Published
type: Concept

Deprecated
type: Concept

RDA:n toimijan ominaisuudet
licence: deed.en US
contributor: RSC Technical Working Group
creator: RDA Steering Committee
description: Properties that represent the attribute and relationship elements of the RDA Agent, Collective Agent, Person, Family, and Corporate Body entities. @en
description: RDA-elementeistä johdetut ominaisuudet RDA:n toimijan ja sen alaluokkien (yhteistoimija, henkilö, suku ja yhteisö) määrittelyjoukossa.
issued: 2014-01-18
modified: 2025-05-16
publisher: ALA Digital Reference
rights: Copyright © 2020 American Library Association, Canadian Federation of Library Associations, and CILIP: Chartered Institute of Library and Information Professionals @en
title: Agent properties @en
type: http://rdaregistry.info/termList/RDALinkedDataWork/1003
preferred namespace prefix: rdaa
type: Ontology
version info: v5.4.2

respondentti teoksessa
has element type: 2
instruction number: 18.5
toolkit definition: A work that is a thesis provided by the praeses in an academic disputation that is defended or opposed by a candidate for a degree. @en
toolkit definition: Akadēmiskā disputa vadītāja piedāvātās tēzes, kuras aizstāv vai kam oponē kandidāts grāda iegūšanai. @lv
toolkit definition: Bir akademik tartışmada danışman tarafından sunulan ve bir derece adayı tarafından savunulan veya karşı çıkılan bir tez olan çalışma. @tr
toolkit definition: Een werk dat is een stelling verstrekt door de preses in een academisch dispuut dat verdedigd of aangevallen wordt door een kandidaat voor een graad. @nl
toolkit definition: Egy elnök által egy tudományos vitában előterjesztett szakdolgozat, amelyet a tudományos fokozat jelöltje megvéd vagy opponál. @hu
toolkit definition: Eine These (Werk), die vom Praeses in einer akademischen Disputation aufgestellt wird und die von einer Kandidatin/einem Kandidaten für einen akademischen Grad verteidigt oder abgelehnt wird. @de
toolkit definition: En avhandling levert av preses i en akademisk disputas og som kandidaten for en grad enten forsvarer eller bestrider. @no
toolkit definition: Obra que és una tesi proposada pel praeses en una disputa acadèmica la qual defensa o a la qual s’oposa un candidat a un grau acadèmic. @ca
toolkit definition: Praeses'e esitletud teesid, mida kraadi taotlev isik akadeemilises väitluses kaitseb või oponeerib. @et
toolkit definition: Teos, joka on väitöskirja, jonka preeses esittelee akateemisessa väitöstilaisuudessa ja jota oppiarvoa tavoitteleva kandidaatti puolustaa tai opponoi.
toolkit definition: Tesi fornita dal presidente in una dissertazione universitaria che è sostenuta o confutata da un candidato alla laurea. @it
toolkit definition: Værk, som er en disputats, som er fremsat af præses i en akademisk disputation, som forsvares eller opponeres af en kandidat til en akademisk grad. @da
toolkit definition: Œuvre qui consiste en une thèse proposée par le praeses lors d’une disputation académique et que défend ou réfute un candidat à un grade universitaire. @fr
toolkit definition: Μια θέση που τίθεται από τον επόπτη σε ακαδημαϊκή διαβούλευση, η οποία [θέση] υποστηρίζεται από τον υποψήφιο διδάκτορα. @el
toolkit definition: عمل عبارة عن أطروحة يقدمها رئيس الجلسة في مناظرة أكاديمية، ويدافع عنها أو يعارضها مرشح للحصول على درجة علمية. @ar
toolkit definition: 学位论文答辩中评审人提供的一篇论文之作品 @zh-hans
toolkit label: Respondentin/Respondent von @de
toolkit label: ir respondents akadēmiskajā disputā @lv
toolkit label: respondens de @ca
toolkit label: respondens teoses @et
toolkit label: respondent af @da
toolkit label: respondent of @en
toolkit label: respondent til @no
toolkit label: respondent van @nl
toolkit label: respondentti teoksessa
toolkit label: rispondente di @it
toolkit label: répondant de @fr
toolkit label: tez savunan kişi @tr
toolkit label: válaszadója a következőnek: @hu
toolkit label: συμμετέχων του @el
toolkit label: مستجيب لـ @ar
toolkit label: ……的答辩人 @zh-hans
has subproperty: P50001
lexical alias: respondentOf.en
status: Published
type: Property
domain: C10004
label: er respondent af @da
label: er respondent til @no
label: est un répondant de @fr
label: ir respondents akadēmiskajā disputā @lv
label: is respondent of @en
label: is respondent van @nl
label: ist Respondentin/Respondent von @de
label: respondens teoses @et
label: tez yazarıdır @tr
label: válaszadója a következőnek: @hu
label: è rispondente di @it
label: és respondens de @ca
label: είναι συμμετέχων του @el
label: هو مستجيب لـ @ar
label: 是……的答辩人 @zh-hans
sub property of: teoksen tekijä (henkilö) teoksessa
alternative label: väitöskirja
definition: Bir akademik derece adayının savunduğu veya karşı çıktığı akademik bir savunmada akademik derece adayının başarısını gösteren çalışma olan tez ile adayı ilişkilendirir. @tr
definition: Correla una persona a una tesi fornita dal presidente in una dissertazione universitaria che è sostenuta o confutata da un candidato alla laurea. @it
definition: Egy személyt hozzákapcsol az elnök által egy tudományos vitában előterjesztett szakdolgozathoz, amelyet a fokozat jelöltje megvéd vagy opponál. @hu
definition: Liittää oppiarvoa tavoittelevan, puolustavan tai opponoivan kandidaatin teokseen, joka on väitöskirja, jonka preeses esittelee akateemisessa väitöstilaisuudessa.
definition: Met une personne en relation avec une œuvre qui consiste en une thèse proposée par le praeses lors d’une disputation académique et que défend ou réfute un candidat à un grade universitaire. @fr
definition: Relaciona una persona amb una obra que és una tesi proposada pel praeses en una disputa acadèmica la qual defensa o a la qual s’oposa un candidat a un grau acadèmic. @ca
definition: Relateert een persoon aan een werk dat is een stelling verstrekt door de preses in een academisch dispuut dat verdedigd of aangevallen wordt door een kandidaat voor een graad. @nl
definition: Relaterer en person til en avhandling levert av preses i en akademisk disputas og som kandidaten for en grad enten forsvarer eller bestrider. @no
definition: Relaterer en person til en disputats, som er fremsat af præses i et akademisk disputation, som forsvares eller opponeres af en kandidat til en akademisk grad. @da
definition: Relates a person to a work that is a thesis provided by the praeses in an academic disputation that is defended or opposed by a candidate for a degree. @en
definition: Sasaista personu ar darbu, kas ir akadēmiskā disputa vadītāja piedāvātās tēzes, kuras aizstāv vai kam oponē kandidāts grāda iegūšanai. @lv
definition: Seostab isiku praeses'e esitletud teesidega, mida kraadi taotlev isik akadeemilises väitluses kaitseb või oponeerib. @et
definition: Setzt eine Person in Beziehung zu einer These (Werk), die vom Praeses in einer akademischen Disputation aufgestellt wird und die von einer Kandidatin/einem Kandidaten für einen akademischen Grad verteidigt oder abgelehnt wird. @de
definition: Συνδέει έναν υποψήφιο διδάκτορα, ο οποίος επιχειρηματολογεί υπέρ ή κατά μιας θέσης που τίθεται από τον επόπτη σε ακαδημαϊκή διαβούλευση, με ένα έργο. @el
definition: يربط شخصا بعمل عبارة عن أطروحة يقدمها رئيس الجلسة في مناظرة أكاديمية، ويدافع عنها أو يعارضها مرشح للحصول على درجة علمية. @ar
definition: 将一个个人与学位论文答辩中评审人提供的一篇论文之作品关联起来。 @zh-hans

yhteisö muutoksenhakijan vastapuolena teoksessa
has element type: 2
instruction number: 18.5
toolkit definition: A legal work of a higher court that records a decision of a lower court that appeals against a corporate body. @en
toolkit definition: Augstākas instances tiesas spriedums zemākās instances tiesas sprieduma izskatīšanā, ko pārsūdz institūcija vai persona. @lv
toolkit definition: Bir tüzel kişiye karşı temyize giden bir alt mahkemenin kararını kaydeden bir üst mahkemenin yasal bir eseri @tr
toolkit definition: Een juridisch werk van een hoger gerechtshof dat een oordeel vastlegt van een lager gerechtshof waarbij in beroep gegaan wordt tegen een corporatie. @nl
toolkit definition: Egy felsőbb bíróság jogi műve, amely rögzíti egy alsóbb szintű bíróságnak azt az ítéletét, amely egy testület ellenében fellebez. @hu
toolkit definition: Ein juristisches Werk einer höheren Instanz, das ein Gerichtsurteil festhält, bei dem gegen eine Körperschaft Rechtsmittel gegen ein Gerichtsurteil einer unteren Instanz eingelegt werden. @de
toolkit definition: Et juridisk verk fra en høyere rettsinstans som registrerer en avgjørelse fra en lavere rettsinstans som anker mot en korporasjon. @no
toolkit definition: Juridinen teos, jolla haetaan muutosta alemman oikeusasteen päätökseen ja joka kohdistuu yhteisöön.
toolkit definition: Juridisk værk fra en højere retsinstans, som registrerer en lavere retsinstans dom, som appellerer imod en korporation. @da
toolkit definition: Kõrgema astme kohtu juriidiline teos, milles on dokumenteeritud alama astme kohtu otsus, mille peale on asutuse vastu esitatud apellatsioon. @et
toolkit definition: Obra jurídica d’un tribunal superior que enregistra una decisió d’un tribunal inferior que apel·la contra una entitat corporativa. @ca
toolkit definition: Opera legale di un tribunale superiore che registra una decisione di un tribunale inferiore che fa ricorso contro un ente. @it
toolkit definition: Œuvre juridique d’un tribunal supérieur qui enregistre une décision d’un tribunal inférieur portant un appel contre une collectivité. @fr
toolkit definition: Ένα νομικό έργο ενός ανώτερου δικαστηρίου, το οποίο καταγράφει στα πρακτικά (του) μία απόφαση ενός κατώτερου δικαστηρίου, ενώπιον του οποίου δικάστηκε έφεση εναντίον ενός συλλογικού οργάνου. @el
toolkit definition: عمل قضائي لمحكمة أعلى درجة يُسجل قرار محكمة أدنى بالاستئناف ضد هيئة. @ar
toolkit definition: 一种记录下级法院起诉一个团体的上级法院的法律作品 @zh-hans
toolkit label: Körperschaft als Berufungsbeklagte/Berufungsbeklagter/Revisionsbeklagte/Revisionsbeklagter von @de
toolkit label: alperes testülete a következőnek: @hu
toolkit label: appellato ente di @it
toolkit label: appellee - korporasjon for @no
toolkit label: appellee corporate body of @en
toolkit label: collectivité intimée de @fr
toolkit label: entitat corporativa apel·lada de @ca
toolkit label: gedaagde-corporatie van @nl
toolkit label: ir apsūdzētais (institūcija) @lv
toolkit label: korporation, som er indstævnte af @da
toolkit label: temyiz edilen tüzel kişi @tr
toolkit label: vastustaja (asutus) teoses @et
toolkit label: yhteisö muutoksenhakijan vastapuolena teoksessa
toolkit label: εφεσίβλητο/αναιρεσίβλητο συλλογικό όργανο του @el
toolkit label: هيئة مستأنف ضدها من @ar
toolkit label: ……的被上诉团体 @zh-hans
has subproperty: P50002
lexical alias: appelleeCorporateBodyOf.en
status: Published
type: Property
domain: C10005
label: alperes testülete a következőnek: @hu
label: er appellee - korporasjon for @no
label: er korporation, som er indstævnte af @da
label: est une collectivité intimée de @fr
label: ir apsūdzētais (institūcija) @lv
label: is appellee corporate body of @en
label: is gedaagde-corporatie van @nl
label: ist Körperschaft als Berufungsbeklagte/Berufungsbeklagter/Revisionsbeklagte/Revisionsbeklagter von @de
label: temyiz edilen tüzel kişisidir @tr
label: vastustaja (asutus) teoses @et
label: è appellato ente di @it
label: és entitat corporativa apel·lada de @ca
label: είναι εφεσίβλητο/αναιρεσίβλητο συλλογικό όργανο του @el
label: هي هيئة مُستأنف ضدها من @ar
label: 是……的被上诉团体 @zh-hans
sub property of: er korporation, som er ophav til værk af
alternative label: yhteisöön kohdistuva muutoshakemus
definition: Bir tüzel kişiyi, bir tüzel kişiliğe karşı temyize giden bir alt mahkemenin kararını kaydeden bir üst mahkemenin yasal eseriyle ilişkilendirir. @tr
definition: Correla un ente a un'opera legale di un tribunale superiore che registra una decisione di un tribunale inferiore che fa ricorso contro un ente. @it
definition: Hozzákapcsol egy testületet egy felsőbb bíróság jogi művéhez, amely rögzíti egy alsóbb szintű bíróságnak azt az ítéletét, amely egy testület ellenében fellebbez. @hu
definition: Liittää muutoshakemuksen kohteena olevan yhteisön juridiseen teokseen, jolla haetaan muutosta alemman oikeusasteen päätökseen.
definition: Met une collectivité en relation avec une œuvre juridique d’un tribunal supérieur qui enregistre une décision d’un tribunal inférieur portant un appel contre une collectivité. @fr
definition: Relaciona una entitat corporativa amb una obra jurídica d’un tribunal superior que enregistra una decisió d’un tribunal inferior que apel·la contra una entitat corporativa. @ca
definition: Relateert een corporatie aan een juridisch werk van een hoger gerechtshof dat een oordeel vastlegt van een lager gerechtshof waarbij in beroep gegaan wordt tegen een corporatie. @nl
definition: Relaterer en korporasjon til et juridisk verk fra en høyere rettsinstans som registrerer en avgjørelse fra en lavere rettsinstans som anker mot en korporasjon. @no
definition: Relaterer en korporation til et juridisk værk fra en højere retsinstans, som registrerer en lavere retsinstans dom, som appellerer imod en korporation. @da
definition: Relates a corporate body to a legal work of a higher court that records a decision of a lower court that appeals against a corporate body. @en
definition: Sasaista institūciju ar augstākas instances tiesas spriedumu zemākās instances tiesas sprieduma izskatīšanā, ko pārsūdz institūcija vai persona. @lv
definition: Seostab asutuse kõrgema astme kohtu juriidilise teosega, milles on dokumenteeritud alama astme kohtu otsus, mille peale on asutuse vastu esitatud apellatsioon. @et
definition: Setzt eine Körperschaft in Beziehung zu einem juristischen Werk einer höheren Instanz, das ein Gerichtsurteil festhält, bei dem gegen eine Körperschaft Rechtsmittel gegen ein Gerichtsurteil einer unteren Instanz eingelegt werden. @de
definition: Συνδέει ένα συλλογικό όργανο εναντίον του οποίου ασκείται έφεση εναντίον απόφασης κατώτερου δικαστηρίου, που καταχωρίστηκε στα πρακτικά ενός ανωτέρου δικαστηρίου, με ένα έργο. @el
definition: يربط هيئة بعمل قضائي لمحكمة أعلى درجة تُسجل قرار محكمة أدنى بالاستئناف ضد هيئة. @ar
definition: 将一个团体与一种记录下级法院起诉一个团体的决定的上级法院的法律作品关联 @zh-hans

oppiarvon myöntävä yhteisö teoksessa
has element type: 2
instruction number: 18.5
toolkit definition: A work that is a thesis or dissertation associated with an academic degree that is approved by a corporate body. @en
toolkit definition: Akadeemilise kraadi taotlemiseks esitatud teos, mille asutus on heaks kiitnud. @et
toolkit definition: Akadēmiskais grāds, ko piešķīrusi institūcija. @lv
toolkit definition: Bir tüzel kişi tarafından onaylanan ve akademik derece ile bağlantılı olan yüksek lisans ya da doktora tezi çalışması. @tr
toolkit definition: Een werk dat een scriptie of proefschrift is voor een academische graad dat is goedgekeurd door een corporatie. @nl
toolkit definition: Egy mű, amely egy tudományos fokozat elnyeréséért benyújtott szakdolgozat vagy disszertáció, amelyet a testület jóváhagyott. @hu
toolkit definition: Eine Hochschulschrift (Werk), die von einer Körperschaft genehmigt wird und mit einem akademischen Grad in Verbindung steht. @de
toolkit definition: Et verk som er en avhandling for en akademisk grad som tildeles en korporasjon. @no
toolkit definition: Obra que és una tesi o una dissertació associada amb un grau acadèmic i que és aprovada per una entitat corporativa. @ca
toolkit definition: Opera che è una tesi per una laurea universitaria approvata da un ente. @it
toolkit definition: Teos, joka on yhteisön hyväksymä akateemisen oppiarvon opinnäyte tai väitöskirja.
toolkit definition: Værk, som er en afhandling for en akademisk grad, som er godkendt af en korporation. @da
toolkit definition: Œuvre qui consiste en une thèse ou un mémoire associé à un grade universitaire qui est approuvé par une collectivité. @fr
toolkit definition: Ένα ανώτερου εκπαιδευτικού επιπέδου πτυχίο το οποίο χορηγείται από ένα συλλογικό όργανο. @el
toolkit definition: عمل عبارة عن أطروحة أو رسالة جامعية ذات صلة بدرجة أكاديمية معتمدة من هيئة. @ar
toolkit definition: 一种作为被一个机构批准的学位论文的作品 @zh-hans
toolkit label: Grad-verleihende Institution von @de
toolkit label: degree granting institution of @en
toolkit label: diploma veren kurum @tr
toolkit label: graadverstrekkende instantie van @nl
toolkit label: gradtildelende institution af @da
toolkit label: institució que concedeix un títol acadèmic de @ca
toolkit label: institution conférant un grade universitaire de @fr
toolkit label: ir grāda piešķīrējinstitūcija @lv
toolkit label: istituzione che rilascia un titolo accademico di @it
toolkit label: kraadi andev asutus teoses @et
toolkit label: oppiarvon myöntävä yhteisö teoksessa
toolkit label: tildelende institusjon for @no
toolkit label: tudományos fokozatot adó intézménye a következőnek: @hu
toolkit label: ίδρυμα χορήγησης πτυχίου του @el
toolkit label: مؤسسة مانحة درجة لـ @ar
toolkit label: ……的学位授予机构 @zh-hans
has subproperty: P50003
lexical alias: degreeGrantingInstitutionOf.en
status: Published
type: Property
domain: C10005
label: er gradtildelende institution af @da
label: er tildelende institusjon for @no
label: est une institution conférant un grade universitaire de @fr
label: ir grāda piešķīrējinstitūcija @lv
label: is degree granting institution of @en
label: is graadverstrekkende instantie van @nl
label: ist grad-verleihende Institution von @de
label: kraadi andev asutus teoses @et
label: tez onaylayan kurumudur @tr
label: tudományos fokozatot adó intézménye a következőnek: @hu
label: è istituzione che rilascia un titolo accademico di @it
label: és institució que concedeix un títol acadèmic de @ca
label: είναι ίδρυμα χορήγησης πτυχίου του @el
label: هي مؤسسة مانحة درجة لـ @ar
label: 是……的学位授予机构 @zh-hans
sub property of: er korporation, som er ophav til værk af
definition: Bir tüzel kişiyi, tarafından onaylanan ve akademik bir unvanla ilişkili olan yüksek lisans ya da doktora tezi eseri ile ilişkilendirir. @tr
definition: Correla un ente a un'opera che è una tesi per una laura universitaria approvata da un ente. @it
definition: Hozzákapcsol egy testületet egy műhöz, amely egy tudományos fokozat elnyeréséért benyújtott szakdolgozat vagy disszertáció, amelyet a testület jóváhagyott. @hu
definition: Liittää yhteisön teokseen, joka on yhteisön hyväksymä akateemisen oppiarvon opinnäyte tai väitöskirja.
definition: Met une collectivité en relation avec une œuvre qui consiste en une thèse ou un mémoire associé à un grade universitaire qui est approuvé par une collectivité. @fr
definition: Relaciona una entitat corporativa amb una obra que és una tesi o una dissertació associada amb un grau acadèmic i que és aprovada per una entitat corporativa. @ca
definition: Relateert een corporatie aan een werk dat een scriptie of proefschrift is voor een academische graad dat is goedgekeurd door een corporatie. @nl
definition: Relaterer en korporasjon til et verk som er en avhandling for en akademisk grad som tildeles en korporasjon. @no
definition: Relaterer en korporation til et værk, som er en afhandling for en akademisk grad, som er godkendt af en korporation. @da
definition: Relates a corporate body to a work that is a thesis or dissertation associated with an academic degree that is approved by a corporate body. @en
definition: Sasaista institūciju ar darbu, par ko ir saņemts akadēmiskais grāds, ko piešķīrusi institūcija. @lv
definition: Seostab asutuse akadeemilise kraadi taotlemiseks esitatud teosega, mille asutus on heaks kiitnud. @et
definition: Setzt eine Körperschaft in Beziehung zu einer Hochschulschrift (Werk), die von einer Körperschaft genehmigt wird und mit einem akademischen Grad in Verbindung steht. @de
definition: Συνδέει ένα συλλογικό όργανο που χορηγεί ένα ανώτερου ακαδημαϊκού επιπέδου πτυχίο, με ένα έργο. @el
definition: يربط هيئة بعمل عبارة عن أطروحة أو رسالة جامعية ذات صلة بدرجة أكاديمية معتمدة من هيئة. @ar
definition: 将一个团体与一种作为被一个机构批准的学位论文的作品关联起来。 @zh-hans

isäntäorganisaatio teoksessa
has element type: 2
instruction number: 18.5
toolkit definition: A work that arises from a conference, exhibition, or other event that is hosted by a corporate body with little or no responsibility for the content. @en
toolkit definition: Darbs, kas radies konferences, izstādes vai cita pasākuma rezultātā, ko izmitināja institūcija, kam par darba saturu ir neliela vai pat nekāda atbildība. @lv
toolkit definition: Een werk dat voortkomt uit een conferentie, tentoonstelling of andere gebeurtenis die is gehouden door een corporatie met weinig of geen verantwoordelijkheid voor de content. @nl
toolkit definition: Egy mű keletkezésében szerepet játszó esemény, kiállítás, konferencia stb., amelyet egy olyan testület rendezett, amely kevés vagy semmilyen felelősséget nem visel a mű tartalmáért. @hu
toolkit definition: Ein Werk, das aus einer Konferenz, einer Ausstellung oder einer anderen Veranstaltung hervorgeht, die von einer Körperschaft ausgerichtet wird, die aber für den Inhalt wenig oder gar keine Verantwortung trägt. @de
toolkit definition: Et verk som inspireres av en konferanse, en utstilling eller et annet arrangement som en korporasjon er vert for, men som har lite eller intet ansvar for verkets innhold. @no
toolkit definition: Obra que sorgeix a partir d’un congrés, una exposició o qualsevol altre esdeveniment que és acollit per una entitat corporativa amb poca o cap responsabilitat pel contingut. @ca
toolkit definition: Opera che nasce da una conferenza, mostra o altro evento ospitato da un ente con poca o nessuna responsabilità per il contenuto. @it
toolkit definition: Teos, jolle alun antavan konferenssin, näyttelyn tai muun tapahtuman yhteisö isännöi, mutta jonka sisällöstä yhteisöllä on vähän tai ei lainkaan vastuuta.
toolkit definition: Teos, millele on aluse pannud konverents, näitus või muu üritus, mille asutus on korraldanud, kuid ei vastuta või vastutab vähe selle sisu eest. @et
toolkit definition: Værk, som opstår efter en konference, udstilling, konference eller anden begivenhed, som er afholdt af en korporation med ringe eller intet ansvar for værkets indhold. @da
toolkit definition: İçerik konusunda çok az sorumluluğu olan veya hiç sorumluluğu olmayan kurumsal bir tüzel kişilik tarafından düzenlenen bir konferans, sergi veya başka bir etkinlikten ortaya çıkan bir eser @tr
toolkit definition: Œuvre issue d’un congrès, d’une exposition ou d’un autre événement qui est accueilli par une collectivité qui a peu ou pas du tout de responsabilité quant à son contenu. @fr
toolkit definition: Ένα συμβάν, μια έκθεση, ένα συνέδριο κ.λπ., εκ των οποίων προέκυψε ένα έργο, το οποίο (συμβάν) φιλοξενήθηκε από ένα συλλογικό όργανο, με μερική ή καμία ευθύνη για το περιεχόμενο του έργου. @el
toolkit definition: عمل نتج عن مؤتمر أو عن معرض أو عن أي فاعلية أخرى تستضيفها هيئة، وتقل أو تنعدم مسئوليتها عن محتوى العمل. @ar
toolkit definition: 一个团体承办但对内容没有或很少责任的会议、展览或其他活动所产生的作品 @zh-hans
toolkit label: Gastgebende Institution von @de
toolkit label: ev sahibi kurumudur @tr
toolkit label: hosting institution of @en
toolkit label: hostorganisatie van @nl
toolkit label: institució d’acollida de @ca
toolkit label: institution hôte de @fr
toolkit label: ir uzņemošā institūcija @lv
toolkit label: istituzione ospitante di @it
toolkit label: isäntäorganisaatio teoksessa
toolkit label: rendező intézménye a következőnek: @hu
toolkit label: vertsinstitusjon for @no
toolkit label: værtsinstitution af @da
toolkit label: võõrustav asutus teoses @et
toolkit label: ίδρυμα υποδοχής του @el
toolkit label: مؤسسة مضيفة لـ @ar
toolkit label: ……的承办机构 @zh-hans
has subproperty: P50004
lexical alias: hostingInstitutionOf.en
status: Published
type: Property
domain: C10005
label: er vertsinstitusjon for @no
label: er værtsinstitution af @da
label: est une institution hôte de @fr
label: ev sahibi kurumudur @tr
label: ir uzņemošā institūcija @lv
label: is hosting institution of @en
label: is hostorganisatie van @nl
label: ist gastgebende Institution von @de
label: rendező intézménye a következőnek: @hu
label: võõrustav asutus teoses @et
label: è istituzione ospitante di @it
label: és institució d’acollida de @ca
label: είναι ίδρυμα υποδοχής του @el
label: هي مؤسسة مضيفة لـ @ar
label: 是……的承办机构 @zh-hans
sub property of: yhteisöön liittyvä teos
alternative label: host institution of @en
alternative label: institución anfitriona de @es
alternative label: institution hôtesse de @fr
alternative label: isäntäorganisaationa tapahtumassa
alternative label: مؤسسة مضيفة لـ @ar
alternative label: ……的承办机构 @zh-hans
definition: Bir tüzel kişiyi, içerikten çok az sorumlu olan veya hiç sorumluluğu olmayan bir tüzel kişilik tarafından ev sahipliği yapılan bir konferans, sergi veya başka bir etkinlikten kaynaklanan bir eserle ilişkilendirir. @tr
definition: Correla un ente a un'opera che nasce da una conferenza, mostra o altro evento ospitato da un ente con poca o nessuna responsabilità per il contenuto. @it
definition: Egy testületet, amely egy esemény, kiállítás, konferencia stb. rendezésével elősegíti egy mű keletkezését, hozzákapcsol egy műhöz. @hu
definition: Liittää yhteisön teokseen, jolle alun antavan konferenssin, näyttelyn tai muun tapahtuman yhteisö isännöi, mutta jonka sisällöstä yhteisöllä on vähän tai ei lainkaan vastuuta.
definition: Met une collectivité en relation avec une œuvre issue d’un congrès, d’une exposition ou d’un autre événement qui est accueilli par une collectivité qui a peu ou pas du tout de responsabilité quant à son contenu. @fr
definition: Relaciona una entitat corporativa amb una obra que sorgeix a partir d’un congrés, una exposició o qualsevol altre esdeveniment que és acollit per una entitat corporativa amb poca o cap responsabilitat pel contingut. @ca
definition: Relateert een corporatie aan een werk dat voortkomt uit een conferentie, tentoonstelling of andere gebeurtenis die is gehouden door een corporatie met weinig of geen verantwoordelijkheid voor de content. @nl
definition: Relaterer en korporasjon til et verk som inspireres av en konferanse, en utstilling eller et annet arrangement som en korporasjon er vert for, men som har lite eller intet ansvar for verkets innhold. @no
definition: Relaterer en korporation til et værk, som opstår efter en konference, udstilling, konference eller anden begivenhed, som er afholdt af en korporation med ringe eller intet ansvar for værkets indhold. @da
definition: Relates a corporate body to a work that arises from a conference, exhibition, or other event that is hosted by a corporate body with little or no responsibility for the content. @en
definition: Sasaista institūciju ar darbu, kas radies konferences, izstādes vai cita pasākuma rezultātā, ko izmitināja institūcija, kurai par darba saturu ir neliela vai pat nekāda atbildība. @lv
definition: Seostab asutuse teosega, millele on aluse pannud konverents, näitus või muu üritus, mille asutus on korraldanud, kuid ei vastuta või vastutab vähe selle sisu eest. @et
definition: Setzt eine Körperschaft in Beziehung zu einem Werk, das aus einer Konferenz, einer Ausstellung oder einer anderen Veranstaltung hervorgeht, die von einer Körperschaft ausgerichtet wird, die aber für den Inhalt wenig oder gar keine Verantwortung trägt. @de
definition: Συνδέει ένα συλλογικό όργανο που φιλοξενεί ένα συμβάν, μια έκθεση, ένα συνέδριο κ.λπ., εκ των οποίων προκλήθηκε η δημιουργία ενός έργου, με ένα έργο. @el
definition: يربط هيئة بعمل نتج عن مؤتمر أو عن معرض أو عن أي فعالية أخرى تستضيفها هيئة، وتقل أو تنعدم مسئوليتها عن محتوى العمل. @ar
definition: 将一个团体与一个团体承办但对内容没有或很少责任的会议、展览或其他活动所产生的作品关联起来。 @zh-hans

tuotantoyhtiö teoksessa
has element type: 2
instruction number: 18.5
toolkit definition: A work that involves a responsibility for managing the financial, technical, and organizational aspects of a production for stage, screen, sound recording, television, webcast, etc. @en
toolkit definition: Darbs, kas ietver institūcijas atbildību par teātra, filmas, mūzikas ierakstu televīzijas, tīmekļa pārraides u.tml. finansiālu, tehnisku un organizatorisku vadību. @lv
toolkit definition: Een werk dat met zich meebrengt een verantwoordelijkheid voor het beheer van de financiële, technische en organisatorische aspecten van een productie voor toneel, scherm, geluidsopname, televisie, webcast etc. @nl
toolkit definition: Egy mű felelőssége egy színpadi produkció, film, hangfelvétel, televíziós, webes közvetítés, stb. pénzügyi, technikai és szervezeti vonatkozásának irányításáért. @hu
toolkit definition: Ein Werk, das mit einer Verantwortung verbunden ist, das Management für die finanziellen, technischen und organisatorischen Aspekte einer Produktion für die Bühne, die Leinwand, die Tonaufnahme, das Fernsehen, für einen Webcast und so weiter zu verwalten. @de
toolkit definition: Et verk som involverer ansvar for administrasjon av de økonomiske, tekniske og organisatoriske aspektene ved en produksjon for scene, film eller fjernsyn, lydinnspilling, webcast, etc. @no
toolkit definition: Obra que implica una responsabilitat en la gestió dels aspectes financers, tècnics i organitzatius d’una producció d’un espectacle, d’una pel·lícula, d’un enregistrament àudio, d’un programa de televisió, d’una emissió web, etc. @ca
toolkit definition: Opera che implica la responsabilità di gestione di aspetti finanziari, tecnici e organizzativi di una produzione di una messa in scena, proiezione, registrazione del suono, televisione, trasmissione via web, etc. @it
toolkit definition: Sahne, ekran, ses kaydı, televizyon, web yayını vb. için bir prodüksiyonun finansal, teknik ve organizasyonel yönlerini yönetme sorumluluğunu içeren bir eser @tr
toolkit definition: Teos, jossa yhteisö on vastuussa näyttämö-, elokuva-, äänite-, televisio-, suoratoistolähetys- tms. tuotannon taloudellisesta, teknisestä ja organisatorisesta johtamisesta.
toolkit definition: Teos, mis sisaldab vastutust lavastuste, filmide, helisalvestiste, telesaadete, veebiülekannete jms tootmise finantsilise, tehnilise ja korraldusliku juhtimise eest. @et
toolkit definition: Værk, som involverer et ansvar for økonomisk, teknisk og organisatorisk ledelse af en produktion beregnet til scene, lærred lydoptagelse, tv, webcast etc. @da
toolkit definition: Œuvre qui comporte une responsabilité consistant à gérer les aspects financiers, techniques et organisationnels de la production d’un spectacle, d’un film, d’un enregistrement audio, d’une émission de télévision, d’une webémission, etc. @fr
toolkit definition: Ένα έργο που περιλαμβάνει την οικονομική, τεχνική και οργανωτική διαχείριση μιας παραγωγής που προορίζεται για τη σκηνή, την οθόνη, μια ηχογράφηση, την τηλεόραση, μια διαδικτυακή μετάδοση κ.λπ. @el
toolkit definition: عمل يترتب عليه تحمل مسئولية إدارة الجوانب المالية والتقنية والتنظيمية لإنتاج أُعد لمسرح، أو لشاشة عرض، أو لتسجيل صوتي، أو لتلفزيون، أو لبث عبر الإنترنت، إلخ. @ar
toolkit definition: 一种涉及舞台、播放、录音、网络直播等制作的资金、技术和组织方面管理责任的作品 @zh-hans
toolkit label: Produktionsfirma von @de
toolkit label: empresa de producció de @ca
toolkit label: ir producentu kompānija @lv
toolkit label: productiebedrijf van @nl
toolkit label: production company of @en
toolkit label: produkciós cége a következőnek: @hu
toolkit label: produksjonsselskap for @no
toolkit label: produktionsselskab af @da
toolkit label: produktsioonifirma teoses @et
toolkit label: società di produzione di @it
toolkit label: société de production de @fr
toolkit label: tuotantoyhtiö teoksessa
toolkit label: Üretim şi̇rketi̇ @tr
toolkit label: εταιρία παραγωγής του @el
toolkit label: شركة إنتاج لـ @ar
toolkit label: ……的制作公司 @zh-hans
has subproperty: P50005
lexical alias: productionCompanyOf.en
status: Published
type: Property
domain: C10005
label: er produksjonsselskap for @no
label: er produktionsselskab af @da
label: est une société de production de @fr
label: ir producentu kompānija @lv
label: is productiebedrijf van @nl
label: is production company of @en
label: ist Produktionsfirma von @de
label: produkciós cége a következőnek: @hu
label: produktsioonifirma teoses @et
label: yapım şirketidir @tr
label: è società di produzione di @it
label: és empresa de producció de @ca
label: είναι εταιρία παραγωγής του @el
label: هي شركة إنتاج لـ @ar
label: 是……的制作公司 @zh-hans
sub property of: er korporation, som er ophav til værk af
alternative label: tuotantoyhtiönä teoksessa
definition: Bir tüzel kişiyi, sahne, ekran, ses kaydı, televizyon, web yayını vb. için bir prodüksi̇yonun finansal, teknik ve organizasyonel yönlerini yönetme sorumluluğunu içeren bir eserle ilişkilendirir. @tr
definition: Correla un ente a un'opera che implica la responsabilità di gestione di aspetti finanziari, tecnici e organizzativi di una produzione di una messa in scena, proiezione, registrazione del suono, televisione, trasmissione via web, etc. @it
definition: Hozzákapcsol egy testületet egy műhöz, amelyhez hozzátartozik a testület felelőssége egy színpadi produkció, film, hangfelvétel, televíziós, webes közvetítés, stb. pénzügyi, technikai és szervezeti vonatkozásának irányításáért. @hu
definition: Liittää yhteisön teokseen, jossa yhteisö on vastuussa näyttämö-, elokuva-, äänite-, televisio-, suoratoistolähetys- tms. tuotannon taloudellisesta, teknisestä ja organisatorisesta johtamisesta.
definition: Met une collectivité en relation avec une œuvre qui comporte une responsabilité consistant à gérer les aspects financiers, techniques et organisationnels de la production d’un spectacle, d’un film, d’un enregistrement audio, d’une émission de télévision, d’une webémission, etc. @fr
definition: Relaciona una entitat corporativa amb una obra que implica una responsabilitat en la gestió dels aspectes financers, tècnics i organitzatius d’una producció d’un espectacle, d’una pel·lícula, d’un enregistrament àudio, d’un programa de televisió, d’una emissió web, etc. @ca
definition: Relateert een corporatie aan een werk dat met zich meebrengt een verantwoordelijkheid voor het beheer van de financiële, technische en organisatorische aspecten van een productie voor toneel, scherm, geluidsopname, televisie, webcast etc. @nl
definition: Relaterer en korporasjon til et verk som involverer ansvar for administrasjon av de økonomiske, tekniske og organisatoriske aspektene ved en produksjon for scene, film eller fjernsyn, lydinnspilling, webcast, etc. @no
definition: Relaterer en korporation til et værk, som involverer et ansvar for økonomisk, teknisk og organisatorisk ledelse af en produktion beregnet til scene, lærred, lydoptagelse, tv, webcast etc. @da
definition: Relates a corporate body to a work that involves a responsibility for managing the financial, technical, and organizational aspects of a production for stage, screen, sound recording, television, webcast, etc. @en
definition: Sasaista institūciju ar darbu, kas ietver institūcijas atbildību par teātra, filmas, mūzikas ierakstu televīzijas, tīmekļa pārraides u.tml. finansiālu, tehnisku un organizatorisku vadību. @lv
definition: Seostab asutuse teosega, mis sisaldab vastutust lavastuste, filmide, helisalvestiste, telesaadete, veebiülekannete jms tootmise finantsilise, tehnilise ja korraldusliku juhtimise eest. @et
definition: Setzt eine Körperschaft in Beziehung zu einem Werk, das mit einer Verantwortung verbunden ist, das Management für die finanziellen, technischen und organisatorischen Aspekte einer Produktion für die Bühne, die Leinwand, die Tonaufnahme, das Fernsehen, für einen Webcast und so weiter zu verwalten. @de
definition: Συνδέει ένα συλλογικό όργανο, το οποίο είναι υπεύθυνο για την οικονομική, τεχνική και οργανωτική διαχείριση μιας παραγωγής που προορίζεται για τη σκηνή, την οθόνη, μια ηχογράφηση, την τηλεόραση, μια διαδικτυακή μετάδοση κ.λπ., με ένα έργο. @el
definition: يربط هيئة بعمل يترتب عليه تحملها مسئولية إدارة الجوانب المالية والتقنية والتنظيمية لإنتاج أُعد لمسرح، أو لشاشة عرض، أو لتسجيل صوتي، أو لتلفزيون، أو لبث عبر الإنترنت، إلخ. @ar
definition: 将一个团体与一种涉及舞台、播放、录音、网络直播等制作的资金、技术和组织方面管理责任的作品关联起来。 @zh-hans

yhteisön tunniste
has element type: 3
instruction number: 11.12
toolkit definition: A nomen that is an appellation of corporate body that consists of a code, number, or other string, usually independent of natural language and social naming conventions, used to identify a corporate body. @en
toolkit definition: Asutuse nimetus, mis koosneb asutust identifitseerivast koodist, numbrist või muust loomulikust keelest ja üldtuntud nimetamistavadest sõltumatust stringist. @et
toolkit definition: Bir tüzel kişiyi tanımlamak için kullanılan, genellikle doğal dilden ve sosyal adlandırma kurallarından bağımsız olarak bir kod, sayı veya başka bir dizeden oluşan bir tüzel kişinin unvanı olan bir isim @tr
toolkit definition: Denominazione di un ente che consiste di un codice, numero, o altra stringa, solitamente indipendente dal linguaggio naturale e dalle convenzioni sociali di denominazione, usati per identificare un ente. @it
toolkit definition: Een nomen dat is een benaming van corporatie die bestaat uit een code, nummer of andere tekenreeks, meestal onafhankelijk van natuurlijke taal en gewoonlijke naamgevingsconventies, gebruikt om een corporatie te identificeren. @nl
toolkit definition: Egy nomen, amely egy testület megnevezése, egy kód-, szám-, vagy más típusú karakterláncból áll, amely általában független a természetes nyelvektől és társadalmi névkonvencióktól, és egy testület azonosítására használják. @hu
toolkit definition: Eine Bezeichnung für eine Körperschaft, die aus einem Code, einer Nummer oder einer anderen Zeichenkette besteht, der/die normalerweise nicht in natürlicher Sprache und unabhängig von den sozialen Benennungskonventionen ist und zur Identifizierung einer Körperschaft verwendet wird. @de
toolkit definition: En betegnelse for korporasjon som består av en kode, et nummer eller annen streng, vanligvis uavhengig av naturlig språk og sosiale navnekonvensjoner, brukt til å identifisere en korporasjon. @no
toolkit definition: Institūcijas apzīmējums, kas sastāv no koda, skaitļa vai citas virknes, kas parasti ir neatkarīgs no dabiskas valodas vai sabiedrībā pieņemtām nosaukšanas tradīcijām, ko izmanto, lai identificētu institūciju. @lv
toolkit definition: Nomen que és una apel·lació d’entitat corporativa que consisteix en un codi, un número o qualsevol altra cadena, normalment independent del llenguatge natural i de les convencions lingüístiques socials, usada per identificar una entitat corporativa. @ca
toolkit definition: Nomen qui est une appellation de collectivité consistant en un code, un nombre ou une autre chaîne, généralement indépendante du langage naturel et des conventions sociales de dénomination, utilisée pour identifier une collectivité. @fr
toolkit definition: Nomen, joka on yhteisön identifioimiseen käytetty nimitys, joka koostuu koodista, luvusta tai muusta merkkijonosta, joka on tavallisesti riippumaton luonnollisesta kielestä tai yleisistä nimeämiskäytännöistä.
toolkit definition: Nomen, som er en benævnelse på korporation, som består af en kode, nummer eller anden streng, sædvanligvis upåvirket af normalsprog og sociale navngivningskonventioner, brugt til at identificere en korporation. @da
toolkit definition: Una cadena de caracteres singularmente asociada con una entidad corporativa, o con un substituto de una entidad corporativa (p.ej., un registro de autoridad). @es
toolkit definition: Ένας αλφαριθμητικός χαρακτήρας μοναδικά συνδεδεμένος με ένα συλλογικό όργανο ή με ένα υποκατάστατο, όπως μια καθιερωμένη εγγραφή για ένα συλλογικό όργανο. @el
toolkit definition: تسمية هي اسم هيئة يتكون من رمز، أو رقم، أو سلسلة تمثيلات أخرى، عادة ما تكون مختلفة عن اللغة الطبيعية وعن التسميات المتعارف عليها اجتماعيا، المستخدمة في تعريف هيئة. @ar
toolkit definition: 作为一个由代码、数字、或其他字符串构成、通常独立于自然语言和社会命名惯例、用以标识团体的团体称谓的命名 @zh-hans
toolkit label: Identifikator für eine Körperschaft @de
toolkit label: asutuse identifikaator @et
toolkit label: azonosító testület számára: @hu
toolkit label: identifiant de collectivité @fr
toolkit label: identificador de la entidad corporativa @es
toolkit label: identificador d’entitat corporativa @ca
toolkit label: identificatie voor corporatie @nl
toolkit label: identificatore di ente @it
toolkit label: identifier for corporate body @en
toolkit label: identifikator for korporasjon @no
toolkit label: identifikator for korporation @da
toolkit label: identifikator för institutionen @sv
toolkit label: institūcijas identifikators @lv
toolkit label: tüzel kişisinin tanımlayıcısı ile ilişkilidir @tr
toolkit label: yhteisön tunniste
toolkit label: αναγνωριστικό για το συλλογικό όργανο @el
toolkit label: معرِّف لهيئة @ar
toolkit label: 团体的标识符 @zh-hans
has subproperty: P50006
lexical alias: identifierForCorporateBody.en
status: Published
type: Property
domain: C10005
label: a pour identifiant de collectivité @fr
label: asutuse identifikaator @et
label: azonosító testület számára a következő: @hu
label: ha come identificatore di ente @it
label: har identifikator for korporasjon @no
label: har identifikator for korporation @da
label: har identifikator för institutionen @sv
label: has identifier for corporate body @en
label: hat Identifikator für eine Körperschaft @de
label: heeft identificatie voor corporatie @nl
label: institūcijas identifikators @lv
label: té com a identificador d’entitat corporativa @ca
label: tüzel kişinin tanımlayıcısı ile ilişkilidir @tr
label: έχει αναγνωριστικό για το συλλογικό όργανο @el
label: له معرِّف لهيئة @ar
label: 有团体的标识符 @zh-hans
sub property of: yhteisön nimitys
sub property of: yhteistoimijan tunniste
definition: Bir tüzel kişiyi, bir tüzel kişiliği tanımlamak için kullanılan, genellikle doğal dilden ve sosyal adlandırma kurallarından bağımsız olan bir kod, sayı veya başka bir dizeden oluşan tüzel kişilikle olan bir isimle ilişkilendirir. @tr
definition: Correla un ente alla denominazione di un ente che consiste di un codice, numero, o altra stringa, solitamente indipendente dal linguaggio naturale e dalle convenzioni sociali di denominazione, usati per identificare un ente. @it
definition: Hozzákapcsol egy testületet egy nomenhez, amely egy testület megnevezése, egy kód-, szám-, vagy más típusú karakterláncból áll, amely általában független a természetes nyelvektől és társadalmi névkonvencióktól, és egy testület azonosítására használják. @hu
definition: Liittää yhteisön nomeniin, joka on yhteisön nimitys, joka koostuu koodista, luvusta tai muusta tavallisesti luonnollisesta kielestä ja yleisistä nimeämiskäytännöistä riippumattomasta merkkijonosta, jota käytetään yhteisön identifiointiin.
definition: Met une collectivité en relation avec un nomen qui est une appellation de collectivité consistant en un code, un nombre ou une autre chaîne, généralement indépendante du langage naturel et des conventions sociales de dénomination, utilisée pour identifier une collectivité. @fr
definition: Relaciona una entitat corporativa amb un nomen que és una apel·lació d’entitat corporativa que consisteix en un codi, un número o qualsevol altra cadena, normalment independent del llenguatge natural i de les convencions lingüístiques socials, usada per identificar una entitat corporativa. @ca
definition: Relateert een corporatie aan een nomen dat is een benaming van corporatie die bestaat uit een code, nummer of andere tekenreeks, meestal onafhankelijk van natuurlijke taal en gewoonlijke naamgevingsconventies, gebruikt om een corporatie te identificeren. @nl
definition: Relaterer en korporasjon til en betegnelse for korporasjon som består av en kode, et nummer eller annen streng, vanligvis uavhengig av naturlig språk og sosiale navnekonvensjoner, brukt til å identifisere en korporasjon. @no
definition: Relaterer en korporation til en benævnelse på korporation, som består af en kode, nummer eller anden streng, sædvanligvis upåvirket af normalsprog og sociale navngivningskonventioner, brugt til at identificere en korporation. @da
definition: Relates a corporate body to a nomen that is an appellation of corporate body that consists of a code, number, or other string, usually independent of natural language and social naming conventions, used to identify a corporate body. @en
definition: Sasaista institūciju ar nomenu, kas ir institūcijas apzīmējums, kas sastāv no koda, skaitļa vai citas virknes, kas parasti ir neatkarīgs no dabiskas valodas vai sabiedrībā pieņemtām nosaukšanas tradīcijām, ko izmanto, lai identificētu institūciju. @lv
definition: Seostab asutuse asutuse nimetusega, mis koosneb asutust identifitseerivast koodist, numbrist või muust loomulikust keelest ja üldtuntud nimetamistavadest sõltumatust stringist. @et
definition: Setzt eine Körperschaft in Beziehung zu einer Bezeichnung für eine Körperschaft, die aus einem Code, einer Nummer oder einer anderen Zeichenkette besteht, der/die normalerweise nicht in natürlicher Sprache und unabhängig von den sozialen Benennungskonventionen ist und zur Identifizierung einer Körperschaft verwendet wird. @de
definition: Συνδέει ένα συλλογικό όργανο με έναν αλφαριθμητικό χαρακτήρα μοναδικά συνδεδεμένο με ένα συλλογικό όργανο ή με ένα υποκατάστατο, όπως μια καθιερωμένη εγγραφή για ένα συλλογικό όργανο. @el
definition: يربط هيئة بتسمية هي اسم هيئة يتكون من رمز، أو رقم، أو سلسلة تمثيلات أخرى، عادة ما تكون مختلفة عن اللغة الطبيعية وعن التسميات المتعارف عليها اجتماعيا، المستخدمة في تعريف هيئة. @ar
definition: 将一个团体与一个作为由代码、数字、或其他字符串构成、通常独立于自然语言和社会命名惯例、用以标识团体的团体称谓的命名关联起来。 @zh-hans
scope note: Der Identifikator dient dazu, diese Körperschaft von anderen Körperschaften zu unterscheiden. @de
scope note: Identifikatoren tjener til at skelne denne korporation fra andre korporationer. @da
scope note: L’identifiant sert à différencier une collectivité d’autres collectivités. @fr

yhteisön perustanut yhteisö
has element type: 2
instruction number: 29.5
toolkit definition: A corporate body who initiates a corporate body. @en
toolkit definition: Asutus, kes on pannud asutusele aluse. @et
toolkit definition: Bir tüzel kişiliği başlatan bir tüzel kişilik. @tr
toolkit definition: Collectivité qui établit une collectivité. @fr
toolkit definition: Een corporatie die een corporatie opricht. @nl
toolkit definition: Egy testület, amely kezdeményezi egy testület létrehozását. @hu
toolkit definition: Eine Körperschaft, die eine Körperschaft gegründet hat. @de
toolkit definition: En korporasjon som oppretter en annen korporasjon. @no
toolkit definition: Ente che istituisce un ente. @it
toolkit definition: Entitat corporativa que inicia una entitat corporativa. @ca
toolkit definition: Institūcija, kas ir dibinājusi citu institūciju. @lv
toolkit definition: Korporation, som igangsætter en korporation. @da
toolkit definition: Una entidad corporativa que fundó a otra entidad corporativa. @es
toolkit definition: Yhteisö, joka perusti toisen yhteisön.
toolkit definition: Ένα συλλογικό όργανο το οποίο ίδρυσε κάποιο άλλο συλλογικό όργανο. @el
toolkit definition: هيئة تبادر بإنشاء هيئة. @ar
toolkit definition: 发起一个团体的一个团体 @zh-hans
toolkit label: Gründerin/Gründer einer Körperschaft (Körperschaft) @de
toolkit label: asutuse asutanud asutus @et
toolkit label: collectivité fondatrice d’une collectivité @fr
toolkit label: ente fondatore di ente @it
toolkit label: entidad corporativa fundadora @es
toolkit label: entitat corporativa fundadora d’una entitat corporativa @ca
toolkit label: founding corporate body of corporate body @en
toolkit label: grunnleggerkorporasjon for korporasjon @no
toolkit label: institūcijas dibinātājs (institūcija) @lv
toolkit label: korporation, som er grundlægger af korporation @da
toolkit label: oprichter-corporatie van corporatie @nl
toolkit label: testület alapító testülete: @hu
toolkit label: tüzel kişinin kurucu tüzel kişisi @tr
toolkit label: yhteisön perustanut yhteisö
toolkit label: ιδρυτής συλλογικό όργανο του συλλογικού οργάνου @el
toolkit label: هيئة مؤسسة لهيئة @ar
toolkit label: 团体的创办团体 @zh-hans
has subproperty: P50007
lexical alias: foundingCorporateBodyOfCorporateBody.en
status: Published
type: Property
domain: C10005
label: a pour collectivité fondatrice d’une collectivité @fr
label: asutuse asutanud asutus @et
label: ha come ente fondatore di ente @it
label: har grunnleggerkorporasjon for korporasjon @no
label: har korporation, som er grundlægger af korporation @da
label: has founding corporate body of corporate body @en
label: hat Gründerin/Gründer einer Körperschaft (Körperschaft) @de
label: heeft oprichter-corporatie van corporatie @nl
label: institūcijas dibinātājs (institūcija) @lv
label: testület alapító testülete a következő: @hu
label: té com a entitat corporativa fundadora d’una entitat corporativa @ca
label: tüzel kişiyi kuran tüzel kişi ile ilişkilidir @tr
label: έχει ιδρυτή συλλογικό όργανο του συλλογικού οργάνου @el
label: له هيئة مؤسِّسة لهيئة @ar
label: 有团体的创办团体 @zh-hans
sub property of: yhteisöön liittyvä yhteisö
sub property of: yhteisön perustanut yhteistoimija
alternative label: Gründende Körperschaft @de
alternative label: alapító testület @hu
alternative label: asutaja (asutus) @et
alternative label: collectivité fondatrice @fr
alternative label: ente fondatore @it
alternative label: entitat corporativa fundadora @ca
alternative label: founding corporate body @en
alternative label: grunnleggerkorporasjon @no
alternative label: kurucu tüzel kişi @tr
alternative label: oprettende korporation @da
alternative label: organismo corporativo fundador @es
alternative label: perustajayhteisö
alternative label: ιδρυτής συλλογικό όργανο @el
alternative label: هيئة مؤسِّسة @ar
alternative label: 创办团体 @zh-hans
definition: Bir tüzel kişiyi, bir tüzel kişiliği başlatan bir tüzel kişilikle ilişkilendirir. @tr
definition: Correla un ente a un ente che istituisce un ente. @it
definition: Hozzákapcsol egy testületet egy testülethez, amely kezdeményezi egy testület létrehozását. @hu
definition: Liittää yhteisön yhteisöön, joka perusti toisen yhteisön.
definition: Met une collectivité en relation avec une collectivité qui établit une collectivité. @fr
definition: Relaciona una entitat corporativa amb una entitat corporativa que inicia una entitat corporativa. @ca

kattoyhteisö
has element type: 2
instruction number: 29.5
toolkit definition: A corporate body who is hierarchically superior to another corporate body. @en
toolkit definition: Asutus, mis on teise asutuse suhtes ülem. @et
toolkit definition: Başka bir tüzel kişiye hiyerarşik olarak üstün olan bir tüzel kişi. @tr
toolkit definition: Collectivité qui est hiérarchiquement supérieure à une autre collectivité. @fr
toolkit definition: Een corporatie die hiërarchisch hoger staat ten opzichte van een andere corporatie. @nl
toolkit definition: Egy testület, amely egy másik testület hierarchikus felettese. @hu
toolkit definition: Eine Körperschaft, die einer anderen Körperschaft übergeordnet ist. @de
toolkit definition: En korporasjon som er hierarkisk overordnet en annen korporasjon. @no
toolkit definition: Ente gerarchicamente superiore a un altro un ente. @it
toolkit definition: Entitat corporativa que és jeràrquicament superior a una altra entitat corporativa. @ca
toolkit definition: Institūcija, kas ir augstākstāvoša pār citu institūciju. @lv
toolkit definition: Korporation, som er hierarkisk overordnet en anden korporation. @da
toolkit definition: Una entidad corporativa que es jerárquicamente superior a otra entidad corporativa. @es
toolkit definition: Yhteisö, joka on hierarkkisesti ylempänä toista yhteisöä.
toolkit definition: Ένα συλλογικό όργανο το οποίο είναι ιεραρχικά ανώτερο από κάποιο άλλο συλλογικό όργανο. @el
toolkit definition: هيئة أعلى من هيئة أخرى في التسلسل الهرمي. @ar
toolkit definition: 另一个团体的上级团体 @zh-hans
toolkit label: augstākstāvoša institūcija @lv
toolkit label: hierarchical superior @en
toolkit label: hierarchikus felettese: @hu
toolkit label: hierarkisk overordnet @da
toolkit label: hiyerarşik olarak bağlı üst kuruluş ile ilişkilidir @tr
toolkit label: kattoyhteisö
toolkit label: kõrgem asutus @et
toolkit label: moederonderneming @nl
toolkit label: superior jeràrquic @ca
toolkit label: superior jerárquica @es
toolkit label: superiore gerarchico @it
toolkit label: supérieur hiérarchique @fr
toolkit label: Übergeordnete Körperschaft @de
toolkit label: ιεραρχικά ανώτερος @el
toolkit label: أعلى رتبة في التسلسل الهرمي @ar
toolkit label: 上级团体 @zh-hans
has subproperty: P50008
lexical alias: hierarchicalSuperior.en
status: Published
type: Property
domain: C10005
label: a pour supérieur hiérarchique @fr
label: augstākstāvoša institūcija @lv
label: ha come superiore gerarchico @it
label: har hierarkisk overordnet @da
label: has hierarchical superior @en
label: hat übergeordnete Körperschaft @de
label: heeft moederonderneming @nl
label: hierarchikus felettese a következő: @hu
label: hiyerarşik olarak bağlı üst kuruluş ile ilişkilidir @tr
label: kõrgem asutus @et
label: té com a superior jeràrquic @ca
label: έχει ιεραρχικά ανώτερο @el
label: لها هيئة أعلى في التسلسل الهرمي @ar
label: 有上级团体 @zh-hans
sub property of: yhteisöön liittyvä yhteisö
definition: Bir tüzel kişiyi, hiyerarşik olarak başka bir tüzel kişilikden üstün olan bir tüzel kişilikle ilişkilendirir. @tr
definition: Correla un ente a un ente gerarchicamente superiore a un altro un ente. @it
definition: Hozzákapcsol egy testületet, amely egy másik testület hierarchikus felettese, egy testülethez. @hu
definition: Liittää yhteisön yhteisöön, joka on hierarkkisesti ylempänä toista yhteisöä.
definition: Met une collectivité en relation avec une collectivité qui est hiérarchiquement supérieure à une autre collectivité. @fr
definition: Relaciona una entitat corporativa amb una entitat corporativa que és jeràrquicament superior a una altra entitat corporativa. @ca
definition: Relateert een corporatie aan een corporatie die hiërarchisch hoger staat ten opzichte van een andere corporatie. @nl
definition: Relaterer en korporasjon til en korporasjon som er hierarkisk overordnet en annen korporasjon. @no
definition: Relaterer en korporation til en korporation, som er hierarkisk overordnet en anden korporation. @da
definition: Relates a corporate body to a corporate body who is hierarchically superior to another corporate body. @en
definition: Sasaista institūciju ar institūciju, kas ir augstākstāvoša pār citu institūciju. @lv
definition: Seostab asutuse asutusega, mis on teise asutuse suhtes ülem. @et
definition: Setzt eine Körperschaft in Beziehung zu einer Körperschaft, die einer anderen Körperschaft übergeordnet ist. @de
definition: Συνδέει ένα συλλογικό όργανο με ένα συλλογικό όργανο το οποίο είναι ιεραρχικά ανώτερο από κάποιο άλλο συλλογικό όργανο. @el
definition: يربط هيئة بهيئة أعلى من هيئة أخرى في التسلسل الهرمي. @ar
definition: 将一个团体与另一个团体的上级团体关联起来。 @zh-hans

yhteisön sponsoroima yhteisö
has element type: 2
instruction number: 29.5
toolkit definition: A corporate body who is sponsored by another corporate body. @en
toolkit definition: Asutus, mida teine asutus majanduslikult toetab. @et
toolkit definition: Başka bir tüzel kişi tarafından madden desteklenen bir tüzel kişi. @tr
toolkit definition: Collectivité qui est parrainée par une autre collectivité. @fr
toolkit definition: Een corporatie die is gesponsord door een andere corporatie. @nl
toolkit definition: Egy testület, amelyet egy másik testület szponzorál. @hu
toolkit definition: Eine Körperschaft, die von einer anderen Körperschaft gefördert wird. @de
toolkit definition: En korporasjon som en annen korporasjon er sponsor av. @no
toolkit definition: Ente sponsorizzato da un altro un ente. @it
toolkit definition: Entitat corporativa que és patrocinada per una altra entitat corporativa. @ca
toolkit definition: Institūcija, ko sponsorē cita institūcija. @lv
toolkit definition: Korporation, som er sponsoreret af en anden korporation. @da
toolkit definition: Una entidad corporativa que es patrocinada por otra entidad corporativa. @es
toolkit definition: Yhteisö, jota toinen yhteisö sponsoroi.
toolkit definition: Ένα συλλογικό όργανο το οποίο χρηματοδοτείται από κάποιο άλλο συλλογικό όργανο. @el
toolkit definition: هيئة ترعاها هيئة أخرى. @ar
toolkit definition: 受到另一个团体赞助的团体 @zh-hans
toolkit label: Körperschaft als Sponsorin/Sponsor einer Körperschaft @de
toolkit label: asutuse toetatud asutus @et
toolkit label: collectivité parrainée d’une collectivité @fr
toolkit label: ente sponsorizzato da un ente @it
toolkit label: entidad corporativa patrocinada @es
toolkit label: entitat corporativa patrocinada per una entitat corporativa @ca
toolkit label: gesponsorde corporatie van corporatie @nl
toolkit label: konferences numerācija @lv
toolkit label: korporasjon sponset av korporasjon @no
toolkit label: korporation sponsoreret af korporation @da
toolkit label: sponsored corporate body of corporate body @en
toolkit label: testület szponzoráló testülete: @hu
toolkit label: tüzel kişinin sponsor olduğu tüzel kişi @tr
toolkit label: yhteisön sponsoroima yhteisö
toolkit label: χορηγούμενο συλλογικό όργανο του συλλογικού οργάνου @el
toolkit label: هيئة راعية لهيئة @ar
toolkit label: 团体的受到赞助的团体 @zh-hans
has subproperty: P50009
lexical alias: sponsoredCorporateBodyOfCorporateBody.en
status: Published
type: Property
domain: C10005
label: a pour collectivité parrainée d’une collectivité @fr
label: asutuse toetatud asutus @et
label: ha come ente sponsorizzato di ente @it
label: har korporasjon sponset av korporasjon @no
label: har korporation sponsoreret af korporation @da
label: has sponsored corporate body of corporate body @en
label: hat Körperschaft als Sponsorin/Sponsor einer Körperschaft @de
label: heeft gesponsorde corporatie van corporatie @nl
label: konferences numerācija @lv
label: testület szponzoráló testülete a következő: @hu
label: té com a entitat corporativa patrocinada per una entitat corporativa @ca
label: tüzel kişinin sponsor olduğu tüzel kişi ile ilişkilidir @tr
label: έχει χορηγήσει συλλογικό όργανο του συλλογικού οργάνου @el
label: لها هيئة راعية لهيئة @ar
label: 有团体的受到赞助团体 @zh-hans
sub property of: yhteisöön liittyvä yhteisö
sub property of: yhteistoimijan sponsoroima yhteisö
alternative label: collectivité commanditée d’une collectivité @fr
alternative label: sponsoroitu yhteisö
definition: Bir tüzel kişiyi, başka bir tüzel kişi tarafından desteklenen bir kuruluş ile ilişkilendirir. @tr
definition: Correla un ente a un ente sponsorizzato da un altro un ente. @it
definition: Hozzákapcsol egy testületet egy testülethez, amelyet a másik testület szponzorál. @hu
definition: Liittää yhteisön yhteisöön, jota toinen yhteisö sponsoroi.
definition: Met une collectivité en relation avec une collectivité qui est parrainée par une autre collectivité. @fr
definition: Relaciona una entitat corporativa amb una entitat corporativa que és patrocinada per una altra entitat corporativa. @ca
definition: Relateert een corporatie aan een corporatie die is gesponsord door een andere corporatie. @nl
definition: Relaterer en korporasjon til en korporasjon som en annen korporasjon er sponsor av. @no
definition: Relaterer en korporation til en korporation, som er sponsoreret af en anden korporation. @da
definition: Relates a corporate body to a corporate body who is sponsored by another corporate body. @en
definition: Sasaista institūciju ar institūciju, ko sponsorē cita institūcija. @lv
definition: Seostab asutuse asutusega, mida teine asutus majanduslikult toetab. @et
definition: Setzt eine Körperschaft in Beziehung zu einer Körperschaft, die von einer anderen Körperschaft gefördert wird. @de
definition: Συνδέει ένα συλλογικό όργανο με ένα συλλογικό όργανο το οποίο χρηματοδοτείται από κάποιο άλλο συλλογικό όργανο. @el
definition: يربط هيئة بهيئة ترعاها هيئة أخرى. @ar
definition: 将一个团体与受到另一个团体赞助的团体关联起来。 @zh-hans

alayhteisö
has element type: 2
instruction number: 29.5
toolkit definition: A corporate body who is subordinate to another corporate body. @en
toolkit definition: Asutus, mis allub teisele asutusele. @et
toolkit definition: Başka bir tüzel kişiye bağlı olan bir tüzel kişi @tr
toolkit definition: Collectivité qui est subordonnée à une autre collectivité. @fr
toolkit definition: Een corporatie die ondergeschikt is aan een andere corporatie. @nl
toolkit definition: Egy testület, amely egy másik testület hierarchikus alárendeltje. @hu
toolkit definition: Eine Körperschaft, die einer anderen Körperschaft untergeordnet ist. @de
toolkit definition: En korporasjon som er underordnet en annen korporasjon. @no
toolkit definition: Ente subordinato a un altro ente. @it
toolkit definition: Entitat corporativa que està subordinada a una altra entitat corporativa. @ca
toolkit definition: Institūcija, kas ir pakļauta citai institūcijai. @lv
toolkit definition: Korporation, som er underordnet en anden korporation. @da
toolkit definition: Una entidad corporativa que es subordinada a otra entidad corporativa. @es
toolkit definition: Yhteisö, joka on hierarkkisesti toisen yhteisön alainen.
toolkit definition: Ένα συλλογικό όργανο το οποίο υπόκειται κάποιο άλλο συλλογικό όργανο. @el
toolkit definition: هيئة أدنى من هيئة أخرى. @ar
toolkit definition: 另一个团体的下级团体 @zh-hans
toolkit label: Untergeordnete Körperschaft @de
toolkit label: alayhteisö
toolkit label: allasutus @et
toolkit label: dochteronderneming @nl
toolkit label: hierarchical subordinate @en
toolkit label: hierarchikus alárendeltje: @hu
toolkit label: hierarkisk underordnet @da
toolkit label: hiyerarşik olarak bağlı alt kuruluş ile ilişkilidir @tr
toolkit label: pakļautības institūcija @lv
toolkit label: subordinada jerárquica @es
toolkit label: subordinat jeràrquic @ca
toolkit label: subordinato gerarchico @it
toolkit label: subordonné hiérarchique @fr
toolkit label: ιεραρχικά υποτασσόμενο @el
toolkit label: أدنى رتبة في التسلسل الهرمي @ar
toolkit label: 下级团体 @zh-hans
has subproperty: P50010
lexical alias: hierarchicalSubordinate.en
status: Published
type: Property
domain: C10005
label: a pour subordonné hiérarchique @fr
label: allasutus @et
label: ha come subordinato gerarchico @it
label: har hierarkisk underordnet @da
label: has hierarchical subordinate @en
label: hat untergeordnete Körperschaft @de
label: heeft dochteronderneming @nl
label: hierarchikus alárendeltje a következő: @hu
label: hiyerarşik olarak bağlı alt kuruluş ile ilişkilidir @tr
label: pakļautības institūcija @lv
label: té com a subordinat jeràrquic @ca
label: έχει ιεραρχικά υποτασσόμενο @el
label: لها هيئة أدنى في التسلسل الهرمي @ar
label: 有下级团体 @zh-hans
sub property of: yhteisöön liittyvä yhteisö
definition: Bir tüzel kişiyi, başka bir tüzel kişiye bağlı olan bir tüzel kişiyle ilişkilendirir. @tr
definition: Correla un ente a un ente subordinato un altro un ente. @it
definition: Hozzákapcsol egy testületet, amely egy másik testület hierarchikus alárendeltje, egy testülethez. @hu
definition: Liittää yhteisön yhteisöön, joka on hierarkkisesti toisen yhteisön alainen.
definition: Met une collectivité en relation avec une collectivité qui est subordonnée à une autre collectivité. @fr
definition: Relaciona una entitat corporativa amb una entitat corporativa que està subordinada a una altra entitat corporativa. @ca
definition: Relateert een corporatie aan een corporatie die ondergeschikt is aan een andere corporatie. @nl
definition: Relaterer en korporasjon til en korporasjon som er underordnet en annen korporasjon. @no
definition: Relaterer en korporation til en korporation, som er underordnet en anden korporation. @da
definition: Relates a corporate body to a corporate body who is subordinate to another corporate body. @en
definition: Sasaista institūciju ar institūciju, kas ir pakļauta citai institūcijai. @lv
definition: Seostab asutuse asutusega, mis allub teisele asutusele. @et
definition: Setzt eine Körperschaft in Beziehung zu einer Körperschaft, die einer anderen Körperschaft untergeordnet ist. @de
definition: Συνδέει ένα συλλογικό όργανο με ένα συλλογικό όργανο το οποίο υπόκειται σε κάποιο άλλο συλλογικό όργανο. @el
definition: يربط هيئة بهيئة هي أدنى من هيئة أخرى. @ar
definition: 将一个团体与另一个团体的下级团体关联起来。 @zh-hans

kanssayhdistyjä
has element type: 2
instruction number: 29.5
toolkit definition: A corporate body who merged with another corporate body to form a third. @en
toolkit definition: Ar otru institūciju apvienota institūcija, kopā veidojot trešo. @lv
toolkit definition: Asutus, mis on ühendanud teise asutuse ja moodustunud on kolmas asutus. @et
toolkit definition: Collectivité qui a fusionné avec une autre collectivité pour en former une troisième. @fr
toolkit definition: Een corporatie die met een andere corporatie fuseerde om een derde te vormen. @nl
toolkit definition: Egy testület, amely egy harmadikat alkotva összeolvad egy másik testülettel. @hu
toolkit definition: Eine Körperschaft, die mit einer anderen Körperschaft fusioniert hat, um eine neue zu bilden. @de
toolkit definition: En korporasjon som er slått sammen med en annen korporasjon for å danne en tredje korporasjon. @no
toolkit definition: Ente che si è accorpato con un altro ente per formarne un terzo. @it
toolkit definition: Entitat corporativa que s’ha fusionat amb una altra entitat corporativa per formar-ne una tercera. @ca
toolkit definition: Korporation, som blev sammenlagt med en anden korporation for at skabe en tredje. @da
toolkit definition: Una entidad corporativa que se fusionó con otra entidad corporativa para formar una tercera. @es
toolkit definition: Yhteisö, joka on sulautunut toiseen yhteisöön muodostaakseen kolmannen yhteisön.
toolkit definition: Üçüncü bir tüzel kişi oluşturmak üzere başka bir tüzel kişiyle birleşen bir tüzel kişi @tr
toolkit definition: Ένα συλλογικό όργανο το οποίο συγχωνεύθηκε με κάποιο άλλο συλλογικό όργανο για τη δημιουργία ενός τρίτου. @el
toolkit definition: هيئة اندمجت مع هيئة أخرى لتُشكل هيئة ثالثة. @ar
toolkit definition: 与另一团体合并后形成第三个团体的团体 @zh-hans
toolkit label: Birleşme @tr
toolkit label: Fusionierte Körperschaft @de
toolkit label: accorpato @it
toolkit label: beolvadó: @hu
toolkit label: collectivité fusionnée @fr
toolkit label: element i sammenslåing @no
toolkit label: entitat corporativa fusionada @ca
toolkit label: fusiepartner @nl
toolkit label: fusionada con @es
toolkit label: institūcija apvienota ar @lv
toolkit label: kanssayhdistyjä
toolkit label: mergee @en
toolkit label: sammenlagt @da
toolkit label: ühendav asutus @et
toolkit label: συγχώνευση @el
toolkit label: هيئة مُدمجة @ar
toolkit label: 被合并的一方 @zh-hans
has subproperty: P50011
lexical alias: mergee.en
status: Published
type: Property
domain: C10005
label: a pour collectivité fusionnée @fr
label: beolvadója a következő: @hu
label: birleşen kurum ile ilişkilidir @tr
label: ha come accorpato @it
label: har element i sammenslåing @no
label: har sammenlagt @da
label: has mergee @en
label: hat fusionierte Körperschaft @de
label: heeft fusiepartner @nl
label: institūcija apvienota ar @lv
label: té com a entitat corporativa fusionada @ca
label: ühendav asutus @et
label: έχει συγχώνευση @el
label: لها هيئة مُدمجة @ar
label: 有被合并的一方 @zh-hans
sub property of: yhteisöön liittyvä yhteisö
definition: Bir tüzel kişiyi, üçüncü bir tüzel kişiyi oluşturmak üzere başka bir tüzel kişi ile birleşen bir tüzel kişi ile ilişkilendirir @tr
definition: Correla un ente a un ente che si è accorpato con un altro ente per formarne un terzo. @it
definition: Hozzákapcsol egy testületet egy testülethez, amely egy harmadikat alkotva összeolvad egy másik testülettel. @hu
definition: Liittää yhteisön yhteisöön, joka on sulautunut toiseen yhteisöön muodostaakseen kolmannen yhteisön.
definition: Met une collectivité en relation avec une collectivité qui a fusionné avec une autre collectivité pour en former une troisième. @fr
definition: Relaciona una entitat corporativa amb una entitat corporativa que s’ha fusionat amb una altra entitat corporativa per formar-ne una tercera. @ca
definition: Relateert een corporatie aan een corporatie die met een andere corporatie fuseerde om een derde te vormen. @nl
definition: Relaterer en korporasjon til en korporasjon som er slått sammen med en annen korporasjon for å danne en tredje korporasjon. @no
definition: Relaterer en korporation til en korporation, som blev sammenlagt med en anden korporation for at skabe en tredje. @da
definition: Relates a corporate body to a corporate body who merged with another corporate body to form a third. @en
definition: Sasaista institūciju ar institūciju, kas apvienota ar citu institūciju, kopā veidojot trešo. @lv
definition: Seostab asutuse asutusega, mis on ühendanud teise asutuse ja moodustunud on kolmas asutus. @et
definition: Setzt eine Körperschaft in Beziehung zu einer Körperschaft, die mit einer anderen Körperschaft fusioniert hat, um eine neue zu bilden. @de
definition: Συνδέει ένα συλλογικό όργανο με ένα συλλογικό όργανο το οποίο συγχωνεύθηκε με κάποιο άλλο συλλογικό όργανο για τη δημιουργία ενός τρίτου. @el
definition: يربط هيئة بهيئة اندمجت مع هيئة أخرى لتشكيل هيئة ثالثة. @ar
definition: 将一个团体与一个和另一团体合并后形成第三个团体的团体关联起来。 @zh-hans

yhteisön edeltäjä
has element type: 2
instruction number: 29.5
toolkit definition: A corporate body who precedes another corporate body. @en
toolkit definition: Asutus, mis eelneb teisele asutusele. @et
toolkit definition: Başka bir tüzel kişiden önce gelen tüzel kişi @tr
toolkit definition: Collectivité qui précède une autre collectivité. @fr
toolkit definition: Een corporatie die aan een andere corporatie voorafgaat. @nl
toolkit definition: Egy testület, amely egy másik testület elődje. @hu
toolkit definition: Eine Körperschaft, die einer anderen Körperschaft vorausgeht. @de
toolkit definition: En korporasjon som kommer før en annen korporasjon. @no
toolkit definition: Entitat corporativa que precedeix una altra entitat corporativa. @ca
toolkit definition: Institūcija, citas institūcijas priekštecis. @lv
toolkit definition: Korporation, som går forud for en anden korporation. @da
toolkit definition: Una entidad corporativa que precede a otra entidad corporativa @es
toolkit definition: Yhteisö, joka edelsi toista yhteisöä.
toolkit definition: ente predecessore di un altro ente. @it
toolkit definition: Ένα συλλογικό όργανο το οποίο προηγείται κάποιου άλλου συλλογικού οργάνου. @el
toolkit definition: هيئة سبقت هيئة أخرى. @ar
toolkit definition: 作为另一个团体前身的团体 @zh-hans
toolkit label: Tüzel kişiliğin öncüsü @tr
toolkit label: Vorgängerin/Vorgänger einer Körperschaft @de
toolkit label: asutuse eelkäija @et
toolkit label: forgænger til korporation @da
toolkit label: forløper til korporasjon @no
toolkit label: institūcijas priekštecis (institūcija) @lv
toolkit label: predecesora @es
toolkit label: predecessor d’una entitat corporativa @ca
toolkit label: predecessor of corporate body @en
toolkit label: predecessore di un ente @it
toolkit label: prédécesseur d’une collectivité @fr
toolkit label: testület jogelődje: @hu
toolkit label: voorganger van corporatie @nl
toolkit label: yhteisön edeltäjä
toolkit label: πρόγονος του συλλογικού οργάνου @el
toolkit label: سابقة لهيئة @ar
toolkit label: 团体的前身 @zh-hans
has subproperty: jakautunut yhteisö
has subproperty: yhdistynyt yhteisö
has subproperty: P50012
lexical alias: predecessorOfCorporateBody.en
status: Published
type: Property
domain: C10005
label: a pour prédécesseur d’une collectivité @fr
label: asutuse eelkäija @et
label: ha come predecessore di ente @it
label: har forgænger til korporation @da
label: har forløper til korporasjon @no
label: has predecessor of corporate body @en
label: hat Vorgängerin/Vorgänger einer Körperschaft @de
label: heeft voorganger van corporatie @nl
label: institūcijas priekštecis (institūcija) @lv
label: testület jogelődje a következő: @hu
label: té com a predecessor d’una entitat corporativa @ca
label: önceki tüzel kişi ile ilişkilidir @tr
label: έχει πρόγονο του συλλογικού οργάνου @el
label: لها هيئة سابقة @ar
label: 有团体的前身 @zh-hans
sub property of: yhteisöön liittyvä yhteisö
sub property of: yhteistoimijan edeltäjä
alternative label: Vorgänger @de
alternative label: edeltäjä
alternative label: előd: @hu
alternative label: forløber @da
alternative label: forløper @no
alternative label: predecesor @es
alternative label: predecessor @ca
alternative label: predecessore @it
alternative label: prédécesseur @fr
alternative label: Öncül @tr
alternative label: πρόγονος @el
alternative label: سابقة @ar
alternative label: 前身 @zh-hans
definition: Bir tüzel kişiyi, başka bir tüzel kişilikten önce gelen bir tüzel kişilikle ilişkilendirir. @tr
definition: Correla un ente a un ente che è predecessore di un altro ente. @it
definition: Hozzákapcsol egy testületet egy testülethez, amely egy másik testület elődje. @hu
definition: Liittää yhteisön yhteisöön, joka edelsi toista yhteisöä.
definition: Met une collectivité en relation avec une collectivité qui précède une autre collectivité. @fr
definition: Relaciona una entitat corporativa amb una entitat corporativa que precedeix una altra entitat corporativa. @ca

yhdistymisestä muodostunut yhteisö
has element type: 2
instruction number: 29.5
toolkit definition: A corporate body who resulted from a merger of two or more other corporate bodies. @en
toolkit definition: Asutus, mis on kahe või enama asutuse ühinemise tulemus. @et
toolkit definition: Collectivité qui a résulté d’une fusion entre deux ou plusieurs autres collectivités. @fr
toolkit definition: Een corporatie die resulteerde uit een fusie van twee of meer andere corporaties. @nl
toolkit definition: Egy testület, amelyet két vagy több másik testület összeolvadása eredményezett. @hu
toolkit definition: Eine Körperschaft, die aus einer Fusion von zwei oder mehreren Körperschaften entstanden ist. @de
toolkit definition: En korporasjon som er resultat av en fusjon av to eller flere andre korporasjoner. @no
toolkit definition: Ente che è il risultato dell'accorpamento di due o più altri enti. @it
toolkit definition: Entitat corporativa que és el resultat d’una fusió de dues o més entitats corporatives. @ca
toolkit definition: Institūcija, kas izveidojās, apvienojoties divām vai vairākām institūcijām. @lv
toolkit definition: Kahden tai useamman yhteisön yhdistymisestä muodostunut yhteisö.
toolkit definition: Korporation, som er resultatet af en sammenlægning af to eller flere andre korporationer. @da
toolkit definition: Una entidad corporativa que resulta de la fusión de dos o más entidades corporativas. @es
toolkit definition: İki veya daha fazla tüzel kişilerin birleşmesi sonucu ortaya çıkan bir tüzel kişilik. @tr
toolkit definition: Ένα συλλογικό όργανο το οποίο προέκυψε από τη συγχώνευση δύο ή περισσότερων συλλογικών οργάνων. . @el
toolkit definition: هيئة نتجت عن اندماج هيئتين أو أكثر من الهيئات الأخرى. @ar
toolkit definition: 两个其他团体合并后产生的团体 @zh-hans
toolkit label: Ergebnis einer Fusion @de
toolkit label: apvienotā institūcija @lv
toolkit label: beolvadás eredménye: @hu
toolkit label: birleşme ürünü @tr
toolkit label: product of merger @en
toolkit label: producto de fusión de @es
toolkit label: produkt af sammenlægning @da
toolkit label: resultaat van fusie @nl
toolkit label: resultat av sammenslåing @no
toolkit label: resultat de fusió @ca
toolkit label: risultato di un accorpamento @it
toolkit label: résultat de fusion @fr
toolkit label: yhdistymisestä muodostunut yhteisö
toolkit label: ühinemisel moodustunud asutus @et
toolkit label: προϊόν της συγχώνευσης @el
toolkit label: نتاج دمج @ar
toolkit label: 合并而成的团体 @zh-hans
has subproperty: P50013
lexical alias: productOfMerger.en
status: Published
type: Property
domain: C10005
label: a pour résultat de fusion @fr
label: apvienotā institūcija @lv
label: beolvadás eredménye a következő: @hu
label: birleşme sonucu oluşan tüzel kişi ile ilişkilidir @tr
label: ha come risultato di accorpamento @it
label: har produkt af sammenlægning @da
label: har resultat av sammenslåing @no
label: has product of merger @en
label: hat Ergebnis einer Fusion @de
label: heeft resultaat van fusie @nl
label: té com a resultat de fusió @ca
label: ühinemisel moodustunud asutus @et
label: έχει προϊόν της συγχώνευσης @el
label: لها نتاج دمج @ar
label: 有合并而成的团体 @zh-hans
sub property of: yhteisön seuraaja
definition: Bir tüzel kişiyi, iki veya daha fazla başka tüzel kişinin birleşmesi sonucu ortaya çıkan bir tüzel kişiyle ilişkilendirir @tr
definition: Correla un ente a un ente che è il risultato dell'accorpamento di due o più altri enti. @it
definition: Hozzákapcsol egy testületet egy testülethez, amelyet két vagy több másik testület összeolvadása eredményezett. @hu
definition: Liittää yhteisön kahden tai useamman yhteisön yhdistymisestä muodostuneeseen yhteisöön.
definition: Met une collectivité en relation avec une collectivité qui a résulté d’une fusion entre deux ou plusieurs autres collectivités. @fr
definition: Relaciona una entitat corporativa amb una entitat corporativa que és el resultat d’una fusió de dues o més entitats corporatives. @ca
definition: Relateert een corporatie aan een corporatie die resulteerde uit een fusie van twee of meer andere corporaties. @nl
definition: Relaterer en korporasjon til en korporasjon som er resultat av en fusjon av to eller flere andre korporasjoner. @no
definition: Relaterer en korporation til en korporation, som er resultatet af en sammenlægning af to eller flere andre korporationer. @da
definition: Relates a corporate body to a corporate body who resulted from a merger of two or more other corporate bodies. @en
definition: Sasaista institūciju ar institūciju, kas izveidojās, apvienojoties divām vai vairākām institūcijām. @lv
definition: Seostab asutuse asutusega, mis on kahe või enama asutuse ühinemise tulemus. @et
definition: Setzte eine Körperschaft in Beziehung zu einer Körperschaft, die aus einer Fusion von zwei oder mehreren Körperschaften entstanden ist. @de
definition: Συνδέει ένα συλλογικό όργανο με ένα συλλογικό όργανο το οποίο προέκυψε από τη συγχώνευση δύο ή περισσότερων συλλογικών οργάνων. @el
definition: يربط هيئة بهيئة نتجت عن اندماج هيئتين أو أكثر من الهيئات الأخرى. @ar
definition: 将一个团体与两个其他团体合并后产生的团体关联起来。 @zh-hans

jakautumisesta muodostunut yhteisö
has element type: 2
instruction number: 29.5
toolkit definition: A corporate body who resulted from a split or division of another corporate body. @en
toolkit definition: Asutus, mis on teise asutuse jagunemise tulemus. @et
toolkit definition: Başka bir tüzel kişiliğin bölünmesi veya parçalanması sonucu ortaya çıkan bir tüzel kişilik. @tr
toolkit definition: Collectivité qui a résulté d’une scission ou d’une division d’une autre collectivité. @fr
toolkit definition: Een corporatie die resulteerde uit een splitsing of onderverdeling van een andere corporatie. @nl
toolkit definition: Egy testület, amelyet egy másik testület szétválása vagy felosztása eredményezett. @hu
toolkit definition: Eine Körperschaft, die aus einer Aufteilung oder einer Teilung einer anderen Körperschaft entstanden ist. @de
toolkit definition: En korporasjon som er resultat av en oppdeling av en annen korporasjon. @no
toolkit definition: Ente sorto dalla separazione o divisione di un altro ente. @it
toolkit definition: Entitat corporativa que és el resultat d’una escissió o una divisió d’una altra entitat corporativa. @ca
toolkit definition: Institūcija, kas radusies atdaloties no citas institūcijas. @lv
toolkit definition: Korporation, som er resultatet af en opdeling af to eller flere andre korporationer. @da
toolkit definition: Una entidad corporativa que resulta de la escisión o división de otra entidad corporativa. @es
toolkit definition: Yhteisö, joka on seuraus toisen yhteisön jakautumisesta.
toolkit definition: Ένα συλλογικό όργανο το οποίο προέκυψε από τον διαχωρισμό ή τη διάσπαση κάποιου άλλου συλλογικού οργάνου. @el
toolkit definition: هيئة نتجت عن انشطار أو انقسام هيئة أخرى. @ar
toolkit definition: 另一个团体分出或划分后形成的团体 @zh-hans
toolkit label: Ergebnis einer Aufteilung @de
toolkit label: atdalītā institūcija @lv
toolkit label: bölünmüş ürün @tr
toolkit label: jagunemisel moodustunud asutus @et
toolkit label: jakautumisesta muodostunut yhteisö
toolkit label: product of split @en
toolkit label: producto de escisión de @es
toolkit label: produkt af opdeling @da
toolkit label: resultaat van splitsing @nl
toolkit label: resultat av oppdeling @no
toolkit label: resultat d’escissió @ca
toolkit label: risultato di separazione @it
toolkit label: résultat de scission @fr
toolkit label: szétválás eredménye: @hu
toolkit label: προϊόν του διαχωρισμού @el
toolkit label: ناتج الانفصال @ar
toolkit label: 分出的团体 @zh-hans
has subproperty: P50014
lexical alias: productOfSplit.en
status: Published
type: Property
domain: C10005
label: a pour résultat de scission @fr
label: atdalītā institūcija @lv
label: bölünme sonucu oluşan tüzel kişi ile ilişkilidir @tr
label: ha come risultato di separazione @it
label: har produkt af opdeling @da
label: har resultat av oppdeling @no
label: has product of split @en
label: hat Ergebnis einer Aufteilung @de
label: heeft resultaat van splitsing @nl
label: jagunemisel moodustunud asutus @et
label: szétválás ereménye a következő: @hu
label: té com a resultat d’escissió @ca
label: έχει προϊόν του διαχωρισμού @el
label: لها ناتج للانفصال @ar
label: 有分出的团体 @zh-hans
sub property of: yhteisön seuraaja
definition: Bir tüzel kişiyi, başka bir tüzel kişinin bölünmesi veya parçalanması sonucu ortaya çıkan bir tüzel kişilikle ilişkilendirir. @tr
definition: Correla un ente a un ente sorto dalla separazione o divisione di un altro ente. @it
definition: Hozzákapcsol egy testületet egy testülethez, amelyet egy másik testület szétválása vagy felosztása eredményezett. @hu
definition: Liittää yhteisön yhteisöön, joka on seuraus toisen yhteisön jakautumisesta.
definition: Met une collectivité en relation avec une collectivité qui a résulté d’une scission ou d’une division d’une autre collectivité. @fr
definition: Relaciona una entitat corporativa amb una entitat corporativa que és el resultat d’una escissió o una divisió d’una altra entitat corporativa. @ca
definition: Relateert een corporatie aan een corporatie die resulteerde uit een splitsing of onderverdeling van een andere corporatie. @nl
definition: Relaterer en korporasjon til en korporasjon som er resultat av en oppdeling av en annen korporasjon. @no
definition: Relaterer en korporation til en korporation, som er resultatet af en opdeling af to eller flere andre korporationer. @da
definition: Relates a corporate body to a corporate body who resulted from a split or division of another corporate body. @en
definition: Sasaista institūciju ar institūciju, kas radusies atdaloties no citas institūcijas. @lv
definition: Seostab asutuse asutusega, mis on teise asutuse jagunemise tulemus. @et
definition: Setzt eine Körperschaft in Beziehung zu einer Körperschaft, die aus einer Aufteilung oder einer Teilung einer anderen Körperschaft entstanden ist. @de
definition: Συνδέει ένα συλλογικό όργανο με ένα συλλογικό όργανο το οποίο προέκυψε από τον διαχωρισμό ή τη διάσπαση κάποιου άλλου συλλογικού οργάνου. @el
definition: يربط هيئة بهيئة نتجت عن انفصال أو عن تقسيم هيئة الأخرى. @ar
definition: 将一个团体与另一个团体分出或划分后形成的团体关联起来。 @zh-hans

yhteisöä sponsoroiva yhteisö
has element type: 2
instruction number: 29.5
toolkit definition: A corporate body who sponsors another corporate body. @en
toolkit definition: Asutus, kes toetab majanduslikult teist asutust. @et
toolkit definition: Başka bir tüzel kişiye sponsor olan bir tüzel kişi. @tr
toolkit definition: Collectivité qui parraine une autre collectivité. @fr
toolkit definition: Een corporatie die een andere corporatie sponsort. @nl
toolkit definition: Egy testület, amely egy másik testületet szponzorál. @hu
toolkit definition: Eine Körperschaft, die eine andere Körperschaft fördert. @de
toolkit definition: En korporasjon som er sponsor av en annen korporasjon. @no
toolkit definition: Ente che che sponsorizza un altro ente. @it
toolkit definition: Entitat corporativa que patrocina una altra entitat corporativa. @ca
toolkit definition: Institūcija, kas sponsorē citu institūciju @lv
toolkit definition: Korporation, som sponsorerer en anden korporation. @da
toolkit definition: Una entidad corporativa que patrocina a otra entidad corporativa. @es
toolkit definition: Yhteisö, joka sponsoroi toista yhteisöä.
toolkit definition: Ένα συλλογικό όργανο το οποίο χρηματοδοτεί κάποιο άλλο συλλογικό όργανο. @el
toolkit definition: هيئة ترعى هيئة أخرى. @ar
toolkit definition: 赞助另一个团体的团体 @zh-hans
toolkit label: Sponsorin/Sponsor einer Körperschaft (Körperschaft) @de
toolkit label: asutust toetav asutus @et
toolkit label: collectivité parraineuse d’une collectivité @fr
toolkit label: ente che sponsorizza un ente @it
toolkit label: entidad corporativa patrocinadora @es
toolkit label: entitat corporativa patrocinadora d’una entitat corporativa @ca
toolkit label: institūcijas sponsors (institūcija) @lv
toolkit label: sponsor-corporatie van corporatie @nl
toolkit label: sponsorerende korporation af korporation @da
toolkit label: sponsoring corporate body of corporate body @en
toolkit label: sponsorkorporasjon for korporasjon @no
toolkit label: testület szponzoráló testülete: @hu
toolkit label: tüzel kişinin sponsor olan tüzel kişisi @tr
toolkit label: yhteisöä sponsoroiva yhteisö
toolkit label: χορηγός συλλογικό όργανο του συλλογικού οργάνου @el
toolkit label: هيئة راعية لهيئة @ar
toolkit label: 团体的赞助团体 @zh-hans
has subproperty: P50015
lexical alias: sponsoringCorporateBodyOfCorporateBody.en
status: Published
type: Property
domain: C10005
label: a pour collectivité parraineuse d’une collectivité @fr
label: asutust toetav asutus @et
label: ha come ente sponsorizzatore di ente @it
label: har sponsorerende korporation af korporation @da
label: har sponsorkorporasjon for korporasjon @no
label: has sponsoring corporate body of corporate body @en
label: hat Sponsorin/Sponsor einer Körperschaft (Körperschaft) @de
label: heeft sponsor-corporatie van corporatie @nl
label: institūcijas sponsors (institūcija) @lv
label: testület szponzoráló testülete a következő: @hu
label: té com a entitat corporativa patrocinadora d’una entitat corporativa @ca
label: tüzel kişinin sponsoru olan tüzel kişi ile ilişkilidir @tr
label: έχει χορηγό συλλογικό όργανο του συλλογικού οργάνου @el
label: لها هيئة راعية لهيئة @ar
label: 有团体的赞助团体 @zh-hans
sub property of: yhteisöön liittyvä yhteisö
sub property of: yhteisöä sponsoroiva yhteistoimija
alternative label: Fördernde Körperschaft @de
alternative label: collectivité commanditaire d’une collectivité @fr
alternative label: ente sostenitore @it
alternative label: entitat corporativa patrocinadora @ca
alternative label: organismo corporativo patrocinador @es
alternative label: sponsor (asutus) @et
alternative label: sponsor olan tüzel kişi @tr
alternative label: sponsorerende korporation @da
alternative label: sponsoring corporate body @en
alternative label: sponsorkorporasjon @no
alternative label: sponsoroiva yhteisö
alternative label: szponzoráló testület: @hu
alternative label: χορηγός συλλογικό όργανο @el
alternative label: هيئة راعية @ar
alternative label: 赞助团体 @zh-hans
definition: Bir tüzel kişiyi, başka bir tüzel kişiye sponsor olan bir tüzel kişiyle ilişkilendirir. @tr
definition: Correla un ente a un ente che sponsorizza un altro ente. @it
definition: Hozzákapcsol egy testületet egy testülethez, amely egy másik testületet szponzorál. @hu
definition: Liittää yhteisön yhteisöön, joka sponsoroi toista yhteisöä.
definition: Met une collectivité en relation avec une collectivité qui parraine une autre collectivité. @fr
definition: Relaciona una entitat corporativa amb una entitat corporativa que patrocina una altra entitat corporativa. @ca

yhteisön seuraaja
has element type: 2
instruction number: 29.5
toolkit definition: A corporate body who succeeds or follows another corporate body. @en
toolkit definition: Asutus, mis järgneb teisele asutusele. @et
toolkit definition: Başka bir tüzel kişinin yerine geçen veya onu takip eden bir tüzel kişi. @tr
toolkit definition: Collectivité qui succède ou fait suite à une autre collectivité. @fr
toolkit definition: Een corporatie die een andere corporatie opvolgt of volgt. @nl
toolkit definition: Egy testület, amely egy másik testületet követ vagy annak utódja. @hu
toolkit definition: Eine Körperschaft, die einer anderen Körperschaft nachfolgt oder aus ihr hervorgeht. @de
toolkit definition: En korporasjon som etterfølger en annen korporasjon. @no
toolkit definition: Ente che succede o segue un altro ente. @it
toolkit definition: Entitat corporativa que succeeix o segueix una altra entitat corporativa. @ca
toolkit definition: Institūcija, citas institūcijas pēctecis. @lv
toolkit definition: Korporation, som efterfølger eller kommer efter en anden korporation. @da
toolkit definition: Una entidad corporativa que sucede o continúa a otra entidad corporativa. @es
toolkit definition: Yhteisö, joka jatkaa tai seuraa toista yhteisöä.
toolkit definition: Ένα συλλογικό όργανο το οποίο διαδέχεται ή έπεται κάποιου άλλου συλλογικού οργάνου. @el
toolkit definition: هيئة تخلُف هيئة أخرى أو تتبعها. @ar
toolkit definition: 后继或紧随另一个团体的团体 @zh-hans
toolkit label: Nachfolger einer Körperschaft @de
toolkit label: asutuse järglane @et
toolkit label: efterfølger til korporation @da
toolkit label: etterfølger til korporasjon @no
toolkit label: institūcijas pēctecis (institūcija) @lv
toolkit label: opvolger van corporatie @nl
toolkit label: successeur d’une collectivité @fr
toolkit label: successor d’una entitat corporativa @ca
toolkit label: successor of corporate body @en
toolkit label: successore di un ente @it
toolkit label: sucesora @es
toolkit label: testület jogutódja: @hu
toolkit label: yerine geçen tüzel kişi @tr
toolkit label: yhteisön seuraaja
toolkit label: διάδοχος του συλλογικού οργάνου @el
toolkit label: هيئة تخلُف أخرى @ar
toolkit label: 团体的后继 @zh-hans
has subproperty: yhdistymisestä muodostunut yhteisö
has subproperty: jakautumisesta muodostunut yhteisö
has subproperty: P50016
lexical alias: successorOfCorporateBody.en
status: Published
type: Property
domain: C10005
label: a pour successeur d’une collectivité @fr
label: asutuse järglane @et
label: ha come successore di ente @it
label: har efterfølger til korporation @da
label: har etterfølger til korporasjon @no
label: has successor of corporate body @en
label: hat Nachfolger einer Körperschaft @de
label: heeft opvolger van corporatie @nl
label: institūcijas pēctecis (institūcija) @lv
label: testület jogutódja a következő: @hu
label: té com a successor d’una entitat corporativa @ca
label: tüzel kişinin yerine geçen tüzel kişi ile ilişkilidir @tr
label: έχει διάδοχο του συλλογικού οργάνου @el
label: لها هيئة خليفة لأخرى @ar
label: 有团体的后继 @zh-hans
sub property of: yhteisöön liittyvä yhteisö
sub property of: yhteistoimijan seuraaja
alternative label: Nachfolger @de
alternative label: efterfølger @da
alternative label: etterfølger @no
alternative label: seuraaja
alternative label: successeur @fr
alternative label: successor @ca
alternative label: successore @it
alternative label: sucesor @es
alternative label: utód: @hu
alternative label: yerine geçen @tr
alternative label: διάδοχος @el
alternative label: خليفة @ar
alternative label: 后继 @zh-hans
definition: Bir tüzel kişiyi, başka bir tüzel kişinin yerine geçen veya onu takip eden bir tüzel kişilikle ilişkilendirir @tr
definition: Correla un ente a un ente che succede o segue un altro ente. @it
definition: Hozzákapcsol egy testületet egy testülethez, amely egy másik testületet követ vagy annak utódja. @hu
definition: Liittää yhteisön yhteisöön, joka jatkaa tai seuraa toista yhteisöä.
definition: Met une collectivité en relation avec une collectivité qui succède ou fait suite à une autre collectivité. @fr
definition: Relaciona una entitat corporativa amb una entitat corporativa que succeeix o segueix una altra entitat corporativa. @ca

yhteisön perustama yhteisö
has element type: 2
instruction number: 29.5
toolkit definition: A corporate body who is initiated by a corporate body. @en
toolkit definition: Asutus, millele asutus on aluse pannud. @et
toolkit definition: Bir tüzel kişilik tarafından başlatılan bir tüzel kişilik. @tr
toolkit definition: Collectivité qui est établie par une collectivité. @fr
toolkit definition: Een corporatie die is gesticht door een corporatie. @nl
toolkit definition: Egy testület, amelynek létrehozását egy testület kezdeményezte. @hu
toolkit definition: Eine Körperschaft, die von einer anderen Körperschaft gegründet wird. @de
toolkit definition: En korporasjon som ble opprettet av en annen korporasjon. @no
toolkit definition: Ente istituito da un ente @it
toolkit definition: Entitat corporativa que és iniciada per una altra entitat corporativa. @ca
toolkit definition: Institūcija, kas ir citas institūcijas dibināta. @lv
toolkit definition: Korporation, som er igangsat af en anden korporation. @da
toolkit definition: Una entidad corporativa fundada por la otra entidad corporativa. @es
toolkit definition: Yhteisö, joka on yhteisön perustama.
toolkit definition: Ένα συλλογικό όργανο το οποίο ιδρύθηκε από κάποιο άλλο συλλογικό όργανο. @el
toolkit definition: هيئة بادرت بإنشائها هيئة. @ar
toolkit definition: 被另一个团体发起的一个团体 @zh-hans
toolkit label: Von einer Körperschaft gegründete Körperschaft @de
toolkit label: asutuse asutatud asutus @et
toolkit label: collectivité fondée d’une collectivité @fr
toolkit label: ente fondato di ente @it
toolkit label: entidad corporativa fundada @es
toolkit label: entitat corporativa fundada per una entitat corporativa @ca
toolkit label: founded corporate body of corporate body @en
toolkit label: institūcijas dibinātā institūcija @lv
toolkit label: korporasjon grunnlagt av korporasjon @no
toolkit label: korporation grundlagt af korporation @da
toolkit label: opgerichte corporatie van corporatie @nl
toolkit label: testület által alapított testület: @hu
toolkit label: tüzel kişi tarafından kurulan tüzel kişi @tr
toolkit label: yhteisön perustama yhteisö
toolkit label: ιδρυθέν συλλογικό όργανο του συλλογικού οργάνου @el
toolkit label: هيئة تأسست من هيئة @ar
toolkit label: 团体的被创办团体 @zh-hans
has subproperty: P50017
lexical alias: foundedCorporateBodyOfCorporateBody.en
status: Published
type: Property
domain: C10005
label: a pour collectivité fondée d’une collectivité @fr
label: asutuse asutatud asutus @et
label: ha come ente fondato di ente @it
label: har korporasjon grunnlagt av korporasjon @no
label: har korporation grundlagt af korporation @da
label: has founded corporate body of corporate body @en
label: hat von einer Körperschaft gegründete Körperschaft @de
label: heeft opgerichte corporatie van corporatie @nl
label: institūcijas dibinātā institūcija @lv
label: testület által alapított testület a következő: @hu
label: té com a entitat corporativa fundada per una entitat corporativa @ca
label: tüzel kişinin kurduğu tüzel kişi ile ilişkilidir @tr
label: έχει ιδρύσει συλλογικό όργανο του συλλογικού οργάνου @el
label: أسَّست هيئة لهيئة @ar
label: 有团体的被创办团体 @zh-hans
sub property of: yhteisöön liittyvä yhteisö
sub property of: yhteistoimijan perustama yhteisö
alternative label: perustanut yhteisön
definition: Bir tüzel kişiyi, bir tüzel kişilik tarafından başlatılan bir tüzel kişilikle ilişkilendirir. @tr
definition: Correla un ente a un ente istituito da un ente @it
definition: Hozzákapcsol egy testületet egy testülethez, amelynek létrehozását egy testület kezdeményezte. @hu
definition: Liittää yhteisön yhteisöön, joka on yhteisön perustama.
definition: Met une collectivité en relation avec une collectivité qui est établie par une collectivité. @fr
definition: Relaciona una entitat corporativa amb una entitat corporativa que és iniciada per una altra entitat corporativa. @ca
definition: Relateert een corporatie aan een corporatie die is gesticht door een corporatie. @nl
definition: Relaterer en korporasjon til en korporasjon som ble opprettet av en annen korporasjon. @no
definition: Relaterer en korporation til en korporation, som er igangsat af en anden korporation. @da
definition: Relates a corporate body to a corporate body who is initiated by a corporate body. @en
definition: Sasaista institūciju ar institūciju, kas ir citas institūcijas dibināta. @lv
definition: Seostab asutuse asutusega, millele asutus on aluse pannud. @et
definition: Setzt eine Körperschaft in Beziehung zu einer Körperschaft, die von einer Körperschaft gegründet wird. @de
definition: Συνδέει ένα συλλογικό όργανο με ένα συλλογικό όργανο το οποίο ιδρύθηκε από κάποιο άλλο συλλογικό όργανο. @el
definition: يربط هيئة بهيئة بادرت بإنشائها هيئة. @ar
definition: 将一个团体与被另一个团体发起的一个团体关联起来。 @zh-hans

has location of headquarters (Deprecated)
toolkit definition: A country, state, province, etc., or local place in which an organization has its headquarters. (Deprecated) @en
toolkit label: location of headquarters (Deprecated) @en
lexical alias: locationOfHeadquarters.en
status: Deprecated
type: Property
domain: C10005
definition: Relates a corporate body to a country, state, province, etc., or local place in which an organization has its headquarters. (Deprecated) @en

konferenssin numero
has element type: 6
instruction number: 11.6
toolkit definition: A designation of the sequencing of a conference, exhibition, or other formally named and convened event that gives rise to a work. @en
toolkit definition: Bir eserin ortaya çıkmasını sağlayan bir konferans, sergi veya resmi olarak adlandırılmış ve toplanmış diğer etkinliklerin sıralamasının bir tanımı. @tr
toolkit definition: Designació de la seqüència d’un congrés, una exposició o qualsevol altre esdeveniment formalment esmentat i convocat que dona origen a una obra. @ca
toolkit definition: Designazione della numerazione di una conferenza, mostra o altro evento formalmente denominato e indetto che dà origine a un'opera. @it
toolkit definition: Désignation d’un ordre séquentiel d’un congrès, d’une exposition ou d’un autre événement formellement nommé et convoqué qui donne lieu à la création d’une œuvre. @fr
toolkit definition: Een aanduiding van de volgorde van een conferentie, tentoonstelling of andere formeel benoemde en samengekomen gebeurtenis die aanleiding geeft tot een werk. @nl
toolkit definition: Egy konferencia, kiállítás vagy más hivatalosan megnevezett és összehívott esemény sorrendjének jelölése, amely egy művet eredményez. @hu
toolkit definition: Eine Bezeichnung der Abfolge einer Konferenz, Ausstellung oder einer anderen formal benannten und einberufenen Veranstaltung, aus der ein Werk hervorgeht. @de
toolkit definition: En betegnelse for nummerering av en konferanse, utstilling eller annet formelt navngitt og avholdt arrangement som gir opphav til et verk. @no
toolkit definition: Konferences, izstādes vai cita oficiāli nosaukta vai sasaukta pasākuma norises secības apzīmējums. @lv
toolkit definition: Sekvensbetegnelse for en konference, udstilling eller anden formelt navngivet og indkaldt begivenhed, som giver anledning til et værk. @da
toolkit definition: Teokselle alun antaneen konferenssin, näyttelyn tai muun nimetyn ja kokontuneen tapahtuman järjestysluku.
toolkit definition: Teosele aluse pannud konverentsi, näituse või muu vormiliselt nimetatud ja kokku kutsutud ürituse järjestuse tähistus. @et
toolkit definition: Una designación de la secuencia de una conferencia, etc., dentro de una serie de conferencias, etc. @es
toolkit definition: Ο προσδιορισμός της αλληλουχίας ενός συνεδρίου κ.λπ. σε μια σειρά συνεδρίων κ.λπ. @el
toolkit definition: تحديد تتابع مؤتمر أو معرض أو حدث آخر سُمي وعقد رسميًا وأسفر عن عمل. @ar
toolkit definition: 产生作品的会议、展览或其他正式命名并举办的活动的序列的标识 @zh-hans
toolkit label: Zählung einer Konferenz @de
toolkit label: konferans sayısı @tr
toolkit label: konferences numerācija @lv
toolkit label: konferencia sorszáma: @hu
toolkit label: konferenssin numero
toolkit label: konverentsi järjenumber @et
toolkit label: number of conference @en
toolkit label: numero di conferenza @it
toolkit label: nummer for konferanse @no
toolkit label: nummer på konference @da
toolkit label: nummer van conferentie @nl
toolkit label: numéro d’ordre d’un congrès @fr
toolkit label: número de congrés @ca
toolkit label: número de una conferencia, etc. @es
toolkit label: ordningsnummer för konferens etc. @sv
toolkit label: αριθμός συνεδρίου @el
toolkit label: له رقم مؤتمر @ar
toolkit label: 会议的届次 @zh-hans
has subproperty: P50019
lexical alias: numberOfConference.en
status: Published
type: Property
domain: C10005
label: a pour numéro d’ordre d’un congrès @fr
label: ha come numero di conferenza @it
label: har nummer for konferanse @no
label: har nummer på konference @da
label: har ordningsnummer för konferens etc. @sv
label: has number of conference @en
label: hat Zählung einer Konferenz @de
label: heeft nummer van conferentie @nl
label: konferans numarası hakkında not ile ilişkilidir @tr
label: konferences numerācija @lv
label: konferencia sorszáma a következő: @hu
label: konverentsi järjenumber @et
label: té com a número de congrés @ca
label: έχει αριθμό συνεδρίου @el
label: له رقم مؤتمر @ar
label: 有会议的届次 @zh-hans
alternative label: Zählung einer Konferenz usw. @de
alternative label: konferans sayısı vs. @tr
alternative label: konferencia sorszáma, stb. @hu
alternative label: konferenssin tms. numero
alternative label: konverentsi vms järjenumber @et
alternative label: number of conference, etc. @en
alternative label: numero di conferenza, etc. @it
alternative label: nummer for konferanse, etc. @no
alternative label: nummer på konference ect. @da
alternative label: numéro d’ordre d’un congrès, etc. @fr
alternative label: número de conferencia, etc. @es
alternative label: número de congrés, etc. @ca
alternative label: αριθμός συνεδρίου κ.λπ. @el
alternative label: رقم مؤتمر @ar
alternative label: 会议等的届次 @zh-hans
definition: Bir tüzel kişiyi, bir konferansın, serginin veya bir esere yol açan resmi olarak adlandırılmış ve toplanmış başka bir etkinliğin sıralamasının belirlenmesiyle ilişkilendirir. @tr
definition: Correla un ente a una designazione della numerazione di una conferenza, mostra o altro evento formalmente denominato e indetto che dà origine a un'opera. @it
definition: Hozzákapcsol egy testületet egy konferencia, kiállítás vagy más hivatalosan megnevezett és összehívott esemény sorrendjének jelöléséhez, amely egy művet eredményez. @hu
definition: Liittää yhteisön teokselle alun antaneen konferenssin, näyttelyn tai muun nimetyn ja kokontuneen tapahtuman järjestyslukuun.
definition: Met une collectivité en relation avec une désignation d’un ordre séquentiel d’un congrès, d’une exposition ou d’un autre événement formellement nommé et convoqué qui donne lieu à la création d’une œuvre. @fr
definition: Relaciona una entitat corporativa amb una designació de la seqüència d’un congrés, una exposició o qualsevol altre esdeveniment formalment esmentat i convocat que dona origen a una obra. @ca

yhteisön perustanut suku
has element type: 2
instruction number: 29.5
toolkit definition: A family who initiates a corporate body. @en
toolkit definition: Bir tüzel kişiyi başlatan bir aile. @tr
toolkit definition: Dzimta/ģimene, kas dibinājusi institūciju. @lv
toolkit definition: Een familie die een corporatie opricht. @nl
toolkit definition: Egy család, amely egy testület létrehozását kezdeményezi. @hu
toolkit definition: Eine Familie, die eine Körperschaft gegründet hat. @de
toolkit definition: En familie som oppretter en korporasjon. @no
toolkit definition: Famiglia che istituisce un ente. @it
toolkit definition: Familie, som igangsætter en korporation. @da
toolkit definition: Famille qui établit une collectivité. @fr
toolkit definition: Família que inicia una entitat corporativa. @ca
toolkit definition: Perekond, kes on pannud asutusele aluse. @et
toolkit definition: Suku, joka perusti yhteisön.
toolkit definition: Una familia que fundó la entidad corporativa. @es
toolkit definition: Μια οικογένεια η οποία ίδρυσε ένα συλλογικό όργανο. @el
toolkit definition: عائلة تبادر بإنشاء هيئة. @ar
toolkit definition: 发起一个团体的家族 @zh-hans
toolkit label: Gründerin/Gründer einer Körperschaft (Familie) @de
toolkit label: asutuse asutanud perekond @et
toolkit label: famiglia fondatrice di ente @it
toolkit label: familia fundadora @es
toolkit label: familie, som er grundlæggere af korporation @da
toolkit label: famille fondatrice d’une collectivité @fr
toolkit label: família fundadora d’una entitat corporativa @ca
toolkit label: founding family of corporate body @en
toolkit label: grunnleggerfamilie for korporasjon @no
toolkit label: institūcijas dibinātājs (dzimta/ģimene) @lv
toolkit label: oprichter-familie van corporatie @nl
toolkit label: testületet alapító család: @hu
toolkit label: tüzel kişinin kurucu ailesi @tr
toolkit label: yhteisön perustanut suku
toolkit label: ιδρύτρια οικογένεια του συλλογικού οργάνου @el
toolkit label: عائلة مؤسَّسة لهيئة @ar
toolkit label: 团体的创办家族 @zh-hans
has subproperty: P50020
lexical alias: foundingFamilyOfCorporateBody.en
status: Published
type: Property
domain: C10005
label: a pour famille fondatrice d’une collectivité @fr
label: asutuse asutanud perekond @et
label: ha come famiglia fondatrice di ente @it
label: har familie, som er grundlæggere af korporation @da
label: har grunnleggerfamilie for korporasjon @no
label: has founding family of corporate body @en
label: hat Gründerin/Gründer einer Körperschaft (Familie) @de
label: heeft oprichter-familie van corporatie @nl
label: institūcijas dibinātājs (dzimta/ģimene) @lv
label: testület alapító családja a következő: @hu
label: té com a família fundadora d’una entitat corporativa @ca
label: tüzel kişiyi kuran aile ile ilişkilidir @tr
label: έχει ιδρύτρια οικογένεια του συλλογικού οργάνου @el
label: لها عائلة مؤسِّسة لهيئة @ar
label: 有团体的创办家族 @zh-hans
sub property of: yhteisöön liittyvä suku
sub property of: yhteisön perustanut yhteistoimija
alternative label: Gründerfamilie @de
alternative label: alapító család: @hu
alternative label: asutaja (perekond) @et
alternative label: famiglia fondatrice @it
alternative label: familia fundadora @es
alternative label: famille fondatrice @fr
alternative label: família fundadora @ca
alternative label: founding family @en
alternative label: grunnleggerfamilie @no
alternative label: kurucu aile @tr
alternative label: perustajasuku
alternative label: stiftende familie @da
alternative label: ιδρύτρια οικογένεια @el
alternative label: عائلة مؤسِّسة @ar
alternative label: 创办家族 @zh-hans
definition: Bir tüzel kişiyi, bir tüzel kişiliğin faaliyet gösterdiği bir çalışma alanı, yetki alanı, sorumluluk alanı, yargı yetkisi vb. ile ilişkilendirir. @tr
definition: Correla un ente a una famiglia che istituisce un ente. @it
definition: Hozzákapcsol egy testületet egy családhoz, amely egy testület létrehozását kezdeményezi. @hu
definition: Liittää yhteisön sukuun, joka perusti yhteisön.
definition: Met une collectivité en relation avec une famille qui établit une collectivité. @fr
definition: Relaciona una entitat corporativa amb una família que inicia una entitat corporativa. @ca

yhteisöä sponsoroiva suku
has element type: 2
instruction number: 29.5
toolkit definition: A family who sponsors a corporate body. @en
toolkit definition: Dzimta/ģimene, kas sponsorē institūciju. @lv
toolkit definition: Een familie die een corporatie sponsort. @nl
toolkit definition: Egy család, amely egy testületet szponzorál. @hu
toolkit definition: Eine Familie, die eine Körperschaft fördert. @de
toolkit definition: En familie som er sponsor av en korporasjon. @no
toolkit definition: Famiglia che sponsorizza un ente. @it
toolkit definition: Familie, som sponsorerer en korporation. @da
toolkit definition: Famille qui parraine une collectivité. @fr
toolkit definition: Família que patrocina una entitat corporativa. @ca
toolkit definition: Perekond, kes toetab majanduslikult asutust. @et
toolkit definition: Suku, joka sponsoroi yhteisöä.
toolkit definition: Tüzel bir kişiye sponsor olan bir aile. @tr
toolkit definition: Una familia que patrocina la entidad corporativa. @es
toolkit definition: Μια οικογένεια η οποία χρηματοδοτεί ένα συλλογικό όργανο. @el
toolkit definition: عائلة ترعى هيئة. @ar
toolkit definition: 赞助一个团体的家族 @zh-hans
toolkit label: Sponsorin/Sponsor einer Körperschaft (Familie) @de
toolkit label: asutust toetav perekond @et
toolkit label: famiglia sponsorizzatrice di ente @it
toolkit label: familia patrocinadora @es
toolkit label: famille parraineuse d’une collectivité @fr
toolkit label: família patrocinadora d’una entitat corporativa @ca
toolkit label: institūcijas sponsors (dzimta/ģimene) @lv
toolkit label: sponsor-familie van corporatie @nl
toolkit label: sponsorerende familie for korporation @da
toolkit label: sponsorfamilie for korporasjon @no
toolkit label: sponsoring family of corporate body @en
toolkit label: testületet szponzoráló család: @hu
toolkit label: tüzel kişinin sponsor olan ailesi @tr
toolkit label: yhteisöä sponsoroiva suku
toolkit label: χορηγός οικογένεια του συλλογικού οργάνου @el
toolkit label: عائلة راعية لهيئة @ar
toolkit label: 团体的赞助家族 @zh-hans
has subproperty: P50021
lexical alias: sponsoringFamilyOfCorporateBody.en
status: Published
type: Property
domain: C10005
label: a pour famille parraineuse d’une collectivité @fr
label: asutust toetav perekond @et
label: ha come famiglia che sostiene un ente @it
label: har sponsorerende familie for korporation @da
label: har sponsorfamilie for korporasjon @no
label: has sponsoring family of corporate body @en
label: hat Sponsorin/Sponsor einer Körperschaft (Akteur) @de
label: heeft sponsor-familie van corporatie @nl
label: institūcijas sponsors (dzimta/ģimene) @lv
label: testület szponzoráló családja a következő: @hu
label: té com a família patrocinadora d’una entitat corporativa @ca
label: tüzel kişinin sponsoru olan aile ile ilişkilidir @tr
label: έχει χορηγό οικογένεια του συλλογικού οργάνου @el
label: لها عائلة ترعى هيئة @ar
label: 有团体的赞助家族 @zh-hans
sub property of: yhteisöön liittyvä suku
sub property of: yhteisöä sponsoroiva yhteistoimija
alternative label: Sponsorenfamilie @de
alternative label: famiglia promotrice @it
alternative label: familia patrocinadora @es
alternative label: famille commanditaire d’une collectivité @fr
alternative label: família patrocinadora @ca
alternative label: sponsor (perekond) @et
alternative label: sponsor olan aile @tr
alternative label: sponsorerende familie @da
alternative label: sponsorfamilie @no
alternative label: sponsoring family @en
alternative label: sponsoroiva suku
alternative label: szponzoráló család: @hu
alternative label: χορηγός οικογένεια @el
alternative label: أسرة راعية @ar
alternative label: 赞助家族 @zh-hans
definition: Bir tüzel kişiyi, tüzel kuruluşa sponsor olan bir aile ile ilişkilendirir. @tr
definition: Correla un ente a una famiglia che sponsorizza un ente. @it
definition: Hozzákapcsol egy testületet egy családhoz, amely egy testületet szponzorál. @hu
definition: Liittää yhteisön sukuun, joka sponsoroi yhteisöä.
definition: Met une collectivité en relation avec une famille qui parraine une collectivité. @fr
definition: Relaciona una entitat corporativa amb una família que patrocina una entitat corporativa. @ca

yhteisön toiminta-ala
has element type: 5
instruction number: 11.1
toolkit definition: A field of endeavor, area of competence, or responsibility in which a corporate body is engaged. @en
toolkit definition: Ala, jolla yhteisö toimii tai on toiminut, tai jonka asiantuntija tms. se on.
toolkit definition: Bir tüzel kişinin faaliyet gösterdiği çalışma alanı, yetki alanı, sorumluluk alanı, yargı yetkisi vb. @tr
toolkit definition: Camp d’activitat, àrea de competència o de responsabilitat al qual es dedica una entitat corporativa. @ca
toolkit definition: Campo di impegno, area di competenza, responsabilità, giurisdizione, etc., nel quale un ente è impegnato. @it
toolkit definition: Champ d’activité, domaine de compétence ou de responsabilité dans lequel une collectivité évolue. @fr
toolkit definition: Darbības joma, kurā institūcija ir iesaistīta atbilstoši tās kompetencei, atbildībai un jurisdikcijai, u.tml. @lv
toolkit definition: Een veld van inspanning, vakgebied etc. waarbij een corporatie betrokken is. @nl
toolkit definition: Egy tevékenység, szakterület, illetékességi, felelősségi, joghatósági, stb. terület, amely iránt egy testület elkötelezett. @hu
toolkit definition: Ein Tätigkeitsfeld, ein Kompetenzbereich, eine Verantwortlichkeit, eine Zuständigkeit und so weiter, in dem/der eine Körperschaft tätig ist. @de
toolkit definition: Et engasjement innen et felt, kompetanseområde, ansvarsområde, jurisdiksjon, etc. som en korporasjon er engasjert i. @no
toolkit definition: Indsats-, kompetence- eller ansvarsområde eller jurisdiktion etc., hvori en korporation virker. @da
toolkit definition: Tegevusala, eriala, vastutusala, võimkond või muu, millega asutus tegeleb või on tegelnud. @et
toolkit definition: Un campo de negocios al que la entidad corporativa está dedicada y/o su área de competencia, responsabilidad, jurisdicción, etc. @es
toolkit definition: Ένας επιχειρηματικός τομέας στον οποίο το συλλογικό όργανο δραστηριοποιείται ή ένας τομέας αρμοδιότητας, ευθύνης, δικαιοδοσίας κ.λπ. ενός συλλογικού οργάνου. @el
toolkit definition: مجالات عمل الهيئة واختصاصها ومسئوليتها وولايتها القضائية، إلخ. @ar
toolkit definition: 一个团体的努力领域、能力范围或担负责任 @zh-hans
toolkit label: Betätigungsfeld einer Körperschaft @de
toolkit label: asutuse tegevusala @et
toolkit label: camp d’activitat d’una entitat corporativa @ca
toolkit label: campo de actividad de la entidad corporativa @es
toolkit label: campo di attività di ente @it
toolkit label: domaine d’activité d’une collectivité @fr
toolkit label: field of activity of corporate body @en
toolkit label: institūcijas darbības joma @lv
toolkit label: testület tevékenységi köre: @hu
toolkit label: tüzel kişinin faaliyet alanı @tr
toolkit label: veld van activiteit van corporatie @nl
toolkit label: virkefelt for korporation @da
toolkit label: virksomhetsområde for korporasjon @no
toolkit label: yhteisön toiminta-ala
toolkit label: πεδίο δραστηριοποίησης του συλλογικού οργάνου @el
toolkit label: مجال نشاط لهيئة @ar
toolkit label: 团体的活动领域 @zh-hans
has subproperty: P50022
lexical alias: fieldOfActivityOfCorporateBody.en
status: Published
type: Property
domain: C10005
label: a pour domaine d’activité d’une collectivité @fr
label: asutuse tegevusala @et
label: ha come campo di attività di ente @it
label: har virkefelt for korporation @da
label: har virksomhetsområde for korporasjon @no
label: has field of activity of corporate body @en
label: hat Betätigungsfeld einer Körperschaft @de
label: heeft veld van activiteit van corporatie @nl
label: institūcijas darbības joma @lv
label: testület tevékenységi köre a következő: @hu
label: té com a camp d’activitat d’una entitat corporativa @ca
label: tüzel kişinin faaliyet alanı ile ilişkilidir @tr
label: έχει πεδίο δραστηριοποίησης του συλλογικού οργάνου @el
label: لها مجال نشاط هيئة @ar
label: 有团体的活动领域 @zh-hans
sub property of: yhteistoimijan toiminta-ala
definition: Bir tüzel kişiyi, bir tüzel kişinin faaliyet gösterdiği bir çalışma alanı, yetki alanı, sorumluluk alanı, yargı yetkisi vb. ile ilişkilendirir. @tr
definition: Correla un ente a un campo di impegno, area di competenza, responsabilità, giurisdizione, etc., nel quale un ente è impegnato. @it
definition: Hozzákapcsol egy testületet egy tevékenységhez, szakterülethez, illetékességi, felelősségi, joghatósági, stb. területhez, amely iránt egy testület elkötelezett. @hu
definition: Liittää yhteisön alaan, jolla yhteisö toimii tai on toiminut, tai jonka asiantuntija tms. se on.
definition: Met une collectivité en relation avec un champ d’activité, domaine de compétence ou de responsabilité dans lequel une collectivité évolue. @fr
definition: Relaciona una entitat corporativa amb un camp d’activitat, àrea de competència o de responsabilitat al qual es dedica una entitat corporativa. @ca
definition: Relateert een corporatie aan een veld van inspanning, vakgebied etc. waarbij een corporatie betrokken is. @nl
definition: Relaterer en korporasjon til et engasjement innen et felt, kompetanseområde, ansvarsområde, jurisdiksjon, etc. som en korporasjon er engasjert i. @no
definition: Relaterer en korporation til et indsats-, kompetence- eller ansvarsområde eller jurisdiktion etc., hvori en korporation virker. @da
definition: Relates a corporate body to a field of endeavor, area of competence, or responsibility in which a corporate body is engaged. @en
definition: Sasaista institūciju ar darbības jomu, kurā institūcija ir iesaistīta atbilstoši tās kompetencei, atbildībai un jurisdikcijai, u.tml. @lv
definition: Seostab asutuse tegevusala, eriala, vastutusala, võimkonna või muuga, millega asutus tegeleb või on tegelnud. @et
definition: Setzt eine Körperschaft in Beziehung zu einem Tätigkeitsfeld, einem Kompetenzbereich, einer Verantwortlichkeit, einer Zuständigkeit und so weiter, in dem/der eine Körperschaft tätig ist. @de
definition: Συνδέει ένα συλλογικό όργανο με έναν επιχειρηματικό τομέα στον οποίο το συλλογικό όργανο δραστηριοποιείται ή έναν τομέα αρμοδιότητας, ευθύνης, δικαιοδοσίας κ.λπ. με ένα συλλογικό όργανο. @el
definition: يربط هيئة بمجالات العمل الذي تمارسه الهيئة واختصاصها ومسئوليتها وولايتها القضائية، إلخ. @ar
definition: 将一个团体与一个团体的努力领域、能力范围或担负责任关联起来。 @zh-hans

yhteisön käyttämä kieli
has element type: 5
instruction number: 11.8
toolkit definition: A language that is used by a corporate body in its communications. @en
toolkit definition: Bir tüzel kişinin iletişiminde kullandığı dil. @tr
toolkit definition: Een taal die gebruikt wordt door een corporatie in haar communicatie. @nl
toolkit definition: Egy nyelv, amelyet egy testület saját kommunikációjában használ. @hu
toolkit definition: Eine Sprache, die eine Körperschaft bei ihrer Kommunikation verwendet. @de
toolkit definition: Et språk som brukes av en korporasjon i sin kommunikasjon. @no
toolkit definition: Keel, mida asutus suhtluses kasutab. @et
toolkit definition: Kieli, jota yhteisö käyttää viestinnässään.
toolkit definition: Langue qu’une collectivité utilise pour sa communication. @fr
toolkit definition: Lengua o lenguas que usa la entidad corporativa en sus comunicaciones @es
toolkit definition: Lingua utilizzata da un ente nelle proprie comunicazioni. @it
toolkit definition: Llengua que és usada per una entitat corporativa en les seves comunicacions. @ca
toolkit definition: Sprog, som en korporation anvender i sin kommunikation. @da
toolkit definition: Valoda, ko institūcija lieto saziņā. @lv
toolkit definition: Μια γλώσσα που χρησιμοποιεί το συλλογικό όργανο στις επικοινωνίες του. @el
toolkit definition: اللغة التي تستخدمها هيئة في اتصالاتها. @ar
toolkit definition: 一个团体在交流中所用的语言 @zh-hans
toolkit label: Sprache einer Körperschaft @de
toolkit label: asutuse keel @et
toolkit label: institūcijas valoda @lv
toolkit label: language of corporate body @en
toolkit label: langue d’une collectivité @fr
toolkit label: lengua de la entidad corporativa @es
toolkit label: lingua di ente @it
toolkit label: llengua d’una entitat corporativa @ca
toolkit label: sprog for korporation @da
toolkit label: språk for korporasjon @no
toolkit label: taal van corporatie @nl
toolkit label: testületi nyelv: @hu
toolkit label: tüzel kişisnin dili @tr
toolkit label: yhteisön käyttämä kieli
toolkit label: γλώσσα του συλλογικού οργάνου @el
toolkit label: لغة هيئة @ar
toolkit label: 团体的语言 @zh-hans
has subproperty: P50023
lexical alias: languageOfCorporateBody.en
status: Published
type: Property
domain: C10005
label: a pour langue d’une collectivité @fr
label: asutuse keel @et
label: ha come lingua di ente @it
label: har sprog for korporation @da
label: har språk for korporasjon @no
label: has language of corporate body @en
label: hat Sprache einer Körperschaft @de
label: heeft taal van corporatie @nl
label: institūcijas valoda @lv
label: testület nyelve a következő: @hu
label: té com a llengua d’una entitat corporativa @ca
label: tüzel kişinin dili ile ilişkilidir @tr
label: έχει γλώσσα του συλλογικού οργάνου @el
label: لها لغة هيئة @ar
label: 有团体的语言 @zh-hans
sub property of: yhteistoimijan käyttämä kieli
definition: Bir tüzel kişiyi, tüzel kişinin iletişiminde kullandığı bir dille ilişkilendirir. @tr
definition: Correla un ente a una lingua utilizzata da un ente nelle proprie comunicazioni. @it
definition: Hozzákapcsol egy testületet egy nyelvhez, amelyet egy testület saját kommunikációjában használ. @hu
definition: Liittää yhteisön kieleen, jota yhteisö käyttää viestinnässään.
definition: Met une collectivité en relation avec une langue qu’une collectivité utilise pour sa communication. @fr
definition: Relaciona una entitat corporativa amb una llengua que és usada per una entitat corporativa en les seves comunicacions. @ca
definition: Relateert een corporatie aan een taal die gebruikt wordt door een corporatie in haar communicatie. @nl
definition: Relaterer en korporasjon til et språk som brukes av en korporasjon i sin kommunikasjon. @no
definition: Relaterer en korporation til et sprog, som en korporation anvender i sin kommunikation. @da
definition: Relates a corporate body to a language that is used by a corporate body in its communications. @en
definition: Sasaista institūciju ar valodu, ko institūcija lieto saziņā. @lv
definition: Seostab asutuse keelega, mida asutus suhtluses kasutab. @et
definition: Setzt eine Körperschaft in Beziehung zu einer Sprache, die eine Körperschaft bei ihrer Kommunikation verwendet. @de
definition: Συνδέει ένα συλλογικό όργανο με μια γλώσσα που χρησιμοποιεί το συλλογικό όργανο στις επικοινωνίες του. @el
definition: يربط هيئة بلغة تستخدمها هيئة في اتصالاتها. @ar
definition: 将一个团体与一个团体在交流中所用的语言关联起来。 @zh-hans

konferenssin paikka
has element type: 3
instruction number: 11.3.2
toolkit definition: A place where a conference, exhibition, or other formally named and convened event that gives rise to a work is held. @en
toolkit definition: Bir eserin ortaya çıkmasını sağlayan konferans, sergi veya resmi olarak adlandırılmış ve toplanmış diğer etkinliklerin düzenlendiği yer. @tr
toolkit definition: Een plaats waar een conferentie, tentoonstelling of andere formeel benoemde en samengekomen gebeurtenis is gehouden die aanleiding geeft tot een werk. @nl
toolkit definition: Egy hely, ahol egy mű létrejöttét eredményező konferenciát, kiállítást vagy más hivatalos névvel rendelkező és szervezett eseményt megtartanak. @hu
toolkit definition: Ein Geografikum, in dem eine Konferenz, eine Ausstellung oder eine andere formal benannte und einberufene Veranstaltung stattfindet, aus der ein Werk hervorgeht. @de
toolkit definition: Et sted hvor en konferanse, utstilling eller annet formelt navngitt og gjennomført arrangement som gir opphav til et verk er avholdt. @no
toolkit definition: Koht, kus on toimunud konverents, näitus või muu vormiliselt nimetatud ja kokku kutsutud üritus, mis paneb aluse teosele. @et
toolkit definition: Lieu où se tient un congrès, une exposition ou un autre événement formellement nommé et convoqué qui donne lieu à la création d’une œuvre. @fr
toolkit definition: Lloc on se celebra un congrés, una exposició o qualsevol altre esdeveniment formalment esmentat i convocat que dona origen a una obra. @ca
toolkit definition: Luogo dove si è tenuta una conferenza, mostra o altro evento formalmente denominato e indetto che dà origine a un'opera. @it
toolkit definition: Paikka, jossa teokselle alun antanut konferenssi, näyttely tai muu nimetty ja kokoontunut tapahtuma järjestettiin.
toolkit definition: Sted, hvor der afholdes en konference, udstilling eller anden formelt navngivet og indkaldt begivenhed, som giver anledning til et værk. @da
toolkit definition: Una localidad en la que se se realizó una conferencia, congreso, reunión, exposición, feria, festival, etc. @es
toolkit definition: Vieta, kur notiek konference, izstāde vai cits formāli nosaukts un organizēts pasākums. @lv
toolkit definition: Ένας τόπος ή τόποι στους οποίους ένα συνέδριο, συνάντηση, έκθεση, φεστιβάλ κ.λπ. διεξήχθησαν. @el
toolkit definition: مكان إقامة مؤتمر، أو معرض، أو أي فعالية أخرى تقررت وعُقدت رسميًا وأسفرت عن عمل. @ar
toolkit definition: 产生作品的一次会议、展览或其他正式命名并举办的活动的地点 @zh-hans
toolkit label: Ort einer Konferenz @de
toolkit label: konferans yeri @tr
toolkit label: konferenciahelyszín: @hu
toolkit label: konferensort @sv
toolkit label: konferenssin paikka
toolkit label: konverentsi toimumiskoht @et
toolkit label: lieu d’un congrès @fr
toolkit label: lloc de congrés @ca
toolkit label: lugar de la conferencia, etc. @es
toolkit label: luogo di conferenza @it
toolkit label: pasākuma norises vieta @lv
toolkit label: plaats van conferentie @nl
toolkit label: place of conference @en
toolkit label: sted for konferanse @no
toolkit label: sted for konference @da
toolkit label: τόπος του συνεδρίου @el
toolkit label: مكان مؤتمر @ar
toolkit label: 会议的地点 @zh-hans
has subproperty: P50024
lexical alias: placeOfConference.en
status: Published
type: Property
domain: C10005
label: a pour lieu d’un congrès @fr
label: ha come luogo di conferenza @it
label: har konferensort @sv
label: har sted for konferanse @no
label: har sted for konference @da
label: has place of conference @en
label: hat Ort einer Konferenz @de
label: heeft plaats van conferentie @nl
label: konferans yeri ile ilişkilidir @tr
label: konferenciahelyszíne a következő: @hu
label: konverentsi toimumiskoht @et
label: pasākuma norises vieta @lv
label: té com a lloc de congrés @ca
label: έχει τόπο του συνεδρίου @el
label: لديها مكان لعقد مؤتمر @ar
label: 有会议的地点 @zh-hans
sub property of: yhteisöön liittyvä paikka
alternative label: Ort einer Konferenz usw. @de
alternative label: emplacement d’un congrès, etc. @fr
alternative label: konferans konumu vs. @tr
alternative label: konferencia helye, stb. @hu
alternative label: konferenssin tms. paikka
alternative label: konverentsi vms asukoht @et
alternative label: localització de congrés, etc. @ca
alternative label: location of conference, etc. @en
alternative label: lokation for konference etc. @da
alternative label: luogo di una conferenza, etc. @it
alternative label: møtested for konferanse etc. @no
alternative label: ubicación de conferencia, etc. @es
alternative label: τόπος του συνεδρίου κ.λπ. @el
alternative label: مكان مؤتمر، الخ @ar
alternative label: 会议等的位置 @zh-hans
definition: Bir tüzel kişiyi, bir eserin ortaya çıkmasına sebep olan bir konferans, sergi veya resmi olarak adlandırılmış ve toplanmış diğer bir etkinliğin düzenlendiği bir yerle ilişkilendirir. @tr
definition: Correla un ente a un luogo dove si è tenuta una conferenza, mostra o altro evento formalmente denominato e indetto che dà origine a un'opera. @it
definition: Hozzákapcsol testületet egy helyhez, ahol egy mű létrejöttét eredményező konferenciát, kiállítást vagy más hivatalos névvel rendelkező és szervezett eseményt megtartanak. @hu
definition: Liittää yhteisön paikkaan, jossa teokselle alun antanut konferenssi, näyttely tai muu nimetty ja kokoontunut tapahtuma järjestettiin.
definition: Met une collectivité en relation avec un lieu où se tient un congrès, une exposition ou un autre événement formellement nommé et convoqué qui donne lieu à la création d’une œuvre. @fr

yhteisön varianttinimi
has element type: 3
instruction number: 11.2.3
toolkit definition: A nomen that is a name of corporate body that is not selected for preference in a specific application or context. @en
toolkit definition: Asutuse nimi, mis kindlas rakenduses või kontekstis ei ole valitud eelistatuks. @et
toolkit definition: Belirli bir uygulama veya bağlamda tercih için seçilmemiş bir tüzel kişilik ismidir. @tr
toolkit definition: Een nomen dat is een naam van corporatie die niet de voorkeur heeft gekregen in een specifieke applicatie of context. @nl
toolkit definition: Egy nomen, egy testület neve, amelyet egy bizonyos alkalmazásban vagy kontextusban nem részesítenek előnyben. @hu
toolkit definition: Ein Name einer Körperschaft, der in einer bestimmten Anwendung oder in einem bestimmten Kontext nicht als Vorzugsform bestimmt wird. @de
toolkit definition: Et navn på korporasjon som ikke er valgt som preferanse i en bestemt applikasjon eller kontekst. @no
toolkit definition: Institūcijas vārds/nosaukums, kurš nav izvēlēts kā prioritārs noteiktā lietojumprogrammā vai kontekstā. @lv
toolkit definition: Nome di un ente non scelto come preferito in una specifica applicazione o contesto. @it
toolkit definition: Nomen que és un nom d’una entitat corporativa que no se selecciona com a preferent en una aplicació o un context específic. @ca
toolkit definition: Nomen qui est un nom de collectivité ne faisant pas l’objet d’un choix privilégié dans une application ou un contexte spécifiques. @fr
toolkit definition: Nomen, joka on yhteisön nimi, jota ei ole valittu yhteisön ensisijaiseksi nimeksi tietyssä sovelluksessa tai kontekstissa.
toolkit definition: Nomen, som er et navn på korporation, som ikke er valgt som foretrukken i en specifik applikation eller kontekst. @da
toolkit definition: Un nombre o una forma de un nombre mediante el cual se conoce a una entidad corporativa que difiere del nombre o la forma del nombre escogido como el nombre preferido. @es
toolkit definition: Ένα όνομα ή μια μορφή ονόματος με την οποία ένα συλλογικό όργανο είναι γνωστό, η οποία διαφέρει από το όνομα ή τη μορφή ονόματος που έχει επιλεγεί ως το προτιμώμενο όνομα. @el
toolkit definition: يربط هيئة باسم هيئة لم يُختر كاسم مفضل في تطبيق أو في سياق محدد. @ar
toolkit definition: 一个作为团体名称并不在特定应用或语境下优先选用的命名 @zh-hans
toolkit label: Abweichender Name einer Körperschaft @de
toolkit label: asutuse variantnimi @et
toolkit label: institūcijas cits vārds/nosaukums @lv
toolkit label: nome variante di ente @it
toolkit label: testületi névváltozat: @hu
toolkit label: tüzel kişinin alternatif ismi @tr
toolkit label: variant af navn på korporation @da
toolkit label: variant de nom d’entitat corporativa @ca
toolkit label: variant naam van corporatie @nl
toolkit label: variant name of corporate body @en
toolkit label: variante de nom de collectivité @fr
toolkit label: variante del nombre de la entidad corporativa @es
toolkit label: variantform av korporasjonsnavn @no
toolkit label: variantnamn för institutionen @sv
toolkit label: yhteisön varianttinimi
toolkit label: εναλλακτικό όνομα του συλλογικού οργάνου @el
toolkit label: اسم هيئة مختلف @ar
toolkit label: 团体的变异名称 @zh-hans
has subproperty: P50025
lexical alias: variantNameOfCorporateBody.en
status: Published
type: Property
domain: C10005
label: a pour variante de nom de collectivité @fr
label: asutuse variantnimi @et
label: ha come nome variante di ente @it
label: har variant af navn på korporation @da
label: har variantform av korporasjonsnavn @no
label: har variantnamn för institutionen @sv
label: has variant name of corporate body @en
label: hat abweichenden Namen einer Körperschaft @de
label: heeft variant naam van corporatie @nl
label: institūcijas cits vārds/nosaukums @lv
label: testület névváltozata a következő: @hu
label: té com a variant de nom d’entitat corporativa @ca
label: tüzel kişinin alternatif ismi ile ilişkilidir @tr
label: έχει εναλλακτικό όνομα του συλλογικού οργάνου @el
label: لها اسم هيئة مختلف @ar
label: 有团体的变异名称 @zh-hans
sub property of: yhteisön nimi
sub property of: yhteistoimijan varianttinimi
alternative label: -
alternative label: Abweichender Name für eine Körperschaft @de
alternative label: testületi névvariáns: @hu
alternative label: tüzel kişi için alternatif isim @tr
alternative label: variant name for corporate body @en
alternative label: variante de nombre para organismo corporativo @es
alternative label: variantnavn for korporation @da
alternative label: اسم هيئة مختلف @ar
alternative label: 给团体的变异名称 @zh-hans
definition: Bir tüzel kişiyi, belirli bir uygulama veya bağlamda kullanım için tercih edilmeyen bir tüzel kişinin adı olan bir isimle ilişkilendirir. @tr
definition: Correla un ente a un nome di un ente non scelto come preferito in una specifica applicazione o contesto, @it
definition: Hozzákapcsol egy testületet egy nomenhez, egy testület nevéhez, amelyet egy bizonyos alkalmazásban vagy kontextusban nem részesítenek előnyben. @hu
definition: Liittää yhteisön nomeniin, joka on nimi, jota ei ole valittu yhteisön ensisijaiseksi nimeksi tietyssä sovelluksessa tai kontekstissa.
definition: Met une collectivité en relation avec un nomen qui est un nom de collectivité ne faisant pas l’objet d’un choix privilégié dans une application ou un contexte spécifiques. @fr
definition: Relaciona una entitat corporativa amb un nomen que és un nom d’una entitat corporativa que no se selecciona com a preferent en una aplicació o un context específic. @ca
definition: Relateert een corporatie aan een nomen dat is een naam van corporatie die niet de voorkeur heeft gekregen in een specifieke applicatie of context. @nl
definition: Relaterer en korporasjon til et navn på korporasjon som ikke er valgt som preferanse i en bestemt applikasjon eller kontekst. @no
definition: Relaterer en korporation til et navn på korporation, som ikke er valgt som foretrukken i en specifik applikation eller kontekst. @da
definition: Relates a corporate body to a nomen that is a name of corporate body that is not selected for preference in a specific application or context. @en

työntekijä
has element type: 2
instruction number: 29.5
toolkit definition: A person who is employed by a corporate body. @en
toolkit definition: Bir tüzel kişi altında çalışan bir kişi @tr
toolkit definition: Een persoon die in dienst is bij een corporatie. @nl
toolkit definition: Egy személy, akit egy testület alkalmaz. @hu
toolkit definition: Eine Person, die bei einer Körperschaft beschäftigt ist. @de
toolkit definition: En person som er ansatt i en korporasjon. @no
toolkit definition: Henkilö, joka on työntekijänä yhteisössä.
toolkit definition: Isik, kelle asutus on tööle palganud. @et
toolkit definition: Person, som er ansat hos en korporation. @da
toolkit definition: Persona che è impiegata presso un ente @it
toolkit definition: Persona que és empleada per una entitat corporativa. @ca
toolkit definition: Persona, kuru nodarbina institūcija. @lv
toolkit definition: Personne qui est employée par une collectivité. @fr
toolkit definition: Una persona empleada por la entidad corporativa. @es
toolkit definition: Ένα φυσικό πρόσωπο που απασχολείται από ένα συλλογικό όργανο. @el
toolkit definition: شخص توظفه هيئة. @ar
toolkit definition: 被一个团体雇用的一个个人 @zh-hans
toolkit label: Arbeitnehmerin/Arbeitnehmer @de
toolkit label: alkalmazott: @hu
toolkit label: ansat @da
toolkit label: ansatt @no
toolkit label: darbinieks @lv
toolkit label: empleado @es
toolkit label: empleat @ca
toolkit label: employee @en
toolkit label: employé @fr
toolkit label: impiegato @it
toolkit label: työntekijä
toolkit label: töötaja @et
toolkit label: werknemer @nl
toolkit label: çalışan @tr
toolkit label: εργαζόμενος @el
toolkit label: موظف @ar
toolkit label: 雇员 @zh-hans
has subproperty: P50026
lexical alias: employee.en
status: Published
type: Property
domain: C10005
label: a pour employé @fr
label: alkalmazottja a következő: @hu
label: darbinieks @lv
label: ha come impiegato @it
label: har ansat @da
label: har ansatt @no
label: has employee @en
label: hat Arbeitnehmerin/Arbeitnehmer @de
label: heeft werknemer @nl
label: té com a empleat @ca
label: töötaja @et
label: çalışan ile ilişkilidir @tr
label: έχει εργαζόμενο @el
label: لها موظف @ar
label: 有雇员 @zh-hans
sub property of: yhteisön henkilöjäsen
definition: Bir tüzel kişiyi, bir tüzel kişiliğin altında çalışan bir kişi ile ilişkilendirir. @tr
definition: Correla un ente a una persona che è impiegata presso un ente. @it
definition: Hozzákapcsol egy testületet egy személyhez, akit egy testület alkalmaz. @hu
definition: Liittää yhteisön henkilöön, joka on työntekijänä yhteisössä.
definition: Met une collectivité en relation avec une personne qui est employée par une collectivité. @fr
definition: Relaciona una entitat corporativa amb una persona que és empleada per una entitat corporativa. @ca
definition: Relateert een corporatie aan een persoon die in dienst is bij een corporatie. @nl
definition: Relaterer en korporasjon til en person som er ansatt i en korporasjon. @no
definition: Relaterer en korporation til en person, som er ansat hos en korporation. @da
definition: Relates a corporate body to a person who is employed by a corporate body. @en
definition: Sasaista institūciju ar personu, kuru nodarbina institūcija. @lv
definition: Seostab asutuse isikuga, kelle asutus on tööle palganud. @et
definition: Setzt eine Körperschaft in Beziehung zu einer Person, die bei einer Körperschaft beschäftigt ist. @de
definition: Συνδέει ένα συλλογικό όργανο με ένα φυσικό πρόσωπο το οποίο απασχολείται από το συλλογικό όργανο. @el
definition: يربط هيئة بشخص يعمل موظفا لدى هيئة. @ar
definition: 将一个团体与被一个团体雇用的一个个人关联起来。 @zh-hans

toimihenkilö
has element type: 2
instruction number: 29.5
toolkit definition: A person who holds an office in a corporate body. @en
toolkit definition: Een persoon die een functie beoefent binnen een corporatie. @nl
toolkit definition: Egy személy, aki egy testületben hivatalt visel. @hu
toolkit definition: Eine Person, die ein Amt in einer Körperschaft innehat. @de
toolkit definition: En person som har en ledende stilling i en korporasjon. @no
toolkit definition: Henkilö, jolla on toimi tai virka yhteisössä.
toolkit definition: Isik, kes peab asutuses ametit. @et
toolkit definition: Person, som har et embede i en korporation. @da
toolkit definition: Persona che ha una carica presso un ente. @it
toolkit definition: Persona que té un càrrec en una entitat corporativa. @ca
toolkit definition: Persona, kura ieņem amatu institūcijā. @lv
toolkit definition: Personne qui exerce une fonction de responsabilité au sein d’une collectivité. @fr
toolkit definition: Tüzel bir kuruluşta ofiste görev yapan bir kişi @tr
toolkit definition: Una persona que tiene un cargo en la entidad corporativa. @es
toolkit definition: Ένα φυσικό πρόσωπο που κατέχει μια θέση σε ένα συλλογικό όργανο. @el
toolkit definition: شخص يشغل منصبا في هيئة. @ar
toolkit definition: 在一个团体任职的一个个人 @zh-hans
toolkit label: Leitende Angestellte/Leitender Angestellter @de
toolkit label: amatpersona @lv
toolkit label: ametnik @et
toolkit label: directiu @ca
toolkit label: dirigeant @fr
toolkit label: dirigente @it
toolkit label: embedsmand @da
toolkit label: funcionario @es
toolkit label: functionaris @nl
toolkit label: görevli @tr
toolkit label: leder @no
toolkit label: officer @en
toolkit label: tisztviselő: @hu
toolkit label: toimihenkilö
toolkit label: υπάλληλος @el
toolkit label: مسئول @ar
toolkit label: 任职者 @zh-hans
has subproperty: pääjohtaja
has subproperty: edunvalvoja
has subproperty: P50027
lexical alias: officer.en
status: Published
type: Property
domain: C10005
label: a pour dirigeant @fr
label: amatpersona @lv
label: ametnik @et
label: ha come dirigente @it
label: har embedsmand @da
label: har leder @no
label: has officer @en
label: hat leitende Angestellte/leitenden Angestellten @de
label: heeft functionaris @nl
label: tisztviselője a következő: @hu
label: té com a directiu @ca
label: yetkili ile ilişkilidir @tr
label: έχει υπάλληλο @el
label: لها مسؤول @ar
label: 有任职者 @zh-hans
sub property of: yhteisöön liittyvä henkilö
alternative label: virkamies
definition: Bir tüzel kişiyi, tüzel bir kişinin ofisi olan bir kişi ile ilişkilendirir @tr
definition: Correla un ente a una persona che ha una carica presso un ente. @it
definition: Hozzákapcsol egy testületet egy személyhez, aki egy testületben hivatalt visel. @hu
definition: Liittää yhteisön henkilöön, jolla on toimi tai virka yhteisössä.
definition: Met une collectivité en relation avec une personne qui exerce une fonction de responsabilité au sein d’une collectivité. @fr
definition: Relaciona una entitat corporativa amb una persona que té un càrrec en una entitat corporativa. @ca
definition: Relateert een corporatie aan een persoon die een functie beoefent binnen een corporatie. @nl
definition: Relaterer en korporasjon til en person som har en ledende stilling i en korporasjon. @no
definition: Relaterer en korporation til en person, som har et embede i en korporation. @da
definition: Relates a corporate body to a person who holds an office in a corporate body. @en
definition: Sasaista institūciju ar personu, kura ieņem amatu institūcijā. @lv
definition: Seostab asutuse isikuga, kes peab asutuses ametit. @et
definition: Setzt eine Körperschaft in Beziehung zu einer Person, die ein Amt in einer Körperschaft innehat. @de
definition: Συνδέει ένα συλλογικό όργανο με ένα φυσικό πρόσωπο το οποίο κατέχει μία θέση σε ένα συλλογικό όργανο. @el
definition: يربط هيئة بشخص يشغل منصبا في هيئة. @ar
definition: 将一个团体与在一个团体任职的一个个人关联起来。 @zh-hans

yhteisöä sponsoroiva henkilö
has element type: 2
instruction number: 29.5
toolkit definition: A person who sponsors a corporate body. @en
toolkit definition: Een persoon die een corporatie sponsort. @nl
toolkit definition: Egy személy, aki egy testületet szponzorál. @hu
toolkit definition: Eine Person, die eine Körperschaft finanziell unterstützt. @de
toolkit definition: En person som er sponsor for en korporasjon. @no
toolkit definition: Henkilö, joka rahoittaa tai tukee yhteisöä.
toolkit definition: Isik, kes toetab majanduslikult asutust. @et
toolkit definition: Person, som sponsorerer en korporation. @da
toolkit definition: Persona che sostiene un ente @it
toolkit definition: Persona que patrocina una entitat corporativa. @ca
toolkit definition: Persona, kura sponsorē institūciju. @lv
toolkit definition: Personne qui parraine une collectivité. @fr
toolkit definition: Tüzel bir kuruluşa sponsorluk yapan bir kişi @tr
toolkit definition: Una persona que patrocina la entidad corporativa @es
toolkit definition: Ένα φυσικό πρόσωπο που χρηματοδοτεί ένα συλλογικό όργανο. @el
toolkit definition: شخص يرعى هيئة. @ar
toolkit definition: 赞助一个团体的一个个人 @zh-hans
toolkit label: Sponsorin/Sponsor einer Körperschaft (Person) @de
toolkit label: asutust toetav isik @et
toolkit label: institūcijas sponsors (persona) @lv
toolkit label: patrocinador @es
toolkit label: person, som er sponsor for korporation @da
toolkit label: persona patrocinadora d’una entitat corporativa @ca
toolkit label: personne parraineuse d’une collectivité @fr
toolkit label: sponsor for korporasjon (person) @no
toolkit label: sponsor persona di ente @it
toolkit label: sponsor-persoon van corporatie @nl
toolkit label: sponsoring person of corporate body @en
toolkit label: testületet szponzoráló személy: @hu
toolkit label: tüzel kişinin sponsor olan kişisi @tr
toolkit label: yhteisöä sponsoroiva henkilö
toolkit label: χορηγός φυσικό πρόσωπο του συλλογικού οργάνου @el
toolkit label: شخص راعِ لهيئة @ar
toolkit label: 团体的赞助个人 @zh-hans
has subproperty: P50028
lexical alias: sponsoringPersonOfCorporateBody.en
status: Published
type: Property
domain: C10005
label: a pour personne parraineuse d’une collectivité @fr
label: asutust toetav isik @et
label: ha come sponsor persona di ente @it
label: har person, som er sponsor for korporation @da
label: har sponsor for korporasjon (person) @no
label: has sponsoring person of corporate body @en
label: hat Sponsorin/Sponsor einer Körperschaft (Person) @de
label: heeft sponsor-persoon van corporatie @nl
label: institūcijas sponsors (persona) @lv
label: testület szponzoráló személye a következő: @hu
label: té com a persona patrocinadora d’una entitat corporativa @ca
label: tüzel kişinin sponsoru olan kişi ile ilişkilidir @tr
label: έχει χορηγό φυσικό πρόσωπο του συλλογικού οργάνου @el
label: لها شخص راعٍ لهيئة @ar
label: 有团体的赞助个人 @zh-hans
sub property of: yhteisöön liittyvä henkilö
sub property of: yhteisöä sponsoroiva toimija
alternative label: Person als Sponsor @de
alternative label: patrocinador @ca
alternative label: personne commanditaire d’une collectivité @fr
alternative label: sostenitore @it
alternative label: sponsor @da
alternative label: sponsor (isik) @et
alternative label: sponsori
alternative label: szponzor: @hu
alternative label: χορηγός @el
alternative label: راع @ar
alternative label: 赞助人 @zh-hans
definition: Bir tüzel kişiyi, tüzel kişiliğe sponsor olan bir kişi ile ilişkilendirir @tr
definition: Correla un ente a una persona che sostiene un ente. @it
definition: Hozzákapcsol egy testületet egy személyhez, aki egy testületet szponzorál. @hu
definition: Liittää yhteisön henkilöön, joka rahoittaa tai tukee yhteisöä.
definition: Met une collectivité en relation avec une personne qui parraine une collectivité. @fr
definition: Relaciona una entitat corporativa amb una persona que patrocina una entitat corporativa. @ca
definition: Relateert een corporatie aan een persoon die een corporatie sponsort. @nl
definition: Relaterer en korporasjon til en person som er sponsor for en korporasjon. @no
definition: Relaterer en korporation til en person, som sponsorerer en korporation. @da
definition: Relates a corporate body to a person who sponsors a corporate body. @en

yhteisön perustanut henkilö
has element type: 2
instruction number: 29.5
toolkit definition: A person who initiates a corporate body. @en
toolkit definition: Bir tüzel kişiliği başlatan kişi. @tr
toolkit definition: Een persoon die een corporatie opricht. @nl
toolkit definition: Egy személy, aki kezdeményezi egy testület létrehozását. @hu
toolkit definition: Eine Person, die eine Körperschaft gründet. @de
toolkit definition: En person som grunnla en korporasjon. @no
toolkit definition: Henkilö, joka perusti yhteisön.
toolkit definition: Isik, kes on pannud asutusele aluse. @et
toolkit definition: Person, som igangsætter en korporation. @da
toolkit definition: Persona che istituisce un ente. @it
toolkit definition: Persona que inicia una entitat corporativa. @ca
toolkit definition: Persona, kura dibinājusi institūciju. @lv
toolkit definition: Personne qui établit une collectivité. @fr
toolkit definition: Una persona que fundó la entidad corporativa. @es
toolkit definition: Ένα φυσικό πρόσωπο που εκκινεί ένα συλλογικό όργανο. @el
toolkit definition: شخص يشرع في إنشاء هيئة. @ar
toolkit definition: 发起一个团体的一个个人 @zh-hans
toolkit label: Gründerin/Gründer einer Körperschaft (Person) @de
toolkit label: asutuse asutanud isik @et
toolkit label: fondatore persona di ente @it
toolkit label: founding person of corporate body @en
toolkit label: fundador @es
toolkit label: grunnlegger for korporasjon (person) @no
toolkit label: institūcijas dibinātājs (persona) @lv
toolkit label: oprichter-persoon van corporatie @nl
toolkit label: person, som er grundlægger af korporation @da
toolkit label: persona fundadora d’una entitat corporativa @ca
toolkit label: personne fondatrice d’une collectivité @fr
toolkit label: testületet alapító személy: @hu
toolkit label: tüzel kişinin kurucusu @tr
toolkit label: yhteisön perustanut henkilö
toolkit label: ιδρυτής φυσικό πρόσωπο του συλλογικού οργάνου @el
toolkit label: شخص مؤسس لهيئة @ar
toolkit label: 团体的创办个人 @zh-hans
has subproperty: P50029
lexical alias: foundingPersonOfCorporateBody.en
status: Published
type: Property
domain: C10005
label: a pour personne fondatrice d’une collectivité @fr
label: asutuse asutanud isik @et
label: ha come fondatore persona di ente @it
label: har grunnlegger for korporasjon (person) @no
label: har person, som er grundlægger af korporation @da
label: has founding person of corporate body @en
label: hat Gründerin/Gründer einer Körperschaft (Person) @de
label: heeft oprichter-persoon van corporatie @nl
label: institūcijas dibinātājs (persona) @lv
label: testület alapító személye a következő: @hu
label: té com a persona fundadora d’una entitat corporativa @ca
label: tüzel kişiyi kuran kişi ile ilişkilidir @tr
label: έχει ιδρυτή φυσικό πρόσωπο του συλλογικού οργάνου @el
label: لها شخص مؤسس لهيئة @ar
label: 有团体的创办个人 @zh-hans
sub property of: yhteisöön liittyvä henkilö
sub property of: yhteisön perustanut toimija
alternative label: Begründerin/Begründer @de
alternative label: alapító: @hu
alternative label: asutaja (isik) @et
alternative label: fondateur @fr
alternative label: fondatore @it
alternative label: founder @en
alternative label: fundador @ca
alternative label: grundlægger @da
alternative label: grunnlegger @no
alternative label: kurucu @tr
alternative label: perustaja
alternative label: ιδρυτής @el
alternative label: مؤسس @ar
alternative label: 创办者 @zh-hans
definition: Bir tüzel kişiyi tüzel kişiliği kuran bir kişi ile ilişkilendirir. @tr
definition: Correla un ente a una persona che istituisce un ente. @it
definition: Hozzákapcsol egy testületet egy személyhez, aki kezdeményezi egy testület létrehozását. @hu
definition: Liittää yhteisön henkilöön, joka perusti yhteisön.
definition: Met une collectivité en relation avec une personne qui établit une collectivité. @fr
definition: Relaciona una entitat corporativa amb una persona que inicia una entitat corporativa. @ca
definition: Relateert een corporatie aan een persoon die een corporatie opricht. @nl

yhteisön henkilöjäsen
has element type: 2
instruction number: 29.5
toolkit definition: A person who is a member of a corporate body. @en
toolkit definition: Een persoon die lid is van een corporatie. @nl
toolkit definition: Egy személy, aki egy testület tagja. @hu
toolkit definition: Eine Person, die Mitglied einer Körperschaft ist. @de
toolkit definition: En person som er medlem av en korporasjon. @no
toolkit definition: Henkilö, joka on yhteisön jäsen.
toolkit definition: Isik, kes on asutuse liige. @et
toolkit definition: Person, som er medlem af en korporation. @da
toolkit definition: Persona che è membro di un ente @it
toolkit definition: Persona que és membre d’una entitat corporativa. @ca
toolkit definition: Persona, kura pievienojas institūcijai. @lv
toolkit definition: Personne qui est membre d’une collectivité. @fr
toolkit definition: Tüzel bir kuruluşun üyesi olan bir kişi. @tr
toolkit definition: Una persona que es miembro de una entidad corporativa. @es
toolkit definition: Ένα φυσικό πρόσωπο που είναι μέλος ενός συλλογικού οργάνου. @el
toolkit definition: شخص عضو في هيئة. @ar
toolkit definition: 作为团体的个人成员的个人 @zh-hans
toolkit label: Mitglied einer Körperschaft (Person) @de
toolkit label: asutuse liige (isik) @et
toolkit label: institūcijas dalībnieks (persona) @lv
toolkit label: medlem av korporasjon (person) @no
toolkit label: membro persona di ente @it
toolkit label: miembro @es
toolkit label: person member of corporate body @en
toolkit label: person, som er medlem af korporation @da
toolkit label: persona membre d’una entitat corporativa @ca
toolkit label: personne membre d’une collectivité @fr
toolkit label: persoonlijk lid van corporatie @nl
toolkit label: testület személy tagja: @hu
toolkit label: tüzel kuruluşun üyesi olan kişi @tr
toolkit label: yhteisön henkilöjäsen
toolkit label: φυσικό πρόσωπο μέλος του συλλογικού οργάνου @el
toolkit label: شخص عضو في هيئة @ar
toolkit label: 团体的个人成员 @zh-hans
has subproperty: työntekijä
has subproperty: P50030
lexical alias: personMemberOfCorporateBody.en
status: Published
type: Property
domain: C10005
label: a pour personne membre d’une collectivité @fr
label: asutuse liige (isik) @et
label: ha come persona membro di ente @it
label: har medlem av korporasjon (person) @no
label: har person, som er medlem af korporation @da
label: has person member of corporate body @en
label: hat Mitglied einer Körperschaft (Person) @de
label: heeft persoonlijk lid van corporatie @nl
label: institūcijas dalībnieks (persona) @lv
label: testület személy tagja a következő: @hu
label: té com a persona membre d’una entitat corporativa @ca
label: tüzel kişinin kişi üyesi ile ilişkilidir @tr
label: έχει φυσικό πρόσωπο μέλος του συλλογικού οργάνου @el
label: لها شخص عضو في هيئة @ar
label: 有团体的个人成员 @zh-hans
sub property of: yhteisöön liittyvä henkilö
sub property of: yhteistoimijan henkilöjäsen
alternative label: Affiliation von @de
alternative label: affiliation de @fr
alternative label: affiliation of @en
alternative label: affiliációja: @hu
alternative label: afiliación de @es
alternative label: liige (isik) @et
alternative label: medlem av @no
alternative label: member @en
alternative label: membre @fr
alternative label: membro @it
alternative label: miembro @es
alternative label: tag: @hu
alternative label: tilknytning @da
alternative label: tilknyttet @no
alternative label: Üyelik @tr
alternative label: üye @tr
alternative label: μέλος @el
alternative label: σύνδεση του @el
alternative label: تابعة لـ @ar
alternative label: 成员 @zh-hans

yhteisöön liittyvä paikka
has element type: 3
instruction number: 11.3
toolkit definition: A place that is associated with a corporate body. (Deprecated) @en
toolkit definition: Egy testülettel kapcsolatos jelentős hely. @hu
toolkit definition: Eine wichtiger Ort, der mit einer Körperschaft in Verbindung steht. @de
toolkit definition: Emplacement important associé à une collectivité. @fr
toolkit definition: En væsentlig lokalitet der er forbundet med en korporation. @da
toolkit definition: Et sted som forbindes med korporasjonen. @no
toolkit definition: Localització significativa associada amb una entitat corporativa. @ca
toolkit definition: Merkittävä yhteisöön liittyvä paikka.
toolkit definition: Un lugar significativo asociado con una entidad corporativa. @es
toolkit definition: Μια σημαντική τοποθεσία που συνδέεται με ένα συλλογικό όργανο. @el
toolkit label: Ort, der mit einer Körperschaft in Verbindung steht @de
toolkit label: lieu associé à une collectivité @fr
toolkit label: lloc associat amb una entitat corporativa @ca
toolkit label: lugar asociado con la entidad corporativa @es
toolkit label: ort förknippad med institutionen @sv
toolkit label: place associated with corporate body (Deprecated) @en
toolkit label: sted forbundet med korporationen @da
toolkit label: sted som forbindes med korporasjon @no
toolkit label: testülettel kapcsolatos hely @hu
toolkit label: yhteisöön liittyvä paikka
toolkit label: τόπος σχετικός με το συλλογικό όργανο @el
has subproperty: muu yhteisöön liittyvä paikka
has subproperty: P50031
lexical alias: placeAssociatedWithCorporateBody.en
status: Deprecated
type: Property
domain: C10005
label: a pour lieu associé à une collectivité @fr
label: har ort förknippad med institutionen @sv
label: har sted forbundet med korporationen @da
label: has place associated with corporate body (Deprecated) @en
label: hat Ort, der mit einer Körperschaft in Verbindung steht @de
label: té com a lloc associat amb una entitat corporativa @ca
label: van testülettel kapcsolatos helye @hu
label: έχει τόπο συνδεδεμένο με το συλλογικό όργανο @el
sub property of: yhteisöön liittyvä paikka
definition: Egy testületet hozzákapcsol egy jelentős helyhez, amely egy testülettel összefüggésben van. @hu
definition: Liittää yhteisön merkittävään yhteisöön liittyvä paikka.
definition: Met une collectivité en relation avec un emplacement important associé à une collectivité. @fr
definition: Relaciona una entitat corporativa amb una localització significativa associada amb una entitat corporativa. @ca
definition: Relaterer en korporation til en væsentlig lokalitet der er forbundet med en korporation. @da
definition: Relates a corporate body to a place that is associated with a corporate body. (Deprecated) @en
definition: Setzt eine Körperschaft mit einer wichtigen Örtlichkeit, die mit einer Körperschaft in Verbindung steht, in Beziehung. @de
definition: Συνδέει ένα συλλογικό όργανο με μια σημαντική τοποθεσία η οποία συνδέεται με ένα συλλογικό όργανο. @el

yhteisön nimi
has element type: 3
instruction number: 11.2
toolkit definition: A nomen that is an appellation of corporate body in natural language and phrasing used in common discourse. @en
toolkit definition: Asutuse nimetus loomulikus keeles ja sõnastuses, mida kasutatakse ühises diskursuses. @et
toolkit definition: Doğal dilde ve ortak söylemde kullanılan ifadelerde tüzel kişinin unvanı olan bir isim. @tr
toolkit definition: Een nomen dat is een benaming van corporatie in natuurlijke taal en formulering gebruikt in alledaags taalgebruik. @nl
toolkit definition: Egy nomen, amely egy testület megnevezése természetes nyelven és közbeszédben használt kifejezéssel. @hu
toolkit definition: Eine Bezeichnung für eine Körperschaft in natürlicher Sprache und Ausdrucksweise, die beim normalen Sprechen und Schreiben verwendet wird. @de
toolkit definition: En betegnelse for korporasjon på et naturlig språk og med frasering brukt i alminnelig diskurs. @no
toolkit definition: Institūcijas apzīmējums dabiskajā valodā, ko izmanto savstarpējā saziņā. @lv
toolkit definition: Nomen que és una apel·lació d’entitat corporativa en llenguatge i frases naturals usada en el discurs comú. @ca
toolkit definition: Nomen qui est une appellation de collectivité exprimée dans un langage et une formulation naturels et utilisée dans le langage courant. @fr
toolkit definition: Nomen, joka on yhteisöstä yleisessä diskurssissa käytetty nimitys, joka on luonnollisella kielellä ja luonnollisessa sanamuodossa.
toolkit definition: Nomen, som er en benævnelse på korporation på normalsprog og med formuleringer, som bruges alment. @da
toolkit definition: Una palabra, carácter o grupo de palabras y/o caracteres mediante los cuales se conoce una entidad corporativa. @es
toolkit definition: Μια λέξη, χαρακτήρας ή ομάδα λέξεων ή/και χαρακτήρων με τους οποίους ένα συλλογικό όργανο είναι γνωστό. @el
toolkit definition: تسمية هيئة في اللغة الطبيعية وفي العبارات المستخدمة في الخطاب العام. @ar
toolkit definition: 作为用自然语言和普通话语措词表达的团体的称谓的一个命名 @zh-hans
toolkit label: Name einer Körperschaft @de
toolkit label: asutuse nimi @et
toolkit label: institutionsnamn @sv
toolkit label: institūcijas vārds/nosaukums @lv
toolkit label: korporasjonsnavn @no
toolkit label: naam van corporatie @nl
toolkit label: name of corporate body @en
toolkit label: navn på korporation @da
toolkit label: nom de collectivité @fr
toolkit label: nom d’entitat corporativa @ca
toolkit label: nombre de la entidad corporativa @es
toolkit label: testületnév: @hu
toolkit label: tüzel kişiliğin adı @tr
toolkit label: yhteisön nimi
toolkit label: όνομα του συλλογικού οργάνου @el
toolkit label: اسم هيئة @ar
toolkit label: 团体的名称 @zh-hans
has subproperty: yhteisön varianttinimi
has subproperty: yhteisön ensisijainen nimi
has subproperty: P50032
lexical alias: nameOfCorporateBody.en
status: Published
type: Property
domain: C10005
label: a pour nom de collectivité @fr
label: asutuse nimi @et
label: har institutionsnamn @sv
label: har korporasjonsnavn @no
label: har navn på korporation @da
label: has name of corporate body @en
label: hat Namen einer Körperschaft @de
label: heeft naam van corporatie @nl
label: institūcijas vārds/nosaukums @lv
label: testület neve a következő: @hu
label: té com a nom d’entitat corporativa @ca
label: tüzel kişinin adı ile ilişkilidir @tr
label: έχει όνομα του συλλογικού οργάνου @el
label: لها اسم هيئة @ar
label: 有团体的名称 @zh-hans
sub property of: yhteisön nimitys
sub property of: yhteistoimijan nimi
definition: Bir tüzel kişiyi, doğal dilde ve ortak söylemde kullanılan ifadelerde tüzel kuruluşun bir adı olan bir isimle ilişkilendirir. @tr
definition: Hozzákapcsol egy testületet egy nomenhez, amely egy testület megnevezése természetes nyelven és közbeszédben használt kifejezéssel. @hu
definition: Liittää yhteisön nomeniin, joka on luonnollisella kielellä ja sanamuodolla oleva, yleisessä diskurssissa käytetty nimitys yhteisöstä.
definition: Met une collectivité en relation avec un nomen qui est une appellation de collectivité exprimée dans un langage et une formulation naturels et utilisée dans le langage courant. @fr
definition: Relaciona una entitat corporativa amb un nomen que és una apel·lació d’entitat corporativa en llenguatge i frases naturals usada en el discurs comú. @ca
definition: Relateert een corporatie aan een nomen dat is een benaming van corporatie in natuurlijke taal en formulering gebruikt in alledaags taalgebruik. @nl
definition: Relaterer en korporasjon til en betegnelse for korporasjon på et naturlig språk og med frasering brukt i alminnelig diskurs. @no
definition: Relaterer en korporation til en benævnelse på korporation på normalsprog og med formuleringer, som bruges alment. @da
definition: Relates a corporate body to a nomen that is an appellation of corporate body in natural language and phrasing used in common discourse. @en
definition: Sasaista institūciju ar nomenu, kas ir institūcijas apzīmējums dabiskajā valodā, ko izmanto savstarpējā saziņā. @lv
definition: Seostab asutuse asutuse nimetusega loomulikus keeles ja sõnastuses, mida kasutatakse ühises diskursuses. @et
definition: Setzt eine Körperschaft in Beziehung zu einer Bezeichnung für eine Körperschaft in natürlicher Sprache und Ausdrucksweise, die beim normalen Sprechen und Schreiben verwendet wird. @de
definition: Συνδέει ένα συλλογικό όργανο με μια ονομασία ενός συλλογικού οργάνου σε φυσική γλώσσα και διατύπωση χρησιμοποιούμενη στην καθομιλουμένη. @el
definition: يربط هيئة بمسمى هيئة في اللغة الطبيعية وفي العبارات المستخدمة في الخطاب العام @ar
definition: 将一个团体与作为用自然语言和普通话语措词表达的团体的称谓的一个命名关联起来。 @zh-hans

muu yhteisöön liittyvä määrite
has element type: 6
instruction number: 11.7
toolkit definition: A word, phrase, or abbreviation indicating incorporation or legal status of a corporate body, or any term serving to differentiate a corporate body from another agent. (Deprecated) @en
toolkit definition: Egy szó, kifejezés vagy rövidítés, amely egy testület cégbejegyzését vagy jogi státuszát jelzi, vagy bármely terminus, amely egy testületet megkülönböztet más testületektől, személyektől stb. @hu
toolkit definition: Ein Wort, eine Phrase oder eine Abkürzung, das/die die Gründung oder den rechtlichen Status der Körperschaft anzeigt, oder ein beliebiger Terminus, der dazu dient, die Körperschaft von anderen Körperschaften, Personen usw. zu unterscheiden. @de
toolkit definition: Et ord, et begrep eller en forkortelse som angir juridisk status eller selskapsform for en korporasjon, eller et annet begrep som skiller en korporasjon fra andre korporasjoner, personer, etc. @no
toolkit definition: Mot, expression ou abréviation qui indique le statut commercial ou juridique d’une collectivité ou tout terme qui permet de différencier une collectivité d’autres collectivités, personnes, etc. @fr
toolkit definition: Ord, frase eller forkortelse, der forklarer en korporations art eller juridiske status, eller en tilføjelse, der tjener til at skelne korporationen fra andre korporationer, personer etc. @da
toolkit definition: Paraula, frase o abreviació que indica la constitució en societat comercial o l’estat jurídic d’una entitat corporativa, o qualsevol terme que diferencia una entitat d’altres entitats corporatives, persones, etc. @ca
toolkit definition: Una palabra, frase o abreviatura que indica la incorporación o la condición legal de una entidad corporativa, o cualquier término que diferencia la entidad de otras entidades corporativas, personas, etc. @es
toolkit definition: Yhteisön yhtiömuotoa tai oikeudellista asemaa osoittava sana, ilmaus tai lyhenne tai mikä tahansa muu termi, joka erottaa yhteisön muista yhteisöistä, henkilöistä jne.
toolkit definition: Μια λέξη, φράση ή συντομογραφία που δηλώνει σύσταση ή νομικό καθστώς ενός συλλογικού οργάνου ή οποιοσδήποτε όρος που έχει ως στόχο τη διαφοροποίηση ενός συλλογικού οργάνου από άλλα συλλογικά όργανα, φυσικά πρόσωπα κ.λπ. @el
toolkit label: Sonstige zur Körperschaft gehörende Kennzeichnung @de
toolkit label: altra designació associada amb una entitat corporativa @ca
toolkit label: annen betegnelse som forbindes med korporasjon @no
toolkit label: autre désignation associée à une collectivité @fr
toolkit label: forklarende tilføjelse til korporationen @da
toolkit label: muu yhteisöön liittyvä määrite
toolkit label: other designation associated with corporate body (Deprecated) @en
toolkit label: otra designación asociada con la entidad corporativa @es
toolkit label: testülettel kapcsolatos más elnevezés @hu
toolkit label: övrig beteckning förknippad med institutionen @sv
toolkit label: άλλος προσδιορισμός συνδεδεμένος με το συλλογικό όργανο @el
has subproperty: muu määrite
has subproperty: P50033
lexical alias: otherDesignationAssociatedWithCorporateBody.en
status: Deprecated
type: Property
domain: C10005
label: a pour autre désignation associée à une collectivité @fr
label: har forklarende tilføjelse til korporationen @da
label: har övrig beteckning förknippad med institutionen @sv
label: has other designation associated with corporate body (Deprecated) @en
label: hat sonstige zur Körperschaft gehörende Kennzeichnung @de
label: té com a altra designació associada amb una entitat corporativa @ca
label: van testülettel kapcsolatos más elnevezése @hu
label: έχει άλλον προσδιορισμό συνδεδεμένο με το συλλογικό όργανο @el
definition: Egy testületet hozzákapcsol egy testület jogi személyiségét vagy jogi státuszát jelző szóhoz, kifejezéshez vagy rövidítéshez, vagy bármely olyan kifejezéshez, amely egy testületet más testületektől, személyektől stb. megkülönböztet. @hu
definition: Liittää yhteisön yhteisön yhtiömuotoa tai oikeudellista asemaa osoittavaan sanaan, ilmaukseen tai lyhenteeseen tai mihinä tahansa muuhun termiin, joka erottaa yhteisön muista yhteisöistä, henkilöistä jne.
definition: Met une collectivité en relation avec un mot, une expression ou une abréviation qui indique le statut commercial ou juridique d’une collectivité ou tout terme qui permet de différencier une collectivité d’autres collectivités, personnes, etc. @fr
definition: Relaciona una entitat corporativa amb una paraula, frase o abreviació que indica la constitució en societat comercial o l’estat jurídic d’una entitat corporativa, o qualsevol terme que diferencia una entitat d’altres entitats corporatives, persones, etc. @ca
definition: Relaterer en korporation til et ord, frase eller forkortelse, der forklarer en korporations art eller juridiske status, eller en tilføjelse, der tjener til at skelne korporationen fra andre korporationer, personer etc. @da
definition: Relates a corporate body to a word, phrase, or abbreviation indicating incorporation or legal status of a corporate body, or any term serving to differentiate a corporate body from another agent. (Deprecated) @en
definition: Setzt eine Körperschaft mit einem Wort, einer Phrase oder einer Abkürzung, das/die die Gründung oder den rechtlichen Status der Körperschaft anzeigt, oder ein beliebiger Terminus, der dazu dient, die Körperschaft von anderen Körperschaften, Personen usw. zu unterscheiden, in Beziehung. @de
definition: Συνδέει ένα συλλογικό όργανο με μια λέξη, φράση ή συντομογραφία που δηλώνει σύσταση ή νομικό καθεστώς ενός συλλογικού οργάνου ή οποιονδήποτε όρο που έχει ως στόχο τη διαφοροποίηση ενός συλλογικού οργάνου από άλλα συλλογικά όργανα, φυσικά πρόσωπα κ.λπ. @el

yhteisöön liittyvä laitos
has element type: 2
instruction number: 11.5
toolkit definition: An institution commonly associated with a corporate body. (Deprecated) @en
toolkit definition: Egy testülethez általában kötődő intézmény. @hu
toolkit definition: Eine Institution, die üblicherweise mit einer Körperschaft in Verbindung gebracht wird. @de
toolkit definition: En institusjon som vanligvis forbindes med en korporasjon. @no
toolkit definition: Institució associada normalment amb una entitat corporativa. @ca
toolkit definition: Institution communément associée à une collectivité. @fr
toolkit definition: Institution, der almindeligvis opfattes knyttet til en korporation. @da
toolkit definition: Tiettyyn yhteisöön yleisesti liitetty laitos.
toolkit definition: Una institución comúnmente asociada con una entidad corporativa. @es
toolkit definition: Ένα ίδρυμα ευρέως συνδεδεμένο με ένα συλλογικό όργανο. @el
toolkit label: In Verbindung stehende Institution @de
toolkit label: associated institution (Deprecated) @en
toolkit label: assosiert institusjon @no
toolkit label: institució associada @ca
toolkit label: institución asociada @es
toolkit label: institution associée @fr
toolkit label: samhörande institution @sv
toolkit label: tilknyttet institution @da
toolkit label: társintézmény @hu
toolkit label: yhteisöön liittyvä laitos
toolkit label: συνδεδεμένο ίδρυμα @el
has subproperty: P50034
lexical alias: associatedInstitution.en
status: Deprecated
type: Property
domain: C10005
label: a pour institution associée @fr
label: har samhörande institution @sv
label: har tilknyttet institution @da
label: has associated institution (Deprecated) @en
label: hat in Verbindung stehende Institution @de
label: té com a institució associada @ca
label: van kapcsolódó intézménye @hu
label: έχει συνδεδεμένο ίδρυμα @el
sub property of: yhteisöön liittyvä yhteisö
definition: Egy testületet hozzákapcsol egy testülethez általában kötődő intézményhez. @hu
definition: Liittää yhteisön tiettyyn yhteisöön yleisesti liitettyyn laitokseen.
definition: Met une collectivité en relation avec une institution communément associée à une collectivité. @fr
definition: Relaciona una entitat corporativa amb una institució associada normalment amb una entitat corporativa. @ca
definition: Relaterer en korporation til en institution der almindeligvis opfattes knyttet til en korporation @da
definition: Relates a corporate body to an institution commonly associated with a corporate body. (Deprecated) @en
definition: Setzt eine Körperschaft mit einer Institution, die üblicherweise mit einer Körperschaft in Verbindung gebracht wird, in Beziehung. @de
definition: Συνδέει ένα συλλογικό όργανο με ένα ίδρυμα ευρέως συνδεδεμένο με ένα συλλογικό όργανο. @el

yhteisöhistoria
has element type: 6
instruction number: 11.11
toolkit definition: A summary of information about the history of a corporate body. @en
toolkit definition: Bir tüzel kuruluşun tarihi hakkındaki bilgilerin özeti @tr
toolkit definition: Een samenvatting van informatie over de geschiedenis van een corporatie. @nl
toolkit definition: Egy összefoglaló, amely történeti információkat közöl egy testületről. @hu
toolkit definition: Et sammendrag av historisk informasjon om en korporasjon. @no
toolkit definition: Información histórica de una entidad corporativa @es
toolkit definition: Informationen über die Geschichte einer Körperschaft. @de
toolkit definition: Kokkuvõtlik ajalooline info asutuse kohta. @et
toolkit definition: Kopsavilkums par institūcijas vēsturi. @lv
toolkit definition: Opsummering af oplysninger om en korporations historie. @da
toolkit definition: Resum de la informació sobre la història d’una entitat corporativa. @ca
toolkit definition: Résumé d’informations sur l’histoire d’une collectivité. @fr
toolkit definition: Sommario delle informazioni storiche sull'ente. @it
toolkit definition: Yhteenveto yhteisön historiaan liittyvistä tiedoista.
toolkit definition: Μια συνοπτική ιστορική πληροφόρηση αναφορικά με ένα συλλογικό όργανο. @el
toolkit definition: ملخص المعلومات التاريخية لهيئة. @ar
toolkit definition: 关于一个团体历史的信息提要 @zh-hans
toolkit label: Geschichte einer Körperschaft @de
toolkit label: asutuse ajalugu @et
toolkit label: bedrijfsgeschiedenis @nl
toolkit label: corporate history @en
toolkit label: historia corporativa @es
toolkit label: historique d’une collectivité @fr
toolkit label: història corporativa @ca
toolkit label: institutionshistoria @sv
toolkit label: institūcijas vēsture @lv
toolkit label: korporasjonshistorikk @no
toolkit label: korporationshistorie @da
toolkit label: storia di ente @it
toolkit label: testülettörténet: @hu
toolkit label: tüzel tarih @tr
toolkit label: yhteisöhistoria
toolkit label: εταιρική ιστορία @el
toolkit label: تاريخ هيئة @ar
toolkit label: 团体历史 @zh-hans
has subproperty: P50035
lexical alias: corporateHistory.en
status: Published
type: Property
domain: C10005
label: a pour historique d’une collectivité @fr
label: asutuse ajalugu @et
label: ha come storia di ente @it
label: har institutionshistoria @sv
label: har korporasjonshistorikk @no
label: har korporationshistorie @da
label: has corporate history @en
label: hat Geschichte einer Körperschaft @de
label: heeft bedrijfsgeschiedenis @nl
label: institūcijas vēsture @lv
label: kurumsal tarih ile ilişkilidir @tr
label: testülettörténete a következő: @hu
label: té com a història corporativa @ca
label: έχει εταιρική ιστορία @el
label: لها تاريخ هيئة @ar
label: 有团体历史 @zh-hans
alternative label: yhteisön historia
definition: Bir tüzel kişiyi, bir tüzel kişinin tarihi hakkındaki bilgilerin bir özetiyle ilişkilendirir. @tr
definition: Correla un ente a un sommario delle informazioni storiche sull'ente. @it
definition: Hozzákapcsol egy testületet egy összefoglalóhoz, amely történeti információkat közöl egy testületről. @hu
definition: Liittää yhteisön yhteenvetoon yhteisön historiaan liittyvistä tiedoista.
definition: Met une collectivité en relation avec un résumé d’informations sur l’histoire d’une collectivité. @fr
definition: Relaciona una entitat corporativa amb un resum de la informació sobre la història d’una entitat corporativa. @ca
definition: Relateert een corporatie aan een samenvatting van informatie over de geschiedenis van een corporatie. @nl
definition: Relaterer en korporasjon til et sammendrag av historisk informasjon om en korporasjon. @no
definition: Relaterer en korporation til en opsummering af historiske oplysninger om en korporation. @da
definition: Relates a corporate body to a summary of information about the history of a corporate body. @en
definition: Sasaista institūciju ar kopsavilkumu par institūcijas vēsturi. @lv
definition: Seostab asutuse kokkuvõtliku ajaloolise infoga asutuse kohta. @et
definition: Setzt ein Körperschaft in Beziehung zu Informationen über die Geschichte einer Körperschaft. @de
definition: Συνδέει ένα συλλογικό όργανο με μια περίληψη ιστορικών πληροφοριών σχετικών με ένα συλλογικό όργανο. @el
definition: يربط هيئة بملخص المعلومات التاريخية لهيئة. @ar
definition: 将一个团体与关于一个团体历史的信息提要关联起来。 @zh-hans

yhteisön osoite
has element type: 6
instruction number: 11.9
toolkit definition: Adresse d’une collectivité. @fr
toolkit definition: Adresse på en korporation. @da
toolkit definition: Adreça d’una entitat corporativa. @ca
toolkit definition: An address of a corporate body. @en
toolkit definition: Asutuse aadress. @et
toolkit definition: Bir tüzel kişiliğin adresi @tr
toolkit definition: Een adres van een corporatie. @nl
toolkit definition: Egy testület címe. @hu
toolkit definition: Eine Adresse einer Körperschaft. @de
toolkit definition: En korporasjons adresse. @no
toolkit definition: Indirizzo di un ente. @it
toolkit definition: Institūcijas adrese. @lv
toolkit definition: La dirección de una entidad corporativa. @es
toolkit definition: Yhteisön osoite.
toolkit definition: Μια διεύθυνση ενός συλλογικού οργάνου. @el
toolkit definition: عنوان مراسلة لهيئة. @ar
toolkit definition: 一个团体的地址 @zh-hans
toolkit label: Adresse einer Körperschaft @de
toolkit label: Tüzel kişinin adresi @tr
toolkit label: address of corporate body @en
toolkit label: adres van corporatie @nl
toolkit label: adresse d’une collectivité @fr
toolkit label: adresse for korporasjon @no
toolkit label: adresse på korporation @da
toolkit label: adreça d’una entitat corporativa @ca
toolkit label: asutuse aadress @et
toolkit label: dirección de la entidad corporativa @es
toolkit label: indirizzo di ente @it
toolkit label: institūcijas adrese @lv
toolkit label: testületi cím: @hu
toolkit label: yhteisön osoite
toolkit label: διεύθυνση του συλλογικού οργάνου @el
toolkit label: عنوان هيئة @ar
toolkit label: 团体的地址 @zh-hans
has subproperty: P50036
lexical alias: addressOfCorporateBody.en
status: Published
type: Property
domain: C10005
label: a pour adresse d’une collectivité @fr
label: asutuse aadress @et
label: ha come indirizzo di ente @it
label: har adresse for korporasjon @no
label: har adresse på korporation @da
label: has address of corporate body @en
label: hat Adresse einer Körperschaft @de
label: heeft adres van corporatie @nl
label: institūcijas adrese @lv
label: testület címe a következő: @hu
label: té com a adreça d’una entitat corporativa @ca
label: tüzel kişinin adresi ile ilişkilidir @tr
label: έχει διεύθυνση του συλλογικού οργάνου @el
label: لها عنوان مراسلة هيئة @ar
label: 有团体的地址 @zh-hans
sub property of: yhteistoimijan osoite
definition: Bir tüzel kişiyi, bir tüzel kişiliğin adresi ile ilişkilendirir. @tr
definition: Correla un ente a un indirizzo di un ente. @it
definition: Hozzákapcsol egy testületet egy testület címéhez. @hu
definition: Liittää yhteisön sen osoitteeseen.
definition: Met une collectivité en relation avec une adresse d’une collectivité. @fr
definition: Relaciona una entitat corporativa amb una adreça d’una entitat corporativa. @ca
definition: Relateert een corporatie aan een adres van een corporatie. @nl
definition: Relaterer en korporasjon til en korporasjons adresse. @no
definition: Relaterer en korporation til en adresse på en korporation @da
definition: Relates a corporate body to an address of a corporate body. @en
definition: Sasaista institūciju ar institūcijas adresi. @lv
definition: Seostab asutuse asutuse aadressiga. @et
definition: Setzt eine Körperschaft in Beziehung zu einer Adresse einer Körperschaft. @de
definition: Συνδέει ένα συλλογικό όργανο με μια διεύθυνση ενός συλλογικού οργάνου. @el
definition: يربط هيئة بعنوان مراسلة هيئة. @ar
definition: 将一个团体与一个团体的地址关联起来。 @zh-hans
scope note: Comprend une adresse de courrier électronique ou une autre adresse en ligne. @fr
scope note: Darunter fallen E-Mail-Adressen oder andere Online-Adressen. @de
scope note: Email vagy más online cím is idetartozik. @hu
scope note: Hõlmab ka e-posti vm võrguaadressi. @et
scope note: Ietver e-pastu vai citu tiešsaistes adresi. @lv
scope note: Inclou un correu electrònic o qualsevol altra adreça en línia. @ca

perustamisajankohta
has element type: 3
instruction number: 11.4.3
toolkit definition: A timespan during which a corporate body is established or founded. @en
toolkit definition: Ajanjakso, jolloin yhteisö on perustettu.
toolkit definition: Ajavahemik, millal asutus on asutatud. @et
toolkit definition: Arco di tempo durante il quale un ente è stato costituito o fondato @it
toolkit definition: Bir tüzel kuruluşun kurulduğu veya oluşturulduğu zaman aralığı. @tr
toolkit definition: Een tijdspanne gedurende welke een corporatie wordt vastgesteld of opgericht. @nl
toolkit definition: Egy időtartam, amely alatt egy testületet alapítottak vagy létesítettek. @hu
toolkit definition: Ein Zeitraum, in dem eine Körperschaft eingeführt oder gegründet wurde. @de
toolkit definition: Et tidsrom hvor en korporasjon blir etablert eller grunnlagt. @no
toolkit definition: Institūcijas izveidošanas vai nodibināšanas datējums. @lv
toolkit definition: Interval de temps durant el qual una entitat corporativa es crea o es funda. @ca
toolkit definition: La fecha en que se estableció o fundó una entidad corporativa. @es
toolkit definition: Laps de temps pendant lequel une collectivité est établie ou fondée. @fr
toolkit definition: Tidsperiode, hvorunder en korporation er etableret eller grundlagt. @da
toolkit definition: Μια χρονολογία κατά την οποία ένα συλλογικό όργανο συστάθηκε ή ιδρύθηκε. @el
toolkit definition: فترة زمنية نشأت أو تأسست خلالها هيئة. @ar
toolkit definition: 一个团体成立或创办的时间段 @zh-hans
toolkit label: Gründungsdatum @de
toolkit label: alapítás időpontja: @hu
toolkit label: asutamisaeg @et
toolkit label: data de creació @ca
toolkit label: data di costituzione @it
toolkit label: date de fondation @fr
toolkit label: date of establishment @en
toolkit label: dato for etablering @da
toolkit label: datum van oprichting @nl
toolkit label: fecha de establecimiento @es
toolkit label: kuruluş tarihi @tr
toolkit label: nodibināšanas datējums @lv
toolkit label: perustamisajankohta
toolkit label: tid för institutionens grundande @sv
toolkit label: tidspunkt for opprettelse @no
toolkit label: χρονολογία της εγκαθίδρυσης @el
toolkit label: تاريخ تأسيس @ar
toolkit label: 成立日期 @zh-hans
has subproperty: P50037
lexical alias: dateOfEstablishment.en
status: Published
type: Property
domain: C10005
label: a pour date de fondation @fr
label: alapításának időpontja a következő: @hu
label: asutamisaeg @et
label: ha come data di costituzione @it
label: har dato for etablering @da
label: har tid för institutionens grundande @sv
label: har tidspunkt for opprettelse @no
label: has date of establishment @en
label: hat Gründungsdatum @de
label: heeft datum van oprichting @nl
label: kuruluş tarihi ile ilişkilidir @tr
label: nodibināšanas datējums @lv
label: té com a data de creació @ca
label: έχει χρονολογία της εγκαθύδρισης @el
label: لها تاريخ تأسيس @ar
label: 有成立日期 @zh-hans
sub property of: yhteisöön liittyvä ajanjakso
definition: Bir tüzel kişiyi, bir tüzel kişiliğin kurulduğu veya oluşturulduğu bir zaman aralığı ile ilişkilendirir. @tr
definition: Correla un ente a un arco di tempo nel quale un ente è stato costituito o fondato. @it
definition: Hozzákapcsol egy testületet egy időtartamhoz, amely alatt egy testületet alapítottak vagy létesítettek. @hu
definition: Liittää yhteisön ajanjaksoon, jolloin yhteisö on perustettu.
definition: Met une collectivité en relation avec un laps de temps pendant lequel une collectivité est établie ou fondée. @fr
definition: Relaciona una entitat corporativa amb un interval de temps durant el qual una entitat corporativa es crea o es funda. @ca
definition: Relateert een corporatie aan een tijdspanne gedurende welke een corporatie wordt vastgesteld of opgericht. @nl
definition: Relaterer en korporasjon til et tidsrom hvor en korporasjon blir etablert eller grunnlagt. @no
definition: Relaterer en korporation til en tidsperiode, hvorunder en korporation er etableret eller grundlagt. @da
definition: Relates a corporate body to a timespan during which a corporate body is established or founded. @en
definition: Sasaista institūciju ar laikposmu, kas ir institūcijas izveidošanas vai nodibināšanas datējums. @lv
definition: Seostab asutuse ajavahemikuga, millal asutus on asutatud. @et
definition: Setzt eine Körperschaft in Beziehung zu einem Zeitraum, in dem eine Körperschaft eingeführt oder gegründet wurde. @de
definition: Συνδέει ένα συλλογικό όργανο με ένα χρονικό διάστημα κατά το οποίο ένα συλλογικό όργανο συστάθηκε ή ιδρύθηκε. @el
definition: يربط هيئة بفترة زمنية نشأت أو تأسست خلالها هيئة. @ar
definition: 将一个团体与一个团体成立或创办的时间段关联起来。 @zh-hans

lakkauttamisajankohta
has element type: 3
instruction number: 11.4.4
toolkit definition: A timespan during which a corporate body is terminated or dissolved. @en
toolkit definition: Ajanjakso, jolloin yhteisö on lakkautettu tai hajotettu.
toolkit definition: Ajavahemik, millal asutuse tegevus on lõpetatud. @et
toolkit definition: Arco di tempo durante il quale un ente è cessato o sciolto @it
toolkit definition: Bir tüzel kuruluşun sona erdiği veya feshedildiği bir zaman aralığı. @tr
toolkit definition: Een tijdspanne gedurende welke een corporatie wordt beëindigd of opgeheven. @nl
toolkit definition: Egy időtartam, amely alatt egy testületet megszüntettek vagy feloszlattak. @hu
toolkit definition: Ein Zeitraum, in dem eine Körperschaft aufgehoben oder aufgelöst wurde. @de
toolkit definition: Et tidsrom hvor en korporasjon blir lagt ned eller oppløst. @no
toolkit definition: Interval de temps durant el qual una entitat corporativa cessa o es dissol. @ca
toolkit definition: La fecha en la que una entidad corporativa fue concluida o disuelta. @es
toolkit definition: Laikposms, kad institūcija beidz pastāvēt vai likvidēta. @lv
toolkit definition: Laps de temps pendant lequel une collectivité cesse son activité ou est dissoute. @fr
toolkit definition: Tidsperiode, hvorunder en korporation er ophørt eller opløst. @da
toolkit definition: Μια χρονολογία κατά την οποία ένα συλλογικό όργανο έπαυσε ή λύθηκε. @el
toolkit definition: فترة زمنية توقفت الهيئة خلالها أو حُلت . @ar
toolkit definition: 一个团体终止或解散的时间段 @zh-hans
toolkit label: Auflösungsdatum @de
toolkit label: data de cessament @ca
toolkit label: data di termine @it
toolkit label: date de cessation @fr
toolkit label: date of termination @en
toolkit label: dato for ophør @da
toolkit label: datum van opheffing @nl
toolkit label: fecha de terminación @es
toolkit label: lakkauttamisajankohta
toolkit label: megszüntetés időpontja: @hu
toolkit label: pastāvēšanas beigu datējums @lv
toolkit label: sonlandırma tarihi @tr
toolkit label: tegevuse lõpetamise aeg @et
toolkit label: tid för institutionens upphörande @sv
toolkit label: tidspunkt for opphør @no
toolkit label: καταληκτική χρονολογία @el
toolkit label: تاريخ التوقف @ar
toolkit label: 终止日期 @zh-hans
has subproperty: P50038
lexical alias: dateOfTermination.en
status: Published
type: Property
domain: C10005
label: a pour date de cessation @fr
label: ha come data di termine @it
label: har dato for ophør @da
label: har tid för institutionens upphörande @sv
label: har tidspunkt for opphør @no
label: has date of termination @en
label: hat Auflösungsdatum @de
label: heeft datum van opheffing @nl
label: megszüntetésének időpontja a következő: @hu
label: pastāvēšanas beigu datējums @lv
label: sonlanma tarihi ile ilişkilidir @tr
label: tegevuse lõpetamise aeg @et
label: té com a data de cessament @ca
label: έχει καταληκτική χρονολογία @el
label: لها تاريخ توقف @ar
label: 有终止日期 @zh-hans
sub property of: yhteisöön liittyvä ajanjakso
definition: Bir tüzel kişiyi, feshedildiği veya dağıtıldığı bir zaman aralığı ile ilişkilidir. @tr
definition: Correla un ente a un arco di tempo nel quale un ente è cessato o è stato sciolto. @it
definition: Hozzákapcsolt egy testületet egy időtartamhoz, amely alatt egy testületet megszüntettek vagy feloszlattak. @hu
definition: Liittää yhteisön ajanjaksoon, jolloin yhteisö on lakkautettu tai hajotettu.
definition: Met une collectivité en relation avec un laps de temps pendant lequel une collectivité cesse son activité ou est dissoute. @fr
definition: Relaciona una entitat corporativa amb un interval de temps durant el qual una entitat corporativa cessa o es dissol. @ca
definition: Relateert een corporatie aan een tijdspanne gedurende welke een corporatie wordt beëindigd of opgeheven. @nl
definition: Relaterer en korporasjon til et tidsrom hvor en korporasjon blir lagt ned eller oppløst. @no
definition: Relaterer en korporation til en tidsperiode, hvorunder en korporation er ophørt eller opløst. @da
definition: Relates a corporate body to a timespan during which a corporate body is terminated or dissolved. @en
definition: Sasaista institūciju ar laikposmu, kad institūcija beidz pastāvēt vai likvidēta. @lv
definition: Seostab asutuse ajavahemikuga, millal asutuse tegevus on lõpetatud. @et
definition: Setzt eine Körperschaft in Beziehung zu einem Zeitraum, in dem eine Körperschaft aufgehoben oder aufgelöst wurde. @de
definition: Συνδέει ένα συλλογικό όργανο με ένα χρονικό διάστημα κατά το οποίο το συλλογικό όργανο έπαυσε [να υφίσταται] ή διαλύθηκε. @el
definition: يربط هيئة بفترة زمنية توقفت الهيئة خلالها أو حُلت. @ar
definition: 将一个团体与一个团体终止或解散的时间段关联起来。 @zh-hans

konferenssin ajankohta
has element type: 3
instruction number: 11.4.2
toolkit definition: A timespan during which a conference, exhibition, or other formally named and convened event is held. @en
toolkit definition: Ajanjakso, jolloin konferenssi, näyttely tai muu nimetty ja kokoontunut tapahtuma järjestettiin.
toolkit definition: Ajavahemik, millal on peetud teosele aluse pannud konverents, näitus või muu vormiliselt nimetatud ja kokku kutsutud üritus. @et
toolkit definition: Arco di tempo nel quale una conferenza, mostra, o un altro evento formalmente denominato e indetto che ha generato un lavoro si è tenuto @it
toolkit definition: Bir konferansın, serginin veya resmi olarak adlandırılmış ve toplanmış diğer etkinliklerin düzenlendiği zaman aralığı. @tr
toolkit definition: Een tijdspanne gedurende welke een conferentie, tentoonstelling of andere formeel benoemde en samengekomen gebeurtenis is gehouden. @nl
toolkit definition: Egy időtartam, amely alatt konferenciát, kiállítást vagy más hivatalos névvel rendelkező és szervezett eseményt tartanak. @hu
toolkit definition: Ein Zeitraum, in dem eine Konferenz, eine Ausstellung oder eine andere formal benannte und einberufene Veranstaltung stattfindet. @de
toolkit definition: Et tidsrom hvor en konferanse, kongress eller annet formelt navngitt arrangement som inspirerer til et verk er avholdt. @no
toolkit definition: Interval de temps durant el qual se celebra un congrés, una exposició o qualsevol altre esdeveniment formalment esmentat i convocat. @ca
toolkit definition: La fecha o rango de fechas en las que se realizó una conferencia, congreso, reunión, exposición, feria, festival, etc. @es
toolkit definition: Laikposms, kurā notikusi konference, izstāde vai cits pasākums. @lv
toolkit definition: Laps de temps pendant lequel se tient un congrès, une exposition ou un autre événement formellement nommé et convoqué. @fr
toolkit definition: Tidsperiode, hvorunder en konference, udstilling eller anden formelt navngivet og indkaldt begivenhed er afholdt. @da
toolkit definition: Μια χρονολογία ή εύρος χρονολογιών κατά τις οποίες ένα συνέδριο, συνάντηση, εορτή, φεστιβάλ κ.λπ. έλαβε χώρα. @el
toolkit definition: فترة زمنية تحدد أو عُقد خلالها رسمياً مؤتمر، أو معرض، أو أي فعالية أخرى، وأسفرت عن عمل. @ar
toolkit definition: 会议、展览或其他正式命名并举办的活动的时间跨度 @zh-hans
toolkit label: Datum einer Konferenz @de
toolkit label: data de congrés @ca
toolkit label: data di conferenza @it
toolkit label: date de congrès @fr
toolkit label: date of conference @en
toolkit label: dato for konference @da
toolkit label: datum van conferentie @nl
toolkit label: fecha de la conferencia, etc. @es
toolkit label: konferans tarihi @tr
toolkit label: konferencia időpontja: @hu
toolkit label: konferenssin ajankohta
toolkit label: konverentsi toimumisaeg @et
toolkit label: pasākuma datējums @lv
toolkit label: tid för konferens @sv
toolkit label: tidspunkt for konferanse @no
toolkit label: χρονολογία του συνεδρίου @el
toolkit label: تاريخ مؤتمر @ar
toolkit label: 会议的日期 @zh-hans
has subproperty: P50039
lexical alias: dateOfConference.en
status: Published
type: Property
domain: C10005
label: a pour date de congrès @fr
label: ha come data di conferenza @it
label: har dato for konference @da
label: har tid för konferens @sv
label: har tidspunkt for konferanse @no
label: has date of conference @en
label: hat Datum einer Konferenz @de
label: heeft datum van conferentie @nl
label: konferans tarihi ile ilişkilidir @tr
label: konferencia időpontja a következő: @hu
label: konverentsi toimumisaeg @et
label: pasākuma datējums @lv
label: té com a data de congrés @ca
label: έχει χρονολογία του συνεδρίου @el
label: لها تاريخ مؤتمر @ar
label: 有会议的日期 @zh-hans
sub property of: yhteisöön liittyvä ajanjakso
alternative label: Datum einer Konferenz usw. @de
alternative label: data de congrés, etc. @ca
alternative label: data della conferenza, etc. @it
alternative label: date de congrès, etc. @fr
alternative label: date of conference, etc. @en
alternative label: fecha de conferencia, etc. @es
alternative label: konferans tarihi, vb. @tr
alternative label: konferencedato etc. @da
alternative label: konferencia időpontja, stb. @hu
alternative label: konferenssin tms. ajankohta
alternative label: konverentsi vms toimumisaeg @et
alternative label: tidspunkt for konferanse etc. @no
alternative label: χρονολογία συνεδρίου κ.λπ. @el
alternative label: تاريخ مؤتمر @ar
alternative label: 会议等的日期 @zh-hans
definition: Bir tüzel kişiyi, bir konferans, sergi veya resmi olarak adlandırılmış ve toplanmış diğer etkinliklerin düzenlendiği bir zaman aralığı ile ilişkilendirir. @tr
definition: Correla un ente a un arco di tempo nel quale una conferenza, mostra, o un altro evento formalmente denominato e indetto che ha generato un lavoro si è tenuto @it
definition: Hozzákapcsol egy testületet egy időtartamhoz, amely alatt konferenciát, kiállítást vagy más hivatalos névvel rendelkező és szervezett eseményt tartanak. @hu
definition: Liittää yhteisön ajanjaksoon, jolloin konferenssi, näyttely tai muu nimetty ja kokoontunut tapahtuma järjestettiin.
definition: Met une collectivité en relation avec un laps de temps pendant lequel se tient un congrès, une exposition ou un autre événement formellement nommé et convoqué. @fr

yhteisöön liittyvä ajankohta
has element type: 3
instruction number: 11.4
toolkit definition: A timespan that has a significant association with a corporate body. (Deprecated) @en
toolkit definition: Data significativa associada amb la història d’una entitat corporativa. @ca
toolkit definition: Date importante associée à l’histoire d’une collectivité. @fr
toolkit definition: Egy testület történetével kapcsolatos jelentős időpont. @hu
toolkit definition: Ein wichtiges Datum, das mit der Geschichte einer Körperschaft in Verbindung steht. @de
toolkit definition: Et viktig tidspunkt som forbindes med en korporasjons historie. @no
toolkit definition: Una fecha significativa asociada con la historia de una entidad corporativa, incluyendo fechas de conferencia, fechas de terminación, y período de actividad. @es
toolkit definition: Væsentlig dato forbundet med en korporations historie. @da
toolkit definition: Yhteisön historiaan liittyvä merkittävä ajankohta.
toolkit definition: Μια σημαντική χρονολογία που συνδέεται με την ιστορία ενός συλλογικού οργάνου. @el
toolkit label: Datum, das mit einer Körperschaft in Verbindung steht @de
toolkit label: data associada amb una entitat corporativa @ca
toolkit label: date associated with corporate body (Deprecated) @en
toolkit label: date associée à une collectivité @fr
toolkit label: dato knyttet til korporationen @da
toolkit label: fecha asociada con la entidad corporativa @es
toolkit label: testülethez kötődő időpont @hu
toolkit label: tid förknippad med institutionen @sv
toolkit label: tidspunkt som forbindes med korporasjon @no
toolkit label: yhteisöön liittyvä ajankohta
toolkit label: χρονολογία συνδεδεμένη με το συλλογικό όργανο @el
has subproperty: P50040
lexical alias: dateAssociatedWithCorporateBody.en
status: Deprecated
type: Property
domain: C10005
label: a pour date associée à une collectivité @fr
label: har dato knyttet til korporationen @da
label: har tid förknippad med institutionen @sv
label: has date associated with corporate body (Deprecated) @en
label: hat Datum, das mit einer Körperschaft in Verbindung steht @de
label: té com a data associada amb una entitat corporativa @ca
label: van testülettel kapcsolatos időpontja @hu
label: έχει χρονολογία συνδεδεμένη με το το συλλογικό όργανο @el
sub property of: yhteisöön liittyvä ajanjakso
definition: Egy testületet hozzákapcsol egy testület történetéhez kötődő fontos időponthoz. @hu
definition: Liittää yhteisön yhteisön historian merkittävään ajankohtaan.
definition: Met une collectivité en relation avec une date importante associée à l’histoire d’une collectivité. @fr
definition: Relaciona una entitat corporativa amb una data significativa associada amb la història d’una entitat corporativa. @ca
definition: Relaterer en korporation til en væsentlig datering forbundet med en korporations historie. @da
definition: Relates a corporate body to a timespan that has a significant association with a corporate body. (Deprecated) @en
definition: Setzt eine Körperschaft mit einem wichtigen Datum, das mit der Geschichte einer Körperschaft in Verbindung steht, in Beziehung. @de
definition: Συνδέει ένα συλλογικό όργανο με μια σημαντική χρονολογία που σχετίζεται με την ιστορία ενός συλλογικού οργάνου. @el

yhteisön ensisijainen nimi
has element type: 3
instruction number: 11.2.2
toolkit definition: A nomen that is a name of corporate body that is selected for preference in a specific application or context. @en
toolkit definition: Asutuse nimi, mis kindlas rakenduses või kontekstis on valitud eelistatuks. @et
toolkit definition: Belirli bir uygulama veya bağlamda tercih için seçilen bir tüzel kuruluş adıdır. @tr
toolkit definition: Een nomen dat is een naam van corporatie die de voorkeur heeft gekregen in een specifieke applicatie of context. @nl
toolkit definition: Egy nomen, egy testület neve, amelyet egy bizonyos alkalmazásban vagy kontextusban előnyben részesítenek. @hu
toolkit definition: Ein Name einer Körperschaft, der in einer bestimmten Anwendung oder in einem bestimmten Kontext als Vorzugsform bestimmt wird. @de
toolkit definition: El nombre o la forma del nombre elegida para identificar la entidad corporativa. @es
toolkit definition: Et navn for korporasjon som er valgt som preferanse i en bestemt applikasjon eller kontekst. @no
toolkit definition: Institūcijas nosaukums, kurš ir izvēlēts noteiktam lietojumam vai noteiktā kontekstā. @lv
toolkit definition: Nome di ente che è stato scelto come preferito in una specifica applicazione o contesto. @it
toolkit definition: Nomen que és un nom d’entitat corporativa que se selecciona com a preferent en una aplicació o un context específic. @ca
toolkit definition: Nomen qui est un nom de collectivité faisant l’objet d’un choix privilégié dans une application ou un contexte spécifiques. @fr
toolkit definition: Nomen, joka on yhteisön nimi, joka on valittu ensisijaiseksi tietyssä sovelluksessa tai kontekstissa.
toolkit definition: Nomen, som er et navn på korporation, som er valgt som præference i en specifik anvendelse eller kontekst. @da
toolkit definition: Ένα όνομα ή μορφή ονόματος που έχει επιλεγεί για την ταύτιση ενός συλλογικού οργάνου. @el
toolkit definition: اسم هيئة اختير اسما مفضلا ضمن تطبيق أو سياق محدد. @ar
toolkit definition: 作为团体名称并在特定应用或语境下优先选用的命名 @zh-hans
toolkit label: Bevorzugter Name einer Körperschaft @de
toolkit label: asutuse eelisnimi @et
toolkit label: foretrukket korporasjonsnavn @no
toolkit label: foretrukket navn på korporation @da
toolkit label: föredraget namn för institutionen @sv
toolkit label: geprefereerde naam van corporatie @nl
toolkit label: institūcijas prioritārais nosaukums @lv
toolkit label: nom preferit d’entitat corporativa @ca
toolkit label: nom privilégié d’une collectivité @fr
toolkit label: nombre preferido de la entidad corporativa @es
toolkit label: nome preferito di ente @it
toolkit label: preferred name of corporate body @en
toolkit label: testület előnyben részesített neve: @hu
toolkit label: tüzel kişinin tercih ettiği isim @tr
toolkit label: yhteisön ensisijainen nimi
toolkit label: προτιμώμενο όνομα του συλλογικού οργάνου @el
toolkit label: اسم مفضل لهيئة @ar
toolkit label: 团体的首选名称 @zh-hans
has subproperty: P50041
lexical alias: preferredNameOfCorporateBody.en
status: Published
type: Property
domain: C10005
label: a pour nom privilégié d’une collectivité @fr
label: asutuse eelisnimi @et
label: ha come nome preferito di ente @it
label: har foretrukket korporasjonsnavn @no
label: har foretrukket navn på korporation @da
label: har föredraget namn för institutionen @sv
label: has preferred name of corporate body @en
label: hat bevorzugten Namen einer Körperschaft @de
label: heeft geprefereerde naam van corporatie @nl
label: institūcijas prioritārais nosaukums @lv
label: tercih edilen tüzel kişi adı ile ilişkilidir @tr
label: testület előnyben részesített neve a következő: @hu
label: té com a nom preferit d’entitat corporativa @ca
label: έχει προτιμώμενο όνομα του συλλογικού οργάνου @el
label: لها اسم مفضل لهيئة @ar
label: 有团体的首选名称 @zh-hans
sub property of: yhteisön nimi
sub property of: yhteistoimijan ensisijainen nimi
alternative label: -
alternative label: Bevorzugter Name für eine Körperschaft @de
alternative label: Foretrukket navn på korporation @da
alternative label: nombre preferido para organismo corporativo @es
alternative label: preferred name for corporate body @en
alternative label: testület kitüntetett neve: @hu
alternative label: tüzel kişilik için tercih edilen isim @tr
alternative label: اسم مفضل لهيئة @ar
alternative label: 团体的首选名称 @zh-hans
definition: Bir tüzel kişiyi, belirli bir uygulama veya bağlamda tercih edilmek üzere seçilen bir tüzel kişinin adı olan bir isimle ilişkilendirir. @tr
definition: Correla un ente a un nome di ente che è stato scelto come preferito in una specifica applicazione o contesto. @it
definition: Hozzákapcsol egy testületet egy nomenhez, egy testület nevéhez, amelyet egy bizonyos alkalmazásban vagy kontextusban előnyben részesítenek. @hu
definition: Liittää yhteisön nomeniin, joka on yhteisön nimi, joka on valittu ensisijaiseksi tietyssä sovelluksessa tai kontekstissa.
definition: Met une collectivité en relation avec un nomen qui est un nom de collectivité faisant l’objet d’un choix privilégié dans une application ou un contexte spécifiques. @fr
definition: Relaciona una entitat corporativa amb un nomen que és un nom d’entitat corporativa que se selecciona com a preferent en una aplicació o un context específic. @ca
definition: Relateert een corporatie aan een nomen dat is een naam van corporatie die de voorkeur heeft gekregen in een specifieke applicatie of context. @nl
definition: Relaterer en korporasjon til et navn for korporasjon som er valgt som preferanse i en bestemt applikasjon eller kontekst. @no
definition: Relaterer en korporation til et navn på korporation, som er valgt som præference i en specifik anvendelse eller kontekst. @da
definition: Relates a corporate body to a nomen that is a name of corporate body that is selected for preference in a specific application or context. @en

yhteisön muutoshakemus oikeudessa
has element type: 2
instruction number: 18.5
toolkit definition: A work that is a legal work of a higher court that records a decision of a lower court that is appealed by a corporate body. @en
toolkit definition: Augstākas instances tiesas spriedums zemākās instances tiesas sprieduma izskatīšanā, ko pārsūdz institūcija. @lv
toolkit definition: Bir tüzel kişi tarafından temyiz edilen bir alt mahkeme kararını kaydeden yüksek mahkemeye ait hukuki bir çalışma. @tr
toolkit definition: Een juridisch werk van een hoger gerechtshof dat een oordeel vastlegt van een lager gerechtshof waarbij een corporatie in beroep gaat. @nl
toolkit definition: Ein juristisches Werk einer höheren Instanz, das ein Gerichtsurteil einer unteren Instanz erfasst, gegen das eine Körperschaft Rechtsmittel (Berufung/Revision) einlegt. @de
toolkit definition: Et juridisk verk fra en høyere rettsinstans som registrerer en avgjørelse fra en lavere rettsinstans som ankes av en korporasjon. @no
toolkit definition: Felsőbb bíróság jogi műve, amely rögzíti egy alsóbb szintű bíróságnak azt az ítéletét, amelyet egy testület megfellebbezett. @hu
toolkit definition: Juridisk værk fra en højere retsinstans, som registerer en lavere retsinstans dom, som er appelleret af en korporation. @da
toolkit definition: Kõrgema astme kohtu juriidiline teos, milles on dokumenteeritud alama astme kohtu otsus, mille peale asutus on esitanud apellatsiooni. @et
toolkit definition: Obra que és una obra jurídica d’un tribunal superior que enregistra una decisió d’un tribunal inferior que és apel·lada per una entitat corporativa. @ca
toolkit definition: Opera legale di un tribunale superiore che registra una decisione di un tribunale inferiore al quale è stato presentato un ricorso da un ente. @it
toolkit definition: Ylemmän oikeusasteen juridinen teos, jolla yhteisö hakee muutosta alemman oikeusasteen päätökseen.
toolkit definition: Œuvre juridique d’un tribunal supérieur qui enregistre une décision d’un tribunal inférieur portée en appel par une collectivité. @fr
toolkit definition: Μια νομική υπόθεση ανώτερου δικαστηρίου που εκδικάζει μία απόφαση ενός κατώτερου δικαστηρίου για την οποία ο εφεσιβάλλων είναι ένα συλλογικό όργανο. @el
toolkit definition: عمل قضائي لمحكمة أعلى درجة تسجل قرار محكمة أدنى درجة تطعن فيه هيئة. @ar
toolkit definition: 一种记录下级法院被一个团体起诉的决定的上级法院的法律作品 @zh-hans
toolkit label: Körperschaft als Berufungsklagende/Berufungsklagender/Revisionsklagende/Revisionsklagender von @de
toolkit label: aanklager in beroep-corporatie van @nl
toolkit label: apellant (asutus) teoses @et
toolkit label: appellant corporate body of @en
toolkit label: appellantkorporasjon for @no
toolkit label: collectivité appelante de @fr
toolkit label: ente ricorrente di @it
toolkit label: entitat corporativa apel·lant de @ca
toolkit label: fellebbező testülete: @hu
toolkit label: ir apelācijas iesniedzējs (institūcija) @lv
toolkit label: korporation, som er appellant af @da
toolkit label: temyiz eden tüzel kişi @tr
toolkit label: yhteisön muutoshakemus oikeudessa
toolkit label: εναγόμενο συλλογικό όργανο του @el
toolkit label: هيئة مستأنِّفة @ar
toolkit label: ……的上诉团体 @zh-hans
has subproperty: P50042
lexical alias: appellantCorporateBodyOf.en
status: Published
type: Property
domain: C10005
label: apellant (asutus) teoses @et
label: er appellantkorporasjon for @no
label: er korporation, som er appellant af @da
label: est une collectivité appelante de @fr
label: fellebbező testülete: @hu
label: ir apelācijas iesniedzējs (institūcija) @lv
label: is aanklager in beroep-corporatie van @nl
label: is appellant corporate body of @en
label: ist Körperschaft als Berufungsklagende/Berufungsklagender/Revisionsklagende/Revisionsklagender von @de
label: temyiz eden tüzel kişisidir @tr
label: è un ente ricorrente di @it
label: és entitat corporativa apel·lant de @ca
label: είναι εκαλλούν/αναιρεσείον συλλογικό όργανο του @el
label: هي هيئة مستأنفة لـ @ar
label: 是……的上诉团体 @zh-hans
sub property of: er korporation, som er ophav til værk af
alternative label: yhteisön muutoshakemus
definition: Bir tüzel kişiyi, bir tüzel kuruluş tarafından temyiz edilen bir alt mahkemenin kararını kaydeden bir üst mahkemenin yasal çalışması olan bir eserle ilişkilendirir. @tr
definition: Correla un ente a un'opera legale di un tribunale superiore che registra una decisione di un tribunale inferiore al quale è stato presentato un ricorso da un ente. @it
definition: Hozzákapcsol egy testületet egy felsőbb bíróság jogi művéhez, amely rögzíti egy alsóbb bíróság ítéletét, amelyet egy testület megfellebbezett. @hu
definition: Liittää yhteisön ylemmän oikeusasteen juridiseen teokseen, jolla yhteisö hakee muutosta alemman oikeusasteen päätökseen.
definition: Met une collectivité en relation avec une œuvre juridique d’un tribunal supérieur qui enregistre une décision d’un tribunal inférieur portée en appel par une collectivité. @fr
definition: Relaciona una entitat corporativa amb una obra que és una obra jurídica d’un tribunal superior que enregistra una decisió d’un tribunal inferior que és apel·lada per una entitat corporativa. @ca
definition: Relateert een corporatie aan een juridisch werk van een hoger gerechtshof dat een oordeel vastlegt van een lager gerechtshof waarbij een corporatie in beroep gaat. @nl
definition: Relaterer en korporasjon til et juridisk verk fra en høyere rettsinstans som registrerer en avgjørelse fra en lavere rettsinstans som ankes av en korporasjon. @no
definition: Relaterer en korporation til et juridisk værk fra en højere retsinstans, som registerer en lavere retsinstans dom, som er appelleret af en korporation. @da
definition: Relates a corporate body to a work that is a legal work of a higher court that records a decision of a lower court that is appealed by a corporate body. @en
definition: Sasaista institūciju ar augstākas instances tiesas spriedumu zemākās instances tiesas sprieduma izskatīšanā, ko pārsūdz institūcija. @lv
definition: Seostab asutuse kõrgema astme kohtu juriidilise teosega, milles on dokumenteeritud alama astme kohtu otsus, mille peale asutus on esitanud apellatsiooni. @et
definition: Setzt eine Körperschaft in Beziehung zu einem juristischen Werk einer höheren Instanz, das ein Gerichtsurteil einer unteren Instanz erfasst, gegen das eine Körperschaft Rechtsmittel (Berufung/Revision) einlegt. @de
definition: Συνδέει ένα συλλογικό όργανο, το οποίο ασκεί έφεση εναντίον απόφασης κατώτερου δικαστηρίου, που καταχωρίστηκε στα πρακτικά ενός ανωτέρου δικαστηρίου, με ένα έργο. @el
definition: يربط هيئة بعمل قضائي لمحكمة أعلى درجة يُسجل قرار محكمة أدنى درجة تطعن فيه هيئة. @ar
definition: 将一个团体与一种记录下级法院被一个团体起诉的决定的上级法院的法律作品关联起来。 @zh-hans

yhteisökantaja teoksessa
has element type: 2
instruction number: 18.5
toolkit definition: A work that involves a responsibility for bringing a suit as a corporate body in a civil proceeding. @en
toolkit definition: Bir hukuk davasında tüzel kişi olarak dava açma sorumluluğunu içeren bir çalışma. @tr
toolkit definition: Darbs, kas ietver atbildību par to, ka institūcija ceļ prasību civiltiesā. @lv
toolkit definition: Een werk dat met zich meebrengt een verantwoordelijkheid voor het aanspannen van een proces als een corporatie in een civielrechtelijke procedure. @nl
toolkit definition: Egy mű, amelyhez hozzátartozik egy testület felelőssége egy per elindításáért egy polgári jogi eljárásban. @hu
toolkit definition: Ein Werk, bei der eine Körperschaft eine Klage in ein Zivilverfahren einreicht. @de
toolkit definition: Et verk som involverer ansvar for å bringe fram et søksmål som en korporasjon i en sivilrettslig sak. @no
toolkit definition: Obra que implica una responsabilitat d’interposar una demanda civil com a entitat corporativa en un procés civil. @ca
toolkit definition: Opera che implica una responsabilità per intentare una causa come ente in un processo civile. @it
toolkit definition: Teos, jossa yhteisö on vastuussa kanteen tuomisesta siviilioikeudenkäyntiin.
toolkit definition: Teos, mis sisaldab asutuse vastutust tsiviilkohtumenetluses hagi esitamise eest. @et
toolkit definition: Værk, som involverer et ansvar for at anlægge en sag, som en korporation, i en civilproces. @da
toolkit definition: Œuvre qui comporte une responsabilité consistant à intenter une poursuite civile en tant que collectivité. @fr
toolkit definition: Ένα έργο που περιλαμβάνει την ευθύνη για την άσκηση αγωγής αστικού δικαίου από ένα συλλογικό όργανο. @el
toolkit definition: عمل يقتضي تحمل هيئة المسئولية عن إقامة دعوى مدنية. @ar
toolkit definition: 涉及民事诉讼中作为团体起诉的责任的作品 @zh-hans
toolkit label: Körperschaft als Zivilklägerin/Zivilkläger von @de
toolkit label: aanklager-corporatie van @nl
toolkit label: collectivité demanderesse de @fr
toolkit label: davacı tüzel kişisi @tr
toolkit label: entitat corporativa demandant de @ca
toolkit label: felperes testülete: @hu
toolkit label: hageja (asutus) teoses @et
toolkit label: ir prasītājs (institūcija) @lv
toolkit label: korporation, som er sagsøger af @da
toolkit label: plaintiff corporate body of @en
toolkit label: querelante ente di @it
toolkit label: saksøker - korporasjon for @no
toolkit label: yhteisökantaja teoksessa
toolkit label: ενάγον συλλογικό όργανο του @el
toolkit label: هيئة مدعية لـ @ar
toolkit label: ……的原告团体 @zh-hans
has subproperty: P50043
lexical alias: plaintiffCorporateBodyOf.en
status: Published
type: Property
domain: C10005
label: davacı tüzel kişisidir @tr
label: er korporation, som er sagsøger af @da
label: er saksøker - korporasjon for @no
label: est une collectivité demanderesse de @fr
label: felperes testülete a következőnek: @hu
label: hageja (asutus) teoses @et
label: ir prasītājs (institūcija) @lv
label: is aanklager-corporatie van @nl
label: is plaintiff corporate body of @en
label: ist Körperschaft als Zivilklägerin/Zivilkläger von @de
label: è querelante ente di @it
label: és entitat corporativa demandant de @ca
label: είναι ενάγον συλλογικό όργανο του @el
label: هي هيئة مُدعية لـ @ar
label: 是……的原告团体 @zh-hans
sub property of: er korporation, som er ophav til værk af
alternative label: kanne
alternative label: yhteisön tekemä kanne
definition: Bir tüzel kişiyi, bir hukuk davasında tüzel kuruluş olarak dava açma sorumluluğunu içeren bir eserle ilişkilendirir. @tr
definition: Correla un ente a un'opera che implica una responsabilità per intentare una causa come ente in un processo civile. @it
definition: Hozzákapcsol egy testületet egy műhöz, amelyhez hozzátartozik egy testület felelőssége egy per elindításáért egy polgári jogi eljárásban. @hu
definition: Liittää yhteisön teokseen, jossa yhteisö on vastuussa kanteen tuomisesta siviilioikeudenkäyntiin.
definition: Met une collectivité en relation avec une œuvre qui comporte une responsabilité consistant à intenter une poursuite civile en tant que collectivité. @fr
definition: Relaciona una entitat corporativa amb una obra que implica una responsabilitat d’interposar una demanda civil com a entitat corporativa en un procés civil. @ca
definition: Relateert een corporatie aan een werk dat met zich meebrengt een verantwoordelijkheid voor het aanspannen van een proces als een corporatie in een civielrechtelijke procedure. @nl
definition: Relaterer en korporasjon til et verk som involverer ansvar for å bringe fram et søksmål som en korporasjon i en sivilrettslig sak. @no
definition: Relaterer en korporation til et værk, som involverer et ansvar for at anlægge en sag, som en korporation, i en civilproces. @da
definition: Relates a corporate body to a work that involves a responsibility for bringing a suit as a corporate body in a civil proceeding. @en
definition: Sasaista institūciju ar darbu, kas ietver atbildību par to, ka institūcija ceļ prasību civiltiesā. @lv
definition: Seostab asutuse teosega, mis sisaldab asutuse vastutust tsiviilkohtumenetluses hagi esitamise eest. @et
definition: Setzt eine Körperschaft in Beziehung zu einem Werk, bei dem eine Körperschaft eine Klage in ein Zivilverfahren einreicht. @de
definition: Συνδέει ένα συλλογικό όργανο, το οποίο ασκεί αγωγή στο πλαίσιο αστικής διαδικασίας, με ένα έργο. @el
definition: يربط هيئة بعمل يقتضي تحملها المسئولية كهيئة عن إقامة دعوى مدنية. @ar
definition: 将一个团体与涉及民事诉讼中作为团体起诉的责任的作品关联起来。 @zh-hans

sääntöjen ohjaaman tuomioistuimen päätös
has element type: 2
instruction number: 18.5
toolkit definition: A work of a court governed by court rules, regardless of their official nature. @en
toolkit definition: Bir eserin resmi niteliğine bakılmaksızın, mahkeme kuralları tarafından yönetilen bir mahkemenin eseri. @tr
toolkit definition: Darbs, ko radījusi tiesa saskaņā ar procesuālajiem noteikumiem (neatkarīgi no to formālā rakstura). @lv
toolkit definition: Een werk van een hof geregeerd door rechtbankregels, ongeacht hun officiële aard. @nl
toolkit definition: Egy mű, amely bírósági szabályzatok által irányított bíróság hatálya alá tartozik, függetlenül a mű hivatalos természetétől. @hu
toolkit definition: Ein Werk eines Gerichts, das durch gerichtliche Verfahrensvorschriften geregelt wird, unabhängig von deren förmlicher Rechtsnatur. @de
toolkit definition: Et verk fra en domstol som styres av rettergangsregler, uavhengig av deres offisielle status. @no
toolkit definition: Obra d’un tribunal regit per regles de procediment, independentment de la seva natura oficial. @ca
toolkit definition: Opera di un tribunale disciplinata da regole giudiziarie, indipendentemente dal loro carattere ufficiale. @it
toolkit definition: Teos, jonka on tehnyt sääntöjen ohjaama tuomioistuin riippumatta säännön virallisesta luonteesta.
toolkit definition: Teos, mille on loonud menetluseeskirjadest (sõltumata nende vormilisest olemusest) juhinduv kohus. @et
toolkit definition: Værk fra en retsinstans, som er underlagt retsregler, uden hensyn til deres officielle status. @da
toolkit definition: Œuvre d’un tribunal régi par des règles de pratique, sans égard à leur nature officielle. @fr
toolkit definition: Ένα έργο ενός δικαστηρίου που εφαρμόζει δικαστικούς/δικονομικούς κανόνες, ανεξάρτητα από τον επίσημο χαρακτήρα τους. @el
toolkit definition: عمل محكمة وفقا للوائح المحاكم، بغض النظر عن طابعها الرسمي. @ar
toolkit definition: 一个通过法院规则（不管其与作品的正式性质）受管辖的法院的作品 @zh-hans
toolkit label: autorità giudiziaria disciplinata da @it
toolkit label: court governed of @en
toolkit label: domstol som styres for @no
toolkit label: durch Verfahrensvorschriften geregeltes Gericht von @de
toolkit label: hof geregeerd van @nl
toolkit label: irányított bírósága: @hu
toolkit label: kohus teoses @et
toolkit label: mahkeme tarafından yönetilen @tr
toolkit label: procesuālas tiesas spriedums @lv
toolkit label: retsinstans underlagt af @da
toolkit label: sääntöjen ohjaaman tuomioistuimen päätös
toolkit label: tribunal regit de @ca
toolkit label: tribunal régi de @fr
toolkit label: δικαστήριο διεπόμενο του @el
toolkit label: محكمة تعمل وفقا لـ @ar
toolkit label: ……的受管辖的法院 @zh-hans
has subproperty: P50044
lexical alias: courtGovernedOf.en
status: Published
type: Property
domain: C10005
label: er domstol som styres for @no
label: er retsinstans underlagt af @da
label: est un tribunal régi de @fr
label: ir procesuālas tiesas spriedums @lv
label: irányított bírósága a következőnek: @hu
label: is court governed of @en
label: is hof geregeerd van @nl
label: ist durch Verfahrensvorschriften geregeltes Gericht von @de
label: kohus teoses @et
label: mahkeme yönetimindedir @tr
label: è autorità giudiziaria disciplinata da @it
label: és tribunal regit de @ca
label: είναι δικαστήριο διεπόμενο του @el
label: هي محكمة تعمل وفقا لـ @ar
label: 是……的受管辖的法院 @zh-hans
sub property of: er korporation, som er ophav til værk af
definition: Bir tüzel kişi, resmi niteliğine bakılmaksızın, mahkeme kuralları tarafından yönetilen bir mahkemenin bir eseri ile ilişkilendirir. @tr
definition: Correla un ente a un'opera di un tribunale disciplinata da regole giudiziarie, indipendentemente dal loro carattere ufficiale, rispetto a un'opera. @it
definition: Hozzákapcsol egy testületet egy műhöz, amely bírósági szabályzatok által irányított bíróság hatálya alá tartozik, függetlenül a mű hivatalos természetétől. @hu
definition: Liittää yhteisön teokseen, joka on sääntöjen ohjaaman tuomioistuimen tekemä, riippumatta säännön virallisesta luonteesta.
definition: Met une collectivité en relation avec une œuvre d’un tribunal régi par des règles de pratique, sans égard à leur nature officielle. @fr
definition: Relaciona una entitat corporativa amb una obra d’un tribunal regit per regles de procediment, independentment de la seva natura oficial. @ca
definition: Relateert een corporatie aan een werk van een hof geregeerd door rechtbankregels, ongeacht hun officiële aard. @nl
definition: Relaterer en korporasjon til et verk fra en domstol som styres av rettergangsregler, uavhengig av deres offisielle status. @no
definition: Relaterer en korporation til et værk fra en retsinstans, som er underlagt retsregler, uden hensyn til deres officielle status. @da
definition: Relates a corporate body to a work of a court governed by court rules, regardless of their official nature to a work. @en
definition: Sasaista institūciju ar darbu, ko radījusi tiesa saskaņā ar procesuālajiem noteikumiem (neatkarīgi no to formālā rakstura). @lv
definition: Seostab asutuse teosega, mille on loonud menetluseeskirjadest (sõltumata nende vormilisest olemusest) juhinduv kohus. @et
definition: Setzt eine Körperschaft in Beziehung zu einem Werk eines Gerichts, das durch gerichtliche Verfahrensvorschriften geregelt wird, unabhängig von deren förmlicher Rechtsnatur. @de
definition: Συνδέει ένα δικαστήριο, το οποίο εφαρμόζει δικαστικούς/δικονομικούς κανόνες, ανεξάρτητα από τον επίσημο χαρακτήρα τους, με ένα έργο. @el
definition: يربط هيئة بعمل محكمة تعمل وفقا للوائح المحاكم، بغض النظر عن طابعها الرسمي. @ar
definition: 将一个团体与一个通过法院规则（不管其与作品的正式性质）受管辖的法院的作品关联起来。 @zh-hans

kokoelman muodostaja (toimija) kappaleessa
has element type: 2
instruction number: 18.5
toolkit definition: An item that is brought together by an agent with items from various sources that are arranged, described, or catalogued as a collection. (Deprecated) @en
toolkit definition: Een item dat samengebracht is door een actor met items van diverse bronnen die gearrangeerd, beschreven of gecatalogiseerd zijn als een verzameling. @nl
toolkit definition: Egy példány, amelyet egy ágens különböző forrásokból származó, gyűjteményként rendezett, leírt és katalogizált példányokkal fog össze. @hu
toolkit definition: Ein Exemplar, das von einem Akteur mit Materialien aus unterschiedlichen Quellen zusammengetragen wird, die dann als Sammlung geordnet, beschrieben oder katalogisiert werden. @de
toolkit definition: Eksemplar, mille tegija on kokku pannud teiste eri allikatest kogutud eksemplaridega, mis on korrastatud, kirjeldatud ja kataloogitud koguna. @et
toolkit definition: Eksemplar, som er sammenført af en agent med eksemplarer fra forskellige kilder, som er arrangeret, beskrevet og katalogiseret som en samling. @da
toolkit definition: Et eksemplar som er satt sammen av en agent av eksemplarer fra ulike kilder og som deretter arrangeres, beskrives og katalogiseres som en samling. @no
toolkit definition: Item che è raccolto insieme da agente con item di varie sorgenti che sono organizzati, descritti e catalogati come una raccolta @it
toolkit definition: Item qui est regroupé par un agent avec des items de diverses sources qui sont arrangés, décrits ou catalogués comme une collection de ressources. @fr
toolkit definition: Kappale, jonka toimija on koonnut osaksi järjestettyä, kuvailtua tai luetteloitua kokoelmaa yhdessä muiden eri lähteistä olevien kappaleiden kanssa.
toolkit definition: Vienība, ko aģents apkopojis kopā ar citām vienībām no dažādiem avotiem, kas ir sakārtotas, aprakstītas un kataloģizētas kā kolekcija. @lv
toolkit definition: Ítem que és aplegat per un agent amb ítems de diverses fonts que s’arrangen, es descriuen o es cataloguen com una col·lecció. @ca
toolkit definition: Ένα τεκμήριο που συνενώνεται με τεκμήρια από διάφορες πηγές τα οποία εν συνεχεία οργανώνονται, περιγράφονται και καταλογογραφούνται ως μία συλλογή. @el
toolkit definition: مفردة جمعها وكيل مع مفردات من مصادر مختلفة رُتبت ووُصفت وفُهرست كمجموعة. @ar
toolkit label: Akteur als Sammlerin/Sammler von @de
toolkit label: agent collectionneur de @fr
toolkit label: agent col·leccionista de @ca
toolkit label: agent, som er samler af @da
toolkit label: collector agent of (Deprecated) @en
toolkit label: collezionista agente di @it
toolkit label: ir kolekcionārs (aģents) @lv
toolkit label: kogu moodustaja (tegija) eksemplarile @et
toolkit label: kokoelman muodostaja (toimija) kappaleessa
toolkit label: kollektor ágense: @hu
toolkit label: samler av (agent) @no
toolkit label: verzamelaar-actor van @nl
toolkit label: συλλέκτης φορέας του @el
toolkit label: وكيل جامع @ar
has subproperty: kokoelman muodostaja (henkilö) kappaleessa
has subproperty: kokoelman muodostaja (yhteistoimija) kappaleessa
has subproperty: P50045
lexical alias: collectorAgentOf.en
status: Deprecated
type: Property
domain: C10002
label: er agent, som er samler af @da
label: er samler av (agent) @no
label: est un agent collectionneur de @fr
label: ir kolekcionārs (aģents) @lv
label: is collector agent of (Deprecated) @en
label: is verzamelaar-actor van @nl
label: ist Akteur als Sammlerin/Sammler von @de
label: kogu moodustaja (tegija) eksemplarile @et
label: kollektor ágense a következőnek: @hu
label: è collezionista agente di @it
label: és agent col·leccionista de @ca
label: είναι συλλέκτης φορέας του @el
label: هو وكيل جامع لـ @ar
sub property of: kuraattori (toimija) kappaleelle
alternative label: Sammlerin/Sammler von @de
alternative label: collectionneur de @fr
alternative label: collector of @en
alternative label: collezionista di @it
alternative label: col·leccionista de @ca
alternative label: kogu moodustaja eksemplarile @et
alternative label: koguja eksemplarile @et
alternative label: kokoelma
alternative label: kollektora: @hu
alternative label: samler af @da
alternative label: samler av @no
alternative label: συλλέκτης του @el
alternative label: جامع لـ @ar
definition: Correla un agente a un item che è raccolto insieme da un agente con un item di varie sorgenti che sono organizzati, descritti e catalogati come una raccolta. @it
definition: Hozzákapcsol egy ágenst egy példányhoz, amely egy ágens különböző forrásokból származó, gyűjteményként rendezett, leírt és katalogizált példányokkal fog össze. @hu
definition: Liittää toimijan kappaleeseen, jonka toimija on koonnut järjestetyksi, kuvailluksi tai luetteloiduksi kokoelmaksi eri lähteistä olevista kappaleista.
definition: Met un agent en relation avec un item qui est regroupé par un agent avec des items de diverses sources qui sont arrangés, décrits ou catalogués comme une collection de ressources. @fr
definition: Relaciona un agent amb un ítem que és aplegat per un agent amb ítems de diverses fonts que s’arrangen, es descriuen o es cataloguen com una col·lecció. @ca
definition: Relateert een actor aan een item dat samengebracht is door een actor met items van diverse bronnen die gearrangeerd, beschreven of gecatalogiseerd zijn als een verzameling. @nl
definition: Relaterer en agent til et eksemplar som er satt sammen av en agent av eksemplarer fra ulike kilder og som deretter arrangeres, beskrives og katalogiseres som en samling. @no
definition: Relaterer en agent til et eksemplar, som er sammenført af en agent med eksemplarer fra forskellige kilder, som er arrangeret, beskrevet og katalogiseret som en samling. @da
definition: Relates an agent to an item that is brought together by an agent with items from various sources that are arranged, described, or catalogued as a collection. (Deprecated) @en
definition: Sasaista aģentu ar vienību, ko aģents apkopojis kopā ar citām vienībām no dažādiem avotiem, kas ir sakārtotas, aprakstītas un kataloģizētas kā kolekcija. @lv
definition: Seostab tegija eksemplariga, mille tegija on kokku pannud teiste eri allikatest kogutud eksemplaridega, mis on korrastatud, kirjeldatud ja kataloogitud koguna. @et
definition: Setzt einen Akteur in Beziehung zu einem Exemplar, das von einem Akteur mit Materialien aus unterschiedlichen Quellen zusammengetragen wird, die dann als Sammlung geordnet, beschrieben oder katalogisiert werden. @de
definition: Συνδέει έναν έφορο, ο οποίος συγκεντρώνει αντικείμενα από διάφορες πηγές, τα οποία εν συνεχεία οργανώνονται, περιγράφονται και καταλογογραφούνται ως μία συλλογή από αντικείμενα, με ένα αντικείμενο. @el
definition: يربط وكيلا بمفردة جمعها وكيل مع مفردات من مصادر مختلفة رُتبت وُوصفت وفُهرست كمجموعة. @ar

kokoelman luetteloija (toimija) kappaleessa
has element type: 2
instruction number: 18.5
toolkit definition: An item that is listed or inventoried by an agent in an aggregate work such as a collection of items or works. (Deprecated) @en
toolkit definition: Een item dat vermeld of geïnventariseerd is door een actor in een aggregaatwerk zoals een collectie van items of werken. @nl
toolkit definition: Egy példány, amelyet egy ágens felsorol vagy leltárba vesz egy aggregáló műben, mint például példányok vagy művek gyűjteményében. @hu
toolkit definition: Ein Exemplar, das von einem Akteur als aggregiertes Werk verzeichnet oder inventarisiert wird, wie zum Beispiel eine Sammlung von Exemplaren oder Werken. @de
toolkit definition: Eksemplar, mille tegija on loetlenud või inventeerinud liitumit moodustavate eksemplaride või teoste kogu jaoks. @et
toolkit definition: Eksemplar, som er listet eller opstillet af en agent i et samlingsværk, såsom en samling af eksemplarer eller værker. @da
toolkit definition: Et eksemplar som er oppført av en agent i en liste eller oversikt over eksemplarene i et samleverk, for eksempel en samling av eksemplarer eller verk. @no
toolkit definition: Item che è elencato o inventariato da un agente in un'opera aggregata come una raccolta di item o opere. @it
toolkit definition: Item qui est listé ou inventorié par un agent dans une œuvre agrégative telle qu’une collection d’items ou d’œuvres. @fr
toolkit definition: Kappale, jonka toimija on luetteloinut tai inventoinut osaksi aggregaattiteosta, kuten kappaleista tai teoksista koostuvaa kokoelmaa.
toolkit definition: Vienība, ko aģents uzskaitījis vai inventarizējis apkopotā darbā, piemēram, vienību vai darbu kolekcijā. @lv
toolkit definition: Ítem que és llistat o inventariat per un agent en una obra agregada,com ara una col·lecció d’ítems o d’obres. @ca
toolkit definition: Ένα αντικείμενο το οποίο απαριθμείται ή καταγράφεται σε ένα συγκεντρωτικό έργο, όπως μία συλλογή αντικειμένων ή έργων. @el
toolkit definition: مفردة مسجلة في قائمة أو قام وكيل بجردها في عمل تجميعي، مثل مجموعة من المفردات أو الأعمال. @ar
toolkit label: Akteur als Registrarin/Registrar von @de
toolkit label: agent catalogueur d’une collection de ressources de @fr
toolkit label: agent conservador de col·leccions de recursos de @ca
toolkit label: agent, som er samlingsregistrator af @da
toolkit label: collectieregistrator-actor van @nl
toolkit label: collection registrar agent of (Deprecated) @en
toolkit label: conservatore della raccolta agente di @it
toolkit label: gyűjtemény-nyilvántartó ágense: @hu
toolkit label: ir kolekcijas reģistrētājs (aģents) @lv
toolkit label: kogu registreerija (tegija) eksemplarile @et
toolkit label: kokoelman luetteloija (toimija) kappaleessa
toolkit label: samlingsregistrator for (agent) @no
toolkit label: καταχωρητής συλλογής φορέας του @el
toolkit label: وكيل مسجِل مجموعة لـ @ar
has subproperty: kokoelman luetteloija (henkilö) kappaleessa
has subproperty: kokoelman luetteloija (yhteistoimija) kappaleessa
has subproperty: P50046
lexical alias: collectionRegistrarAgentOf.en
status: Deprecated
type: Property
domain: C10002
label: er agent, som er samlingsregistrator af @da
label: er samlingsregistrator for (agent) @no
label: est un agent catalogueur d’une collection de ressources de @fr
label: gyűjtemény-nyilvántartó ágense a következőnek: @hu
label: ir kolekcijas reģistrētājs (aģents) @lv
label: is collectieregistrator-actor van @nl
label: is collection registrar agent of (Deprecated) @en
label: ist Akteur als Registrarin/Registrar von @de
label: kogu registreerija (tegija) eksemplarile @et
label: è conservatore della raccolta agente di @it
label: és agent conservador de col·leccions de recursos de @ca
label: είναι καταχωρητής συλλογής φορέας του @el
label: هو وكيل مسجل مجموعة لـ @ar
sub property of: kuraattori (toimija) kappaleelle
alternative label: Registrar von @de
alternative label: agent conservateur d’une collection de ressources de @fr
alternative label: collection registrar of @en
alternative label: conservador de col·leccions de recursos @ca
alternative label: conservatore della raccolta di @it
alternative label: gyűjtemény-nyilvántartója: @hu
alternative label: kogu registreerija eksemplarile @et
alternative label: kokoelmarekisteri
alternative label: samlingsregistrator af @da
alternative label: samlingsregistrator for @no
alternative label: καταχωρητής συλλογής του @el
alternative label: مسجل مجموعة لـ @ar
definition: Correla un agente a un item che è elencato o inventariato da un agente in un'opera aggregata come una raccolta di item o opere. @it
definition: Hozzákapcsol egy ágenst egy példányhoz, amelyet egy ágens felsorol vagy leltárba vesz egy aggregáló műben, mint például példányok vagy művek gyűjteményében. @hu
definition: Liittää toimijan kappaleeseen, jonka toimija on luetteloinut tai inventoinut osaksi aggregaattiteosta, kuten kappaleista tai teoksista koostuvaa kokoelmaa.
definition: Met un agent en relation avec un item qui est listé ou inventorié par un agent dans une œuvre agrégative telle qu’une collection d’items ou d’œuvres. @fr
definition: Relaciona un agent amb un ítem que és llistat o inventariat per un agent en una obra agregada com ara una col·lecció d’ítems o d’obres. @ca
definition: Relateert een actor aan een item dat vermeld of geïnventariseerd is door een actor in een aggregaatwerk zoals een collectie van items of werken. @nl
definition: Relaterer en agent til et eksemplar som er oppført av en agent i en liste eller oversikt over eksemplarene i et samleverk, for eksempel en samling av eksemplarer eller verk. @no
definition: Relaterer en agent til et eksemplar, som er listet eller opstillet af en agent i et samlingsværk, såsom en samling af eksemplarer eller værker. @da
definition: Relates an agent to an item that is listed or inventoried by an agent in an aggregate work such as a collection of items or works. (Deprecated) @en
definition: Sasaista aģentu ar vienību, ko aģents uzskaitījis vai inventarizējis apkopotā darbā, piemēram, vienību vai darbu kolekcijā. @lv
definition: Seostab tegija eksemplariga, mille tegija on loetlenud või inventeerinud liitumit moodustavate eksemplaride või teoste kogu jaoks. @et
definition: Setzt einen Akteur in Beziehung zu einem Exemplar, das von einem Akteur als aggregiertes Werk verzeichnet oder inventarisiert wird, wie zum Beispiel eine Sammlung von Exemplaren oder Werken. @de
definition: Συνδέει έναν έφορο ο οποίος απαριθμεί ή καταγράφει τα αντικείμενα σε ένα συγκεντρωτικό έργο, όπως μία συλλογή αντικειμένων ή έργων, με ένα αντικείμενο. @el
definition: يربط وكيلا بمفردة مسجلة في قائمة أو قام وكيل بجردها في عمل تجميعي، مثل مجموعة مفردات أو أعمال. @ar

tallettaja (toimija) kappaleessa
has element type: 2
instruction number: 18.5
toolkit definition: An item that is deposited by an agent into the custody of another agent without transferring ownership. @en
toolkit definition: Bir temsilci tarafından mülkiyeti devretmeden başka bir temsilci gözetimine bırakılan bir kopya. @tr
toolkit definition: Een item dat door een actor in bewaring is gegeven bij een andere actor zonder overdracht van eigenaarschap. @nl
toolkit definition: Egy példány, amelyet egy ágens egy másik ágens felügyelete alá helyez anélkül, hogy tulajdonjogot ruházna át. @hu
toolkit definition: Ein Exemplar, das von einem Akteur in die Obhut eines anderen Akteurs gegeben wird, ohne das Eigentumsrecht zu übertragen. @de
toolkit definition: Eksemplar, mille tegija on deponeerinud teise tegija vastutavale hoiule ilma omandiõiguse üleminekuta. @et
toolkit definition: Et eksemplar som av en agent er deponert til forvaring av en annen agent uten at eierskapet overføres. @no
toolkit definition: Item che èdepositato da agentedella custodia di altro agente senza trasferirne la proprietà. @it
toolkit definition: Item qui est déposé par un agent sous la garde d’un autre agent sans que sa propriété ne soit transférée. @fr
toolkit definition: Kappale, jonka toimija on luovuttanut toisen toimijan haltuun siirtämättä omistajuutta.
toolkit definition: Vienība, ko aģents deponējis cita aģenta uzglabāšanā, vienlaikus saglabājot deponenta īpašumtiesības. @lv
toolkit definition: eksemplar, som er deponeret i forvaring af en agent hos en anden agent, men uden at overgive ejerskab. @da
toolkit definition: Ítem que és dipositat per un agent sota la custòdia d’un altre agent sense transferir-li la propietat. @ca
toolkit definition: Ένα αντίτυπο το οποίο κατατίθεται υπό την επιμέλεια φύλαξης άλλου φορέα, ενόσω ο καταθέτης διατηρεί την ιδιοκτησία. @el
toolkit definition: مفردة أودعها وكيل في عهدة وكيل آخر دون نقل الملكية. @ar
toolkit definition: 被一个行为者储存归另一个行为者保管而不转移所有权的一个单件 @zh-hans
toolkit label: Akteur als Leihgeberin/Leihgeber von @de
toolkit label: agent dipositador de @ca
toolkit label: agent déposant de @fr
toolkit label: agent, som er udlåner af @da
toolkit label: agente depositante di @it
toolkit label: bruikleen-actor van @nl
toolkit label: deponeerija (tegija) eksemplarile @et
toolkit label: deponent av (agent) @no
toolkit label: depositor agent of @en
toolkit label: ir deponētājs (aģents) @lv
toolkit label: letétbe helyező ágense: @hu
toolkit label: mevduatçı temsilci @tr
toolkit label: tallettaja (toimija) kappaleessa
toolkit label: καταθέτης φορέας του @el
toolkit label: وكيل مودع لـ @ar
toolkit label: ……的托存者行为者 @zh-hans
has subproperty: tallettaja (henkilö) kappaleessa
has subproperty: tallettaja (yhteistoimija) kappaleessa
has subproperty: P50047
lexical alias: depositorAgentOf.en
status: Published
type: Property
domain: C10002
label: deponeerija (tegija) eksemplarile @et
label: er agent, som er udlåner af @da
label: er deponent av (agent) @no
label: est un agent déposant de @fr
label: ir deponētājs (aģents) @lv
label: is bruikleen-actor van @nl
label: is depositor agent of @en
label: ist Akteur als Leihgeberin/Leihgeber von @de
label: letétbe helyező ágense a következőnek: @hu
label: mevduatçı temsilisidir @tr
label: è depositante agente di @it
label: és agent dipositador de @ca
label: είναι καταθέτης φορέας του @el
label: هو وكيل مودع لـ @ar
label: 是……的托存者行为者 @zh-hans
sub property of: nykyinen omistaja (toimija) kappaleessa
alternative label: Leihgeber von @de
alternative label: deponeerija eksemplarile @et
alternative label: deponent av @no
alternative label: deponointi
alternative label: depositante de @es
alternative label: depositante di @it
alternative label: depositor of @en
alternative label: dipositador de @ca
alternative label: déposant de @fr
alternative label: letétbe helyezője: @hu
alternative label: mevduatçı @tr
alternative label: udlåner af @da
alternative label: καταθέτης του @el
alternative label: مودع @ar
alternative label: ……的托存者 @zh-hans
definition: Bir temsilciyi, mülkiyeti devretmeden bir temsilci tarafından başka bir temsilcinin gözetimine bırakılan bir kopyayla ilişkilendirir. @tr
definition: Correla un agente a un item che è depositato da agente nella custodia di altro agente senza trasferimento della proprietà. @it
definition: Hozzákapcsol egy ágenst egy példányhoz, amelyet egy másik ágens felügyelete alá helyez anélkül, hogy tulajdonjogot ruházna át. @hu
definition: Liittää toimijan kappaleeseen, jonka toimija on luovuttanut toisen toimijan haltuun siirtämättä omistajuutta.
definition: Met un agent en relation avec un item qui est déposé par un agent sous la garde d’un autre agent sans que sa propriété ne soit transférée. @fr
definition: Relaciona un agent amb un ítem que és dipositat per un agent sota la custòdia d’un altre agent sense transferir-li la propietat. @ca
definition: Relateert een actor aan een item dat door een actor in bewaring is gegeven bij een andere actor zonder overdracht van eigenaarschap. @nl

elokuvaohjaaja (toimija) teoksessa
has element type: 2
instruction number: 18.5
toolkit definition: A work that involves a responsibility of an agent for the general management and supervision of a filmed performance. @en
toolkit definition: Darbs, kas ietver aģenta atbildību par uzfilmētā pasākuma vispārējo vadību un uzraudzību @lv
toolkit definition: Een werk dat met zich meebrengt een verantwoordelijkheid van een actor voor het algemeen beheer en toezicht van een gefilmde uitvoering. @nl
toolkit definition: Egy mű, amelyhez hozzátartozik egy ágens felelőssége egy filmforgatás általános menedzseléséért és felügyeletéért. @hu
toolkit definition: Ein Werk, bei dem ein Akteur für das allgemeine Management und die Leitung einer verfilmten Darbietung verantwortlich ist. @de
toolkit definition: Et verk som involverer ansvar av en agent for generell ledelse av en filmet forestilling. @no
toolkit definition: Filme alınmış bir performansın genel yönetimi ve denetimi için bir temsilcinin sorumluluğunu içeren bir eser. @tr
toolkit definition: Obra que implica una responsabilitat d’un agent en la gestió general i la supervisió d’una actuació filmada. @ca
toolkit definition: Opera che implica una responsabilità di un agente della gestione generale e la supervisione di un'interpretazione filmata. @it
toolkit definition: Teos, joka sisältää toimijan vastuun elokuvatun esityksen yleisestä johtamisesta ja valvonnasta.
toolkit definition: Teos, mis sisaldab tegija vastutust filmitava etenduse üldise juhtimise ja juhendamise eest. @et
toolkit definition: Værk, som involverer en agents ansvar for den generelle ledelse af- og tilsyn med en filmoptagelse. @da
toolkit definition: Œuvre qui comporte une responsabilité de la part d’un agent consistant à assurer la gestion et la supervision générales d’une prestation filmée. @fr
toolkit definition: Ένα έργο το οποίο περιλαμβάνει την ευθύνη για τη γενική διαχείριση και εποπτεία μιας κινηματογραφικής ερμηνείας. @el
toolkit definition: عمل يترتب عليه مسئولية وكيل عن الإدارة العامة والإشراف على أداء مصور. @ar
toolkit definition: 涉及拍摄表演的总体管理和监督的一个行为者的责任的一种作品 @zh-hans
toolkit label: Akteur als Filmregisseurin/Filmregisseur von @de
toolkit label: agent director cinematogràfic de @ca
toolkit label: agent réalisateur de cinéma de @fr
toolkit label: agent, som er filminstruktør af @da
toolkit label: agente regista di film @it
toolkit label: elokuvaohjaaja (toimija) teoksessa
toolkit label: film director agent of @en
toolkit label: film yönetmeni temsilcisi @tr
toolkit label: filmirežissöör (tegija) teoses @et
toolkit label: filmregisseur-actor van @nl
toolkit label: filmregissør av (agent) @no
toolkit label: filmrendező ágense: @hu
toolkit label: ir kinorežisors (aģents) @lv
toolkit label: σκηνοθέτης φορέας του @el
toolkit label: وكيل مخرج فيلم لـ @ar
toolkit label: ……的电影导演行为者 @zh-hans
has subproperty: elokuvaohjaaja (henkilö) teoksessa
has subproperty: elokuvaohjaaja (yhteistoimija) teoksessa
has subproperty: P50048
lexical alias: filmDirectorAgentOf.en
status: Published
type: Property
domain: C10002
label: er agent, som er filminstruktør af @da
label: er filmregissør av (agent) @no
label: est un agent réalisateur de cinéma de @fr
label: film yönetmeni temsilcisidir @tr
label: filmirežissöör (tegija) teoses @et
label: filmrendező ágense a következőnek: @hu
label: ir kinorežisors (aģents) @lv
label: is film director agent of @en
label: is filmregisseur-actor van @nl
label: ist Akteur als Filmregisseurin/Filmregisseur von @de
label: è regista agente di @it
label: és agent director cinematogràfic de @ca
label: είναι σκηνοθέτης φορέας του @el
label: هو وكيل مخرج فيلم لـ @ar
label: 是……的电影导演行为者 @zh-hans
sub property of: ohjaaja (toimija) teoksessa
alternative label: Filmregisseur von @de
alternative label: agent réalisateur de film de @fr
alternative label: director cinematogràfic de @ca
alternative label: director de cine de @es
alternative label: elokuvaohjaaja teoksessa
alternative label: film director of @en
alternative label: film yönetmeni @tr
alternative label: filminstruktør af @da
alternative label: filmirežissöör teoses @et
alternative label: filmregissør av @no
alternative label: filmrendezője: @hu
alternative label: regista di @it
alternative label: réalisateur de cinéma de @fr
alternative label: σκηνοθέτης του @el
alternative label: مخرج الفيلم @ar
alternative label: ……的电影导演 @zh-hans
definition: Bir temsilciyi, filme alınmış bir performansın genel yönetimi ve denetimine ilişkin bir temsilcinin sorumluluğunu içeren eserle ilişkilendirir. @tr
definition: Correla un agente a un'opera che implica una responsabilità di un agente per la gestione generale e la supervisione di un'interpretazione filmata. @it
definition: Hozzákapcsol egy ágenst egy műhöz, amelyhez hozzátartozik egy ágens felelőssége egy filmforgatás általános menedzseléséért és felügyeletéért. @hu
definition: Liittää toimijan teokseen, joka sisältää vastuun elokuvatun esityksen yleisestä johtamisesta ja valvonnasta.
definition: Met un agent en relation avec une œuvre qui comporte une responsabilité de la part d’un agent consistant à assurer la gestion et la supervision générales d’une prestation filmée. @fr
definition: Relaciona un agent amb una obra que implica una responsabilitat d’un agent en la gestió general i la supervisió d’una actuació filmada. @ca

radio-ohjaaja (toimija) teoksessa
has element type: 2
instruction number: 18.5
toolkit definition: A work that involves a responsibility of an agent for the general management and supervision of a radio program. @en
toolkit definition: Bir radyo programının genel yönetimi ve denetimi için bir temsilcinin sorumluluğunu içeren bir eser. @tr
toolkit definition: Darbs, kas ietver aģenta atbildību par radio raidījuma vispārējo vadību un uzraudzību. @lv
toolkit definition: Een werk dat met zich meebrengt een verantwoordelijkheid van een actor voor het algemeen beheer en toezicht van een radioprogramma. @nl
toolkit definition: Egy mű, amelyhez hozzátartozik egy ágens felelőssége egy rádióműsor általános menedzseléséért és felügyeletéért. @hu
toolkit definition: Ein Werk, bei dem ein Akteur für das allgemeine Management und die Leitung einer Hörfunksendung verantwortlich ist. @de
toolkit definition: Et verk som involverer ansvar av en agent for generell ledelse av et radioprogram. @no
toolkit definition: Obra que implica una responsabilitat d’un agent en la gestió general i la supervisió d’un programa radiofònic. @ca
toolkit definition: Opera che implica una responsabilità di un agente della gestione generale e la supervisione di programma radidionico. @it
toolkit definition: Teos, joka sisältää toimijan vastuun radio-ohjelman yleisestä johtamisesta ja valvonnasta.
toolkit definition: Teos, mis sisaldab tegija vastutust raadiosaate üldise juhtimise ja juhendamise eest. @et
toolkit definition: Værk, som involverer en agents ansvar for den generelle ledelse af- og tilsyn med et radioprogram. @da
toolkit definition: Œuvre qui comporte une responsabilité de la part d’un agent consistant à assurer la gestion et la supervision générales d’une émission de radio. @fr
toolkit definition: Ένα έργο το οποίο περιλαμβάνει την ευθύνη για τη γενική διαχείριση και εποπτεία ενός ραδιοφωνικού προγράμματος. @el
toolkit definition: عمل يترتب عليه تحمل وكيل مسئولية الإدارة العامة والإشراف على برنامج إذاعي. @ar
toolkit definition: 涉及广播节目的总体管理和监督的一个行为者的责任的一种作品 @zh-hans
toolkit label: Akteur als Hörfunkregisseurin/Hörfunkregisseur von @de
toolkit label: agent realitzador radiofònic de @ca
toolkit label: agent réalisateur de radio de @fr
toolkit label: er agent, som er radioregissør af @da
toolkit label: ir radio raidījuma direktors (aģents) @lv
toolkit label: raadiorežissöör (tegija) teoses @et
toolkit label: radio director agent of @en
toolkit label: radio-ohjaaja (toimija) teoksessa
toolkit label: radioregisseur-actor van @nl
toolkit label: radioregissør for (agent) @no
toolkit label: radyo yönetmeni temsilcisi @tr
toolkit label: regista radiofonico agente di @it
toolkit label: rádiós rendező ágense: @hu
toolkit label: διευθυντής ραδιοφωνικού προγράμματος φορέας του @el
toolkit label: وكيل مخرج إذاعي لـ @ar
toolkit label: ……的广播导演行为者 @zh-hans
has subproperty: radio-ohjaaja (henkilö) teoksessa
has subproperty: radio-ohjaaja (yhteistoimija) teoksessa
has subproperty: P50049
lexical alias: radioDirectorAgentOf.en
status: Published
type: Property
domain: C10002
label: er agent, som er radioregissør af @da
label: er radioregissør for (agent) @no
label: est un agent réalisateur de radio de @fr
label: ir radio raidījuma direktors (aģents) @lv
label: is radio director agent of @en
label: is radioregisseur-actor van @nl
label: ist Akteur als Hörfunkregisseurin/Hörfunkregisseur von @de
label: raadiorežissöör (tegija) teoses @et
label: radyo yönetmeni temsilcisidir @tr
label: rádiós rendező ágense a következőnek: @hu
label: è regista radiofonico agente di @it
label: és agent realitzador radiofònic de @ca
label: είναι διευθυντής ραδιοφωνικού προγράμματος φορέας του @el
label: هو وكيل مخرج إذاعي لـ @ar
label: 是……的广播导演行为者 @zh-hans
sub property of: ohjaaja (toimija) teoksessa
alternative label: Hörfunkregisseur von @de
alternative label: director de radio de @es
alternative label: raadiorežissöör teoses @et
alternative label: radio director of @en
alternative label: radio-ohjaaja teoksessa
alternative label: radioregissør af @da
alternative label: radioregissør av @no
alternative label: radyo yönetmeni @tr
alternative label: realitzador radiofònic de @ca
alternative label: regista radiofonico di @it
alternative label: rádiós rendezője: @hu
alternative label: réalisateur de radio de @fr
alternative label: ραδιοφωνικός διευθυντής του @el
alternative label: مخرج إذاعي @ar
alternative label: ……的广播导演 @zh-hans
definition: Bir temsilciyi, bir radyo programının genel yönetimi ve denetimine ilişkin bir temsilcinin sorumluluğunu içeren eserle ilişkilendirir. @tr
definition: Correla un agente a un opera che implica una responsabilità di un agente per la gestione generale e la supervisione di programma radiofonico. @it
definition: Hozzákapcsol egy ágenst egy műhöz, amelyhez hozzátartozik egy ágens felelőssége egy rádióműsor általános menedzseléséért és felügyeletéért. @hu
definition: Liittää toimijan teokseen, joka sisältää vastuun radio-ohjelman yleisestä johtamisesta ja valvonnasta.
definition: Met un agent en relation avec une œuvre qui comporte une responsabilité de la part d’un agent consistant à assurer la gestion et la supervision générales d’une émission de radio. @fr
definition: Relaciona un agent amb una obra que implica una responsabilitat d’un agent en la gestió general i la supervisió d’un programa radiofònic. @ca
definition: Relateert een actor aan een werk dat met zich meebrengt een verantwoordelijkheid van een actor voor het algemeen beheer en toezicht van een radioprogramma. @nl

televisio-ohjaaja (toimija) teoksessa
has element type: 2
instruction number: 18.5
toolkit definition: A work that involves a responsibility of an agent for the general management and supervision of a television program. @en
toolkit definition: Bir televizyon programının genel yönetimi ve denetimi için bir temsilcinin sorumluluğunu içeren bir eser. @tr
toolkit definition: Darbs, kas ietver aģenta atbildību par televīzijas raidījuma vispārēju vadību un uzraudzību. @lv
toolkit definition: Een werk dat met zich meebrengt een verantwoordelijkheid van een actor voor het algemeen beheer en toezicht van een televisieprogramma. @nl
toolkit definition: Egy mű, amelyhez hozzátartozik egy ágens felelőssége egy televízióműsor általános menedzseléséért és felügyeletéért. @hu
toolkit definition: Ein Werk, bei dem ein Akteur für das allgemeine Management und die Leitung einer Fernsehsendung verantwortlich ist. @de
toolkit definition: Et verk som involverer ansvar av en agent for generell ledelse av et fjernsynsprogram. @no
toolkit definition: Obra que implica una responsabilitat d’un agent en la gestió general i la supervisió d’un programa de televisió. @ca
toolkit definition: Opera che implica una responsabilità di un agente della gestione generale e della supervisione di programma televisivo. @it
toolkit definition: Teos, joka sisältää toimijan vastuun televisio-ohjelman yleisestä johtamisesta ja valvonnasta.
toolkit definition: Teos, mis sisaldab tegija vastutust telesaate üldise juhtimise ja juhendamise eest. @et
toolkit definition: Værk, som involverer en agents ansvar for den generelle ledelse af- og tilsyn med et tv-program. @da
toolkit definition: Œuvre qui comporte une responsabilité de la part d’un agent consistant à assurer la gestion et la supervision générales d’une émission de télévision. @fr
toolkit definition: Ένα έργο το οποίο περιλαμβάνει την ευθύνη για τη γενική διαχείριση και εποπτεία ενός τηλεοπτικού προγράμματος. @el
toolkit definition: عمل يترتب عليه تحمل وكيل مسئولية الإدارة العامة والإشراف على برنامج تليفزيوني. @ar
toolkit definition: 涉及电视节目的总体管理和监督的一个行为者的责任的一种作品 @zh-hans
toolkit label: Akteur als Fernsehregisseurin/Fernsehregisseur von @de
toolkit label: agent realitzador de televisió de @ca
toolkit label: agent réalisateur de télévision de @fr
toolkit label: agent, som er tv-regissør af @da
toolkit label: fjernsynsregissør av (agent) @no
toolkit label: ir televīzijas raidījuma direktors (aģents) @lv
toolkit label: regista televisivo agente @it
toolkit label: telerežissöör (tegija) teoses @et
toolkit label: televisieregisseur-actor van @nl
toolkit label: televisio-ohjaaja (toimija) teoksessa
toolkit label: television director agent of @en
toolkit label: televizyon yönetmeni temsilci @tr
toolkit label: televíziós rendező ágense: @hu
toolkit label: τηλεοπτικός διευθυντής φορέας του @el
toolkit label: وكيل مخرج تليفزيوني @ar
toolkit label: ……的电视导演行为者 @zh-hans
has subproperty: televisio-ohjaaja (henkilö) teoksessa
has subproperty: televisio-ohjaaja (yhteistoimija) teoksessa
has subproperty: P50050
lexical alias: televisionDirectorAgentOf.en
status: Published
type: Property
domain: C10002
label: er agent, som er tv-regissør af @da
label: er fjernsynsregissør av (agent) @no
label: est un agent réalisateur de télévision de @fr
label: ir televīzijas raidījuma direktors (aģents) @lv
label: is televisieregisseur-actor van @nl
label: is television director agent of @en
label: ist Akteur als Fernsehregisseurin/Fernsehregisseur von @de
label: telerežissöör (tegija) teoses @et
label: televizyon yönetmen temsilcisidir. @tr
label: televíziós rendező ágense a következőnek: @hu
label: è regista televisivo agente di @it
label: és agent realitzador de televisió de @ca
label: είναι τηλεοπτικός διευθυντής φορέας του @el
label: هو وكيل مخرج تليفزيوني لـ @ar
label: 是……的电视导演行为者 @zh-hans
sub property of: ohjaaja (toimija) teoksessa
alternative label: Fernsehregisseur von @de
alternative label: director de televisión de @es
alternative label: fjernsynsregissør for @no
alternative label: realitzador de televisió de @ca
alternative label: regista televisivo ti @it
alternative label: réalisateur de télévision de @fr
alternative label: telerežissöör teoses @et
alternative label: televisio-ohjaaja teoksessa
alternative label: television director of @en
alternative label: televizyon yönetmeni @tr
alternative label: televíziós rendezője: @hu
alternative label: tv-regissør af @da
alternative label: τηλεοπτικός διευθυντής του @el
alternative label: مخرج تليفزيوني لـ @ar
alternative label: ……的电视导演 @zh-hans
definition: Bir temsilciyi, bir televizyon programının genel yönetimi ve denetimine ilişkin bir temsilcinin sorumluluğunu içeren eserle ilişkilendirir. @tr
definition: Correla un agente a un'opera che implica una responsabilità di un agente per la gestione generale e la supervisione di un programma televisivo. @it
definition: Hozzákapcsol egy ágenst egy műhöz, amelyhez hozzátartozik egy ágens felelőssége egy televízióműsor általános menedzseléséért és felügyeletéért. @hu
definition: Liittää toimijan teokseen, joka sisältää vastuun televisio-ohjelman yleisestä johtamisesta ja valvonnasta.
definition: Met un agent en relation avec une œuvre qui comporte une responsabilité de la part d’un agent consistant à assurer la gestion et la supervision générales d’une émission de télévision. @fr
definition: Relaciona un agent amb una obra que implica una responsabilitat d’un agent en la gestió general i la supervisió d’un programa de televisió. @ca
definition: Relateert een actor aan een werk dat met zich meebrengt een verantwoordelijkheid van een actor voor het algemeen beheer en toezicht van een televisieprogramma. @nl

suvun kategoria
has element type: 5
instruction number: 10.3
toolkit definition: A type to which a family belongs. @en
toolkit definition: Bir ailenin ait olduğu bir tür. @tr
toolkit definition: Een type waartoe een familie behoort. @nl
toolkit definition: Egy típus, amelyhez egy család tartozik. @hu
toolkit definition: Eine Art, zu der eine Familie gehört. @de
toolkit definition: En type som en familie tilhører. @no
toolkit definition: Sukuun liittyvä tyyppi tai jaottelu.
toolkit definition: Tipo a cui una famiglia appartiene. @it
toolkit definition: Tipus al qual pertany una família. @ca
toolkit definition: Type auquel une famille appartient. @fr
toolkit definition: Type, som en familie tilhører. @da
toolkit definition: Tüüp, millesse perekond kuulub. @et
toolkit definition: Una categorización o descriptor genérico del tipo de familia. @es
toolkit definition: Veids, pie kura pieder dzimta/ģimene. @lv
toolkit definition: Μια κατηγοριοποίηση ή γενικός περιγραφέας για έναν τύπο οικογένειας. @el
toolkit definition: نوع تنتمي إليه عائلة. @ar
toolkit definition: 一个家族所属于的类型 @zh-hans
toolkit label: Kategorie einer Familie @de
toolkit label: aile kategorisi @tr
toolkit label: categoria de família @ca
toolkit label: categoria di famiglia @it
toolkit label: categorie van familie @nl
toolkit label: category of family @en
toolkit label: catégorie de famille @fr
toolkit label: családkategória @hu
toolkit label: dzimtas/ģimenes kategorija @lv
toolkit label: kategori af familie @da
toolkit label: kategori av familie @no
toolkit label: perekonna kategooria @et
toolkit label: suvun kategoria
toolkit label: tipo de familia @es
toolkit label: typ av familj/släkt @sv
toolkit label: κατηγορία της οικογένειας @el
toolkit label: فئة عائلة @ar
toolkit label: 家族的类别 @zh-hans
has subproperty: P50051
lexical alias: categoryOfFamily.en
status: Published
type: Property
domain: C10008
label: a pour catégorie de famille @fr
label: ailenin kategorisi ile ilişkilidir @tr
label: dzimtas/ģimenes kategorija @lv
label: entitás kategóriája a következő: @hu
label: ha come categoria di famiglia @it
label: har kategori af familie @da
label: har kategori av familie @no
label: har typ av familj/släkt @sv
label: has category of family @en
label: hat Kategorie einer Familie @de
label: heeft categorie van familie @nl
label: perekonna kategooria @et
label: té com a categoria de família @ca
label: έχει κατηγορία της οικογένειας @el
label: له فئة عائلة @ar
label: 有家族的类别 @zh-hans
sub property of: yhteistoimijan kategoria
alternative label: Art einer Familie @de
alternative label: ailenin türü @tr
alternative label: családtípus @hu
alternative label: perekonna tüüp @et
alternative label: suvun tyyppi
alternative label: tipo de familia @es
alternative label: tipo di famiglia @it
alternative label: tipus de família @ca
alternative label: type af familie @da
alternative label: type de famille @fr
alternative label: type familie @no
alternative label: type of family @en
alternative label: τύπος της οικογένειας @el
alternative label: نوع عائلة @ar
alternative label: 家族的类型 @zh-hans
definition: Bir aileyi, ailenin ait olduğu bir türle ilişkilendirir. @tr
definition: Correla una famiglia a un tipo a cui la famiglia appartiene. @it
definition: Hozzákapcsol egy családot ahhoz a típushoz, amelyhez a család tartozik. @hu
definition: Liittää suvun tyyppiin tai jaotteluun, johon suku kuuluu.
definition: Met une famille en relation avec un type auquel une famille appartient. @fr

suvun tunniste
has element type: 3
instruction number: 10.1
toolkit definition: A nomen that is an appellation of family that consists of a code, number, or other string, usually independent of natural language and social naming conventions, used to identify a family. @en
toolkit definition: Bir aileyi tanımlamak için kullanılan, genellikle doğal dil ve sosyal adlandırma kurallarından bağımsız bir kod, sayı veya başka bir dizeden oluşan bir aile unvanı olan isim. @tr
toolkit definition: Denominazione di famiglia che consiste di un codice, numero o altra sequenza di caratteri, solitamente indipendente dal linguaggio naturale e dalle convenzioni sociali di denominazione, usati per identificare una famiglia. @it
toolkit definition: Dzimtas/ģimenes apzīmējums, kas sastāv no koda, skaitļa vai citas virknes, kas parasti ir neatkarīgs no dabiskas valodas vai sabiedrībā pieņemtām nosaukšanas tradīcijām, ko izmanto, lai identificētu dzimti/ģimenei. @lv
toolkit definition: Een nomen dat is een benaming van familie die bestaat uit een code, nummer of andere tekenreeks, meestal onafhankelijk van natuurlijke taal en gewoonlijke naamgevingsconventies, gebruikt om een familie te identificeren. @nl
toolkit definition: Egy nomen, amely egy család megnevezése, kódból, számból vagy egyéb karakterláncból áll, általában a természetes nyelvtől és társadalmi elnevezési konvencióktól független, és egy család azonosítására használják. @hu
toolkit definition: Eine Bezeichnung für eine Familie, die aus einem Code, einer Nummer oder einer anderen Zeichenkette besteht, der/die normalerweise nicht in natürlicher Sprache und unabhängig von den sozialen Benennungskonventionen ist und zur Identifizierung einer Familie verwendet wird. @de
toolkit definition: En betegnelse for familie som består av en kode, et nummer eller annen streng, vanligvis uavhengig av naturlig språk og sosiale navnekonvensjoner, brukt for å identifisere en familie. @no
toolkit definition: Nomen que és una apel·lació d’una família que consisteix en un codi, un número o qualsevol altra cadena, normalment independent del llenguatge natural i de les convencions lingüístiques socials, usada per identificar una família. @ca
toolkit definition: Nomen qui est une appellation de famille consistant en un code, un nombre ou une autre chaîne, généralement indépendante du langage naturel et des conventions sociales de dénomination, utilisée pour identifier une famille. @fr
toolkit definition: Nomen, som er en benævnelse på familie, som består af en kode, nummer eller anden streng, sædvanligvis upåvirket af normalsprog og sociale navngivningskonventioner, brugt til at identificere en familie. @da
toolkit definition: Perekonna nimetus, mis koosneb perekonda identifitseerivast koodist, numbrist või muust loomulikust keelest ja üldtuntud nimetamistavadest sõltumatust stringist. @et
toolkit definition: Suvun identifioimiseen käytetty nomen, joka on nimitys, joka koostuu koodista, luvusta tai muusta merkkijonosta, joka on tavallisesti riippumaton luonnollisesta kielestä tai yleisistä nimeämiskäytännöistä.
toolkit definition: Una cadena de caracteres solamente asociada con una familia, o con un sustituto de una familia (por ej., un registro de autoridad). @es
toolkit definition: Ένας αλφαριθμητικός χαρακτήρας μοναδικά συνδεδεμένος με μια οικογένεια ή με ένα υποκατάστατο, όπως μία καθιερωμένη εγγραφή για μια οικογένεια. @el
toolkit definition: تسمية هي اسم عائلة يتكون من رمز، أو رقم، أو سلسلة تمثيلات أخرى، عادة ما تكون مختلفة عن اللغة الطبيعية وعن التسميات المتعارف عليها اجتماعيا، المستخدمة في تعريف عائلة. @ar
toolkit definition: 一个作为家族的称谓、由代码、数字或其他字符串构成、通常独立于自然语言和社会命名惯例、用以识别一个家族的命名 @zh-hans
toolkit label: Identifikator für eine Familie @de
toolkit label: ailenin tanımlayıcısı ile ilişkilidir @tr
toolkit label: családazonosító: @hu
toolkit label: dzimtas/ģimenes identifikators @lv
toolkit label: identifiant de famille @fr
toolkit label: identificador de família @ca
toolkit label: identificador de la familia @es
toolkit label: identificatie voor familie @nl
toolkit label: identificatore di famiglia @it
toolkit label: identifier for family @en
toolkit label: identifikator for familie @da
toolkit label: identifikator för familjen/släkten @sv
toolkit label: perekonna identifikaator @et
toolkit label: suvun tunniste
toolkit label: αναγνωριστικό για την οικογένεια @el
toolkit label: معرِّف لعائلة @ar
toolkit label: 给家族的标识符 @zh-hans
has subproperty: P50052
lexical alias: identifierForFamily.en
status: Published
type: Property
domain: C10008
label: a pour identifiant de famille @fr
label: ailenin tanımlayıcısı ile ilişkilidir @tr
label: család azonosítója a következő: @hu
label: dzimtas/ģimenes identifikators @lv
label: ha come identificatore di famiglia @it
label: har identifikator for familie @da
label: har identifikator för familjen/släkten @sv
label: has identifier for family @en
label: hat Identifikator für eine Familie @de
label: heeft identificatie voor familie @nl
label: perekonna identifikaator @et
label: té com a identificador de família @ca
label: έχει αναγνωριστικό για την οικογένεια @el
label: له معرِّف لعائلة @ar
label: 有给家族的标识符 @zh-hans
sub property of: suvun nimitys
sub property of: yhteistoimijan tunniste
definition: Bir aileyi, bir aileyi tanımlamak için kullanılan, genellikle doğal dil ve sosyal adlandırma kurallarından bağımsız bir kod, sayı veya başka bir dizeden oluşan bir aile adı olan bir isimle ilişkilendirir. @tr
definition: Correla una famiglia a una denominazione di famiglia appartiene che consiste di un codice, numero o altra sequenza di caratteri, solitamente indipendente dal linguaggio naturale e dalle convenzioni sociali di denominazione, usati per identificare una famiglia. @it
definition: Hozzákapcsol egy családot egy nomenhez, egy család megnevezéséhez, amely kódból, számból vagy egyéb karakterláncból áll, általában a természetes nyelvtől és társadalmi elnevezési konvencióktól független, és egy család azonosítására használják. @hu
definition: Liittää suvun nomeniin, joka on suvun nimitys, joka koostuu koodista, luvusta tai muusta tavallisesti luonnollisesta kielestä ja yleisistä nimeämiskäytännöistä riippumattomasta merkkijonosta, jota käytetään suvun identifiointiin.
definition: Met une famille en relation avec un nomen qui est une appellation de famille consistant en un code, un nombre ou une autre chaîne, généralement indépendante du langage naturel et des conventions sociales de dénomination, utilisée pour identifier une famille. @fr
definition: Relaciona una família amb un nomen que és una apel·lació d’una família que consisteix en un codi, un número o qualsevol altra cadena, normalment independent del llenguatge natural i de les convencions lingüístiques socials, usada per identificar una família. @ca
definition: Relateert een familie aan een nomen dat is een benaming van familie die bestaat uit een code, nummer of andere tekenreeks, meestal onafhankelijk van natuurlijke taal en gewoonlijke naamgevingsconventies, gebruikt om een familie te identificeren. @nl
definition: Relaterer en famile til en betegnelse for familie som består av en kode, et nummer eller annen streng, vanligvis uavhengig av naturlig språk og sosiale navnekonvensjoner, brukt for å identifisere en familie. @no
definition: Relaterer en familie til et nomen, som er en benævnelse på familie, som består af en kode, nummer eller anden streng, sædvanligvis upåvirket af normalsprog og sociale navngivningskonventioner, brugt til at identificere en familie. @da
definition: Relates a family to a nomen that is an appellation of family that consists of a code, number, or other string, usually independent of natural language and social naming conventions, used to identify a family. @en
definition: Sasaista dzimtu/ģimeni ar nomenu, kas ir dzimtas/ģimenes apzīmējums, kas sastāv no koda, skaitļa vai citas virknes, kas parasti ir neatkarīgs no dabiskas valodas vai sabiedrībā pieņemtām nosaukšanas tradīcijām, ko izmanto, lai identificētu dzimti/ģimenei. @lv
definition: Seostab perekonna perekonna nimetusega, mis koosneb perekonda identifitseerivast koodist, numbrist või muust loomulikust keelest ja üldtuntud nimetamistavadest sõltumatust stringist. @et
definition: Setzt eine Familie in Beziehung zu einer Bezeichnung für eine Familie, die aus einem Code, einer Nummer oder einer anderen Zeichenkette besteht, der/die normalerweise nicht in natürlicher Sprache und unabhängig von den sozialen Benennungskonventionen ist und zur Identifizierung einer Familie verwendet wird. @de
definition: Συνδέει μια οικογένεια με έναν αλφαριθμητικό χαρακτήρα μοναδικά συνδεδεμένο με μία οικογένεια ή με ένα υποκατάστατο, όπως μία καθιερωμένη εγγραφή για μια οικογένεια. @el
definition: يربط عائلة بتسمية هي اسم عائلة يتكون من رمز، أو رقم، أو سلسلة تمثيلات أخرى، عادة ما تكون مختلفة عن اللغة الطبيعية وعن التسميات المتعارف عليها اجتماعيا، المستخدمة في تعريف عائلة. @ar
definition: 将一个家族与一个作为家族的称谓、由代码、数字或其他字符串构成、通常独立于自然语言和社会命名惯例、用以识别一个家族的命名关联起来。 @zh-hans
scope note: Der Identifikator dient dazu, diese Familie von anderen Familien zu unterscheiden. @de
scope note: Identifikatoren tjener til at skelne en familie fra andre familier. @da
scope note: L’identifiant sert à différencier une famille d’autres familles. @fr
scope note: Tunniste erottaa suvun muista suvuista.
scope note: Το αναγνωριστικό χρησιμοποιείται για τη διαφοροποίηση μιας οικογένειας από άλλες οικογένειες. @el

suvusta polveutuva suku
has element type: 2
instruction number: 29.5
toolkit definition: A family who descends from another family. @en
toolkit definition: Başka bir ailenin soyundan gelen bir aile. @tr
toolkit definition: Dzimta/ģimene, kas cēlusies no citas dzimtas/ģimenes. @lv
toolkit definition: Een familie die afstamt van een andere familie. @nl
toolkit definition: Egy család, amely egy másik családból származik. @hu
toolkit definition: Eine Familie, die von einer anderen Familie abstammt. @de
toolkit definition: En familie som er etterkommere av en annen familie. @no
toolkit definition: Famiglia che discende da un'altra famiglia. @it
toolkit definition: Familie, som nedstammer fra en anden familie. @da
toolkit definition: Famille qui descend d’une autre famille. @fr
toolkit definition: Família que descendeix d’una altra família. @ca
toolkit definition: Perekond, kes põlvneb teisest perekonnast. @et
toolkit definition: Suku, joka polveutuu toisesta suvusta.
toolkit definition: Una familia que desciende de otra familia. @es
toolkit definition: Μια οικογένεια που κατάγεται από κάποια άλλη οικογένεια. @el
toolkit definition: عائلة منحدرة من عائلة أخرى. @ar
toolkit definition: 作为另一个家族后裔的一个家族 @zh-hans
toolkit label: Abstammende Familie @de
toolkit label: afstammeling-familie van familie van @nl
toolkit label: alt soy ailesi @tr
toolkit label: descendant family of family @en
toolkit label: dzimtas/ģimenes pēcnācējs (dzimta/ģimene) @lv
toolkit label: egy család leszármazott családja: @hu
toolkit label: etterkommende familie av familie @no
toolkit label: famiglia discendente di famiglia @it
toolkit label: familia descendiente @es
toolkit label: familie nedstammende af familie @da
toolkit label: famille descendante d’une famille @fr
toolkit label: família descendent d’una família @ca
toolkit label: perekonnast põlvnev perekond @et
toolkit label: suvusta polveutuva suku
toolkit label: επίγονος οικογένεια της οικογένειας @el
toolkit label: عائلة منحدرة من عائلة @ar
toolkit label: 家族的后裔家族 @zh-hans
has subproperty: P50053
lexical alias: descendantFamilyOfFamily.en
status: Published
type: Property
domain: C10008
label: a pour famille descendante d’une famille @fr
label: ailenin alt soy ailesi ile ilişkilidir @tr
label: család leszármazott családja a következő: @hu
label: dzimtas/ģimenes pēcnācējs (dzimta/ģimene) @lv
label: ha come famiglia discendente di famiglia @it
label: har etterkommende familie av familie @no
label: har familie nedstammende af familie @da
label: has descendant family of family @en
label: hat abstammende Familie @de
label: heeft afstammeling-familie van familie van @nl
label: perekonnast põlvnev perekond @et
label: té com a família descendent d’una família @ca
label: έχει επίγονο οικογένεια της οικογένειας @el
label: له عائلة منحدرة من عائلة @ar
label: 有家族的后裔家族 @zh-hans
sub property of: suvun sukuhaara
alternative label: descendant family @en
alternative label: familia descendiente @es
alternative label: famille descendante @fr
alternative label: família descendent @ca
alternative label: leszármazott család: @hu
alternative label: nedstammende familie @da
alternative label: polveutuva suku
alternative label: soyundan gelen aile @tr
alternative label: عائلة منحدرة @ar
alternative label: 后裔家族 @zh-hans
definition: Bir aileyi başka bir aileden gelen bir aile ile ilişkilendirir. @tr
definition: Correla una famiglia a una famiglia che discende da un'altra famiglia. @it
definition: Hozzákapcsol egy családot egy családhoz, amely egy másik családból származik. @hu
definition: Liittää suvun sukuun, joka polveutuu toisesta suvusta.
definition: Met une famille en relation avec une famille qui descend d’une autre famille. @fr
definition: Relaciona una família amb una família que descendeix d’una altra família. @ca
definition: Relateert een familie aan een familie die afstamt van een andere familie. @nl
definition: Relaterer en familie til en familie som er etterkommere av en annen familie. @no
definition: Relaterer en familie til en familie, som nedstammer fra en anden familie. @da
definition: Relates a family to a family who descends from another family. @en
definition: Sasaista dzimtu/ģimeni ar dzimtu/ģimeni, kas cēlusies no citas dzimtas/ģimenes. @lv
definition: Seostab perekonna perekonnaga, kes põlvneb teisest perekonnast. @et

suvun varianttinimi
has element type: 3
instruction number: 10.2.3
toolkit definition: A nomen that is a name of family that is not selected for preference in a specific application or context. @en
toolkit definition: Belirli bir uygulama veya bağlamda tercih için seçilmemiş bir aile adı olan bir isim. @tr
toolkit definition: Dzimtas/ģimenes vārds, kurš nav izvēlēts kā prioritārs noteiktā lietojumprogrammā vai kontekstā. @lv
toolkit definition: Een nomen dat is een naam van familie die niet de voorkeur heeft gekregen in een specifieke applicatie of context. @nl
toolkit definition: Egy családnév nomen, amelyet egy bizonyos alkalmazásban vagy kontextusban nem részesítenek előnyben. @hu
toolkit definition: Ein Name einer Familie, der in einer bestimmten Anwendung oder in einem bestimmten Kontext nicht als Vorzugsform bestimmt wird. @de
toolkit definition: Et familienavn som ikke er valgt som preferanse i en bestemt applikasjon eller kontekst. @no
toolkit definition: Nome di famiglia non scelto come preferito in una specifica applicazione o contesto. @it
toolkit definition: Nomen que és un nom de família que no se selecciona com a preferent en una aplicació o un context específic. @ca
toolkit definition: Nomen qui est un nom d’une famille ne faisant pas l’objet d’un choix privilégié dans une application ou un contexte spécifiques. @fr
toolkit definition: Nomen, joka on suvun nimi, jota ei ole valittu suvun ensisijaiseksi nimeksi tietyssä sovelluksessa tai kontekstissa.
toolkit definition: Nomen, som er navn på familie, som ikke er valgt som foretrukken i en specifik applikation eller kontekst. @da
toolkit definition: Perekonna nimi, mis kindlas rakenduses või kontekstis ei ole valitud eelistatuks. @et
toolkit definition: Un nombre o una forma del nombre mediante el cual se conoce una familia, que difiere del nombre o la forma del nombre elegida como el nombre preferido. @es
toolkit definition: Ένα όνομα ή μορφή ονόματος με το οποίο η οικογένεια είναι γνωστή, το οποίο διαφέρει από ένα όνομα ή μορφή ονόματος που έχει επιλεγεί ως το προτιμώμενο όνομα. @el
toolkit definition: اسم عائلة لم يُختر كاسم مفضل في تطبيق أو في سياق محدد. @ar
toolkit definition: 作为家族的名称、但在特定应用和语境下不首选的一个命名 @zh-hans
toolkit label: abweichender Name einer Familie @de
toolkit label: ailenin alternatif ismi @tr
toolkit label: család névváltozata: @hu
toolkit label: dzimtas/ģimenes cits vārds @lv
toolkit label: nome variante di famiglia @it
toolkit label: perekonna variantnimi @et
toolkit label: suvun varianttinimi
toolkit label: variant af navn på familie @da
toolkit label: variant de nom de família @ca
toolkit label: variant naam van familie @nl
toolkit label: variant name of family @en
toolkit label: variante de nom d’une famille @fr
toolkit label: variante del nombre de la familia @es
toolkit label: variantform av familienavn @no
toolkit label: variantnamn för familjen/släkten @sv
toolkit label: εναλλακτικό όνομα της οικογένειας @el
toolkit label: اسم مختلف لعائلة @ar
toolkit label: 家族的变异名称 @zh-hans
has subproperty: P50054
lexical alias: variantNameOfFamily.en
status: Published
type: Property
domain: C10008
label: a pour variante de nom d’une famille @fr
label: ailenin alternatif ismi ile ilişkilidir @tr
label: család névváltozata a következő: @hu
label: dzimtas/ģimenes cits vārds @lv
label: ha come nome variante di famiglia @it
label: har variant af navn på familie @da
label: har variantform av familienavn @no
label: har variantnamn för familjen/släkten @sv
label: has variant name of family @en
label: hat abweichenden Namen einer Familie @de
label: heeft variant naam van familie @nl
label: perekonna variantnimi @et
label: té com a variant de nom de família @ca
label: έχει εναλλακτικό όνομα της οικογένειας @el
label: لها اسم عائلة مختلف @ar
label: 有家族的变异名称 @zh-hans
sub property of: suvun nimi
sub property of: yhteistoimijan varianttinimi
alternative label: -
alternative label: Abweichender Name für eine Familie @de
alternative label: aile için alternatif isim @tr
alternative label: család névvariánsa: @hu
alternative label: variant name for family @en
alternative label: variante de nombre de familia @es
alternative label: variantnavn for familie @da
alternative label: اسم مختلف لعائلة @ar
alternative label: 给家族的变异名称 @zh-hans
definition: Bir aileyi, belirli bir uygulama veya bağlamda tercih için seçilmeyen bir aile adı olan bir soyadı ile ilişkilendirir. @tr
definition: Correla una famiglia a un nome di famiglia non scelto come preferito in una specifica applicazione o contesto. @it
definition: Hozzákapcsol egy családot egy családnév nomenhez, amelyet egy bizonyos alkalmazásban vagy kontextusban nem részesítenek előnyben. @hu
definition: Liittää suvun nomeniin, joka on nimi, jota ei ole valittu suvun ensisijaiseksi nimeksi tietyssä sovelluksessa tai kontekstissa.
definition: Met une famille en relation avec un nomen qui est un nom d’une famille ne faisant pas l’objet d’un choix privilégié dans une application ou un contexte spécifiques. @fr
definition: Relaciona una família amb un nomen que és un nom de família que no se selecciona com a preferent en una aplicació o un context específic. @ca
definition: Relateert een familie aan een nomen dat is een naam van familie die niet de voorkeur heeft gekregen in een specifieke applicatie of context. @nl
definition: Relaterer en familie til et familienavn som ikke er valgt som preferanse i en bestemt applikasjon eller kontekst. @no
definition: Relaterer en familie til et navn på familie, som ikke er valgt som foretrukken i en specifik applikation eller kontekst. @da
definition: Relates a family to a nomen that is a name of family that is not selected for preference in a specific application or context. @en

suvun kantahenkilö
has element type: 2
instruction number: 29.5
toolkit definition: A person from whom a family descends. @en
toolkit definition: Bir ailenin soyundan gelen bir kişi @tr
toolkit definition: Een persoon van wie een familie afstamt. @nl
toolkit definition: Egy személy, akitől egy család származik. @hu
toolkit definition: Eine Person, von der eine Familie abstammt. @de
toolkit definition: En person som en familie nedstammer fra. @no
toolkit definition: Henkilö, josta suku polveutuu.
toolkit definition: Isik, kellest perekond põlvneb. @et
toolkit definition: Person, som en familie nedstammer fra. @da
toolkit definition: Persona da cui discende una famiglia. @it
toolkit definition: Persona de qui descendeix una família. @ca
toolkit definition: Persona, no kuras cēlusies dzimta/ģimene. @lv
toolkit definition: Personne de qui une famille descend. @fr
toolkit definition: Una persona de la cual desciende la familia. @es
toolkit definition: Ένα φυσικό πρόσωπο από το οποίο κατάγεται μια οικογένεια. @el
toolkit definition: شخص تنحدر منه عائلة. @ar
toolkit definition: 一个家族作为其后裔的个人 @zh-hans
toolkit label: Stammvater @de
toolkit label: afstammeling-familie van persoon van @nl
toolkit label: descendant family of person of @en
toolkit label: etterkommende familie av person for @no
toolkit label: famiglia discendente di una persona di @it
toolkit label: familie nedstammende af person af @da
toolkit label: famille descendante d’une personne de @fr
toolkit label: família descendent d’una persona de @ca
toolkit label: ir dzimtas/ģimenes pirmsācējs (persona) @lv
toolkit label: kişinin alt soy ailesi @tr
toolkit label: leszármazott családja a következő személynek: @hu
toolkit label: perekonna esivanem @et
toolkit label: progenitor @es
toolkit label: suvun kantahenkilö
toolkit label: επίγονος οικογένεια του φυσικού προσώπου του @el
toolkit label: عائلة منحدرة من شخص @ar
toolkit label: ……个人的后裔家族 @zh-hans
has subproperty: P50055
lexical alias: descendantFamilyOfPersonOf.en
status: Published
type: Property
domain: C10008
label: er etterkommende familie av person for @no
label: er familie nedstammende af person af @da
label: est une famille descendante d’une personne de @fr
label: ir dzimtas/ģimenes pirmsācējs (persona) @lv
label: is afstammeling-familie van persoon van @nl
label: is descendant family of person of @en
label: ist Stammvater @de
label: kişisinin alt soy ailesidir @tr
label: leszármazott családja a következő személynek: @hu
label: perekonna esivanem @et
label: è famiglia discendente di persona di @it
label: és família descendent d’una persona de @ca
label: είναι επίγονος οικογένεια του φυσικού προσώπου του @el
label: هي عائلة منحدرة من شخص لـ @ar
label: 是……个人的后裔家族 @zh-hans
sub property of: suvun henkilöjäsen
alternative label: ancêtre @fr
alternative label: ane @no
alternative label: eellane @et
alternative label: forfader @da
alternative label: kantaisä
alternative label: progenitor @ca
alternative label: progenitor: @hu
alternative label: progenitore @it
alternative label: Öncül @tr
alternative label: πρόγονος @el
alternative label: الأسلاف @ar
alternative label: 祖先 @zh-hans
definition: Bir aileyi, bir ailenin soyundan gelen bir kişiyle ilişkilendirir. @tr
definition: Correla una famiglia a una personada cui la famiglia discende. @it
definition: Hozzákapcsol egy családot egy személyhez, akitől egy család származik. @hu
definition: Liittää suvun henkilöön, josta suku polveutuu.
definition: Met une famille en relation avec une personne de qui une famille descend. @fr
definition: Relaciona una família amb una persona de qui descendeix una família. @ca
definition: Relateert een familie aan een persoon van wie een familie afstamt. @nl
definition: Relaterer en familie til en person som en familie nedstammer fra. @no
definition: Relaterer en familie til en person, som en familie nedstammer fra. @da
definition: Relates a family to a person from whom a family descends. @en

suvun henkilöjäsen
has element type: 2
instruction number: 29.5
toolkit definition: A person who is a member of a family. @en
toolkit definition: Aile üyesi olan bir kişi. @tr
toolkit definition: Een persoon die lid is van een familie. @nl
toolkit definition: Egy személy, aki egy család tagja. @hu
toolkit definition: Eine Person, die ein Mitglied einer Familie ist. @de
toolkit definition: En person som er et medlem av en familie. @no
toolkit definition: Henkilö, joka on suvun jäsen.
toolkit definition: Isik, kes on perekonna liige. @et
toolkit definition: Person, som er medlem af en familie. @da
toolkit definition: Persona che è membro di una famiglia. @it
toolkit definition: Persona que és un membre d’una família. @ca
toolkit definition: Persona, kura pievienojas dzimta/ģimene. @lv
toolkit definition: Personne qui est membre d’une famille. @fr
toolkit definition: Una persona que es un miembro de la familia. @es
toolkit definition: Ένα φυσικό πρόσωπο το οποίο είναι μέλος μιας οικογένειας. @el
toolkit definition: شخص هو عضو في عائلة. @ar
toolkit definition: 作为一个家族成员的个人 @zh-hans
toolkit label: Familienmitglied (Person) @de
toolkit label: aile üyesi olan kişi @tr
toolkit label: család személy tagja: @hu
toolkit label: dzimtas/ģimenes dalībnieks (persona) @lv
toolkit label: familiemedlem (person) @no
toolkit label: miembro de la familia @es
toolkit label: perekonna liige (isik) @et
toolkit label: person member of family @en
toolkit label: person, som er familiemedlem @da
toolkit label: persona membre d’una família @ca
toolkit label: persona membro di famiglia @it
toolkit label: personne membre d’une famille @fr
toolkit label: persoonlijk lid van familie @nl
toolkit label: suvun henkilöjäsen
toolkit label: φυσικό πρόσωπο μέλος της οικογένειας @el
toolkit label: شخص عضو في عائلة @ar
toolkit label: 家族的个人成员 @zh-hans
has subproperty: suvun kantahenkilö
has subproperty: suvun tunnettu jäsen
has subproperty: P50056
lexical alias: personMemberOfFamily.en
status: Published
type: Property
domain: C10008
label: a pour personne membre d’une famille @fr
label: ailenin kişi üyesi ile ilişkilidir @tr
label: család személy tagja a következő: @hu
label: dzimtas/ģimenes dalībnieks (persona) @lv
label: ha come persona membro di famiglia @it
label: har familiemedlem (person) @no
label: har person, som er familiemedlem @da
label: has person member of family @en
label: hat Familienmitglied (Person) @de
label: heeft persoonlijk lid van familie @nl
label: perekonna liige (isik) @et
label: té com a persona membre d’una família @ca
label: έχει φυσικό πρόσωπο μέλος της οικογένειας @el
label: لديه شخص عضو في عائلة @ar
label: 有家族的个人成员 @zh-hans
sub property of: sukuun liittyvä henkilö
sub property of: yhteistoimijan henkilöjäsen
alternative label: Familienmitglied @de
alternative label: aile üyesi @tr
alternative label: családtag: @hu
alternative label: familiemedlem @da
alternative label: family member @en
alternative label: membre de famille @fr
alternative label: membre d’una família @ca
alternative label: membro di famiglia @it
alternative label: miembro de familia @es
alternative label: perekonna liige @et
alternative label: suvun jäsen
alternative label: μέλος οικογένειας @el
alternative label: عضو في عائلة @ar
alternative label: 家族成员 @zh-hans
definition: Bir aileyi, bir ailenin hatırası olan bir kişiyle ilişkilendirir. @tr
definition: Correla una famiglia a una persona che è membro di una famiglia. @it
definition: Hozzákapcsol egy családot egy személyhez, aki egy család tagja. @hu
definition: Liittää suvun henkilöön, joka on suvun jäsen.
definition: Met une famille en relation avec une personne qui est membre d’une famille. @fr

sukuun liittyvä paikka
has element type: 2
instruction number: 10.5
toolkit definition: A place that is associated with a family. (Deprecated) @en
toolkit definition: Egy hely, ahol egy család lakik vagy lakott, vagy amellyel bizonyos kapcsolata van. @hu
toolkit definition: Ein Ort, an dem eine Familie wohnt, gewohnt hat oder zu dem sie eine Verbindung hat. @de
toolkit definition: Et sted hvor familien bor, har bodd, eller har tilknytning til. @no
toolkit definition: Lieu où une famille réside ou a résidé ou avec lequel elle a une relation quelconque. @fr
toolkit definition: Lloc on una família resideix o ha residit o amb el qual té algun tipus de relació. @ca
toolkit definition: Paikka, jossa suku asuu tai on asunut, tai johon sillä on jokin muu yhteys.
toolkit definition: Sted, hvor en familie bor eller har boet, eller som familien har en forbindelse til. @da
toolkit definition: Un lugar donde reside la familia, o donde ha residido o que tiene alguna conexión. @es
toolkit definition: Ένας τόπος, όπου η οικογένεια κατοικεί ή κατοίκησε ή με τον οποίο διατηρεί κάποια σχέση. @el
toolkit label: Ort, der mit einer Familie in Verbindung steht @de
toolkit label: családhoz kötődő hely @hu
toolkit label: lieu associé à une famille @fr
toolkit label: lloc associat amb una família @ca
toolkit label: lugar asociado con la familia @es
toolkit label: ort förknippad med familjen/släkten @sv
toolkit label: place associated with family (Deprecated) @en
toolkit label: sted forbundet med familien @da
toolkit label: sted som forbindes med familien @no
toolkit label: sukuun liittyvä paikka
toolkit label: τόπος συνδεδεμένος με την οικογένεια @el
has subproperty: P50057
lexical alias: placeAssociatedWithFamily.en
status: Deprecated
type: Property
domain: C10008
label: a pour lieu associé à une famille @fr
label: har ort förknippad med familjen/släkten @sv
label: har sted forbundet med familien @da
label: has place associated with family (Deprecated) @en
label: hat Ort, der mit einer Familie in Verbindung steht @de
label: té com a lloc associat amb una família @ca
label: van családdal kapcsolatos helye @hu
label: έχει τόπο συνδεδεμένο με την οικογένεια @el
sub property of: sukuun liittyvä paikka
definition: Egy családot hozzákapcsol egy helyhez, ahol egy család lakik vagy lakott vagy valami kapcsolata van vele. @hu
definition: Liittää suvun paikkaan, jossa suku asuu tai on asunut, tai johon sillä on jokin muu yhteys.
definition: Met une famille en relation avec un lieu où une famille réside ou a résidé ou avec lequel elle a une relation quelconque. @fr
definition: Relaciona una família amb un lloc on una família resideix o ha residit o amb el qual té algun tipus de relació. @ca
definition: Relaterer til et sted, hvor en familie bor eller har boet, eller som familien har en forbindelse til. @da
definition: Relates a family to a place that is associated with a family. (Deprecated) @en
definition: Setzt eine Familie mit einem Ort, an dem eine Familie wohnt, gewohnt hat oder zu dem sie eine Verbindung hat, in Beziehung. @de
definition: Συνδέει μια οικογένεια με έναν τόπο όπου η οικογένεια κατοικεί ή έχει κατοικήσει ή έχει κάποια σύνδεση. @el

sukuun liittyvä ajankohta
has element type: 3
instruction number: 10.4
toolkit definition: A timespan that has a significant association with a family. (Deprecated) @en
toolkit definition: Data significativa associada amb una família. @ca
toolkit definition: Date importante associée à une famille. @fr
toolkit definition: Egy fontos időpont, amely kötődik egy családhoz. @hu
toolkit definition: Ein wichtiges Datum, das mit der Geschichte einer Familie in Verbindung steht. @de
toolkit definition: Et viktig tidspunkt som kan forbindes med en familie. @no
toolkit definition: Sukuun liittyvä merkittävä ajankohta.
toolkit definition: Una fecha significativa asociada con la familia. @es
toolkit definition: Væsentlig dato forbundet med en familie. @da
toolkit definition: Μια σημαντική χρονολογία συνδεδεμένη με μια οικογένεια. @el
toolkit label: Datum, das mit einer Familie in Verbindung steht @de
toolkit label: családhoz kötődő időpont @hu
toolkit label: data associada amb una família @ca
toolkit label: date associated with family (Deprecated) @en
toolkit label: date associée à une famille @fr
toolkit label: dato knyttet til familien @da
toolkit label: fecha asociada con la familia @es
toolkit label: sukuun liittyvä ajankohta
toolkit label: tid förknippad med famliljen/släkten @sv
toolkit label: tidspunkt som forbindes med familien @no
toolkit label: χρονολογία συνδεδεμένη με την οικογένεια @el
has subproperty: P50058
lexical alias: dateAssociatedWithFamily.en
status: Deprecated
type: Property
domain: C10008
label: a pour date associée à une famille @fr
label: har dato knyttet til familien @da
label: har tid förknippad med famliljen/släkten @sv
label: has date associated with family (Deprecated) @en
label: hat Datum, das mit einer Familie in Verbindung steht @de
label: té com a data associada amb una família @ca
label: van családdal kapcsolatos időpontja @hu
label: έχει χρονολογία συνδεδεμένη με την οικογένεια @el
sub property of: sukuun liittyvä ajanjakso
definition: Egy családot hozzákapcsol egy családhoz kötődő fontos időponthoz. @hu
definition: Liittää suvun sukuun liittyvän merkittävän ajankohdan.
definition: Met une famille en relation avec une date importante associée à une famille. @fr
definition: Relaciona una família amb una data significativa associada amb una família. @ca
definition: Relaterer en familie til et væsentlig dato forbundet med en familie. @da
definition: Relates a family to a timespan that has a significant association with a family. (Deprecated) @en
definition: Setzt eine Familie mit einem wichtigen Datum, das mit der Geschichte einer Familie in Verbindung steht, in Beziehung. @de
definition: Συνδέει μια οικογένεια με μια σημαντική χρονολογία συνδεδεμένη με την οικογένεια. @el

periytyvä arvonimi
has element type: 3
instruction number: 10.7
toolkit definition: A word or phrase indicative of royalty, nobility, etc., associated with a family. @en
toolkit definition: Bir aileyle bağlantılı olan kraliyet, soyluluk vb. gösteren bir kelime veya ifade. @tr
toolkit definition: Een woord of uitdrukking wijzend op koningschap, adel etc, geassocieerd met een familie. @nl
toolkit definition: Egy szó vagy kifejezés, amely társulva egy családdal, királyi, nemesi stb. címre utal. @hu
toolkit definition: Ein Wort oder eine Phrase, das/die mit einer Familie in Verbindung steht und auf die Zugehörigkeit zu einem Fürstentum, zum Adel und so weiter hinweist. @de
toolkit definition: Et ord eller en frase som antyder tilknytning til kongehus, adel etc. som forbindes med en familie. @no
toolkit definition: Mot ou locution qui indique la royauté, la noblesse, etc. et qui est associé à une famille. @fr
toolkit definition: Ord eller udtryk, som indikerer kongeslægt, adelslægt etc., som er knyttet til en familie. @da
toolkit definition: Paraula o frase indicativa de reialesa, noblesa, etc., associada amb una família. @ca
toolkit definition: Parola o frase indicativa di regalità, nobiltà, etc. associata a una famiglia. @it
toolkit definition: Sana tai ilmaus, joka osoittaa suvun kuninkaallista, aatelis- tms. arvoa.
toolkit definition: Sõna või väljend, mis näitab perekonna kuninglikku seisust, aadliseisust vms. @et
toolkit definition: Un título de nobleza, etc., asociado con una familia. @es
toolkit definition: Vārds vai frāze, kas norāda uz aristokrātiju u.tml., kas saistīts ar dzimtu/ģimeni. @lv
toolkit definition: Ένας τίτλος ευγενείας κ.λπ. συνδεδεμένος με μια οικογένεια. @el
toolkit definition: كلمة أو عبارة تدل على الملكية والنبالة الخ، مرتبطة بعائلة. @ar
toolkit definition: 表示皇室、贵族等与家族相关的一个单词或短语 @zh-hans
toolkit label: Erbtitel @de
toolkit label: arvet hedersbetegnelse @no
toolkit label: erfelijke term van eer @nl
toolkit label: hereditary term of honour @en
toolkit label: hódolat örökletes kifejezése: @hu
toolkit label: nedarvet æresbevisning @da
toolkit label: periytyvä arvonimi
toolkit label: pärilik tiitel @et
toolkit label: pārmantotais tituls @lv
toolkit label: soyluluk unvanı ile ilişkilidir @tr
toolkit label: terme d’honneur héréditaire @fr
toolkit label: terme honorífic hereditari @ca
toolkit label: titolo ereditario d'onore @it
toolkit label: título hereditario @es
toolkit label: ärvd titel @sv
toolkit label: κληρονομικός όρος τιμής @el
toolkit label: لقب شرف متوارث @ar
toolkit label: 世袭荣誉称号 @zh-hans
has subproperty: P50059
lexical alias: hereditaryTermOfHonour.en
status: Published
type: Property
domain: C10008
label: a pour terme d’honneur héréditaire @fr
label: aileye ait soyluluk unvanı ile ilişkilidir @tr
label: ha come titolo ereditario d'onore @it
label: har arvet hedersbetegnelse @no
label: har nedarvet æresbevisning @da
label: har ärvd titel @sv
label: has hereditary term of honour @en
label: hat Erbtitel @de
label: heeft erfelijke term van eer @nl
label: hódolat örökletes kifejezése a következő: @hu
label: pärilik tiitel @et
label: pārmantotais tituls @lv
label: té com a terme honorífic hereditari @ca
label: έχει κληρονομικό όρο τιμής @el
label: له لقب شرف متوارث @ar
label: 有世袭头衔 @zh-hans
alternative label: arvelig æresperiode @da
alternative label: hereditary term of honor @en
alternative label: hereditary title @en
alternative label: hódolat örökletes kifejezése: @hu
alternative label: soyluluk unvanı ile ilişkilidir @tr
alternative label: terme honorifique héréditaire @fr
alternative label: titre héréditaire @fr
alternative label: término honorífico hereditario @es
alternative label: título hereditario @es
alternative label: örökletes cím: @hu
alternative label: لقب شرف متوارث @ar
alternative label: 世袭头衔 @zh-hans
alternative label: 世袭荣誉称号 @zh-hans
definition: Bir aileyi, bir aileyle ilişkili kraliyet, soyluluk vb. gösteren bir kelime veya anlatımla ilişkilendirir. @tr
definition: Correla una famiglia a una parola o frase indicativa di regalità, nobiltà, etc. associata a una famiglia. @it
definition: Hozzákapcsol egy családot egy szóhoz vagy kifejezéshez, amely társulva egy családdal, királyi, nemesi stb. címre utal. @hu
definition: Liittää suvun sanaan tai ilmaukseen, joka osoittaa suvun kuninkaallista, aatelis- tms. arvoa.
definition: Met une famille en relation avec un mot ou une locution qui indique la royauté, la noblesse, etc. et qui est associé à une famille. @fr
definition: Relaciona una família amb una paraula o frase indicativa de reialesa, noblesa, etc., associada amb una família. @ca
definition: Relateert een familie aan een woord of uitdrukking wijzend op koningschap, adel etc, geassocieerd met een familie. @nl
definition: Relaterer en familie til et ord eller en frase som antyder tilknytning til kongehus, adel etc. som forbindes med en familie. @no

suvun tunnettu jäsen
has element type: 2
instruction number: 10.6
toolkit definition: A person who is a well-known individual who is a member of a family. @en
toolkit definition: Bir ailenin üyesi olup tanınmış bir birey olan kişi. @tr
toolkit definition: Een persoon die is een welbekend individu die een lid is van een familie. @nl
toolkit definition: Egy személy, egy jól ismert egyén, aki egy család tagja. @hu
toolkit definition: Ein bekanntes Individuum (Person), das Mitglied einer Familie ist. @de
toolkit definition: En velkjent person som er et familiemedlem. @no
toolkit definition: Ievērojama persona, kura pieder dzimtai/ ģimenei. @lv
toolkit definition: Person, der er et velkendt individ, som er medlem af en familie. @da
toolkit definition: Persona que és un individu ben conegut que és un membre d’una família. @ca
toolkit definition: Personne qui est un individu jouissant d’une certaine notoriété et est membre d’une famille. @fr
toolkit definition: Sukuun kuuluva henkilö, joka on yleisesti tunnettu.
toolkit definition: Un individuo ampliamente conocido, que es miembro de una familia. @es
toolkit definition: Un individuo famoso che è membro di una famiglia. @it
toolkit definition: Üldtuntud üksikisik, kes on perekonna liige. @et
toolkit definition: Ένα δημοφιλές άτομο το οποίο είναι μέλος μιας οικογένειας. @el
toolkit definition: شخص هو فرد معروف في عائلة. @ar
toolkit definition: 作为名人也作为家族成员的一个个人 @zh-hans
toolkit label: Bedeutendes Familienmitglied @de
toolkit label: ailenin seçkin üyesi @tr
toolkit label: család prominens tagja: @hu
toolkit label: framtredende familiemedlem @no
toolkit label: fremtrædende medlem af familien @da
toolkit label: ievērojams dzimtas/ģimenes piederīgais @lv
toolkit label: membre destacat d’una família @ca
toolkit label: membre illustre d’une famille @fr
toolkit label: membro prominente di famiglia @it
toolkit label: miembro prominente de la familia @es
toolkit label: perekonna silmapaistev liige @et
toolkit label: prominent lid van familie @nl
toolkit label: prominent member of family @en
toolkit label: suvun tunnettu jäsen
toolkit label: välkänd medlem av familjen/släkten @sv
toolkit label: διακεκριμένο μέλος της οικογένειας @el
toolkit label: فرد بارز في عائلة @ar
toolkit label: 家族的著名成员 @zh-hans
has subproperty: P50060
lexical alias: prominentMemberOfFamily.en
status: Published
type: Property
domain: C10008
label: a pour membre illustre d’une famille @fr
label: ailenin seçkin üyesi ile ilişkilidir @tr
label: család prominens tagja a következő: @hu
label: ha come membro prominente di famiglia @it
label: har framtredende familiemedlem @no
label: har fremtrædende medlem af familie @da
label: har välkänd medlem av familjen/släkten @sv
label: has prominent member of family @en
label: hat bedeutendes Familienmitglied @de
label: heeft prominent lid van familie @nl
label: ievērojams dzimtas/ģimenes piederīgais @lv
label: perekonna silmapaistev liige @et
label: té com a membre destacat d’una família @ca
label: έχει διακεκριμένο μέλος της οικογένειας @el
label: لها فرد بارز في العائلة @ar
label: 有家族的著名成员 @zh-hans
sub property of: suvun henkilöjäsen
definition: Bir aileyi, bir ailenin üyesi olan tanınmış bir birey olan bir kişiyle ilişkilendirir. @tr
definition: Correla una famiglia a un individuo famoso che è membro di una famiglia. @it
definition: Hozzákapcsol egy családot egy személyhez, egy jól ismert egyénhez, aki egy család tagja. @hu
definition: Liittää suvun henkilöön, joka on yleisesti tunnettu suvun jäsen
definition: Met une famille en relation avec une personne qui est un individu jouissant d’une certaine notoriété et est membre d’une famille. @fr
definition: Relaciona una família amb un individu ben conegut que és un membre d’una família. @ca
definition: Relateert een familie aan een persoon die is een welbekend individu die een lid is van een familie. @nl
definition: Relaterer en familie til en person, der er et velkendt individ, som er medlem af en familie. @da
definition: Relaterer en familie til en velkjent person som er et familiemedlem. @no
definition: Relates a family to a person who is a well-known individual who is a member of a family. @en
definition: Sasaista dzimtu/ģimeni ar personu, kura ir ievērojama persona, kura pieder dzimtai/ ģimenei. @lv
definition: Seostab perekonna üldtuntud üksikisikuga, kes on perekonna liige. @et
definition: Setzt eine Familie in Beziehung zu einem bekannten Individuum (Person), das Mitglied einer Familie ist. @de
definition: Συνδέει μια οικογένεια με ένα ευρέως γνωστό άτομο το οποίο είναι μέλος μιας οικογένειας. @el
definition: يربط عائلة بشخص مشهور هو عضو في عائلة @ar
definition: 将家族与作为名人也作为家族成员的一个个人关联起来。 @zh-hans

suvun nimi
has element type: 3
instruction number: 10.2
toolkit definition: A nomen that is an appellation of family in natural language and phrasing used in common discourse. @en
toolkit definition: Doğal dilde ve ortak söylemde kullanılan ifadelerde, bir ailenin unvanı olan bir isim. @tr
toolkit definition: Dzimtas/ģimenes apzīmējums dabiskajā valodā, ko izmanto savstarpējā saziņā. @lv
toolkit definition: Een nomen dat is een benaming van familie in natuurlijke taal en formulering gebruikt in alledaags taalgebruik. @nl
toolkit definition: Egy nomen, egy család megnevezése természetes nyelven és közbeszédben használt kifejezéssel. @hu
toolkit definition: Eine Bezeichnung für eine Familie in natürlicher Sprache und Ausdrucksweise, die beim normalen Sprechen und Schreiben verwendet wird. @de
toolkit definition: En betegnelse for familie på et naturlig språk og med frasering brukt i alminnelig diskurs. @no
toolkit definition: Nomen que és una apel·lació de família en llenguatge i frases naturals usada en el discurs comú. @ca
toolkit definition: Nomen qui est une appellation de famille exprimée dans un langage et une formulation naturels et utilisée dans le langage courant. @fr
toolkit definition: Nomen, joka on suvusta yleisessä diskurssissa käytetty nimitys, joka on luonnollisella kielellä ja luonnollisessa sanamuodossa.
toolkit definition: Nomen, som er en benævnelse på familie på normalsprog og med formuleringer, som bruges alment. @da
toolkit definition: Perekonna nimetus loomulikus keeles ja sõnastuses, mida kasutatakse ühises diskursuses. @et
toolkit definition: Una palabra, un carácter o grupo de palabras y/o caracteres mediante los cuales se conoce una familia. @es
toolkit definition: Μια λέξη, χαρακτήρας ή ομάδα λέξων ή/και χαρακτήρων μέσω των οποίων είναι γνωστή μια οικογένεια. @el
toolkit definition: تسمية هي اسم عائلة في اللغة الطبيعية وفي العبارات المستخدمة في الخطاب العام. @ar
toolkit definition: 作为用自然语言和普通话语措词表达的家族的称谓的一个命名 @zh-hans
toolkit label: Name einer Familie @de
toolkit label: aile adı @tr
toolkit label: családnév: @hu
toolkit label: dzimtas/ģimenes vārds/nosaukums @lv
toolkit label: familienavn @no
toolkit label: naam van familie @nl
toolkit label: name of family @en
toolkit label: navn på familie @da
toolkit label: nom de família @ca
toolkit label: nom d’une famille @fr
toolkit label: nombre de la familia @es
toolkit label: perekonna nimi @et
toolkit label: suvun nimi
toolkit label: όνομα της οικογένειας @el
toolkit label: اسم عائلة @ar
toolkit label: 家族的名称 @zh-hans
has subproperty: suvun varianttinimi
has subproperty: suvun ensisijainen nimi
has subproperty: P50061
lexical alias: nameOfFamily.en
status: Published
type: Property
domain: C10008
label: a pour nom d’une famille @fr
label: ailenin adı ile ilişkilidir @tr
label: család neve a következő: @hu
label: dzimtas/ģimenes vārds/nosaukums @lv
label: har familienavn @no
label: har navn på familie @da
label: has name of family @en
label: hat Namen einer Familie @de
label: heeft naam van familie @nl
label: perekonna nimi @et
label: té com a nom de família @ca
label: έχει όνομα της οικογένειας @el
label: له اسم عائلة @ar
label: 有家族的名称 @zh-hans
sub property of: suvun nimitys
sub property of: yhteistoimijan nimi
definition: Bir aileyi, doğal dilde ve ortak söylemde kullanılan ifadelerde, ailenin unvanı olan bir adla ilişkilendirir. @tr
definition: Hozzákapcsol egy családot egy nomenhez, egy család megnevezéséhez természetes nyelven és közbeszédben használt kifejezéssel. @hu
definition: Liittää suvun nomeniin, joka on luonnollisella kielellä ja sanamuodolla oleva, yleisessä diskurssissa käytetty nimitys suvusta.
definition: Met une famille en relation avec un nomen qui est une appellation de famille exprimée dans un langage et une formulation naturels et utilisée dans le langage courant. @fr
definition: Relaciona una família amb un nomen que és una apel·lació de família en llenguatge i frases naturals usada en el discurs comú. @ca
definition: Relateert een familie aan een nomen dat is een benaming van familie in natuurlijke taal en formulering gebruikt in alledaags taalgebruik. @nl
definition: Relaterer en familie til en betegnelse for familie på et naturlig språk og med frasering brukt i alminnelig diskurs. @no
definition: Relaterer en familie til et nomen, som er en benævnelse på familie på normalsprog og med formuleringer, som bruges alment. @da
definition: Relates a family to a nomen that is an appellation of family in natural language and phrasing used in common discourse. @en
definition: Sasaista dzimtu/ģimeni ar nomenu, kas ir dzimtas/ģimenes apzīmējums dabiskajā valodā, ko izmanto savstarpējā saziņā. @lv
definition: Seostab perekonna perekonna nimetusega loomulikus keeles ja sõnastuses, mida kasutatakse ühises diskursuses. @et
definition: Setzt eine Familie in Beziehung zu einer Bezeichnung für eine Familie in natürlicher Sprache und Ausdrucksweise, die beim normalen Sprechen und Schreiben verwendet wird. @de
definition: Συνδέει μια οικογένεια με μια λέξη, χαρακτήρα ή ομάδα λέξεων ή/και χαρακτήρων με τους οποίους μια οικογένεια είναι γνωστή. @el
definition: يربط عائلة بتسمية لعائلة في اللغة الطبيعية وفي العبارات المستخدمة في الخطاب العام. @ar
definition: 将一个家族与作为用自然语言和普通话语措词表达的家族的称谓的一个命名关联起来。 @zh-hans

suvun perustama yhteisö
has element type: 2
instruction number: 29.5
toolkit definition: A corporate body who is initiated by a family. @en
toolkit definition: Asutus, millele perekond on aluse pannud. @et
toolkit definition: Bir aile tarafından üyeliğe kabul edilmiş bir tüzel kişi. @tr
toolkit definition: Collectivité qui est établie par une famille. @fr
toolkit definition: Een corporatie die is gesticht door een familie. @nl
toolkit definition: Egy testület, amelynek létrehozását egy család kezdeményezte. @hu
toolkit definition: Eine Körperschaft, die von einer Familie gegründet wurde. @de
toolkit definition: En korporasjon som er opprettet av en familie. @no
toolkit definition: Ente istituito da una famiglia. @it
toolkit definition: Entitat corporativa que és iniciada per una família. @ca
toolkit definition: Institūcija, ko dibinājusi dzimta/ģimene. @lv
toolkit definition: Korporation, som er igangsat af en familie. @da
toolkit definition: Una entidad corporativa que la familia fundó. @es
toolkit definition: Yhteisö, jonka suku on perustanut.
toolkit definition: Ένας οργανισμός τον οποίο ίδρυσε μια οικογένεια. @el
toolkit definition: هيئة بادرت بتأسيسها عائلة. @ar
toolkit definition: 被一个家族发起的一个团体 @zh-hans
toolkit label: Von einer Familie gegründete Körperschaft @de
toolkit label: aile tarafından kurulan tüzel kişi @tr
toolkit label: collectivité fondée d’une famille @fr
toolkit label: család által alapított testület: @hu
toolkit label: dzimtas/ģimenes dibinātā institūcija @lv
toolkit label: ente fondato di famiglia @it
toolkit label: entidad corporativa fundada @es
toolkit label: entitat corporativa fundada per una família @ca
toolkit label: founded corporate body of family @en
toolkit label: korporasjon grunnlagt av familie @no
toolkit label: korporation grundlagt af familie @da
toolkit label: opgerichte corporatie van familie @nl
toolkit label: perekonna asutatud asutus @et
toolkit label: suvun perustama yhteisö
toolkit label: ιδρυθέν συλλογικό όργανο της οικογένειας @el
toolkit label: أسست هيئة لعائلة @ar
toolkit label: 家族的被创办团体 @zh-hans
has subproperty: P50062
lexical alias: foundedCorporateBodyOfFamily.en
status: Published
type: Property
domain: C10008
label: a pour collectivité fondée d’une famille @fr
label: ailenin kurduğu tüzel kişi ile ilişkilidir @tr
label: család által alapított testület a következő: @hu
label: dzimtas/ģimenes dibinātā institūcija @lv
label: ha ente fondato di famiglia @it
label: har korporasjon grunnlagt av familie @no
label: har korporation grundlagt af familie @da
label: has founded corporate body of family @en
label: hat von einer Familie gegründete Körperschaft @de
label: heeft opgerichte corporatie van familie @nl
label: perekonna asutatud asutus @et
label: té com a entitat corporativa fundada per una família @ca
label: έχει ιδρύσει συλλογικό όργανο της οικογένειας @el
label: أسست هيئة لعائلة @ar
label: 有家族的被创办团体 @zh-hans
sub property of: sukuun liittyvä yhteisö
sub property of: yhteistoimijan perustama yhteisö
definition: Bir aileyi, bir aile tarafından üyeliğe kabul edilmiş bir tüzel kişilik ile ilişkilendirir. @tr
definition: Correla una famiglia a un ente istituito da una famiglia. @it
definition: Hozzákapcsol egy családot egy testülethez, amelynek létrehozását egy család kezdeményezte. @hu
definition: Liittää suvun yhteisöön, jonka suku on perustanut.
definition: Met une famille en relation avec une collectivité qui est établie par une famille. @fr
definition: Relaciona una família amb una entitat corporativa que és iniciada per una família. @ca
definition: Relateert een familie aan een corporatie die is gesticht door een familie. @nl
definition: Relaterer en familie til en korporasjon som er opprettet av en familie. @no
definition: Relaterer en familie til en korporation, som er igangsat af en familie. @da
definition: Relates a family to a corporate body who is initiated by a family. @en
definition: Sasaista dzimtu/ģimeni ar institūciju, ko dibinājusi dzimta/ģimene. @lv
definition: Seostab perekonna asutusega, millele perekond on aluse pannud. @et
definition: Setzt eine Familie in Beziehung zu einer Körperschaft, die von einer Familie gegründet wurde. @de
definition: Συνδέει μια οικογένεια με έναν οργανισμό που ίδρυσε μια οικογένεια. @el
definition: يربط عائلة بهيئة بادرت بتأسيسها عائلة. @ar
definition: 将一个家族与一个家族发起的一个团体关联起来。 @zh-hans

suvun sponsoroima yhteisö
has element type: 2
instruction number: 29.5
toolkit definition: A corporate body who is sponsored by a family. @en
toolkit definition: Asutus, mida perekond majanduslikult toetab. @et
toolkit definition: Bir aile tarafından desteklenen tüzel kişi. @tr
toolkit definition: Collectivité qui est parrainée par une famille. @fr
toolkit definition: Een corporatie die is gesponsord door een familie. @nl
toolkit definition: Egy testület, amelyet egy család szponzorál. @hu
toolkit definition: Eine Körperschaft, die von einer Familie gefördert wird. @de
toolkit definition: En korporasjon som en familie er sponsor av. @no
toolkit definition: Ente sponsorizzato da una famiglia. @it
toolkit definition: Entitat corporativa que és patrocinada per una família. @ca
toolkit definition: Institūcija, ko sponsorē dzimta/ģimene. @lv
toolkit definition: Korporation, som er sponsoreret af en familie. @da
toolkit definition: Una entidad corporativa que la familia patrocina. @es
toolkit definition: Yhteisö, jota suku sponsoroi.
toolkit definition: Ένας οργανισμός τον οποίο η οικογένεια υποστηρίζει μέσω χορηγίας, χρηματοδότησης κ.λπ. @el
toolkit definition: هيئة ترعاها عائلة. @ar
toolkit definition: 被一个家族赞助的一个团体 @zh-hans
toolkit label: Familie als Sponsorin/Sponsor einer Körperschaft von @de
toolkit label: ailenin sponsor olduğu tüzel kişi @tr
toolkit label: collectivité parrainée d’une famille @fr
toolkit label: család által szponzorált testület: @hu
toolkit label: dzimtas/ģimenes sponsorētā institūcija @lv
toolkit label: ente sponsorizzato di famiglia @it
toolkit label: entidad corporativa patrocinada @es
toolkit label: entitat corporativa patrocinada per una família @ca
toolkit label: gesponsorde corporatie van familie @nl
toolkit label: korporasjon sponset av familie @no
toolkit label: korporation sponsoreret af familie @da
toolkit label: perekonna toetatud asutus @et
toolkit label: sponsored corporate body of family @en
toolkit label: suvun sponsoroima yhteisö
toolkit label: επιχορηγούμενο συλλογικό όργανο της οικογένειας @el
toolkit label: هيئة تحت رعاية عائلة @ar
toolkit label: 家族的被赞助的团体 @zh-hans
has subproperty: P50063
lexical alias: sponsoredCorporateBodyOfFamily.en
status: Published
type: Property
domain: C10008
label: a pour collectivité parrainée d’une famille @fr
label: ailenin sponsor olduğu tüzel kişi ile ilişkilidir @tr
label: család szponzorált testülete a következő: @hu
label: dzimtas/ģimenes sponsorētā institūcija @lv
label: ha sostenuto un ente di famiglia @it
label: har korporasjon sponset av familie @no
label: har korporation sponsoreret af familie @da
label: has sponsored corporate body of family @en
label: hat Familie als Sponsorin/Sponsor einer Körperschaft von @de
label: heeft gesponsorde corporatie van familie @nl
label: perekonna toetatud asutus @et
label: té com a entitat corporativa patrocinada per una família @ca
label: έχει χορηγήσει συλλογικό όργανο της οικογένειας @el
label: لها هيئة ترعاها عائلة @ar
label: 有家族的被赞助的团体 @zh-hans
sub property of: sukuun liittyvä yhteisö
sub property of: yhteistoimijan sponsoroima yhteisö
alternative label: collectivité commanditée d’une famille @fr
definition: Bir aileyi, bir aile tarafından desteklenen bir tüzel kişilikle ilişkilendirir. @tr
definition: Correla una famiglia a un ente sponsorizzato da una famiglia. @it
definition: Hozzákapcsol egy családot egy testülethez, amelyet egy család szponzorál. @hu
definition: Liittää suvun yhteisöön, jota suku sponsoroi.
definition: Met une famille en relation avec une collectivité qui est parrainée par une famille. @fr
definition: Relaciona una família amb una entitat corporativa que és patrocinada per una família. @ca
definition: Relateert een familie aan een corporatie die is gesponsord door een familie. @nl
definition: Relaterer en familie til en korporasjon som en familie er sponsor av. @no
definition: Relaterer en familie til en korporation, som er sponsoreret af en familie. @da
definition: Relates a family to a corporate body who is sponsored by a family. @en
definition: Sasaista dzimtu/ģimeni ar institūciju, ko sponsorē dzimta/ģimene. @lv
definition: Seostab perekonna asutusega, mida perekond majanduslikult toetab. @et
definition: Setzt eine Familie in Beziehung zu einer Körperschaft, die von einer Familie gefördert wird. @de
definition: Συνδέει μια οικογένεια με έναν οργανισμό που μια οικογένεια υποστηρίζει μέσω χορηγίας, χρηματοδότησης κ.λπ. @el
definition: يربط عائلة بهيئة ترعاها عائلة. @ar
definition: 将一个家族与被一个家族赞助的一个团体关联起来。 @zh-hans

sukuhistoria
has element type: 6
instruction number: 10.9
toolkit definition: A summary of information about the history of a family or its members. @en
toolkit definition: Bir ailenin veya üyelerinin geçmişi hakkındaki bilgilerin özeti. @tr
toolkit definition: Een samenvatting van informatie over de geschiedenis van een familie of haar leden. @nl
toolkit definition: Egy család vagy a tagjainak történetéről szóló információk összefoglalása. @hu
toolkit definition: Elämäkerrallista tietoa suvusta tai suvun jäsenistä.
toolkit definition: Et sammendrag av informasjon om en families eller familiemedlemmenes historie. @no
toolkit definition: Información biográfica sobre la familia y sus miembros @es
toolkit definition: Informationen über die Geschichte einer Familie oder ihrer Mitglieder. @de
toolkit definition: Informācija par dzimtas/ģimenes vai tās piederīgo vēsturi. @lv
toolkit definition: Kokkuvõtlik info perekonna või selle liikmete aja- või eluloost. @et
toolkit definition: Opsummering af oplysninger om en families- eller dens medlemmers historie. @da
toolkit definition: Resum de la informació sobre la història d’una família o dels seus membres. @ca
toolkit definition: Résumé d’informations sur l’histoire d’une famille ou de ses membres. @fr
toolkit definition: Sommario d'informazioni sulla storia di una famiglia o dei suoi membri. @it
toolkit definition: Μια συνοπτική πληροφόρηση αναφορικά με το ιστορικό της οικογένιας ή/και τα μέλη της. @el
toolkit definition: ملخص للمعلومات المتعلقة بتاريخ العائلة أو أفرادها. @ar
toolkit definition: 关于一个家族及其成员历史信息的概要 @zh-hans
toolkit label: Familiengeschichte @de
toolkit label: aile tarihi @tr
toolkit label: családtörténet: @hu
toolkit label: dzimtas/ģimenes vēsture @lv
toolkit label: familiegeschiedenis @nl
toolkit label: familiehistorie @da
toolkit label: family history @en
toolkit label: historia de la familia @es
toolkit label: historique d’une famille @fr
toolkit label: història d’una família @ca
toolkit label: perekonnalugu @et
toolkit label: storia familiare @it
toolkit label: sukuhistoria
toolkit label: οικογενειακή ιστορία @el
toolkit label: تاريخ عائلة @ar
toolkit label: 家族历史 @zh-hans
has subproperty: P50064
lexical alias: familyHistory.en
status: Published
type: Property
domain: C10008
label: a pour historique d’une famille @fr
label: aile geçmişi ile ilişkilidir @tr
label: családtörténete a következő: @hu
label: dzimtas/ģimenes vēsture @lv
label: ha come storia di famiglia @it
label: har familiehistorie @da
label: has family history @en
label: hat Familiengeschichte @de
label: heeft familiegeschiedenis @nl
label: perekonnalugu @et
label: té com a història d’una família @ca
label: έχει οικογενειακή ιστορία @el
label: له تاريخ عائلة @ar
label: 有家族历史 @zh-hans
definition: Bir aileyi, bir ailenin veya üyelerinin geçmişi hakkındaki bilgilerin bir özetiyle ilişkilendirir. @tr
definition: Correla una famiglia a un sommario d'informazioni sulla storia di una famiglia o dei suoi membri. @it
definition: Hozzákapcsol egy családot egy család vagy a tagjainak történetéről szóló információk összefoglalásához. @hu
definition: Liittää suvun elämäkerralliseen tietoon suvusta ja/tai suvun jäsenistä.
definition: Met une famille en relation avec un résumé d’informations sur l’histoire d’une famille ou de ses membres. @fr
definition: Relaciona una família amb un resum de la informació sobre la història d’una família o dels seus membres. @ca
definition: Relateert een familie aan een samenvatting van informatie over de geschiedenis van een familie of haar leden. @nl
definition: Relaterer en familie til en opsummering af oplysninger om en families- eller dens medlemmers historie. @da
definition: Relaterer en familie til et sammendrag av informasjon om en families eller familiemedlemmenes historie. @no
definition: Relates a family to a summary of information about the history of a family or its members. @en
definition: Sasaista dzimtu/ģimeni ar informāciju par dzimtas/ģimenes vai tās piederīgo vēsturi. @lv
definition: Seostab perekonna kokkuvõtliku infoga perekonna või selle liikmete aja- või eluloost. @et
definition: Setzt eine Familie in Beziehung zu Informationen über die Geschichte einer Familie oder ihrer Mitglieder. @de
definition: Συνδέει μια οικογένεια με μια περίληψη πληροφοριών σχετικών με την ιστορία μιας οικογένειας ή/και των μελών της. @el
definition: يربط عائلة بمعلومات موجزة عن تاريخ عائلة أو عن أفرادها. @ar
definition: 将一个家族与关于一个家族及其成员历史信息的概要关联起来。 @zh-hans

suvun ensisijainen nimi
has element type: 3
instruction number: 10.2.2
toolkit definition: A nomen that is a name of family that is selected for preference in a specific application or context. @en
toolkit definition: Belirli bir uygulama veya bağlamda tercih için seçilen bir aile adı olan bir isim. @tr
toolkit definition: Dzimtas/ģimenes vārds, kurš ir izvēlēts noteiktam lietojumam vai noteiktā kontekstā. @lv
toolkit definition: Een nomen dat is een naam van familie die de voorkeur heeft gekregen in een specifieke applicatie of context. @nl
toolkit definition: Egy családnév nomen, amelyet egy bizonyos alkalmazásban vagy kontextusban előnyben részesítenek. @hu
toolkit definition: Ein Name einer Familie, der in einer bestimmten Anwendung oder in einem bestimmten Kontext als Vorzugsform bestimmt wird. @de
toolkit definition: El nombre o la forma del nombre elegida para identificar la familia. @es
toolkit definition: Et navn på familie som er valgt som preferanse i en bestemt applikasjon eller kontekst. @no
toolkit definition: Nome di famiglia che è scelto come preferito in una specifica applicazione o contesto. @it
toolkit definition: Nomen que és un nom de família que se selecciona com a preferent en una aplicació o un context específic. @ca
toolkit definition: Nomen qui est un nom d’une famille faisant l’objet d’un choix privilégié dans une application ou un contexte spécifiques. @fr
toolkit definition: Nomen, joka on suvun nimi, joka on valittu ensisijaiseksi tietyssä sovelluksessa tai kontekstissa.
toolkit definition: Nomen, som er navn på familie, som er valgt som foretrukken i en specifik applikation eller kontekst. @da
toolkit definition: Perekonna nimi, mis kindlas rakenduses või kontekstis on valitud eelistatuks. @et
toolkit definition: Ένα όνομα ή μορφή ονόματος που έχει επιλεγεί για την ταύτιση μιας οικογένειας. @el
toolkit definition: اسم عائلة اختير كاسم مفضل في تطبيق أو في سياق محدد. @ar
toolkit definition: 作为家族的名称、在特定应用和语境下首选的一个命名 @zh-hans
toolkit label: Ailenin tercih ettiği isim @tr
toolkit label: Bevorzugter Name einer Familie @de
toolkit label: család előnyben részesített neve: @hu
toolkit label: dzimtas/ģimenes prioritārais vārds @lv
toolkit label: foretrukket familienavn @no
toolkit label: foretrukket navn på familie @da
toolkit label: föredraget namn för familjen/släkten @sv
toolkit label: geprefereerde naam van familie @nl
toolkit label: nom preferit de família @ca
toolkit label: nom privilégié d’une famille @fr
toolkit label: nombre preferido de la familia @es
toolkit label: nome preferito di famiglia @it
toolkit label: perekonna eelisnimi @et
toolkit label: preferred name of family @en
toolkit label: suvun ensisijainen nimi
toolkit label: προτιμώμενο όνομα της οικογένειας @el
toolkit label: اسم مفضل لعائلة @ar
toolkit label: 家族的首选名称 @zh-hans
has subproperty: P50065
lexical alias: preferredNameOfFamily.en
status: Published
type: Property
domain: C10008
label: a pour nom privilégié d’une famille @fr
label: család előnyben részesített neve a következő: @hu
label: dzimtas/ģimenes prioritārais vārds @lv
label: ha come nome preferito di famiglia @it
label: har foretrukket familienavn @no
label: har foretrukket navn på familie @da
label: har föredraget namn för familjen/släkten @sv
label: has preferred name of family @en
label: hat bevorzugten Namen einer Familie @de
label: heeft geprefereerde naam van familie @nl
label: perekonna eelisnimi @et
label: tercih edilen aile adı ile ilişkilidir @tr
label: té com a nom preferit de família @ca
label: έχει προτιμώμενο όνομα της οικογένειας @el
label: له اسم مفضل لعائلة @ar
label: 有家族的首选名称 @zh-hans
sub property of: suvun nimi
sub property of: yhteistoimijan ensisijainen nimi
alternative label: -
alternative label: Aile için tercih edilen isim @tr
alternative label: Bevorzugter Name für eine Familie @de
alternative label: Foretrukket navn på familie @da
alternative label: család előnyben részesített neve: @hu
alternative label: nombre preferido para familia @es
alternative label: preferred name for family @en
alternative label: اسم مفضل لعائلة @ar
alternative label: 给家族的首选名称 @zh-hans
definition: Bir aileyi, belirli bir uygulama veya bağlamda tercih edilmek üzere seçilen bir aile adı olan isimle ilişkilendirir. @tr
definition: Correla una famiglia a un nome di famiglia scelto come preferito in una specifica applicazione o contesto. @it
definition: Hozzákapcsol egy családot egy családnév nomenhez, amelyet egy bizonyos alkalmazásban vagy kontextusban előnyben részesítenek. @hu
definition: Liittää suvun nomeniin, joka on suvun nimi, joka on valittu ensisijaiseksi tietyssä sovelluksessa tai kontekstissa.
definition: Met une famille en relation avec un nomen qui est un nom d’une famille faisant l’objet d’un choix privilégié dans une application ou un contexte spécifiques. @fr
definition: Relaciona una família amb un nomen que és un nom de família que se selecciona com a preferent en una aplicació o un context específic. @ca
definition: Relateert een familie aan een nomen dat is een naam van familie die de voorkeur heeft gekregen in een specifieke applicatie of context. @nl
definition: Relaterer en familie til et navn på familie som er valgt som preferanse i en bestemt applikasjon eller kontekst. @no
definition: Relaterer en familie til et nomen, som er et navn på familie, som er valgt som præference i en specifik anvendelse eller kontekst. @da
definition: Relates a family to a nomen that is a name of family that is selected for preference in a specific application or context. @en

lahjoittaja (toimija) kappaleelle
has element type: 2
instruction number: 18.5
toolkit definition: An item that is donated to another owner who is an agent. @en
toolkit definition: Bir temsilci olan başka bir mülk sahibine bağışlanan bir kopya. @tr
toolkit definition: Een item dat is geschonken aan een andere eigenaar die een actor is. @nl
toolkit definition: Egy példány, amelyet egy másik tulajdonos ágensnek adományoznak. @hu
toolkit definition: Ein Exemplar, das einer anderen Eigentümerin/einem anderen Eigentümer (Akteur) überlassen wird. @de
toolkit definition: Eksemplar, mille tegija on kinkinud teisele omanikule. @et
toolkit definition: Eksemplar, som er doneret til en anden ejer, som er en agent. @da
toolkit definition: Et eksemplar som er gitt til en annen eier som er en agent. @no
toolkit definition: Item donato a un altro proprietario che è agente. @it
toolkit definition: Item qui est offert en don à un autre propriétaire qui est un agent. @fr
toolkit definition: Kappale, joka on lahjoitettu toiselle omistajalle, joka on toimija.
toolkit definition: Vienība, ko aģents ziedojis citam īpašniekam. @lv
toolkit definition: Ítem que es dona a un altre propietari que és un agent. @ca
toolkit definition: Ένα αντίτυπο που έχει δωρηθεί σε κάποιον άλλον ιδιοκτήτη. @el
toolkit definition: مفردة تم التبرع بها إلى مالك آخر هو وكيل. @ar
toolkit definition: 被捐赠给作为一个行为者的另一个拥有者的一个单件 @zh-hans
toolkit label: Akteur als Stifterin/Stifter von @de
toolkit label: adományozó ágense: @hu
toolkit label: agent donant de @ca
toolkit label: agent donateur de @fr
toolkit label: agent, som er donor af @da
toolkit label: agente donatore di @it
toolkit label: annetaja (tegija) eksemplarile @et
toolkit label: bağışcı temsilci @tr
toolkit label: donor agent of @en
toolkit label: giver av (agent) @no
toolkit label: ir ziedotājs (aģents) @lv
toolkit label: lahjoittaja (toimija) kappaleelle
toolkit label: schenker-actor van @nl
toolkit label: δωρητής φορέας του @el
toolkit label: وكيل مانح لـ @ar
toolkit label: 捐赠者行为者 @zh-hans
has subproperty: lahjoittaja (henkilö) kappaleelle
has subproperty: lahjoittaja (yhteistoimija) kappaleelle
has subproperty: P50066
lexical alias: donorAgentOf.en
status: Published
type: Property
domain: C10002
label: adományozó ágense a következőnek: @hu
label: annetaja (tegija) eksemplarile @et
label: bağışçı temsilcisidir @tr
label: er agent, som er donor af @da
label: er giver av (agent) @no
label: est un agent donateur de @fr
label: ir ziedotājs (aģents) @lv
label: is donor agent of @en
label: is schenker-actor van @nl
label: ist Akteur als Stifterin/Stifter von @de
label: è donatore agente di @it
label: és agent donant de @ca
label: είναι δωρητής φορέας του @el
label: هو وكيل متبرع لـ @ar
label: 是……的捐赠者行为者 @zh-hans
sub property of: entinen omistaja (toimija) kappaleessa
alternative label: Stifter von @de
alternative label: adományozója: @hu
alternative label: annetaja eksemplarile @et
alternative label: bağışçı @tr
alternative label: donador de @es
alternative label: donant de @ca
alternative label: donateur de @fr
alternative label: donatore di @it
alternative label: donor af @da
alternative label: donor of @en
alternative label: giver av @no
alternative label: lahjoitus
alternative label: δωρητής του @el
alternative label: مانح لـ @ar
alternative label: ……的捐赠者 @zh-hans
definition: Bir temsilciyi, temsilci olan başka bir sahibine bağışlanan bir kopyayla ilişkilendirir. @tr
definition: Correla un agente a un item donato a un altro proprietario che è un agente. @it
definition: Hozzákapcsol egy ágenst egy példányhoz, amelyet egy másik tulajdonos ágensnek adományoznak. @hu
definition: Liittää toimijan kappaleeseen, jonka toimija on lahjoittanut toiselle omistajalle.
definition: Met un agent en relation avec un item qui est offert en don à un autre propriétaire qui est un agent. @fr
definition: Relaciona un agent amb un ítem que es dona a un altre propietari que és un agent. @ca
definition: Relateert een actor aan een item dat is geschonken aan een andere eigenaar die een actor is. @nl

myyjä (toimija) kappaleelle
has element type: 2
instruction number: 18.5
toolkit definition: An item that is sold to another owner who is an agent. @en
toolkit definition: Bir temsilci olan başka bir mülk sahibine satılan bir kopya. @tr
toolkit definition: Een item dat is verkocht aan een andere eigenaar die een actor is. @nl
toolkit definition: Egy példány, amelyet egy másik tulajdonos ágensnek adnak el. @hu
toolkit definition: Ein Exemplar, das an eine andere Eigentümerin/einen anderen Eigentümer (Akteur) verkauft wird. @de
toolkit definition: Eksemplar, mille tegija on müünud teisele omanikule. @et
toolkit definition: Eksemplar, som er solgt til en anden ejer, som er en agent. @da
toolkit definition: Et eksemplar som er solgt til en annen eier som er en agent. @no
toolkit definition: Item qui est vendu à un autre propriétaire qui est un agent. @fr
toolkit definition: Kappale, joka on myyty toiselle omistajalle, joka on toimija.
toolkit definition: Vienība, ko aģents pārdod citam īpašniekam. @lv
toolkit definition: item venduto a un altro proprietario che è agente. @it
toolkit definition: Ítem que es ven a un altre propietari que és un agent. @ca
toolkit definition: Ένα αντίτυπο που πουλήθηκε σε κάποιον άλλον ιδιοκτήτη. @el
toolkit definition: مفردة تم بيعها لمالك آخر هو وكيل. @ar
toolkit definition: 被出售给作为行为者的另一个拥有者的单件 @zh-hans
toolkit label: Akteur als Verkäuferin/Verkäufer von @de
toolkit label: agent vendeur de @fr
toolkit label: agent venedor de @ca
toolkit label: agent, som er sælger af @da
toolkit label: agente venditore di @it
toolkit label: ir pārdevējs (aģents) @lv
toolkit label: myyjä (toimija) kappaleelle
toolkit label: müüja (tegija) eksemplarile @et
toolkit label: satıcı temsilcisi @tr
toolkit label: selger av (agent) @no
toolkit label: seller agent of @en
toolkit label: verkoper-actor van @nl
toolkit label: értékesítő ágense: @hu
toolkit label: πωλητής φορέας του @el
toolkit label: وكيل بائع @ar
toolkit label: ……的出售者行为者 @zh-hans
has subproperty: myyjä (henkilö) kappaleelle
has subproperty: myyjä (yhteistoimija) kappaleelle
has subproperty: P50067
lexical alias: sellerAgentOf.en
status: Published
type: Property
domain: C10002
label: er agent, som er sælger af @da
label: er selger av (agent) @no
label: est un agent vendeur de @fr
label: ir pārdevējs (aģents) @lv
label: is seller agent of @en
label: is verkoper-actor van @nl
label: ist Akteur als Verkäuferin/Verkäufer von @de
label: müüja (tegija) eksemplarile @et
label: satış temsilcisi @tr
label: è venditore agente di @it
label: értékesítő ágense a következőnek: @hu
label: és agent venedor de @ca
label: είναι πωλητής φορέας του @el
label: هو وكيل بائع لـ @ar
label: 是……的出售者行为者 @zh-hans
sub property of: entinen omistaja (toimija) kappaleessa
alternative label: Verkäufer von @de
alternative label: myyjä kappaleelle
alternative label: müüja eksemplarile @et
alternative label: satıcı @tr
alternative label: selger av @no
alternative label: seller of @en
alternative label: sælger af @da
alternative label: vendedor de @es
alternative label: vendeur de @fr
alternative label: venditore di @it
alternative label: venedor de @ca
alternative label: értékesítője: @hu
alternative label: πωλητής του @el
alternative label: بائع لـ @ar
alternative label: ……的出售者 @zh-hans
definition: Bir temsilciyi, temsilci olan başka bir sahibine satılan bir kopyayla ilişkilendirir. @tr
definition: Correla un agente a un item venduto a un altro proprietario che è un agente. @it
definition: Hozzákapcsol egy ágenst egy példányhoz, amelyet egy másik tulajdonos ágensnek adnak el. @hu
definition: Liittää toimijan kappaleeseen, jonka toimija on myynyt toiselle omistajalle.
definition: Met un agent en relation avec un item qui est vendu à un autre propriétaire qui est un agent. @fr
definition: Relaciona un agent amb un ítem que es ven a un altre propietari que és un agent. @ca
definition: Relateert een actor aan een item dat is verkocht aan een andere eigenaar die een actor is. @nl

säätävän hallintoelimen päätös
has element type: 2
instruction number: 18.5
toolkit definition: A work that is a law, regulation, constitution, court rule, or other legislation enacted by a corporate body who is a government. @en
toolkit definition: Bir yönetim olan tüzel bir kişi tarafından yürürlüğe konulan yasa, yönetmelik, anayasa, mahkeme kuralı veya diğer mevzuat niteliğindeki bir çalışma. @tr
toolkit definition: Darbs, kas ir likums, noteikumi, konstitūcija, tiesas nolēmumi vai citi tiesību akti, ko ieviesusi institūcija, kas ir valsts pārvaldes iestāde. @lv
toolkit definition: Een werk dat een wet, regeling, grondwet, rechterlijke uitspraak of andere regelgeving is, aangenomen door een corporatie die een regering is. @nl
toolkit definition: Egy mű, amely egy kormányzati testület által beiktatott törvény, rendelet, alkotmány, bírósági határozat, vagy egyéb jogszabály. @hu
toolkit definition: Ein Werk, bei dem es sich um ein Gesetz, eine Verordnung, eine Verfassung, eine Rechtsverordnung oder eine andere Gesetzgebung handelt, das/die von einer Regierung erlassen wird. @de
toolkit definition: Et verk som er en lov, vedtekt, grunnlov, rettergangsregel etc. eller annen lovgivning som vedtas av en korporasjon som er en regjeringsmakt. @no
toolkit definition: Lainsäädännöllinen teos kuten laki, asetus, perustuslaki, tuomioistuinta koskeva sääntö tms., jonka julkishallinnollinen yhteisö on säätänyt.
toolkit definition: Obra que és una llei, un reglament, una constitució, una regla de funcionament d’un tribunal o qualsevol altra legislació promulgada per una entitat corporativa que és un govern. @ca
toolkit definition: Opera che è una legge, regolamento, costituzione, norma di un tribunale emanata da un organo che è un governo. @it
toolkit definition: Teos, mis on seadus, määrus, konstitutsioon, menetluseeskiri või muu õigusakt, mille asutus valitsusena on kehtestanud. @et
toolkit definition: Værk, som er en lov, forordning, forfatning, retsplejeregel eller anden lovgivning vedtaget af en korporation, som er en myndighed. @da
toolkit definition: Œuvre qui consiste en une loi, un règlement, une constitution, une règle de pratique de tribunal ou une autre mesure législative promulguée par une collectivité qui constitue un gouvernement. @fr
toolkit definition: Ένα έργο που θεσπίζει έναν νόμο, κανονισμό, σύνταγμα, κανονισμό δικαστηρίου κ.λπ. @el
toolkit definition: عمل هو قانون، أو لائحة، أو دستور، أو حكم محكمة، أو أي تشريع آخر تسنه هيئة هي الحكومة. @ar
toolkit definition: 作为政府的一个团体颁布的法律、法规、宪法、法院规则或其他立法的一种作品 @zh-hans
toolkit label: Normerlassende Gebietskörperschaft von @de
toolkit label: enacting government of @en
toolkit label: giurisdizione emanante di @it
toolkit label: gouvernement promulgateur de @fr
toolkit label: govern promulgador de @ca
toolkit label: ir ieviesējjurisdikcija @lv
toolkit label: kehtestav võimkond teoses @et
toolkit label: rendelkező joghatósága: @hu
toolkit label: säätävän hallintoelimen päätös
toolkit label: udøvende jurisdiktion af @da
toolkit label: vaststellende jurisdictie van @nl
toolkit label: vedtakende jurisdiksjon for @no
toolkit label: yargı yetkisini yürürlüğe koyma @tr
toolkit label: θεσπισμένη δικαιοδοσία του @el
toolkit label: هي ولاية قضائية مشرِّعة @ar
toolkit label: ……的颁布政府 @zh-hans
has subproperty: P50068
lexical alias: enactingGovernmentOf.en
status: Published
type: Property
domain: C10005
label: er udøvende jurisdiktion af @da
label: er vedtakende jurisdiksjon for @no
label: est un gouvernement promulgateur de @fr
label: ir ieviesējjurisdikcija @lv
label: is enacting government of @en
label: is vaststellende jurisdictie van @nl
label: ist normerlassende Gebietskörperschaft von @de
label: kehtestav võimkond teoses @et
label: rendelkező joghatósága a következőnek: @hu
label: yasa çıkaran hükümetidir @tr
label: è la giurisdizione emanante di @it
label: és govern promulgador de @ca
label: είναι θεσπισμένη δικαιοδοσία του @el
label: هي ولاية قضائية مشرِّعة لـ @ar
label: 是……的颁布政府 @zh-hans
sub property of: er korporation, som er ophav til værk af
alternative label: gouvernement édicteur de @fr
alternative label: juridiction promulgatrice de @fr
alternative label: هيئة سن تشريعات @ar
definition: Bir tüzel kişiyi, bir devlet organı tarafından çıkarılan kanun, yönetmelik, anayasa, mahkeme kuralı veya yürürlüğe konulan diğer mevzuat niteliğindeki bir eserle ilişkilendirir. @tr
definition: Correla un organo a un'opera che è una legge, regolamento, costituzione, norme di un tribunale emanata da un organo che è un governo. @it
definition: Hozzákapcsol egy testületet egy műhöz, amely egy kormányzati testület által beiktatott törvény, rendelet, alkotmány, bírósági határozat, vagy egyéb jogszabály. @hu
definition: Liittää yhteisön lainsäädännölliseen teokseen, kuten lakiin, asetukseen, perustuslakiin, tuomioistuinta koskevaan sääntöön tms., jonka julkishallinnollinen yhteisö on säätänyt.
definition: Met une collectivité en relation avec une œuvre qui consiste en une loi, un règlement, une constitution, une règle de pratique de tribunal ou une autre mesure législative promulguée par une collectivité qui constitue un gouvernement. @fr
definition: Relaciona una entitat corporativa amb una obra que és una llei, un reglament, una constitució, una regla de funcionament d’un tribunal o qualsevol altra legislació promulgada per una entitat corporativa que és un govern. @ca
definition: Relateert een corporatie aan een werk dat een wet, regeling, grondwet, rechterlijke uitspraak of andere regelgeving is, aangenomen door een corporatie die een regering is. @nl
definition: Relaterer en korporasjon til et verk som er en lov, vedtekt, grunnlov, rettergangsregel etc. eller annen lovgivning som vedtas av en korporasjon som er en regjeringsmakt. @no
definition: Relaterer en korporation til et værk, som er en lov, forordning, forfatning, retsplejeregel eller anden lovgivning vedtaget af en korporation, som er en myndighed. @da
definition: Relates a corporate body to a work that is a law, regulation, constitution, court rule, or other legislation enacted by a corporate body who is a government. @en
definition: Sasaista institūciju ar darbu, kas ir likums, noteikumi, konstitūcija, tiesas nolēmumi vai citi tiesību akti, ko ieviesusi institūcija, kas ir valsts pārvaldes iestāde. @lv
definition: Seostab asutuse teosega, mis on seadus, määrus, konstitutsioon, menetluseeskiri või muu õigusakt, mille asutus valitsusena on kehtestanud. @et
definition: Setzt eine Körperschaft in Beziehung zu einem Werk, bei dem es sich um ein Gesetz, eine Verordnung, eine Verfassung, eine Rechtsverordnung oder eine andere Gesetzgebung handelt, das/die von einer Regierung erlassen wird. @de
definition: Συνδέει μια δικαιοδοσία, που θεσπίζει έναν νόμο, κανονισμό, σύνταγμα, κανόνα δικαστηρίου κ.λπ., με ένα έργο. @el
definition: يربط هيئة بعمل هو قانون، أو لائحة، أو دستور، أو حكم محكمة، أو أي تشريع آخر تسنه هيئة هي الحكومة. @ar
definition: 将一个团体与作为政府的一个团体颁布的法律、法规、宪法、法院规则或其他立法的一种作品关联起来。 @zh-hans

soveltavan lainkäyttöalueen päätös
instruction number: 18.5
toolkit definition: Ein Gesetz, eine Verordnung usw., das/die von einer anderen Gebietskörperschaft erlassen wurde. @de
toolkit definition: En lov, vedtekt, etc. som ble vedtatt i en annen jurisdiksjon. @no
toolkit definition: Llei, reglament, etc., promulgat per una altra jurisdicció. @ca
toolkit definition: Loi, règlement, etc. promulgué par une autre juridiction. @fr
toolkit definition: Lov, forordning etc., der blev vedtaget af en anden jurisdiktion. @da
toolkit definition: Toisen lainkäyttöalueen säätämä laki, asetus tms.
toolkit definition: Ένας νόμος, κανονισμός κ.λπ. ο οποίος θεσπίζεται από κάποια άλλη δικαιοδοσία. @el
toolkit label: Geregelte Gebietskörperschaft von @de
toolkit label: juridiction régie de @fr
toolkit label: jurisdicció regida de @ca
toolkit label: jurisdiksjon som styres av @no
toolkit label: jurisdiktion underlagt @da
toolkit label: soveltavan lainkäyttöalueen päätös
toolkit label: δικαιοδοσία κυβερνάται από @el
has subproperty: P50069
lexical alias: jurisdictionGovernedOf.en
status: Deprecated
type: Property
domain: C10005
label: er jurisdiktion underlagt @da
label: est une juridiction régie de @fr
label: ist geregelte Gebietskörperschaft von @de
label: és jurisdicció regida de @ca
label: είναι δικαιοδοσία που κυβερνάται από @el
sub property of: muuna toimijana teoksessa
definition: Liittää soveltavan lainkäyttöalueen toisen lainkäyttöalueen säätämään lakiin, asetukseen tms.
definition: Met une juridiction régie par une loi, un règlement, etc. qui a été promulgué par une autre juridiction en relation avec une œuvre. @fr
definition: Relaciona una jurisdicció, que promulga una llei, un reglament, una constitució, una regla de funcionament d’un tribunal, etc., amb una obra. @ca
definition: Relaterer en jurisdiktion, der er underlagt en lov, forordning etc., der var vedtaget af en anden domsmyndighed til et værk. @da
definition: Setzt eine Gebietskörperschaft, die durch ein Gesetz, eine Verordnung usw. geregelt wird, das/die von einer anderen Gebietskörperschaft erlassen wurde, mit einem Werk in Beziehung. @de
definition: Συνδέει μια δικαιοδοσία, που διέπεται από έναν νόμο, κανονισμό κ.λπ., που θεσπίζεται από κάποια άλλη δικαιοδοσία, με ένα έργο. @el

johtaja (toimija) ekspressiossa
has element type: 2
instruction number: 18.5
toolkit definition: An expression that includes a contribution by an agent of leading a performing group in a musical or dramatic presentation. @en
toolkit definition: Een expressie die omvat een bijdrage van een actor door het leiden van een uitvoerende groep in een muziek- of dramapresentatie. @nl
toolkit definition: Egy kifejezési forma, amely magában foglalja egy zenei vagy drámai bemutatóban előadói csoportot vezető ágens közreműködését. @hu
toolkit definition: Eine Expression, zu der ein Akteur beiträgt, indem er ein aufführendes Ensemble in einer musikalischen oder dramatischen Darbietung leitet. @de
toolkit definition: Ekspressio, jonka tekemiseen toimija osallistuu johtamalla esiintyjäryhmän esiintymistä musiikki- tai näytelmäesityksessä.
toolkit definition: Espressione che include un contributo da parte di un agente che guida un organico in una rappresentazione musicale o teatrale. @it
toolkit definition: Et uttrykk som inkluderer et bidrag fra en agent i form av å lede en gruppe med utøvere i en musikalsk eller dramatisk forestilling etc. @no
toolkit definition: Expression qui intègre une contribution de la part d’un agent consistant à diriger un groupe d’interprètes dans une présentation musicale ou dramatique. @fr
toolkit definition: Expressió que inclou una contribució d’un agent dirigint un grup d’intèrprets en una representació musical o dramàtica. @ca
toolkit definition: Izteiksme, kas ietver aģenta ieguldījumu, vadot izpildītāju grupu muzikālā vai dramatiskā uzvedumā. @lv
toolkit definition: Müzikal veya dramatik bir sunumda bir performans grubuna liderlik eden bir temsilcinin katkısını içeren bir anlatım. @tr
toolkit definition: Udtryk, som omfatter en agents bidrag ved at lede en udøvende gruppe i en musikalsk eller dramatisk præsentation. @da
toolkit definition: Väljendus, millesse tegija on andnud panuse, juhatades muusika- või draamaetenduse esitusrühma. @et
toolkit definition: Μια έκφραση ενός μουσικού έργου που ενσωματώνει τη συνεισφορά της διεύθυνσης ενός συνόλου σε μια μουσική ή δραματική παρουσίαση κ.λπ. @el
toolkit definition: تعبيرة تتضمن إسهام وكيل في قيادة فرقة عزف في عرض موسيقي أو درامي. @ar
toolkit definition: 包括有领导音乐或戏剧呈现的表演团体的一个行为者的贡献的一种内容表达 @zh-hans
toolkit label: Akteur als Dirigentin/Dirigent von @de
toolkit label: agent chef musical de @fr
toolkit label: agent director d’orquestra de @ca
toolkit label: agent, som er dirigent af @da
toolkit label: conductor agent of @en
toolkit label: direttore agente di @it
toolkit label: dirigent (tegija) väljenduses @et
toolkit label: dirigent for (agent) @no
toolkit label: dirigent-actor van @nl
toolkit label: ir diriģents (aģents) @lv
toolkit label: johtaja (toimija) ekspressiossa
toolkit label: karmester ágense: @hu
toolkit label: orkestra şefi temsilcisi @tr
toolkit label: διευθυντής ορχήστρας φορέας του @el
toolkit label: وكيل قائد فرقة موسيقية لـ @ar
toolkit label: ……的指挥行为者 @zh-hans
has subproperty: kuoronjohtaja (toimija) ekspressiossa
has subproperty: kapellimestari (toimija) ekspressiossa
has subproperty: johtaja (henkilö) ekspressiossa
has subproperty: johtaja (yhteistoimija) ekspressiossa
has subproperty: P50070
lexical alias: conductorAgentOf.en
status: Published
type: Property
domain: C10002
label: dirigent (tegija) väljenduses @et
label: er agent, som er dirigent af @da
label: er dirigent for (agent) @no
label: est un agent chef musical de @fr
label: ir diriģents (aģents) @lv
label: is conductor agent of @en
label: is dirigent-actor van @nl
label: ist Akteur als Dirigentin/Dirigent von @de
label: karmester ágense a következőnek: @hu
label: orkestra şefi temsilcisidir @tr
label: è direttore agente di @it
label: és agent director d’orquestra de @ca
label: είναι διευθυντής ορχήστρας φορέας του @el
label: هو وكيل مايسترو لـ @ar
label: 是……的指挥行为者 @zh-hans
sub property of: esittäjä (toimija) ekspressiossa
alternative label: Dirigent von @de
alternative label: chef musical de @fr
alternative label: conductor of @en
alternative label: director de @es
alternative label: director d’orquestra de @ca
alternative label: direttore di @it
alternative label: dirigent af @da
alternative label: dirigent for @no
alternative label: dirigent väljenduses @et
alternative label: johtaja ekspressiossa
alternative label: karmestere: @hu
alternative label: orkestra şefi @tr
alternative label: διευθυντής ορχήστρας του @el
alternative label: مايسترو لـ @ar
alternative label: ……的指挥 @zh-hans
definition: Bir temsilciyi, müzikal veya dramatik bir sunumda bir performans grubuna liderlik eden bir temsilcinin katkısını içeren bir anlatımla ilişkilendirir. @tr
definition: Correla un agente a un'espressione che include un contributo da parte di un agente che guida un organico in una rappresentazione musicale o teatrale. @it
definition: Hozzákapcsol egy ágenst egy kifejezési formához, amely magában foglalja egy zenei vagy drámai bemutatóban előadói csoportot vezető ágens közreműködését. @hu
definition: Liittää toimijan ekspressioon, jonka tekemiseen toimija osallistuu johtamalla esiintyjäryhmän esiintymistä musiikki- tai näytelmäesityksessä.
definition: Met un agent en relation avec une expression qui intègre une contribution de la part d’un agent consistant à diriger un groupe d’interprètes dans une présentation musicale ou dramatique. @fr

näyttelijä (toimija) ekspressiossa
has element type: 2
instruction number: 18.5
toolkit definition: An expression that includes a contribution by an agent of acting as a cast member or player in a musical or dramatic presentation. @en
toolkit definition: Bir müzikal veya dramatik sunumda oyuncu veya oyuncu kadrosu üyesi olarak hareket eden bir temsilcinin katkısını içeren bir anlatım. @tr
toolkit definition: Een expressie die omvat een bijdrage door een actor die speelt als een lid van een gezelschap of speler in een muziek- of dramapresentatie. @nl
toolkit definition: Egy kifejezési forma, amely magában foglalja egy ágensnek, mint a szereposztás egy tagjának vagy előadójának a közreműködését egy zenei vagy drámai bemutatóban. @hu
toolkit definition: Eine Expression, zu der ein Akteur beiträgt, indem er als Ensemble-Mitglied oder Darstellerin/Darsteller in einer musikalischen oder dramatischen Darbietung fungiert. @de
toolkit definition: Ekspressio, jonka tekemiseen toimija osallistuu näyttelemällä musiikki- tai näytelmäesityksessä.
toolkit definition: Espressione che include un contributo da parte di un agente che agisce come membro del cast o attore in una rappresentazione musicale o teatrale. @it
toolkit definition: Et uttrykk som inkluderer et bidrag fra en agent i form av å spille en rolle i en musikalsk eller dramatisk presentasjon. @no
toolkit definition: Expression qui intègre une contribution de la part d’un agent consistant à agir à titre de membre d’une distribution artistique ou de comédien dans une présentation musicale ou dramatique. @fr
toolkit definition: Expressió que inclou una contribució d’un agent actuant com un membre del repartiment o com un comediant d’una representació musical o dramàtica. @ca
toolkit definition: Izteiksme, kas ietver aģenta ieguldījumu, izpildot lomu dramatiskā uzvedumā vai spēlējot mūzikas uzvedumā. @lv
toolkit definition: Udtryk, som omfatter en agents bidrag ved at være skuespiller eller musiker i en musikalsk eller dramatisk præsentation. @da
toolkit definition: Väljendus, millesse tegija on andnud panuse, osaledes trupiliikme või näitlejana muusika- või draamaetenduses. @et
toolkit definition: Μια έκφραση ενός έργου που ενσωματώνει τη συνεισφορά της υποκριτικής ερμηνείας ως μέλος του επιτελείου των ηθοποιών ή των εκτελεστών, σε μια μουσική ή δραματική παρουσίαση κ.λπ. @el
toolkit definition: تعبيرة تتضمن إسهام وكيل يعمل كعضو فريق تمثيل أو عازف في عرض موسيقي أو درامي. @ar
toolkit definition: 包括在音乐或戏剧呈现中扮演角色或演奏的一个行为者的贡献的一种内容表达 @zh-hans
toolkit label: Akteur als Schauspielerin/Schauspieler von @de
toolkit label: Oyuncu temsilci @tr
toolkit label: acteur-actor van @nl
toolkit label: actor agent of @en
toolkit label: agent acteur de @fr
toolkit label: agent actor de @ca
toolkit label: agent, som er skuespiller af @da
toolkit label: attore agente di @it
toolkit label: ir aktieris (aģents) @lv
toolkit label: näitleja (tegija) väljenduses @et
toolkit label: näyttelijä (toimija) ekspressiossa
toolkit label: skuespiller i (agent) @no
toolkit label: színész ágense: @hu
toolkit label: ηθοποιός φορέας του @el
toolkit label: وكيل ممثل @ar
toolkit label: ……的演员行为者 @zh-hans
has subproperty: ääninäyttelijä (toimija) ekspressiossa
has subproperty: näyttelijä (henkilö) ekspressiossa
has subproperty: näyttelijä (yhteistoimija) ekspressiossa
has subproperty: P50071
lexical alias: actorAgentOf.en
status: Published
type: Property
domain: C10002
label: aktör temsilcisidir @tr
label: er agent, som er skuespiller af @da
label: er skuespiller i (agent) @no
label: est un agent acteur de @fr
label: ir aktieris (aģents) @lv
label: is acteur-actor van @nl
label: is actor agent of @en
label: ist Akteur als Schauspielerin/Schauspieler von @de
label: näitleja (tegija) väljenduses @et
label: színész ágense a következőnek: @hu
label: è attore agente di @it
label: és agent actor de @ca
label: είναι ηθοποιός φορέας του @el
label: هو وكيل ممثل لـ @ar
label: 是……的演员行为者 @zh-hans
sub property of: esittäjä (toimija) ekspressiossa
alternative label: Oyuncu @tr
alternative label: Schauspieler von @de
alternative label: acteur de @fr
alternative label: actor de @ca
alternative label: actor of @en
alternative label: attore di @it
alternative label: esiintyjänä esityksessä
alternative label: näitleja väljenduses @et
alternative label: skuespiller af @da
alternative label: skuespiller i @no
alternative label: színésze: @hu
alternative label: ηθοποιός του @el
alternative label: ممثل @ar
alternative label: ……的演员 @zh-hans
definition: Bir temsilciyi, müzikal veya dramatik bir sunumda oyuncu veya oyuncu olarak rol yapan bir temsilcinin katkısını içeren bir anlatımla ilişkilendirir. @tr
definition: Correla un agente a un'espressione che include un contributo da parte di un agente che agisce come membro del cast o attore in una rappresentazione musicale o teatrale. @it
definition: Hozzákapcsol egy ágenst egy kifejezési formához, amely magában foglalja egy ágensnek, mint a szereposztás egy tagjának vagy előadójának a közreműködését egy zenei vagy drámai bemutatóban. @hu
definition: Liittää toimijan ekspressioon, jonka tekemiseen toimija osallistuu näyttelemällä musiikki- tai näytelmäesityksessä.
definition: Met un agent en relation avec une expression qui intègre une contribution de la part d’un agent consistant à agir à titre de membre d’une distribution artistique ou de comédien dans une présentation musicale ou dramatique. @fr
definition: Relaciona un agent amb una expressió que inclou una contribució d’un agent actuant com un membre del repartiment o com un comediant d’una representació musical o dramàtica. @ca
definition: Relateert een actor aan een expressie die omvat een bijdrage door een actor die speelt als een lid van een gezelschap of speler in een muziek- of dramapresentatie. @nl

esittelijä (toimija) ekspressiossa
has element type: 2
instruction number: 18.5
see also: liikkuvaan kuvaan osallistuja (toimija) ekspressiossa
toolkit definition: An expression that includes a contribution by an agent of appearing on-screen to provide contextual or background information. @en
toolkit definition: Bağlamsal veya arka plan bilgisi vermek amacı ile ekranda görünen bir temsilcinin katkısını içeren bir anlatım. @tr
toolkit definition: Een expressie die omvat een bijdrage door een actor door in beeld te verschijnen om contextuele of achtergrondinformatie te geven. @nl
toolkit definition: Eine Expression, zu der ein Akteur beiträgt, indem er auf dem Bildschirm erscheint, um Kontext- und Hintergrundinformationen zu liefern. @de
toolkit definition: Ekspressio, jonka tekemiseen toimija osallistuu esiintymällä televisiossa tai elokuvassa taustatiedon antajana.
toolkit definition: Espressione che include un contributo da parte di un agente che compare sullo schermo per fornire informazioni contestuali o di base. @it
toolkit definition: Et uttrykk som inkluderer et bidrag fra en agent i form av å vises på skjermen for å gi kontekst eller bakgrunnsinformasjon. @no
toolkit definition: Expression qui intègre une contribution de la part d’un agent consistant à apparaître à l’écran pour fournir de l’information contextuelle ou complémentaire. @fr
toolkit definition: Expressió que inclou una contribució d’un agent apareixent en pantalla per proporcionar informació contextual o dels antecedents. @ca
toolkit definition: Izteiksme, kas ietver aģenta ieguldījumu, parādoties ekrānā, lai nodrošinātu konteksta vai fona informāciju. @lv
toolkit definition: Udtryk, som omfatter en agents bidrag ved at optræde på en skærm for at give kontekstuel- eller baggrundsinformation. @da
toolkit definition: Väljendus, millesse tegija on andnud panuse, pakkudes ekraanil kontekstilist ja taustinfot. @et
toolkit definition: képernyőn megjelenő előadója: @hu
toolkit definition: Μια έκφραση ενός έργου που ενσωματώνει τη συνεισφορά της εμφάνισης επί της οθόνης για την παροχή πληροφοριών αναφορικά με το πλαίσιο ή το υποβάθρο. @el
toolkit definition: تعبيرة تتضمن إسهام وكيل بظهوره على الشاشة لتقديم معلومات سياقية أو معلومات أساسية. @ar
toolkit definition: 包括有出现在屏幕上提供语境或背景信息的一个行为者的贡献的一种内容表达 @zh-hans
toolkit label: Akteur als On-Screen-Präsentatorin/On-Screen-Präsentator von @de
toolkit label: Egy kifejezési forma, amely magában foglalja egy képernyőn megjelenő ágens közreműködését szövegösszefüggésre vonatkozó vagy háttérinformáció szolgáltatásában. @hu
toolkit label: agent presentador en pantalla de @ca
toolkit label: agent présentateur à l’écran de @fr
toolkit label: ekraanil esineja (tegija) väljenduses @et
toolkit label: ekran sunucu temsilcisi @tr
toolkit label: esittelijä (toimija) ekspressiossa
toolkit label: ir ekrānā redzamais vadītājs (aģents) @lv
toolkit label: onscreen presenter agent of @en
toolkit label: presentator in beeld-actor van @nl
toolkit label: presentatore video agente di @it
toolkit label: programleder for (agent) @no
toolkit label: programvært på skærmen af @da
toolkit label: οθονικός παρουσιαστής φορέας του @el
toolkit label: وكيل مقدم برامج على الشاشة @ar
toolkit label: ……的屏幕主持人行为者 @zh-hans
has subproperty: esittelijä (henkilö) ekspressiossa
has subproperty: esittelijä (yhteistoimija) ekspressiossa
has subproperty: P50072
lexical alias: onscreenPresenterAgentOf.en
status: Published
type: Property
domain: C10002
label: ekraanil esineja (tegija) väljenduses @et
label: ekran sunucusu temsilcisidir @tr
label: er agent, som er programvært af @da
label: er programleder for (agent) @no
label: est un agent présentateur à l’écran de @fr
label: ir ekrānā redzamais vadītājs (aģents) @lv
label: is onscreen presenter agent of @en
label: is presentator in beeld-actor van @nl
label: ist Akteur als On-Screen-Präsentatorin/On-Screen-Präsentator von @de
label: képernyőn megjelenő előadó ágense a következőnek: @hu
label: è presentatore video agente di @it
label: és agent presentador en pantalla de @ca
label: είναι οθονικός παρουσιαστής φορέας του @el
label: هو وكيل مقدم برامج على الشاشة لـ @ar
label: 是……的屏幕主持人行为者 @zh-hans
sub property of: esittäjä (toimija) ekspressiossa
alternative label: Egy képernyőn megjelenő előadó tényszerű mozgóképanyagokban vagy fikciós mozgóképanyagok bevezetőiben is látható. @hu
alternative label: On-Screen-Präsentator von @de
alternative label: ekraanil esineja väljenduses @et
alternative label: ekran sunucusu @tr
alternative label: esittelijänä ohjelmassa
alternative label: on-screen presenter of @en
alternative label: presentador en pantalla de @ca
alternative label: presentatore video di @it
alternative label: programleder for (agent) @no
alternative label: présentateur à l’écran de @fr
alternative label: studievært af @da
alternative label: οθονικός παρουσιαστής του @el
alternative label: مقدم برامج على الشاشة @ar
alternative label: ……的屏幕主持人 @zh-hans
definition: Bir temsilciyi, bağlamsal veya arka plan bilgileri sağlamak için ekranda görünen bir temsilcinin katkısını içeren bir anlatımla ilişkilendirir. @tr
definition: Correla un agente a un'espressione che include un contributo da parte di un agente che compare sullo schermo per fornire informazioni contestuali o di base. @it
definition: Hozzákapcsol egy ágenst egy kifejezési formához, amely magában foglalja egy képernyőn megjelenő ágens közreműködését szövegösszefüggésre vonatkozó vagy háttérinformáció szolgáltatásában. @hu
definition: Liittää toimijan ekspressioon, jonka tekemiseen toimija osallistuu esiintymällä televisiossa tai elokuvassa taustatiedon antajana.
definition: Met un agent en relation avec une expression qui intègre une contribution de la part d’un agent consistant à apparaître à l’écran pour fournir de l’information contextuelle ou complémentaire. @fr
definition: Relaciona un agent amb una expressió que inclou una contribució d’un agent apareixent en pantalla per proporcionar informació contextual o dels antecedents. @ca
definition: Relateert een actor aan een expressie die omvat een bijdrage door een actor door in beeld te verschijnen om contextuele of achtergrondinformatie te geven. @nl

tanssija (toimija) ekspressiossa
has element type: 2
instruction number: 18.5
toolkit definition: An expression that includes a contribution by an agent of dancing in a musical or dramatic presentation. @en
toolkit definition: Een expressie die omvat een bijdrage van een actor door het dansen in een muziek- of dramapresentatie. @nl
toolkit definition: Egy kifejezési forma, amely magában foglalja egy zenei vagy drámai bemutatóban táncoló ágens közreműködését. @hu
toolkit definition: Eine Expression, zu der ein Akteur beiträgt, indem er in einer musikalischen oder dramatischen Darbietung tanzt. @de
toolkit definition: Ekspressio, jonka tekemiseen toimija osallistuu tanssimalla musiikki- tai näyttämöesityksessä.
toolkit definition: Espressione che include un contributo da parte di un agente che danza in una presentazione musicale o drammatica, @it
toolkit definition: Et uttrykk som inkluderer et bidrag fra en agent i form av å danse i en musikalsk eller dramatisk forestilling. @no
toolkit definition: Expression qui intègre une contribution de la part d’un agent consistant à danser dans une présentation musicale ou dramatique. @fr
toolkit definition: Expressió que inclou una contribució d’un agent dansant en una representació musical o dramàtica. @ca
toolkit definition: Izteiksme, kas ietver aģenta ieguldījumu, dejojot muzikālā vai dramatiskā uzvedumā. @lv
toolkit definition: Müzikal veya dramatik bir sunumda dans eden bir temsilcinin katkısını içeren bir anlatım. @tr
toolkit definition: Udtryk, som omfatter en agents bidrag ved at danse i en musikalsk eller dramatisk præsentation. @da
toolkit definition: Väljendus, millesse tegija on andnud panuse, tantsides muusika- või draamaetenduses. @et
toolkit definition: Μια έκφραση ενός έργου που ενσωματώνει τη συνεισφορά της χορευτικής ερμηνείας σε μια μουσική, δραματική κ.λπ. παρουσίαση. @el
toolkit definition: تعبيرة تتضمن إسهام وكيل الرقص في عرض موسيقي أو مسرحي. @ar
toolkit definition: 包括在音乐或戏剧呈现中的一个舞蹈行为者的贡献的一种内容表达 @zh-hans
toolkit label: Akteur als Tänzerin/Tänzer von @de
toolkit label: agent ballarí de @ca
toolkit label: agent danseur de @fr
toolkit label: agent, som er danser af @da
toolkit label: dancer agent of @en
toolkit label: danser i (agent) @no
toolkit label: danser-actor van @nl
toolkit label: dansçı temsilci @tr
toolkit label: danzatore agente di @it
toolkit label: ir dejotājs (aģents) @lv
toolkit label: tanssija (toimija) ekspressiossa
toolkit label: tantsija (tegija) väljenduses @et
toolkit label: táncos ágense: @hu
toolkit label: χορευτής φορέας του @el
toolkit label: وكيل راقص @ar
toolkit label: ……的舞蹈者行为者 @zh-hans
has subproperty: tanssija (henkilö) ekspressiossa
has subproperty: tanssija (yhteistoimija) ekspressiossa
has subproperty: P50073
lexical alias: dancerAgentOf.en
status: Published
type: Property
domain: C10002
label: dansçı temsilcisidir @tr
label: er agent, som er danser af @da
label: er danser i (agent) @no
label: est un agent danseur de @fr
label: ir dejotājs (aģents) @lv
label: is dancer agent of @en
label: is danser-actor van @nl
label: ist Akteur als Tänzerin/Tänzer von @de
label: tantsija (tegija) väljenduses @et
label: táncos ágense a következőnek: @hu
label: è danzatore agente di @it
label: és agent ballarí de @ca
label: είναι χορευτής φορέας του @el
label: هو وكيل راقص لـ @ar
label: 是……的舞蹈者行为者 @zh-hans
sub property of: esittäjä (toimija) ekspressiossa
alternative label: Tänzer von @de
alternative label: bailarín de @es
alternative label: ballarí de @ca
alternative label: dancer of @en
alternative label: danser af @da
alternative label: danser i @no
alternative label: danseur de @fr
alternative label: dansçı @tr
alternative label: danzatore di @it
alternative label: tanssiesitys
alternative label: tantsija väljenduses @et
alternative label: táncosa: @hu
alternative label: χορευτής του @el
alternative label: راقص @ar
alternative label: ……的舞蹈者 @zh-hans
definition: Bir temsilciyi, müzikal veya dramatik bir sunumda dans eden temsilcinin katkısını içeren bir anlatımla ilişkilendirir. @tr
definition: Correla un agente a un'espressione che include un contributo da parte di un agente che danza in una presentazione musicale o teatrale. @it
definition: Hozzákapcsol egy ágenst egy kifejezési formához, amely magában foglalja egy zenei vagy drámai bemutatóban táncoló ágens közreműködését. @hu
definition: Liittää toimijan ekspressioon, jonka tekemiseen toimija osallistuu tanssimalla musiikki- tai näyttämöesityksessä.
definition: Met un agent en relation avec une expression qui intègre une contribution de la part d’un agent consistant à danser dans une présentation musicale ou dramatique. @fr
definition: Relaciona un agent amb una expressió que inclou una contribució d’un agent dansant en una representació musical o dramàtica. @ca
definition: Relateert een actor aan een expressie die omvat een bijdrage van een actor door het dansen in een muziek- of dramapresentatie. @nl

opettaja (toimija) ekspressiossa
has element type: 2
instruction number: 18.5
toolkit definition: An expression that includes a contribution by an agent of teaching or providing a demonstration. @en
toolkit definition: Bir gösteriyi öğreten ya da temin eden bir temsilcinin katkısını içeren bir anlatım. @tr
toolkit definition: Een expressie die omvat een bijdrage door een actor door onderwijzen of verschaffen van een demonstratie. @nl
toolkit definition: Egy kifejezési forma, amely magában foglalja egy tanító vagy szemléltetést tartó ágens közreműködését. @hu
toolkit definition: Eine Expression, zu der ein Akteur beiträgt, indem er unterrichtet oder etwas demonstriert. @de
toolkit definition: Ekspressio, jonka tekemiseen toimija osallistuu opettamalla tai esittelemällä.
toolkit definition: Espressione che include un contributo da parte di un agente che insegna o fornisce una dimostrazione. @it
toolkit definition: Et uttrykk som inkluderer et bidrag fra en agent i form av å gi instruksjoner eller en demonstrasjon. @no
toolkit definition: Expression qui intègre une contribution de la part d’un agent consistant à enseigner ou à faire une démonstration. @fr
toolkit definition: Expressió que inclou una contribució d’un agent ensenyant o proporcionant una demostració. @ca
toolkit definition: Izteiksme, kas ietver aģenta ieguldījumu, mācot vai demonstrējot. @lv
toolkit definition: Udtryk, som omfatter en agents bidrag ved at undervise eller ved at give en demonstration. @da
toolkit definition: Väljendus, millesse tegija on andnud panuse, õpetades või ette näidates. @et
toolkit definition: Μια έκφραση ενός έργου που ενσωματώνει τη συνεισφορά της διδασκαλίας ή επίδειξης. @el
toolkit definition: تعبيرة تتضمن إسهام وكيل بالتدريس أو بتقديم عرض توضيحي. @ar
toolkit definition: 包括有教学或提供演示的一个行为者的贡献的一种内容表达 @zh-hans
toolkit label: Akteur als Ausbilderin/Ausbilder von @de
toolkit label: agent enseignant de @fr
toolkit label: agent instructor de @ca
toolkit label: agent, som er instruktør af @da
toolkit label: eğitmen temsilcisidir @tr
toolkit label: instructeur-actor van @nl
toolkit label: instructor agent of @en
toolkit label: instruktor (tegija) väljenduses @et
toolkit label: instruktør for (agent) @no
toolkit label: ir instruktors (aģents) @lv
toolkit label: istruttore agente di @it
toolkit label: oktató ágense: @hu
toolkit label: opettaja (toimija) ekspressiossa
toolkit label: εκπαιδευτής φορέας του @el
toolkit label: وكيل محاضر @ar
toolkit label: ……的教师行为者 @zh-hans
has subproperty: opettaja (henkilö) ekspressiossa
has subproperty: opettaja (yhteistoimija) ekspressiossa
has subproperty: P50074
lexical alias: instructorAgentOf.en
status: Published
type: Property
domain: C10002
label: er agent, som er instruktør af @da
label: er instruktør for (agent) @no
label: est un agent enseignant de @fr
label: eğitmen temsilcisidir @tr
label: instruktor (tegija) väljenduses @et
label: ir instruktors (aģents) @lv
label: is instructeur-actor van @nl
label: is instructor agent of @en
label: ist Akteur als Ausbilderin/Ausbilder von @de
label: oktató ágense a következőnek: @hu
label: è istruttore agente di @it
label: és agent instructor de @ca
label: είναι εκπαιδευτής φορέας του @el
label: هو وكيل محاضر لـ @ar
label: 是……的教师行为者 @zh-hans
sub property of: esittäjä (toimija) ekspressiossa
alternative label: Ausbilder von @de
alternative label: enseignant de @fr
alternative label: eğitmenidir @tr
alternative label: instructor de @ca
alternative label: instructor of @en
alternative label: instruktor väljenduses @et
alternative label: instruktør af @da
alternative label: instruktør for @no
alternative label: istruttore di @it
alternative label: oktatója: @hu
alternative label: opetustilanne
alternative label: εκπαιδευτής του @el
alternative label: محاضر @ar
alternative label: ……的教师 @zh-hans
definition: Bir temsilciyi, bir öğretim veya göstermeyi sağlayan bir temsilcinin katkısını içeren bir anlatımla ilişkilendirir. @tr
definition: Correla un agente a un'espressione che include un contributo da parte di un agente che insegna o fornisce una dimostrazione. @it
definition: Hozzákapcsol egy ágenst egy kifejezési formához, amely magában foglalja egy tanító vagy szemléltetést tartó ágens közreműködését. @hu
definition: Liittää toimijan ekspressioon, jonka tekemiseen toimija osallistuu opettamalla tai esittelemällä.
definition: Met un agent en relation avec une expression qui intègre une contribution de la part d’un agent consistant à enseigner ou à faire une démonstration. @fr
definition: Relaciona un agent amb una expressió que inclou una contribució d’un agent ensenyant o proporcionant una demostració. @ca
definition: Relateert een actor aan een expressie die omvat een bijdrage door een actor door onderwijzen of verschaffen van een demonstratie. @nl
definition: Relaterer en agent til et udtryk, som omfatter en agents bidrag ved at undervise eller ved at give en demonstration. @da

juontaja (toimija) ekspressiossa
has element type: 2
instruction number: 18.5
toolkit definition: An expression that includes a contribution by an agent of leading a program, often broadcast, that includes other performers. @en
toolkit definition: Een expressie die omvat een bijdrage van een actor die is een uitvoerder door het leiden van een programma, vaak uitgezonden, dat omvat andere gasten, artiesten en andere actoren. @nl
toolkit definition: Egy kifejezési forma, amely magában foglalja egy ágens közreműködését egy program, gyakran sugárzott műsor, vezetésében, amelyen más előadók vesznek részt. @hu
toolkit definition: Eine Expression, zu der ein Akteur beiträgt, indem er eine Veranstaltung (meist eine Sendung) leitet, an der auch andere Ausführende teilnehmen. @de
toolkit definition: Ekspressio, jonka tekemiseen toimija osallistuu juontamalla (useimmiten lähetettyä) ohjelmaa, johon osallistuu muita esiintyjiä.
toolkit definition: Espressione che include un contributo da parte di un agente che conduce un programma, spesso una trasmissione, che include altri ospiti, attori e altri agenti. @it
toolkit definition: Et uttrykk som inkluderer et bidrag fra en agent i form av å lede et program, ofte kringkastet, som inkluderer andre gjester, utøvere etc. @no
toolkit definition: Expression qui intègre une contribution de la part d’un agent consistant à diriger une activité, souvent diffusée à la radio, à la télévision, etc., qui fait appel à d’autres interprètes. @fr
toolkit definition: Expressió que inclou una contribució d’un agent dirigint un programa, sovint emès, que inclou altres intèrprets. @ca
toolkit definition: Genellikle yayınlanan ve diğer sanatçıları da içeren bir programa liderlik eden bir temsilcinin katkısını içeren bir anlatım. @tr
toolkit definition: Izteiksme, kas ietver aģenta ieguldījumu, vadot programmu (parasti apraidi), kas ietver citu viesu, izpildītāju, citu aģentu piedalīšanos. @lv
toolkit definition: Udtryk, som omfatter et bidrag af en agent, der er en performer ved at lede et program, ofte transmitteret, som omfatter andre performers. @da
toolkit definition: Väljendus, millesse tegija on andnud panuse, juhtides saadet (sageli ringhäälingus), kus osalevad külalised, esitajad ja teised tegijad. @et
toolkit definition: Μια έκφραση ενός έργου που ενσωματώνει τη συνεισφορά της παρουσίασης ενός προγράμματος, συχνά εκπομπής, που περιλαμβάνει συχνά καλεσμένους, εκτελεστές κ.λπ. @el
toolkit definition: تعبيرة تتضمن إسهام وكيل مؤدي في برنامج يجري في الغالب بثه، ويستضيف فناني أداء آخرين. @ar
toolkit definition: 包括有主导节目（经常是广播节目）的一个行为者并包括其他表演者的贡献的一种内容表达 @zh-hans
toolkit label: Akteur als Gastgeberin/Gastgeber von @de
toolkit label: agent amfitrió de @ca
toolkit label: agent hôte de @fr
toolkit label: agent, som er vært af @da
toolkit label: gastgever-actor van @nl
toolkit label: host agent of @en
toolkit label: házigazda ágense: @hu
toolkit label: ir programmas vadītājs (aģents) @lv
toolkit label: juontaja (toimija) ekspressiossa
toolkit label: ospite agente di @it
toolkit label: saatejuht (tegija) väljenduses @et
toolkit label: sunucu temsilcisidir @tr
toolkit label: vert for (agent) @no
toolkit label: ξενιστής φορέας του @el
toolkit label: وكيل مضيف @ar
toolkit label: ……的主持人行为者 @zh-hans
has subproperty: juontaja (henkilö) ekspressiossa
has subproperty: juontaja (yhteistoimija) ekspressiossa
has subproperty: P50075
lexical alias: hostAgentOf.en
status: Published
type: Property
domain: C10002
label: er agent, som er vært af @da
label: er vert for (agent) @no
label: est un agent hôte de @fr
label: házigazda ágense a következőnek: @hu
label: ir programmas vadītājs (aģents) @lv
label: is gastgever-actor van @nl
label: is host agent of @en
label: ist Akteur als Gastgeberin/Gastgeber von @de
label: saatejuht (tegija) väljenduses @et
label: sunucu temsilcisidir @tr
label: è ospite agente di @it
label: és agent amfitrió de @ca
label: είναι ξενιστής φορέας του @el
label: هو وكيل مضيف لـ @ar
label: 是……的主持人行为者 @zh-hans
sub property of: esittäjä (toimija) ekspressiossa
alternative label: Gastgeberin/Gastgeber von @de
alternative label: amfitrió de @ca
alternative label: anfitrión de @es
alternative label: host of @en
alternative label: házigazdája: @hu
alternative label: hôte de @fr
alternative label: juontajana ohjelmassa
alternative label: ospite di @it
alternative label: saatejuht väljenduses @et
alternative label: sunucu temsilcisi ile ilişkilidir @tr
alternative label: vert for @no
alternative label: vært af @da
alternative label: ξενιστής του @el
alternative label: مضيف @ar
alternative label: ……的主持人 @zh-hans
definition: Bir temsilciyi, diğer sanatçıları içeren, sıklıkla bir programa liderlik eden bir temsilcinin katkısını içeren bir anlatımla ilişkilendirir. @tr
definition: Correla un agente a un'espressione che include un contributo da parte di un agente che conduce un programma, spesso una trasmissione, che include altri ospiti, attori e altri agenti. @it
definition: Hozzákapcsol egy ágenst egy kifejezési formához, amely magában foglalja egy ágens közreműködését egy program, gyakran sugárzott műsor, vezetésében, amelyen más előadók vesznek részt. @hu
definition: Liittää toimijan ekspressioon, jonka tekemiseen toimija osallistuu juontamalla (useimmiten lähetettyä) ohjelmaa, johon osallistuu muita esiintyjiä.
definition: Met un agent en relation avec une expression qui intègre une contribution de la part d’un agent consistant à diriger une activité, souvent diffusée à la radio, à la télévision, etc., qui fait appel à d’autres interprètes. @fr
definition: Relaciona un agent amb una expressió que inclou una contribució d’un agent dirigint un programa, sovint emès, que inclou altres intèrprets. @ca
definition: Relateert een actor aan een expressie die omvat een bijdrage van een actor die is een uitvoerder door het leiden van een programma, vaak uitgezonden, dat omvat andere gasten, artiesten en andere actoren. @nl

moderoija (toimija) ekspressiossa
has element type: 2
instruction number: 18.5
toolkit definition: An expression that includes a contribution by an agent of leading a program, often broadcast, where topics are discussed, usually with participation of experts in fields related to the discussion. @en
toolkit definition: Een expressie die omvat een bijdrage van een actor door leiden van een programma, vaak uitgezonden, waar onderwerpen worden bediscussieerd, vaak met deelname van experts op gebieden gerelateerd aan de discussie. @nl
toolkit definition: Egy kifejezési forma, amely magában foglalja egy ágens közreműködését egy program, gyakran sugárzott műsor, vezetésében, amelyen témákat vitatnak meg, rendszerint a beszélgetés témájában jártas szakértők részvételével. @hu
toolkit definition: Eine Expression, zu der ein Akteur beiträgt, indem er eine Veranstaltung (meist eine Sendung) leitet, in der Themen üblicherweise mit Expertinnen/Experten diskutiert werden. @de
toolkit definition: Ekspressio, jonka tekemiseen toimija osallistuu juontamalla (useimmiten lähetettyä) ohjelmaa, jossa keskustellaan eri aiheista tavallisesti keskusteluun liittyvien aiheiden asiantuntijoiden kanssa.
toolkit definition: Espressione che include un contributo da parte di un agente che conduce programma, spesso una trasmissione, dove sono discussi argomenti, solitamente con la partecipazione di esperti in campi relativi alla discussione. @it
toolkit definition: Et uttrykk som inkluderer et bidrag fra en agent i form av å lede et program, ofte kringkastet, der emner diskuteres, som regel med eksperter innen områder knyttet til diskusjonen, som deltakere. @no
toolkit definition: Expression qui intègre une contribution de la part d’un agent consistant à diriger une activité, souvent diffusée à la radio, à la télévision, etc., où des sujets sont discutés, habituellement avec la participation d’experts dans les domaines reliés à la discussion. @fr
toolkit definition: Expressió que inclou una contribució d’un agent dirigint un programa, sovint emès, on es discuteixen temes, habitualment amb la participació d’experts en els camps relacionats amb la discussió. @ca
toolkit definition: Genellikle tartışma ile ilgili alanlarda uzmanların katılımıyla konuların tartışıldığı, genellikle yayınlanan bir programa liderlik eden bir temsilcinin katkısını içeren bir anlatım. @tr
toolkit definition: Izteiksme, kas ietver aģenta ieguldījumu, vadot programmu (parasti apraidi), kurā tiek apspriestas tēmas ar ekspertu piedalīšanos. @lv
toolkit definition: Udtryk, som omfatter en agents bidrag ved at lede et program, ofte transmitteret, hvor emner diskuteres, normalt med deltagelse af fagfolk indenfor felter, som er relateret til diskussionen. @da
toolkit definition: Väljendus, millesse tegija on andnud panuse, juhtides saadet (sageli ringhäälingus), kus arutatakse mingeid teemasid ja kus tavaliselt osalevad arutatava teemavaldkonna asjatundjad. @et
toolkit definition: Μια έκφραση ενός έργου που ενσωματώνει τη συνεισφορά του συντονισμού ενός προγράμματος, συχνά εκπομπής, όπου συζητώνται θέματα, συνήθως με τη συμμετοχή ειδικών, σε τομείς συναφείς με το θέμα συζήτησης. @el
toolkit definition: تعبيرة تتضمن إسهام وكيل في إدارة برنامج، غالبا ما يجري بثه، ومناقشة موضوعات بمشاركة خبراء في المجالات المتعلقة بموضوع النقاش. @ar
toolkit definition: 包括有主导节目（经常是广播节目，其中讨论话题，通常有讨论相关领域专家参与）的一个行为者的贡献的一种内容表达 @zh-hans
toolkit label: Akteur als Moderatorin/Moderator von @de
toolkit label: agent moderador de @ca
toolkit label: agent modérateur de @fr
toolkit label: agent, som er ordstyrer af @da
toolkit label: ir moderators (aģents) @lv
toolkit label: moderator agent of @en
toolkit label: moderator-actor van @nl
toolkit label: moderatore agente di @it
toolkit label: moderatör temsilcisi @tr
toolkit label: moderoija (toimija) ekspressiossa
toolkit label: moderátor ágense: @hu
toolkit label: ordstyrer for (agent) @no
toolkit label: väitlusjuht (tegija) väljenduses @et
toolkit label: συντονιστής φορέας του @el
toolkit label: وكيل مدير مناقشة لـ @ar
toolkit label: ……的谈话类节目主持人行为者 @zh-hans
has subproperty: moderoija (henkilö) ekspressiossa
has subproperty: moderoija (yhteistoimija) ekspressiossa
has subproperty: P50076
lexical alias: moderatorAgentOf.en
status: Published
type: Property
domain: C10002
label: er agent, som er ordstyrer af @da
label: er ordstyrer for (agent) @no
label: est un agent modérateur de @fr
label: ir moderators (aģents) @lv
label: is moderator agent of @en
label: is moderator-actor van @nl
label: ist Akteur als Moderatorin/Moderator von @de
label: moderatör temsilcisidir @tr
label: moderátor ágense a következőnek: @hu
label: väitlusjuht (tegija) väljenduses @et
label: è moderatore agente di @it
label: és agent moderador de @ca
label: είναι συντονιστής φορέας του @el
label: هو وكيل مدير مناقشة لـ @ar
label: 是……的谈话类节目主持人行为者 @zh-hans
sub property of: esittäjä (toimija) ekspressiossa
alternative label: Moderator von @de
alternative label: moderador de @ca
alternative label: moderator af @da
alternative label: moderator of @en
alternative label: moderatore di @it
alternative label: moderatör @tr
alternative label: moderoijana ohjelmassa
alternative label: moderátora: @hu
alternative label: modérateur de @fr
alternative label: ordstyrer for @no
alternative label: väitlusjuht väljenduses @et
alternative label: συντονιστής του @el
alternative label: مدير مناقشة لـ @ar
alternative label: ……的谈话类节目主持人 @zh-hans
definition: Bir temsilciyi, genellikle tartışma ile ilgili alanlardaki uzmanların katılımıyla konuların tartışıldığı, sıklıkla yayınlanan bir programa liderlik eden bir temsilcinin katkısını içeren bir anlatımla ilişkilendirir. @tr
definition: Correla un agente a un'espressione che include un contributo da parte di un agente che conduce programma, spesso una trasmissione, dove sono discussi argomenti, solitamente con la partecipazione di esperti in campi relativi alla discussione. @it
definition: Hozzákapcsol egy ágenst egy kifejezési formához, amely magában foglalja egy ágens közreműködését egy program, gyakran sugárzott műsor, vezetésében, amelyen témákat vitatnak meg, rendszerint a beszélgetés témájában jártas szakértők részvételével. @hu
definition: Liittää toimijan ekspressioon, jonka tekemiseen toimija osallistuu juontamalla (useimmiten lähetettyä) ohjelmaa, jossa keskustellaan eri aiheista tavallisesti keskusteluun liittyvien aiheiden asiantuntijoiden kanssa.
definition: Met un agent en relation avec une expression qui intègre une contribution de la part d’un agent consistant à diriger une activité, souvent diffusée à la radio, à la télévision, etc., où des sujets sont discutés, habituellement avec la participation d’experts dans les domaines reliés à la discussion. @fr
definition: Relaciona un agent amb una expressió que inclou una contribució d’un agent dirigint un programa, sovint emès, on es discuteixen temes, habitualment amb la participació d’experts en els camps relacionats amb la discussió. @ca
definition: Relateert een actor aan een expressie die omvat een bijdrage van een actor door leiden van een programma, vaak uitgezonden, waar onderwerpen worden bediscussieerd, vaak met deelname van experts op gebieden gerelateerd aan de discussie. @nl
definition: Relaterer en agent til et udtryk, som omfatter en agents bidrag ved at lede et program, ofte transmitteret, hvor emner diskuteres, normalt med deltagelse af fagfolk indenfor felter, som er relateret til diskussionen. @da

nukettaja (toimija) ekspressiossa
has element type: 2
instruction number: 18.5
toolkit definition: An expression that includes a contribution by an agent of manipulating, controlling, or directing puppets or marionettes in a moving image production or a musical or dramatic presentation or entertainment. @en
toolkit definition: Een expressie die omvat een bijdrage van een actor in het manipuleren, sturen of regisseren van poppen of marionetten in een bewegend beeld-productie of in een muziek- of dramapresentatie of vermaak. @nl
toolkit definition: Egy kifejezési forma, amely magában foglalja egy ágens közreműködését bábok vagy marionettfigurák manipulálásában, vezérlésében vagy irányításában egy mozgókép-produkcióban, zenei vagy drámai bemutatóban vagy szórakoztató műsorban. @hu
toolkit definition: Eine Expression, zu der ein Akteur beiträgt, indem er Puppen oder Marionetten in einer Bewegtbildproduktion oder einer musikalischen oder dramatischen Darbietung oder Aufführung bewegt, kontrolliert oder lenkt. @de
toolkit definition: Ekspressio, jonka tekemiseen toimija osallistuu käsittelemällä, kontrolloimalla tai ohjaamalla nukkeja tai marionetteja elokuvatuotannossa tai musiikki- tai näytelmäesityksessä.
toolkit definition: Espressione che include un contributo da parte di un agente nella manipolazione, controllo o direzione di burattini o marionette in una produzione di immagini in movimento o una presentazione o spettacolo musicale o drammatico. @it
toolkit definition: Et uttrykk som inkluderer et bidrag fra en agent i form av å styre dukker eller marionetter i en produksjon med levende bilder eller i en musikalsk eller dramatisk forestilling eller underholdning. @no
toolkit definition: Expression qui intègre une contribution de la part d’un agent consistant à manipuler, à contrôler ou à diriger des marionnettes dans une production d’images animées ou bien dans une présentation ou un spectacle musical ou dramatique. @fr
toolkit definition: Expressió que inclou una contribució d’un agent manipulant, controlant o dirigint titelles o marionetes en una producció d’imatge en moviment o en una representació o un espectacle musical o dramàtic. @ca
toolkit definition: Hareketli bir görüntü üretiminde veya müzikal veya dramatik bir sunumda veya eğlencede kuklaları manipüle eden, kontrol eden veya yöneten bir temsilcinin katkısını içeren bir anlatım. @tr
toolkit definition: Izteiksme, kas ietver aģenta ieguldījumu, manipulējot, kontrolējot vai vadot lelles vai marionetes, radot kustīgu attēlu vai muzikālu, vai dramatisku prezentāciju vai izklaidei. @lv
toolkit definition: Udtryk, som omfatter en agents bidrag ved at manipulere, styre eller føre dukker eller marionetter i en levende billedproduktion eller en musikalsk eller dramatisk præsentation eller underholdning. @da
toolkit definition: Väljendus, millesse tegija on andnud panuse, käsitsedes, kontrollides või juhtides nukke või marionette filmi tootmisel, muusika- või draamaetenduses või meelelahutusüritusel. @et
toolkit definition: Μια έκφραση ενός έργου που ενσωματώνει τη συνεισφορά του χειρισμού, του ελέγχου ή της καθοδήγησης μαριονετών σε μια παραγωγή κινητής εικόνας ή σε μια μουσική ή δραματική παρουσίαση ή ψυχαγωγία. @el
toolkit definition: تعبيرة تتضمن إسهام وكيل باللعب بالعرائس أو الدمى المتحركة أو التحكم فيها، أو توجيهها في إنتاج لصور متحركة أو في عرض موسيقي أو درامي أو ترفيهي. @ar
toolkit definition: 包括有在动态图像制作或者音乐或戏剧呈现或娱乐中操纵、控制、指引木偶的一个行为者的贡献的一种内容表达 @zh-hans
toolkit label: Akteur als Puppenspielerin/Puppenspieler von @de
toolkit label: agent marionnettiste de @fr
toolkit label: agent titellaire de @ca
toolkit label: agent, som er dukkefører af @da
toolkit label: burattinaio agente di @it
toolkit label: bábjátékos ágense: @hu
toolkit label: dukkefører for (agent) @no
toolkit label: ir leļļu teātra aktieris (aģents) @lv
toolkit label: kuklacı temsilcisi @tr
toolkit label: nukettaja (toimija) ekspressiossa
toolkit label: nukujuht (tegija) väljenduses @et
toolkit label: poppenspeler-actor van @nl
toolkit label: puppeteer agent of @en
toolkit label: κουκλοπαίκτης φορέας του @el
toolkit label: وكيل محرك عرائس @ar
toolkit label: ……的木偶表演者行为者 @zh-hans
has subproperty: nukettaja (henkilö) ekspressiossa
has subproperty: nukettaja (yhteistoimija) ekspressiossa
has subproperty: P50077
lexical alias: puppeteerAgentOf.en
status: Published
type: Property
domain: C10002
label: bábjátékos ágense a következőnek: @hu
label: er agent, som er dukkefører af @da
label: er dukkefører for (agent) @no
label: est un agent marionnettiste de @fr
label: ir leļļu teātra aktieris (aģents) @lv
label: is poppenspeler-actor van @nl
label: is puppeteer agent of @en
label: ist Akteur als Puppenspielerin/Puppenspieler von @de
label: kuklacı temsilcisidir @tr
label: nukujuht (tegija) väljenduses @et
label: è burattinaio agente di @it
label: és agent titellaire de @ca
label: είναι κουκλοπαίκτης φορέας του @el
label: هو وكيل محرك عرائس لـ @ar
label: 是……的木偶表演者行为者 @zh-hans
sub property of: esittäjä (toimija) ekspressiossa
alternative label: Puppenspieler von @de
alternative label: burattinaio di @it
alternative label: bábjátékosa: @hu
alternative label: dukkefører af @da
alternative label: dukkefører for @no
alternative label: kuklacı @tr
alternative label: marionnettiste de @fr
alternative label: nukettajana esityksessä
alternative label: nukujuht väljenduses @et
alternative label: puppeteer of @en
alternative label: titellaire de @ca
alternative label: titiritero de @es
alternative label: κουκλοπαίκτης του @el
alternative label: μαριονετίστας του @el
alternative label: محرك عرائس @ar
alternative label: ……的木偶表演者 @zh-hans
definition: Bir temsilciyi, hareketli bir görüntü üretiminde veya müzikal ya da dramatik bir sunumda veya eğlencede kuklaları manipüle eden, kontrol eden veya yöneten bir temsilcinin katkısını içeren bir anlatımla ilişkilendirir. @tr
definition: Correla un agente a un'espressione che include un contributo da parte di un agente nella manipolazione, controllo o direzione di burattini o marionette in una produzione di immagini in movimento o una presentazione o spettacolo musicale o drammatico. @it
definition: Hozzákapcsol egy ágenst egy kifejezési formához, amely magában foglalja egy ágens közreműködését bábok vagy marionettfigurák manipulálásában, vezérlésében vagy irányításában egy mozgókép-produkcióban, zenei vagy drámai bemutatóban vagy szórakoztató műsorban. @hu
definition: Liittää toimijan ekspressioon, jonka tekemiseen toimija osallistuu käsittelemällä, kontrolloimalla tai ohjaamalla nukkeja tai marionetteja elokuvatuotannossa tai musiikki- tai näytelmäesityksessä.
definition: Met un agent en relation avec une expression qui intègre une contribution de la part d’un agent consistant à manipuler, à contrôler ou à diriger des marionnettes dans une production d’images animées ou bien dans une présentation ou un spectacle musical ou dramatique. @fr
definition: Relaciona un agent amb una expressió que inclou una contribució d’un agent manipulant, controlant o dirigint titelles o marionetes en una producció d’imatge en moviment o en una representació o un espectacle musical o dramàtic. @ca

panelisti (toimija) ekspressiossa
has element type: 2
instruction number: 18.5
toolkit definition: An expression that includes a contribution by an agent of participating in a program, often broadcast, where topics are discussed, usually with participation of experts in fields related to the discussion. @en
toolkit definition: Een expressie die omvat een bijdrage van een actor door deelname aan een programma, vaak uitgezonden, waar onderwerpen worden bediscussieerd, vaak met deelname van experts op gebieden gerelateerd aan de discussie. @nl
toolkit definition: Egy kifejezési forma, amely magában foglalja egy ágens közreműködését egy programban, gyakran sugárzott műsorban, való részvételben, amelyen témákat vitatnak meg, rendszerint a beszélgetés témájában jártas szakértők részvételével. @hu
toolkit definition: Eine Expression, zu der ein Akteur beiträgt, indem er an einer Veranstaltung (meist einer Sendung) teilnimmt, in der Themen üblicherweise mit Expertinnen/Experten diskutiert werden. @de
toolkit definition: Ekspressio, jonka tekemiseen toimija osallistuu panelistina (useimmiten lähetetyssä) ohjelmassa, jossa keskustellaan eri aiheista tavallisesti keskusteluun liittyvien aiheiden asiantuntijoiden kanssa.
toolkit definition: Espressione che include un contributo da parte di un agente che partecipa ad programma, spesso una trasmissione, dove sono discussi argomenti, solitamente con la partecipazione di esperti in campi relativi alla discussione.. @it
toolkit definition: Et uttrykk som inkluderer et bidrag fra en agent i form av å delta i et program, ofte kringkastet, der emner diskuteres, som regel med eksperter innen områder knyttet til diskusjonen, som deltakere. @no
toolkit definition: Expression qui intègre une contribution de la part d’un agent consistant à participer à une activité, souvent diffusée à la radio, à la télévision, etc., où des sujets sont discutés, habituellement avec la participation d’experts dans les domaines reliés à la discussion. @fr
toolkit definition: Expressió que inclou una contribució d’un agent participant en un programa, sovint emès, on es discuteixen temes, habitualment amb la participació d’experts en els camps relacionats amb la discussió. @ca
toolkit definition: Genellikle yayınlanan, konuların tartışıldığı, genellikle tartışmayla ilgili alanlardaki uzmanların katılımıyla bir programa katılan bir temsilcinin katkısını içeren bir anlatım. @tr
toolkit definition: Izteiksme, kas ietver aģenta ieguldījumu, piedaloties programmā (parasti apraidē), kurā tiek apspriestas tēmas ar ekspertu līdzdalību. @lv
toolkit definition: Udtryk, som omfatter en agents bidrag ved at deltage i et program, ofte transmitteret, hvor emner diskuteres, normat med deltagelse af fagfolk indenfor felter, som er relateret til diskussionen. @da
toolkit definition: Väljendus, millesse tegija on andnud panuse, osaledes saates (sageli ringhäälingus), kus arutatakse mingeid teemasid ja kus tavaliselt osalevad arutatava teemavaldkonna asjatundjad. @et
toolkit definition: Μια έκφραση ενός έργου που ενσωματώνει τη συνεισφορά της συμμετοχής σε ένα πρόγραμμα, συνήθως σε μια εκπομπή, όπου συζητώνται θέματα, συνήθως με τη συμμετοχή των ειδικών στους τομείς που συνδέονται με το θέμα συζήτησης. @el
toolkit definition: تعبيرة تتضمن إسهام وكيل بالمشاركة في برنامج، غالبا ما يجري بثه، ومناقشة موضوعات بمشاركة خبراء في المجالات المتعلقة بموضوع النقاش. @ar
toolkit definition: 包括有参与节目（经常是广播节目，其中讨论话题，通常有讨论相关领域专家参与）的一个行为者的贡献的一种内容表达 @zh-hans
toolkit label: Akteur als Diskussionsteilnehmerin/Diskussionsteilnehmer von @de
toolkit label: Panel katılımcı temsilcisi @tr
toolkit label: agent panelista de @ca
toolkit label: agent panéliste de @fr
toolkit label: agent, som er paneldeltager af @da
toolkit label: arutelust osavõtja (tegija) väljenduses @et
toolkit label: ir diskusijas dalībnieks (aģents) @lv
toolkit label: paneldeltaker i (agent) @no
toolkit label: panelist agent of @en
toolkit label: panelist agente di @it
toolkit label: panelisti (toimija) ekspressiossa
toolkit label: panellid-actor van @nl
toolkit label: vitafórumtag ágense a következőnek: @hu
toolkit label: μέλος ομάδας φορέας του @el
toolkit label: وكيل مشارك في برنامج @ar
toolkit label: ……的访谈嘉宾行为者 @zh-hans
has subproperty: panelisti (henkilö) ekspressiossa
has subproperty: panelisti (yhteistoimija) ekspressiossa
has subproperty: P50078
lexical alias: panelistAgentOf.en
status: Published
type: Property
domain: C10002
label: arutelust osavõtja (tegija) väljenduses @et
label: er agent, som er paneldeltager af @da
label: er paneldeltaker i (agent) @no
label: est un agent panéliste de @fr
label: ir diskusijas dalībnieks (aģents) @lv
label: is panelist agent of @en
label: is panellid-actor van @nl
label: ist Akteur als Diskussionsteilnehmerin/Diskussionsteilnehmer von @de
label: panelist temsilcisidir @tr
label: vitafórumtag ágense a következőnek: @hu
label: è partecipante agente di @it
label: és agent panelista de @ca
label: είναι μέλος λογομήγυρης φορέας του @el
label: هو وكيل مشارك في برنامج لـ @ar
label: 是……的访谈嘉宾行为者 @zh-hans
sub property of: esittäjä (toimija) ekspressiossa
alternative label: Diskussionsteilnehmer von @de
alternative label: Panel katılımcı @tr
alternative label: arutelust osavõtja väljenduses @et
alternative label: paneeliohjelma
alternative label: paneldeltager af @da
alternative label: paneldeltaker i @no
alternative label: panelist of @en
alternative label: panelista de @ca
alternative label: panéliste de @fr
alternative label: parecipante di @it
alternative label: vitafórumtagja: @hu
alternative label: μέλος πάνελ του @el
alternative label: مشارك في برنامج @ar
alternative label: ……的访谈嘉宾 @zh-hans
definition: Bir temsilciyi, genellikle tartışma ile ilgili alanlarda uzmanların katılımıyla konuların tartışıldığı, sıklıkla yayınlanan bir programa katılan temsilcinin katkısını içeren bir anlatımla ilişkilendirir. @tr
definition: Correla un agente a un'espressione che include un contributo da parte di un agente che partecipa ad programma, spesso una trasmissione, dove sono discussi argomenti, solitamente con la partecipazione di esperti in campi relativi alla discussione. @it
definition: Hozzákapcsol egy ágenst egy kifejezési formához, amely magában foglalja egy ágens közreműködését egy programban, gyakran sugárzott műsorban, való részvételben, amelyen témákat vitatnak meg, rendszerint a beszélgetés témájában jártas szakértők részvételével. @hu
definition: Liittää toimijan ekspressioon, jonka tekemiseen toimija osallistuu panelistina (useimmiten lähetetyssä) ohjelmassa, jossa keskustellaan eri aiheista tavallisesti keskusteluun liittyvien aiheiden asiantuntijoiden kanssa.
definition: Met un agent en relation avec une expression qui intègre une contribution de la part d’un agent consistant à participer à une activité, souvent diffusée à la radio, à la télévision, etc., où des sujets sont discutés, habituellement avec la participation d’experts dans les domaines reliés à la discussion. @fr
definition: Relaciona un agent amb una expressió que inclou una contribució d’un agent participant en un programa, sovint emès, on es discuteixen temes, habitualment amb la participació d’experts en els camps relacionats amb la discussió. @ca
definition: Relateert een actor aan een expressie die omvat een bijdrage van een actor door deelname aan een programma, vaak uitgezonden, waar onderwerpen worden bediscussieerd, vaak met deelname van experts op gebieden gerelateerd aan de discussie. @nl
definition: Relaterer en agent til et udtryk, som omfatter en agents bidrag ved at deltage i et program, ofte transmitteret, hvor emner diskuteres, normat med deltagelse af fagfolk indenfor felter, som er relateret til diskussionen. @da

soittaja (toimija) ekspressiossa
has element type: 2
instruction number: 18.5
toolkit definition: An expression that includes a contribution by an agent of playing a musical instrument. @en
toolkit definition: Bir müzik aleti çalan bir temsilcinin katkısını içeren bir anlatım. @tr
toolkit definition: Een expressie die omvat een bijdrage door een actor door het spelen van een muziekinstrument. @nl
toolkit definition: Egy kifejezési forma, amely magában foglalja egy hangszeren játszó ágens közreműködését. @hu
toolkit definition: Eine Expression, zu der ein Akteur beiträgt, indem er ein Musikinstrument spielt. @de
toolkit definition: Ekspressio, jonka tekemiseen toimija osallistuu soittamalla soitinta.
toolkit definition: Espressione che include un contributo da parte di un agente nel suonare uno strumento musicale. @it
toolkit definition: Et uttrykk som inkluderer et bidrag fra en agent i form av å spille et musikkinstrument. @no
toolkit definition: Expression qui intègre une contribution de la part d’un agent consistant à jouer d’un instrument de musique. @fr
toolkit definition: Expressió que inclou una contribució d’un agent tocant un instrument musical. @ca
toolkit definition: Izteiksme, kas ietver aģenta ieguldījumu, spēlējot mūzikas instrumentu. @lv
toolkit definition: Udtryk, som omfatter en agents bidrag ved at spille et musikinstrument. @da
toolkit definition: Väljendus, millesse tegija on andnud panuse, mängides muusikainstrumenti. @et
toolkit definition: Μια έκφραση ενός έργου που ενσωματώνει τη συνεισφορά της εκτέλεσης ενός μουσικού οργάνου. @el
toolkit definition: تعبيرة تتضمن إسهام وكيل بالعزف على آلة موسيقية. @ar
toolkit definition: 包括有演奏乐器的一个行为者的贡献的一种内容表达 @zh-hans
toolkit label: Akteur als Instrumentalmusikerin/Instrumentalmusiker von @de
toolkit label: agent instrumentista de @ca
toolkit label: agent instrumentiste de @fr
toolkit label: agent, som er instrumentalist af @da
toolkit label: enstrümantalist temsilcisidir @tr
toolkit label: instrumentalist (tegija) väljenduses @et
toolkit label: instrumentalist agent of @en
toolkit label: instrumentalist i (agent) @no
toolkit label: instrumentalist-actor van @nl
toolkit label: ir instrumentālists (aģents) @lv
toolkit label: soittaja (toimija) ekspressiossa
toolkit label: strumentista agente di @it
toolkit label: zenész ágense: @hu
toolkit label: εκτελεστής [μουσικού οργάνου] του @el
toolkit label: وكيل عازف @ar
toolkit label: ……的乐器演奏者行为者 @zh-hans
has subproperty: soittaja (henkilö) ekspressiossa
has subproperty: soittaja (yhteistoimija) ekspressiossa
has subproperty: P50079
lexical alias: instrumentalistAgentOf.en
status: Published
type: Property
domain: C10002
label: enstrümantalist temsilcisidir @tr
label: er agent, som er instrumentalist af @da
label: er instrumentalist i (agent) @no
label: est un agent instrumentiste de @fr
label: instrumentalist (tegija) väljenduses @et
label: ir instrumentālists (aģents) @lv
label: is instrumentalist agent of @en
label: is instrumentalist-actor van @nl
label: ist Akteur als Instrumentalmusikerin/Instrumentalmusiker von @de
label: zenész ágense a következőnek: @hu
label: è strumentista agente di @it
label: és agent instrumentista de @ca
label: είναι εκτελεστής [μουσικού οργάνου] φορέας του @el
label: هو وكيل عازف لـ @ar
label: 是……的乐器演奏者行为者 @zh-hans
sub property of: esittäjä (toimija) ekspressiossa
alternative label: Instrumentalmusiker von @de
alternative label: enstrümentalist temsilcisidir @tr
alternative label: instrumentalist af @da
alternative label: instrumentalist i @no
alternative label: instrumentalist of @en
alternative label: instrumentalist väljenduses @et
alternative label: instrumentista de @ca
alternative label: instrumentiste de @fr
alternative label: soittajana ohjelmassa
alternative label: strumentista di @it
alternative label: zenésze: @hu
alternative label: εκτελεστής [μουσικού οργάνου] του @el
alternative label: عازف @ar
alternative label: ……的乐器演奏者 @zh-hans
definition: Bir temsilciyi, bir müzik aleti çalan temsilcinin katkısını içeren bir anlatımla ilişkilendirir. @tr
definition: Correla un agente a un'espressione che include un contributo da parte di un agente nel suonare uno strumento musicale, @it
definition: Hozzákapcsol egy ágenst egy kifejezési formához, amely magában foglalja egy hangszeren játszó ágens közreműködését. @hu
definition: Liittää toimijan ekspressioon, jonka tekemiseen toimija osallistuu soittamalla soitinta.
definition: Met un agent en relation avec une expression qui intègre une contribution de la part d’un agent consistant à jouer d’un instrument de musique. @fr
definition: Relaciona un agent amb una expressió que inclou una contribució d’un agent tocant un instrument musical. @ca
definition: Relateert een actor aan een expressie die omvat een bijdrage door een actor door het spelen van een muziekinstrument. @nl
definition: Relaterer en agent til et udtryk, som omfatter en agents bidrag ved at spille et musikinstrument. @da

kommentaattori (toimija) ekspressiossa
has element type: 2
instruction number: 18.5
toolkit definition: An expression that includes a contribution by an agent of providing interpretation, analysis, or a discussion of the subject matter on a recording, film, or other audiovisual medium. @en
toolkit definition: Bir kayıtta, filmde veya diğer görsel-işitsel ortamda konuya ilişkin yorum, analiz veya tartışma sağlayan bir temsilcinin katkısını içeren bir anlatım. @tr
toolkit definition: Een expressie die omvat een bijdrage door een actor door het verlenen van uitleg, analyse of een discussie over het onderwerp op een opname, film of ander audiovisueel medium. @nl
toolkit definition: Egy kifejezési forma, amely magában foglalja egy ágens közreműködését tolmácsolásban, elemzésben vagy a téma megvitatásában egy felvételen, filmen vagy más audiovizuális médiumon. @hu
toolkit definition: Eine Expression, zu der ein Akteur beiträgt, indem er in einer Aufnahme, in einem Film oder in einem anderen audiovisuellen Medium eine Interpretation, eine Analyse oder eine Diskussion des Themas präsentiert. @de
toolkit definition: Ekspressio, jonka tekemiseen toimija osallistuu tulkitsemalla tai analysoimalla äänitteen, elokuvan tai muun audiovisuaalisen aineiston aihetta tai keskustelemalla siitä.
toolkit definition: Espressione che include un contributo da parte di un agente nel fornire interpretazione, analisi o discussione dell'argomento di una registrazione, film o altro mezzo audiovisivo. @it
toolkit definition: Et uttrykk som inkluderer et bidrag fra en agent i form av å tilføre tolkning, analyse eller drøfting av temaet for et opptak, en film eller et annet audiovisuelt medium. @no
toolkit definition: Expression qui intègre une contribution de la part d’un agent consistant à fournir une interprétation, une analyse ou une explication du sujet sur un enregistrement, un film ou un autre support audiovisuel. @fr
toolkit definition: Expressió que inclou una contribució d’un agent proporcionant l’opinió, l’anàlisi o una explicació del tema d’un enregistrament, una pel·lícula o de qualsevol altre suport audiovisual. @ca
toolkit definition: Izteiksme, kas ietver aģenta ieguldījumu, sniedzot interpretāciju, analīzi vai diskusiju par tēmu ierakstā, filmā vai citā audiovizuālā vidē. @lv
toolkit definition: Udtryk, som omfatter en agents bidrag ved at stå for fortolkning, analyse eller diskussion af det emne, som behandles i en optagelse, film eller andet audiovisuelt medium. @da
toolkit definition: Väljendus, millesse tegija on andnud panuse, tõlgendades või analüüsides salvestuse, filmi või muu audiovisuaalse meediumi ainestikku või arutledes selle üle. @et
toolkit definition: Μια έκφραση ενός έργου που ενσωματώνει τη συνεισφορά της ερμηνείας, ανάλυσης ή συζήτησης ενός θέματος μιας ηχογράφησης, μιας ταινίας ή άλλου οπτικοακουστικού μέσου. @el
toolkit definition: تعبيرة تتضمن إسهام وكيل في تقديم تفسير للموضوع، أو تحليله، أو مناقشته في تسجيل أو في فيلم، أو أي وسيط سمعي بصري آخر. @ar
toolkit definition: 包括有提供关于录像、电影或其他视听媒介中的主要内容之解释、分析或讨论的一个行为者的贡献的一种内容表达 @zh-hans
toolkit label: Akteur als Kommentatorin/Kommentator von @de
toolkit label: agent comentarista de @ca
toolkit label: agent commentateur de @fr
toolkit label: agent, som er kommentator af @da
toolkit label: commentator agent of @en
toolkit label: commentator-actor van @nl
toolkit label: commentatore agente di @it
toolkit label: ir komentators (aģents) @lv
toolkit label: kommentaator (tegija) väljenduses @et
toolkit label: kommentaattori (toimija) ekspressiossa
toolkit label: kommentator for (agent) @no
toolkit label: kommentátor ágense: @hu
toolkit label: yorumcu temsilcisi @tr
toolkit label: σχολιαστής φορέας του @el
toolkit label: وكيل معلق @ar
toolkit label: ……的解说员行为者 @zh-hans
has subproperty: kommentaattori (henkilö) ekspressiossa
has subproperty: kommentaattori (yhteistoimija) ekspressiossa
has subproperty: P50080
lexical alias: commentatorAgentOf.en
status: Published
type: Property
domain: C10002
label: er agent, som er kommentator af @da
label: er kommentator for (agent) @no
label: est un agent commentateur de @fr
label: ir komentators (aģents) @lv
label: is commentator agent of @en
label: is commentator-actor van @nl
label: ist Akteur als Kommentatorin/Kommentator von @de
label: kommentaator (tegija) väljenduses @et
label: kommentátor ágense a következőnek: @hu
label: yorumcu temsilcisidir @tr
label: è commentatore agente di @it
label: és agent comentarista de @ca
label: είναι σχολιαστής φορέας του @el
label: هو وكيل مُعلِق على @ar
label: 是……的解说员行为者 @zh-hans
sub property of: esittäjä (toimija) ekspressiossa
alternative label: Kommentator von @de
alternative label: comentarista de @ca
alternative label: commentateur de @fr
alternative label: commentator of @en
alternative label: commentatore di @it
alternative label: kommentaator väljenduses @et
alternative label: kommentaattorina ohjelmassa
alternative label: kommentator af @da
alternative label: kommentator for @no
alternative label: kommentátora: @hu
alternative label: yorumcu @tr
alternative label: σχολιαστής του @el
alternative label: معلق @ar
alternative label: ……的解说员 @zh-hans
definition: Bir temsilciyi, bir kayıt, film veya başka görsel-işitsel ortamda konuya dair yorum, analiz ya da konu hakkında tartışma yapmayı sağlayan bir temsilcinin katkısını içeren bir anlatımla ilişkilendirir. @tr
definition: Correla un agente a un'espressione che include un contributo da parte di un agente nel fornire interpretazione, analisi o discussione dell'argomento di una registrazione, film o altro mezzo audiovisivo. @it
definition: Hozzákapcsol egy ágenst egy kifejezési formához, amely magában foglalja egy ágens közreműködését tolmácsolásban, elemzésben vagy a téma megvitatásában egy felvételen, filmen vagy más audiovizuális médiumon. @hu
definition: Liittää toimijan ekspressioon, jonka tekemiseen toimija osallistuu tulkitsemalla tai analysoimalla äänitteen, elokuvan tai muun audiovisuaalisen aineiston aihetta tai keskustelemalla siitä.
definition: Met un agent en relation avec une expression qui intègre une contribution de la part d’un agent consistant à fournir une interprétation, une analyse ou une explication du sujet sur un enregistrement, un film ou un autre support audiovisuel. @fr
definition: Relaciona un agent amb una expressió que inclou una contribució d’un agent proporcionant l’opinió, l’anàlisi o una explicació del tema d’un enregistrament, una pel·lícula o de qualsevol altre suport audiovisual. @ca
definition: Relateert een actor aan een expressie die omvat een bijdrage door een actor door het verlenen van uitleg, analyse of een discussie over het onderwerp op een opname, film of ander audiovisueel medium. @nl
definition: Relaterer en agent til et udtryk, som omfatter en agents bidrag ved at stå for fortolkning, analyse eller diskussion af det emne, som behandles i en optagelse, film eller andet audiovisuelt medium. @da

kertoja (toimija) ekspressiossa
has element type: 2
instruction number: 18.5
toolkit definition: An expression that includes a contribution by an agent of reading aloud or giving an account of an act, occurrence, or other event. @en
toolkit definition: Een expressie die omvat een bijdrage door een actor door hardop lezen of verslag geven van een daad, voorval of andere gebeurtenis. @nl
toolkit definition: Egy kifejezési forma, amely magában foglalja egy ágens közreműködését egy cselekményről, történésről vagy más eseményről szóló beszámoló hangos felolvasásában. @hu
toolkit definition: Eine Expression, zu der ein Akteur beiträgt, indem er eine Handlung, ein Geschehnis oder ein anderes Ereignis laut vorliest oder schildert. @de
toolkit definition: Ekspressio, jonka tekemiseen toimija osallistuu lukemalla ääneen tai kertomalla toiminnasta, tapahtumasta, tapahtumien kulusta tms.
toolkit definition: Espressione che include un contributo da parte di un agente nella lettura ad alta voce o racconto di un fatto, avvenimento o altro evento. @it
toolkit definition: Et uttrykk som inkluderer et bidrag fra en agent i form av å lese høyt eller fortelle om en handling, hendelse eller annen begivenhet. @no
toolkit definition: Expression qui intègre une contribution de la part d’un agent consistant à lire à voix haute ou à rendre compte d’une action, d’une situation ou d’un autre événement. @fr
toolkit definition: Expressió que inclou una contribució d’un agent llegint en veu alta o explicant una acció, una situació o qualsevol altre esdeveniment. @ca
toolkit definition: Izteiksme, kas ietver aģenta ieguldījumu, skaļi nolasot tekstu vai sniedzot ziņojumu par kādu darbību, notikumu, notikumu gaitu u.tml. @lv
toolkit definition: Udtryk, som omfatter en agents bidrag ved at læse højt eller berette om en handling, en hændelse, et begivenhedsforløb etc. @da
toolkit definition: Väljendus, millesse tegija on andnud panuse, valjusti lugedes või jutustades mingist tegevusest, juhtumist, sündmuste käigust vms. @et
toolkit definition: Yüksek sesle okuma veya bir eylem, olay veya başka bir olayın hesabını veren bir temsilcinin katkısını içeren bir anlatım. @tr
toolkit definition: Μια έκφραση ενός έργου που ενσωματώνει τη συνεισφορά της ανάγνωσης ή της αφήγησης για να διηγηθεί ένα γεγονός, μία πράξη, μία σειρά συμβάντων κ.λπ. @el
toolkit definition: تعبيرة تتضمن إسهام وكيل بالقراءة بصوت مرتفع أو بسرد فصل من مسرحية، أو واقعة، أو حدث آخر. @ar
toolkit definition: 包括有朗读或描述行为、事情或其他事件的一个行为者的贡献的一种内容表达 @zh-hans
toolkit label: Akteur als Erzählerin/Erzähler von @de
toolkit label: agent narrador de @ca
toolkit label: agent narrateur de @fr
toolkit label: agent, som er fortæller af @da
toolkit label: anlatıcı temsilcisi @tr
toolkit label: forteller av (agent) @no
toolkit label: ir teicējs (aģents) @lv
toolkit label: jutustaja (tegija) väljenduses @et
toolkit label: kertoja (toimija) ekspressiossa
toolkit label: narrator agent of @en
toolkit label: narratore agente di @it
toolkit label: narrátor ágense: @hu
toolkit label: verteller-actor van @nl
toolkit label: αφηγητής φορέας του @el
toolkit label: وكيل راوٍ @ar
toolkit label: ……的旁白者行为者 @zh-hans
has subproperty: kertoja (henkilö) ekspressiossa
has subproperty: kertoja (yhteistoimija) ekspressiossa
has subproperty: P50081
lexical alias: narratorAgentOf.en
status: Published
type: Property
domain: C10002
label: anlatıcı temsilcisidir @tr
label: er agent, som er fortæller af @da
label: er forteller av (agent) @no
label: est un agent narrateur de @fr
label: ir teicējs (aģents) @lv
label: is narrator agent of @en
label: is verteller-actor van @nl
label: ist Akteur als Erzählerin/Erzähler von @de
label: jutustaja (tegija) väljenduses @et
label: narrátor ágense a következőnek: @hu
label: è narratore agente di @it
label: és agent narrador de @ca
label: είναι αφηγητής φορέας του @el
label: هو وكيل راوٍ لـ @ar
label: 是……的旁白者行为者 @zh-hans
sub property of: esittäjä (toimija) ekspressiossa
alternative label: Erzähler von @de
alternative label: anlatıcısı @tr
alternative label: forteller av @no
alternative label: fortæller af @da
alternative label: jutustaja väljenduses @et
alternative label: kertojana tilaisuudessa
alternative label: narrador de @ca
alternative label: narrateur de @fr
alternative label: narrator of @en
alternative label: narratore di @it
alternative label: narrátora: @hu
alternative label: αφηγητής του @el
alternative label: راوٍ @ar
alternative label: ……的旁白者 @zh-hans
definition: Bir temsilciyi, bir eylemi, oluşumu veya başka bir etkinliği anlatan veya yüksek sesle okuyan bir temsilcinin katkısını içeren bir anlatımla ilişkilendirir. @tr
definition: Correla un agente a un'espressione che include un contributo da parte di un agente nella lettura ad alta voce o racconto di un fatto, avvenimento o altro evento. @it
definition: Hozzákapcsol egy ágenst egy kifejezési formához, amely magában foglalja egy ágens közreműködését egy cselekményről, történésről vagy más eseményről szóló beszámoló hangos felolvasásában. @hu
definition: Liittää toimijan ekspressioon, jonka tekemiseen toimija osallistuu lukemalla ääneen tai kertomalla toiminnasta, tapahtumasta, tapahtumien kulusta tms.
definition: Met un agent en relation avec une expression qui intègre une contribution de la part d’un agent consistant à lire à voix haute ou à rendre compte d’une action, d’une situation ou d’un autre événement. @fr
definition: Relaciona un agent amb una expressió que inclou una contribució d’un agent llegint en veu alta o explicant una acció, una situació o qualsevol altre esdeveniment. @ca
definition: Relateert een actor aan een expressie die omvat een bijdrage door een actor door hardop lezen of verslag geven van een daad, voorval of andere gebeurtenis. @nl
definition: Relaterer en agent til et udtryk, som omfatter en agents bidrag ved at læse højt eller berette om en handling, en hændelse, et begivenhedsforløb etc. @da

tarinankertoja (toimija) ekspressiossa
has element type: 2
instruction number: 18.5
toolkit definition: An expression that includes a contribution by an agent of relaying a story with dramatic or theatrical interpretation. @en
toolkit definition: Dramatik veya teatral bir yorumla bir hikayeyi aktaran bir temsilcinin katkısını içeren bir anlatım. @tr
toolkit definition: Een expressie die omvat een bijdrage door een actor die een uitvoerder is door het doorvertellen van een verhaal met dramatische of theatrale vertolking. @nl
toolkit definition: Egy kifejezési forma, amely magában foglalja egy ágens közreműködését egy történet dramatizált vagy színházi interpretációjában. @hu
toolkit definition: Eine Expression, zu der eine Ausführende/ein Ausführender (Akteur) beiträgt, indem sie/er eine Geschichte mit dramatischer oder theatralischer Interpretation wiedergibt. @de
toolkit definition: Ekspressio, jonka tekemiseen toimija osallistuu välittämällä tarinan draamallisella tai teatraalisella tulkinnalla.
toolkit definition: Espressione che include un contributo da parte di un agente in un'esibizione che riporta una storia originale con un'interpretazione drammatica o teatrale. @it
toolkit definition: Et uttrykk som inkluderer et bidrag fra en agent i form av å lese forfatterens originalhistorie med innlevelse eller dramatisk tolkning. @no
toolkit definition: Expression qui intègre une contribution de la part d’un agent consistant à raconter une histoire au moyen d’une interprétation dramatique ou théâtrale. @fr
toolkit definition: Expressió que inclou una contribució d’un agent explicant un conte original amb una interpretació dramàtica o teatral. @ca
toolkit definition: Izteiksme, kas ietver aģenta ieguldījumu, pasniedzot radītāja oriģinālo stāstu ar dramatisku vai teatrālu interpretāciju. @lv
toolkit definition: Udtryk, som omfatter bidrag af en agent, der er en performer, ved at give en oprindelig historie dramatisk eller teatralsk fortolkning. @da
toolkit definition: Väljendus, millesse tegija on andnud panuse, esitades originaallugu draama- või teatritõlgenduses. @et
toolkit definition: Μια έκφραση ενός έργου που ενσωματώνει τη συνεισφορά της διήγησης μιας πρωτότυπης ιστορίας ενός δημιουργού με θεατρική ερμηνεία. @el
toolkit definition: تعبيرة تتضمن إسهام وكيل بنقل قصة أصلية ووصفها بصورة درامية أو مسرحية. @ar
toolkit definition: 包括有用戏剧化解释转达故事的一个行为者的贡献的一种内容表达 @zh-hans
toolkit label: Akteur als Geschichtenerzählerin/Geschichtenerzähler von @de
toolkit label: agent conteur de @fr
toolkit label: agent rondallaire de @ca
toolkit label: agent, som er historiefortæller af @da
toolkit label: hikaye anlatıcı temsilci @tr
toolkit label: historieforteller av (agent) @no
toolkit label: ir stāstnieks (aģents) @lv
toolkit label: jutuvestja (tegija) väljenduses @et
toolkit label: storyteller agent of @en
toolkit label: storyteller agente di @it
toolkit label: tarinankertoja (toimija) ekspressiossa
toolkit label: történetmesélő ágense: @hu
toolkit label: verhalenverteller-actor van @nl
toolkit label: αφηγητής ιστοριών φορέας του @el
toolkit label: وكيل راوي قصص @ar
toolkit label: ……的说书人行为者 @zh-hans
has subproperty: tarinankertoja (henkilö) ekspressiossa
has subproperty: tarinankertoja (yhteistoimija) ekspressiossa
has subproperty: P50082
lexical alias: storytellerAgentOf.en
status: Published
type: Property
domain: C10002
label: er agent, som er historiefortæller af @da
label: er historieforteller av (agent) @no
label: est un agent conteur de @fr
label: hikaye anlatıcısı temsilcisidir. @tr
label: ir stāstnieks (aģents) @lv
label: is storyteller agent of @en
label: is verhalenverteller-actor van @nl
label: ist Akteur als Geschichtenerzählerin/Geschichtenerzähler von @de
label: jutuvestja (tegija) väljenduses @et
label: történetmesélő ágense a következőnek: @hu
label: è storyteller agente di @it
label: és agent rondallaire de @ca
label: είναι αφηγητής ιστοριών φορέας του @el
label: هو وكيل راوي قصص لـ @ar
label: 是……的说书人行为者 @zh-hans
sub property of: esittäjä (toimija) ekspressiossa
alternative label: Geschichtenerzählerin/Geschichtenerzähler von @de
alternative label: conteur de @fr
alternative label: cuentista de @es
alternative label: hikaye anlatıcı @tr
alternative label: historieforteller av @no
alternative label: jutuvestja väljenduses @et
alternative label: rondallaire de @ca
alternative label: storyteller af @da
alternative label: storyteller di @it
alternative label: storyteller of @en
alternative label: tarinankertoja ekspressiossa
alternative label: történetmesélője: @hu
alternative label: αφηγητής ιστοριών του @el
alternative label: راوي قصص @ar
alternative label: ……的说书人 @zh-hans
definition: Bir temsilciyi, bir hikayeyi dramatik veya teatral yorumla aktarmaya yönelik bir temsilcinin katkısını içeren bir anlatımla ilişkilendirir. @tr
definition: Correla un agente a un'espressione che include un contributo da parte di un agente in un'esibizione che riporta una storia originale con un'interpretazione drammatica o teatrale. @it
definition: Hozzákapcsol egy ágenst egy kifejezési formához, amely magában foglalja egy ágens közreműködését egy történet dramatizált vagy színházi interpretációjában. @hu
definition: Liittää toimijan ekspressioon, jonka tekemiseen toimija osallistuu välittämällä tarinan draamallisella tai teatraalisella tulkinnalla.
definition: Met un agent en relation avec une expression qui intègre une contribution de la part d’un agent consistant à raconter une histoire au moyen d’une interprétation dramatique ou théâtrale. @fr
definition: Relaciona un agent amb una expressió que inclou una contribució d’un agent explicant un conte original amb una interpretació dramàtica o teatral. @ca
definition: Relateert een actor aan een expressie die omvat een bijdrage door een actor die een uitvoerder is door het doorvertellen van een verhaal met dramatische of theatrale vertolking. @nl

puhuja (toimija) ekspressiossa
has element type: 2
instruction number: 18.5
toolkit definition: An expression that includes a contribution by an agent of speaking words, such as a lecture, speech, etc. @en
toolkit definition: Bir ders, konuşma vb… alanlarda konuşan bir temsilcinin katkısını içeren bir anlatım. @tr
toolkit definition: Een expressie die omvat een bijdrage door een actor van woorden spreken, zoals een lezing, speech etc. @nl
toolkit definition: Egy kifejezési forma, amely magában foglalja egy ágens élőszóbeli közreműködését, például előadásként, beszédként stb. @hu
toolkit definition: Eine Expression, zu der ein Akteur beiträgt, indem er Worte, wie zum Beispiel einen Vortrag, eine Rede oder ähnliches, spricht. @de
toolkit definition: Ekspressio, jonka tekemiseen toimija osallistuu puhumalla, kuten luennoimalla tai pitämällä puheen tms.
toolkit definition: Espressione che include un contributo da parte di un agente nell'esposizione di parole, come una conferenza, discorso, etc. @it
toolkit definition: Et uttrykk som inkluderer et bidrag fra en agent i form av å uttale ord, for eksempel en forelesning, tale, etc. @no
toolkit definition: Expression qui intègre une contribution de la part d’un agent consistant à énoncer des paroles, telles qu’un exposé, un discours, etc. @fr
toolkit definition: Expressió que inclou una contribució d’un agent pronunciant paraules, com ara una conferència, un discurs, etc. @ca
toolkit definition: Izteiksme, kas ietver aģenta ieguldījumu, uzstājoties, piemēram, ar lekciju, runu u.tml. @lv
toolkit definition: Udtryk, som omfatter en agents bidrag ved at fremføre ord, såsom en forelæsning, tale etc. @da
toolkit definition: Väljendus, millesse tegija on andnud panuse kõneldes, nt loengut või kõnet pidades. @et
toolkit definition: Μια έκφραση ενός έργου που ενσωματώνει τη συνεισφορά της ομιλίας, όπως διάλεξη, λόγος κ.λπ. @el
toolkit definition: تعبيرة تتضمن إسهام وكيل بالتحدث بكلمات، كما في محاضرة، أو خطبة، إلخ. @ar
toolkit definition: 包括有诸如讲座和演讲之类讲话的一个行为者的贡献的一种内容表达 @zh-hans
toolkit label: Akteur als Rednerin/Redner von @de
toolkit label: agent orador de @ca
toolkit label: agent orateur de @fr
toolkit label: agent, som er forelæser/taler @da
toolkit label: ir orators (aģents) @lv
toolkit label: konuşmacı temsilci @tr
toolkit label: kõneleja (tegija) väljenduses @et
toolkit label: oratore agente di @it
toolkit label: puhuja (toimija) ekspressiossa
toolkit label: speaker agent of @en
toolkit label: spreker-actor van @nl
toolkit label: taler for (agent) @no
toolkit label: élőszavas előadó ágense: @hu
toolkit label: ομιλητής φορέας του @el
toolkit label: وكيل متحدث لـ @ar
toolkit label: ……的演说者行为者 @zh-hans
has subproperty: puhuja (henkilö) ekspressiossa
has subproperty: puhuja (yhteistoimija) ekspressiossa
has subproperty: P50083
lexical alias: speakerAgentOf.en
status: Published
type: Property
domain: C10002
label: er agent, som er forelæser/taler af @da
label: er taler for (agent) @no
label: est un agent orateur de @fr
label: ir orators (aģents) @lv
label: is speaker agent of @en
label: is spreker-actor van @nl
label: ist Akteur als Rednerin/Redner von @de
label: konuşmacı temsilcisidir. @tr
label: kõneleja (tegija) väljenduses @et
label: è oratore agente di @it
label: élőszavas előadó ágense a következőnek: @hu
label: és agent orador de @ca
label: είναι ομιλητής φορέας του @el
label: هو وكيل متحدث لـ @ar
label: 是……的演说者行为者 @zh-hans
sub property of: esittäjä (toimija) ekspressiossa
alternative label: Redner von @de
alternative label: forelæser/taler af @da
alternative label: konuşmacı @tr
alternative label: kõneleja väljenduses @et
alternative label: orador de @ca
alternative label: orateur de @fr
alternative label: oratore di @it
alternative label: puhuja ekspressiossa
alternative label: speaker of @en
alternative label: taler for @no
alternative label: élőszavas előadója: @hu
alternative label: ομιλητής του @el
alternative label: متحدث @ar
alternative label: ……的演说者 @zh-hans
definition: Bir temsilciyi, ders, konuşma vb. gibi kelimeleri söyleyen temsilcinin katkısını içeren bir anlatımla ilişkilendirir. @tr
definition: Correla un agente a un'espressione che include un contributo da parte di un agente nell'esposizione di parole, come una conferenza, discorso, etc. @it
definition: Hozzákapcsol egy ágenst egy kifejezési formához, amely magában foglalja egy ágens élőszóbeli közreműködését, például előadásként, beszédként stb. @hu
definition: Liittää toimijan ekspressioon, jonka tekemiseen toimija osallistuu puhumalla, kuten luennoimalla tai pitämällä puheen tms.
definition: Met un agent en relation avec une expression qui intègre une contribution de la part d’un agent consistant à énoncer des paroles, telles qu’un exposé, un discours, etc. @fr
definition: Relaciona un agent amb una expressió que inclou una contribució d’un agent pronunciant paraules, com ara una conferència, un discurs, etc. @ca
definition: Relateert een actor aan een expressie die omvat een bijdrage door een actor van woorden spreken, zoals een lezing, speech etc. @nl
definition: Relaterer en agent til et udtryk, som omfatter en agents bidrag ved at fremføre ord, såsom en forelæsning, tale etc. @da

laulaja (toimija) ekspressiossa
has element type: 2
instruction number: 18.5
toolkit definition: An expression that includes a contribution by an agent who uses their voice, with or without instrumental accompaniment, to produce music. @en
toolkit definition: Een expressie die omvat een bijdrage door een actor die is een uitvoerder van stem, met of zonder instrumentale begeleiding, om muziek te produceren. @nl
toolkit definition: Eine Expression, zu der eine Ausführende/ein Ausführender (Akteur) beiträgt, indem sie/er durch ihre/seine Singstimme, mit oder ohne instrumentale Begleitung, Musik erzeugt. @de
toolkit definition: Ekspressio, jonka tekemiseen toimija, joka esiintyy lauluäänellä (soitinsäestyksellä tai ilman), osallistuu tuottaakseen musiikkia.
toolkit definition: Espressione che include un contributo da parte di un agente in un'esecuzione vocale, corredata o meno da accompagnamento strumentale, per produrre musica. @it
toolkit definition: Et uttrykk som inkluderer et bidrag fra en agent i form av at en sanger bruker stemmen sin, med eller uten akkompagnement fra instrumenter, til å lage musikk. @no
toolkit definition: Expression qui intègre une contribution de la part d’un agent qui utilise sa voix, avec ou sans accompagnement instrumental, pour produire de la musique. @fr
toolkit definition: Expressió que inclou una contribució d’un agent que usa la seva veu, amb acompanyament instrumental o sense, per produir música. @ca
toolkit definition: Izteiksme, kas ietver aģenta ieguldījumu, izmantojot balsi, ar vai bez instrumentāla pavadījuma, lai radītu mūziku. @lv
toolkit definition: Müzik üretmek için enstrüman eşliğinde veya enstrümansız olarak sesini kullanan bir temsilcinin katkısını içeren bir anlatım. @tr
toolkit definition: Udtryk, som omfatter et bidrag af en agent, der er en performer, der bruger sin stemme, med eller uden instrumentalledsagelse, til at skabe musik. @da
toolkit definition: Väljendus, millesse tegija on andnud panuse, kasutades muusika tegemiseks oma häält, kas instrumentaalsaatega või ilma. @et
toolkit definition: énekese: @hu
toolkit definition: Μια έκφραση ενός έργου που ενσωματώνει τη συνεισφορά της χρήσης της φωνής του/της/των, με ή χωρίς συνοδεία μουσικών οργάνων για την παραγωγή μουσικής. @el
toolkit definition: تعبيرة تتضمن إسهام وكيل بأداء صوتي، بمصاحبة أو دون مصاحبة آلة موسيقية، لإنتاج أغنية. @ar
toolkit definition: 包括有用其人声（不管是否有乐器伴奏）产生音乐的一个行为者的贡献的一种内容表达 @zh-hans
toolkit label: Akteur als Sängerin/Sänger von @de
toolkit label: Egy kifejezési forma, amely magában foglalja egy ágens közreműködését zenei produktum hanggal történő előadásában hangszeres kísérettel vagy anélkül. @hu
toolkit label: agent cantant de @ca
toolkit label: agent chanteur de @fr
toolkit label: agent, som er sanger af @da
toolkit label: cantante agente di @it
toolkit label: ir dziedātājs (aģents) @lv
toolkit label: laulaja (toimija) ekspressiossa
toolkit label: laulja (tegija) väljenduses @et
toolkit label: sanger av (agent) @no
toolkit label: singer agent of @en
toolkit label: zanger-actor van @nl
toolkit label: şarkıcı temsilci @tr
toolkit label: τραγουδιστής φορέας του @el
toolkit label: وكيل مغنّ لـ @ar
toolkit label: ……的演唱者行为者 @zh-hans
has subproperty: laulaja (henkilö) ekspressiossa
has subproperty: laulaja (yhteistoimija) ekspressiossa
has subproperty: P50084
lexical alias: singerAgentOf.en
status: Published
type: Property
domain: C10002
label: er agent, som er sanger af @da
label: er sanger av (agent) @no
label: est un agent chanteur de @fr
label: ir dziedātājs (aģents) @lv
label: is singer agent of @en
label: is zanger-actor van @nl
label: ist Akteur als Sängerin/Sänger von @de
label: laulja (tegija) väljenduses @et
label: è cantante agente di @it
label: énekes ágense a következőnek: @hu
label: és agent cantant de @ca
label: şarkıcı temsilcisidir. @tr
label: είναι τραγουδιστής φορέας του @el
label: هو وكيل مغنِ @ar
label: 是……的演唱者行为者 @zh-hans
sub property of: esittäjä (toimija) ekspressiossa
alternative label: Egy énekes előadása tartalmazhat vagy nem tartalmazhat tényleges szavakat. @hu
alternative label: Sängerin/Sänger von @de
alternative label: cantant de @ca
alternative label: cantante de @es
alternative label: cantante di @it
alternative label: chanteur de @fr
alternative label: laulaja ekspressiossa
alternative label: laulja väljenduses @et
alternative label: sanger af @da
alternative label: sanger av @no
alternative label: singer of @en
alternative label: şarkıcısı @tr
alternative label: τραγουδιστής του @el
alternative label: مغنّ لـ @ar
alternative label: ……的演唱者 @zh-hans
definition: Bir temsilciyi, müzik üretmek için enstrüman eşliğinde veya eşliksiz bir ses sanatçısı olan bir temsilcinin katkısını içeren bir anlatımla ilişkilendirir. @tr
definition: Correla un agente a un'espressione che include un contributo da parte di un agente in un'esecuzione vocale, corredata o meno da accompagnamento strumentale, per produrre musica. @it
definition: Hozzákapcsol egy ágenst egy kifejezési formához, amely magában foglalja egy ágens közreműködését zenei produktum hanggal történő előadásában hangszeres kísérettel vagy anélkül. @hu
definition: Liittää toimijan ekspressioon, jonka tekemiseen toimija, joka esiintyy lauluäänellä (soitinsäestyksellä tai ilman), osallistuu tuottaakseen musiikkia.
definition: Met un agent en relation avec une expression qui intègre une contribution de la part d’un agent qui utilise sa voix, avec ou sans accompagnement instrumental, pour produire de la musique. @fr
definition: Relaciona un agent amb una expressió que inclou una contribució d’un agent que usa la seva veu, amb acompanyament instrumental o sense, per produir música. @ca
definition: Relateert een actor aan een expressie die omvat een bijdrage door een actor die is een uitvoerder van stem, met of zonder instrumentale begeleiding, om muziek te produceren. @nl

henkilö muutoksenhakijan vastapuolena teoksessa
has element type: 2
instruction number: 18.5
toolkit definition: A work that is a legal work of a higher court that records a decision of a lower court that appeals against a person. @en
toolkit definition: Augstākās tiesas sprieduma ieraksts par zemākas instances tiesas lēmumu, kas ir apelācija pret personu. @lv
toolkit definition: Bir alt mahkemenin bir kişiye karşı temyiz ettiği kararını kaydeden yüksek mahkemeye ait hukuki bir çalışma. @tr
toolkit definition: Een juridisch werk van een hoger gerechtshof dat een oordeel vastlegt van een lager gerechtshof waarbij in beroep gegaan wordt tegen een persoon. @nl
toolkit definition: Ein juristisches Werk einer höheren Instanz, das ein Gerichtsurteil festhält, bei dem gegen eine Person Rechtsmittel gegen ein Gerichtsurteil einer unteren Instanz eingelegt werden. @de
toolkit definition: Et juridisk verk fra en høyere rettsinstans som registrerer en avgjørelse fra en lavere rettsinstans som anker mot en person. @no
toolkit definition: Felsőbb bíróság jogi műve, amely rögzíti egy alsóbb bíróság egy személy ellenében fellebbező ítéletét. @hu
toolkit definition: Juridinen teos, jolla haetaan muutosta alemman oikeusasteen päätökseen ja joka kohdistuu henkilöön.
toolkit definition: Juridisk værk fra en højere retsinstans, som registrerer en lavere retsinstans dom, som appellerer imod en person. @da
toolkit definition: Kõrgema astme kohtu juriidiline teos, milles on dokumenteeritud alama astme kohtu otsus, mille peale on isiku vastu esitatud apellatsioon. @et
toolkit definition: Obra que és una obra jurídica d’un tribunal superior que enregistra una decisió d’un tribunal inferior que apel·la contra una persona. @ca
toolkit definition: Opera legale di un tribunale superiore che registra una decisione di un tribunale inferiore che fa ricorso contro una persona. @it
toolkit definition: Œuvre juridique d’un tribunal supérieur qui enregistre une décision d’un tribunal inférieur portant un appel contre une personne. @fr
toolkit definition: Ένα νομικό έργο που καταχωρίστηκε στα πρακτικά ενός ανώτερου δικαστηρίου, που ασκεί έφεση εναντίον απόφασης κατώτερου δικαστηρίου, για φυσικό πρόσωπο. @el
toolkit definition: عمل قضائي لمحكمة أعلى درجة تسجل قرار محكمة أدنى درجة تستأنف ضد شخص. @ar
toolkit definition: 一种记录下级法院起诉一个个人的决定的上级法院的法律作品 @zh-hans
toolkit label: Person als Berufungsbeklagte/Berufungsbeklagter/Revisionsbeklagte/Revisionsbeklagter von @de
toolkit label: appellato persona di @it
toolkit label: appellee - person for @no
toolkit label: appellee person of @en
toolkit label: fellebbezési alperes személye: @hu
toolkit label: gedaagde-persoon van @nl
toolkit label: henkilö muutoksenhakijan vastapuolena teoksessa
toolkit label: ir apsūdzētais (persona) @lv
toolkit label: person, som er indstævnte af @da
toolkit label: persona apel·lada de @ca
toolkit label: personne intimée de @fr
toolkit label: temyiz edilen kişi @tr
toolkit label: vastustaja (isik) teoses @et
toolkit label: εφεσίβλητο/αναιρεσίβλητο φυσικό πρόσωπο του @el
toolkit label: شخص مستأنف ضده @ar
toolkit label: ……的被上诉者个人 @zh-hans
has subproperty: P50085
lexical alias: appelleePersonOf.en
status: Published
type: Property
domain: C10004
label: er appellee - person for @no
label: er person, som er indstævnte af @da
label: est une personne intimée de @fr
label: fellebezési alperes személye a következőnek: @hu
label: ir apsūdzētais (persona) @lv
label: is appellee person of @en
label: is gedaagde-persoon van @nl
label: ist Person als Berufungsbeklagte/Berufungsbeklagter/Revisionsbeklagte/Revisionsbeklagter von @de
label: temyiz edilen kişisidir @tr
label: vastustaja (isik) teoses @et
label: è appellato persona di @it
label: és persona apel·lada de @ca
label: είναι εφεσίβλητο/αναιρεσίβλητο φυσικό πρόσωπο του @el
label: هو شخص مستأنف ضده لـ @ar
label: 是……的被上诉者个人 @zh-hans
sub property of: teoksen tekijä (henkilö) teoksessa
alternative label: henkilöön kohdistuva muutoshakemus
definition: Bir kişiyi, bir kişi aleyhine temyize giden bir alt mahkemenin kararını kaydeden bir üst mahkemenin yasal çalışması olan bir eserle ilişkilendirir. @tr
definition: Correla una persona a un opera legale di un tribunale superiore che registra una decisione di un tribunale inferiore che fa ricorso contro una persona. @it
definition: Hozzákapcsol egy személyt egy felsőbb bíróság jogi művéhez, amely rögzíti egy alsóbb bíróság egy személy ellenében fellebbező ítéletét. @hu
definition: Liittää henkilön juridiseen teokseen, jolla haetaan muutosta alemman oikeusasteen päätökseen ja joka kohdistuu henkilöön.
definition: Met une personne en relation avec une œuvre juridique d’un tribunal supérieur qui enregistre une décision d’un tribunal inférieur portant un appel contre une personne. @fr
definition: Relaciona una persona amb una obra que és una obra jurídica d’un tribunal superior que enregistra una decisió d’un tribunal inferior que apel·la contra una persona. @ca
definition: Relateert een persoon aan een juridisch werk van een hoger gerechtshof dat een oordeel vastlegt van een lager gerechtshof waarbij in beroep gegaan wordt tegen een persoon. @nl
definition: Relaterer en person til et juridisk verk fra en høyere rettsinstans som registrerer en avgjørelse fra en lavere rettsinstans som anker mot en person. @no
definition: Relaterer en person til et juridisk værk fra en højere retsinstans, som registrerer en lavere retsinstans dom, som appellerer imod en person. @da
definition: Relates a person to a work that is a legal work of a higher court that records a decision of a lower court that appeals against a person. @en
definition: Sasaista personu ar augstākās tiesas sprieduma ierakstu par zemākas instances tiesas lēmumu, kas ir apelācija pret personu. @lv
definition: Seostab isiku kõrgema astme kohtu juriidilise teosega, milles on dokumenteeritud alama astme kohtu otsus, mille peale on isiku vastu esitatud apellatsioon. @et
definition: Setzt eine Person in Beziehung zu einem juristischen Werk einer höheren Instanz, das ein Gerichtsurteil festhält, bei dem gegen eine Person Rechtsmittel gegen ein Gerichtsurteil einer unteren Instanz eingelegt werden. @de
definition: Συνδέει ένα φυσικό πρόσωπο, που ασκεί έφεση εναντίον μιας απόφασης κατώτερου δικαστηρίου για μεταβίβαση της υπόθεσης σε ανώτερο δικαστήριο, με ένα έργο. @el
definition: يربط شخصا بعمل قضائي لمحكمة أعلى درجة تسجل قرار محكمة أدنى درجة تستأنف ضد شخص. @ar
definition: 将一个个人与一种记录下级法院起诉一个个人的决定的上级法院的法律作品关联起来。 @zh-hans

meedio teoksessa
has element type: 2
instruction number: 18.5
toolkit definition: A work that involves a responsibility for claiming a communication with a world of spirits. @en
toolkit definition: Darbs, kas ietver personas atbildību, apgalvojot par saziņu ar garu pasauli. @lv
toolkit definition: Een werk dat met zich meebrengt een verantwoordelijkheid voor het beweren een communicatiekanaal te zijn voor een wereld van geesten. @nl
toolkit definition: Egy mű, amely magában foglalja a szellemek világával folytatott kommunikáció állításának felelősségét. @hu
toolkit definition: Ein Werk, das für sich in Anspruch nimmt, als Kommunikationskanal zwischen der irdischen Welt und einer Geisterwelt zu dienen. @de
toolkit definition: Et verk som involverer et ansvar for en påstått kommunikasjon med en åndeverden. @no
toolkit definition: Obra que implica una responsabilitat d’atribució d’una comunicació amb un món d’esperits. @ca
toolkit definition: Opera che implica la responsabilità di sostenere una comunicazione con il mondo degli spiriti. @it
toolkit definition: Ruhlar dünyasıyla iletişim kurma sorumluluğunu içeren bir eser. @tr
toolkit definition: Teos, johon sisältyy väite kommunikaatiosta henkimaailman kanssa
toolkit definition: Teos, mis sisaldab vastutust väidetava suhtluse eest vaimude maailmaga. @et
toolkit definition: Værk, som involverer et ansvar for at hævde kommunikation med en åndeverden. @da
toolkit definition: Œuvre qui comporte une responsabilité consistant à prétendre être un canal de communication avec un monde d’esprits. @fr
toolkit definition: Ένα έργο που περιλαμβάνει την ευθύνη για την επικοινωνία μεταξύ του γήινου κόσμου και του κόσμου των πνευμάτων. @el
toolkit definition: عمل يترتب عليه تحمل مسئولية الادعاء بالتواصل مع عالم الأرواح. @ar
toolkit definition: 涉及声称与精神世界交流的责任的作品 @zh-hans
toolkit label: Channel von @de
toolkit label: ir medijs @lv
toolkit label: medie af @da
toolkit label: medium di @it
toolkit label: medium for @no
toolkit label: medium of @en
toolkit label: medium van @nl
toolkit label: medyum @tr
toolkit label: meedio teoksessa
toolkit label: meedium teoses @et
toolkit label: mèdium de @ca
toolkit label: médium de @fr
toolkit label: médiuma: @hu
toolkit label: μέσο του @el
toolkit label: وسيط روحاني لـ @ar
toolkit label: ……的通灵者 @zh-hans
has subproperty: P50086
lexical alias: mediumOf.en
status: Published
type: Property
domain: C10004
label: er medie af @da
label: er medium for @no
label: est un médium de @fr
label: ir medijs @lv
label: is medium of @en
label: is medium van @nl
label: ist Channel von @de
label: medyumudur @tr
label: meedium teoses @et
label: médiuma a következőnek: @hu
label: è medium di @it
label: és mèdium de @ca
label: είναι μέσο του @el
label: هو وسيط روحاني لـ @ar
label: 是……的通灵者 @zh-hans
sub property of: teoksen tekijä (henkilö) teoksessa
definition: Bir kişiyi, ruhlar dünyasıyla iletişim kurma sorumluluğunu içeren bir eserle ilişkilendirir. @tr
definition: Correla una persona a un'opera che implica una responsabilità di sostenere una comunicazione con il mondo degli spiriti. @it
definition: Hozzákapcsol egy személyt egy műhöz, amely magában foglalja a szellemek világával folytatott kommunikáció állításának felelősségét. @hu
definition: Liittää henkilön teokseen, johon sisältyy väite kommunikaatiosta henkimaailman kanssa.
definition: Met une personne en relation avec une œuvre qui comporte une responsabilité consistant à prétendre être un canal de communication avec un monde d’esprits. @fr
definition: Relaciona una persona amb una obra que implica una responsabilitat d’atribució d’una comunicació amb un món d’esperits. @ca
definition: Relateert een persoon aan een werk dat met zich meebrengt een verantwoordelijkheid voor het beweren een communicatiekanaal te zijn voor een wereld van geesten. @nl
definition: Relaterer en person til et verk som involverer et ansvar for en påstått kommunikasjon med en åndeverden. @no
definition: Relaterer en person til et værk, som involverer et ansvar for at hævde kommunikation med en åndeverden. @da
definition: Relates a person to a work that involves a responsibility for claiming a communication with a world of spirits. @en
definition: Sasaista personu ar darbu, kas ietver personas atbildību, apgalvojot par saziņu ar garu pasauli. @lv
definition: Seostab isiku teosega, mis sisaldab vastutust väidetava suhtluse eest vaimude maailmaga. @et
definition: Setzt eine Person in Beziehung zu einem Werk, das für sich in Anspruch nimmt, als Kommunikationskanal zwischen der irdischen Welt und einer Geisterwelt zu dienen. @de
definition: Συνδέει ένα φυσικό πρόσωπο, το οποίο χρησιμοποιείται ως ενδιάμεσο κανάλι επικοινωνίας μεταξύ του γήινου κόσμου και του κόσμου των πνευμάτων, με ένα έργο. @el
definition: يربط شخصا بعمل يترتب عليه تحمل مسئولية الادعاء بالتواصل مع عالم الأرواح. @ar
definition: 将一个个人与涉及声称与精神世界交流的责任的作品关联起来。 @zh-hans

kohdistettu muutoshakemus
instruction number: 18.5
toolkit definition: Ein juristisches Werk einer höheren Instanz, bei dem gegen eine Person oder gegen eine Körperschaft Rechtsmittel gegen ein Gerichtsurteil der unteren Instanz eingelegt werden. @de
toolkit definition: Et juridisk verk fra en høyere rettsinstans som registrerer en avgjørelse fra en lavere rettsinstans som anker mot en person eller korporasjon. @no
toolkit definition: Hakemus, jolla haetaan muutosta alemman oikeusasteen päätökseen ja joka kohdistuu henkilöön tai sukuun.
toolkit definition: Juridisk værk fra en højere retsinstans, der registrerer en beslutning fra en underret, der har gjort indsigelse mod en person eller korporation. @da
toolkit definition: Obra jurídica d’un tribunal superior perquè esmeni una sentència d’un tribunal inferior que apel·la contra una persona o entitat corporativa. @ca
toolkit definition: Œuvre juridique d’un tribunal supérieur qui enregistre une décision d’un tribunal inférieur portant un appel contre une personne ou une collectivité. @fr
toolkit definition: Ένα νομικό έργο για το οποίο ασκεί έφεση εναντίον απόφασης κατώτερου δικαστηρίου, που καταχωρίστηκε στα πρακτικά ενός ανωτέρου δικαστηρίου, ένα φυσικό πρόσωπο ή συλλογικό όργανο. @el
toolkit label: Berufungsbeklagter/Revisionsbeklagter von @de
toolkit label: apel·lat de @ca
toolkit label: appellee for @no
toolkit label: indstævnet af @da
toolkit label: intimé de @fr
toolkit label: kohdistettu muutoshakemus
toolkit label: εφεσίβλητος/αναιρεσίβλητος του @el
lexical alias: appelleeOf.en
status: Deprecated
type: Property
label: er indstævnet af @da
label: est un intimé de @fr
label: ist Berufungsbeklagter/Revisionsbeklagter von @de
label: és apel·at de @ca
label: είναι εφεσίβλητος/αναιρεσίβλητος του @el
sub property of: muuna toimijana teoksessa
definition: Liittää henkilön tai yhteisön hakemukseen, jolla haetaan muutosta alemman oikeusasteen päätökseen ja joka kohdistuu henkilöön tai sukuun
definition: Met une personne ou collectivité contre laquelle a été formé un appel d’une décision d’un tribunal inférieur enregistrée dans une œuvre juridique d’un tribunal supérieur en relation avec une œuvre. @fr
definition: Relaciona una persona o entitat corporativa, contra la qual es recorre en un tribunal superior perquè esmeni la sentència d’un tribunal inferior, amb una obra. @ca
definition: Relaterer en person eller korporation mod hvem der er gjort indsigelse over en underrets beslutning, der er registreret i et juridisk værk fra en højere retsinstans til et værk. @da
definition: Setzt eine Person oder eine Körperschaft, gegen die Rechtsmittel (Berufung/Revision) gegen ein Gerichtsurteil einer unteren Instanz, das in einem juristischen Werk einer höheren Instanz erfasst ist, eingelegt werden, mit einem Werk in Beziehung. @de
definition: Συνδέει ένα φυσικό πρόσωπο ή συλλογικό όργανο που ασκεί έφεση εναντίον απόφασης κατώτερου δικαστηρίου, που καταχωρίστηκε στα πρακτικά ενός ανωτέρου δικαστηρίου, με ένα έργο. @el

muutoshakemus
instruction number: 18.5
toolkit definition: Ein juristisches Werk einer höheren Instanz, bei der eine Person oder eine Körperschaft gegen ein Gerichtsurteil einer unteren Instanz, das in einem juristischen Werk einer höheren Instanz erfasst ist, Rechtsmittel (Berufung/Revision) einlegt. @de
toolkit definition: Et juridisk verk fra en høyere rettsinstans som registrerer en avgjørelse fra en lavere rettsinstans som ankes av en person eller korporasjon. @no
toolkit definition: Hakemus, jolla henkilö tai yhteisö hakee muutosta alemman oikeusasteen päätökseen.
toolkit definition: Juridisk værk fra en højere retsinstans, der har registreret en beslutning fra en underret, der bliver appelleret af en person eller korporation. @da
toolkit definition: Obra jurídica d’un tribunal superior perquè esmeni una sentència d’un tribunal inferior apel·lada per una persona o entitat corporativa. @ca
toolkit definition: Œuvre juridique d’un tribunal supérieur qui enregistre une décision d’un tribunal inférieur portée en appel par une personne ou une collectivité. @fr
toolkit definition: Ένα έργο που καταχωρίστηκε στα πρακτικά ενός ανωτέρου δικαστηρίου,για το οποίο ασκείται έφεση εναντίον απόφασης κατώτερου δικαστηρίου από φυσικό πρόσωπο ή συλλογικό όργανο. @el
toolkit label: Berufungskläger/Revisionskläger von @de
toolkit label: apel·lant de @ca
toolkit label: appelant de @fr
toolkit label: appellant af @da
toolkit label: appellant for @no
toolkit label: muutoshakemus
toolkit label: εκκαλών/αναιρεσείων του @el
lexical alias: appellantOf.en
status: Deprecated
type: Property
label: er appellant af @da
label: est un appelant de @fr
label: ist Berufungskläger/Revisionskläger von @de
label: és apel·lant de @ca
label: είναι εκκαλών/αναιρεσείων του @el
sub property of: muuna toimijana teoksessa
definition: Liittää henkilön tai yhteisön hakemukseen, jolla henkilö tai yhteisö hakee muutosta alemman oikeusasteen päätökseen.
definition: Met une personne ou collectivité qui en appelle d’une décision d’un tribunal inférieur enregistrée dans une œuvre juridique d’un tribunal supérieur en relation avec une œuvre. @fr
definition: Relaciona una persona o entitat corporativa, que recorre a un tribunal superior perquè esmeni la sentència d’un tribunal inferior, amb una obra. @ca
definition: Relaterer en person eller korporation, der appelerer en underrets beslutning, der er registrereret i et juridisk værk fra en højerere retsinstans til et værk. @da
definition: Setzt eine Person oder eine Körperschaft, die gegen ein Gerichtsurteil einer unteren Instanz, das in einem juristischen Werk einer höheren Instanz erfasst ist, Rechtsmittel (Berufung/Revision) einlegt, mit einem Werk in Beziehung. @de
definition: Συνδέει ένα φυσικό πρόσωπο ή συλλογικό όργανο, που ασκεί έφεση εναντίον απόφασης κατώτερου δικαστηρίου, που καταχωρίστηκε στα πρακτικά ενός ανωτέρου δικαστηρίου, με ένα έργο. @el

annettu haaste
instruction number: 18.5
toolkit definition: Ein Werk, bei der eine Person oder eine Körperschaft eine Klage in ein Zivilverfahren einbringt. @de
toolkit definition: Et verk som involverer ansvar for å være en person eller korporasjon som er saksøker i en sivilrettslig sak. @no
toolkit definition: Obra que involucra una responsabilitat d’interposar una demanda civil per una persona o entitat corporativa. @ca
toolkit definition: Teos, joka sisältää tapauksen tuomisen siviilioikeudelliseen käsittelyyn henkilön tai yhteisön toimesta.
toolkit definition: Værk der involverer et ansvar for at anlægge en civil sag af en person eller korporation. @da
toolkit definition: Œuvre qui comporte une responsabilité consistant à être une personne ou une collectivité qui intente une poursuite civile. @fr
toolkit definition: Ένα έργο που περιλαμβάνει την ευθύνη για την άσκηση αγωγής στο πλαίσιο αστικής διαδικασίας από ένα φυσικό πρόσωπο ή συλλογικό όργανο. @el
toolkit label: Zivilkläger von @de
toolkit label: demandant de @ca
toolkit label: demandeur de @fr
toolkit label: kanne
toolkit label: sagsøger af @da
toolkit label: saksøker for @no
toolkit label: ενάγων του @el
lexical alias: plaintiffOf.en
status: Deprecated
type: Property
label: er sagsøger af @da
label: est un demandeur de @fr
label: ist Zivilkläger von @de
label: és demandant de @ca
label: είναι ενάγων του @el
sub property of: muuna toimijana teoksessa
definition: Liittää henkilön tai yhteisön teokseen, joka sisältää tapauksen tuomisen siviilioikeudelliseen käsittelyyn henkilön tai yhteisön toimesta.
definition: Met une personne ou collectivité qui intente une poursuite civile en relation avec une œuvre. @fr
definition: Relaciona una persona o entitat corporativa, que interposa una demanda civil, amb una obra. @ca
definition: Relaterer en person eller korporation der anlægger en civil sag til et værk. @da
definition: Setzt eine Person oder eine Körperschaft, die eine Klage in ein Zivilverfahren einbringt, mit einem Werk in Beziehung. @de
definition: Συνδέει ένα φυσικό πρόσωπο ή συλλογικό όργανο, που ασκεί αγωγή στο πλαίσιο αστικής διαδικασίας, με ένα έργο. @el

saatu haaste
instruction number: 18.5
toolkit definition: Ein Werk, bei dem eine Person oder eine Körperschaft in einem Strafverfahren angeklagt oder in einem Zivilprozess verklagt ist. @de
toolkit definition: Et verk som involverer et ansvar for å være en person eller korporasjon som er tiltalt i en straffesak eller saksøkt i en sivilrettslig sak. @no
toolkit definition: Obra que involucra una responsabilitat de ser una persona o entitat corporativa acusada en un procés penal o demandada en un procés civil. @ca
toolkit definition: Teos, joka sisältää henkilöön tai yhteisöön kohdistuvan syytteen rikosoikeudenkäynnissä tai haasteen siviilioikeudenkäynnissä.
toolkit definition: Værk der involverer et ansvar for at være en person eller korporation anklaget i en straffesag eller sagsøgt i en civil sag. @da
toolkit definition: Œuvre qui comporte une responsabilité consistant à être une personne ou une collectivité accusée dans une poursuite criminelle ou contre laquelle une poursuite civile est intentée. @fr
toolkit definition: Ένα έργο που περιλαμβάνει την ευθύνη ενός φυσικού προσώπου ή συλλογικού οργάνου, το οποίο έχει κατηγορηθεί σε μία ποινική διαδικασία ή έχει ασκηθεί αγωγή εναντίον του στο πλαίσιο αστικής διαδικασίας. @el
toolkit label: Angeklagter/Beklagter von @de
toolkit label: acusat de @ca
toolkit label: défendeur de @fr
toolkit label: kohteena kanteessa
toolkit label: sagsøgt af @da
toolkit label: saksøkte for @no
toolkit label: εναγόμενος του @el
lexical alias: defendantOf.en
status: Deprecated
type: Property
label: er sagsøgt af @da
label: est un défendeur de @fr
label: ist Angeklagter/Beklagter von @de
label: és acusat de @ca
label: είναι εναγόμενος του @el
sub property of: muuna toimijana teoksessa
definition: Liittää henkilön tai yhteisön teokseen, joka sisältää henkilöön tai yhteisöön kohdistuvan syytteen rikosoikeudenkäynnissä tai haasteen siviilioikeudenkäynnissä.
definition: Met une personne ou collectivité qui est accusée dans une poursuite criminelle ou contre laquelle une poursuite civile est intentée en relation avec une œuvre. @fr
definition: Relaciona una persona o entitat corporativa, que és acusada en un procés penal o demandada en un procés civil, amb una obra. @ca
definition: Relaterer en person eller korporation der er anklaget i en straffesag eller sagsøgt i en civil sag til et værk. @da
definition: Setzt eine Person oder eine Körperschaft, die in einem Strafverfahren angeklagt oder in einem Zivilprozess verklagt ist, mit einem Werk in Beziehung. @de
definition: Συνδέει ένα φυσικό πρόσωπο ή συλλογικό όργανο, το οποίο έχει κατηγορηθεί σε μία ποινική διαδικασία ή έχει ασκηθεί αγωγή εναντίον του στο πλαίσιο αστικής διαδικασίας, με ένα έργο. @el

opinnäytteen ohjaaja teoksessa
has element type: 2
instruction number: 18.5
toolkit definition: A work that involves a responsibility as an academic supervisor of thesis or dissertation research for an academic degree that results in a work. @en
toolkit definition: Bir çalışmayla sonuçlanan akademik bir derece için tez araştırmasının akademik danışmanı olarak sorumluluk içeren bir çalışma. @tr
toolkit definition: Darbs, kas ietver personas atbildību, esot par akadēmisko vadītāju promocijas darba pētījumam, kura rezultātā radīts darbs. @lv
toolkit definition: Een werk dat met zich meebrengt een verantwoordelijkheid als een academische begeleider van scriptie- of proefschriftonderzoek voor een academische graad dat resulteert in een werk. @nl
toolkit definition: Egy mű, amely magában foglalja egy tudományos fokozattal kapcsolatos szakdolgozat vagy egy disszertációs kutatás tudományos témavezetőjének a felelősségét, amely egy művet eredményez. @hu
toolkit definition: Ein Werk, bei dem eine akademische Betreuerin/ein akademischer Betreuer für die Beratung und Aufsicht von Forschungstätigkeiten im Rahmen einer Hochschularbeit verantwortlich ist, die zur Erlangung eines akademischen Grads und zu einem Werk führen. @de
toolkit definition: Et verk som involverer ansvar som en akademisk veileder for avhandlinger eller masteroppgaver for en akademisk grad som resulterer i et verk. @no
toolkit definition: Obra que implica una responsabilitat com a supervisor acadèmic d’una tesi o una dissertació d’una recerca per a l’obtenció d’un grau acadèmic que dona com a resultat una obra. @ca
toolkit definition: Opera che implica una responsabilità come supervisore accademico di una tesi o dissertazione di ricerca per una titolo accademico che si concretizza in un'opera. @it
toolkit definition: Teos, joka sisältää vastuun akateemisten opinnäytteen tai väitöskirjan ohjaamisesta.
toolkit definition: Teos, mis sisaldab akadeemilise juhendaja vastutust akadeemilise kraadi saamiseks tehtava ja teoses väljenduva uurimistöö eest. @et
toolkit definition: Værk, som involverer et ansvar som akademisk vejleder for forskning til en akademisk grads afhandling eller speciale, som resulterer i et værk. @da
toolkit definition: Œuvre qui comporte une responsabilité en tant que superviseur académique de travaux de thèse ou de mémoire menant à l’obtention d’un grade universitaire et entraînant la création d’une œuvre. @fr
toolkit definition: Ένα έργο που περιλαμβάνει την ευθύνη για την επίβλεψη μιας διατριβής ή διδακτορικής έρευνας για την απόκτηση είτε ενός ανώτερου εκπαιδευτικού επιπέδου πτυχίου είτε διδακτορικού. @el
toolkit definition: عمل يترتب عليه مسئولية مشرف أكاديمي على أطروحة أو بحث أكاديمي للحصول على درجة أكاديميةينشأ عنها عمل. @ar
toolkit definition: 涉及作为学位论文学术主管导致一种作品的责任的作品 @zh-hans
toolkit label: Betreuerin/Betreuer einer Hochschulschrift von @de
toolkit label: correlatore di @it
toolkit label: degree supervisor of @en
toolkit label: fokozat témavezetője: @hu
toolkit label: graad-begeleider van @nl
toolkit label: hovedvejleder af @da
toolkit label: ir promocijas darba vadītājs @lv
toolkit label: opinnäytteen ohjaaja teoksessa
toolkit label: superviseur de thèse de @fr
toolkit label: supervisor de grau acadèmic de @ca
toolkit label: tez danışmanı @tr
toolkit label: veileder for @no
toolkit label: väitekirja juhendaja teoses @et
toolkit label: επόπτης καθηγητής του @el
toolkit label: مشرف على درجة أكاديمية @ar
toolkit label: ……的学位导师 @zh-hans
has subproperty: P50091
lexical alias: degreeSupervisorOf.en
status: Published
type: Property
domain: C10004
label: er hovedvejleder af @da
label: er veileder for @no
label: est un superviseur de thèse de @fr
label: fokozat témavezetője a következőnek: @hu
label: ir promocijas darba vadītājs @lv
label: is degree supervisor of @en
label: is graad-begeleider van @nl
label: ist Betreuerin/Betreuer einer Hochschulschrift von @de
label: tez danışmanıdır @tr
label: väitekirja juhendaja teoses @et
label: è relatore di @it
label: és supervisor de grau acadèmic de @ca
label: είναι επόπτης καθηγητής του @el
label: هو مشرف على درجة أكاديمية لـ @ar
label: 是……的学位导师 @zh-hans
sub property of: akateeminen ohjaaja teoksessa
definition: Bir kişiyi, bir eserle sonuçlanan akademik bir derece için tez veya tez araştırmasının akademik danışmanı olarak sorumluluk içeren eserle ilişkilendirir. @tr
definition: Correla una persona a un'opera che implica una responsabilità come supervisore accademico di una tesi o dissertazione di ricerca per una titolo accademico che si concretizza in un'opera. @it
definition: Hozzákapcsol egy személyt egy műhöz, amely magában foglalja egy tudományos fokozattal kapcsolatos szakdolgozat vagy egy disszertációs kutatás tudományos témavezetőjének a felelősségét, amely egy művet eredményez. @hu
definition: Liittää henkilön teokseen, joka sisältää vastuun akateemisen opinnäytteen tai väitöskirjan ohjaamisesta.
definition: Met une personne en relation avec une œuvre qui comporte une responsabilité en tant que superviseur académique de travaux de thèse ou de mémoire menant à l’obtention d’un grade universitaire et entraînant la création d’une œuvre. @fr
definition: Relaciona una persona amb una obra que implica una responsabilitat com a supervisor acadèmic d’una tesi o una dissertació d’una recerca per a l’obtenció d’un grau acadèmic que dona com a resultat una obra. @ca
definition: Relateert een persoon aan een werk dat met zich meebrengt een verantwoordelijkheid als een academische begeleider van scriptie- of proefschriftonderzoek voor een academische graad dat resulteert in een werk. @nl
definition: Relaterer en person til et verk som involverer ansvar som en akademisk veileder for avhandlinger eller masteroppgaver for en akademisk grad som resulterer i et verk. @no
definition: Relaterer en person til et værk, som involverer et ansvar som en akademisk vejleder for forskning til en akademisk grads afhandling eller speciale, som resulterer i et værk. @da
definition: Relates a person to a work that involves a responsibility as an academic supervisor of thesis or dissertation research for an academic degree that results in a work. @en
definition: Sasaista personu ar darbu, kas ietver personas atbildību, esot par akadēmisko vadītāju promocijas darba pētījumam, kura rezultātā radīts darbs. @lv
definition: Seostab isiku teosega, mis sisaldab akadeemilise juhendaja vastutust akadeemilise kraadi saamiseks tehtava ja teoses väljenduva uurimistöö eest. @et
definition: Setzt eine Person in Beziehung zu einem Werk, bei dem eine akademische Betreuerin/ein akademischer Betreuer für die Beratung und Aufsicht von Forschungstätigkeiten im Rahmen einer Hochschularbeit verantwortlich ist, die zur Erlangung eines akademischen Grads und zu einem Werk führen. @de
definition: Συνδέει ένα φυσικό πρόσωπο, όπως σύμβουλο ή επόπτη μιας διατριβής ή διδακτορικής έρευνας, είτε για την απόκτηση ανώτερου εκπαιδευτικού επιπέδου πτυχίου είτε διδακτορικού, με ένα έργο. @el
definition: يربط شخصا بعمل يترتب عليه مسئولية كمشرف أكاديمي على أطروحة أو بحث أكاديمي للحصول على درجة أكاديمية تؤدي إلى عمل. @ar
definition: 将一个个人与涉及作为学位论文学术主管导致一种作品的责任的作品关联起来。 @zh-hans

illuminoinnin tekijä (toimija) kappaleessa
has element type: 2
instruction number: 18.5
toolkit definition: An item that is decorated by an agent using precious metals or colour, often with elaborate designs and motifs. @en
toolkit definition: Değerli metaller veya renkler kullanılarak, genellikle özenle hazırlanmış desenler ve motiflerle bir temsilci tarafından süslenen bir kopya. @tr
toolkit definition: Een item dat is versierd door een actor met gebruikmaking van edelmetalen of kleur, vaak met uitgebreide patronen en motieven. @nl
toolkit definition: Egy példány, amelyet egy ágens nemesfémeket vagy színeket használva díszít, gyakran kidolgozott rajzokkal és motívumokkal. @hu
toolkit definition: Eine Exemplar, das von einem Akteur durch Edelmetalle oder Farbe, häufig mit kunstvollen Mustern und Motiven, (aus-)gestaltet wird. @de
toolkit definition: Eksemplar, mille tegija on kaunistanud väärismetallide ja värvidega, kasutades sageli keerulisi kujundeid ja motiive. @et
toolkit definition: Eksemplar, som er udsmykket af en agent med ædelmetal eller farve, ofte med detaljerige mønstre og motiver. @da
toolkit definition: Et eksemplar som er dekorert av en agent ved bruk av edle metaller eller farger, gjerne med intrikate former og motiver. @no
toolkit definition: Item qui est orné par un agent avec des métaux précieux ou de la couleur, souvent avec des dessins et des motifs élaborés. @fr
toolkit definition: Kappale, jonka toimija koristelee usein yksityiskohtaisin kuvioin tai motiivein käyttäen jalometalleja tai värejä.
toolkit definition: Mette in relazione un agente a un item che è decorato da un agente utilizzando metalli preziosi o colore, spesso con disegni e motivi elaborati. @it
toolkit definition: Vienība, ko aģents izgreznojis, izmantojot krāsu un/vai dārgmetālus, bieži ar izsmalcinātiem un filigrāniem zīmējumiem, burtiem un motīviem. @lv
toolkit definition: Ítem que és decorat per un agent usant metalls preciosos o amb color, sovint amb dissenys i motius elaborats. @ca
toolkit definition: Ένα αντίτυπο διακοσμημένο μέσω πολύτιμων μετάλλων ή χρώματος, συχνά με περίτεχνα σχέδια και μοτίβα. @el
toolkit definition: مفردة يزينها وكيل بمعادن ثمينة أو بألوان، غالبًا بتصاميم وزخارف منمقة. @ar
toolkit definition: 被用贵重的金属或色彩（通常有精心的设计和图案）的一个行为者进行装饰的一个单件 @zh-hans
toolkit label: Akteur als Illuminatorin/Illuminator von @de
toolkit label: agent enlumineur de @fr
toolkit label: agent il·luminador de @ca
toolkit label: agent, som er illuminator af @da
toolkit label: illuminator agent of @en
toolkit label: illuminator av (agent) @no
toolkit label: illumineerija (tegija) eksemplaris @et
toolkit label: illuminoinnin tekijä (toimija) kappaleessa
toolkit label: illuminátor ágense: @hu
toolkit label: ir iluminātors (aģents) @lv
toolkit label: miniatore agente di @it
toolkit label: tezhip sanatçısı temsilcisidir @tr
toolkit label: verluchter-actor van @nl
toolkit label: φωτιστής φορέας του @el
toolkit label: وكيل مزخرف @ar
toolkit label: ……的彩饰者行为者 @zh-hans
has subproperty: illuminoinnin tekijä (henkilö) kappaleessa
has subproperty: illuminoinnin tekijä (yhteistoimija) kappaleessa
has subproperty: P50092
lexical alias: illuminatorAgentOf.en
status: Published
type: Property
domain: C10002
label: er agent, som er illuminator af @da
label: er illuminator av (agent) @no
label: est un agent enlumineur de @fr
label: illumineerija (tegija) eksemplaris @et
label: illuminátor ágense a következőnek: @hu
label: ir iluminātors (aģents) @lv
label: is illuminator agent of @en
label: is verluchter-actor van @nl
label: ist Akteur als Illuminatorin/Illuminator von @de
label: tezhip sanatçısı temsilcisidir @tr
label: è miniatore agente di @it
label: és agent il·luminador de @ca
label: είναι φωτιστής φορέας του @el
label: هو وكيل مزخرِف لـ @ar
label: 是……的彩饰者行为者 @zh-hans
sub property of: toimijaan liittyvä kappale
alternative label: Illuminator von @de
alternative label: enlumineur de @fr
alternative label: illuminator af @da
alternative label: illuminator av @no
alternative label: illuminator of @en
alternative label: illumineerija eksemplaris @et
alternative label: illuminointi kappaleessa
alternative label: illuminátora: @hu
alternative label: iluminador de @es
alternative label: il·luminador de @ca
alternative label: miniatore di @it
alternative label: φωτιστής του @el
alternative label: مزخرف لـ @ar
alternative label: ……的彩饰者 @zh-hans
definition: Bir temsilciyi, bir temsilci tarafından değerli metaller veya renkler kullanılarak, genellikle ayrıntılı tasarımlar ve motiflerle süslenmiş bir kopyayla ilişkilendirir. @tr
definition: Correla un agente a un item che è decorato da un agente utilizzando metalli preziosi o colore, spesso con disegni e motivi elaborati. @it
definition: Hozzákapcsol egy ágenst egy példányhoz, amelyet az ágens nemesfémeket vagy színeket használva díszít, gyakran kidolgozott rajzokkal és motívumokkal. @hu
definition: Liittää toimijan kappaleeseen, jonka toimija koristelee usein yksityiskohtaisin kuvioin tai motiivein käyttäen jalometalleja tai värejä.
definition: Met un agent en relation avec un item qui est orné par un agent avec des métaux précieux ou de la couleur, souvent avec des dessins et des motifs élaborés. @fr
definition: Relaciona un agent amb un ítem que és decorat per un agent usant metalls preciosos o amb color, sovint amb dissenys i motius elaborats. @ca
definition: Relateert een actor aan een item dat is versierd door een actor met gebruikmaking van edelmetalen of kleur, vaak met uitgebreide patronen en motieven. @nl
definition: Relaterer en agent til et eksemplar som er dekorert av en agent ved bruk av edle metaller eller farger, gjerne med intrikate former og motiver. @no

yksilöimätön nimi
has element type: 3
instruction number: 8.11
toolkit definition: A categorization indicating that the core elements recorded are insufficient to differentiate between two or more persons with the same name. (Deprecated) @en
toolkit definition: Categorització que indica que els elements bàsics enregistrats són insuficients per diferenciar entre dues o més persones amb el mateix nom. @ca
toolkit definition: Catégorisation qui indique que les éléments fondamentaux enregistrés sont insuffisants pour différencier deux ou plusieurs personnes portant le même nom. @fr
toolkit definition: Eine Kategorisierung, die anzeigt, dass die erfassten Kernelemente nicht zur Unterscheidung von mehreren Personen mit demselben Namen ausreichen. @de
toolkit definition: En betegnelse som angir at kjerneelementene som er beskrevet ikke skiller mellom to eller flere personer med samme navn. @no
toolkit definition: Jaottelu, jolla osoitetaan, että merkityt ydinelementit eivät riitä erottamaan toisistaan kahta tai useampaa samannimistä henkilöä.
toolkit definition: Kategorisering, der angiver, at de registrerede kerneelementer erutilstrækkelige til at skelne mellem to eller flere personer med det samme navn. @da
toolkit definition: Una categorización que indica que los elementos núcleo registrados son insuficientes para diferenciar dos o más personas con el mismo nombre. @es
toolkit definition: Μια κατηγοριοποίηση που υποδηλώνει ότι τα βασικά καταχωρισμένα στοιχεία είναι ανεπαρκή για τη διαφοροποίηση μεταξύ δύο ή περισσότερων φυσικών προσώπων με το ίδιο όνομα. @el
toolkit label: Indikator für nicht individualisierte Namen @de
toolkit label: ikke entydig navneindikator @da
toolkit label: ikke-skillende navneopplysninger @no
toolkit label: indicador de nom no diferenciat @ca
toolkit label: indicador de nombre no diferenciado @es
toolkit label: indicateur de nom indifférencié @fr
toolkit label: indikator för odifferentierat namn @sv
toolkit label: undifferentiated name indicator (Deprecated) @en
toolkit label: yksilöimätön nimi
toolkit label: μη διαφοροποιημένος δείκτης ονόματος @el
has subproperty: P50093
lexical alias: undifferentiatedNameIndicator.en
status: Deprecated
type: Property
domain: C10004
label: a pour indicateur de nom indifférencié @fr
label: har ikke entydig navneindikator @da
label: har indikator för odifferentierat namn @sv
label: has undifferentiated name indicator (Deprecated) @en
label: hat Indikator für nicht individualisierte Namen @de
label: té com a indicador de nom no diferenciat @ca
label: έχει μη διαφοροποιημένο δείκτη ονόματος @el
definition: Liittää henkilön jaotteluun, jolla osoitetaan, että merkityt ydinelementit eivät riitä erottamaan toisistaan kahta tai useampaa samannimistä henkilöä.
definition: Met une personne en relation avec une catégorisation qui indique que les éléments fondamentaux enregistrés sont insuffisants pour distinguer deux ou plusieurs personnes portant le même nom. @fr
definition: Relaciona una persona amb una categorització que indica que els elements bàsics enregistrats són insuficients per diferenciar entre dues o més persones amb el mateix nom. @ca
definition: Relaterer en person til en kategorisering, der angiver, at de registrerede kerneelementer er utilstrækkelige til at skelne mellem to eller flere personer med det samme navn. @da
definition: Relates a person to a categorization indicating that the core elements recorded are insufficient to differentiate between two or more persons with the same name. (Deprecated) @en
definition: Setzt eine Person mit einer Kategorisierung, die anzeigt, dass die erfassten Kernelemente nicht zur Unterscheidung von mehreren Personen mit demselben Namen ausreichen, in Beziehung. @de
definition: Συνδέει ένα φυσικό πρόσωπο με μια κατηγοριοποίηση που υποδηλώνει ότι τα βασικά καταχωρισμένα στοιχεία είναι ανεπαρκή για τη διαφοροποίηση μεταξύ δύο ή περισσότερων φυσικών προσώπων με το ίδιο όνομα. @el

henkilön tunniste
has element type: 3
instruction number: 9.18
toolkit definition: A nomen that is an appellation of person that consists of a code, number, or other string, usually independent of natural language and social naming conventions, used to identify a person. @en
toolkit definition: Bir kişiyi tanımlamak için kullanılan, genellikle doğal dilden ve sosyal adlandırma kurallarından bağımsız olarak, bir kod, sayı veya başka bir dizgiden oluşan, kişinin unvanı olan bir isim. @tr
toolkit definition: Denominazione di una persona consistente di un codice, numero o altra stringa, solitamente indipendente dal linguaggio naturale e dalle convenzioni sociali di denominazione, usati per identificare una persona. @it
toolkit definition: Een nomen dat is een benaming van persoon die bestaat uit een code, nummer of andere tekenreeks, meestal onafhankelijk van natuurlijke taal en gewoonlijke naamgevingsconventies, gebruikt om een persoon te identificeren. @nl
toolkit definition: Egy nomen, egy személy megnevezése, amely egy kódból, számból, vagy más típusú karakterláncból áll, amely általában független a természetes nyelvektől és társadalmi névkonvencióktól, és egy személy azonosítására használják. @hu
toolkit definition: Eine Bezeichnung für eine Person, die aus einem Code, einer Nummer oder einer anderen Zeichenkette besteht, der/die normalerweise nicht in natürlicher Sprache und unabhängig von den sozialen Benennungskonventionen ist und zur Identifizierung einer Person verwendet wird. @de
toolkit definition: En betegnelse for person som består av en kode, et nummer eller annen streng, vanligvis uavhengig av naturlig språk og sosiale navnekonvensjoner, brukt for å identifisere en person. @no
toolkit definition: Isiku nimetus, mis koosneb isikut identifitseerivast koodist, numbrist või muust loomulikust keelest ja üldtuntud nimetamistavadest sõltumatust stringist. @et
toolkit definition: Nomen que és una apel·lació de persona que consisteix en un codi, un número o qualsevol altra cadena, habitualment independent del llenguatge natural i de les convencions lingüístiques socials, usada per identificar una persona. @ca
toolkit definition: Nomen qui est une appellation de personne consistant en un code, un nombre ou une autre chaîne, généralement indépendante du langage naturel et des conventions sociales de dénomination, utilisée pour identifier une personne. @fr
toolkit definition: Nomen, der er en benævnelse på person, som består af en kode, nummer eller anden streng, ofte uafhængig af normalsprog og navngivningskonventioner, brugt til at identificere en person. @da
toolkit definition: Nomen, joka on henkilön identifioimiseen käytetty nimitys, joka koostuu koodista, luvusta tai muusta merkkijonosta, joka on tavallisesti riippumaton luonnollisesta kielestä tai yleisistä nimeämiskäytännöistä.
toolkit definition: Personas apzīmējums, kas sastāv no koda, skaitļa vai citas virknes, kas parasti ir neatkarīgs no dabiskas valodas vai sabiedrībā pieņemtām nosaukšanas tradīcijām, ko izmanto, lai identificētu personu. @lv
toolkit definition: Una cadena de caracteres asociados de manera unívoca con una persona, o un sustituto de la persona (p.ej., un registro de autoridad). @es
toolkit definition: Ένας αλφαριθμητικός χαρακτήρας μοναδικά συνδεδεμένος με ένα φυσικό πρόσωπο ή με ένα υποκατάστατο, όπως μια καθιερωμένη εγγραφή για το φυσικό πρόσωπο. @el
toolkit definition: تسمية هي اسم شخص يتكون من رمز، أو رقم، أو سلسلة تمثيلات أخرى، عادة ما تكون مختلفة عن اللغة الطبيعية وعن التسميات المتعارف عليها اجتماعيا، المستخدمة في تعريف شخص. @ar
toolkit definition: 一个由代码、数字、或其他字符串、通常独立于自然语言和社会命名惯例、用以标识一个个人的个人称谓的命名 @zh-hans
toolkit label: Identifikator für eine Person @de
toolkit label: henkilön tunniste
toolkit label: identifiant de personne @fr
toolkit label: identificador de la persona @es
toolkit label: identificador de persona @ca
toolkit label: identificatie voor persoon @nl
toolkit label: identificatore di persona @it
toolkit label: identifier for person @en
toolkit label: identifikator for person @da
toolkit label: identifikator för personen @sv
toolkit label: isiku identifikaator @et
toolkit label: kişinin tanımlayıcısı ile ilişkilidir @tr
toolkit label: personas identifikators @lv
toolkit label: személyazonosító: @hu
toolkit label: αναγνωριστικό για το φυσικό πρόσωπο @el
toolkit label: مُعرِّف لشخص @ar
toolkit label: 个人标识符 @zh-hans
has subproperty: P50094
lexical alias: identifierForPerson.en
status: Published
type: Property
domain: C10004
label: a pour identifiant de personne @fr
label: ha come identificatore di persona @it
label: har identifikator for person @da
label: har identifikator för personen @sv
label: has identifier for person @en
label: hat Identifikator für eine Person @de
label: heeft identificatie voor persoon @nl
label: isiku identifikaator @et
label: kişinin tanımlayıcısı ile ilişkilidir @tr
label: personas identifikators @lv
label: személy azonosítója a következő: @hu
label: té com a identificador de persona @ca
label: έχει αναγνωριστικό για το φυσικό πρόσωπο @el
label: له مُعرِّف لشخص @ar
label: 有个人的标识符 @zh-hans
sub property of: henkilön nimitys
sub property of: toimijan tunniste
definition: Bir kişiyi, bir kişiyi tanımlamak için kullanılan, genellikle doğal dilden ve sosyal adlandırma kurallarından bağımsız olarak, bir kod, sayı veya başka bir dizeden oluşan bir kişinin unvanı olan bir isimle ilişkilendirir. @tr
definition: Correla una persona a una denominazione di persona consistente di un codice, numero o altra stringa, solitamente indipendente dal linguaggio naturale e dalle convenzioni sociali di denominazione, usati per identificare una persona. @it
definition: Hozzákapcsol egy személyt egy nomenhez, egy személy megnevezéséhez, amely egy kódból, számból, vagy más típusú karakterláncból áll, amely általában független a természetes nyelvektől és társadalmi névkonvencióktól, és egy személy azonosítására használják. @hu
definition: Liittää henkilön nomeniin, joka on henkilön nimitys, joka koostuu koodista, luvusta tai muusta tavallisesti luonnollisesta kielestä ja yleisistä nimeämiskäytännöistä riippumattomasta merkkijonosta, jota käytetään henkilön identifiointiin.
definition: Met une personne en relation avec un nomen qui est une appellation de personne consistant en un code, un nombre ou une autre chaîne, généralement indépendante du langage naturel et des conventions sociales de dénomination, utilisée pour identifier une personne. @fr
definition: Relaciona una persona amb un nomen que és una apel·lació de persona que consisteix en un codi, un número o qualsevol altra cadena, habitualment independent del llenguatge natural i de les convencions lingüístiques socials, usada per identificar una persona. @ca
definition: Relateert een persoon aan een nomen dat is een benaming van persoon die bestaat uit een code, nummer of andere tekenreeks, meestal onafhankelijk van natuurlijke taal en gewoonlijke naamgevingsconventies, gebruikt om een persoon te identificeren. @nl
definition: Relaterer en person til en betegnelse for person som består av en kode, et nummer eller annen streng, vanligvis uavhengig av naturlig språk og sosiale navnekonvensjoner, brukt for å identifisere en person. @no
definition: Relaterer en person til et nomen, som er en benævnelse på person, som består af en kode, nummer eller anden streng, ofte uafhængig af normalsprog og navngivningskonventioner, brugt til at identificere en person. @da
definition: Relates a person to a nomen that is an appellation of person that consists of a code, number, or other string, usually independent of natural language and social naming conventions, used to identify a person. @en
definition: Sasaista personu ar nomenu, kas ir personas apzīmējums, kas sastāv no koda, skaitļa vai citas virknes, kas parasti ir neatkarīgs no dabiskas valodas vai sabiedrībā pieņemtām nosaukšanas tradīcijām, ko izmanto, lai identificētu personu. @lv
definition: Seostab isiku isiku nimetusega, mis koosneb isikut identifitseerivast koodist, numbrist või muust loomulikust keelest ja üldtuntud nimetamistavadest sõltumatust stringist. @et
definition: Setzt eine Person in Beziehung zu einer Bezeichnung für eine Person, die aus einem Code, einer Nummer oder einer anderen Zeichenkette besteht, der/die normalerweise nicht in natürlicher Sprache und unabhängig von den sozialen Benennungskonventionen ist und zur Identifizierung einer Person verwendet wird. @de
definition: Συνδέει ένα φυσικό πρόσωπο με έναν αλφαριθμητικό χαρακτήρα μοναδικά συνδεδεμένο με ένα φυσικό πρόσωπο ή με ένα υποκατάστατο, όπως μια καθιερωμένη εγγραφή για το φυσικό πρόσωπο. @el
definition: يربط شخصا بتسمية هي اسم شخص يتكون من رمز، أو رقم، أو سلسلة تمثيلات أخرى، عادة ما تكون مختلفة عن اللغة الطبيعية وعن التسميات المتعارف عليها اجتماعيا، المستخدمة في تعريف شخص. @ar
definition: 将一个个人与一个由代码、数字、或其他字符串、通常独立于自然语言和社会命名惯例、用以标识一个个人的个人称谓的命名关联起来。 @zh-hans
scope note: Der Identifikator dient dazu, diese Person von anderen Personen zu unterscheiden. @de
scope note: Identifikatoren tjener til at skelne denne person fra andre personer. @da
scope note: L’identifiant sert à différencier une personne d’autres personnes. @fr
scope note: Tunniste erottaa henkilön muista henkilöistä.
scope note: Το αναγνωριστικό χρησιμοποιείται για τη διαφοροποίηση αυτού του φυσικού προσώπου από άλλα φυσικά πρόσωπα. @el

henkilöjäsen yhteisössä
has element type: 2
instruction number: 29.5
toolkit definition: A corporate body of whom a person is a member. @en
toolkit definition: Asutus, mille liige isik on. @et
toolkit definition: Bir kişinin üyesi olduğu tüzel kişilik. @tr
toolkit definition: Collectivité dont une personne est membre. @fr
toolkit definition: Een corporatie van welke een persoon een lid is. @nl
toolkit definition: Egy testület, amelynek egy személy az egyik tagja. @hu
toolkit definition: Eine Körperschaft, deren Mitglied eine Person ist. @de
toolkit definition: En korporasjon der en person er medlem. @no
toolkit definition: Ente di cui una persona è membro. @it
toolkit definition: Entitat corporativa de la qual una persona n’és un membre. @ca
toolkit definition: Institūcija, kam pievienojas persona. @lv
toolkit definition: Korporation, som en person er medlem af. @da
toolkit definition: Una entidad corporativa de la cual es miembro una persona. @es
toolkit definition: Yhteisö, jossa henkilö on jäsenenä.
toolkit definition: Ένα συλλογικό όργανο στο οποίο ένα φυσικό πρόσωπο είναι μέλος. @el
toolkit definition: هيئة لديها شخص عضو. @ar
toolkit definition: 一个个人在其中是成员的一个团体 @zh-hans
toolkit label: Person als Mitglied einer Körperschaft von @de
toolkit label: Tüzel kuruluşun üyesi olan kişi @tr
toolkit label: asutuse liige (isik) asutuses @et
toolkit label: entidad corporativa @es
toolkit label: henkilöjäsen yhteisössä
toolkit label: ir institūcijas dalībnieks (persona) @lv
toolkit label: medlem av korporasjon for (person) @no
toolkit label: person member of corporate body of @en
toolkit label: person, som er medlem af korporation af @da
toolkit label: persona membre d’una entitat corporativa de @ca
toolkit label: persona membro di ente di @it
toolkit label: personne membre d’une collectivité de @fr
toolkit label: persoonlijk lid van corporatie van @nl
toolkit label: személy tagja a következő testületnek: @hu
toolkit label: φυσικό πρόσωπο μέλος του συλλογικού οργάνου του @el
toolkit label: شخص عضو في هيئة @ar
toolkit label: ……团体的个人成员 @zh-hans
has subproperty: työnantaja
has subproperty: P50095
lexical alias: personMemberOfCorporateBodyOf.en
status: Published
type: Property
domain: C10004
label: asutuse liige (isik) asutuses @et
label: er medlem av korporasjon for (person) @no
label: er person, som er medlem af korporation af @da
label: est une personne membre d’une collectivité de @fr
label: ir institūcijas dalībnieks (persona) @lv
label: is person member of corporate body of @en
label: is persoonlijk lid van corporatie van @nl
label: ist Person als Mitglied einer Körperschaft von @de
label: személy tagja a következő testületnek: @hu
label: tüzel kişisinin kişi üyesidir @tr
label: è persona membro di un ente @it
label: és persona membre d’una entitat corporativa de @ca
label: είναι φυσικό πρόσωπο μέλος του συλλογικού οργάνου του @el
label: هو شخص عضو في هيئة لـ @ar
label: 是……团体的个人成员 @zh-hans
sub property of: henkilöön liittyvä yhteisö
sub property of: henkilöjäsen yhteistoimijassa
alternative label: Affiliation @de
alternative label: affiliation @en
alternative label: affiliációja: @hu
alternative label: afiliación @es
alternative label: asutus @et
alternative label: collectivité @fr
alternative label: corporate body @en
alternative label: ente @it
alternative label: korporasjon @no
alternative label: korporation @da
alternative label: organismo corporativo @es
alternative label: testülete: @hu
alternative label: tilknytning @no
alternative label: tüzel kişi @tr
alternative label: Üyelik @tr
alternative label: συλλογικό όργανο @el
alternative label: σύνδεση @el
alternative label: هيئة تابعة @ar
alternative label: 团体 @zh-hans
alternative label: 隶属 @zh-hans

työnantaja
has element type: 2
instruction number: 29.5
toolkit definition: A corporate body who employs a person. @en
toolkit definition: Asutus, kes on isiku tööle palganud. @et
toolkit definition: Bir kişiyi istihdam eden bir tüzel kişilik @tr
toolkit definition: Collectivité qui emploie une personne. @fr
toolkit definition: Een corporatie die een persoon in dienst heeft. @nl
toolkit definition: Egy testület, amely egy személyt alkalmaz. @hu
toolkit definition: Eine Körperschaft, die eine Person beschäftigt. @de
toolkit definition: En korporasjon der en person er ansatt. @no
toolkit definition: Ente che impiega una persona. @it
toolkit definition: Entitat corporativa que dona treball a una persona. @ca
toolkit definition: Institūcija, kur persona strādā. @lv
toolkit definition: Korporation, som beskæftiger en person. @da
toolkit definition: Una entidad corporativa que emplea a la persona. @es
toolkit definition: Yhteisö, joka työllistää henkilön.
toolkit definition: Ένα συλλογικό όργανο το οποίο απασχολεί ένα φυσικό πρόσωπο ως εργοδότης. @el
toolkit definition: هيئة توظف شخصًا. @ar
toolkit definition: 雇主 @zh-hans
toolkit label: Arbeitgeberin/Arbeitgeber @de
toolkit label: arbeidsgiver @no
toolkit label: arbejdsgiver @da
toolkit label: darba devējs @lv
toolkit label: datore di lavoro @it
toolkit label: empleador @es
toolkit label: employer @en
toolkit label: employeur @fr
toolkit label: işveren @tr
toolkit label: munkaadó: @hu
toolkit label: ocupador @ca
toolkit label: työnantaja
toolkit label: tööandja @et
toolkit label: werkgever @nl
toolkit label: εργοδότης @el
toolkit label: صاحب عمل @ar
toolkit label: 雇员 @zh-hans
has subproperty: P50096
lexical alias: employer.en
status: Published
type: Property
domain: C10004
label: a pour employeur @fr
label: darba devējs @lv
label: ha come datore di lavoro @it
label: har arbeidsgiver @no
label: har arbejdsgiver @da
label: has employer @en
label: hat Arbeitgeberin/Arbeitgeber @de
label: heeft werkgever @nl
label: işveren ile ilişkilidir @tr
label: munkaadója a következő: @hu
label: té com a ocupador @ca
label: tööandja @et
label: έχει εργοδότη @el
label: له صاحب عمل @ar
label: 有雇员 @zh-hans
sub property of: henkilöjäsen yhteisössä
definition: Bir kişiyi istihdam eden bir tüzel kişilikle ilişkilendirir. @tr
definition: Correla una persona a un ente che impiega una persona. @it
definition: Hozzákapcsol egy személyt egy testülethez, amely egy személyt alkalmaz. @hu
definition: Liittää henkilön yhteisöön, joka työllistää henkilön.
definition: Met une personne en relation avec une collectivité qui emploie une personne. @fr
definition: Relaciona una persona amb una entitat corporativa que dona treball a una persona. @ca
definition: Relateert een persoon aan een corporatie die een persoon in dienst heeft. @nl
definition: Relaterer en person til en korporasjon der en person er ansatt. @no
definition: Relaterer en person til en korporation, som beskæftiger en person. @da
definition: Relates a person to a corporate body who employs a person. @en
definition: Sasaista personu ar institūciju, kur persona strādā. @lv
definition: Seostab isiku asutusega, kes on isiku tööle palganud. @et
definition: Setzt eine Person in Beziehung zu einer Körperschaft, die eine Person beschäftigt. @de
definition: Συνδέει ένα φυσικό πρόσωπο με ένα συλλογικό όργανο, το οποίο απασχολεί ένα φυσικό πρόσωπο ως εργοδότης. @el
definition: يربط شخصا بهيئة توظف شخصًا. @ar
definition: 将一个个人与雇用一个个人的一个团体关联起来。 @zh-hans

henkilöön liittyvä maa
has element type: 2
instruction number: 9.1
toolkit definition: A place that is a country with which a person is identified. @en
toolkit definition: Bir kişinin özdeşleştiği bir ülke olan bir yer. @tr
toolkit definition: Een land waarmee een persoon geïdentificeerd wordt. @nl
toolkit definition: Egy ország, amellyel egy személyt azonosítanak. @hu
toolkit definition: Ein Land, mit dem eine Person identifiziert wird. @de
toolkit definition: Et land som en person identifiseres med. @no
toolkit definition: Land, som en person forbindes med. @da
toolkit definition: Lieu qui consiste en un pays auquel une personne est associée. @fr
toolkit definition: Lloc que és un país amb el qual s’identifica una persona. @ca
toolkit definition: Maa, joka yhdistetään henkilöön.
toolkit definition: Maa, millega isik on lahutamatult seotud. @et
toolkit definition: Paese con il quale una persona è identificata. @it
toolkit definition: Un país con el que se identifica la persona @es
toolkit definition: Valsts, ar kuru persona saistīta. @lv
toolkit definition: Μια χώρα με την οποία ένα φυσικό πρόσωπο ταυτίζεται. @el
toolkit definition: بلد يُستدل به على شخص. @ar
toolkit definition: 作为一个个人识别的国家的地点 @zh-hans
toolkit label: Land, das mit einer Person in Verbindung steht @de
toolkit label: ar personu saistītā valsts @lv
toolkit label: country associated with person @en
toolkit label: henkilöön liittyvä maa
toolkit label: isikuga seotud maa @et
toolkit label: kişiyle bağlantılı ülke @tr
toolkit label: land förknippat med personen @sv
toolkit label: land geassocieerd met persoon @nl
toolkit label: land knyttet til personen @da
toolkit label: land som forbindes med person @no
toolkit label: nazione associata a una persona @it
toolkit label: pays associé à une personne @fr
toolkit label: país asociado con la persona @es
toolkit label: país associat amb una persona @ca
toolkit label: személyhez kapcsolódó ország: @hu
toolkit label: χώρα σχετική με το φυσικό πρόσωπο @el
toolkit label: بلد مرتبط بشخص @ar
toolkit label: 与个人相关的国家 @zh-hans
has subproperty: P50097
lexical alias: countryAssociatedWithPerson.en
status: Published
type: Property
domain: C10004
label: a pour pays associé à une personne @fr
label: ar personu saistītā valsts @lv
label: ha come paese associato a persona @it
label: har land förknippat med personen @sv
label: har land knyttet til person @da
label: har land som forbindes med person @no
label: has country associated with person @en
label: hat Land, das mit einer Person in Verbindung steht @de
label: heeft land geassocieerd met persoon @nl
label: isikuga seotud maa @et
label: kişiyle bağlantılı olan ülke ile ilişkilidir @tr
label: személyhez kapcsolódó ország a következő: @hu
label: té com a país associat amb una persona @ca
label: έχει χώρα σχετική με το φυσικό πρόσωπο @el
label: له بلد مرتبط بشخص @ar
label: 雇佣一个个人的一个团体 @zh-hans
sub property of: henkilöön liittyvä paikka
definition: Bir kişiyi, o kişinin özdeşleştiği bir ülke olan bir yerle ilişkilendirir. @tr
definition: Correla una persona a un paese con il quale una persona è identificata. @it
definition: Hozzákapcsol egy személyt egy országhoz, amellyel egy személyt azonosítanak. @hu
definition: Liittää henkilön maahan, joka yhdistetään henkilöön.
definition: Met une personne en relation avec un lieu qui consiste en un pays auquel une personne est associée. @fr
definition: Relaciona una persona amb un lloc que és un país amb el qual s’identifica una persona. @ca
definition: Relateert een persoon aan een land waarmee een persoon geïdentificeerd wordt. @nl
definition: Relaterer en person til et land som en person identifiseres med. @no
definition: Relaterer en person til et land, som en person forbindes med. @da
definition: Relates a person to a place that is a country with which a person is identified. @en
definition: Sasaista personu ar valsti, ar kuru persona saistīta. @lv
definition: Seostab isiku maaga, millega isik on lahutamatult seotud. @et
definition: Setzt eine Person in Beziehung zu einem Land, mit dem eine Person identifiziert wird. @de
definition: Συνδέει ένα φυσικό πρόσωπο με μια χώρα με την οποία ένα φυσικό πρόσωπο ταυτίζεται. @el
definition: يربط شخصا ببلد يُستدل به على شخص @ar
definition: 将一个个人与一个作为一个个人识别的国家的地点关联起来。 @zh-hans

henkilön toiminta-aika
has element type: 2
instruction number: 9.3.4
toolkit definition: A timespan during which a person is active in their primary field of endeavor. @en
toolkit definition: Ajanjakso, jonka aikana henkilö on ollut aktiivinen ensisijaisella toiminta-alallaan.
toolkit definition: Ajavahemik, mille jooksul isik on olnud oma peamisel tegevusalal aktiivne. @et
toolkit definition: Arco di tempo durante il quale una persona è attiva nel suo primario campo di impegno. @it
toolkit definition: Bir kişinin, asıl faaliyet alanında aktif olduğu bir zaman aralığı. @tr
toolkit definition: Een tijdspanne gedurende welke een persoon actief is in zijn primaire veld van inspanning. @nl
toolkit definition: Egy időtartam, amely alatt egy személy fő tevékenységi területén aktív. @hu
toolkit definition: Ein Zeitraum, in dem eine Person in ihrem primären Tätigkeitsfeld aktiv ist. @de
toolkit definition: Et tidsrom hvor en person er aktiv innenfor sitt hovedvirke. @no
toolkit definition: Interval de temps durant el qual una persona està en actiu en el seu camp principal d’activitat. @ca
toolkit definition: La fecha o rango de fechas que indica el período en el que una persona fue activa en su campo primario de desempeño. @es
toolkit definition: Laikposms, kurā persona ir aktīva savā darbības jomā. @lv
toolkit definition: Laps de temps pendant lequel une personne est active dans son principal champ d’activité. @fr
toolkit definition: Tidsperiode, hvori en person er aktiv i sit primære virkefelt. @da
toolkit definition: Μια χρονολογία ή ένα εύρος χρονολογιών ενδεικτικών της περιόδου κατά την οποία το φυσικό πρόσωπο έδρασε στο κύριο πεδίο της δραστηριοποίησης του/της. @el
toolkit definition: فترة زمنية ينشط خلالها شخص في مجال عمله الأساسي. @ar
toolkit definition: 一个个人在其主要努力领域中活跃的时间范围 @zh-hans
toolkit label: Wirkungszeitraum einer Person @de
toolkit label: aktivitetsperiode for person @da
toolkit label: henkilön toiminta-aika
toolkit label: isiku tegutsemisaeg @et
toolkit label: kişinin faaliyet süresi @tr
toolkit label: period of activity of person @en
toolkit label: periode van activiteit van persoon @nl
toolkit label: perioden en person var aktiv @no
toolkit label: periodo di attività di persona @it
toolkit label: personas darbības periods @lv
toolkit label: període d’activitat d’una persona @ca
toolkit label: período de actividad de la persona @es
toolkit label: période d’activité d’une personne @fr
toolkit label: személy tevékenységének időszaka: @hu
toolkit label: verksamhetstid för personen @sv
toolkit label: περίοδος της δραστηριοποίησης του φυσικού προσώπου @el
toolkit label: فترة نشاط شخص @ar
toolkit label: 个人的活动时期 @zh-hans
has subproperty: P50098
lexical alias: periodOfActivityOfPerson.en
status: Published
type: Property
domain: C10004
label: a pour période d’activité d’une personne @fr
label: ha come periodo di attività di persona @it
label: har aktivitetsperiode for person @da
label: har periode en person var aktiv @no
label: har verksamhetstid för personen @sv
label: has period of activity of person @en
label: hat Wirkungszeitraum einer Person @de
label: heeft periode van activiteit van persoon @nl
label: isiku tegutsemisaeg @et
label: kişinin faaliyet dönemi ile ilişkilidir @tr
label: personas darbības periods @lv
label: személy tevékenységének időszaka a következő: @hu
label: té com a període d’activitat d’una persona @ca
label: έχει περίοδο δραστηριοποίησης του φυσικού προσώπου @el
label: له فترة نشاط شخص @ar
label: 有个人的活动时期 @zh-hans
sub property of: henkilöön liittyvä ajanjakso
sub property of: toimijan toiminta-aika
alternative label: henkilön toimintaan liittyvä ajanjakso
definition: Bir kişiyi birincil çaba alanında aktif olduğu bir zaman aralığı ile ilişkilendirir. @tr
definition: Correla una persona a un arco di tempo durante il quale una persona è attiva nel suo primario campo di impegno. @it
definition: Hozzákapcsol egy személyt egy időtartamhoz, amely alatt egy személy fő tevékenységi területén aktív. @hu
definition: Liittää henkilön ajanjaksoon, jonka aikana henkilö on ollut aktiivinen ensisijaisella toiminta-alallaan.
definition: Met une personne en relation avec un laps de temps pendant lequel une personne est active dans son principal champ d’activité. @fr
definition: Relaciona una persona amb un interval de temps durant el qual una persona està en actiu en el seu camp principal d’activitat. @ca
definition: Relateert een persoon aan een tijdspanne gedurende welke een persoon actief is in zijn primaire veld van inspanning. @nl
definition: Relaterer en person til en tidsperiode, hvori en person er aktiv i sit primære virkefelt. @da
definition: Relaterer en person til et tidsrom hvor en person er aktiv innenfor sitt hovedvirke. @no
definition: Relates a person to a timespan during which a person is active in their primary field of endeavor. @en
definition: Sasaista personu ar laikposmu, kurā persona ir aktīva savā darbības jomā. @lv
definition: Seostab isiku ajavahemikuga, mille jooksul isik on olnud oma peamisel tegevusalal aktiivne. @et
definition: Setzt eine Person in Beziehung zu einem Zeitraum, in dem eine Person in ihrem primären Tätigkeitsfeld aktiv ist. @de
definition: Συνδέει ένα φυσικό πρόσωπο με μια χρονολογία ή ένα εύρος χρονολογιών ενδεικτικών της περιόδου κατά την οποία το φυσικό πρόσωπο έδρασε στο κύριο πεδίο της δραστηριοποίησης του/της. @el
definition: يربط شخصا بفترة زمنية ينشط خلالها شخص في مجال عمله الأساسي. @ar
definition: 将一个个人与一个个人在其主要努力领域中活跃的时间范围关联起来。 @zh-hans

henkilöstä polveutuva suku
has element type: 2
instruction number: 29.5
toolkit definition: A family who descends from a particular person. @en
toolkit definition: Belirli bir kişinin soyundan gelen bir aile. @tr
toolkit definition: Dzimta/ģimene, kas cēlusies no konkrētas personas. @lv
toolkit definition: Een familie die afstamt van een specifieke persoon. @nl
toolkit definition: Egy család, amely egy bizonyos személytől származik. @hu
toolkit definition: Eine Familie, die von einer bestimmten Person abstammt. @de
toolkit definition: En familie som er etterkommere av en bestemt person. @no
toolkit definition: Famiglia che discende da una particolare persona. @it
toolkit definition: Familie, som nedstammer fra en bestemt person. @da
toolkit definition: Famille qui descend d’une personne particulière. @fr
toolkit definition: Família que descendeix d’una persona concreta. @ca
toolkit definition: Perekond, kes põlvneb sellest isikust. @et
toolkit definition: Suku, joka polveutuu tietystä henkilöstä.
toolkit definition: Una familia que desciende de una persona determinada. @es
toolkit definition: Μια οικογένεια η οποία κατάγεται από ένα συγκεκριμένο φυσικό πρόσωπο. @el
toolkit definition: عائلة تنحدر من شخص معين. @ar
toolkit definition: 一个特定个人的后代的家族 @zh-hans
toolkit label: Nachkommen @de
toolkit label: afstammeling-familie van persoon @nl
toolkit label: descendant family of person @en
toolkit label: descendientes @es
toolkit label: etterkommende familie av person @no
toolkit label: famiglia discendente di persona @it
toolkit label: familie nedstammende af person @da
toolkit label: famille descendante d’une personne @fr
toolkit label: família descendent d’una persona @ca
toolkit label: henkilöstä polveutuva suku
toolkit label: isikust põlvnev perekond @et
toolkit label: kişinin alt soy ailesi @tr
toolkit label: personas pēcnācējs (dzimta/ģimene) @lv
toolkit label: személy leszármazott családja: @hu
toolkit label: επίγονος οικογένεια του φυσικού προσώπου @el
toolkit label: عائلة منحدرة من شخص @ar
toolkit label: 个人的后裔家族 @zh-hans
has subproperty: P50099
lexical alias: descendantFamilyOfPerson.en
status: Published
type: Property
domain: C10004
label: a pour famille descendante d’une personne @fr
label: ha come famiglia discendente di persona @it
label: har etterkommende familie av person @no
label: har familie nedstammende af person @da
label: has descendant family of person @en
label: hat Nachkommen @de
label: heeft afstammeling-familie van persoon @nl
label: isikust põlvnev perekond @et
label: kişinin alt soy ailesi ile ilişkilidir @tr
label: personas pēcnācējs (dzimta/ģimene) @lv
label: személy leszármazott családja a következő: @hu
label: té com a família descendent d’una persona @ca
label: έχει επίγονο οικογένεια του φυσικού προσώπου @el
label: له عائلة منحدرة من شخص @ar
label: 有个人的后裔家族 @zh-hans
sub property of: henkilöjäsen suvussa
alternative label: descendants @en
alternative label: descendents @ca
alternative label: descendientes @es
alternative label: discendenti @it
alternative label: efterkommere @da
alternative label: etterkommere @no
alternative label: jälkeläiset
alternative label: järglased @et
alternative label: leszármazottak: @hu
alternative label: soydan gelenler @tr
alternative label: επίγονοι @el
alternative label: أحفاد @ar
alternative label: 后代 @zh-hans
definition: Bir kişiyi, belirli bir kişinin soyundan gelen bir aileyle ilişkilendirir. @tr
definition: Correla una persona a una famiglia che discende da una particolare persona. @it
definition: Hozzákapcsol egy személyt egy családhoz, amely egy bizonyos személytől származik. @hu
definition: Liittää henkilön sukuun, joka polveutuu tietystä henkilöstä.
definition: Met une personne en relation avec une famille qui descend d’une personne particulière. @fr
definition: Relaciona una persona amb una família que descendeix d’una persona concreta. @ca
definition: Relateert een persoon aan een familie die afstamt van een specifieke persoon. @nl
definition: Relaterer en person til en familie som er etterkommere av en bestemt person. @no
definition: Relaterer en person til en familie, som nedstammer fra en bestemt person. @da

henkilön toiminta-ala
has element type: 5
instruction number: 9.15
toolkit definition: A field of endeavor, area of expertise, etc., in which a person is engaged. @en
toolkit definition: Ala, jolla henkilö toimii tai on toiminut, tai jonka asiantuntija tms. hän on.
toolkit definition: Bir kişinin meşgul olduğu bir uğraş, uzmanlık alanı vb. @tr
toolkit definition: Camp d’acció, àrea d’experiència, etc., al qual es dedica una persona. @ca
toolkit definition: Campo di impegno, area di competenza, etc. nella quale una persona è impegnata. @it
toolkit definition: Champ d’activité, domaine d’expertise, etc. dans lequel une personne évolue. @fr
toolkit definition: Een veld van inspanning, vakgebied etc. waarbij een persoon betrokken is. @nl
toolkit definition: Egy tevékenység, szakterület, illetékességi, felelősségi, joghatósági, stb. terület, amely iránt a személy elkötelezett. @hu
toolkit definition: Ein Tätigkeitsfeld, ein Wissensgebiet und so weiter, in dem eine Person tätig ist. @de
toolkit definition: Et arbeidsfelt, et ekspertiseområde, etc., som en person er involvert i. @no
toolkit definition: Indsatsområde, ekspertiseområde osv., inden for hvilket en person er engageret. @da
toolkit definition: Personas darbības joma, kurā tā iesaistīta. @lv
toolkit definition: Tegevus- või eriala, millega isik tegeleb või on tegelnud. @et
toolkit definition: Un área de trabajo, área de pericia, etc., en el que la persona está o estuvo involucrada. @es
toolkit definition: Ένα πεδίο δραστηριοποίησης, μια περιοχή ειδίκευσης κ.λπ. με την οποία το φυσικό πρόσωπο εμπλέκεται ή εμπλεκόταν. @el
toolkit definition: مجال العمل والخبرة، الخ، التي يمارسها شخص. @ar
toolkit definition: 一个个人所从事的努力的领域和专长范围等 @zh-hans
toolkit label: Betätigungsfeld einer Person @de
toolkit label: camp d’activitat d’una persona @ca
toolkit label: campo de actividad de la persona @es
toolkit label: campo di attività di persona @it
toolkit label: domaine d’activité d’une personne @fr
toolkit label: field of activity of person @en
toolkit label: henkilön toiminta-ala
toolkit label: isiku tegevusala @et
toolkit label: kişinin faaliyet alanı @tr
toolkit label: personas darbības joma @lv
toolkit label: személy tevékenységi köre: @hu
toolkit label: veld van activiteit van persoon @nl
toolkit label: virkefelt for person @da
toolkit label: virksomhetsområde for person @no
toolkit label: πεδίο της δραστηριοποίησης του φυσικού προσώπου @el
toolkit label: مجال نشاط لشخص @ar
toolkit label: 个人的活动领域 @zh-hans
has subproperty: P50100
lexical alias: fieldOfActivityOfPerson.en
status: Published
type: Property
domain: C10004
label: a pour domaine d’activité d’une personne @fr
label: ha come campo di attività di persona @it
label: har virkefelt for person @da
label: har virksomhetsområde for person @no
label: has field of activity of person @en
label: hat Betätigungsfeld einer Person @de
label: heeft veld van activiteit van persoon @nl
label: isiku tegevusala @et
label: kişinin faaliyet alanı ile ilişkilidir @tr
label: personas darbības joma @lv
label: személy tevékenységi köre a következő: @hu
label: té com a camp d’activitat d’una persona @ca
label: έχει πεδίο δραστηριοποίησης του φυσικού προσώπου @el
label: له مجال نشاط لشخص @ar
label: 有个人的活动领域 @zh-hans
sub property of: toimijan toiminta-ala
definition: Bir kişiyi, meşgul olduğu bir çalışma alanı, uzmanlık alanı vb. ile ilişkilendirir. @tr
definition: Correla una persona a un campo di impegno, area di competenza, etc. nella quale una persona è impegnata. @it
definition: Hozzákapcsol egy személyt egy tevékenységhez, szakterülethez, illetékességi, felelősségi, joghatósági, stb. területhez, amely iránt a személy elkötelezett. @hu
definition: Liittää henkilön alaan, jolla henkilö toimii tai on toiminut, tai jonka asiantuntija tms. hän on.
definition: Met une personne en relation avec un champ d’activité, domaine d’expertise, etc. dans lequel une personne évolue. @fr
definition: Relaciona una persona amb un camp d’acció, àrea d’experiència, etc., al qual es dedica una persona. @ca
definition: Relateert een persoon aan een veld van inspanning, vakgebied etc. waarbij een persoon betrokken is. @nl
definition: Relaterer en person til et arbeidsfelt, et ekspertiseområde, etc., som en person er involvert i. @no
definition: Relaterer en person til et indsatsområde, ekspertiseområde osv., inden for hvilket en person er engageret. @da
definition: Relates a person to a field of endeavor, area of expertise, etc., in which a person is engaged. @en
definition: Sasaista personu ar personas darbības jomu, kurā tā iesaistīta. @lv
definition: Seostab isiku tegevus- või erialaga, millega isik tegeleb või on tegelnud. @et
definition: Setzt eine Person in Beziehung zu einem Tätigkeitsfeld, einem Wissensgebiet und so weiter, in dem eine Person tätig ist. @de
definition: Συνδέει ένα φυσικό πρόσωπο με ένα πεδίο δραστηριοποίησης, μια περιοχή ειδίκευσης κ.λπ. με την οποία το φυσικό πρόσωπο εμπλέκεται ή εμπλεκόταν. @el
definition: يربط شخصا بمجال العمل والخبرة، الخ، التي يمارسها شخص. @ar
definition: 将一个个人与一个个人所从事的努力的领域和专长范围等关联起来。 @zh-hans

viiteryhmä
instruction number: 9.13
toolkit definition: Eine Gruppe, zu der eine Person durch Anstellung, Mitgliedschaft, kulturelle Identität usw. zugehörig ist oder war. @de
toolkit definition: En gruppe som en person har eller har hatt tilknytning til gjennom arbeid, medlemskap, kulturell identitet, etc. @no
toolkit definition: Groupe auquel une personne est ou a été affiliée par recrutement, acquisition de la qualité de membre, identité culturelle, etc. @fr
toolkit definition: Grup en el qual una persona està o ha estat afiliada per qüestions de feina, en qualitat de membre, per afinitat cultural, etc. @ca
toolkit definition: Gruppe, som en person er eller har været tilknyttet via beskæftigelse, medlemskab, kulturel identitet etc. @da
toolkit definition: Ryhmä, johon henkilöllä on ollut yhteys työn, jäsenyyden, kulttuuri-identiteetin tms. kautta.
toolkit definition: Un grupo con el que la persona está afiliada, o ha estado afiliada, mediante empleo, membresía, identidad cultural, etc. @es
toolkit definition: Μια ομάδα με την οποία το φυσικό πρόσωπο συνδέεται ή έχει συνδεθεί μέσω εργασίας, συνδρομής μέλους, πολιτιστικής ταυτότητας κ.λπ. @el
toolkit label: Affiliation @de
toolkit label: affiliation @fr
toolkit label: afiliació @ca
toolkit label: afiliación @es
toolkit label: organisatorisk tillhörighet @sv
toolkit label: tilhørsforhold @da
toolkit label: viiteryhmä
toolkit label: σύνδεση @el
has subproperty: P50101
lexical alias: affiliation.en
status: Deprecated
type: Property
domain: C10004
label: a pour affiliation @fr
label: har organisatorisk tillhörighet @sv
label: har tilhørsforhold @da
label: hat Affiliation @de
label: té com a afiliació @ca
label: έχει σύνδεση @el
definition: Liittää henkilön ryhmään, johon henkilöllä on ollut yhteys työn, jäsenyyden, kulttuuri-identiteetin tms. kautta.
definition: Met une personne en relation avec un groupe auquel une personne est ou a été affiliée par recrutement, acquisition de la qualité de membre, identité culturelle, etc. @fr
definition: Relaciona una persona amb un grup en el qual una persona està o ha estat afiliada per qüestions de feina, en qualitat de membre, per afinitat cultural, etc. @ca
definition: Relaterer en person til en gruppe, som en person er eller har været tilknyttet via beskæftigelse, medlemskab, kulturel identitet etc. @da
definition: Setzt eine Person mit einer Gruppe, die durch Anstellung, Mitgliedschaft, kulturelle Identität usw. zugehörig ist oder war, in Beziehung. @de
definition: Συνδέει ένα φυσικό πρόσωπο με μια ομάδα με την οποία το φυσικό πρόσωπο συνδέεται ή έχει συνδεθεί μέσω εργασίας, συνδρομής μέλους, πολιτιστικής ταυτότητας κ.λπ. @el

henkilön käyttämä kieli
has element type: 5
instruction number: 9.14
toolkit definition: A language that is used by a person in its communications. @en
toolkit definition: Bir kişinin iletişiminde kullandığı dil @tr
toolkit definition: Een taal die gebruikt is door een persoon bij het schrijven voor uitgeven, uitzenden etc. @nl
toolkit definition: Egy nyelv, amelyet egy személy publikáció írására, műsorközvetítésben stb. használ @hu
toolkit definition: Eine Sprache, die eine Person für ihre Veröffentlichungen, zum Senden und so weiter verwendet. @de
toolkit definition: Et språk brukt av en person som skriver for utgivelse, kringkasting etc. @no
toolkit definition: Keel, mida isik kasutab, kirjutades avaldamiseks, avalikult esitamiseks vms. @et
toolkit definition: Kieli, jota henkilö käyttää viestinnässään.
toolkit definition: Langue qu’une personne utilise pour sa communication. @fr
toolkit definition: Lingua utilizzata da una persona quando scrive per una pubblicazione, trasmissione, etc. @it
toolkit definition: Llengua que és usada per una persona en les seves comunicacions. @ca
toolkit definition: Sprog, som en person anvender til at skrive til publicering, udsendelse etc. @da
toolkit definition: Una lengua que una persona utiliza cuando escribe para publicaciones, transmisiones, etc. @es
toolkit definition: Valoda, ko persona lieto publicējoties vai uzstājoties. @lv
toolkit definition: Μια γλώσσα την οποία το φυσικό πρόσωπο χρησιμοποιεί σε μια δημοσίευση, εκπομπή κ.λπ. @el
toolkit definition: لغة يستخدمها شخص عند الكتابة للنشر، والبث الإذاعي، إلخ. @ar
toolkit definition: 一个个人在交流中所用的一种语言 @zh-hans
toolkit label: Kişinin dili @tr
toolkit label: Sprache einer Person @de
toolkit label: henkilön käyttämä kieli
toolkit label: isiku keel @et
toolkit label: language of person @en
toolkit label: langue d’une personne @fr
toolkit label: lengua de la persona @es
toolkit label: lingua di persona @it
toolkit label: llengua d’una persona @ca
toolkit label: personas valoda @lv
toolkit label: personens språk @no
toolkit label: sprog for person @da
toolkit label: személy nyelve: @hu
toolkit label: taal van persoon @nl
toolkit label: γλώσσα του φυσικού προσώπου @el
toolkit label: لغة شخص @ar
toolkit label: 个人的语言 @zh-hans
has subproperty: P50102
lexical alias: languageOfPerson.en
status: Published
type: Property
domain: C10004
label: a pour langue d’une personne @fr
label: ha come lingua di persona @it
label: har personens språk @no
label: har sprog for person @da
label: has language of person @en
label: hat Sprache einer Person @de
label: heeft taal van persoon @nl
label: isiku keel @et
label: kişinin dili ile ilişkilidir @tr
label: personas valoda @lv
label: személy nyelve a következő: @hu
label: té com a llengua d’una persona @ca
label: έχει γλώσσα του φυσικού προσώπου @el
label: له لغة شخص @ar
label: 有个人的语言 @zh-hans
sub property of: toimijan käyttämä kieli
definition: Bir kişiyi, bir kişinin iletişiminde kullandığı bir dille ilişkilendirir. @tr
definition: Correla una persona a una lingua utilizzata da una persona quando scrive per una pubblicazione, trasmissione, etc. @it
definition: Hozzákapcsol egy személyt egy nyelvhez, amelyet egy személy publikáció írására, műsorközvetítésben stb. használ @hu
definition: Liittää henkilön kieleen, jota henkilö käyttää viestinnässään.
definition: Met une personne en relation avec une langue qu’une personne utilise pour sa communication. @fr
definition: Relaciona una persona amb una llengua que és usada per una persona en les seves comunicacions. @ca
definition: Relateert een persoon aan een taal die gebruikt is door een persoon bij het schrijven voor uitgeven, uitzenden etc. @nl
definition: Relaterer en person til et sprog, som en person anvender til at skrive til publicering, udsendelse etc. @da
definition: Relaterer en person til et språk brukt av en person som skriver for utgivelse, kringkasting etc. @no
definition: Relates a person to a language that is used by a person in its communications. @en
definition: Sasaista personu ar valodu, ko persona lieto publicējoties vai uzstājoties. @lv
definition: Seostab isiku keelega, mida isik kasutab, kirjutades avaldamiseks, avalikult esitamiseks vms. @et
definition: Setzt eine Person in Beziehung zu einer Sprache, die eine Person für ihre Veröffentlichungen, zum Senden und so weiter verwendet. @de
definition: Συνδέει ένα φυσικό πρόσωπο με μια γλώσσα την οποία το φυσικό πρόσωπο χρησιμοποιεί σε μια δημοσίευση, εκπομπή κ.λπ. @el
definition: يربط شخصا بلغة يستخدمها شخص عند الكتابة للنشر، وللبث الإذاعي، إلخ @ar
definition: 将一个个人与一个个人在交流中所用的一种语言关联起来。 @zh-hans

henkilön varianttinimi
has element type: 3
instruction number: 9.2.3
toolkit definition: A nomen that is a name of person that is not selected for preference in a specific application or context. @en
toolkit definition: Belirli bir uygulamada veya bağlamda tercih için seçilmemiş kişi adı olan bir isim. @tr
toolkit definition: Een nomen dat is een naam van persoon die niet de voorkeur heeft gekregen in een specifieke applicatie of context. @nl
toolkit definition: Egy személynév nomen, amelyet egy bizonyos alkalmazásban vagy kontextusban nem részesítenek előnyben. @hu
toolkit definition: Ein Name einer Person, der in einer bestimmten Anwendung oder in einem bestimmten Kontext nicht als Vorzugsform bestimmt wird. @de
toolkit definition: Et navn for person som ikke er valgt som preferanse i en bestemt applikasjon eller kontekst. @no
toolkit definition: Isiku nimi, mis kindlas rakenduses või kontekstis ei ole valitud eelistatuks. @et
toolkit definition: Nome di persona non scelto come preferito in una specifica applicazione o contesto. @it
toolkit definition: Nomen que és un nom de persona que no se selecciona com a preferent en un context o aplicació específic. @ca
toolkit definition: Nomen qui est un nom de personne ne faisant pas l’objet d’un choix privilégié dans une application ou un contexte spécifiques. @fr
toolkit definition: Nomen, joka on nimi, jota ei ole valittu henkilön ensisijaiseksi nimeksi tietyssä sovelluksessa tai kontekstissa.
toolkit definition: Nomen, som er et navn på person, som ikke er valgt som foretrukken i en specifik anvendelse eller kontekst. @da
toolkit definition: Personas vārds, kurš nav izvēlēts kā prioritārs noteiktā lietojumprogrammā vai kontekstā. @lv
toolkit definition: Un nombre o forma del nombre mediante el cual se conoce una persona que difiere del nombre o forma del nombre elegido como el nombre preferido. @es
toolkit definition: Ένα όνομα ή μια μορφή ονόματος με την οποία το φυσικό πρόσωπο είναι γνωστό, η οποία διαφέρει από το όνομα ή τη μορφή ονόματος που έχει επιλεγεί ως το προτιμώμενο όνομα. @el
toolkit definition: اسم عائلة اختير اسما مفضلا في تطبيق أو في سياق محدد. @ar
toolkit definition: 一个作为个人名称并不在特定应用或语境下优先选用的命名 @zh-hans
toolkit label: Abweichender Name einer Person @de
toolkit label: ha come nome variante di persona @it
toolkit label: henkilön varianttinimi
toolkit label: isiku variantnimi @et
toolkit label: kişinin alternatif ismi @tr
toolkit label: personas cits vārds @lv
toolkit label: személy névváltozata: @hu
toolkit label: variant af navn på person @da
toolkit label: variant de nom de persona @ca
toolkit label: variant naam van persoon @nl
toolkit label: variant name of person @en
toolkit label: variante de nom de personne @fr
toolkit label: variante del nombre de la persona @es
toolkit label: variantform av personnavn @no
toolkit label: variantnamn för personen @sv
toolkit label: εναλλακτικό όνομα του φυσικού προσώπου @el
toolkit label: اسم مختلف للشخص @ar
toolkit label: 个人的变异名称 @zh-hans
has subproperty: P50103
lexical alias: variantNameOfPerson.en
status: Published
type: Property
domain: C10004
label: a pour variante de nom de personne @fr
label: ha come nome variante di persona @it
label: har variant af navn på person @da
label: har variantform av personnavn @no
label: har variantnamn för personen @sv
label: has variant name of person @en
label: hat abweichenden Namen einer Person @de
label: heeft variant naam van persoon @nl
label: isiku variantnimi @et
label: kişinin alternatif ismi ile ilişkilidir @tr
label: personas cits vārds @lv
label: személy névváltozata a következő: @hu
label: té com a variant de nom de persona @ca
label: έχει εναλλακτικό όνομα του φυσικού προσώπου @el
label: له اسم مختلف لشخص @ar
label: 有个人的变异名称 @zh-hans
sub property of: henkilön nimi
sub property of: toimijan varianttinimi
alternative label: -
alternative label: Abweichender Name für einer Person @de
alternative label: kişi için alternatif isim @tr
alternative label: személy névvariánsa: @hu
alternative label: variant name for person @en
alternative label: variante de nombre para persona @es
alternative label: variantnavn for person @da
alternative label: اسم مختلف للشخص @ar
alternative label: 给个人的变异名称 @zh-hans
definition: Bir kişiyi, özel uygulama veya içerikte kullanılması tercih edilmeyen diğer ismiyle ilişkilendirir. @tr
definition: Correla una persona a un nome di persona non scelto come preferito in una specifica applicazione o contesto. @it
definition: Hozzákapcsol egy személyt egy személynév nomenhez, amelyet egy bizonyos alkalmazásban vagy kontextusban nem részesítenek előnyben. @hu
definition: Liittää henkilön nomeniin, joka on henkilön nimi, jota ei ole valittu henkilön ensisijaiseksi nimeksi tietyssä sovelluksessa tai kontekstissa.
definition: Met une personne en relation avec un nomen qui est un nom de personne ne faisant pas l’objet d’un choix privilégié dans une application ou un contexte spécifiques. @fr
definition: Relaciona una persona amb un nomen que és un nom de persona que no se selecciona com a preferent en un context o aplicació específic. @ca
definition: Relateert een persoon aan een nomen dat is een naam van persoon die niet de voorkeur heeft gekregen in een specifieke applicatie of context. @nl
definition: Relaterer en person til et navn for person som ikke er valgt som preferanse i en bestemt applikasjon eller kontekst. @no
definition: Relaterer en person til et nomen, som er et navn på person, som ikke er valgt som foretrukken i en specifik anvendelse eller kontekst. @da
definition: Relates a person to a nomen that is a name of person that is not selected for preference in a specific application or context. @en

henkilön ammatti tai tehtävä
has element type: 5
instruction number: 9.16
toolkit definition: A vocation or avocation. @en
toolkit definition: Bir meslek veya uğraşı. @tr
toolkit definition: Een roeping of nevenwerkzaamheden. @nl
toolkit definition: Egy hivatás vagy kiegészítő tevékenység. @hu
toolkit definition: Eine Berufung oder Nebenbeschäftigung. @de
toolkit definition: En levevei eller et arbeid. @no
toolkit definition: Erhverv eller bibeskæftigelse. @da
toolkit definition: Henkilön ammatti tai harrastus.
toolkit definition: Kutseala või kõrvaltegevus. @et
toolkit definition: Personas profesija vai nodarbošanās. @lv
toolkit definition: Profession ou passe-temps. @fr
toolkit definition: Professione o occupazione. @it
toolkit definition: Vocació o dedicació. @ca
toolkit definition: Vocación o pasatiempo de una persona. @es
toolkit definition: Το επάγγελμα ή η ενασχόληση ενός φυσικού προσώπου. @el
toolkit definition: صنعة أو بحرفة. @ar
toolkit definition: 职业或爱好 @zh-hans
toolkit label: Beruf oder Tätigkeit @de
toolkit label: beroep of bezigheid @nl
toolkit label: elukutse või amet @et
toolkit label: henkilön ammatti tai tehtävä
toolkit label: profesija vai nodarbošanās @lv
toolkit label: profesión u ocupación @es
toolkit label: profesjon eller yrke @no
toolkit label: profession eller beskæftigelse @da
toolkit label: profession or occupation @en
toolkit label: profession ou occupation @fr
toolkit label: professione o occupazione @it
toolkit label: professió o ocupació @ca
toolkit label: szakterülete vagy foglalkozása: @hu
toolkit label: uzmanlığı veya mesleği @tr
toolkit label: yrke eller sysselsättning @sv
toolkit label: επάγγελμα ή απασχόληση @el
toolkit label: مهنة أو وظيفة @ar
toolkit label: 职业或工作 @zh-hans
has subproperty: P50104
lexical alias: professionOrOccupation.en
status: Published
type: Property
domain: C10004
label: a pour profession ou occupation @fr
label: elukutse või amet @et
label: ha come professione o occupazione @it
label: har profesjon eller yrke @no
label: har profession eller beskæftigelse @da
label: har yrke eller sysselsättning @sv
label: has profession or occupation @en
label: hat Beruf oder Tätigkeit @de
label: heeft beroep of bezigheid @nl
label: iş veya meslek ile ilişkilidir @tr
label: profesija vai nodarbošanās @lv
label: szakterülete vagy foglalkozása a következő: @hu
label: té com a professió o ocupació @ca
label: έχει επάγγελμα ή απασχόληση @el
label: له مهنة أو وظيفة @ar
label: 有职业和工作 @zh-hans
definition: Bir kişiyi, kişinin mesleği ya da hobisiyle ilişkilendirir. @tr
definition: Correla una persona a una professione o occupazione @it
definition: Hozzákapcsol egy ágenst egy hivatáshoz vagy kiegészítő tevékenységhez. @hu
definition: Liittää henkilön henkilön ammattiin tai harrastukseen.
definition: Met une personne en relation avec une profession ou un passe-temps. @fr
definition: Relaciona una persona amb una vocació o dedicació. @ca
definition: Relateert een persoon aan een roeping of nevenwerkzaamheden. @nl
definition: Relaterer en person til en levevei eller et arbeid. @no
definition: Relaterer en person til et erhverv eller bibeskæftigelse. @da
definition: Relates a person to a vocation or avocation. @en
definition: Sasaista personu ar personas profesiju vai nodarbošanos. @lv
definition: Seostab isiku kutseala või kõrvaltegevusega. @et
definition: Setzt eine Person in Beziehung zu einer Berufung oder Nebenbeschäftigung. @de
definition: Συνδέει ένα φυσικό πρόσωπο με το επάγγελμα ή την ενασχόληση ενός φυσικού προσώπου. @el
definition: يربط شخصا بصنعة أو بحرفة. @ar
definition: 将一个个人与一个职业或爱好关联起来。 @zh-hans

toinen identiteetti
instruction number: 29.5
toolkit definition: Ein Pseudonym oder eine sonstige Identität, das/die eine Person annimmt. @de
toolkit definition: Et pseudonym eller en annen identitet som forbindes med en person. @no
toolkit definition: Henkilön omaksuma toinen identiteetti.
toolkit definition: Pseudonym eller anden identitet antaget af en person. @da
toolkit definition: Pseudonyme ou autre identité adoptée par une personne. @fr
toolkit definition: Pseudònim o qualsevol altra identitat adoptada per una persona. @ca
toolkit definition: Un seudónimo u otra identidad asumida por la persona. @es
toolkit definition: Ένα ψευδώνυμο ή άλλη ψευδής ταυτότητα ενός φυσικού προσώπου. @el
toolkit label: Andere Identität @de
toolkit label: alternativ identitet @da
toolkit label: identidad alternativa @es
toolkit label: identitat alternativa @ca
toolkit label: identité alternative @fr
toolkit label: toinen identiteetti
toolkit label: εναλλακτική ταυτότητα @el
has subproperty: P50105
lexical alias: alternateIdentity.en
status: Deprecated
type: Property
domain: C10004
label: a pour identité alternative @fr
label: har alternativ identitet @da
label: hat andere Identität @de
label: té com a identitat alternativa @ca
label: έχει εναλλακτική ταυτότητα @el
definition: Liittää henkilön henkilön omaksumaan toiseen identiteettiiin.
definition: Met une personne en relation avec un pseudonyme ou une autre identité adoptée par une personne. @fr
definition: Relaciona una persona amb un pseudònim o qualsevol altra identitat adoptada per una persona. @ca
definition: Relaterer en person til en pseudonym eller anden identitet antaget af en person. @da
definition: Relates a person to a pseudonymous or other identity assumed by a person. (Deprecated) @en
definition: Setzt eine Person mit einem Pseudonym oder einer sonstigen Identität, das/die eine Person annimmt, in Beziehung. @de
definition: Συνδέει ένα φυσικό πρόσωπο με ένα ψευδώνυμο ή άλλη ψευδή ταυτότητα ενός φυσικού προσώπου. @el

todellinen identiteetti
instruction number: 29.5
toolkit definition: Eine reale Person, die eine andere Identität annimmt. @de
toolkit definition: En virkelig person som bruker en alternativ identitet. @no
toolkit definition: Persona real que adopta una identitat alternativa. @ca
toolkit definition: Personne réelle qui adopte une identité alternative. @fr
toolkit definition: Toisen identiteetin omaksuneen henkilön todellinen identiteetti.
toolkit definition: Una persona real que asume la identidad alternativa. @es
toolkit definition: Virkelig person der antager en alternativ identitet. @da
toolkit definition: Ένα πραγματικό φυσικό πρόσωπο με εναλλακτική ταυτότητα. @el
toolkit label: Wirkliche Identität @de
toolkit label: identidad real @es
toolkit label: identitat real @ca
toolkit label: identité réelle @fr
toolkit label: todellinen identiteetti
toolkit label: virkelig identitet @da
toolkit label: πραγματική ταυτότητα @el
has subproperty: P50106
lexical alias: realIdentity.en
status: Deprecated
type: Property
domain: C10004
label: a pour identité réelle @fr
label: har virkelig identitet @da
label: hat wirkliche Identität @de
label: té com a identitat real @ca
label: έχει πραγματική ταυτότητα @el
definition: Liittää henkilön toisen identiteetin omaksuneen henkilön todelliseen identiteettiin.
definition: Met une personne en relation avec une personne réelle qui adopte une identité alternative. @fr
definition: Relaciona una persona amb una persona real que adopta una identitat alternativa. @ca
definition: Relaterer en person til en virkelig person der antager en alternativ identitet. @da
definition: Relates a person to a real person who assumes an alternate identity. (Deprecated) @en
definition: Setzt eine Person mit einer realen Person, die eine andere Identität annimmt, in Beziehung. @de
definition: Συνδέει ένα φυσικό πρόσωπο με ένα πραγματικό φυσικό πρόσωπο με εναλλακτική ταυτότητα. @el

henkilöön liittyvä ajankohta
has element type: 3
instruction number: 9.3
toolkit definition: A timespan that has a significant association with a person. (Deprecated) @en
toolkit definition: Data significativa associada amb una persona. @ca
toolkit definition: Date importante associée à une personne. @fr
toolkit definition: Egy személyhez kötődő fontos időpont. @hu
toolkit definition: Ein wichtiges Datum, das mit der Geschichte einer Person in Verbindung steht. @de
toolkit definition: Et viktig tidspunkt som kan forbindes med en person. @no
toolkit definition: Henkilöön liittyvä merkittävä ajankohta.
toolkit definition: Mια σημαντική χρονολογία συνδεδεμένη με ένα φυσικό πρόσωπο. @el
toolkit definition: Una fecha significativa asociada con la persona (p.ej., fecha de nacimiento, fecha de fallecimiento). @es
toolkit definition: Væsentlig dato forbundet med en person. @da
toolkit label: Datum, das mit einer Person in Verbindung steht @de
toolkit label: data associada amb una persona @ca
toolkit label: date associated with person (Deprecated) @en
toolkit label: date associée à une personne @fr
toolkit label: dato knyttet til personen @da
toolkit label: fecha asociada con la persona @es
toolkit label: henkilöön liittyvä ajankohta
toolkit label: személlyel kapcsolatos időpont @hu
toolkit label: tid förknippad med personen @sv
toolkit label: tidspunkt som forbindes med person @no
toolkit label: χρονολογία συνδεδεμένη με το φυσικό πρόσωπο @el
has subproperty: P50107
lexical alias: dateAssociatedWithPerson.en
status: Deprecated
type: Property
domain: C10004
label: a pour date associée à une personne @fr
label: har dato knyttet til personen @da
label: har tid förknippad med personen @sv
label: has date associated with person (Deprecated) @en
label: hat Datum, das mit einer Person in Verbindung steht @de
label: té com a data associada amb una persona @ca
label: van személlyel kapcsolatos időpontja @hu
label: έχει χρονολογία συνδεδεμένη με το φυσικό πρόσωπο @el
sub property of: henkilöön liittyvä ajanjakso
definition: Egy személyt hozzákapcsol egy személyhez kötődő fontos időponthoz. @hu
definition: Liittää henkilön henkilöön liittyvään merkittävään ajankohtaan.
definition: Met une personne en relation avec une date importante associée à une personne. @fr
definition: Relaciona una persona amb una data significativa associada amb una persona. @ca
definition: Relaterer en person til en væsentlig dato forbundet med en person. @da
definition: Relates a person to a timespan that has a significant association with a person. (Deprecated) @en
definition: Setzt eine Person mit einem wichtigen Datum, das mit der Geschichte einer Person in Verbindung steht, in Beziehung. @de
definition: Συνδέει ένα φυσικό πρόσωπο με μια σημαντική χρονολογία συνδεδεμένη με ένα φυσικό πρόσωπο. @el

muu henkilöön liittyvä määrite
has element type: 6
instruction number: 9.6
toolkit definition: A term other than a term of rank, honour, or office that is associated with a person. (Deprecated) @en
toolkit definition: Egy személyhez kötődő kifejezés, amely más, mint egy cím. @hu
toolkit definition: Ein Terminus, der kein Titel ist, der mit dem Namen einer Person in Verbindung steht. @de
toolkit definition: En annen type betegnelse enn tittel som forbindes med en person. @no
toolkit definition: Henkilöön liitetty muu määrite kuin arvonimi.
toolkit definition: Terme, autre qu’un titre, associé à une personne. @fr
toolkit definition: Terme, diferent d’un títol, que s’associa amb una persona. @ca
toolkit definition: Tilføjelse, bortset fra en titel, der er knyttet til en persons navn. @da
toolkit definition: Un término diferente de un título que está asociado con el nombre de la persona. @es
toolkit definition: Ένας όρος άλλος από τον τίτλο, ο οποίος συνδέεται με τον όνομα ενός φυσικού προσώπου. @el
toolkit label: Sonstige zur Person gehörende Kennzeichnung @de
toolkit label: altra designació associada amb una persona @ca
toolkit label: annen betegnelse som forbindes med person @no
toolkit label: autre désignation associée à une personne @fr
toolkit label: forklarende tilføjelse til person @da
toolkit label: muu henkilöön liittyvä määrite
toolkit label: other designation associated with person (Deprecated) @en
toolkit label: otra designación asociada con la persona @es
toolkit label: személlyel kapcsolatos másik megjelölés @hu
toolkit label: övrig beteckning förknippad med personen @sv
toolkit label: άλλος προσδιορισμός συνδεδεμένος με το φυσικό πρόσωπο @el
has subproperty: P50108
lexical alias: otherDesignationAssociatedWithPerson.en
status: Deprecated
type: Property
domain: C10004
label: a pour autre désignation associée à une personne @fr
label: har forklarende tilføjelse til person @da
label: har övrig beteckning förknippad med personen @sv
label: has other designation associated with person (Deprecated) @en
label: hat sonstige zur Person gehörende Kennzeichnung @de
label: té com a altra designació associada amb una persona @ca
label: van személlyel kapcsolatos másik elnevezése @hu
label: έχει άλλον προσδιορισμό συνδεδεμένο με το φυσικό πρόσωπο @el
definition: Egy személyt hozzákapcsol egy kifejezéshez, ami nem cím, amely kötődik egy személy nevéhez. @hu
definition: Liittää henkilön henkilöön liitettyyn muuhun määritteeseen kuin arvonimeen.
definition: Met une personne en relation avec un terme, autre qu’un titre, associé à une personne. @fr
definition: Relaciona una persona amb un terme, diferent d’un títol, que s’associa amb el nom d’una persona. @ca
definition: Relaterer en person til en tilføjelse, bortset fra en titel, der er knyttet til en persons navn. @da
definition: Relates a person to a term other than a term of rank, honour, or office that is associated with a person. (Deprecated) @en
definition: Setzt eine Person mit einem Terminus, der kein Titel ist, der mit dem Namen einer Person in Verbindung steht, in Beziehung. @de
definition: Συνδέει ένα φυσικό πρόσωπο με έναν όρο άλλον από τον τίτλο, ο οποίος συνδέεται με το όνομα ενός φυσικού προσώπου. @el

asuinpaikka
has element type: 3
instruction number: 9.11
toolkit definition: A place where a person resides or has resided. @en
toolkit definition: Bir kişinin ikamet ettiği veya etmiş olduğu yer. @tr
toolkit definition: Een plaats waar een persoon woont of heeft gewoond. @nl
toolkit definition: Egy hely, ahol egy személy lakik vagy lakott. @hu
toolkit definition: Ein Geografikum, in dem eine Person wohnt oder gewohnt hat. @de
toolkit definition: Et sted hvor en person bor eller har bodd. @no
toolkit definition: Koht, kus isik elab või elas. @et
toolkit definition: Lieu où une personne réside ou a résidé. @fr
toolkit definition: Lloc on resideix o ha residit una persona. @ca
toolkit definition: Luogo dove una persona risiede o ha risieduto. @it
toolkit definition: Paikka, jossa henkilö asuu tai on asunut.
toolkit definition: Sted, hvor en person bor eller har boet. @da
toolkit definition: Un poblado, ciudad, provincia, estado y/o país en el que residió o ha residido una persona, u otro lugar significativo asociado con la persona diferente del lugar de nacimiento, fallecimiento o residencia (por ej., un lugar donde la persona ha trabajado o estudiado). @es
toolkit definition: Vieta, kurā persona dzīvo vai dzīvojusi. @lv
toolkit definition: Μια πόλη, επαρχία, πολιτεία/κράτος ή/και χώρα στην οποία ένα φυσικό πρόσωπο διαμένει ή έχει διαμείνει ή ένας άλλος σημαντικός τόπος συνδεδεμένος με ένα φυσικό πρόσωπο, άλλος από τον τόπο γέννησης, τον τόπο θανάτου ή διαμονής. @el
toolkit definition: مكان يقيم فيه شخص أو أقام فيه. @ar
toolkit definition: 一个个人居住或居住过的地点 @zh-hans
toolkit label: Wohnort @de
toolkit label: asuinpaikka
toolkit label: bostadsort @sv
toolkit label: bosted @no
toolkit label: elukoht @et
toolkit label: ikamet yeri @tr
toolkit label: lakóhely: @hu
toolkit label: lieu de résidence @fr
toolkit label: lloc de residència @ca
toolkit label: lugar de residencia @es
toolkit label: luogo di residenza @it
toolkit label: opholdssted @da
toolkit label: plaats van verblijf @nl
toolkit label: place of residence @en
toolkit label: uzturēšanās vieta @lv
toolkit label: τόπος κατοικίας @el
toolkit label: مكان الإقامة @ar
toolkit label: 居住地 @zh-hans
has subproperty: P50109
lexical alias: placeOfResidence.en
status: Published
type: Property
domain: C10004
label: a pour lieu de résidence @fr
label: elukoht @et
label: ha come luogo di residenza @it
label: har bostadsort @sv
label: har bosted @no
label: har opholdssted @da
label: has place of residence @en
label: hat Wohnort @de
label: heeft plaats van verblijf @nl
label: ikamet yeri ile ilişkilidir @tr
label: lakóhelye a következő: @hu
label: té com a lloc de residència @ca
label: uzturēšanās vieta @lv
label: έχει τόπο κατοικίας @el
label: له مكان إقامة @ar
label: 有居住地 @zh-hans
sub property of: henkilöön liittyvä paikka
alternative label: A hely, ahol egy személy dolgozott vagy tanult, szintén idetartozik. @hu
alternative label: Wohnort usw. @de
alternative label: asuinpaikka tms.
alternative label: bosted, etc. @no
alternative label: elukoht vms @et
alternative label: ikamet yeri vb. @tr
alternative label: lieu de résidence, etc. @fr
alternative label: lloc de residència, etc. @ca
alternative label: lugar de residencia, etc. @es
alternative label: luogo di residenza, etc. @it
alternative label: opholdssted ect. @da
alternative label: place of residence, etc. @en
alternative label: τόπος κατοικίας, κ.λπ. @el
alternative label: مكان الإقامة @ar
alternative label: 居住等的地点 @zh-hans
definition: Bir kişiyi, bir kişinin ikamet ettiği veya ikamet yeriyle ilişkilendirir. @tr
definition: Correla una persona a un luogo dove la persona risiede o ha risieduto. @it
definition: Hozzákapcsol egy személyt egy helyhez, ahol egy személy lakik vagy lakott. @hu
definition: Liittää henkilön paikkaan, jossa henkilö asuu tai on asunut.
definition: Met une personne en relation avec un lieu où une personne réside ou a résidé. @fr

henkilön arvonimi tai asema
has element type: 5
instruction number: 9.4
toolkit definition: A word or phrase indicative of royalty, nobility, rank, honour, or office, or a term of address for a person of religious vocation. @en
toolkit definition: Een woord of uitdrukking wijzend op koningschap, adel, kerkelijke rang of ambt, of een aanspreektitel voor een persoon met religieuze roeping. @nl
toolkit definition: Ein Wort oder eine Phrase, das/die auf die Zugehörigkeit zu einem Fürstentum, zum Adel, auf einen kirchlichen Rang oder ein kirchliches Amt hinweist, oder eine Anrede für eine Person mit religiöser Berufung. @de
toolkit definition: Et ord eller en frase som viser en persons tilknytning til kongehus, adel eller religiøse institusjoner, tiltaleform for en person med et religiøst virke. @no
toolkit definition: Kraliyet, asalet, dini rütbe veya makamı belirten bir kelime veya ifadeyi veya dini mesleği olan bir kişi için bir hitap terimi. @tr
toolkit definition: Mot ou locution qui indique la royauté, la noblesse, le rang, un honneur ou une fonction, ou terme de politesse pour une personne à vocation religieuse. @fr
toolkit definition: Ord eller udtryk, som indikerer kongeslægt, adelslægt, gejstlig rang eller embede, eller en tiltaleform for en person med religiøst hverv. @da
toolkit definition: Paraula o frase indicativa de reialesa, de noblesa, de rang, de distinció o de càrrec, o terme de tractament d’una persona de vocació religiosa. @ca
toolkit definition: Parola o frase indicativa di regalità, nobiltà, rango ecclesiastico o di posizione lavorativa, o un titolo per una persona di vocazione religiosa. @it
toolkit definition: Sana tai ilmaus, joka osoittaa kuninkaallista tai aatelisarvoa, kirkollista virkaa tai asemaa tai uskonnolliseen tehtävään liittyvää puhuttelua.
toolkit definition: Sõna või väljend, mis näitab kuninglikku seisust, aadliseisust, kiriklikku ametiastet või ametit, samuti kõnetlussõna, millega pöördutakse religioosse kutsumusega isiku poole. @et
toolkit definition: Una palabra o frase que indica realeza, nobleza o rango o cargo eclesiástico o un término de tratamiento de una persona de vocación religiosa. @es
toolkit definition: Vārds vai frāze, kas norāda uz karalisku vai aristokrātisku titulu, garīdznieka pakāpi vai amatu, vai uzrunas formu reliģiskas profesijas personai. @lv
toolkit definition: személy titulusa: @hu
toolkit definition: Μια λέξη ή φράση που υποδηλώνει βασιλεία, ευγένεια, εκκλησιαστικό αξίωμα ή ένας όρος προσφώνησης για ένα φυσικό πρόσωπο θρησκευτικού λειτουργήματος. @el
toolkit definition: كلمة أو عبارة تشير إلى رتبة ملكية أو نبالة أو منصب كنسي أو مصطلح يُخاطب به شخص له وظيفة دينية. @ar
toolkit definition: 表示皇室、贵族、教会级别或职位、或者一个宗教职业个人的称谓的一个单词或短语 @zh-hans
toolkit label: Egy királyi, nemesi, egyházi rangot vagy hivatalt jelentő szó vagy kifejezés, vagy egy személynek szóló vallási megszólítási forma. @hu
toolkit label: Rang-, Ehren- oder Amtsbezeichnung @de
toolkit label: betegnelse for rang, utmerkelse eller tjeneste @no
toolkit label: henkilön arvonimi tai asema
toolkit label: isiku tiitel @et
toolkit label: ranga, goda vai amata apzīmējums @lv
toolkit label: rütbe, onur veya görev unvanı @tr
toolkit label: term of rank or honour or office @en
toolkit label: term van rang, eer of ambt @nl
toolkit label: terme de rang o de distinció o de càrrec @ca
toolkit label: terme de rang ou d’honneur ou de fonction @fr
toolkit label: titel af rang, æresbevisning eller embede @da
toolkit label: titolo di rango, onore, o carica @it
toolkit label: título de la persona @es
toolkit label: όρος του βαθμού, του τίτλου τιμής ή του αξιώματος @el
toolkit label: مصطلح يدل على مكانة، أو شرف، أو منصب @ar
toolkit label: 登记或荣誉或职位的头衔 @zh-hans
has subproperty: P50110
lexical alias: termOfRankOrHonourOrOffice.en
status: Published
type: Property
domain: C10004
label: a pour terme de rang ou d’honneur ou de fonction @fr
label: ha come titolo di rango, onore o carica @it
label: har betegnelse for rang, utmerkelse eller tjeneste @no
label: har titel af rang, æresbevisning eller embede @da
label: has term of rank or honour or office @en
label: hat Rang-, Ehren- oder Amtsbezeichnung @de
label: heeft term van rang, eer of ambt @nl
label: isiku tiitel @et
label: ranga, goda vai amata apzīmējums @lv
label: rangot, hódolatot vagy hivatalt kifejező szava a következő: @hu
label: rütbe, onur veya makam ile ilişkilidir @tr
label: té com a terme de rang o de distinció o de càrrec @ca
label: έχει όρο του βαθμού, του τίτλου τιμής ή του αξιώματος @el
label: له لقب رتبة، أو شرف، أو منصب @ar
label: 有等级或荣誉或职位的头衔 @zh-hans
alternative label: A rang, megbecsülés vagy hivatali cím magában foglal tudományos fokozatot vagy szervezeti tagságot jelentő kezdőbetűket vagy rövidítéseket, és kizárja azokat a megszólító címeket, amelyek csak nemre vagy házassági státuszra utalnak, mint a Mr. vagy Mrs. @hu
alternative label: Titel einer Person @de
alternative label: henkilön arvonimi
alternative label: kişinin unvanı @tr
alternative label: terme de rang, d’honneur ou de fonction @fr
alternative label: titel af person @da
alternative label: title of person @en
alternative label: titolo di persona @it
alternative label: titre d’une personne @fr
alternative label: tittel på person @no
alternative label: títol d’una persona @ca
alternative label: título de persona @es
alternative label: τίτλος του φυσικού προσώπου @el
alternative label: لقب الشخص @ar
alternative label: 个人的头衔 @zh-hans
definition: Bir kişiyi, kraliyet, asalet, dini rütbe veya makama işaret eden bir kelime veya ifadeyle veya dini mesleği olan bir kişi için kullanılan bir hitap terimiyle ilişkilendirir. @tr
definition: Correla una persona a una parola o frase indicativa di regalità, nobiltà, rango ecclesiastico o di posizione lavorativa, o un titolo per una persona di vocazione religiosa. @it
definition: Hozzákapcsol egy személyt egy királyi, nemesi, egyházi rangot vagy hivatalt jelentő szóhoz vagy kifejezéshez, vagy egy személynek szóló vallási megszólítási formához, vagy egyéb rangot, hódolatot vagy hivatalt kifejező szóhoz. @hu
definition: Liittää henkilön sanaan tai ilmaukseen, joka osoittaa kuninkaallista tai aatelisarvoa, kirkollista virkaa tai asemaa tai uskonnolliseen tehtävään liittyvää puhuttelua.
definition: Met une personne en relation avec un mot ou une locution qui indique la royauté, la noblesse, le rang, un honneur ou une fonction, ou un terme de politesse pour une personne à vocation religieuse. @fr
definition: Relaciona una persona amb una paraula o frase indicativa de reialesa, de noblesa, de rang, de distinció o de càrrec, o terme de tractament d’una persona de vocació religiosa. @ca
definition: Relateert een persoon aan een woord of uitdrukking wijzend op koningschap, adel, kerkelijke rang of ambt, of een aanspreektitel voor een persoon met religieuze roeping. @nl
definition: Relaterer en person til Et ord eller en frase som viser en persons tilknytning til kongehus, adel eller religiøse institusjoner, tiltaleform for en person med et religiøst virke. @no

henkilön nimi
has element type: 3
instruction number: 9.2
toolkit definition: A nomen that is an appellation of person in natural language and phrasing used in common discourse. @en
toolkit definition: Denominazione di persona in linguaggio naturale e frasi usate nel discorso comune. @it
toolkit definition: Doğal dilde ve ortak söylemde kullanılan ifadelerde bir kişinin unvanı olan bir isim. @tr
toolkit definition: Een nomen dat is een benaming van persoon in natuurlijke taal en formulering gebruikt in alledaags taalgebruik. @nl
toolkit definition: Egy nomen, amely egy személy megnevezése természetes nyelven és közbeszédben használt kifejezéssel. @hu
toolkit definition: Eine Bezeichnung für eine Person in natürlicher Sprache und Ausdrucksweise, die beim normalen Sprechen und Schreiben verwendet wird. @de
toolkit definition: En betegnelse for person på et naturlig språk og med frasering brukt i alminnelig diskurs. @no
toolkit definition: Isiku nimetus loomulikus keeles ja sõnastuses, mida kasutatakse ühises diskursuses. @et
toolkit definition: Nomen que és una apel·lació de persona en llenguatge i frases naturals usada en el discurs comú. @ca
toolkit definition: Nomen qui est une appellation de personne exprimée dans un langage et une formulation naturels et utilisée dans le langage courant. @fr
toolkit definition: Nomen, joka on henkilöstä yleisessä diskurssissa käytetty nimitys, joka on luonnollisella kielellä ja luonnollisessa sanamuodossa.
toolkit definition: Nomen, som er en benævnelse på person på normalsprog og med formuleringer, som bruges alment. @da
toolkit definition: Personas apzīmējums dabiskajā valodā, ko izmanto savstarpējā saziņā. @lv
toolkit definition: Una palabra, carácter o grupo de palabras y/o caracteres mediante el cual se conoce una persona. @es
toolkit definition: Μια λέξη, φράση, χαρακτήρας ή ομάδα λέξεων ή/και χαρακτήρων με τους οποίους είναι γνωστό ένα φυσικό πρόσωπο. @el
toolkit definition: تسمية شخص في اللغة الطبيعية وفي العبارات المستخدمة في الخطاب العام. @ar
toolkit definition: 作为用自然语言和普通话语措词表达的个人的称谓的一个命名 @zh-hans
toolkit label: Name einer Person @de
toolkit label: henkilön nimi
toolkit label: isiku nimi @et
toolkit label: kişinin adı @tr
toolkit label: naam van persoon @nl
toolkit label: name of person @en
toolkit label: navn på person @da
toolkit label: nom de persona @ca
toolkit label: nom de personne @fr
toolkit label: nombre de la persona @es
toolkit label: nome di persona @it
toolkit label: personas vārds @lv
toolkit label: personnamn @sv
toolkit label: personnavn @no
toolkit label: személynév: @hu
toolkit label: όνομα του φυσικού προσώπου @el
toolkit label: اسم شخص @ar
toolkit label: 个人的名称 @zh-hans
has subproperty: henkilön varianttinimi
has subproperty: nimen täydellisempi muoto
has subproperty: henkilön ensisijainen nimi
has subproperty: sukunimi
has subproperty: etunimi
has subproperty: P50111
lexical alias: nameOfPerson.en
status: Published
type: Property
domain: C10004
label: a pour nom de personne @fr
label: ha come nome di persona @it
label: har navn på person @da
label: har personnamn @sv
label: har personnavn @no
label: has name of person @en
label: hat Namen einer Person @de
label: heeft naam van persoon @nl
label: isiku nimi @et
label: kişinin adı ile ilişkilidir @tr
label: personas vārds @lv
label: személy neve a következő: @hu
label: té com a nom de persona @ca
label: έχει όνομα του φυσικού προσώπου @el
label: له اسم شخص @ar
label: 有个人的名称 @zh-hans
sub property of: henkilön nimitys
sub property of: toimijan nimi
definition: Bir kişiyi, doğal dilde ve ortak söylemde kullanılan ifadelerde bir kişi unvanı olan bir isimle ilişkilendirir. @tr
definition: Correla una persona a una denominazione di persona in linguaggio naturale e frasi usate nel discorso comune. @it
definition: Hozzákapcsol egy személyt egy nomenhez, amely egy személy megnevezése természetes nyelven és közbeszédben használt kifejezéssel. @hu
definition: Liittää henkilön nomeniin, joka on luonnollisella kielellä ja sanamuodolla oleva, yleisessä diskurssissa käytetty nimitys henkilöstä.
definition: Met une personne en relation avec un nomen qui est une appellation de personne exprimée dans un langage et une formulation naturels et utilisée dans le langage courant. @fr
definition: Relaciona una persona amb un nomen que és una apel·lació de persona en llenguatge i frases naturals usada en el discurs comú. @ca
definition: Relateert een persoon aan een nomen dat is een benaming van persoon in natuurlijke taal en formulering gebruikt in alledaags taalgebruik. @nl
definition: Relaterer en person til en betegnelse for person på et naturlig språk og med frasering brukt i alminnelig diskurs. @no
definition: Relaterer en person til et nomen, som er en benævnelse på person på normalsprog og med formuleringer, som bruges alment. @da
definition: Relates a person to a nomen that is an appellation of person in natural language and phrasing used in common discourse. @en
definition: Sasaista personu ar nomenu, kas ir personas apzīmējums dabiskajā valodā, ko izmanto savstarpējā saziņā. @lv
definition: Seostab isiku isiku nimetusega loomulikus keeles ja sõnastuses, mida kasutatakse ühises diskursuses. @et
definition: Setzt eine Person in Beziehung zu einer Bezeichnung für eine Person in natürlicher Sprache und Ausdrucksweise, die beim normalen Sprechen und Schreiben verwendet wird. @de
definition: Συνδέει ένα φυσικό πρόσωπο με μια ονομασία του φυσικού προσώπου σε φυσική γλώσσα και διατύπωση που χρησιμοποιείται στον καθημερινό διάλογο. @el

henkilön perustama yhteisö
has element type: 2
instruction number: 29.5
toolkit definition: A corporate body who is initiated by a person. @en
toolkit definition: Asutus, millele isik on aluse pannud. @et
toolkit definition: Bir kişi tarafından kurulan bir tüzel kişilik @tr
toolkit definition: Collectivité qui est établie par une personne. @fr
toolkit definition: Een corporatie die is gesticht door een persoon. @nl
toolkit definition: Egy testület, amelynek létrehozását egy személy kezdeményezte. @hu
toolkit definition: Eine Körperschaft, die von einer Person gegründet wurde. @de
toolkit definition: En korporasjon som er opprettet av en person. @no
toolkit definition: Ente fondato da una persona @it
toolkit definition: Entitat corporativa que és iniciada per una persona. @ca
toolkit definition: Institūcija, ko dibinājusi persona. @lv
toolkit definition: Korporation, som er igangsat af en person. @da
toolkit definition: Una organización que la persona fundó. @es
toolkit definition: Yhteisö, jonka henkilö on perustanut.
toolkit definition: Ένας οργανισμός που ίδρυσε ένα φυσικό πρόσωπο. @el
toolkit definition: هيئة بادر بتأسيسها شخص. @ar
toolkit definition: 被一个个人发起的一个团体 @zh-hans
toolkit label: collectivité fondée d’une personne @fr
toolkit label: ente fondato di persona @it
toolkit label: entidad corporativa fundada @es
toolkit label: entitat corporativa fundada per una persona @ca
toolkit label: founded corporate body of person @en
toolkit label: henkilön perustama yhteisö
toolkit label: isiku asutatud asutus @et
toolkit label: kişi tarafından kurulan tüzel kişi @tr
toolkit label: korporasjon grunnlagt av person @no
toolkit label: korporation grundlagt af person @da
toolkit label: opgerichte corporatie van persoon @nl
toolkit label: personas dibinātā institūcija @lv
toolkit label: személy által alapított testület: @hu
toolkit label: von einer Person gegründete Körperschaft @de
toolkit label: ιδρυθέν συλλογικό όργανο του φυσικού προσώπου @el
toolkit label: أسس هيئة من شخص @ar
toolkit label: 个人的被创办的团体 @zh-hans
has subproperty: P50112
lexical alias: foundedCorporateBodyOfPerson.en
status: Published
type: Property
domain: C10004
label: a pour collectivité fondée d’une personne @fr
label: ha come ente fondato di persona @it
label: har korporasjon grunnlagt av person @no
label: har korporation grundlagt af person @da
label: has founded corporate body of person @en
label: hat von einer Person gegründete Körperschaft @de
label: heeft opgerichte corporatie van persoon @nl
label: isiku asutatud asutus @et
label: kişinin kurduğu tüzel kişi ile ilişkilidir @tr
label: personas dibinātā institūcija @lv
label: személy által alapított testület a következő: @hu
label: té com a entitat corporativa fundada per una persona @ca
label: έχει ιδρυθέν συλλογικό όργανο του φυσικού προσώπου @el
label: أسس هيئة لشخص @ar
label: 有个人的被创办的团体 @zh-hans
sub property of: henkilöön liittyvä yhteisö
sub property of: toimijan perustama yhteisö
definition: Bir kişiyi, bir kişi tarafından kurulan bir tüzel kişilikle İlişkilendirir. @tr
definition: Correla una persona a un ente fondato da una persona @it
definition: Hozzákapcsol egy személyt egy testülethez, amelynek létrehozását egy személy kezdeményezte. @hu
definition: Liittää henkilön yhteisöön, jonka henkilö on perustanut.
definition: Met une personne en relation avec une collectivité qui est établie par une personne. @fr
definition: Relaciona una persona amb una entitat corporativa que és iniciada per una persona. @ca
definition: Relateert een persoon aan een corporatie die is gesticht door een persoon. @nl
definition: Relaterer en person til en korporasjon som er opprettet av en person. @no
definition: Relaterer en person til en korporation, som er igangsat af en person. @da
definition: Relates a person to a corporate body who is initiated by a person. @en
definition: Sasaista personu ar institūciju, ko dibinājusi persona. @lv
definition: Seostab isiku asutusega, millele isik on aluse pannud. @et
definition: Setzt eine Person in Beziehung zu einer Körperschaft, die von einer Person gegründet wurde. @de
definition: Συνδέει ένα φυσικό πρόσωπο με έναν οργανισμό που ίδρυσε ένα φυσικό πρόσωπο. @el
definition: يربط شخصا بهيئة بادر بتأسيسها شخص. @ar
definition: 将一个个人与被一个个人发起的一个团体关联起来。 @zh-hans

elämäkerralliset tiedot
has element type: 6
instruction number: 9.17
toolkit definition: A summary of information about the life or history of a person. @en
toolkit definition: Bir kişinin hayatı veya geçmişi hakkındaki bilgilerin özeti @tr
toolkit definition: Een samenvatting van informatie over het leven of de geschiedenis van een persoon. @nl
toolkit definition: Egy személy életéről vagy történetéről szóló információk összefoglalása. @hu
toolkit definition: Et sammendrag av informasjon om en persons liv eller historie. @no
toolkit definition: Henkilöön liittyvä elämäkerrallinen tieto.
toolkit definition: Información perteneciente a la vida o historia de una persona. @es
toolkit definition: Informationen über das Leben oder die Geschichte einer Person. @de
toolkit definition: Informācijas kopums par personas dzīvi vai vēsturi. @lv
toolkit definition: Kokkuvõtlik info isiku elust. @et
toolkit definition: Opsummering af oplysninger om en persons liv eller historie. @da
toolkit definition: Resum de la informació sobre la vida o la història d’una persona. @ca
toolkit definition: Résumé d’informations sur la vie ou l’histoire d’une personne. @fr
toolkit definition: Sommario di informazioni sulla vita o la storia di una persona. @it
toolkit definition: Μια συνοπτική πληροφόρηση αναφορικά με τη ζωή ή ιστορία ενός φυσικού προσώπου. @el
toolkit definition: ملخص معلومات عن حياة أو تاريخ شخص. @ar
toolkit definition: 关于一个个人的生平或历史的信息提要 @zh-hans
toolkit label: Biografische Angaben @de
toolkit label: biografische informatie @nl
toolkit label: biografisk informasjon @no
toolkit label: biografisk information @sv
toolkit label: biografisk oplysning @da
toolkit label: biographical information @en
toolkit label: biogrāfiska informācija @lv
toolkit label: biyografik bilgi @tr
toolkit label: eluloolised andmed @et
toolkit label: elämäkerralliset tiedot
toolkit label: informació biogràfica @ca
toolkit label: información biográfica @es
toolkit label: information biographique @fr
toolkit label: nota biografica @it
toolkit label: életrajzi információ: @hu
toolkit label: βιογραφική πληροφορία @el
toolkit label: معلومات السيرة الذاتية @ar
toolkit label: 传记信息 @zh-hans
has subproperty: P50113
lexical alias: biographicalInformation.en
status: Published
type: Property
domain: C10004
label: a pour information biographique @fr
label: biogrāfiska informācija @lv
label: biyografik bilgi ile ilişkilidir @tr
label: eluloolised andmed @et
label: ha come nota biografica @it
label: har biografisk informasjon @no
label: har biografisk information @sv
label: har biografisk oplysning @da
label: has biographical information @en
label: hat biografische Angaben @de
label: heeft biografische informatie @nl
label: té com a informació biogràfica @ca
label: életrajzi információja a következő: @hu
label: έχει βιογραφική πληροφορία @el
label: له معلومات السيرة الذاتية @ar
label: 有传记信息 @zh-hans
definition: Bir kişiyi, bir kişinin yaşamı veya geçmişi hakkındaki bilgilerin bir özetiyle ilişkilendirir. @tr
definition: Correla una persona a un sommario di informazioni sulla vita o la storia di una persona. @it
definition: Hozzákapcsol egy személyt egy személy történetéről szóló információk összefoglalásához. @hu
definition: Liittää henkilön elämäkerralliseen tietoon henkilöstä.
definition: Met une personne en relation avec un résumé d’informations sur la vie ou l’histoire d’une personne. @fr
definition: Relaciona una persona amb un resum de la informació sobre la vida o la història d’una persona. @ca
definition: Relateert een persoon aan een samenvatting van informatie over het leven of de geschiedenis van een persoon. @nl
definition: Relaterer en person til en opsummering af oplysninger om en persons liv eller historie. @da
definition: Relaterer en person til et sammendrag av informasjon om en persons liv eller historie. @no
definition: Relates a person to a summary of information about the life or history of a person. @en
definition: Sasaista personu ar informācijas kopumu par personas dzīvi vai vēsturi. @lv
definition: Seostab isiku kokkuvõtliku infoga isiku elust. @et
definition: Setzt eine Person in Beziehung zu Informationen über das Leben oder die Geschichte einer Person. @de
definition: Συνδέει ένα φυσικό πρόσωπο με μια συνοπτική πληροφόρηση αναφορικά με τη ζωή ή την ιστορία ενός φυσικού προσώπου. @el
definition: يربط شخصا بمعلومات موجزة عن حياة أو تاريخ شخص. @ar
definition: 将一个个人与关于一个个人的生平或历史的信息提要关联起来。 @zh-hans

henkilön osoite
has element type: 6
instruction number: 9.12
toolkit definition: Adresse d’une personne. @fr
toolkit definition: Adresse på en person. @da
toolkit definition: Adreça d’una persona. @ca
toolkit definition: An address of a person. @en
toolkit definition: Bir kişinin adresi @tr
toolkit definition: Een adres van een persoon. @nl
toolkit definition: Egy személy címe. @hu
toolkit definition: Eine Adresse einer Person. @de
toolkit definition: En persons adresse. @no
toolkit definition: Henkilön osoite.
toolkit definition: Indirizzo di una persona. @it
toolkit definition: Isiku aadress. @et
toolkit definition: La dirección de una persona. @es
toolkit definition: Personas adrese. @lv
toolkit definition: Η διεύθυνση ενός φυσικού προσώπου. @el
toolkit definition: عنوان مراسلة شخص. @ar
toolkit definition: 一个个人的一个地址 @zh-hans
toolkit label: Adresse einer Person @de
toolkit label: Kişinin adresi @tr
toolkit label: address of person @en
toolkit label: adres van persoon @nl
toolkit label: adresse d’une personne @fr
toolkit label: adresse for person @no
toolkit label: adresse på person @da
toolkit label: adreça d’una persona @ca
toolkit label: dirección de la persona @es
toolkit label: henkilön osoite
toolkit label: indirizzo di persona @it
toolkit label: isiku aadress @et
toolkit label: personas adrese @lv
toolkit label: személy címe: @hu
toolkit label: διεύθυνση του φυσικού προσώπου @el
toolkit label: عنوان مراسلة شخص @ar
toolkit label: 个人的地址 @zh-hans
has subproperty: P50114
lexical alias: addressOfPerson.en
status: Published
type: Property
domain: C10004
label: a pour adresse d’une personne @fr
label: ha come indirizzo di persona @it
label: har adresse for person @no
label: har adresse på person @da
label: has address of person @en
label: hat Adresse einer Person @de
label: heeft adres van persoon @nl
label: isiku aadress @et
label: kişinin adresi ile ilişkilidir @tr
label: personas adrese @lv
label: személy címe a következő: @hu
label: té com a adreça d’una persona @ca
label: έχει διεύθυνση του φυσικού προσώπου @el
label: له عنوان مراسلة شخص @ar
label: 有个人的地址 @zh-hans
sub property of: toimijan osoite
definition: Bir kişiyi, kişinin adresiyle ilişkilendirir. @tr
definition: Correla una persona a un indirizzo di una persona. @it
definition: Hozzákapcsol egy személyt egy személy címéhez. @hu
definition: Liittää henkilön hänen osoitteeseensa.
definition: Met une personne en relation avec une adresse d’une personne. @fr
definition: Relaciona una persona amb una adreça d’una persona. @ca
definition: Relateert een persoon aan een adres van een persoon. @nl
definition: Relaterer en person til en adresse på en person. @da
definition: Relaterer en person til en persons adresse. @no
definition: Relates a person to an address of a person. @en
definition: Sasaista personu ar personas adresi. @lv
definition: Seostab isiku isiku aadressiga. @et
definition: Setzt eine Person in Beziehung zu einer Adresse einer Person. @de
definition: Συνδέει ένα φυσικό πρόσωπο με τη διεύθυνση ενός φυσικού προσώπου. R @el
definition: يربط شخصا بعنوان مراسلة شخص. @ar
definition: 将一个个人与一个个人的一个地址关联起来。 @zh-hans
scope note: Comprend une adresse de courrier électronique ou une autre adresse en ligne. @fr
scope note: Comprende un indirizzo email o un altro indirizzo online @it
scope note: Darunter fallen E-Mail-Adressen oder andere Online-Adressen. @de
scope note: Email vagy más online cím is idetartozik. @hu
scope note: Hõlmab ka e-posti vm võrguaadressi. @et
scope note: Ietver e-pastu vai citu tiešsaistes adresi. @lv

nimen täydellisempi muoto
has element type: 3
instruction number: 9.5
toolkit definition: A nomen that is a name of person that includes the fuller form of a name or part of a name represented by an initial, abbreviation, or shortened or otherwise modified form. @en
toolkit definition: Bir ismin tam halini veya bir ismin baş harfiyle, kısaltmasıyla veya kısaltılmış ya da başka bir şekilde değiştirilmiş haliyle temsil edilen bir kısmını içeren bir kişi ismi @tr
toolkit definition: Een nomen dat is een naam van persoon die omvat de meer volledige vorm van een naam of deel van een naam vertegenwoordigd door een initiaal, afkorting of verkorte of anderszins aangepaste vorm. @nl
toolkit definition: Egy személynév nomen, amelynek van egy teljesebb névformája, vagy nevének egy részét egy kezdőbetű, rövidítés vagy rövidített, illetve más módosító forma reprezentálja. @hu
toolkit definition: Ein Name einer Person, der die vollständige Form oder einen Teil eines Namens enthält, der nur durch eine Initiale, eine Abkürzung oder sonst irgendwie gekürzte oder anderweitig veränderte Form dargestellt wird. @de
toolkit definition: Et navn på person som inkluderer den fullstendige formen av en del av et navn som er representert med bare initialer, forkortelser eller på en annen modifisert form. @no
toolkit definition: Isiku nimi, mis sisaldab nime täielikumat vormi või seda osa nimest, mis on esitatud initsiaalina, lühendina või lühendatud või muul viisil muudetud vormina. @et
toolkit definition: La forma completa de una parte de un nombre representado solo por una inicial o abreviatura en la forma escogida como el nombre preferido, o una parte del nombre no incluida en la forma elegida como el nombre preferido. @es
toolkit definition: Nome di persona che include la forma completa di un nome o parte di un nome rappresentato da un'iniziale, abbreviazione, o una forma accorciata o modificata in altro modo. @it
toolkit definition: Nomen que és un nom de persona que inclou la forma més completa d’un nom o d’una part d’un nom representat per una inicial, una abreviació o una forma escurçada o modificada altrament. @ca
toolkit definition: Nomen qui est un nom de personne comportant la forme développée d’un nom ou d’une partie d’un nom représentée par une initiale ou une abréviation ou bien présentée sous une forme raccourcie ou autrement modifiée. @fr
toolkit definition: Nomen, joka on henkilön nimi, joka sisältää täydellisemmän muodon nimestä tai nimen osasta, joka on esitetty alkukirjaimella, lyhenteellä tai muuten lyhennetyssä tai muunnetussa muodossa.
toolkit definition: Nomen, som er et navn på person, som inkluderer en mere fuldstændig navneform eller del af et navn repræsenteret af et initial, forkortelse eller lignende tilpasninger. @da
toolkit definition: Personas vārds, kas ietver pilnīgāku vārda formu vai nosaukuma daļu, ko attēlo ar iniciāli, abreviatūru vai saīsinājumu, vai citādi pārveidotu formu. @lv
toolkit definition: Ένα όνομα ή ονόματα που συνδέονται με ένα φυσικό πρόσωπο, το οποίο ή τα οποία περιλαμβάνουν την πληρέστερη μορφή μέρους ενός οποιουδήποτε ονόματος που αναπαρίσταται μόνο από ένα αρχικό, συντομογραφία ή σύντμηση ή διαφορετικά τροποποιημένη παραλλαγή της μορφής που έχει επιλεγεί ω το προτιμώμενο όνομα ή/και μέρος του ονόματος, η οποία δεν περιλαμβάνεται στη μορφή που έχει επιλεγεί ως το προτιμώμενο όνομα. @el
toolkit definition: تسمية هي اسم شخص يتضمن صيغة أكمل لاسم، أو لجزء من اسم يُعبر عنه بالأحرف الأولى، أو مختصرا، أو مختزلا، أو معدلا بأي صورة أخرى . @ar
toolkit definition: 一个作为个人名称（包括名称的完整形式或由首字母缩写、缩略或缩短或其他修改形式的名称部分）的命名 @zh-hans
toolkit label: Vollständigere Namensform @de
toolkit label: forma completa di nome @it
toolkit label: forma más completa del nombre @es
toolkit label: forma més completa d’un nom @ca
toolkit label: forme développée du nom @fr
toolkit label: fuller form of name @en
toolkit label: fullständig namnform @sv
toolkit label: ismin tam hali @tr
toolkit label: meer volledige vorm van naam @nl
toolkit label: mer fullstendig navneform @no
toolkit label: mere fuldstændig navneform @da
toolkit label: nimen täydellisempi muoto
toolkit label: personvārda pilnīgāka forma @lv
toolkit label: teljesebb névforma: @hu
toolkit label: täielikum nimevorm @et
toolkit label: πληρέστερη μορφή του ονόματος @el
toolkit label: صيغة أكمل للاسم @ar
toolkit label: 名称的完整形式 @zh-hans
has subproperty: P50115
lexical alias: fullerFormOfName.en
status: Published
type: Property
domain: C10004
label: a pour forme développée du nom @fr
label: ha come forma completa di nome @it
label: har fullständig namnform @sv
label: har mer fullstendig navneform @no
label: har mere fuldstændig navneform @da
label: has fuller form of name @en
label: hat vollständigere Namensform @de
label: heeft meer volledige vorm van naam @nl
label: ismin tam hali ile ilişkilidir @tr
label: personvārda pilnīgāka forma @lv
label: teljesebb névformája a következő: @hu
label: täielikum nimevorm @et
label: té com a forma més completa d’un nom @ca
label: έχει πληρέστερη μορφή του ονόματος @el
label: له صيغة أكمل لاسم @ar
label: 有名称的完整形式 @zh-hans
sub property of: henkilön nimi
definition: Bir kişiyi, bir ismin tam halini veya bir ismin baş harfiyle, kısaltmasıyla veya kısaltılmış ya da başka bir şekilde değiştirilmiş haliyle temsil edilen bir kısmını içeren bir isimle ilişkilendirir. @tr
definition: Correla una persona a un nome di persona che include la forma completa di un nome o parte di un nome rappresentato da un'iniziale, abbreviazione, o una forma accorciata o modificata in altro modo. @it
definition: Hozzákapcsol egy személyt egy személynév nomenhez, amelynek van egy teljesebb névformája, vagy nevének egy részét egy kezdőbetű, rövidítés vagy rövidített, illetve más módosító forma reprezentálja. @hu
definition: Liittää henkilön nomeniin, joka on henkilön nimi, joka sisältää täydellisemmän muodon nimestä tai nimen osasta, joka on esitetty alkukirjaimella, lyhenteellä tai muuten lyhennetyssä tai muunnetussa muodossa.
definition: Met une personne en relation avec un nomen qui est un nom de personne comportant la forme développée d’un nom ou d’une partie d’un nom représentée par une initiale ou une abréviation ou bien présentée sous une forme raccourcie ou autrement modifiée. @fr
definition: Relaciona una persona amb un nomen que és un nom de persona que inclou la forma més completa d’un nom o d’una part d’un nom representat per una inicial, una abreviació o una forma escurçada o modificada altrament. @ca
definition: Relateert een persoon aan een nomen dat is een naam van persoon die omvat de meer volledige vorm van een naam of deel van een naam vertegenwoordigd door een initiaal, afkorting of verkorte of anderszins aangepaste vorm. @nl
definition: Relaterer en person til et navn på person som inkluderer den fullstendige formen av en del av et navn som er representert med bare initialer, forkortelser eller på en annen modifisert form. @no
definition: Relaterer en person til et nomen, som er et navn på person, som inkluderer en mere fuldstændig navneform eller del af et navn repræsenteret af et initial, forkortelse eller lignende tilpasninger. @da
definition: Relates a person to a nomen that is a name of person that includes the fuller form of a name or part of a name represented by an initial, abbreviation, or shortened or otherwise modified form. @en
definition: Sasaista personu ar nomenu, kas ir personas vārds, kas ietver pilnīgāku vārda formu vai nosaukuma daļu, ko attēlo ar iniciāli, abreviatūru vai saīsinājumu, vai citādi pārveidotu formu. @lv
definition: Seostab isiku isiku nimega, mis sisaldab nime täielikumat vormi või seda osa nimest, mis on esitatud initsiaalina, lühendina või lühendatud või muul viisil muudetud vormina. @et
definition: Setzt eine Person in Beziehung zu einem Namen einer Person, der die vollständige Form oder einen Teil eines Namens enthält, der nur durch eine Initiale, eine Abkürzung oder sonst irgendwie gekürzte oder anderweitig veränderte Form dargestellt wird. @de
definition: Συνδέει ένα φυσικό πρόσωπο με ένα όνομα ή ονόματα που συνδέονται με ένα φυσικό πρόσωπο, το οποίο ή τα οποία περιλαμβάνουν την πληρέστερη μορφή μέρους ενός οποιουδήποτε ονόματος που αναπαρίσταται μόνο από ένα αρχικό, συντομογραφία ή σύντμηση ή διαφορετικά τροποποιημένη παραλλαγή της μορφής που έχει επιλεγεί ω το προτιμώμενο όνομα ή/και μέρος του ονόματος, η οποία δεν περιλαμβάνεται στη μορφή που έχει επιλεγεί ως το προτιμώμενο όνομα. @el
definition: يربط شخصا بتسمية هي اسم شخص عبارة عن الصيغة الأكمل لاسم، أو لجزء من اسم، ويُعبر عنه بالأحرف الأولى، أو مختصرا، أو مختزلا، أو معدلا بأي صورة أخرى . @ar
definition: 将一个个人与一个作为个人名称（包括名称的完整形式或由首字母缩写、缩略或缩短或其他修改形式的名称部分）的命名关联起来。 @zh-hans

sukupuoli
has element type: 5
instruction number: 9.7
toolkit definition: A gender with which a person identifies. @en
toolkit definition: Bir kişinin kendini tanımladığı cinsiyet. @tr
toolkit definition: Dzimums, ar kuru persona sevi identificē. @lv
toolkit definition: Een gender waarmee een persoon zich identificeert. @nl
toolkit definition: Egy nem, amellyel egy személy azonosul. @hu
toolkit definition: Ein Geschlecht, mit dem sich eine Person identifiziert. @de
toolkit definition: El género con el que se identifica la persona. @es
toolkit definition: Et kjønn som en person identifiserer seg med. @no
toolkit definition: Genere con il quale una persona si identifica. @it
toolkit definition: Genre auquel une personne s’identifie. @fr
toolkit definition: Køn, som en person identificerer sig med. @da
toolkit definition: Sexe amb el qual s’identifica una persona. @ca
toolkit definition: Sugu, millega isik end identifitseerib. @et
toolkit definition: Sukupuoli, jota henkilö kokee edustavansa.
toolkit definition: Ένα γένος με το οποίο ένα φυσικό πρόσωπο ταυτίζεται. @el
toolkit definition: نوع جنس يُعرف به شخص. @ar
toolkit definition: 一个个人所识别的性别 @zh-hans
toolkit label: Geschlecht @de
toolkit label: cinsiyet @tr
toolkit label: dzimums @lv
toolkit label: gender @en
toolkit label: genere @it
toolkit label: genre @fr
toolkit label: género @es
toolkit label: kjønn @no
toolkit label: kön @sv
toolkit label: køn @da
toolkit label: nem: @hu
toolkit label: sexe @ca
toolkit label: sugu @et
toolkit label: sukupuoli
toolkit label: φύλο @el
toolkit label: نوع الجنس @ar
toolkit label: 性别 @zh-hans
has subproperty: P50116
lexical alias: gender.en
status: Published
type: Property
domain: C10004
label: a pour genre @fr
label: cinsiyet ile ilişkilidir @tr
label: dzimums @lv
label: ha come genere @it
label: har kjønn @no
label: har kön @sv
label: har køn @da
label: has gender @en
label: hat Geschlecht @de
label: heeft gender @nl
label: neme a következő: @hu
label: sugu @et
label: té com a sexe @ca
label: έχει φύλο @el
label: له نوع جنس @ar
label: 有性别 @zh-hans
definition: Bir kişiyi, kişinin kendini tanımladığı bir cinsiyetle ilişkilendirir. @tr
definition: Correla una persona a un genere con il quale una persona si identifica. @it
definition: Hozzákapcsol egy személyt egy nemhez, amellyel egy személy azonosul. @hu
definition: Liittää henkilön sukupuoleen, jota henkilö kokee edustavansa.
definition: Met une personne en relation avec un genre auquel une personne s’identifie. @fr
definition: Relaciona una persona amb un sexe amb el qual s’identifica una persona. @ca
definition: Relateert een persoon aan een gender waarmee een persoon zich identificeert. @nl
definition: Relaterer en person til et kjønn som en person identifiserer seg med. @no
definition: Relaterer en person til et køn, som en person identificerer sig med. @da
definition: Relates a person to a gender with which a person identifies. @en
definition: Sasaista personu ar dzimumu, ar kuru persona sevi identificē. @lv
definition: Seostab isiku sooga, millega isik end identifitseerib. @et
definition: Setzt eine Person in Beziehung zu einem Geschlecht, mit dem sich eine Person identifiziert. @de
definition: Συνδέει ένα φυσικό πρόσωπο με το γένος με το οποίο ένα φυσικό πρόσωπο ταυτίζεται. @el
definition: يربط شخصا بنوع جنس يُعرف به شخص. @ar
definition: 将一个个人与一个个人所识别的性别关联起来。 @zh-hans

henkilön ensisijainen nimi
has element type: 3
instruction number: 9.2.2
toolkit definition: A nomen that is a name of person that is selected for preference in a specific application or context. @en
toolkit definition: Belirli bir uygulamada veya bağlamda tercih için seçilen kişi adı olan bir isim. @tr
toolkit definition: Een nomen dat is een naam van persoon die de voorkeur heeft gekregen in een specifieke applicatie of context. @nl
toolkit definition: Egy személynév nomen, amelyet egy bizonyos alkalmazásban vagy kontextusban előnyben részesítenek. @hu
toolkit definition: Ein Name einer Person, der in einer bestimmten Anwendung oder in einem bestimmten Kontext als Vorzugsform bestimmt wird. @de
toolkit definition: El nombre o forma del nombre elegido para identificar la persona. @es
toolkit definition: Et navn på person som er valgt som preferanse i en bestemt applikasjon eller kontekst. @no
toolkit definition: Isiku nimi, mis kindlas rakenduses või kontekstis on valitud eelistatuks. @et
toolkit definition: Nome scelto come preferito in una specifica applicazione o contesto. @it
toolkit definition: Nomen que és un nom de persona que se selecciona com a preferent en una aplicació o un context específic. @ca
toolkit definition: Nomen qui est un nom de personne faisant l’objet d’un choix privilégié dans une application ou un contexte spécifiques. @fr
toolkit definition: Nomen, joka on henkilön nimi, joka on valittu ensisijaiseksi tietyssä sovelluksessa tai kontekstissa.
toolkit definition: Nomen, som er et navn på person, som er valgt som foretrukken i en specifik anvendelse eller kontekst. @da
toolkit definition: Personas vārds, kurš ir izvēlēts noteiktam lietojumam vai noteiktā kontekstā. @lv
toolkit definition: Ένα όνομα ή μορφή ονόματος που επιλέγεται για την ταύτιση ενός φυσικού προσώπου. @el
toolkit definition: يربط شخصا باسم اختير كاسم مفضل في تطبيق أو في سياق محدد. @ar
toolkit definition: 一个作为个人名称并在特定应用或语境下优先选用的命名 @zh-hans
toolkit label: Bevorzugter Name einer Person @de
toolkit label: foretrukket navn på person @da
toolkit label: foretrukket personnavn @no
toolkit label: geprefereerde naam van persoon @nl
toolkit label: henkilön ensisijainen nimi
toolkit label: isiku eelisnimi @et
toolkit label: kişinin tercih ettiği isim @tr
toolkit label: nom preferit de persona @ca
toolkit label: nom privilégié d’une personne @fr
toolkit label: nombre preferido de la persona @es
toolkit label: nome preferito di persona @it
toolkit label: personas prioritārais vārds @lv
toolkit label: preferred name of person @en
toolkit label: személy előnyben részesített neve: @hu
toolkit label: προτιμώμενο όνομα του φυσικού προσώπου @el
toolkit label: اسم مفضل لشخص @ar
toolkit label: 个人的首选名称 @zh-hans
has subproperty: P50117
lexical alias: preferredNameOfPerson.en
status: Published
type: Property
domain: C10004
label: a pour nom privilégié d’une personne @fr
label: ha come nome preferito di persona @it
label: har foretrukket navn på person @da
label: har foretrukket personnavn @no
label: has preferred name of person @en
label: hat bevorzugten Namen einer Person @de
label: heeft geprefereerde naam van persoon @nl
label: isiku eelisnimi @et
label: personas prioritārais vārds @lv
label: személy előnyben részesített neve a következő: @hu
label: tercih edilen kişi adı ile ilişkilidir @tr
label: té com a nom preferit de persona @ca
label: έχει προτιμώμενο όνομα του φυσικού προσώπου @el
label: له اسم مفضل لشخص @ar
label: 有个人的首选名称 @zh-hans
sub property of: henkilön nimi
sub property of: toimijan ensisijainen nimi
alternative label: -
alternative label: Bevorzugter Name für eine Person @de
alternative label: előnyben részesített személynév: @hu
alternative label: foretrukket navn på person @da
alternative label: kişinin tercih ettiği isim @tr
alternative label: nombre preferido para persona @es
alternative label: preferred name for person @en
alternative label: اسم مفضل لشخص @ar
alternative label: 给个人的首选名称 @zh-hans
definition: Bir kişiyi, özel uygulama veya bağlamda tercih edilmek üzere seçilen bir kişi ismiyle ilişkilendirir. @tr
definition: Correla una persona a un nome scelto come preferito in una specifica applicazione o contesto. @it
definition: Hozzákapcsol egy személyt egy személynév nomenhez, amelyet egy bizonyos alkalmazásban vagy kontextusban előnyben részesítenek. @hu
definition: Liittää henkilön nomeniin, joka on henkilön nimi, joka on valittu ensisijaiseksi tietyssä sovelluksessa tai kontekstissa.
definition: Met une personne en relation avec un nomen qui est un nom de personne faisant l’objet d’un choix privilégié dans une application ou un contexte spécifiques. @fr
definition: Relaciona una persona amb un nomen que és un nom de persona que se selecciona com a preferent en una aplicació o un context específic. @ca
definition: Relateert een persoon aan een nomen dat is een naam van persoon die de voorkeur heeft gekregen in een specifieke applicatie of context. @nl
definition: Relaterer en person til et navn på person som er valgt som preferanse i en bestemt applikasjon eller kontekst. @no
definition: Relaterer en person til et nomen, som er et navn på person, som er valgt som foretrukken i en specifik anvendelse eller kontekst. @da
definition: Relates a person to a nomen that is a name of person that is selected for preference in a specific application or context. @en
definition: Sasaista personu ar nomenu, kas ir personas vārds, kurš ir izvēlēts noteiktam lietojumam vai noteiktā kontekstā. @lv
definition: Seostab isiku isiku nimega, mis kindlas rakenduses või kontekstis on valitud eelistatuks. @et

kuolinpaikka
has element type: 3
instruction number: 9.9
toolkit definition: A place where a person dies. @en
toolkit definition: Bir kişinin öldüğü yer. @tr
toolkit definition: Een plaats waar een persoon sterft. @nl
toolkit definition: Egy hely, ahol egy személy elhunyt. @hu
toolkit definition: Ein Geografikum, in dem eine Person stirbt. @de
toolkit definition: El poblado, ciudad, provincia, estado y/o país en el que murió la persona. @es
toolkit definition: Et sted hvor en person døde. @no
toolkit definition: Koht, kus isik suri. @et
toolkit definition: Lieu où une personne meurt. @fr
toolkit definition: Lloc on mor una persona. @ca
toolkit definition: Luogo dove una persona è morta. @it
toolkit definition: Paikka, jossa henkilö kuoli.
toolkit definition: Personas miršanas vieta. @lv
toolkit definition: Sted, hvor en person dør. @da
toolkit definition: Μια πόλη, επαρχία, πολιτεία/κράτος ή/και χώρα, όπου απεβίωσε ένα φυσικό πρόσωπο. @el
toolkit definition: مكان يتوفى فيه شخص. @ar
toolkit definition: 一个个人去世的地点 @zh-hans
toolkit label: Sterbeort @de
toolkit label: dödsort @sv
toolkit label: dødssted @da
toolkit label: halálozási hely: @hu
toolkit label: kuolinpaikka
toolkit label: lieu de décès @fr
toolkit label: lloc de defunció @ca
toolkit label: lugar de fallecimiento @es
toolkit label: luogo di morte @it
toolkit label: miršanas vieta @lv
toolkit label: plaats van overlijden @nl
toolkit label: place of death @en
toolkit label: surmakoht @et
toolkit label: ölüm yeri @tr
toolkit label: τόπος θανάτου @el
toolkit label: مكان الوفاة @ar
toolkit label: 去世地点 @zh-hans
has subproperty: P50118
lexical alias: placeOfDeath.en
status: Published
type: Property
domain: C10004
label: a pour lieu de décès @fr
label: ha come luogo di morte @it
label: halálozásának helye a következő: @hu
label: har dödsort @sv
label: har dødssted @da
label: has place of death @en
label: hat Sterbeort @de
label: heeft plaats van overlijden @nl
label: miršanas vieta @lv
label: surmakoht @et
label: té com a lloc de defunció @ca
label: ölüm yeri ile ilişkilidir @tr
label: έχει τόπο θανάτου @el
label: له مكان وفاة @ar
label: 有去世地点 @zh-hans
sub property of: henkilöön liittyvä paikka
definition: Bir kişiyi, kişinin öldüğü yer ile ilişkilendirir. @tr
definition: Correla una persona a un luogo dove una persona è morta. @it
definition: Hozzákapcsol egy személyt egy helyhez, ahol egy személy elhunyt. @hu
definition: Liittää henkilön paikkaan, jossa henkilö kuoli.
definition: Met une personne en relation avec un lieu où une personne meurt. @fr
definition: Relaciona una persona amb un lloc on mor una persona. @ca
definition: Relateert een persoon aan een plaats waar een persoon sterft. @nl
definition: Relaterer en person til et sted hvor en person døde. @no
definition: Relaterer en person til et sted, hvor en person dør. @da
definition: Relates a person to a place where a person dies. @en
definition: Sasaista personu ar vietu, kur persona mirusi. @lv
definition: Seostab isiku kohaga, kus isik suri. @et
definition: Setzt eine Person in Beziehung zu einem Geografikum, in dem eine Person stirbt. @de
definition: Συνδέει ένα φυσικό πρόσωπο με μια πόλη, επαρχία, πολιτεία/κράτος ή και χώρα, όπου απεβίωσε ένα φυσικό πρόσωπο. @el
definition: يربط شخصا بمكان توفي فيه شخص. @ar
definition: 将一个个人与一个个人去世的地点关联起来。 @zh-hans

syntymäpaikka
has element type: 3
instruction number: 9.8
toolkit definition: A place where a person is born. @en
toolkit definition: Bir kişinin doğduğu yer. @tr
toolkit definition: Een plaats waar een persoon geboren wordt. @nl
toolkit definition: Egy hely, ahol egy személy született. @hu
toolkit definition: Ein Geografikum, in dem eine Person geboren ist. @de
toolkit definition: El poblado, ciudad, provincia, estado y/o país en el que nació la persona. @es
toolkit definition: Et sted hvor en person ble født. @no
toolkit definition: Koht, kus isik sündis. @et
toolkit definition: Lieu où une personne est née. @fr
toolkit definition: Lloc on neix una persona. @ca
toolkit definition: Luogo dove una persona è nata. @it
toolkit definition: Paikka, jossa henkilö syntyi.
toolkit definition: Personas dzimšanas vieta. @lv
toolkit definition: Sted, hvor en person fødes. @da
toolkit definition: Μια πόλη, επαρχία, πολιτεία/κράτος ή/και χώρα, όπου γεννήθηκε ένα φυσικό πρόσωπο. @el
toolkit definition: مكان ولد فيه الشخص. @ar
toolkit definition: 一个个人出生的地点 @zh-hans
toolkit label: Geburtsort @de
toolkit label: doğum yeri @tr
toolkit label: dzimšanas vieta @lv
toolkit label: födelseort @sv
toolkit label: fødested @da
toolkit label: geboorteplaats @nl
toolkit label: lieu de naissance @fr
toolkit label: lloc de naixement @ca
toolkit label: lugar de nacimiento @es
toolkit label: luogo di nascita @it
toolkit label: place of birth @en
toolkit label: syntymäpaikka
toolkit label: születési hely: @hu
toolkit label: sünnikoht @et
toolkit label: τόπος γέννησης @el
toolkit label: مكان الميلاد @ar
toolkit label: 出生地点 @zh-hans
has subproperty: P50119
lexical alias: placeOfBirth.en
status: Published
type: Property
domain: C10004
label: a pour lieu de naissance @fr
label: doğum yeri ile ilişkilidir @tr
label: dzimšanas vieta @lv
label: ha come luogo di nascita @it
label: har födelseort @sv
label: har fødested @da
label: has place of birth @en
label: hat Geburtsort @de
label: heeft geboorteplaats @nl
label: születésének helye a következő: @hu
label: sünnikoht @et
label: té com a lloc de naixement @ca
label: έχει τόπο γέννησης @el
label: له مكان ميلاد @ar
label: 有出生地点 @zh-hans
sub property of: henkilöön liittyvä paikka
definition: Bir kişiyi, kişinin doğduğu yer ile ilişkilendirir. @tr
definition: Correla una persona a un luogo dove una persona è nata. @it
definition: Hozzákapcsol egy személyt egy helyhez, ahol egy személy született. @hu
definition: Liittää henkilön paikkaan, jossa henkilö syntyi.
definition: Met une personne en relation avec un lieu où une personne est née. @fr
definition: Relaciona una persona amb un lloc on neix una persona. @ca
definition: Relateert een persoon aan een plaats waar een persoon geboren wordt. @nl
definition: Relaterer en person til et sted hvor en person ble født. @no
definition: Relaterer en person til et sted, hvor en person fødes. @da
definition: Relates a person to a place where a person is born. @en
definition: Sasaista personu ar vietu, kur persona dzimusi. @lv
definition: Seostab isiku kohaga, kus isik sündis. @et
definition: Setzt eine Person in Beziehung zu einem Geografikum, in dem eine Person geboren ist. @de
definition: Συνδέει ένα φυσικό πρόσωπο με μια πόλη, επαρχία, πολιτεία/κράτος ή/και χώρα όπου γεννήθηκε ένα φυσικό πρόσωπο. @el
definition: يربط شخصا بمكان ولد فيه شخص @ar
definition: 将一个个人与一个个人出生的地点关联起来。 @zh-hans

kuolinaika
has element type: 3
instruction number: 9.3.3
toolkit definition: A timespan during which a person died. @en
toolkit definition: Ajanjakso, jolloin henkilö kuoli.
toolkit definition: Ajavahemik, millal isik suri. @et
toolkit definition: Arco di tempo nel quale una persona è morta. @it
toolkit definition: Een tijdspanne gedurende welke een persoon stierf. @nl
toolkit definition: Egy időtartam, amely folyamán egy személy meghalt. @hu
toolkit definition: Ein Zeitraum, in dem eine Person gestorben ist. @de
toolkit definition: El año en que murió la persona. @es
toolkit definition: Et tidrom hvor en person døde. @no
toolkit definition: Interval de temps durant el qual va morir una persona. @ca
toolkit definition: Kişinin öldüğü zaman aralığı. @tr
toolkit definition: Laikposms, kurā persona nomira. @lv
toolkit definition: Laps de temps pendant lequel une personne est morte. @fr
toolkit definition: Tidsperiode, hvorunder en person døde. @da
toolkit definition: Μια χρονολογία θανάτου ενός φυσικού προσώπου. @el
toolkit definition: الفترة الزمنية التي توفي خلالها الشخص. @ar
toolkit definition: 一个个人去世的时间段 @zh-hans
toolkit label: Sterbedatum @de
toolkit label: data de defunció @ca
toolkit label: data di morte @it
toolkit label: date de décès @fr
toolkit label: date of death @en
toolkit label: datum van overlijden @nl
toolkit label: dödstid @sv
toolkit label: dødsdato @da
toolkit label: fecha de fallecimiento @es
toolkit label: halálozás időpontja: @hu
toolkit label: kuolinaika
toolkit label: miršanas datējums @lv
toolkit label: surmadaatum @et
toolkit label: ölüm tarihi @tr
toolkit label: χρονολογία θανάτου @el
toolkit label: تاريخ الوفاة @ar
toolkit label: 去世日期 @zh-hans
has subproperty: P50120
lexical alias: dateOfDeath.en
status: Published
type: Property
domain: C10004
label: a pour date de décès @fr
label: ha come data di morte @it
label: halálozásának időpontja a következő: @hu
label: har dödstid @sv
label: har dødsdato @da
label: has date of death @en
label: hat Sterbedatum @de
label: heeft datum van overlijden @nl
label: miršanas datējums @lv
label: surmadaatum @et
label: té com a data de defunció @ca
label: ölüm tarihi ile ilişkilidir @tr
label: έχει χρονολογία θανάτου @el
label: له تاريخ وفاة @ar
label: 有去世日期 @zh-hans
sub property of: henkilöön liittyvä ajanjakso
definition: Bir kişiyi, kişinin öldüğü zaman aralığı ile ilişkilendirir. @tr
definition: Correla una persona a un arco di tempo nel quale una persona è morta. @it
definition: Hozzákapcsol egy személyt egy időszakhoz, amelynek folyamán egy személy meghalt. @hu
definition: Liittää henkilön ajanjaksoon, jolloin henkilö kuoli.
definition: Met une personne en relation avec un laps de temps pendant lequel une personne est morte. @fr
definition: Relaciona una persona amb un interval de temps durant el qual va morir una persona. @ca
definition: Relateert een persoon aan een tijdspanne gedurende welke een persoon stierf. @nl
definition: Relaterer en person til en tidsperiode, hvorunder en person døde. @da
definition: Relaterer en person til et tidrom hvor en person døde. @no
definition: Relates a person to a timespan during which a person died. @en
definition: Sasaista personu ar laikposmu, kurā persona nomira. @lv
definition: Seostab isiku ajavahemikuga, millal isik suri. @et
definition: Setzt eine Person in Beziehung zu einem Zeitraum, in dem eine Person gestorben ist. @de
definition: Συνδέει ένα φυσικό πρόσωπο με τη χρονολογία θανάτου ενός φυσικού προσώπου. @el
definition: يربط شخصا بفترة زمنية توفي خلالها شخص. @ar
definition: 将一个个人与一个个人去世的时间段关联起来。 @zh-hans
scope note: Dødsår kan også inkludere den måned, eller måned og dag, personen døde. @da
scope note: Kuolinaika voi sisältää myös kuukauden tai kuukauden ja päivän.
scope note: Une date de décès peut aussi inclure le mois ou le mois et le jour de la mort de la personne. @fr
scope note: Zum Sterbedatum können auch der Monat oder der Monat und der Tag des Todes der Person gehören. @de
scope note: Η χρονολογία του θανάτου μπορεί επίσης να περιλαμβάνει τον μήνα ή τον μήνα και την ημέρα του θανάτου του φυσικού προσώπου. @el

syntymäaika
has element type: 3
instruction number: 9.3.2
toolkit definition: A timespan during which a person was born. @en
toolkit definition: Ajanjakso, jolloin henkilö on syntynyt.
toolkit definition: Ajavahemik, millal isik sündis. @et
toolkit definition: Arco di tempo nel quale una persona è nata. @it
toolkit definition: Een tijdspanne gedurende welke een persoon geboren werd. @nl
toolkit definition: Egy időtartam, amely folyamán egy személy született. @hu
toolkit definition: Ein Zeitraum, in dem eine Person geboren ist. @de
toolkit definition: El año en que nació la persona. @es
toolkit definition: Et tidsrom hvor en person ble født. @no
toolkit definition: Interval de temps durant el qual va néixer una persona. @ca
toolkit definition: Kişinin doğduğu zaman aralığı. @tr
toolkit definition: Laikposms, kurā persona ir dzimusi. @lv
toolkit definition: Laps de temps pendant lequel une personne est née. @fr
toolkit definition: Tidsperiode, hvorunder en person blev født. @da
toolkit definition: Μια χρονολογία γέννησης ενός φυσικού προσώπου. @el
toolkit definition: الفترة الزمنية التي ولد خلالها الشخص. @ar
toolkit definition: 一个个人出生的时间范围 @zh-hans
toolkit label: Geburtsdatum @de
toolkit label: data de naixement @ca
toolkit label: data di nascita @it
toolkit label: date de naissance @fr
toolkit label: date of birth @en
toolkit label: doğum tarihi @tr
toolkit label: dzimšanas datējums @lv
toolkit label: fecha de nacimiento @es
toolkit label: födelsetid @sv
toolkit label: fødselsdato @da
toolkit label: geboortedatum @nl
toolkit label: syntymäaika
toolkit label: születés időpontja: @hu
toolkit label: sünnidaatum @et
toolkit label: χρονολογία γέννησης @el
toolkit label: تاريخ الميلاد @ar
toolkit label: 出生日期 @zh-hans
has subproperty: P50121
lexical alias: dateOfBirth.en
status: Published
type: Property
domain: C10004
label: a pour date de naissance @fr
label: doğum tarihi ile ilişkilidir @tr
label: dzimšanas datējums @lv
label: ha come data di nascita @it
label: har fødselsdato @da
label: has date of birth @en
label: hat Geburtsdatum @de
label: heeft geboortedatum @nl
label: születésének időpontja a következő: @hu
label: sünnidaatum @et
label: té com a data de naixement @ca
label: έχει χρονολογία γέννησης @el
label: له تاريخ ميلاد @ar
label: 有出生日期 @zh-hans
sub property of: henkilöön liittyvä ajanjakso
definition: Bir kişiyi, kişinin doğduğu zaman aralığı ile ilişkilendirir. @tr
definition: Correla una persona a un arco di tempo nel quale una persona è nata. @it
definition: Hozzákapcsol egy személyt egy időszakhoz, amely folyamán egy személy született. @hu
definition: Liittää henkilön ajanjaksoon, jolloin henkilö on syntynyt.
definition: Met une personne en relation avec un laps de temps pendant lequel une personne est née. @fr
definition: Relaciona una persona amb un interval de temps durant el qual va néixer una persona. @ca
definition: Relateert een persoon aan een tijdspanne gedurende welke een persoon geboren werd. @nl
definition: Relaterer en person til en tidsperiode, hvorunder en person blev født. @da
definition: Relaterer en person til et tidsrom hvor en person ble født. @no
definition: Relates a person to a timespan during which a person was born. @en
definition: Sasaista personu ar laikposmu, kurā persona ir dzimusi. @lv
definition: Seostab isiku ajavahemikuga, millal isik sündis. @et
definition: Setzt eine Person in Beziehung zu einem Zeitraum, in dem eine Person geboren ist. @de
definition: Συνδέει ένα φυσικό πρόσωπο με τη χρονολογία γέννησης ενός φυσικού προσώπου. @el
definition: يربط شخصا بفترة زمنية وُلد فيها شخص @ar
definition: 将一个个人与一个个人出生的时间段关联起来。 @zh-hans
scope note: Fødselsår kan også inkludere den måned, eller måned og dag, personen blev født. @da
scope note: Syntymäaika voi sisältää myös kuukauden tai kuukauden ja päivän.
scope note: Une date de naissance peut aussi inclure le mois ou le mois et le jour de naissance de la personne. @fr
scope note: Zum Geburtsdatum können auch der Monat oder der Monat und der Tag der Geburt der Person gehören. @de
scope note: Η χρονολογία της γέννησης μπορεί επίσης να περιλαμβάνει τον μήνα ή τον μήνα και την ημέρα της γέννησης του φυσικού προσώπου. @el

henkilön muutoshakemus oikeudessa
has element type: 2
instruction number: 18.5
toolkit definition: A work that is a legal work of a higher court that records a decision of a lower court that is appealed by a person. @en
toolkit definition: Augstākas instances tiesas spriedums zemākās instances tiesas sprieduma izskatīšanā, ko pārsūdz persona. @lv
toolkit definition: Bir kişi tarafından temyiz edilen bir alt mahkeme kararını kaydeden yüksek mahkemeye ait hukuki bir çalışma. @tr
toolkit definition: Een juridisch werk van een hoger gerechtshof dat een oordeel vastlegt van een lager gerechtshof waarbij een persoon in beroep gaat. @nl
toolkit definition: Egy felsőbb bíróság jogi mű, amely rögzíti egy alsóbb bíróság ítéletét, amelyet egy személy megfellebbezett. @hu
toolkit definition: Ein juristisches Werk einer höheren Instanz, das ein Gerichtsurteil einer unteren Instanz erfasst, gegen das eine Person Rechtsmittel (Berufung/Revision) einlegt. @de
toolkit definition: Et juridisk verk fra en høyere rettsinstans som registrerer en avgjørelse fra en lavere rettsinstans som ankes av en person. @no
toolkit definition: Juridinen teos, jolla henkilö hakee muutosta alemman oikeusasteen päätökseen.
toolkit definition: Juridisk værk fra en højere retsinstans, som registerer en lavere retsinstans dom, som er appelleret af en person. @da
toolkit definition: Kõrgema astme kohtu juriidiline teos, milles on dokumenteeritud alama astme kohtu otsus, mille peale isik on esitanud apellatsiooni. @et
toolkit definition: Obra que és una obra jurídica d’un tribunal superior que enregistra una decisió d’un tribunal inferior que és apel·lada per una persona. @ca
toolkit definition: Opera legale di un tribunale superiore che registra una decisione di un tribunale inferiore a cui la persona ha fatto ricorso. @it
toolkit definition: Œuvre juridique d’un tribunal supérieur qui enregistre une décision d’un tribunal inférieur portée en appel par une personne. @fr
toolkit definition: Ένα νομικό έργο, που καταχωρίστηκε στα πρακτικά ενός ανωτέρου δικαστηρίου, για φυσικό πρόσωπο που ασκεί έφεση εναντίον απόφασης κατώτερου δικαστηρίου. @el
toolkit definition: عمل قانوني لمحكمة أعلى درجة يُسجل قرار محكمة أدنى درجة يطعن فيه شخص. @ar
toolkit definition: 一种记录下级法院被一个个人起诉的决定的上级法院的法律作品 @zh-hans
toolkit label: Person als Berufungsklagende/Berufungsklagender/Revisionsbeklagende/Revisionsklagender von @de
toolkit label: aanklager in beroep-persoon van @nl
toolkit label: apellant (isik) teoses @et
toolkit label: appellant person of @en
toolkit label: appellantperson for @no
toolkit label: fellebbező személye: @hu
toolkit label: henkilön muutoshakemus oikeudessa
toolkit label: ir apelācijas iesniedzējs (persona) @lv
toolkit label: person, som er appellant af @da
toolkit label: persona apel·lant de @ca
toolkit label: persona ricorrente di @it
toolkit label: personne appelante de @fr
toolkit label: temyiz eden kişi @tr
toolkit label: εκκαλούν/αναιρεσείον φυσικό πρόσωπο του @el
toolkit label: شخص مستأنف لـ @ar
toolkit label: ……的上诉个人 @zh-hans
has subproperty: P50122
lexical alias: appellantPersonOf.en
status: Published
type: Property
domain: C10004
label: apellant (isik) teoses @et
label: er appellantperson for @no
label: er person, som er appellant af @da
label: est une personne appelante de @fr
label: fellebbező személye a következőnek: @hu
label: ir apelācijas iesniedzējs (persona) @lv
label: is aanklager in beroep-persoon van @nl
label: is appellant person of @en
label: ist Person als Berufungsklagende/Berufungsklagender/Revisionsklagende/Revisionsklagender von @de
label: temyiz eden kişisidir @tr
label: è ricorrente persona di @it
label: és persona apel·lant de @ca
label: είναι εκαλλούν/αναιρεσείον φυσικό πρόσωπο του @el
label: هو شخص مستأنِف لـ @ar
label: 是……的上诉个人 @zh-hans
sub property of: teoksen tekijä (henkilö) teoksessa
alternative label: henkilön muutoshakemus
definition: Bir kişiyi, eser ile o eserin oluşumunda rol alan kişiyi bir üst mahkeme tarafından bir alt mahkemenin kararına dair temyizini içeren resmi belge ve o belgeyi oluşturan olarak ilişkilendirir. @tr
definition: Correla una persona a un opera legale di un tribunale superiore che registra una decisione di un tribunale inferiore a cui la persona ha fatto ricorso. @it
definition: Hozzákapcsol egy személyt egy felsőbb bíróság jogi művéhez, amely rögzíti egy alsóbb bíróság ítéletét, amelyet egy személy megfellebbezett. @hu
definition: Liittää henkilön juridiseen teokseen, jolla henkilö hakee muutosta alemman oikeusasteen päätökseen.
definition: Met une personne en relation avec une œuvre juridique d’un tribunal supérieur qui enregistre une décision d’un tribunal inférieur portée en appel par une personne. @fr
definition: Relaciona una persona amb una obra que és una obra jurídica d’un tribunal superior que enregistra una decisió d’un tribunal inferior que és apel·lada per una persona. @ca
definition: Relateert een persoon aan een juridisch werk van een hoger gerechtshof dat een oordeel vastlegt van een lager gerechtshof waarbij een persoon in beroep gaat. @nl
definition: Relaterer en person til et juridisk verk fra en høyere rettsinstans som registrerer en avgjørelse fra en lavere rettsinstans som ankes av en person. @no
definition: Relaterer en person til et juridisk værk fra en højere retsinstans, som registerer en lavere retsinstans dom, som er appelleret af en person. @da
definition: Relates a person to a work that is a legal work of a higher court that records a decision of a lower court that is appealed by a person. @en
definition: Sasaista personu ar augstākas instances tiesas spriedumu zemākās instances tiesas sprieduma izskatīšanā, ko pārsūdz persona. @lv
definition: Seostab isiku kõrgema astme kohtu juriidilise teosega, milles on dokumenteeritud alama astme kohtu otsus, mille peale isik on esitanud apellatsiooni. @et
definition: Setzt eine Person in Beziehung zu einem juristisches Werk einer höheren Instanz, das ein Gerichtsurteil einer unteren Instanz erfasst, gegen das eine Person Rechtsmittel (Berufung/Revision) einlegt. @de
definition: Συνδέει ένα φυσικό πρόσωπο, που ασκεί έφεση εναντίον απόφασης κατώτερου δικαστηρίου, που καταχωρίστηκε στα πρακτικά ενός ανωτέρου δικαστηρίου, με ένα έργο. @el
definition: يربط شخصا بعمل قضائي لمحكمة أعلى درجة يُسجل قرار محكمة أدنى درجة يطعن فيه شخص. @ar
definition: 将一个个人与一种记录下级法院被一个个人起诉的决定的上级法院的一种法律作品关联起来。 @zh-hans

sitoja (toimija) kappaleessa
has element type: 2
instruction number: 18.5
toolkit definition: An item that involves a responsibility of an agent for binding. @en
toolkit definition: Ciltleme için bir temsilcinin sorumluluğunu içeren bir kopya. @tr
toolkit definition: Een item dat met zich meebrengt een verantwoordelijkheid van een actor voor het binden. @nl
toolkit definition: Egy példány, amelyhez hozzátartozik egy ágens felelőssége a kötésért. @hu
toolkit definition: Ein Exemplar, bei dem ein Akteur für das Binden verantwortlich ist. @de
toolkit definition: Eksemplar, mis sisaldab tegija vastutust köitmise eest. @et
toolkit definition: Eksemplar, som involverer en agents ansvar for indbinding. @da
toolkit definition: Et eksemplar som involverer ansvar for en agent i form av innbinding. @no
toolkit definition: Item che implica una responsabilità di un agente per la rilegatura. @it
toolkit definition: Item qui comporte une responsabilité de la part d’un agent en ce qui concerne la reliure. @fr
toolkit definition: Kappale, jonka sitomisesta toimija on vastuussa.
toolkit definition: Vienība, kas ietver aģenta atbildību par iesiešanu. @lv
toolkit definition: Ítem que implica una responsabilitat d’un agent en l’enquadernació. @ca
toolkit definition: Ένα αντίτυπο που βιβλιοδετείται. @el
toolkit definition: مفردة يترتب عليها مسئولية وكيل عن التجليد @ar
toolkit definition: 涉及一个装订行为者的责任的一个单件 @zh-hans
toolkit label: Akteur als Buchbinderin/Buchbinder von @de
toolkit label: agent enquadernador de @ca
toolkit label: agent relieur de @fr
toolkit label: agent, som er bogbinder af @da
toolkit label: binder agent of @en
toolkit label: binder-actor van @nl
toolkit label: bokbinder av (agent) @no
toolkit label: ciltleyici temsilci @tr
toolkit label: ir iesējējs (aģents) @lv
toolkit label: köitja (tegija) eksemplarile @et
toolkit label: könyvkötő ágense: @hu
toolkit label: rilegatore agente di @it
toolkit label: sitoja (toimija) kappaleessa
toolkit label: βιβλιοδέτης φορέας του @el
toolkit label: وكيل مسئول عن التجليد @ar
toolkit label: ……的装订者行为者 @zh-hans
has subproperty: sitoja (henkilö) kappaleessa
has subproperty: sitoja (yhteistoimija) kappaleessa
has subproperty: P50123
lexical alias: binderAgentOf.en
status: Published
type: Property
domain: C10002
label: ciltleyici temsilcisidir @tr
label: er agent, som er bogbinder af @da
label: er bokbinder av (agent) @no
label: est un agent relieur de @fr
label: ir iesējējs (aģents) @lv
label: is binder agent of @en
label: is binder-actor van @nl
label: ist Akteur als Buchbinderin/Buchbinder von @de
label: köitja (tegija) eksemplarile @et
label: könyvkötő ágense a következőnek: @hu
label: è rilegatore agente di @it
label: és agent enquadernador de @ca
label: είναι βιβλιοδέτης φορέας του @el
label: هو وكيل مسئول عن التجليد @ar
label: 是……的装订者行为者 @zh-hans
sub property of: toimijaan liittyvä kappale
alternative label: Buchbinder von @de
alternative label: binder of @en
alternative label: bogbinder af @da
alternative label: bokbinder av @no
alternative label: ciltleyici @tr
alternative label: encuadernador de @es
alternative label: enquadernador de @ca
alternative label: köitja eksemplarile @et
alternative label: könyvkötője: @hu
alternative label: relieur de @fr
alternative label: rilegatore di @it
alternative label: sitojana kappaleessa
alternative label: βιβλιοδέτης του @el
alternative label: مسئول عن تجليد @ar
alternative label: ……的装订者 @zh-hans
definition: Bir temsilciyi, bağlamakla görevli bir temsilcinin sorumluluğunu içeren bir kopyayla ilşkilendirir @tr
definition: Correla un agente a un item che implica una responsabilità di un agente per la rilegatura. @it
definition: Hozzákapcsol egy ágenst egy példányhoz, amelyhez hozzátartozik egy ágens felelőssége a kötésért. @hu
definition: Liittää toimijan kappaleeseen, jonka sitomisesta toimija on vastuussa.
definition: Met un agent en relation avec un item qui comporte une responsabilité de la part d’un agent en ce qui concerne la reliure. @fr
definition: Relaciona un agent amb un ítem que implica una responsabilitat d’un agent en l’enquadernació. @ca
definition: Relateert een actor aan een item dat met zich meebrengt een verantwoordelijkheid van een actor voor het binden. @nl

henkilökantaja teoksessa
has element type: 2
instruction number: 18.5
toolkit definition: A work that involves a responsibility for bringing a suit as a person in a civil proceeding. @en
toolkit definition: Bir hukuk davasında kişi olarak dava açma sorumluluğunu içeren bir çalışma. @tr
toolkit definition: Darbs, kas ietver atbildību par to, ka persona ceļ prasību civiltiesā. @lv
toolkit definition: Een werk dat met zich meebrengt een verantwoordelijkheid voor het aanspannen van een proces als een persoon in een civielrechtelijke procedure. @nl
toolkit definition: Egy mű, amelyhez hozzátartozik egy személy felelőssége egy per elindításáért egy polgári jogi eljárásban. @hu
toolkit definition: Ein Werk, bei dem eine Person eine Klage in ein Zivilverfahren einbringt. @de
toolkit definition: Et verk som involverer ansvar for å være en person som er saksøker i en sivilrettslig sak. @no
toolkit definition: Obra que implica una responsabilitat d’interposar una demanda civil com a persona en un procés civil. @ca
toolkit definition: Opera che implica una responsabilità nell'intentare una causa come persona in un processo civile. @it
toolkit definition: Teos, jossa henkilö on vastuussa kenteen tuomisesta siviilioikeudenkäyntiin.
toolkit definition: Teos, mis sisaldab isiku vastutust tsiviilkohtumenetluses hagi esitamise eest. @et
toolkit definition: Værk, som involverer et ansvar for at anlægge en sag, som en person, i en civilproces. @da
toolkit definition: Œuvre qui comporte une responsabilité consistant à intenter une poursuite civile en tant que personne. @fr
toolkit definition: Ένα έργο, το οποίο περιλαμβάνει την άσκηση αγωγήςστο πλαίσιο αστικής διαδικασίας, από ένα φυσικό πρόσωπο. @el
toolkit definition: عمل يترتب عليه تحمل شخص مسئولية رفع دعوى مدنية. @ar
toolkit definition: 涉及民事诉讼中作为个人起诉的责任的作品 @zh-hans
toolkit label: Zivilklagende Person von @de
toolkit label: aanklager-persoon van @nl
toolkit label: davacı kişi @tr
toolkit label: felperes személye: @hu
toolkit label: hageja (isik) teoses @et
toolkit label: henkilökantaja teoksessa
toolkit label: ir prasītājs (persona) @lv
toolkit label: person, som er sagsøger af @da
toolkit label: persona demandant de @ca
toolkit label: personne demanderesse de @fr
toolkit label: plaintiff person of @en
toolkit label: querelante persona di @it
toolkit label: saksøker av (person) @no
toolkit label: ενάγον φυσικό πρόσωπο του @el
toolkit label: شخص مدع لـ @ar
toolkit label: ……的原告个人 @zh-hans
has subproperty: P50124
lexical alias: plaintiffPersonOf.en
status: Published
type: Property
domain: C10004
label: davacı kişisidir @tr
label: er person, som er sagsøger af @da
label: er saksøker av (person) @no
label: est une personne demanderesse de @fr
label: felperes személye a következőnek: @hu
label: hageja (isik) teoses @et
label: ir prasītājs (persona) @lv
label: is aanklager-persoon van @nl
label: is plaintiff person of @en
label: ist zivilklagende Person von @de
label: è querelante persona di @it
label: és persona demandant de @ca
label: είναι ενάγον φυσικό πρόσωπο του @el
label: هو شخص مُدّعِ لـ @ar
label: 是……的原告个人 @zh-hans
sub property of: teoksen tekijä (henkilö) teoksessa
alternative label: henkilön tekemä kanne
definition: Bir kişiyi, hukuk davasında kişi olarak dava açma sorumluluğunu içeren bir eserle ilişkilendirir. @tr
definition: Correla una persona a un'opera che implica una responsabilità nell'intentare una causa come persona in un processo civile. @it
definition: Hozzákapcsol egy személyt egy műhöz, amelyhez hozzátartozik egy személy felelőssége egy per elindításáért egy polgári jogi eljárásban. @hu
definition: Liittää henkilön teokseen, jossa henkilö on vastuussa kanteen tuomisesta siviilioikeudenkäyntiin.
definition: Met une personne en relation avec une œuvre qui comporte une responsabilité consistant à intenter une poursuite civile en tant que personne. @fr
definition: Relaciona una persona amb una obra que implica una responsabilitat d’interposar una demanda civil com a persona en un procés civil. @ca
definition: Relateert een persoon aan een werk dat met zich meebrengt een verantwoordelijkheid voor het aanspannen van een proces als een persoon in een civielrechtelijke procedure. @nl
definition: Relaterer en person til et verk som involverer ansvar for å være en person som er saksøker i en sivilrettslig sak. @no
definition: Relaterer en person til et værk, som involverer et ansvar for at anlægge en sag, som en person, i en civilproces. @da
definition: Relates a person to a work that involves a responsibility for bringing a suit as a person in a civil proceeding. @en
definition: Sasaista personu ar darbu, kas ietver atbildību par to, ka persona ceļ prasību civiltiesā. @lv
definition: Seostab isiku teosega, mis sisaldab isiku vastutust tsiviilkohtumenetluses hagi esitamise eest. @et
definition: Setzt eine Person in Beziehung zu einem Werk, bei dem eine Person eine Klage in ein Zivilverfahren einbringt. @de
definition: Συνδέει ένα φυσικό πρόσωπο, το οποίο ασκεί αγωγή στο πλαίσιο αστικής διαδικασίας, με ένα έργο. @el
definition: يربط شخصا بعمل يترتب عليه تحمل شخص مسئولية رفع دعوى مدنية. @ar
definition: 将一个个人与涉及民事诉讼中作为个人起诉的责任的作品关联起来。 @zh-hans

omistuskirjoituksen kirjoittaja kappaleessa
has element type: 2
instruction number: 18.5
toolkit definition: An item that involves a responsibility for inscribing a text, such as a statement of dedication or gift. @en
toolkit definition: Een item dat met zich meebrengt een verantwoordelijkheid voor inscriptie van een tekst, zoals een vermelding van opdracht of geschenk. @nl
toolkit definition: Egy példány, amelyhez hozzátartozik a felelősség egy olyan bejegyzett szöveggel kapcsolatosan, mint egy dedikáció vagy egy ajándékozási nyilatkozat. @hu
toolkit definition: Ein Exemplar, das mit einer Verantwortung verbunden ist, eine Widmung oder einen Schenkungsvermerk in ein Exemplar zu schreiben. @de
toolkit definition: Eksemplar, mis sisaldab vastutust pühenduse või kinkimismärke kirjutamise eest. @et
toolkit definition: Eksemplar, som involverer et ansvar for at indskrive en tekst, såsom en dedikation eller gavetilegnelse. @da
toolkit definition: Et eksemplar som involverer ansvar i form av å skrive inn en tekst, slik som en angivelse av dedikasjon eller gave. @no
toolkit definition: Item che implica la responsabilità di scrivere un testo, come una dichiarazione di dedica o omaggio. @it
toolkit definition: Item qui comporte une responsabilité consistant à inscrire un texte tel qu’une dédicace ou une mention de don. @fr
toolkit definition: Kappale, jossa henkilö on vastuussa tekstin, kuten omistuskirjoituksen tai lahjoitusmerkinnön, kirjoittamisesta.
toolkit definition: Vienība, kas ietver personas atbildību par ierakstītu tekstu, piemēram, veltījuma vai dāvinājuma ierakstu. @lv
toolkit definition: Ítem que implica una responsabilitat d’inscriure un text, com ara una menció de dedicatòria o de regal. @ca
toolkit definition: İthaf veya hediye beyanı gibi bir metnin yazılması sorumluluğunu içeren bir kopya. @tr
toolkit definition: Ένα αντίτυπο που φέρει μια αφιέρωση ή δήλωση δωρεάς. @el
toolkit definition: مفردة تنطوي على مسئولية كتابة نص، مثل بيان الإهداء أو الهدية. @ar
toolkit definition: 涉及题写文字（诸如题献或赠与）的责任的单件 @zh-hans
toolkit label: Beschriftende Person von @de
toolkit label: armağan notu yazarıdır @tr
toolkit label: autore di dedica di @it
toolkit label: beírója: @hu
toolkit label: dédicateur d’un item de @fr
toolkit label: indskriver af @da
toolkit label: inscriber of @en
toolkit label: inscriptor de @ca
toolkit label: ir veltījuma ierakstītājs @lv
toolkit label: omistuskirjoituksen kirjoittaja kappaleessa
toolkit label: opdrachtschrijver van @nl
toolkit label: pühenduse kirjutaja eksemplaris @et
toolkit label: tilegner av @no
toolkit label: χαράκτης του @el
toolkit label: كاتب إهداء @ar
toolkit label: ……的题写者 @zh-hans
has subproperty: P50125
lexical alias: inscriberOf.en
status: Published
type: Property
domain: C10004
label: armağan notu yazarıdır @tr
label: beírója a következőnek: @hu
label: er indskriver af @da
label: er tilegner av @no
label: est un dédicateur d’un item de @fr
label: ir veltījuma ierakstītājs @lv
label: is inscriber of @en
label: is opdrachtschrijver van @nl
label: ist beschriftende Person von @de
label: pühenduse kirjutaja eksemplaris @et
label: è autore di dedica di @it
label: és inscriptor de @ca
label: είναι χαράκτης του @el
label: هو كاتب إهداء لـ @ar
label: 是……的题写者 @zh-hans
sub property of: muokkaaja (henkilö) kappaleessa
alternative label: auteur d’un envoi de @fr
alternative label: omistuskirjoitus kappaleessa
definition: Bir kişiyi, ithaf beyanı veya hediye gibi bir metnin yazılması sorumluluğunu içeren bir kopyayla ilişkilendirir. @tr
definition: Correla una persona a un item che implica la responsabilità di scrivere un testo, come una dichiarazione di dedica o omaggio. @it
definition: Hozzákapcsol egy személyt egy példányhoz, amelyhez hozzátartozik a felelősség egy olyan bejegyzett szöveggel kapcsolatosan, mint egy dedikáció vagy egy ajándékozási nyilatkozat. @hu
definition: Liittää henkilön kappaleeseen, jossa henkilö on vastuussa tekstin, kuten omistuskirjoituksen tai lahjoitusmerkinnön, kirjoittamisesta.
definition: Met une personne en relation avec un item qui comporte une responsabilité consistant à inscrire un texte tel qu’une dédicace ou une mention de don. @fr
definition: Relaciona una persona amb un ítem que implica una responsabilitat d’inscriure un text, com ara una menció de dedicatòria o de regal. @ca
definition: Relateert een persoon aan een item dat met zich meebrengt een verantwoordelijkheid voor inscriptie van een tekst, zoals een mededeling van opdracht of geschenk. @nl
definition: Relaterer en person til et eksemplar som involverer ansvar i form av å skrive inn en tekst, slik som en angivelse av dedikasjon eller gave. @no
definition: Relaterer en person til et eksemplar, som involverer et ansvar for at indskrive en tekst, såsom en dedikation eller gavetilegnelse. @da
definition: Relates a person to an item that involves a responsibility for inscribing a text, such as a statement of dedication or gift. @en
definition: Sasaista personu ar vienību, kas ietver personas atbildību par ierakstītu tekstu, piemēram, veltījuma vai dāvinājuma ierakstu. @lv
definition: Seostab isiku eksemplariga, mis sisaldab vastutust pühenduse või kinkimismärke kirjutamise eest. @et
definition: Setzt eine Person in Beziehung zu einem Exemplar, das mit einer Verantwortung verbunden ist, eine Widmung oder einen Schenkungsvermerk in ein Exemplar zu schreiben. @de
definition: Συνδέει ένα φυσικό πρόσωπο, το οποίο έχει γράψει μια αφιέρωση ή δήλωση δωρεάς σε ένα αντίτυπο, με ένα αντίτυπο. @el
definition: يربط شخصا بمفردة يترتب عليها مسئولية كتابة نص، مثل بيان الإهداء أو الهدية. @ar
definition: 将一个个人与涉及题写文字（诸如题献或赠与）的责任的单件关联起来。 @zh-hans

tuomari teoksessa
has element type: 2
instruction number: 18.5
toolkit definition: A work that involves a responsibility for hearing and decision on legal matters in court. @en
toolkit definition: Darbs, kas ietver personas atbildību par lietas izskatīšanu un lēmumu pieņemšanu tiesā. @lv
toolkit definition: Een werk dat met zich meebrengt een verantwoordelijkheid voor horen en besluiten over wettelijke zaken in rechtbank. @nl
toolkit definition: Egy mű, amelyhez hozzátartozik a felelősség bírósági jogi ügyek tárgyalásával és döntésével kapcsolatban. @hu
toolkit definition: Ein Werk, bei dem eine Person dafür verantwortlich ist, sich bei Gericht juristische Angelegenheiten anzuhören und darüber zu entscheiden. @de
toolkit definition: Et verk som involverer ansvar i form av å høre og ta avgjørelser i saker i en rettsinstans. @no
toolkit definition: Hukuki konularda, mahkemede duruşma ve karar verme sorumluluğunu içeren bir çalışma. @tr
toolkit definition: Obra que implica una responsabilitat d’escolta i decisió en les causes jurídiques en un tribunal. @ca
toolkit definition: Opera che implica la responsabilità di dibattere e di decidere su affari legali in un tribunale. @it
toolkit definition: Teos, jossa henkilö on vastuussa oikeusasioiden kuulemisesta ja päättämisestä tuomioistuimessa.
toolkit definition: Teos, mis sisaldab vastutust õigusasjade ärakuulamise ja otsustamise eest kohtus. @et
toolkit definition: Værk, som involverer et ansvar for at høre og afgøre juridiske anliggender i retten. @da
toolkit definition: Œuvre qui comporte une responsabilité consistant à entendre des causes juridiques et à rendre jugement dans un tribunal. @fr
toolkit definition: Ένα έργο που περιλαμβάνει την ευθύνη της ακρόασης και της λήψης απόφασης αναφορικά με ζητήματα νομικής φύσης στο δικαστήριο. @el
toolkit definition: عمل يترتب عليه مسئولية الاستماع إلى المسائل القانونية في محكمة والبت فيها. @ar
toolkit definition: 涉及法院中关于法律事务审理和决定责任的一种作品 @zh-hans
toolkit label: Richterin/Richter von @de
toolkit label: bírája: @hu
toolkit label: dommer af @da
toolkit label: dommer over @no
toolkit label: giudice di @it
toolkit label: ir tiesnesis @lv
toolkit label: judge of @en
toolkit label: juge de @fr
toolkit label: jutge de @ca
toolkit label: kohtunik teoses @et
toolkit label: rechter van @nl
toolkit label: tuomari teoksessa
toolkit label: yargıç @tr
toolkit label: κριτής του @el
toolkit label: قاض @ar
toolkit label: ……的法官 @zh-hans
has subproperty: P50126
lexical alias: judgeOf.en
status: Published
type: Property
domain: C10004
label: bírája a következőnek: @hu
label: er dommer af @da
label: er dommer over @no
label: est un juge de @fr
label: ir tiesnesis @lv
label: is judge of @en
label: is rechter van @nl
label: ist Richterin/Richter von @de
label: kohtunik teoses @et
label: yargıcıdır @tr
label: è giudice di @it
label: és jutge de @ca
label: είναι κριτής του @el
label: هو قاضٍ لـ @ar
label: 是……的法官 @zh-hans
sub property of: teoksen tekijä (henkilö) teoksessa
definition: Bir kişiyi, mahkemede hukuki konular hakkında duruşma ve karar verme sorumluluğu içeren eserle ilişkilendirir. @tr
definition: Correla una persona a un'opera che implica la responsabilità di dibattere e di decidere su affari legali in un tribunale. @it
definition: Hozzákapcsol egy személyt egy műhöz, amelyhez hozzátartozik a felelősség bírósági jogi ügyek tárgyalásával és döntésével kapcsolatban. @hu
definition: Liittää henkilön teokseen, jossa henkilö on vastuussa oikeusasioiden kuulemisesta ja päättämisestä tuomioistuimessa.
definition: Met une personne en relation avec une œuvre qui comporte une responsabilité consistant à entendre des causes juridiques et à rendre jugement dans un tribunal. @fr
definition: Relaciona una persona amb una obra que implica una responsabilitat d’escolta i decisió en les causes jurídiques en un tribunal. @ca
definition: Relateert een persoon aan een werk dat met zich meebrengt een verantwoordelijkheid voor horen en besluiten over wettelijke zaken in rechtbank. @nl
definition: Relaterer en person til et verk som involverer ansvar i form av å høre og ta avgjørelser i saker i en rettsinstans. @no
definition: Relaterer en person til et værk, som involverer et ansvar for at høre og afgøre juridiske anliggender i retten. @da
definition: Relates a person to a work that involves a responsibility for hearing and decision on legal matters in court. @en
definition: Sasaista personu ar darbu, kas ietver personas atbildību par lietas izskatīšanu un lēmumu pieņemšanu tiesā. @lv
definition: Seostab isiku teosega, mis sisaldab vastutust õigusasjade ärakuulamise ja otsustamise eest kohtus. @et
definition: Setzte eine Person in Beziehung zu einem Werk, bei dem eine Person dafür verantwortlich ist, sich bei Gericht juristische Angelegenheiten anzuhören und darüber zu entscheiden. @de
definition: Συνδέει ένα φυσικό πρόσωπο, το οποίο ακούει και αποφασίζει αναφορικά με ζητήματα νομικής φύσης στο δικαστήριο, με ένα έργο. @el
definition: يربط الشخص بعمل يترتب عليه مسئولية الاستماع إلى المسائل القانونية في محكمة والبت فيها. @ar
definition: 将一个个人与涉及法院中关于法律事务审理和决定责任的一种作品关联起来。 @zh-hans

preeses teokselle
has element type: 2
instruction number: 18.5
toolkit definition: A work that involves a responsibility as a faculty moderator of an academic disputation, normally proposing a thesis and participating in the ensuing disputation. @en
toolkit definition: Akademik bir tartışma konusunda fakülte moderatörü olarak sorumluluk içeren, normalde bir tez öneren ve ardından gelen tartışmaya katılan bir çalışma olarak ifade etmektedir. @tr
toolkit definition: Darbs, kas ietver personas atbildību, esot par fakultātes akadēmiskā disputa moderatoru, parasti piedāvājot tematu un piedaloties turpmākajā disputā. @lv
toolkit definition: Een werk dat met zich meebrengt een verantwoordelijkheid van een faculteitsmoderator van een academische disputatie, gewoonlijk voordragend een stelling en deelnemend in het daaropvolgende dispuut. @nl
toolkit definition: Egy mű, amelyhez hozzátartozik egy tudományos vita kari moderátorának felelőssége, aki szokásos módon előterjeszt egy szakdolgozatot, és részt vesz az azt követő vitában. @hu
toolkit definition: Ein Werk, bei dem eine Person auf Fakultätsseite eine akademische Disputation moderiert, normalerweise eine These vorschlägt und an der sich daraus ergebenden Disputation teilnimmt. @de
toolkit definition: Et verk som involverer ansvar som fakultetets ordstyrer i en akademisk disputas, som vanligvis foreslår en avhandling og deltar i den påfølgende disputasen. @no
toolkit definition: Obra que implica una responsabilitat com a moderador d’una disputa acadèmica, normalment proposa una tesi i participa en el debat subsegüent. @ca
toolkit definition: Opera che implica la responsabilità come docente moderatore in una discussione accademica, normalmente proponendo una tesi e partecipando alla conseguente discussione. @it
toolkit definition: Teos, jossa henkilö on vastuussa väitöskirjan esittelystä väitöstilasuudessa tiedekunnan edustajana ja osallistuu keskusteluun väitöstilaisuuden puheenjohtajana.
toolkit definition: Teos, mis sisaldab teaduskonna väitlusjuhi vastutust akadeemilise väitluskoosoleku eest, tavaliselt esitledes väitekirja ning osaledes järgnevas väitluses. @et
toolkit definition: Værk, som involverer et ansvar som en fakultetsordstyrer for en akademisk disputation, normalt ved at fremsætte en tese og deltagelse i den efterfølgende disputation. @da
toolkit definition: Œuvre qui comporte une responsabilité consistant à présider une disputation académique et, normalement, à proposer une thèse et à participer au débat qui s’ensuit. @fr
toolkit definition: Ένα έργο που περιλαμβάνει την ευθύνη του επόπτη σχολής/τομέα μιας ακαδημαϊκής διατριβής, συνήθως μέσω της υποβολής μιας πρότασης και της συμμετοχής στην εκπόνηση της διατριβής. @el
toolkit definition: عمل يترتب عليه مسئولية إدارة حوار في مناقشة أكاديمية، وعادة اقتراح أطروحة، والمشاركة في المناقشة التي تلي ذلك. @ar
toolkit definition: 涉及作为学术辩论的主持教师（通常是提出一个论题并参与后续的辩论）责任的一种作品 @zh-hans
toolkit label: Danışman @tr
toolkit label: Praeses von @de
toolkit label: elnöke: @hu
toolkit label: ir akadēmiskā disputa vadītājs @lv
toolkit label: praeses de @ca
toolkit label: praeses of @en
toolkit label: praeses teoses @et
toolkit label: preeses teokselle
toolkit label: preses for @no
toolkit label: preses van @nl
toolkit label: presidente di @it
toolkit label: præses af @da
toolkit label: επόπτης του @el
toolkit label: رئيس جلسة @ar
toolkit label: ……的评审人 @zh-hans
has subproperty: P50127
lexical alias: praesesOf.en
status: Published
type: Property
domain: C10004
label: danışmanıdır @tr
label: elnöke a következőnek: @hu
label: er preses for @no
label: er præses af @da
label: est un praeses de @fr
label: ir akadēmiskā disputa vadītājs @lv
label: is praeses of @en
label: is preses van @nl
label: ist Praeses von @de
label: praeses teoses @et
label: è presidente di @it
label: és praeses de @ca
label: είναι επόπτης του @el
label: هو رئيس جلسة لـ @ar
label: 是……的评审人 @zh-hans
sub property of: teoksen tekijä (henkilö) teoksessa
alternative label: Präses von @de
alternative label: preesesinä väitöstilaisuudessa
definition: Bir kişiyi, akademik bir tartışma konusunda fakülte moderatörü olarak sorumluluk içeren, normalde bir tez öneren ve ardından gelen tartışmaya katılan bir eserle ilişkilendirir. @tr
definition: Correla una persona a un'opera che implica la responsabilità come docente moderatore in una discussione accademica, normalmente proponendo una tesi e partecipando alla conseguente discussione. @it
definition: Hozzákapcsol egy személyt egy műhöz, amelyhez hozzátartozik egy tudományos vita kari moderátorának felelőssége, aki szokásos módon előterjeszt egy szakdolgozatot, és részt vesz az azt követő vitában. @hu
definition: Liittää henkilön teokseen, jossa henkilö on vastuussa väitöskirjan esittelystä väitöstilasuudessa tiedekunnan edustajana ja osallistuu keskusteluun väitöstilaisuuden puheenjohtajana.
definition: Met une personne en relation avec une œuvre qui comporte une responsabilité consistant à présider une disputation académique et, normalement, à proposer une thèse et à participer au débat qui s’ensuit. @fr
definition: Relaciona una persona amb una obra que implica una responsabilitat com a moderador d’una disputa acadèmica, normalment proposa una tesi i participa en el debat subsegüent. @ca
definition: Relateert een persoon aan een werk dat met zich meebrengt een verantwoordelijkheid van een faculteitsmoderator van een academische disputatie, gewoonlijk voordragend een stelling en deelnemend in het daaropvolgende dispuut. @nl
definition: Relaterer en person til et verk som involverer ansvar som fakultetets ordstyrer i en akademisk disputas, som vanligvis foreslår en avhandling og deltar i den påfølgende disputasen. @no
definition: Relaterer en person til et værk, som involverer et ansvar som en fakultetsordstyrer for en akademisk disputation, normalt ved at fremsætte en tese og deltagelse i den efterfølgende disputation. @da
definition: Relates a person to a work that involves a responsibility as a faculty moderator of an academic disputation, normally proposing a thesis and participating in the ensuing disputation. @en
definition: Sasaista personu ar darbu, kas ietver personas atbildību, esot par fakultātes akadēmiskā disputa moderatoru, parasti piedāvājot tematu un piedaloties turpmākajā disputā. @lv
definition: Seostab isiku teosega, mis sisaldab teaduskonna väitlusjuhi vastutust akadeemilise väitluskoosoleku eest, tavaliselt esitledes väitekirja ning osaledes järgnevas väitluses. @et
definition: Setzt eine Person in Beziehung zu einem Werk, bei dem eine Person auf Fakultätsseite eine akademische Disputation moderiert, normalerweise eine These vorschlägt und an der sich daraus ergebenden Disputation teilnimmt. @de
definition: Συνδέει ένα φυσικό πρόσωπο, το οποίο είναι επόπτης σχολής/τομέα μιας ακαδημαϊκής διατριβής και ο οποίος συνήθως προτείνει μια θέση και συμμετέχει στην εκπόνηση της διατριβής, με ένα έργο. @el
definition: يربط شخصا بعمل يترتب عليه مسئولية إدارة حوار في مناقشة أكاديمية، وعادة اقتراح أطروحة، والمشاركة في المناقشة التي تلي ذلك. @ar
definition: 将一个个人与涉及作为学术辩论的主持教师（通常是提出一个论题并参与后续的辩论）责任的一种作品关联起来。 @zh-hans

lisähuomautusten kirjoittaja kappaleessa
has element type: 2
instruction number: 18.5
toolkit definition: An item that carries notes and other information added by hand. @en
toolkit definition: Een item waarop noten en andere informatie met de hand toegevoegd zijn. @nl
toolkit definition: Egy példány, amely jegyzeteket és más, kézzel írott információt hordoz. @hu
toolkit definition: Ein Exemplar, das handschriftlich Anmerkungen und andere Informationen beinhaltet. @de
toolkit definition: Eksemplar, milles on käsitsi kirjutatud märkusi ja muud infot. @et
toolkit definition: Eksemplar, som har noter og anden information skrevet i hånden. @da
toolkit definition: Elle eklenen notları ve diğer bilgileri taşıyan bir kopya. @tr
toolkit definition: Et eksemplar som har håndskrevne notater og annen informasjon. @no
toolkit definition: Item che riporta note e altre informazioni aggiunte a mano. @it
toolkit definition: Item qui porte des notes ou d’autres informations ajoutées à la main. @fr
toolkit definition: Kappale, joka sisältää käsinkirjoitettuja huomautuksia ja muita selityksiä.
toolkit definition: Vienība, kurai ir pievienotas ar roku rakstītas piezīmes vai cita informācija @lv
toolkit definition: Ítem que porta notes i altra informació afegida a mà. @ca
toolkit definition: Ένα αντίτυπο που φέρει χειρόγραφες σημειώσεις. @el
toolkit definition: مفردة تشتمل على ملاحظات ومعلومات أخرى أضيفت بخط اليد. @ar
toolkit definition: 载有手加批注和其他信息的单件 @zh-hans
toolkit label: Annotierende Person von @de
toolkit label: annotateur de @fr
toolkit label: annotator of @en
toolkit label: annotator van @nl
toolkit label: annotatore di @it
toolkit label: annoterende person for @no
toolkit label: annoteringsskriver af @da
toolkit label: anotador de @ca
toolkit label: anotējis @lv
toolkit label: jegyzetekkel ellátója: @hu
toolkit label: lisähuomautusten kirjoittaja kappaleessa
toolkit label: sissekirjutuste autor eksemplaris @et
toolkit label: yorumlayıcı @tr
toolkit label: σχολιαστής του @el
toolkit label: مُعلِق على @ar
toolkit label: ……的手写批注者 @zh-hans
has subproperty: P50128
lexical alias: annotatorOf.en
status: Published
type: Property
domain: C10004
label: er annoterende person for @no
label: er annoteringsskriver af @da
label: est un annotateur de @fr
label: ir anotējis @lv
label: is annotator of @en
label: is annotator van @nl
label: ist annotierende Person von @de
label: jegyzetekkel ellátója a következőnek: @hu
label: sissekirjutuste autor eksemplaris @et
label: yorumlayıcısıdır @tr
label: è annotatore di @it
label: és anotador de @ca
label: είναι σχολιαστής του @el
label: هو مُعلِّق على @ar
label: 是……的手写批注者 @zh-hans
sub property of: muokkaaja (henkilö) kappaleessa
alternative label: huomautusten kirjoittajana kappaleessa
definition: Bir kişiyi, el yazısı notlar ve diğer bilgileri içeren bir kopyayla ilişkilendirir. @tr
definition: Correla una persona a un item che riporta note e altre informazioni aggiunte a mano. @it
definition: Hozzákapcsol egy személyt egy példányhoz, amely jegyzeteket és más, kézzel írott információt hordoz. @hu
definition: Liittää henkilön kappaleeseen, joka sisältää käsinkirjoitettuja huomautuksia ja muita selityksiä.
definition: Met une personne en relation avec un item qui porte des notes ou d’autres informations ajoutées à la main. @fr
definition: Relaciona una persona amb un ítem que porta notes i altra informació afegida a mà. @ca
definition: Relateert een persoon aan een item waarop noten en andere informatie met de hand toegevoegd zijn. @nl
definition: Relaterer en person til et eksemplar som har håndskrevne notater og annen informasjon. @no
definition: Relaterer en person til et eksemplar, som har noter og anden information skrevet i hånden. @da
definition: Relates a person to an item that carries notes and other information added by hand. @en
definition: Sasaista personu ar vienību, kurai ir pievienotas ar roku rakstītas piezīmes vai cita informācija. @lv
definition: Seostab isiku eksemplariga, milles on käsitsi kirjutatud märkusi ja muud infot. @et
definition: Setzt eine Person in Beziehung zu einem Exemplar, das handschriftlich Anmerkungen und andere Informationen beinhaltet. @de
definition: Συνδέει ένα φυσικό πρόσωπο, το οποίο δημιουργεί χειρόγραφα σχόλια/σημειώσεις σε ένα αντίτυπο, με ένα αντίτυπο. @el
definition: يربط شخصا بمفردة تشتمل على ملاحظات ومعلومات أخرى أضيفت بخط اليد. @ar
definition: 将一个个人与载有手加批注和其他信息的单件关联起来。 @zh-hans

nimikirjoituksen kirjoittaja kappaleessa
has element type: 2
instruction number: 18.5
toolkit definition: An item that involves a responsibility for a manuscript signature appearing on it. @en
toolkit definition: Een item dat met zich meebrengt een verantwoordelijkheid voor een handgeschreven handtekening daarop. @nl
toolkit definition: Egy példány, amelyhez hozzátartozik egy személy felelőssége az azon megjelenő kézírásos aláírásért. @hu
toolkit definition: Ein Exemplar, das von der Person handschriftlich unterschrieben wurde. @de
toolkit definition: Eksemplar, mis sisaldab isiku vastutust selles või sellel oleva omakäelise nime või nimemärgi eest. @et
toolkit definition: Eksemplar, som involverer en persons ansvar for at en signatur forekommer på et eksemplar. @da
toolkit definition: Et eksemplar som involverer ansvar for en signatur som forekommer på et manuskript. @no
toolkit definition: Item che implica la responsabilità di una persona per la firma manoscritta che vi appare. @it
toolkit definition: Item qui comporte une responsabilité en ce qui concerne une signature manuscrite figurant sur lui. @fr
toolkit definition: Kappale, jossa olevasta käsinkirjoitetusta nimikirjoituksesta henkilö on vastuussa.
toolkit definition: Vienība, kas ietver peronas atbildību par autogrāfu uz tās. @lv
toolkit definition: Ítem que implica una responsabilitat d’una persona en una signatura autògrafa que hi figura. @ca
toolkit definition: Üzerinde görünen el yazması imzanın sorumluluğunu içeren bir kopya. @tr
toolkit definition: Ένα αντίτυπο στο οποίο εμφανίζεται μια χειρόγραφη υπογραφή. @el
toolkit definition: مفردة تنطوي على مسئولية شخص عن توقيع يظهر على مخطوط. @ar
toolkit definition: 涉及在手稿上出现的签名的个人的责任的单件 @zh-hans
toolkit label: Unterzeichnerin/Unterzeichner von @de
toolkit label: aláírója: @hu
toolkit label: autograafi kirjutaja eksemplaris @et
toolkit label: autografskriver af @da
toolkit label: autographer of @en
toolkit label: firmatario di @it
toolkit label: handtekening-zetter van @nl
toolkit label: imzalayan @tr
toolkit label: ir autogrāfa ierakstītājs @lv
toolkit label: nimikirjoituksen kirjoittaja kappaleessa
toolkit label: person som har signert på @no
toolkit label: signataire autographe de @fr
toolkit label: signatari d’un autògraf de @ca
toolkit label: αυτoγραφέας του @el
toolkit label: موقِّع على @ar
toolkit label: ……的亲笔签名者 @zh-hans
has subproperty: P50129
lexical alias: autographerOf.en
status: Published
type: Property
domain: C10004
label: aláírója a következőnek: @hu
label: autograafi kirjutaja eksemplaris @et
label: er autografskriver af @da
label: er person som har signert på @no
label: est un signataire autographe de @fr
label: imza sahibidir @tr
label: ir autogrāfa ierakstītājs @lv
label: is autographer of @en
label: is handtekening-zetter van @nl
label: ist Unterzeichnerin/Unterzeichner von @de
label: è firmatario di @it
label: és signatari d’un autògraf de @ca
label: είναι αυτoγραφέας του @el
label: هو موقِّع على @ar
label: 是……的亲笔签名者 @zh-hans
sub property of: muokkaaja (henkilö) kappaleessa
definition: Bir kişiyi, üzerinde görünen el yazması imzasının sorumluluğunu içeren bir kopyayla ilişkilendirir. @tr
definition: Correla una persona a un item che implica la responsabilità di una persona per la firma manoscritta che vi appare. @it
definition: Hozzákapcsol egy személyt egy példányhoz, amelyhez hozzátartozik egy személy felelőssége az azon megjelenő kézírásos aláírásért. @hu
definition: Liittää henkilön kappaleeseen, jossa henkilö on vastuussa siinä olevasta käsinkirjoitetusta nimikirjoituksesta.
definition: Met une personne en relation avec un item qui comporte une responsabilité en ce qui concerne une signature manuscrite figurant sur lui. @fr
definition: Relaciona una persona amb un ítem que implica una responsabilitat d’una persona en una signatura autògrafa que hi figura. @ca
definition: Relateert een persoon aan een item dat met zich meebrengt een verantwoordelijkheid voor een handgeschreven handtekening daarop. @nl
definition: Relaterer en person til et eksemplar som involverer ansvar for en signatur som forekommer på et manuskript. @no
definition: Relaterer en person til et eksemplar, som involverer en persons ansvar for at en signatur forekommer på et eksemplar. @da
definition: Relates a person to an item that involves a responsibility of a person for a manuscript signature appearing on it. @en
definition: Sasaista personu ar vienību, kas ietver peronas atbildību par autogrāfu uz tās. @lv
definition: Seostab isiku eksemplariga, mis sisaldab isiku vastutust selles või sellel oleva omakäelise nime või nimemärgi eest. @et
definition: Setzt eine Person in Beziehung zu einem Exemplar, das von der Person handschriftlich unterschrieben wurde. @de
definition: Συνδέει ένα φυσικό πρόσωπο, του οποίου η χειρόγραφη υπογραφή υπάρχει σε ένα αντίτυπο, με ένα αντίτυπο. @el
definition: يربط شخصا بمفردة تنطوي على مسئولية شخص عن توقيع يظهر على مخطوط. @ar
definition: 将一个个人与涉及在手稿上出现的签名的个人的责任的单件关联起来。 @zh-hans

julkaisija (toimija) teokselle
has element type: 2
instruction number: 18.5
toolkit definition: A work that involves a responsibility of an agent for issuing a work, such as an official organ of the body. @en
toolkit definition: Bir kurumun resmi bir organı gibi, bir eserin yayınlanmasına ilişkin bir temsilcinin sorumluluğunu içeren bir eser. @tr
toolkit definition: Darbs, kas ietver aģenta atbildību par darba publicēšanu, piemēram, iestādes biļetens. @lv
toolkit definition: Een werk dat met zich meebrengt een verantwoordelijkheid van een actor voor uitvaardigen van een werk, zoals een officieel orgaan van de instantie. @nl
toolkit definition: Egy mű, amelyhez hozzátartozik egy ágens felelőssége egy olyan mű kibocsátásáért, mint amilyen egy társaság hivatalos orgánuma. @hu
toolkit definition: Ein Werk, bei dem ein Akteur für die Herausgabe eines Werks, zum Beispiel eines offiziellen Organs der Körperschaft, verantwortlich ist. @de
toolkit definition: Et verk som involverer ansvar for en agent i form av å utgi et verk, for eksempel korporasjonens offisielle organ. @no
toolkit definition: Obra que implica una responsabilitat d’un agent en la publicació d’una obra, com ara un òrgan oficial de l’entitat. @ca
toolkit definition: Opera che implica la responsabilità di un agente per l'emissione di un'opera, come un organo ufficiale dell'ente. @it
toolkit definition: Teos, jossa toimija on vastuussa (esim. virallisena toimielimenä) teoksen julkaisemisesta.
toolkit definition: Teos, mis sisaldab tegija vastutust teose, nt asutuse ametliku häälekandja väljaandmise eest. @et
toolkit definition: Værk, som involverer en agents ansvar for at udgive et værk, som et officielt organ for en organisation. @da
toolkit definition: Œuvre qui comporte une responsabilité de la part d’un agent consistant à publier une œuvre, tel un organe officiel de l’agent. @fr
toolkit definition: Ένα έργο που περιλαμβάνει μια ευθύνη για την έκδοση ενός έργου, όπως ένα επίσημο όργανο του οργάνου. @el
toolkit definition: عمل يترتب عليه مسئولية وكيل عن إصدار عمل، مثل الصحيفة الرسمية للهيئة. @ar
toolkit definition: 涉及一个颁布一种作品（例如一个团体的机关刊物）的一个行为者的责任的一种作品 @zh-hans
toolkit label: Herausgebender Akteur von @de
toolkit label: Yayınlayan temsilcisi @tr
toolkit label: agent d’entitat editora de @ca
toolkit label: agent émetteur de @fr
toolkit label: ir publicētājs (aģents) @lv
toolkit label: issuing agent of @en
toolkit label: julkaisija (toimija) teokselle
toolkit label: kibocsátó ágense: @hu
toolkit label: organismo emittente agente di @it
toolkit label: udstedende agent af @da
toolkit label: uitvaardiger-actor van @nl
toolkit label: utgiverorgan for (agent) @no
toolkit label: väljaandja (tegija) teoses @et
toolkit label: εκδοτικός οργανισμός φορέας του @el
toolkit label: وكيل جهة إصدار @ar
toolkit label: ……的颁布行为者 @zh-hans
has subproperty: julkaisija (henkilö) teokselle
has subproperty: julkaisija (yhteistoimija) teokselle
has subproperty: P50130
lexical alias: issuingAgentOf.en
status: Published
type: Property
domain: C10002
label: er udstedende agent af @da
label: er utgiverorgan for (agent) @no
label: est un agent émetteur de @fr
label: ir publicētājs (aģents) @lv
label: is issuing agent of @en
label: is uitvaardiger-actor van @nl
label: ist herausgebender Akteur von @de
label: kibocsátó ágense a következőnek: @hu
label: piyasaya çıkaran temsilcisidir @tr
label: väljaandja (tegija) teoses @et
label: è ente emittente agente di @it
label: és agent d’entitat editora de @ca
label: είναι εκδοτικός οργανισμός φορέας του @el
label: هو وكيل جهة إصدار لـ @ar
label: 是……的颁布行为者 @zh-hans
sub property of: toimijaan liittyvä teos
alternative label: Herausgebendes Organ von @de
alternative label: Yayınlayan kurum @tr
alternative label: ansvarlig institution af @da
alternative label: entitat editora de @ca
alternative label: issuing body of @en
alternative label: julkaisija manifestaatiossa
alternative label: kibocsátója: @hu
alternative label: organisme de publication de @fr
alternative label: organismo emisor de @es
alternative label: organismo emittente di @it
alternative label: utgiverorgan for @no
alternative label: väljaandja teoses @et
alternative label: εκδοτικός οργανισμός του @el
alternative label: جهة إصدار @ar
alternative label: ……的颁布团体 @zh-hans
definition: Bir temsilciyi, bir kuruluşun resmi bir organı gibi bir kaynağı yayınlamaya ilişkin bir temsilcinin sorumluluğunu içeren bir eserle ilişkilendirir. @tr
definition: Correla un agente a un opera che implica la responsabilità di un agente per l'emissione di un'opera, come un organo ufficiale dell'ente. @it
definition: Hozzákapcsol egy ágenst egy műhöz, amelyhez hozzátartozik egy ágens felelőssége egy olyan mű kibocsátásáért, mint amilyen egy társaság hivatalos orgánuma. @hu
definition: Liittää toimijan teokseen, jossa toimija on vastuussa (esim. virallisena toimielimenä) teoksen julkaisemisesta.
definition: Met un agent en relation avec une œuvre qui comporte une responsabilité de la part d’un agent consistant à publier une œuvre, tel un organe officiel de l’agent. @fr
definition: Relaciona un agent amb una obra que implica una responsabilitat d’un agent en la publicació d’una obra, com ara un òrgan oficial de l’entitat. @ca
definition: Relateert een actor aan een werk dat met zich meebrengt een verantwoordelijkheid van een actor voor uitvaardigen van een werk, zoals een officieel orgaan van de instantie. @nl

muuna toimijana teoksessa
has element type: 3
toolkit definition: A work that involves a responsibility other than creation. (Deprecated) @en
toolkit definition: Egy mű, amely kapcsolatban van egy ágenssel (személlyel, testülettel vagy családdal), aki/amely nem az alkotó. @hu
toolkit definition: Ein Werk, bei dem ein Akteur, außer ein geistiger Schöpfer, mit einem Werk in Verbindung steht. @de
toolkit definition: Et verk som forbindes med en annen agent enn opphavspersonen. @no
toolkit definition: Obra associada amb un agent diferent d’un creador. @ca
toolkit definition: Teos, johon liittyy teokseen liittyvä muu toimija, kuin tekijä.
toolkit definition: Værk, der er forbundet med en agent på en anden måde end som ophav. @da
toolkit definition: Œuvre associée à un agent autre qu’un créateur. @fr
toolkit definition: Ένα έργο που συνδέεται με έναν φορέα άλλον από τον δημιουργό. @el
toolkit label: Sonstiger Akteur, der mit einem Werk in Verbindung steht von @de
toolkit label: altre agent associat amb una obra de @ca
toolkit label: anden agent forbundet med et værk @da
toolkit label: annen agent som forbindes med verk av @no
toolkit label: autre agent associé à une œuvre de @fr
toolkit label: muuna toimijana teoksessa
toolkit label: műhöz kötődő másik közvetítő @hu
toolkit label: other agent associated with work of (Deprecated) @en
toolkit label: άλλος φορέας συνδεδεμένος με ένα έργο του @el
has subproperty: soveltavan lainkäyttöalueen päätös
has subproperty: kohdistettu muutoshakemus
has subproperty: muutoshakemus
has subproperty: annettu haaste
has subproperty: saatu haaste
has subproperty: P50131
lexical alias: otherAgentWorkOf.en
status: Deprecated
type: Property
domain: C10002
label: er anden agent, der forbindes med et værk af @da
label: est un autre agent associé à une œuvre de @fr
label: is other agent associated with work of (Deprecated) @en
label: ist sonstiger Akteur, der mit einem Werk in Verbindung steht, von @de
label: művével kapcsolatos másik ágens @hu
label: és altre agent associat amb una obra de @ca
label: είναι άλλος φορέας συνδεδεμένος με το έργο του @el
sub property of: toimijaan liittyvä teos
definition: Egy ágenst (személyt, családot vagy testületet), aki/amely nem alkotóként kötődik egy műhöz, hozzákapcsol egy műhöz. @hu
definition: Liittää toimijan teokseen, johon liittyy muu toimija, kuin tekijä.
definition: Met un agent, autre qu’un créateur, associé à une œuvre en relation avec une œuvre. @fr
definition: Relaciona un agent, associat amb una obra en una relació diferent de la de creador, amb una obra. @ca
definition: Relaterer en agent, der er forbundet med et værk på en anden måde end som ophav til et værk. @da
definition: Relates an agent to a work that involves a responsibility other than creation. (Deprecated) @en
definition: Setzt einen Akteur, außer einen geistigen Schöpfer, der mit einem Werk in Verbindung steht, mit einem Werk in Beziehung. @de
definition: Συνδέει έναν φορέα, ο οποίος συνδέεται με ένα έργο διαφορετικά, όχι ως δημιουργός, με ένα έργο. @el
scope note: Agenter til hvilke korrespondence er stillet, agenter der æres i festskrifter, instruktører, filmfotografer, institutioner der sponsorerer, produktionsfirmaer, institutioner etc. der arrangerer en udstilling, et event, etc., er omfattet. @da
scope note: Agents to whom correspondence is addressed, agents honoured by a festschrift, directors, cinematographers, sponsoring bodies, production companies, institutions, etc., hosting an exhibition or event, etc., are included. (Deprecated) @en
scope note: Azok az ágensek (személyek, családok vagy testületek), akik/amelyek egy levelezés címzettjei, akiket/amelyeket egy emlékkönyvvel tisztelnek meg, rendezők, filmalkotók, szponzori testületek, gyártóvállalatok, intézmények stb., akik/amelyek egy kiállítást vagy eseményt stb. rendeznek, beletartoznak. @hu
scope note: Dazu gehören Akteure, an die Korrespondenz gerichtet ist, Akteure, die durch eine Festschrift geehrt werden, Regisseure, Kameraleute, fördernde Körperschaften, Produktionsfirmen, Institutionen usw., die eine Ausstellung oder ein Ereignis hosten usw. @de
scope note: Sont inclus les agents à qui une correspondance est adressée, les agents à qui sont offerts des mélanges, les réalisateurs, les directeurs de la photographie, les commanditaires, les sociétés de production, les institutions, etc. accueillant une exposition ou un événement, etc. @fr
scope note: Teokseen liittyvä muu toimija tarkoittaa vastaanottajaa, kunnianosoituksen kohdetta, ohjaajaan, elokuvaajaa, sponsoroijaa, tuotantoyhtiötä, isäntäorganisaatiota tms.
scope note: Περιλαμβάνονται φορείς στους οποίους απευθύνεται η αλληλογραφία, τιμώμενοι φορείς σε επετειακούς τόμους, κινηματογραφιστές, χορηγοί, εταιρίες παραγωγής, ιδρύματα κ.λπ. @el

omistuskirjoituksen tekijä (toimija) teoksessa
has element type: 2
instruction number: 18.5
toolkit definition: A work that is assigned as an acknowledgment of the inspiration or support of a related agent. @en
toolkit definition: Darbs, kas ir veltīts pateicībā par saistītā aģenta iedvesmojumu vai atbalstu. @lv
toolkit definition: Een werk dat toegekend is als erkenning van de inspiratie of hulp van een gerelateerde actor. @nl
toolkit definition: Egy mű, amelyet egy műhöz kapcsolódó ágens ösztönzésének vagy támogatásának köszöneteként jelölnek meg. @hu
toolkit definition: Ein Werk, das als Zeichen der Anerkennung oder Unterstützung einem in Beziehung stehenden Akteur gewidmet ist. @de
toolkit definition: Et verk som er tilegnet som anerkjennelse for inspirasjonen eller støtten fra en relatert agent. @no
toolkit definition: Obra que s’assigna com a reconeixement per la inspiració o suport d’un agent relacionat. @ca
toolkit definition: Opera che è assegnata come riconoscimento di ispirazione o sostegno di un agente correlato. @it
toolkit definition: Teos, joka on omistettu sitä innoittaneelle tai tukeneelle toimijalle.
toolkit definition: Teos, mille seotud tegija on pühendanud kellelegi tänuavaldusena innustuse või toetuse eest. @et
toolkit definition: Værk, som er tilegnet en relateret agent, som en anerkendelse af inspiration eller støtte. @da
toolkit definition: İlgili bir temsilcinin ilhamı veya desteğinin bir teşekkürü olarak atanan bir eser. @tr
toolkit definition: Œuvre qui est dédiée en reconnaissance de l’inspiration ou du soutien d’un agent en relation. @fr
toolkit definition: Ένα έργο που είναι αφιερωμένο σε έναν φορέα. @el
toolkit definition: عمل خُصص للإقرار بالإلهام أو الدعم الذي قدمه وكيل ذو صلة. @ar
toolkit definition: 被指定对一个相关行为者的启发或支持之感谢的一种作品 @zh-hans
toolkit label: Akteur als Widmende/Widmender von @de
toolkit label: adayan temsilci @tr
toolkit label: agent dedicant de @ca
toolkit label: agent dédicateur d’une œuvre de @fr
toolkit label: agent som dediserer for @no
toolkit label: agent, som er dedikationsskriver af @da
toolkit label: dedicante agente di @it
toolkit label: dedicator agent of @en
toolkit label: dedikáló ágense: @hu
toolkit label: ir darba veltītājs (aģents) @lv
toolkit label: omistuskirjoituksen tekijä (toimija) teoksessa
toolkit label: opdrager-actor van @nl
toolkit label: pühendaja (tegija) teoses @et
toolkit label: αφιερωτής φορέας του @el
toolkit label: وكيل مُهدي كتاب @ar
toolkit label: ……的题献者行为者 @zh-hans
has subproperty: omistuskirjoituksen tekijä (henkilö) teoksessa
has subproperty: omistuskirjoituksen tekijä (yhteistoimija) teoksessa
has subproperty: P50132
lexical alias: dedicatorAgentOf.en
status: Published
type: Property
domain: C10002
label: dedikáló ágense a következőnek: @hu
label: er agent som dediserer for @no
label: er agent, som er dedikationsskriver af @da
label: est un agent dédicateur d’une œuvre de @fr
label: ir darba veltītājs (aģents) @lv
label: is dedicator agent of @en
label: is opdrager-actor van @nl
label: ist Akteur als Widmende/Widmender von @de
label: ithaf eden temsilcisidir @tr
label: pühendaja (tegija) teoses @et
label: è dedicante agente di @it
label: és agent dedicant de @ca
label: είναι αφιερωτής φορέας του @el
label: هو وكيل مُهدي كتاب لـ @ar
label: 是……的题献者行为者 @zh-hans
sub property of: toimijaan liittyvä teos
alternative label: Widmende/Widmender von @de
alternative label: adayan @tr
alternative label: dedicador de @es
alternative label: dedicant de @ca
alternative label: dedicator of @en
alternative label: dedicatore di @it
alternative label: dedikatør for @no
alternative label: dedikálója: @hu
alternative label: dédicateur de @fr
alternative label: omistuskirjoitus kappaleessa
alternative label: pühendaja teoses @et
alternative label: tilegner af @da
alternative label: αφιερωτής του @el
alternative label: مُهدي كتاب @ar
alternative label: ……的题献者 @zh-hans
definition: Bir temsilciyi, ilgili bir temsilcinin ilhamı veya desteğinin bir teşekkürü olarak ithaf edilen bir eserle ilişkilendirir. @tr
definition: Correla un agente a un'opera che è assegnata come riconoscimento di ispirazione o sostegno di un agente correlato. @it
definition: Hozzákapcsol egy ágenst egy műhöz, amelyet egy műhöz kapcsolódó ágens ösztönzésének vagy támogatásának köszöneteként jelölnek meg. @hu
definition: Liittää toimijan teokseen, joka on omistettu sitä innoittaneelle tai tukeneelle toimijalle.
definition: Met un agent en relation avec une œuvre qui est dédiée en reconnaissance de l’inspiration ou du soutien d’un agent en relation. @fr
definition: Relaciona un agent amb una obra que s’assigna com a reconeixement per la inspiració o suport d’un agent relacionat. @ca
definition: Relateert een actor aan een werk dat toegekend is als erkenning van de inspiratie of hulp van een gerelateerde actor. @nl

kuraattori (toimija) kappaleelle
has element type: 2
instruction number: 18.5
toolkit definition: An item that involves a responsibility of an agent for conceiving or managing the aggregation of an item in an exhibition or collection. (Deprecated) @en
toolkit definition: Een item dat met zich meebrengt een verantwoordelijkheid van een actor voor het bedenken of beheren van het aggregeren van een item in een tentoonstelling of collectie. @nl
toolkit definition: Egy példány, amelyhez hozzátartozik egy ágens felelőssége egy példány kiállítás vagy gyűjtemény keretében történő összegyűjtésének elgondolásáért vagy kezeléséért. @hu
toolkit definition: Ein Exemplar, bei dem ein Akteur die Aggregation eines Exemplars in einer Ausstellung oder Sammlung konzipiert oder organisiert. @de
toolkit definition: Eksemplar, mis sisaldab tegija vastutust eksemplari näituse või koguga liitmise kavandamise või korraldamise eest. @et
toolkit definition: Eksemplar, som involverer en agents ansvar for at udtænke eller administrere samlingen af et eksemplar til en udstilling eller samling. @da
toolkit definition: Et eksemplar som involverer ansvar for en agent i form av å anskaffe eller håndtere innsamlingen av et eksemplar til en utstilling eller samling. @no
toolkit definition: Item che implica una responsabilità di un agente nella concezione o gestione dell'aggregazione di un item a una mostra o collezione. @it
toolkit definition: Item qui comporte une responsabilité de la part d’un agent consistant à concevoir ou à gérer l’agrégation d’un item dans une exposition ou une collection de ressources. @fr
toolkit definition: Kappale, jonka näyttelyyn tai kokoelmaan kuuluvan kappaleaggregaation aikaasaamisessa tai hallinnoimisessa toimija on osallisena.
toolkit definition: Vienība, kas ietver aģenta atbildību par tās iekļaušanu izstādē vai kolekcijā . @lv
toolkit definition: Ítem que implica una responsabilitat d’un agent de concebre o gestionar l’agregació d’un ítem en una exposició o una col·lecció. @ca
toolkit definition: Ένα αντίτυπο το οποίο συλλαμβάνεται, συγκεντρώνεται ή/και οργανώνεται σε μια έκθεση, συλλογή ή άλλο αντίτυπο. @el
toolkit definition: مفردة تنطوي على مسئولية وكيل عن فهم أو إدارة تجميع مفردة في معرض أو في مجموعة. @ar
toolkit label: Akteur als Kuratorin/Kurator von @de
toolkit label: agent conservador de @ca
toolkit label: agent conservateur de @fr
toolkit label: agent, som er kurator af @da
toolkit label: curator agent of (Deprecated) @en
toolkit label: curator-actor van @nl
toolkit label: curatore agente di @it
toolkit label: ir kurators (aģents) @lv
toolkit label: kuraator (tegija) eksemplarile @et
toolkit label: kuraattori (toimija) kappaleelle
toolkit label: kurator for (agent) @no
toolkit label: kurátor ágense: @hu
toolkit label: έφορος φορέας του @el
toolkit label: وكيل أمين معرض @ar
has subproperty: kokoelman muodostaja (toimija) kappaleessa
has subproperty: kokoelman luetteloija (toimija) kappaleessa
has subproperty: kuraattori (henkilö) kappaleessa
has subproperty: kuraattori (yhteistoimija) kappaleessa
has subproperty: P50133
lexical alias: curatorAgentOf.en
status: Deprecated
type: Property
domain: C10002
label: er agent, som er kurator af @da
label: er kurator for (agent) @no
label: est un agent conservateur de @fr
label: ir kurators (aģents) @lv
label: is curator agent of (Deprecated) @en
label: is curator-actor van @nl
label: ist Akteur als Kuratorin/Kurator von @de
label: kuraator (tegija) eksemplarile @et
label: kurátor ágense a következőnek: @hu
label: è curatore agente di @it
label: és agent conservador de @ca
label: είναι έφορος φορέας του @el
label: هو وكيل أمين معرض لـ @ar
sub property of: toimijaan liittyvä kappale
alternative label: Kurator von @de
alternative label: conservador de @ca
alternative label: conservateur de @fr
alternative label: curator of @en
alternative label: curatore di @it
alternative label: kuraator eksemplarile @et
alternative label: kuratoijana kappaleessa
alternative label: kurator af @da
alternative label: kurator for @no
alternative label: kurátora: @hu
alternative label: έφορος του @el
alternative label: أمين متحف @ar
definition: Correla un agente a un item che implica una responsabilità di un agente nella concezione o gestione dell'aggregazione di un item a una mostra o collezione. @it
definition: Hozzákapcsol egy ágenst egy példányhoz, amelyhez hozzátartozik egy ágens felelőssége egy példány kiállítás vagy gyűjtemény keretében történő összegyűjtésének elgondolásáért vagy kezeléséért. @hu
definition: Liittää toimijan kappaleeseen, jonka näyttelyyn tai kokoelmaan kuuluvan kappaleaggregaation aikaasaamisessa tai hallinnoimisessa toimija on osallisena.
definition: Met un agent en relation avec un item qui comporte une responsabilité de la part d’un agent consistant à concevoir ou à gérer l’agrégation d’un item dans une exposition ou une collection de ressources. @fr
definition: Relaciona un agent amb un ítem que implica una responsabilitat d’un agent de concebre o gestionar l’agregació d’un ítem en una exposició o una col·lecció. @ca
definition: Relateert een actor aan een item dat met zich meebrengt een verantwoordelijkheid van een actor voor het bedenken of beheren van het aggregeren van een item in een tentoonstelling of collectie. @nl
definition: Relaterer en agent til et eksemplar som involverer ansvar for en agent i form av å anskaffe eller håndtere innsamlingen av et eksemplar til en utstilling eller samling. @no
definition: Relaterer en agent til et eksemplar, som involverer en agents ansvar for at udtænke eller administrere samlingen af et eksemplar til en udstilling eller samling. @da
definition: Relates an agent to an item that involves a responsibility of an agent for conceiving or managing the aggregation of an item in an exhibition or collection. (Deprecated) @en
definition: Sasaista aģentu ar vienību, kas ietver aģenta atbildību par tās iekļaušanu izstādē vai kolekcijā . @lv
definition: Seostab tegija eksemplariga, mis sisaldab tegija vastutust eksemplari näituse või koguga liitmise kavandamise või korraldamise eest. @et
definition: Setzt einen Akteur in Beziehung zu einem Exemplar, bei dem ein Akteur die Aggregation eines Exemplars in einer Ausstellung oder Sammlung konzipiert oder organisiert. @de
definition: Συνδέει έναν φορέα, που συλλαμβάνει, συγκεντρώνει ή και οργανώνει μια έκθεση, συλλογή ή άλλο αντίτυπο, με ένα αντίτυπο. @el
definition: يربط وكيلا بمفردة يترتب عليها مسئولية وكيل عن فهم أو إدارة تجميع مفردة في معرض أو في مجموعة. @ar

sävellys (ekspressio)
has element type: 2
instruction number: 18.5
toolkit definition: An expression that includes a contribution of adding music to a work that originally lacked it, by composing new music to substitute for original music, or by composing new music to supplement existing music. (Deprecated) @en
toolkit definition: Egy kifejezési forma, amely hozzájárulást jelent azzal, hogy zenét ad hozzá egy műhöz, amelyben az eredetileg nem volt, új zene komponálásával az eredeti zene helyettesítésére, vagy új zene komponálásával a meglévő zene kiegészítésére. @hu
toolkit definition: Eine Expression, bei der ein Akteur Musik zu einem Werk hinzufügt, das im Original keine hatte, neue Musik als Ersatz für die Originalmusik komponiert oder neue Musik komponiert, die eine existierende Musik ergänzt. @de
toolkit definition: Ekspressio, johon on lisätty musiikkia, joka ei aikaisemmin sisältynyt teokseen, tai johon on sävelletty uutta musiikkia korvaamaan teoksen aikaisemman musiikin tai täydentämään olemassa olevaa musiikkia.
toolkit definition: Et uttrykk som omfatter et bidrag i form av å sette musikk til et verk som opprinnelig var uten musikk, ved å komponere musikk som erstatning for originalmusikken, eller ved å komponere ny musikk i tillegg til den eksisterende musikken. @no
toolkit definition: Expression qui intègre une contribution consistant à ajouter de la musique à une œuvre qui n’en avait pas à l’origine, en composant une nouvelle musique pour remplacer une musique originale ou en composant une nouvelle musique pour compléter une musique existante. @fr
toolkit definition: Expressió d’una obra que incorpora una contribució que afegeix música a una obra que originalment no en tenia, composant música nova per substituir la música original, o composant música nova per complementar la música existent. @ca
toolkit definition: Udtryk, der inkorporerer et bidrag ved at tilføje musik til et værk der oprindelig manglede musik, ved at komponere ny musik, som erstatning for den oprindelige musik eller ved at komponere ny musik som supplement til den eksisterende musik. @da
toolkit definition: Μια έκφραση που ενσωματώνει τη συνεισφορά της προσθήκης μουσικής σε ένα έργο που αρχικά δεν διέθετε [μουσική], μέσω της σύνθεσης νέας μουσικής προς αντικατάσταση της πρωτότυπης μουσικής ή μέσω της σύνθεσης νέας μουσικής ως συμπλήρωμα της ήδη υπάρχουσας μουσικής. @el
toolkit label: Komponist (Expression) von @de
toolkit label: composer of expression of (Deprecated) @en
toolkit label: compositeur (expression) de @fr
toolkit label: compositor (expressió) de @ca
toolkit label: komponist (udtryk) til @da
toolkit label: komponist (uttrykk) av @no
toolkit label: sävellys (ekspressio)
toolkit label: zeneszerzője (kifejezési forma) @hu
toolkit label: συνθέτης (έκφραση) του @el
has subproperty: P50134
lexical alias: composerOfExpressionOf.en
status: Deprecated
type: Property
domain: C10002
label: er komponist (udtryk) til @da
label: est un compositeur (expression) de @fr
label: is composer of expression of (Deprecated) @en
label: ist Komponist (Expression) von @de
label: zeneszerzője (kifejezési forma) @hu
label: és compositor (expressió) de @ca
label: είναι συνθέτης (έκφραση) του @el
sub property of: is contributor to aggregated content of (Deprecated)
definition: Egy ágenst (személyt, családot vagy testületet), aki/amely hozzájárul egy kifejezési formához azzal, hogy zenét ad hozzá egy műhöz, amely eredetileg annak híján volt, új zenét komponál, hogy helyettesítse az eredeti zenét, vagy új zenét komponál, hogy kiegészítse a meglévő zenét, hozzákapcsol egy kifejezési formához. @hu
definition: Liittää toimijan ekspressioon, johon on lisätty musiikkia, joka ei aikaisemmin sisältynyt teokseen, tai johon on sävelletty uutta musiikkia korvaamaan teoksen aikaisemman musiikin tai täydentämään olemassa olevaa musiikkia.
definition: Met un agent qui contribue à une expression en ajoutant de la musique à une œuvre qui n’en avait pas à l’origine, en composant une nouvelle musique pour remplacer la musique originale ou en composant une nouvelle musique pour compléter la musique existante en relation avec une expression. @fr
definition: Relaciona un agent, que contribueix a una expressió afegint música a una obra que originalment no en tenia, composant música nova per substituir la música original, o composant música nova per complementar la música existent, amb una expressió. @ca
definition: Relaterer en agent, der har bidraget til et udtryk ved at tilføje musik til et værk, der oprindeligt manglede det, ved at komponere ny musik som erstatning for den oprindelige musik, eller ved at komponere ny musik som supplement til eksisterende musik til et udtryk. @da
definition: Relates an agent to an expression that includes a contribution of adding music to a work that originally lacked it, by composing new music to substitute for original music, or by composing new music to supplement existing music. (Deprecated) @en
definition: Setzt einen Akteur, der zu einer Expression eines Werks beiträgt, indem er Musik zu einem Werk hinzufügt, das im Original keine hatte, neue Musik als Ersatz für die Originalmusik komponiert oder neue Musik komponiert, die eine existierende Musik ergänzt, mit einer Expression in Beziehung. @de
definition: Συνδέει έναν φορέα, ο οποίος συνεισφέρει σε μια έκφραση μέσω της προσθήκης μουσικής σε ένα έργο που αρχικά δεν διέθετε [μουσική], μέσω της σύνθεσης νέας μουσικής προς αντικατάσταση της πρωτότυπης μουσικής ή μέσω της σύνθεσης νέας μουσικής ως συμπλήρωμα της ήδη υπάρχουσας μουσικής, με μια έκφραση. @el

maanmittaus
has element type: 2
instruction number: 18.5
toolkit definition: An expression that includes a contribution of providing measurements or dimensional relationships for a geographic area that is represented in a cartographic work. (Deprecated) @en
toolkit definition: Egy kartográfiai mű, amely hozzájárulást jelent azzal, hogy mérési értékeket vagy dimenzionális kapcsolatokat közöl a megjelenített földrajzi területre vonatkozóan. @hu
toolkit definition: Eine Expression eines kartografischen Werks, bei der ein Akteur Messwerte oder Abmessungsverhältnisse für den dargestellten geografischen Bereich zur Verfügung stellt. @de
toolkit definition: Et uttrykk av et kartografisk verk som omfatter et bidrag i form av å tilføre målinger eller størrelsesforhold for et geografisk område som gjengis. @no
toolkit definition: Expression d’une œuvre cartographique qui intègre une contribution consistant à fournir des mesures ou des relations dimensionnelles pour une aire géographique représentée. @fr
toolkit definition: Expressió d’una obra cartogràfica que incorpora una contribució que proporciona mesuraments o relacions dimensionals d’una àrea geogràfica representada. @ca
toolkit definition: Kartografisen teoksen ekspressio, johon sisältyy maantieteellisen alueen mittojen tai mittasuhteiden kuvaaminen.
toolkit definition: Udtryk af et kartografisk værk, der inkorporerer et bidrag der sørger for opmålinger eller målestoksforhold til et repræsenteret geografisk område. @da
toolkit definition: Μια έκφραση ενός χαρτογραφικού έργου που ενσωματώνει τη συνεισφορά της παροχής μετρήσεων ή σχέσεων διαστάσεων για τη γεωγραφική περιοχή που παρουσιάζεται με μια έκφραση. @el
toolkit label: Landvermesser von @de
toolkit label: agrimensor de @ca
toolkit label: arpenteur de @fr
toolkit label: földmérője @hu
toolkit label: landmåler for @no
toolkit label: landmåler i @da
toolkit label: maanmittaus
toolkit label: surveyor of (Deprecated) @en
toolkit label: τοπογράφος μηχανικός του @el
has subproperty: P50135
lexical alias: surveyorOf.en
status: Deprecated
type: Property
domain: C10002
label: er landmåler i @da
label: est un arpenteur de @fr
label: földmérője @hu
label: is surveyor of (Deprecated) @en
label: ist Landvermesser von @de
label: és agrimensor de @ca
label: είναι τοπογράφος μηχανικός του @el
sub property of: is contributor to aggregated content of (Deprecated)
definition: Egy ágenst (személyt, családot vagy testületet), aki/amely egy kartográfiai mű kifejezési formájához hozzájárul azzal, hogy megadja egy ábrázolt földrajzi terület méreteit vagy dimenzionális kapcsolatait, hozzákapcsolja egy kifejezési formához. @hu
definition: Liittää toimijan kartografisen teoksen ekspressioon, johon sisältyy maantieteellisen alueen mittojen tai mittasuhteiden kuvaaminen.
definition: Met un agent qui contribue à une expression d’une œuvre cartographique en fournissant les mesures ou les relations dimensionnelles pour l’aire géographique représentée en relation avec une expression. @fr
definition: Relaciona un agent, que contribueix a una expressió d’una obra cartogràfica proporcionant mesuraments o relacions dimensionals d’una àrea geogràfica representada, amb una expressió. @ca
definition: Relaterer en agent, der har bidraget til et udtryk af et kartografisk værk ved at sørge for opmålinger eller målestoksforhold til et repræsenteret geografisk område til et udtryk. @da
definition: Relates an agent to an expression that includes a contribution of providing measurements or dimensional relationships for a geographic area that is represented in a cartographic work. (Deprecated) @en
definition: Setzt einen Akteur, der an der Expression eines kartografischen Werks mitwirkt, indem er Messwerte oder Abmessungsverhältnisse für den dargestellten geografischen Bereich zur Verfügung stellt, mit einer Expression in Beziehung. @de
definition: Συνδέει έναν φορέα, ο οποίος συνεισφέρει σε μια έκφραση ενός χαρτογραφικού έργου παρέχοντας μετρήσεις ή σχέσεις διαστάσεων για τη γεωγραφική περιοχή που παρουσιάζεται, με μια έκφραση. @el

animaattori (toimija) ekspressiossa
has element type: 2
instruction number: 18.5
see also: taiteilija (toimija) teoksessa
toolkit definition: An expression that includes a contribution by an agent of giving apparent movement to inanimate objects or drawings. @en
toolkit definition: Cansız nesnelere veya çizimlere görünür hareket veren bir temsilcinin katkısını içeren bir anlatım. @tr
toolkit definition: Een expressie die omvat een bijdrage door een actor door het geven van schijnbare beweging aan levenloze objecten of tekeningen. @nl
toolkit definition: Egy kifejezési forma, amely magában foglalja egy ágens közreműködését élettelen tárgyak vagy rajzok látszólagos mozgatásában. @hu
toolkit definition: Eine Expression, zu der ein Akteur beiträgt, indem er unbelebte Objekte oder Zeichnungen in scheinbare Bewegung versetzt. @de
toolkit definition: Ekspressio, jonka tekemiseen toimija osallistuu tuottamalla näennäistä liikettä elottomiin esineisiin tai piirroksiin.
toolkit definition: Espressione che include un contributo da parte di un agente nel dare movimento apparente a oggetti o disegni inanimanti. @it
toolkit definition: Et uttrykk som inkluderer et bidrag fra en agent i form av å gi tilsynelatende bevegelse til tegninger eller figurer. @no
toolkit definition: Expression qui intègre une contribution de la part d’un agent consistant à donner l’illusion du mouvement à des objets inanimés ou à des dessins. @fr
toolkit definition: Expressió que inclou una contribució d’un agent donant l’aparença de moviment a objectes o dibuixos inanimats. @ca
toolkit definition: Izteiksme, kas ietver aģenta ieguldījumu, pieškirot šķietamu kustību nekustīgiem objektiem vai zīmējumiem. @lv
toolkit definition: Udtryk, som omfatter en agents bidrag ved at give en illusion af bevægelse til livløse objekter eller tegninger. @da
toolkit definition: Väljendus, millesse tegija on andnud panuse, pannes näiliselt liikuma elutud esemed või joonistused. @et
toolkit definition: Μια έκφραση ενός έργου κινητής εικόνας ή προγράμματος υπολογιστή που ενσωματώνει τη συνεισφορά της παροχής φαινομενικής κίνησης σε άψυχα αντικείμενα ή σχέδια. @el
toolkit definition: تعبيرة تتضمن إسهام وكيل في جعل أو رسومات جامدة تتحرك حركة واضحة. @ar
toolkit definition: 包括一个行为者对给予无生命对象或绘画以貌似运动之贡献的一种内容表达 @zh-hans
toolkit label: Akteur als Trickfilmzeichnerin/Trickfilmzeichner von @de
toolkit label: [σχεδιαστής] κινησιομοίωσης φορέας του @el
toolkit label: agent animador de @ca
toolkit label: agent animateur de @fr
toolkit label: agent, som er animator af @da
toolkit label: animaator (tegija) väljenduses @et
toolkit label: animaattori (toimija) ekspressiossa
toolkit label: animator agent of @en
toolkit label: animator-actor van @nl
toolkit label: animatore agente di @it
toolkit label: animatör temsilcisi @tr
toolkit label: animatør av (agent) @no
toolkit label: animátor ágense: @hu
toolkit label: ir animators (aģents) @lv
toolkit label: وكيل فنان رسوم متحركة @ar
toolkit label: ……的动画师行为者 @zh-hans
has subproperty: animaattori (henkilö) ekspressiossa
has subproperty: animaattori (yhteistoimija) ekspressiossa
has subproperty: P50136
lexical alias: animatorAgentOf.en
status: Published
type: Property
domain: C10002
label: animaator (tegija) väljenduses @et
label: animatör temsilcisidir @tr
label: animátor ágense a következőnek: @hu
label: er agent, som er animator af @da
label: er animatør av (agent) @no
label: est un agent animateur de @fr
label: ir animators (aģents) @lv
label: is animator agent of @en
label: is animator-actor van @nl
label: ist Akteur als Trickfilmzeichnerin/Trickfilmzeichner von @de
label: è animatore agente di @it
label: és agent animador de @ca
label: είναι [σχεδιαστής] κινησιομοίωσης φορέας του @el
label: هو وكيل فنان رسوم متحركة لـ @ar
label: 是……的动画师行为者 @zh-hans
sub property of: esitykseen osallinen toimija ekspressiossa
alternative label: Trickfilmzeichner von @de
alternative label: [σχεδιαστής] κινουμένων σχεδίων @el
alternative label: animaatio
alternative label: animaator väljenduses @et
alternative label: animador de @ca
alternative label: animateur de @fr
alternative label: animator af @da
alternative label: animator of @en
alternative label: animatore di @it
alternative label: animatör @tr
alternative label: animatør av @no
alternative label: animátora: @hu
alternative label: فنان رسوم متحركة @ar
alternative label: ……的动画师 @zh-hans
definition: Bir temsilciyi, temsilcinin hareketsiz nesnelere veya çizimlere görünür hareket veren bir temsilcinin katkısını içeren bir anlatımla ilişkilendirir. @tr
definition: Correla un agente a un'espressione che include un contributo da parte di un agente nel dare movimento apparente a oggetti o disegni inanimati. @it
definition: Hozzákapcsol egy ágenst egy kifejezési formához, amely magában foglalja egy ágens közreműködését élettelen tárgyak vagy rajzok látszólagos mozgatásában. @hu
definition: Liittää toimijan ekspressioon, jonka tekemiseen toimija osallistuu tuottamalla näennäistä liikettä elottomiin esineisiin tai piirroksiin.
definition: Met un agent en relation avec une expression qui intègre une contribution de la part d’un agent consistant à donner l’illusion du mouvement à des objets inanimés ou à des dessins. @fr
definition: Relaciona un agent amb una expressió que inclou una contribució d’un agent donant l’aparença de moviment a objectes o dibuixos inanimats. @ca
definition: Relateert een actor aan een expressie die omvat een bijdrage door een actor door het geven van schijnbare beweging aan levenloze objecten of tekeningen. @nl

sovittaja (toimija) ekspressiossa
has element type: 2
instruction number: 18.5
see also: teoksen säveltäjä (toimija) musiikkiteoksessa
toolkit definition: An expression that includes a contribution by an agent of rewriting a musical composition for a medium of performance different from that for which the work was originally intended. @en
toolkit definition: Bir performans ortamı bestesini, çalışmanın orijinal amacından farklı olarak yeniden yazmakla görevli bir temsilcinin katkısını içeren bir anlatım. @tr
toolkit definition: Een expressie die omvat een bijdrage door een actor door herschrijven van een muzikale compositie voor een uitvoeringsmedium anders dan waarvoor het werk oorspronkelijk bedoeld was. @nl
toolkit definition: Eine Expression, zu der ein Akteur beiträgt, indem er eine Komposition für eine bestimmte Besetzung umschreibt, die sich von der Originalbesetzung unterscheidet, für die das Werk ursprünglich konzipiert war. @de
toolkit definition: Ekspressio, jonka tekemiseen toimija osallistuu muokkaamalla sävellyksen alkuperäisteoksesta poikkeavalle esityskokoonpanolle.
toolkit definition: Espressione che include un contributo da parte di un agente nella riscrittura di una composizione musicale per uno strumento di esecuzione differente da quello per il quale l'opera era stata originariamente concepita. @it
toolkit definition: Et uttrykk som inkludrerer et bidrag fra en agent i form av omskriving av en musikalsk komposisjon for en annen besetning enn verket opprinnelig var ment for. @no
toolkit definition: Expression qui intègre une contribution de la part d’un agent consistant à réécrire une composition musicale pour une distribution d’exécution différente de celle à laquelle l’œuvre était destinée à l’origine. @fr
toolkit definition: Expressió que inclou una contribució d’un agent de reescriure una composició musical per a un repartiment d’execució diferent d’aquell per al qual l’obra va ser concebuda originalment. @ca
toolkit definition: Izteiksme, kas ietver aģenta ieguldījumu, pārrakstot mūzikas kompozīciju izpildījumam, kas atšķirīgs no tā, kas sākotnēji bija paredzēts. @lv
toolkit definition: Udtryk, som omfatter en agents bidrag ved at omskrive en komposition til en anden besætning end den, værket oprindeligt var beregnet til. @da
toolkit definition: Väljendus, millesse tegija on andnud panuse, arranžeerides kompositsiooni esituskoosseisule, mis erineb sellest, millele teos oli algselt mõeldud. @et
toolkit definition: zenei hangszerelője: @hu
toolkit definition: Μια έκφραση ενός μουσικού έργου που ενσωματώνει τη συνεισφορά της μεταγραφής της σύνθεσης για μέσο εκτέλεσης διαφορετικό από το πρωτότυπο. @el
toolkit definition: تعبيرة تتضمن إسهام وكيل في إعادة كتابة لحن موسيقي لوسيط أداء يختلف عن الوسيط الذي كان العمل مقررا له أصلاً. @ar
toolkit definition: 包括一个改写音乐作曲用于不同于作品最初意图的一个表演媒介的一个行为者的贡献的一种内容表达 @zh-hans
toolkit label: Akteur als Arrangeurin/Arrangeur von @de
toolkit label: Egy kifejezési forma, amely magában foglalja egy ágens közreműködését egy zenei kompozíció olyan előadásmédiumra átírásával, amely különbözik a műnek eredetileg szánt médiumtól. @hu
toolkit label: agent arrangeur de musique de @fr
toolkit label: agent arranjador de música de @ca
toolkit label: agent, som er musikarrangør af @da
toolkit label: arranger agent of music of @en
toolkit label: arrangeur-actor van muziek van @nl
toolkit label: arrangiatore di musica agente di @it
toolkit label: arrangør av musikk for (agent) @no
toolkit label: ir aranžētājs (aģents) @lv
toolkit label: muusika seadja (tegija) väljenduses @et
toolkit label: müzik aranjör temsilcisi @tr
toolkit label: sovittaja (toimija) ekspressiossa
toolkit label: διασκευαστής φορέας της μουσικής του @el
toolkit label: وكيل موزع موسيقي @ar
toolkit label: ……的音乐改编者行为者 @zh-hans
has subproperty: sovittaja (henkilö) ekspressiossa
has subproperty: sovittaja (yhteistoimija) ekspressiossa
has subproperty: P50137
lexical alias: arrangerAgentOfMusicOf.en
status: Published
type: Property
domain: C10002
label: er agent, som er musikarrangør af @da
label: er arrangør av musikk for (agent) @no
label: est un agent arrangeur de musique de @fr
label: ir aranžētājs (aģents) @lv
label: is arranger agent of music of @en
label: is arrangeur-actor van muziek van @nl
label: ist Akteur als Arrangeurin/Arrangeur von @de
label: muusika seadja (tegija) väljenduses @et
label: müziğinin aranjör temsilcisidir @tr
label: zenei hangszerelő ágense a következőnek: @hu
label: è arrangiatore di musica agente di @it
label: és agent arranjador de música de @ca
label: είναι διασκευαστής φορέας της μουσικής του @el
label: هو وكيل موزع موسيقي لـ @ar
label: 是……的音乐改编者行为者 @zh-hans
sub property of: tarkastaja (toimija) ekspressiossa
alternative label: Arrangeur von @de
alternative label: Egy zenei hangszerelő módosíthatja a művet a mű elrendezéséhez egyező előadásmédiumra, stb., amikor alapvetően változatlanul megtartja az eredeti kompozíció zenei lényegét. @hu
alternative label: arranger of music of @en
alternative label: arrangeur de musique de @fr
alternative label: arrangiatore di musica di @it
alternative label: arrangør av musikk for @no
alternative label: arranjador de música de @ca
alternative label: arreglista de música de @es
alternative label: musikarrangør af @da
alternative label: muusika seadja väljenduses @et
alternative label: müzik aranjörü @tr
alternative label: sovittajana musiikissa
alternative label: διασκευαστής της μουσικής του @el
alternative label: موزع موسيقي @ar
alternative label: ……的音乐改编者 @zh-hans
definition: Bir temsilciyi, bir müzik bestesinin, orijinal olarak amaçlandığından farklı bir performans ortamı için yeniden yazan bir temsilcinin katkısını içeren anlatımla ilişkilendirir. @tr
definition: Correla un agente a un'espressione che include un contributo da parte di un agente nella riscrittura di una composizione musicale per uno strumento di esecuzione differente da quello per il quale l'opera era stata originariamente concepita. @it
definition: Hozzákapcsol egy ágenst egy kifejezési formához, amely magában foglalja egy ágens közreműködését egy zenei kompozíció olyan előadásmédiumra átírásával, amely különbözik a műnek eredetileg szánt médiumtól. @hu
definition: Liittää toimijan ekspressioon, jonka tekemiseen toimija osallistuu muokkaamalla sävellyksen alkuperäisteoksesta poikkeavalle esityskokoonpanolle.
definition: Met un agent en relation avec une expression qui intègre une contribution de la part d’un agent consistant à réécrire une composition musicale pour une distribution d’exécution différente de celle à laquelle l’œuvre était destinée à l’origine. @fr
definition: Relaciona un agent amb una expressió que inclou una contribució d’un agent de reescriure una composició musical per a un repartiment d’execució diferent d’aquell per al qual l’obra va ser concebuda originalment. @ca

kirjoittajana lisätyssä tekstissä
has element type: 2
instruction number: 18.5
toolkit definition: Alkuaan pääasiassa tekstittömän teoksen ekspressio, johon on tuotettu tekstiä, kuten kuvatekstejä valokuviin tai karttojen kuvauksia.
toolkit definition: An expression that includes a contribution of adding text, such as captions for photographs or descriptions of maps. (Deprecated) @en
toolkit definition: Egy elsődlegesen nem-szöveges mű kifejezési formája, amely hozzájárulást jelent azzal, hogy fényképaláírásokhoz vagy térképleírásokhoz hasonló szöveget ad hozzá. @hu
toolkit definition: Eine Expression, bei der ein Akteur Texte für das nicht textliche Werk verfasst, z. B. Bildunterschriften für Fotografien oder Beschreibungen von Karten. @de
toolkit definition: Et uttrykk av et verk som ikke hovedsakelig består av tekst, som omfatter et bidrag i form av å tilføre tekst, for eksempel bildetekster eller kartbeskrivelser. @no
toolkit definition: Expression d’une œuvre essentiellement non textuelle qui intègre une contribution consistant à fournir du texte, par exemple en écrivant des légendes pour des photographies ou des descriptions de cartes géographiques. @fr
toolkit definition: Expressió d’una obra principalment no textual que incorpora una contribució que proporciona text, com ara escrivint peus de fotografies o descripcions de mapes. @ca
toolkit definition: Udtryk af et fortrinsvis ikke-tekstligt værk, der inkorporerer et bidrag der sørger for tekst som fx billedtekster til fotos eller beskrivelser af kort. @da
toolkit definition: Μια έκφραση ενός μη κειμενικού αρχικά έργου το οποίο ενσωματώνει τη συνεισφορά της παροχής κείμενου, όπως επικεφαλίδες για φωτογραφίες ή περιγραφές για χάρτες. @el
toolkit label: Verfasser von Zusatztexten von @de
toolkit label: auteur de texte ajouté de @fr
toolkit label: escriptor d’un text addicional de @ca
toolkit label: forfatter av tilføyd tekst for @no
toolkit label: forfatter til tilføjet tekst til @da
toolkit label: hozzáadott szöveg írója @hu
toolkit label: kirjoittajana lisätyssä tekstissä
toolkit label: writer of added text of (Deprecated) @en
toolkit label: συγγραφέας του πρόσθετου κειμένου του @el
has subproperty: kirjoittajana lisätylle sanoitukselle
has subproperty: P50138
lexical alias: writerOfAddedTextOf.en
status: Deprecated
type: Property
domain: C10002
label: er forfatter til tilføjet tekst til @da
label: est un auteur de texte ajouté de @fr
label: hozzáadott szöveg írója @hu
label: is writer of added text of (Deprecated) @en
label: ist Verfasser von Zusatztexten von @de
label: és escriptor d’un text addicional de @ca
label: είναι συγγραφέας του πρόσθετου κειμένου του @el
sub property of: oheisteksti
definition: Egy ágenst (személyt, családot vagy testületet), aki/amely egy elsősorban nem-szöveges mű kifejezési formájához hozzájárul azzal, hogy például fényképek képaláírását vagy térképek leírását tartalmazó szöveget csatol hozzá, hozzákapcsol egy kifejezési formához. @hu
definition: Liittää toimijan alkuaan pääasiassa tekstittömän teoksen ekspressioon, johon on tuotettu tekstiä, kuten kuvatekstejä valokuviin tai karttojen kuvauksia.
definition: Met un agent qui contribue à une expression d’une œuvre essentiellement non textuelle en fournissant du texte tel que des légendes de photographies ou des descriptions de cartes géographiques en relation avec une expression. @fr
definition: Relaciona un agent, que contribueix a una expressió d’una obra principalment no textual proporcionant text per a l’obra no textual, com ara escrivint peus de fotografies o descripcions de mapes, amb una expressió. @ca
definition: Relaterer en agent der har bidraget til et udtryk af et fortrinsvisikke-tekstligt værk ved at sørge for tekst til det ikke-tekstlige værk til et udtryk. @da
definition: Relates an agent to an expression that includes a contribution of adding text, such as captions for photographs or descriptions of maps. (Deprecated) @en
definition: Setzt einen Akteur, der an einer Expression eines primär nicht textlichen Werks mitwirkt, indem er Texte für das nicht textliche Werk verfasst, z. B. Bildunterschriften für Fotografien oder Beschreibungen von Karten, mit einer Expression in Beziehung. @de
definition: Συνδέει έναν φορέα, ο οποίος συνεισφέρει σε μια έκφραση ενός μη κειμενικού αρχικά έργου παρέχοντας κείμενο, όπως επικεφαλίδες για φωτογραφίες ή περιγραφές για χάρτες, με μια έκφραση. @el

näyttämöohjaaja (toimija) ekspressiossa
has element type: 2
instruction number: 18.5
toolkit definition: An expression that includes a contribution by an agent of general management and supervision of a stage performance. @en
toolkit definition: Bir sahne performansının genel yönetim ve denetimine bir temsilcinin katkısını içeren bir anlatım. @tr
toolkit definition: Een expressie die omvat een bijdrage door een actor door algeheel beheer en toezicht van een toneeluitvoering. @nl
toolkit definition: Egy kifejezési forma, amely magában foglalja egy ágens közreműködését egy színpadi előadás általános menedzselésében és felügyeletében. @hu
toolkit definition: Eine Expression einer Bühnendarbietung, zu der ein Akteur durch die allgemeine Betreuung und Leitung beiträgt. @de
toolkit definition: Ekspressio, jonka tekemiseen toimija osallistuu johtamalla ja valvomalla näyttämöesitystä.
toolkit definition: Espressione che include un contributo di una persona per la gestione e supervisione generale di un'interpretazione teatrale. @it
toolkit definition: Et uttrykk som inkluderer et bidrag fra en agent i form av generell ledelse av en sceneforestilling. @no
toolkit definition: Expression qui intègre une contribution de la part d’un agent consistant à assurer la gestion et la supervision générales d’une prestation scénique. @fr
toolkit definition: Expressió que inclou una contribució d’un agent en la gestió general i la supervisió d’una representació escènica. @ca
toolkit definition: Izteiksme, kas ietver aģenta ieguldījumu, vispārēji vadot un uzraugot uzvedumu. @lv
toolkit definition: Udtryk, som omfatter en agents bidrag gennem den generelle ledelse af- og tilsyn med en sceneoptræden. @da
toolkit definition: Väljendus, millesse tegija on andnud panuse lavateose esituse üldise juhtimise ja juhendamisega. @et
toolkit definition: Μια έκφραση ενός θεατρικού έργου που ενσωματώνει τη συνεισφορά της γενικής οργάνωσης και εποπτείας μιας παράστασης. @el
toolkit definition: تعبيرة تتضمن إسهام وكيل في الإدارة العامة لأداء مسرحي والإشراف عليه. @ar
toolkit definition: 包括一个行为者对舞台表演总体管理和监督的贡献的一种内容表达 @zh-hans
toolkit label: Akteur als Bühnenregisseurin/Bühnenregisseur von @de
toolkit label: Sahne yönetmeni temsilci @tr
toolkit label: agent director d’escena de @ca
toolkit label: agent metteur en scène de @fr
toolkit label: agent, som er sceneinstruktør af @da
toolkit label: direttore teatrale agente di @it
toolkit label: ir teātra režisors (aģents) @lv
toolkit label: lavastaja (tegija) väljenduses @et
toolkit label: näyttämöohjaaja (toimija) ekspressiossa
toolkit label: sceneregissør for (agent) @no
toolkit label: stage director agent of @en
toolkit label: színpadi rendező ágense: @hu
toolkit label: toneelregisseur-actor van @nl
toolkit label: διευθυντής σκηνής φορέας του @el
toolkit label: وكيل مدير مسرح @ar
toolkit label: ……的舞台导演行为者 @zh-hans
has subproperty: näyttämöohjaaja (henkilö) ekspressiossa
has subproperty: näyttämöohjaaja (yhteistoimija) ekspressiossa
has subproperty: P50139
lexical alias: stageDirectorAgentOf.en
status: Published
type: Property
domain: C10002
label: Sahne yönetmeni temsilcisidir. @tr
label: er agent, som er sceneinstruktør af @da
label: er sceneregissør for (agent) @no
label: est un agent metteur en scène de @fr
label: ir teātra režisors (aģents) @lv
label: is stage director agent of @en
label: is toneelregisseur-actor van @nl
label: ist Akteur als Bühnenregisseurin/Bühnenregisseur von @de
label: lavastaja (tegija) väljenduses @et
label: színpadi rendező ágense a következőnek: @hu
label: è regista teatrale agente di @it
label: és agent director d’escena de @ca
label: είναι διευθυντής σκηνής φορέας του @el
label: هو وكيل مدير مسرح لـ @ar
label: 是……的舞台导演行为者 @zh-hans
sub property of: esitykseen osallinen toimija ekspressiossa
alternative label: Bühnenregisseur von @de
alternative label: director d’escena de @ca
alternative label: director escénico de @es
alternative label: direttore teatrale di @it
alternative label: lavastaja väljenduses @et
alternative label: metteur en scène de @fr
alternative label: näyttämöohjaus
alternative label: sahne yönetmeni @tr
alternative label: sceneinstruktør af @da
alternative label: sceneregissør for @no
alternative label: stage director of @en
alternative label: színpadi rendezője: @hu
alternative label: διευθυντής σκηνής του @el
alternative label: مدير مسرح لـ @ar
alternative label: ……的舞台导演 @zh-hans
definition: Bir temsilciyi, bir sahne performansının genel yönetimi ve denetiminden sorumlu bir temsilcinin katkısını içeren bir anlatımla ilişkilendirir. @tr
definition: Correla un agente a un'espressione che include un contributo di una persona per la gestione e supervisione generale di un'interpretazione teatrale. @it
definition: Hozzákapcsol egy ágenst egy kifejezési formához, amely magában foglalja egy ágens közreműködését egy színpadi előadás általános menedzselésében és felügyeletében. @hu
definition: Liittää toimijan ekspressioon, jonka tekemiseen toimija osallistuu johtamalla ja valvomalla näyttämöesitystä.
definition: Met un agent en relation avec une expression qui intègre une contribution de la part d’un agent consistant à assurer la gestion et la supervision générales d’une prestation scénique. @fr
definition: Relaciona un agent amb una expressió que inclou una contribució d’un agent en la gestió general i la supervisió d’una representació escènica. @ca
definition: Relateert een actor aan een expressie die omvat een bijdrage door een actor door algeheel beheer en toezicht van een toneeluitvoering. @nl

ekspression haastattelija (toimija) ekspressiossa
has element type: 2
instruction number: 18.5
toolkit definition: An expression that includes a contribution by an agent of interviewing, reporting, or some other kind of gathering of information. @en
toolkit definition: Een expressie die omvat een bijdrage door een actor door ondervragen, rapporteren of een andere vorm van informatie verzamelen. @nl
toolkit definition: Egy kifejezési forma, amely magában foglalja egy ágens közreműködését interjúban, riportban vagy más információgyűjtő minőségben. @hu
toolkit definition: Eine Expression, zu der ein Akteur beiträgt, indem er als Interviewerin/Interviewer, Reporterin/Reporter, Meinungsforscherin/Meinungsforscher oder anderer Akteur Informationen zusammenträgt. @de
toolkit definition: Ekspressio, jonka tekemiseen toimija osallistuu toimimalla haastattelijana, toimittajana tai jonain muuna tietoja keräävänä toimijana.
toolkit definition: Espressione che include un contributo da parte di un agente nell'intervistare, riferire notizie o qualche altro tipo di raccolta di informazioni. @it
toolkit definition: Et uttrykk som inkluderer et bidrag fra en agent i form av intervjuer, reporter eller annen form for innsamling av informasjon. @no
toolkit definition: Expression qui intègre une contribution de la part d’un agent consistant à réaliser un entretien, un reportage ou un autre type de collecte d’informations. @fr
toolkit definition: Expressió que inclou una contribució d’un agent entrevistant, informant o recopilant informació d’alguna altra manera. @ca
toolkit definition: Izteiksme, kas ietver aģenta ieguldījumu, darbojoties kā intervētājs, reportieris, aptaujas organizētājs vai kāds cits informācijas apkopotājs. @lv
toolkit definition: Röportaj, raporlama veya başka bir tür bilgi toplayan bir temsilcinin katkısını içeren bir anlatım. @tr
toolkit definition: Udtryk, som omfatter en agents bidrag ved at interviewe, rapportere eller en anden form for indsamling af information. @da
toolkit definition: Väljendus, millesse tegija on andnud panuse, intervjueerides, tehes reportaaži või kogudes muul viisil infot. @et
toolkit definition: Μια έκφραση ενός έργου που ενσωματώνει τη συνεισφορά ενός φορέα που ενεργεί ως ο συνεντευκτής, ως δημοσιογράφος, δημοσκόπος ή κάποιος άλλος φορέας συλλογής πληροφοριών. @el
toolkit definition: تعبيرة تتضمن إسهام وكيل في إجراء مقابلات أو إعداد تقارير أو جمع المعلومات بطريقة أخرى. @ar
toolkit definition: 包括一个采访、报道或其他某种信息收集的一个行为者的贡献的一种内容表达 @zh-hans
toolkit label: Akteur als Interviewerin/Interviewer einer Expression von @de
toolkit label: agent entrevistador d’una expressió de @ca
toolkit label: agent intervieweur d’une expression de @fr
toolkit label: agent, som er interviewer for udtryk af @da
toolkit label: anlatımının görüşmeci temsilcisidir @tr
toolkit label: ekspression haastattelija (toimija) ekspressiossa
toolkit label: interjúkészítő ágense a következő kifejezési formának: @hu
toolkit label: interviewer agent of expression of @en
toolkit label: interviewer-actor van expressie van @nl
toolkit label: intervistatore agente di espressione di @it
toolkit label: intervjueerija (tegija) väljenduses @et
toolkit label: intervjuer for uttrykk av (agent) @no
toolkit label: ir intervētājs (aģents) izteiksmē @lv
toolkit label: συνεντευκτής φορέας της έκφρασης του @el
toolkit label: وكيل محاور في تعبيرة @ar
toolkit label: ……的内容表达的采访者行为者 @zh-hans
has subproperty: ekspression haastattelija (henkilö) ekspressiossa
has subproperty: ekspression haastattelija (yhteistoimija) ekspressiossa
has subproperty: P50140
lexical alias: interviewerAgentOfExpressionOf.en
status: Published
type: Property
domain: C10002
label: anlatımının görüşmeci temsilcisidir @tr
label: er agent, som er interviewer for udtryk af @da
label: er intervjuer for uttrykk av (agent) @no
label: est un agent intervieweur d’une expression de @fr
label: interjúkészítő ágense a következő kifejezési formának: @hu
label: intervjueerija (tegija) väljenduses @et
label: ir intervētājs (aģents) izteiksmē @lv
label: is interviewer agent of expression of @en
label: is interviewer-actor van expressie van @nl
label: ist Akteur als Interviewerin/Interviewer einer Expression von @de
label: è intervistatore agente di espressione di @it
label: és agent entrevistador d’una expressió de @ca
label: είναι συνεντευκτής φορέας της έκφρασης του @el
label: هو وكيل محاور في تعبيرة لـ @ar
label: 是……的内容表达的采访者行为者 @zh-hans
sub property of: esitykseen osallinen toimija ekspressiossa
alternative label: Interviewer (Expression) von @de
alternative label: entrevistador (expresión) de @es
alternative label: entrevistador (expressió) de @ca
alternative label: haastattelijana haastattelussa (ekspressio)
alternative label: interjúkészítője a következőnek (kifejezési forma): @hu
alternative label: interviewer (expression) of @en
alternative label: interviewer (udtryk) af @da
alternative label: intervieweur (expression) de @fr
alternative label: intervistatore di espressione di @it
alternative label: intervjueerija väljenduses @et
alternative label: intervjuer for uttrykk av @no
alternative label: συνεντευκτής της έκφρασης του @el
alternative label: محاور في تعبيرة @ar
alternative label: ……的采访者（内容表达） @zh-hans
definition: Bir temsilciyi, görüşme, raporlama veya diğer bazı bilgi kaynaklarını toplayan temsilcinin katkısını içeren bir anlatımla ilişkilendirir. @tr
definition: Correla un agente a un'espressione che include un contributo da parte di un agente nell'intervistare, riferire notizie o qualche altro tipo di raccolta di informazioni. @it
definition: Hozzákapcsol egy ágenst egy kifejezési formához, amely magában foglalja egy ágens közreműködését interjúban, riportban vagy más információgyűjtő minőségben. @hu
definition: Liittää toimijan ekspressioon, jonka tekemiseen toimija osallistuu toimimalla haastattelijana, toimittajana tai jonain muuna tietoja keräävänä toimijana.
definition: Met un agent en relation avec une expression qui intègre une contribution de la part d’un agent consistant à réaliser un entretien, un reportage ou un autre type de collecte d’informations. @fr
definition: Relaciona un agent amb una expressió que inclou una contribució d’un agent entrevistant, informant o recopilant informació d’alguna altra manera. @ca
definition: Relateert een actor aan een expressie die omvat een bijdrage door een actor door ondervragen, rapporteren of een andere vorm van informatie verzamelen. @nl
definition: Relaterer en agent til et udtryk, som omfatter en agents bidrag ved at interviewe, rapportere eller en anden form for indsamling af information. @da

piirtäjä (toimija) ekspressiossa
has element type: 2
instruction number: 18.5
toolkit definition: An expression that includes a contribution by an agent of making detailed plans or drawings for buildings, ships, aircraft, machines, objects, etc. @en
toolkit definition: Binalar, gemiler, uçaklar, makineler, nesneler vb. için ayrıntılı planlar veya çizimler yapan bir temsilcinin katkısını içeren bir anlatım. @tr
toolkit definition: Een expressie die omvat een bijdrage door een actor door het maken van gedetailleerde plattegronden of tekeningen voor gebouwen, schepen, luchtvaartuigen, machines, voorwerpen etc. @nl
toolkit definition: Egy kifejezési forma, amely magában foglalja egy ágens közreműködését épületek, hajók, repülőgépek, gépek, objektumok, stb. részletes terveinek vagy rajzainak elkészítésében. @hu
toolkit definition: Eine Expression, zu der ein Akteur beiträgt, indem er detaillierte Pläne oder Zeichnungen für Gebäude, Schiffe, Flugzeuge, Maschinen, Objekte oder ähnliches erstellt. @de
toolkit definition: Ekspressio, jonka tekemiseen toimija osallistuu tuottamalla tarkkoja suunnitelmia tai piirroksia rakennuksista, laivoista, lentokoneista, laitteista, esineistä tms.
toolkit definition: Espressione che include un contributo da parte di un agente nel fare progetti o disegni dettagliati per edifici, navi, aerei, macchine, oggetti, etc. @it
toolkit definition: Et uttrykk som inkluderer et bidrag fra en agent i form av å lage detaljerte plantegninger for bygninger, skip, fly, maskiner, gjenstander, etc. @no
toolkit definition: Expression qui intègre une contribution de la part d’un agent consistant à effectuer des plans ou des dessins détaillés pour des bâtiments, des navires, des avions, des machines, des objets, etc. @fr
toolkit definition: Expressió que inclou una contribució d’un agent elaborant plànols o dibuixos detallats d’edificis, de vaixells, d’avions, de màquines, d’objectes, etc. @ca
toolkit definition: Izteiksme, kas ietver aģenta ieguldījumu, izstrādājot ēku, kuģu, lidmašīnu, mašīnu, objektu utt. detalizētus plānus vai rasējumus. @lv
toolkit definition: Mια έκφραση ενός έργου που ενσωματώνει τη συνεισφορά ενός αρχιτέκτονα, εφευρέτη κ.λπ. μέσω της δημιουργίας λεπτομερών σχεδίων ή σκίτσων κτηρίων, πλοίων, αεροσκαφών, μηχανών, αντικειμένων κ.λπ. @el
toolkit definition: Udtryk, som omfatter en agents bidrag ved at lave detaljerede planer eller tegninger til bygninger, skibe, luftfartøj, maskiner, objekter etc. @da
toolkit definition: Väljendus, millesse tegija on andnud panuse, tehes täpseid plaane või jooniseid ehitistele, laevadele, lennukitele, masinatele vm objektidele. @et
toolkit definition: تعبيرة تتضمن إسهام وكيل في وضع خطط أو رسومات مفصلة للمباني والسفن والطائرات والآلات والأشياء، إلخ. @ar
toolkit definition: 包括为建筑物、船舶、飞行器、机械装置、物体等制作详细平面图或绘制草图的一个行为者的贡献的一种内容表达 @zh-hans
toolkit label: Akteur als Technische Zeichnerin/Technischer Zeichner von @de
toolkit label: agent delineant de @ca
toolkit label: agent dessinateur industriel de @fr
toolkit label: agent, som er teknisk tegner af @da
toolkit label: disegnatore industriale agente di @it
toolkit label: draftsman agent of @en
toolkit label: ir rasētājs (aģents) @lv
toolkit label: joonestaja (tegija) väljenduses @et
toolkit label: műszaki rajzoló ágense: @hu
toolkit label: piirtäjä (toimija) ekspressiossa
toolkit label: tasarımcı temsilci @tr
toolkit label: technisch tekenaar-actor van @nl
toolkit label: teknisk tegner av (agent) @no
toolkit label: σχεδιαστής φορέας του @el
toolkit label: وكيل رسام هندسي @ar
toolkit label: ……的绘图者行为者 @zh-hans
has subproperty: piirtäjä (henkilö) ekspressiossa
has subproperty: piirtäjä (yhteistoimija) ekspressiossa
has subproperty: P50141
lexical alias: draftsmanAgentOf.en
status: Published
type: Property
domain: C10002
label: er agent, som er teknisk tegner af @da
label: er teknisk tegner av (agent) @no
label: est un agent dessinateur industriel de @fr
label: ir rasētājs (aģents) @lv
label: is draftsman agent of @en
label: is technisch tekenaar-actor van @nl
label: ist Akteur als Technische Zeichnerin/Technischer Zeichner von @de
label: joonestaja (tegija) väljenduses @et
label: műszaki rajzoló ágense a következőnek: @hu
label: teknik ressam temsilcisidir @tr
label: è disegnatore industriale agente di @it
label: és agent delineant de @ca
label: είναι σχεδιαστής φορέας του @el
label: هو وكيل رسام هندسي لـ @ar
label: 是……的绘图者行为者 @zh-hans
sub property of: yhdistymään osallinen toimija ekspressiossa
alternative label: Technischer Zeichner von @de
alternative label: delineant de @ca
alternative label: delineante de @es
alternative label: dessinateur industriel de @fr
alternative label: disegnatore industriale di @it
alternative label: draftsman of @en
alternative label: joonestaja väljenduses @et
alternative label: műszaki rajzolója a következő: @hu
alternative label: tasarımcı @tr
alternative label: tekninen piirros
alternative label: teknisk tegner af @da
alternative label: teknisk tegner av @no
alternative label: σχεδιαστής του @el
alternative label: رسام هندسي لـ @ar
alternative label: ……的绘图者 @zh-hans
definition: Bir temsilciyi, binalar, gemiler, uçaklar, makineler, nesneler vb. için ayrıntılı planlar veya çizimler yapan bir temsilcinin katkısını içeren bir anlatımla ilişkilendirir. @tr
definition: Correla un agente a un'espressione che include un contributo da parte di un agente nel fare progetti o disegni dettagliati per edifici, navi, aerei, macchine, oggetti, etc. @it
definition: Hozzákapcsol egy ágenst egy kifejezési formához, amely magában foglalja egy ágens közreműködését épületek, hajók, repülőgépek, gépek, objektumok, stb. részletes terveinek vagy rajzainak elkészítésében. @hu
definition: Liittää toimijan ekspressioon, jonka tekemiseen toimija osallistuu tuottamalla tarkkoja suunnitelmia tai piirroksia rakennuksista, laivoista, lentokoneista, laitteista, esineistä tms.
definition: Met un agent en relation avec une expression qui intègre une contribution de la part d’un agent consistant à effectuer des plans ou des dessins détaillés pour des bâtiments, des navires, des avions, des machines, des objets, etc. @fr
definition: Relaciona un agent amb una expressió que inclou una contribució d’un agent elaborant plànols o dibuixos detallats d’edificis, de vaixells, d’avions, de màquines, d’objectes, etc. @ca
definition: Relateert een actor aan een expressie die omvat een bijdrage door een actor door het maken van gedetailleerde plattegronden of tekeningen voor gebouwen, schepen, luchtvaartuigen, machines, voorwerpen etc. @nl

transkriboija (toimija) ekspressiossa
has element type: 2
instruction number: 18.5
see also: sovittaja (toimija) ekspressiossa
toolkit definition: An expression that includes a contribution by an agent of writing down or notating previously unwritten or unnotated content, or by changing it from one system of notation to another. @en
toolkit definition: Daha önce yazılmamış veya not edilmemiş içeriği not eden ya da bir notasyon sisteminden diğerine değiştiren bir temsilcinin katkısını içeren bir anlatım. @tr
toolkit definition: Een expressie die omvat een bijdrage door een actor door opschrijven of noteren van voorheen ongeschreven of niet-genoteerde content, of door het te wijzigen van een notatiesysteen naar een ander. @nl
toolkit definition: Egy kifejezési forma, amely magában foglalja egy ágens közreműködését korábban le nem írt vagy le nem jegyzett tartalom leírásában vagy lejegyzésében, vagy egyik jelölési rendszerről a másikra történő átvitelében. @hu
toolkit definition: Eine Expression, zu der ein Akteur beiträgt, indem er ungeschriebenen und nicht notierten Inhalt niederschreibt oder ihn von einem Notationssystem in ein anderes überträgt. @de
toolkit definition: Ekspressio, jonka tekemiseen toimija osallistuu kirjoittamalla muistiin tai nuotintamalla aiemmin kirjoittamattoman tai nuotintamattoman sisällön tai muuttamalla sen nuotinnusjärjestelmästä toiseen.
toolkit definition: Espressione che include un contributo da parte di un agente nella trascrizione o annotazione di contenuti precedentemente non scritti o non annotati, o nella trasformazione da un sistema di notazione a un altro. @it
toolkit definition: Et uttrykk som inkluderer et bidrag fra en agent i form av å skrive ned eller notere tidligere uskrevet eller unotert innhold, eller i form av omskrivning fra ett system til et annet. @no
toolkit definition: Expression qui intègre une contribution de la part d’un agent consistant à écrire ou à noter un contenu auparavant non écrit ou non noté, ou bien à le transposer d’un système de notation à un autre. @fr
toolkit definition: Expressió que inclou una contribució d’un agent escrivint o notant un contingut que no estava escrit o notat, o canviant-lo d’un sistema de notació a un altre. @ca
toolkit definition: Izteiksme, kas ietver aģenta ieguldījumu, pierakstot iepriekš nepierakstītu mutvārdu vai mūzikas saturu, vai pārrakstot to citādā pierakstā. @lv
toolkit definition: Udtryk, som omfatter en agents bidrag ved at nedskrive eller notere tidligere uskrevet eller ikke noteret indhold, eller ved at ændre det fra et notationssystem til et andet. @da
toolkit definition: Väljendus, millesse tegija on andnud panuse, kirjutades üles või noodistades üleskirjutamata või noodistamata sisu või teisendades seda ühest märkimissüsteemist teise. @et
toolkit definition: Μια έκφραση ενός έργου που ενσωματώνει τη συνεισφορά της δημιουργίας σχολίων/σημειώσεων για περιεχόμενο μη σχολιασμένο προηγούμενα ή [που ενσωματώνει τη συνεισφορά της δημιουργίας] μέσω της αλλαγής σημειογραφίας από ένα σύστημα σε ένα άλλο. @el
toolkit definition: تعبيرة تتضمن إسهام وكيل في كتابة أو تدوين محتوى لم تسبق كتابته أو تدوينه أو في تغييره من نظام تدوين إلى آخر. @ar
toolkit definition: 包括写下或记谱之前未写下或未记谱的内容或者将其从一种记谱体系改成另一种记谱体系的一个行为者的贡献的内容表达 @zh-hans
toolkit label: Akteur als Transkribiererin/Transkribierer von @de
toolkit label: agent transcripteur de @fr
toolkit label: agent transcriptor de @ca
toolkit label: agent, som er transskribent af @da
toolkit label: avskriver for (agent) @no
toolkit label: ir transkribētājs (aģents) @lv
toolkit label: transcribeerder-actor van @nl
toolkit label: transcriber agent of @en
toolkit label: transkribeerija (tegija) väljenduses @et
toolkit label: transkriboija (toimija) ekspressiossa
toolkit label: trascrittore agente di @it
toolkit label: yazıya aktaran temsilci @tr
toolkit label: átíró ágense: @hu
toolkit label: μεταγραφέας φορέας του @el
toolkit label: وكيل ناسخ @ar
toolkit label: ……的转写者行为者 @zh-hans
has subproperty: transkriboija (henkilö) ekspressiossa
has subproperty: transkriboija (yhteistoimija) ekspressiossa
has subproperty: P50142
lexical alias: transcriberAgentOf.en
status: Published
type: Property
domain: C10002
label: Yazıya aktaran temsilcisidir. @tr
label: er agent, som er transskribent af @da
label: er avskriver for (agent) @no
label: est un agent transcripteur de @fr
label: ir transkribētājs (aģents) @lv
label: is transcribeerder-actor van @nl
label: is transcriber agent of @en
label: ist Akteur als Transkribiererin/Transkribierer von @de
label: transkribeerija (tegija) väljenduses @et
label: átíró ágense a következőnek: @hu
label: è trascrittore agente di @it
label: és agent transcriptor de @ca
label: είναι μεταγραφέας φορέας του @el
label: هو وكيل ناسخ لـ @ar
label: 是……的转写者行为者 @zh-hans
sub property of: tarkastaja (toimija) ekspressiossa
alternative label: Transkribierer von @de
alternative label: avskriver for @no
alternative label: transcriber of @en
alternative label: transcripteur de @fr
alternative label: transcriptor de @ca
alternative label: transkribeerija väljenduses @et
alternative label: transkriboitu nuotinnos
alternative label: transskribent af @da
alternative label: trascrittore di @it
alternative label: yazıya aktaran @tr
alternative label: átírója: @hu
alternative label: μεταγραφέας του @el
alternative label: ناسخ لـ @ar
alternative label: ……的转写者 @zh-hans
definition: Bir temsilciyi, daha önce yazılmamış veya belirtilmemiş içeriği yazan veya not eden veya bir gösterim sisteminden diğerine değiştiren temsilcinin katkısını içeren bir anlatımla ilişkilendirir. @tr
definition: Correla un agente a un'espressione che include un contributo da parte di un agente nella trascrizione o annotazione di contenuti precedentemente non scritti o non annotati, o nella trasformazione da un sistema di notazione a un altro. @it
definition: Hozzákapcsol egy ágenst egy kifejezési formához, amely magában foglalja egy ágens közreműködését korábban le nem írt vagy le nem jegyzett tartalom leírásában vagy lejegyzésében, vagy egyik jelölési rendszerről a másikra történő átvitelében. @hu
definition: Liittää toimijan ekspressioon, jonka tekemiseen toimija osallistuu kirjoittamalla muistiin tai nuotintamalla aiemmin kirjoittamattoman tai nuotintamattoman sisällön tai muuttamalla sen nuotinnusjärjestelmästä toiseen.
definition: Met un agent en relation avec une expression qui intègre une contribution de la part d’un agent consistant à écrire ou à noter un contenu auparavant non écrit ou non noté, ou bien à le transposer d’un système de notation à un autre. @fr
definition: Relaciona un agent amb una expressió que inclou una contribució d’un agent escrivint o notant un contingut que no estava escrit o notat, o canviant-lo d’un sistema de notació a un altre. @ca
definition: Relateert een actor aan een expressie die omvat een bijdrage door een actor door opschrijven of noteren van voorheen ongeschreven of niet-genoteerde content, of door het te wijzigen van een notatiesysteen naar een ander. @nl

musiikillinen johtaja (toimija) ekspressiossa
has element type: 2
instruction number: 18.5
toolkit definition: An expression that includes a contribution by an agent of coordinating the activities of composers, sound editors, and sound mixers for a moving image production or for a musical or dramatic presentation or entertainment. @en
toolkit definition: Een expressie die omvat een bijdrage van een actor in het coördineren van de activiteiten van componisten, geluidseditors en geluidsmixers voor een bewegend beeld-productie of in een muziek- of dramapresentatie of vermaak. @nl
toolkit definition: Egy kifejezési forma, amely magában foglalja egy ágens közreműködését zeneszerzők, hangszerkesztők és hangkeverők feladatainak összehangolásában mozgókép-produkcióban, zenei vagy drámai előadásban vagy szórakoztató műsorban. @hu
toolkit definition: Eine Expression, zu der ein Akteur beiträgt, indem er die Arbeit der Komponistin/des Komponisten, der Tonbearbeiterin/des Tonbearbeiters und der Tonmeisterin/des Tonmeisters für eine Bewegtbildproduktion oder eine musikalische oder dramatische Darbietung oder Aufführung koordiniert. @de
toolkit definition: Ekspressio, jonka tekemiseen toimija osallistuu koordinoimalla säveltäjien, äänileikkaajien ja äänimiksaajien toimintaa elokuvatuotannossa tai musiikki- tai näytelmäesityksessä.
toolkit definition: Espressione che include un contributo da parte di un agente nel coordinamento delle attività di compositori, curatori del suono e addetti al missaggio per una produzione di immagini in movimento o per una presentazione o spettacolo musicale o drammatico. @it
toolkit definition: Et uttrykk som inkluderer et bidrag fra en agent i form av å koordinere aktivitetene til komponister, lydteknikere og lydmiksere for en produksjon med levende bilder eller en musikalsk eller dramatisk forestilling eller annen form for underholdning. @no
toolkit definition: Expression qui intègre une contribution de la part d’un agent consistant à coordonner les activités des compositeurs, des monteurs son et des mixeurs de son pour une production d’images animées ou bien pour une présentation ou un spectacle musical ou dramatique. @fr
toolkit definition: Expressió que inclou una contribució d’un agent en la coordinació de les activitats de compositors, editors de so i mescladors de so en el cas d’una producció d’imatge en moviment o d’una representació o un espectacle musical o dramàtic. @ca
toolkit definition: Hareketli bir görüntü prodüksiyonu veya müzikal ya da dramatik bir sunum veya eğlence için bestecilerin, ses editörlerinin ve ses mikserlerinin faaliyetlerini koordine eden bir temsilcinin katkısını içeren bir anlatım. @tr
toolkit definition: Izteiksme, kas ietver aģenta ieguldījumu, koordinējot komponista, skaņu redaktora un skaņas miksētāja kustīga attēla izveidi, mūzikāla vai dramatiska darba prezentācijā vai izklaidē. @lv
toolkit definition: Udtryk, som omfatter en agents bidrag ved at koordinere komponister, tonemestre og lydmixeres aktiviteter til en levende billedproduktion eller en musikalsk eller dramatisk præsentation eller i underholdning. @da
toolkit definition: Väljendus, millesse tegija on andnud panuse, koordineerides heliloojate, helimonteerijate ja helimiksijate tegevust filmi tootmise, muusika- või draamaetenduse või meelelahutusürituse jaoks. @et
toolkit definition: Μια έκφραση ενός έργου που ενσωματώνει τη συνεισφορά του συντονισμού των ενεργειών των συνθετών, των επιμελητών ήχου και των ηχοληπτών για μια παραγωγή κινητής εικόνας ή για μια μουσική ή δραματική παράσταση ή άλλη ψυχαγωγία. @el
toolkit definition: تعبيرة تتضمن إسهام وكيل في تنسيق أنشطة الملحنين؛ ومحرري الصوت؛ ومازجي الصوت لإنتاج فيلم؛ أو لعرض موسيقي أو درامي أو ترفيهي. @ar
toolkit definition: 包括为动态图像制作或者为音乐或戏剧呈现或娱乐协调作曲者、音响编辑、音响师活动的一个行为者的贡献的一种内容表达 @zh-hans
toolkit label: Akteur als Musikalische Leiterin/Musikalischer Leiter von @de
toolkit label: agent directeur musical de @fr
toolkit label: agent director musical de @ca
toolkit label: agent, som er musikdirektør af @da
toolkit label: direttore musicale agente di @it
toolkit label: ir muzikālais vadītājs (aģents) @lv
toolkit label: musical director agent of @en
toolkit label: musiikillinen johtaja
toolkit label: musikalregissør for (agent) @no
toolkit label: muusikajuht (tegija) väljenduses @et
toolkit label: muzikaal director-actor van @nl
toolkit label: müzikal yönetmeni temsilcisi @tr
toolkit label: zenei rendező ágense: @hu
toolkit label: μουσικός διευθυντής φορέας του @el
toolkit label: وكيل مدير موسيقي @ar
toolkit label: ……的音乐总监行为者 @zh-hans
has subproperty: musiikillinen johtaja (henkilö) ekspressiossa
has subproperty: musiikillinen johtaja (yhteistoimija) ekspressiossa
has subproperty: P50143
lexical alias: musicalDirectorAgentOf.en
status: Published
type: Property
domain: C10002
label: er agent, som er musikdirektør af @da
label: er musikalregissør for (agent) @no
label: est un agent directeur musical de @fr
label: ir muzikālais vadītājs (aģents) @lv
label: is musical director agent of @en
label: is muzikaal director-actor van @nl
label: ist Akteur als Musikalische Leiterin/Musikalischer Leiter von @de
label: muusikajuht (tegija) väljenduses @et
label: müzik yönetmeni temsilcisidir @tr
label: zenei rendező ágense a következőnek: @hu
label: è direttore musicale agente di @it
label: és agent director musical de @ca
label: είναι μουσικός διευθυντής φορέας του @el
label: هو وكيل مدير موسيقي لـ @ar
label: 是……的音乐总监行为者 @zh-hans
sub property of: esitykseen osallinen toimija ekspressiossa
alternative label: Musikalischer Leiter von @de
alternative label: directeur musical de @fr
alternative label: director musical de @ca
alternative label: direttore musicale di @it
alternative label: musical director of @en
alternative label: musiikinjohtajana musiikkiesityksessä
alternative label: musikalregissør for @no
alternative label: musikdirektør af @da
alternative label: muusikajuht väljenduses @et
alternative label: müzikal yönetmeni @tr
alternative label: zenei rendezője: @hu
alternative label: μουσικός διευθυντής του @el
alternative label: مدير موسيقي @ar
alternative label: ……的音乐总监 @zh-hans
definition: Bir temsilciyi, hareketli bir görüntü üretimi veya müzikal veya dramatik bir sunum veya eğlence için bestecilerin, ses editörlerinin ve ses mikserlerinin faaliyetlerini koordine eden bir temsilcinin katkısını içeren bir anlatımla ilişkilendirir. @tr
definition: Correla un agente a un'espressione che include un contributo da parte di un agente nel coordinamento delle attività di compositori, curatori del suono e addetti al missaggio per una produzione di immagini in movimento o per una presentazione o spettacolo musicale o drammatico. @it
definition: Hozzákapcsol egy ágenst egy kifejezési formához, amely magában foglalja egy ágens közreműködését zeneszerzők, hangszerkesztők és hangkeverők feladatainak összehangolásában mozgókép-produkcióban, zenei vagy drámai előadásban vagy szórakoztató műsorban. @hu
definition: Liittää toimijan ekspressioon, jonka tekemiseen toimija osallistuu koordinoimalla säveltäjien, äänileikkaajien ja äänimiksaajien toimintaa elokuvatuotannossa tai musiikki- tai näytelmäesityksessä.
definition: Met un agent en relation avec une expression qui intègre une contribution de la part d’un agent consistant à coordonner les activités des compositeurs, des monteurs son et des mixeurs de son pour une production d’images animées ou bien pour une présentation ou un spectacle musical ou dramatique. @fr
definition: Relaciona un agent amb una expressió que inclou una contribució d’un agent en la coordinació de les activitats de compositors, editors de so i mescladors de so en el cas d’una producció d’imatge en moviment o d’una representació o un espectacle musical o dramàtic. @ca
definition: Relateert een actor aan een expressie die omvat een bijdrage van een actor in het coördineren van de activiteiten van componisten, geluidseditors en geluidsmixers voor een bewegend beeld-productie of in een muziek- of dramapresentatie of vermaak. @nl
definition: Relaterer en agent til et udtryk, som omfatter en agents bidrag ved at koordinere komponister, tonemestre og lydmixeres aktiviteter til en levende billedproduktion eller en musikalsk eller dramatisk præsentation eller i underholdning. @da

puvustaja (toimija) ekspressiossa
has element type: 2
instruction number: 18.5
toolkit definition: An expression that includes a contribution by an agent of designing costumes for a moving image production or for a musical or dramatic presentation or entertainment. @en
toolkit definition: Een expressie die omvat een bijdrage door een actor door ontwerpen van kostuums voor een bewegend beeld-productie of voor een muzikale of dramatische presentatie of vermaak. @nl
toolkit definition: Egy kifejezési forma, amely magában foglalja egy ágens közreműködését jelmezek tervezésében mozgókép-produkciókhoz, zenei vagy drámai előadásokhoz vagy szórakoztató műsorokhoz. @hu
toolkit definition: Eine Expression, zu der ein Akteur beiträgt, indem er die Kostüme für eine Bewegtbildproduktion oder für eine musikalische oder dramatische Darbietung oder Aufführung entwirft. @de
toolkit definition: Ekspressio, jonka tekemiseen toimija osallistuu suunnittelemalla elokuvatuotannon tai musiikki- tai näytelmäesityksen puvustuksen.
toolkit definition: Espressione che include un contributo da parte di un agente nella progettazione di costumi per una produzione di immagini in movimento o per una presentazione o spettacolo musicale o drammatico. @it
toolkit definition: Et uttrykk som inkluderer et bidrag fra en agent i form av å designe kostymene for en produksjon med levende bilder eller en musikalsk eller dramatisk forestilling eller form for underholdning. @no
toolkit definition: Expression qui intègre une contribution de la part d’un agent consistant à concevoir des costumes pour une production d’images animées ou bien pour une présentation ou un spectacle musical ou dramatique. @fr
toolkit definition: Expressió que inclou una contribució d’un agent amb el disseny del vestuari en el cas d’una producció d’imatge en moviment o una representació o un espectacle musical o dramàtic. @ca
toolkit definition: Hareketli bir görüntü prodüksiyonu veya müzikal ya da dramatik bir sunum veya eğlence için kostüm tasarlayan bir temsilcinin katkısını içeren bir anlatım. @tr
toolkit definition: Izteiksme, kas ietver aģenta ieguldījumu, izstrādājot tērpu dizainu filmai, muzikālam vai dramatiskam uzvedumam, vai sarīkojumam. @lv
toolkit definition: Udtryk, som omfatter en agents bidrag ved at designe kostumer til en levende billedproduktion eller til en musikalsk eller dramatisk præsentation eller til underholdning. @da
toolkit definition: Väljendus, millesse tegija on andnud panuse, kujundades kostüüme filmi tootmise, muusika- või draamaetenduse või meelelahutusürituse jaoks. @et
toolkit definition: Μια έκφραση ενός έργου που ενσωματώνει τη συνεισφορά του σχεδιασμού των κουστουμιών για μια παραγωγή κινητής εικόνας ή για μια μουσική ή δραματική παράσταση ή άλλη ψυχαγωγία. @el
toolkit definition: تعبيرة تتضمن إسهام وكيل في تصميم أزياء تصميم أزياء لإنتاج فيلم؛ أو لعرض موسيقي أو درامي أو ترفيهي. @ar
toolkit definition: 包括为动态图像制作或者为音乐或戏剧呈现或娱乐设计服装的一个行为者的贡献的一种内容表达 @zh-hans
toolkit label: Akteur als Kostümbildnerin/Kostümbildner von @de
toolkit label: agent concepteur de costumes de @fr
toolkit label: agent dissenyador de vestuari de @ca
toolkit label: agent, som er kostumedesigner af @da
toolkit label: costume designer agent of @en
toolkit label: costumista agente di @it
toolkit label: ir kostīmu mākslinieks (aģents) @lv
toolkit label: jelmeztervező ágense: @hu
toolkit label: kostuumontwerper-actor van @nl
toolkit label: kostymedesigner for (agent) @no
toolkit label: kostüm tasarımcısı temsilcisi @tr
toolkit label: kostüümikunstnik (tegija) väljenduses @et
toolkit label: puvustaja (toimija) ekspressiossa
toolkit label: ενδυματολόγος φορέας του @el
toolkit label: وكيل مصمم أزياء @ar
toolkit label: ……的服装设计者行为者 @zh-hans
has subproperty: puvustaja (henkilö) ekspressiossa
has subproperty: puvustaja (yhteistoimija) ekspressiossa
has subproperty: P50144
lexical alias: costumeDesignerAgentOf.en
status: Published
type: Property
domain: C10002
label: er agent, som er kostumedesigner af @da
label: er kostymedesigner for (agent) @no
label: est un agent concepteur de costumes de @fr
label: ir kostīmu mākslinieks (aģents) @lv
label: is costume designer agent of @en
label: is kostuumontwerper-actor van @nl
label: ist Akteur als Kostümbildnerin/Kostümbildner von @de
label: jelmeztervező ágense a következőnek: @hu
label: kostüm tasarımcısı temsilcisidir @tr
label: kostüümikunstnik (tegija) väljenduses @et
label: è costumista agente di @it
label: és agent dissenyador de vestuari de @ca
label: είναι ενδυματολόγος φορέας του @el
label: هو وكيل مصمم أزياء لـ @ar
label: 是……的服装设计者行为者 @zh-hans
sub property of: esitykseen osallinen toimija ekspressiossa
alternative label: Kostümbildner von @de
alternative label: costume designer of @en
alternative label: costumista di @it
alternative label: créateur de costumes de @fr
alternative label: diseñador de vestuario de @es
alternative label: dissenyador de vestuari de @ca
alternative label: jelmeztervezője: @hu
alternative label: kostumedesigner af @da
alternative label: kostymedesigner for @no
alternative label: kostüm tasarımcısı @tr
alternative label: kostüümikunstnik väljenduses @et
alternative label: puvustajana esityksessä
alternative label: ενδυματολόγος του @el
alternative label: مصمم أزياء @ar
alternative label: ……的服装设计者 @zh-hans
definition: Bir temsilciyi, hareketli bir görüntü yapımı veya müzikal veya dramatik bir sunum veya eğlence için kostüm tasarlama konusunda bir temsilcinin katkısını içeren bir anlatımla ilişkilendirir. @tr
definition: Correla un agente a un'espressione che include un contributo da parte di un agente nella progettazione di costumi per una produzione di immagini in movimento o per una presentazione o spettacolo musicale o drammatico. @it
definition: Hozzákapcsol egy ágenst egy kifejezési formához, amely magában foglalja egy ágens közreműködését jelmezek tervezésében mozgókép-produkciókhoz, zenei vagy drámai előadásokhoz vagy szórakoztató műsorokhoz. @hu
definition: Liittää toimijan ekspressioon, jonka tekemiseen toimija osallistuu suunnittelemalla elokuvatuotannon tai musiikki- tai näytelmäesityksen puvustuksen.
definition: Met un agent en relation avec une expression qui intègre une contribution de la part d’un agent consistant à concevoir des costumes pour une production d’images animées ou bien pour une présentation ou un spectacle musical ou dramatique. @fr
definition: Relaciona un agent amb una expressió que inclou una contribució d’un agent amb el disseny del vestuari en el cas d’una producció d’imatge en moviment o una representació o un espectacle musical o dramàtic. @ca
definition: Relateert een actor aan een expressie die omvat een bijdrage door een actor door ontwerpen van kostuums voor een bewegend beeld-productie of voor een muzikale of dramatische presentatie of vermaak. @nl

kääntäjä (toimija) ekspressiossa
has element type: 2
instruction number: 18.5
toolkit definition: An expression that includes a contribution by an agent of expressing the linguistic content of the work in a different language. @en
toolkit definition: Een expressie die omvat een bijdrage door een actor van uitdrukken van de taalkundige content van het werk in een andere taal. @nl
toolkit definition: Eine Expression, zu der ein Akteur beiträgt, indem er den sprachlichen Inhalt des Werks in einer anderen Sprache ausdrückt. @de
toolkit definition: Ekspressio, jonka tekemiseen toimija osallistuu ilmaisemalla teoksen kielellisen sisällön toisella kielellä.
toolkit definition: Eserin dilsel içeriğini farklı bir dilde ifade eden bir temsilcinin katkısını içeren bir anlatım. @tr
toolkit definition: Espressione che include un contributo da parte di un agente nell'esprimere il contenuto linguistico dell'opera in una lingua differente. @it
toolkit definition: Et uttrykk som inkluderer et bidrag fra en agent i form av å uttrykke verkets språklige innhold på et annet språk enn tidligere uttrykk av et originalverk. @no
toolkit definition: Expression qui intègre une contribution de la part d’un agent consistant à exprimer le contenu linguistique de l’œuvre dans une langue différente. @fr
toolkit definition: Expressió que inclou una contribució d’un agent expressant el contingut lingüístic de l’obra en una llengua diferent. @ca
toolkit definition: Izteiksme, kas ietver aģenta ieguldījumu, izsakot darba saturu valodā, kas atšķiras no sākotnējās darba valodas. @lv
toolkit definition: Udtryk, som omfatter en agents bidrag ved at udtrykke værkets sproglige indhold på et andet sprog. @da
toolkit definition: Väljendus, millesse tegija on andnud panuse, väljendades teose keelesisu teises keeles. @et
toolkit definition: fordítója: @hu
toolkit definition: Μια έκφραση ενός έργου που ενσωματώνει τη συνεισφορά της έκφρασης του γλωσσικού περιεχομένου ενός έργου σε μια γλώσσα διαφορετική από τις προηγούμενες εκφράσεις ενός πρωτότυπο έργου. @el
toolkit definition: تعبيرة تتضمن إسهام وكيل في التعبير عن المحتوى اللغوي للعمل بلغة مختلفة @ar
toolkit definition: 包括用另一种语言表达作品语言内容的一个行为者的贡献的一种内容表达 @zh-hans
toolkit label: Akteur als Übersetzerin/Übersetzer von @de
toolkit label: Egy kifejezési forma, amely magában foglalja egy ágens közreműködését egy mű nyelvi tartalmának más nyelven történő kifejezésével. @hu
toolkit label: agent traducteur de @fr
toolkit label: agent traductor de @ca
toolkit label: agent, som er oversætter af @da
toolkit label: ir tulkotājs (aģents) @lv
toolkit label: kääntäjä (toimija) ekspressiossa
toolkit label: oversetter av (agent) @no
toolkit label: tercüman temsilcisi @tr
toolkit label: traduttore agente di @it
toolkit label: translator agent of @en
toolkit label: tõlkija (tegija) väljenduses @et
toolkit label: vertaler-actor van @nl
toolkit label: μεταφραστής φορέας του @el
toolkit label: وكيل مترجم @ar
toolkit label: ……的译者行为者 @zh-hans
has subproperty: kääntäjä (henkilö) ekspressiossa
has subproperty: kääntäjä (yhteistoimija) ekspressiossa
has subproperty: P50145
lexical alias: translatorAgentOf.en
status: Published
type: Property
domain: C10002
label: er agent, som er oversætter af @da
label: er oversetter av (agent) @no
label: est un agent traducteur de @fr
label: fordító ágense a következőnek: @hu
label: ir tulkotājs (aģents) @lv
label: is translator agent of @en
label: is vertaler-actor van @nl
label: ist Akteur als Übersetzerin/Übersetzer von @de
label: tercüman temsilcisi @tr
label: tõlkija (tegija) väljenduses @et
label: è traduttore agente di @it
label: és agent traductor de @ca
label: είναι μεταφραστής φορέας του @el
label: هو وكيل مترجم لـ @ar
label: 是……的译者行为者 @zh-hans
sub property of: ekspression tekijä (toimija) ekspressiossa
alternative label: Egy fordító ugyanannak a nyelvnek a különböző időszakokból származó formái közötti nyelvi tartalmat is fordíthatja. @hu
alternative label: käännös
alternative label: oversetter av @no
alternative label: oversætter af @da
alternative label: tercüman @tr
alternative label: traducteur de @fr
alternative label: traductor de @ca
alternative label: traduttore di @it
alternative label: translator of @en
alternative label: tõlkija väljenduses @et
alternative label: Übersetzer von @de
alternative label: μεταφραστής του @el
alternative label: مترجم @ar
alternative label: ……的译者 @zh-hans
definition: Bir temsilciyi, kaynağın dil içeriğini farklı bir dilde ifade etme temsilcisinin katkısını içeren bir anlatımla ilişkilendirir. @tr
definition: Correla un agente a un'espressione che include un contributo da parte di un agente nell'esprimere il contenuto linguistico dell'opera in una lingua differente. @it
definition: Hozzákapcsol egy ágenst egy kifejezési formához, amely magában foglalja egy ágens közreműködését egy mű nyelvi tartalmának más nyelven történő kifejezésével. @hu
definition: Liittää toimijan ekspressioon, jonka tekemiseen toimija osallistuu ilmaisemalla teoksen kielellisen sisällön toisella kielellä.
definition: Met un agent en relation avec une expression qui intègre une contribution de la part d’un agent consistant à exprimer le contenu linguistique de l’œuvre dans une langue différente. @fr
definition: Relaciona un agent amb una expressió que inclou una contribució d’un agent expressant el contingut lingüístic de l’obra en una llengua diferent. @ca
definition: Relateert een actor aan een expressie die omvat een bijdrage door een actor van uitdrukken van de taalkundige content van het werk in een andere taal. @nl
definition: Relaterer en agent til et udtryk, som omfatter en agents bidrag ved at udtrykke værkets sproglige indhold på et andet sprog. @da

lavastaja (toimija) ekspressiossa
has element type: 2
instruction number: 18.5
toolkit definition: An expression that includes a contribution by an agent of overseeing artists and craftspeople who build sets for moving image productions. @en
toolkit definition: Een expressie die omvat een bijdrage door een actor door toezicht houden op kunstenaars en ambachtslieden die decors bouwen voor bewegend beeld-producties. @nl
toolkit definition: Egy kifejezési forma, amely magában foglalja egy ágens közreműködését, amely mozgókép-produkciókhoz díszletépítő művészeket és mesterembereket felügyel. @hu
toolkit definition: Eine Expression, zu der ein Akteur beiträgt, indem er Künstlerinnen/Künstler und Kunsthandwerkerinnen/Kunsthandwerker betreut, die Sets für Bewegtbildproduktionen aufbauen. @de
toolkit definition: Ekspressio, jonka tekemiseen toimija osallistuu valvomalla taiteilijoita ja käsityöläisiä, jotka rakentavat lavasteita elokuvatuotantoihin.
toolkit definition: Espressione che include un contributo da parte di un agente nel supervisionare artisti e artigiani che costruiscono set cinematografici. @it
toolkit definition: Et uttrykk som inkluderer et bidrag fra en agent i form av å lede kunstnerne og håndverkerne som bygger kulissene for spillefilmproduksjoner. @no
toolkit definition: Expression qui intègre une contribution de la part d’un agent consistant à superviser les artistes et les artisans qui construisent les décors pour des productions d’images animées. @fr
toolkit definition: Expressió que inclou una contribució d’un agent supervisant els artistes i els artesans que construeixen els decorats de les produccions d’imatge en moviment. @ca
toolkit definition: Hareketli görüntü prodüksiyonları için setler inşa eden sanatçılar ve zanaatkarlardan oluşan bir temsilcinin katkısını içeren bir anlatım. @tr
toolkit definition: Izteiksme, kas ietver aģenta ieguldījumu, uzraugot māksliniekus un meistarus, kuri darbojas kustīgu attēlu veidošanā. @lv
toolkit definition: Udtryk, som omfatter en agents bidrag ved at føre tilsyn med kunstnere og håndværkere, som bygger kulisser til levende billedproduktioner. @da
toolkit definition: Väljendus, millesse tegija on andnud panuse, juhendades kunstnikke ja oskustöölisi, kes valmistavad filmi tootmise jaoks dekoratsioonid ja rekvisiidid. @et
toolkit definition: Μια έκφραση ενός έργου που ενσωματώνει τη συνεισφορά της επίβλεψης των καλλιτεχνών και των τεχνικών που κατασκευάζουν σκηνικά για παραγωγές κινητής εικόνας. @el
toolkit definition: تعبيرة تتضمن إسهام وكيل بالإشراف على الفنيين والحرفيين الذين يبنون مواقع لإنتاج الأفلام. @ar
toolkit definition: 包括监督为动态图像制作建造布景的艺术家和艺人的一个行为者的贡献的一种内容表达 @zh-hans
toolkit label: Akteur als Art Director von @de
toolkit label: Sanat yönetmeni temsilcisi @tr
toolkit label: agent directeur artistique de @fr
toolkit label: agent director artístic de @ca
toolkit label: agent, som er artdirector af @da
toolkit label: art director agent of @en
toolkit label: artdirector-actor van @nl
toolkit label: direttore artistico agente di @it
toolkit label: filmikunstnik (tegija) väljenduses @et
toolkit label: ir galvenais mākslinieks (aģents) @lv
toolkit label: lavastaja (toimija) ekspressiossa
toolkit label: művészeti vezető ágense: @hu
toolkit label: scenograf for (agent) @no
toolkit label: καλλιτεχνικός διευθυντής φορέας του @el
toolkit label: وكيل مخرج فني @ar
toolkit label: ……的艺术总监行为者 @zh-hans
has subproperty: lavastaja (henkilö) ekspressiossa
has subproperty: lavastaja (yhteistoimija) ekspressiossa
has subproperty: P50146
lexical alias: artDirectorAgentOf.en
status: Published
type: Property
domain: C10002
label: er agent, som er artdirector af @da
label: er scenograf for (agent) @no
label: est un agent directeur artistique de @fr
label: filmikunstnik (tegija) väljenduses @et
label: ir galvenais mākslinieks (aģents) @lv
label: is art director agent of @en
label: is artdirector-actor van @nl
label: ist Akteur als Art Director von @de
label: művészeti vezető ágense a következőnek: @hu
label: sanat yönetmeni temsilcisidir @tr
label: è direttore artistico agente di @it
label: és agent director artístic de @ca
label: είναι καλλιτεχνικός διευθυντής φορέας του @el
label: هو وكيل مخرج فني لـ @ar
label: 是……的艺术总监行为者 @zh-hans
sub property of: esitykseen osallinen toimija ekspressiossa
alternative label: Art Director von @de
alternative label: art director af @da
alternative label: art director of @en
alternative label: directeur artistique de @fr
alternative label: director artístic de @ca
alternative label: director de arte de @es
alternative label: direttore artistico di @it
alternative label: filmikunstnik väljenduses @et
alternative label: művészeti vezetője: @hu
alternative label: sanat yönetmeni @tr
alternative label: scenograf for @no
alternative label: καλλιτεχνικός διευθυντής του @el
alternative label: مخرج فني @ar
alternative label: ……的艺术总监 @zh-hans
definition: Bir temsilciyi, hareketli görüntü yapımları için setler oluşturan sanatçıları ve zanaatkarları denetleyen temsilcinin katkısını içeren bir anlatımla ilişkilendirir. @tr
definition: Correla un agente a un'espressione che include un contributo da parte di un agente nel supervisionare artisti e artigiani che costruiscono set cinematografici. @it
definition: Hozzákapcsol egy ágenst egy kifejezési formához, amely magában foglalja egy ágens közreműködését, amely mozgókép-produkciókhoz díszletépítő művészeket és mesterembereket felügyel. @hu
definition: Liittää toimijan ekspressioon, jonka tekemiseen toimija osallistuu valvomalla taiteilijoita ja käsityöläisiä, jotka rakentavat lavasteita elokuvatuotantoihin.
definition: Met un agent en relation avec une expression qui intègre une contribution de la part d’un agent consistant à superviser les artistes et les artisans qui construisent les décors pour des productions d’images animées. @fr
definition: Relaciona un agent amb una expressió que inclou una contribució d’un agent supervisant els artistes i els artesans que construeixen els decorats de les produccions d’imatge en moviment. @ca
definition: Relateert een actor aan een expressie die omvat een bijdrage door een actor door toezicht houden op kunstenaars en ambachtslieden die decors bouwen voor bewegend beeld-producties. @nl
definition: Relaterer en agent til et udtryk, som omfatter en agents bidrag ved at føre tilsyn med kunstnere og håndværkere, som bygger kulisser til levende billedproduktioner. @da

esittäjä (toimija) ekspressiossa
has element type: 2
instruction number: 18.5
toolkit definition: An expression that includes a contribution by an agent of performing music, acting, dancing, speaking, etc. @en
toolkit definition: Een expressie die omvat een bijdrage door een actor door uitvoering van muziek, acteren, dansen, spreken etc. @nl
toolkit definition: Egy kifejezési forma, amely magában foglalja egy ágens közreműködését zene, színjátszás, tánc, élőbeszéd, stb. előadásában. @hu
toolkit definition: Eine Expression, zu der ein Akteur beiträgt, indem er Musik aufführt, schauspielt, tanzt oder spricht und so weiter. @de
toolkit definition: Ekspressio, jonka tekemiseen toimija osallistuu esittämällä musiikkia, näyttelemällä, tanssimalla, puhumalla tms.
toolkit definition: Espressione che include un contributo da parte di un agente nell'eseguire musica, recitare, danzare, parlare, etc.. @it
toolkit definition: Et uttrykk som inkluderer et bidrag fra en agent i form av å spille musikk, spille skuespill, danse, tale, etc. @no
toolkit definition: Expression qui intègre une contribution de la part d’un agent consistant à exécuter de la musique, à jouer, à danser, à parler, etc. @fr
toolkit definition: Expressió que inclou una contribució d’un agent executant la música, actuant, dansant, parlant, etc. @ca
toolkit definition: Izteiksme, kas ietver aģenta ieguldījumu, izpildot mūziku, tēlojumu, deju, runu u.tml. @lv
toolkit definition: Müzik icra etme, oyunculuk, dans etme, konuşma vb. bir temsilcinin katkısını içeren bir anlatım. @tr
toolkit definition: Mια έκφραση ενός έργου που ενσωματώνει τη συνεισφορά της μουσικής ερμηνείας, της ηθοποιίας, του χορού, της ομιλίας κ.λπ. @el
toolkit definition: Udtryk, som omfatter en agents bidrag ved at opføre musik, spille skuespil, danse, tale, etc. @da
toolkit definition: Väljendus, millesse tegija on andnud panuse, esitades muusikat, näideldes, tantsides, kõneldes vms. @et
toolkit definition: تعبيرة تتضمن إسهام من وكيل في أداء موسيقى، تمثيل، رقص، حوار، إلخ. @ar
toolkit definition: 包括表演音乐、扮演、舞蹈、说话等的一个行为者的贡献的一种内容表达 @zh-hans
toolkit label: Akteur als Ausführende/Ausführender von @de
toolkit label: agent interprète de @fr
toolkit label: agent intèrpret de @ca
toolkit label: agent, som er udøver af @da
toolkit label: előadó ágense: @hu
toolkit label: esecutore agente di @it
toolkit label: esitaja (tegija) väljenduses @et
toolkit label: esittäjä (toimija) ekspressiossa
toolkit label: ir izpildītājs (aģents) @lv
toolkit label: performer agent of @en
toolkit label: sanatçı temsilcisi @tr
toolkit label: uitvoerder-actor van @nl
toolkit label: utøver av (agent) @no
toolkit label: εκτελεστής φορέας του @el
toolkit label: وكيل مؤدِ @ar
toolkit label: ……的表演者行为者 @zh-hans
has subproperty: johtaja (toimija) ekspressiossa
has subproperty: näyttelijä (toimija) ekspressiossa
has subproperty: esittelijä (toimija) ekspressiossa
has subproperty: tanssija (toimija) ekspressiossa
has subproperty: opettaja (toimija) ekspressiossa
has subproperty: juontaja (toimija) ekspressiossa
has subproperty: moderoija (toimija) ekspressiossa
has subproperty: nukettaja (toimija) ekspressiossa
has subproperty: panelisti (toimija) ekspressiossa
has subproperty: soittaja (toimija) ekspressiossa
has subproperty: kommentaattori (toimija) ekspressiossa
has subproperty: kertoja (toimija) ekspressiossa
has subproperty: tarinankertoja (toimija) ekspressiossa
has subproperty: puhuja (toimija) ekspressiossa
has subproperty: laulaja (toimija) ekspressiossa
has subproperty: esittäjä (henkilö) ekspressiossa
has subproperty: esittäjä (yhteistoimija) ekspressiossa
has subproperty: P50147
lexical alias: performerAgentOf.en
status: Published
type: Property
domain: C10002
label: előadó ágense a következőnek: @hu
label: er agent, som er udøver af @da
label: er utøver av (agent) @no
label: esitaja (tegija) väljenduses @et
label: est un agent interprète de @fr
label: ir izpildītājs (aģents) @lv
label: is performer agent of @en
label: is uitvoerder-actor van @nl
label: ist Akteur als Ausführende/Ausführender von @de
label: sanatçı temsilcisidir @tr
label: è esecutore agente di @it
label: és agent intèrpret de @ca
label: είναι εκτελεστής φορέας του @el
label: هو وكيل مؤدٍ لـ @ar
label: 是……的表演者行为者 @zh-hans
sub property of: esitykseen osallinen toimija ekspressiossa
alternative label: Ausführender von @de
alternative label: Sanatçı @tr
alternative label: előadója: @hu
alternative label: esecutore di @it
alternative label: esitaja väljenduses @et
alternative label: esitys
alternative label: interprète de @fr

tuomioistuimen kirjuri (toimija) ekspressiossa
has element type: 2
instruction number: 18.5
toolkit definition: An expression that includes a contribution by an agent of preparing an opinion of a court for publication. @en
toolkit definition: Bir mahkemenin yayınlamak üzere görüşünü hazırlayan bir temsilcinin katkısını içeren bir anlatım. @tr
toolkit definition: Een expressie die omvat een bijdrage door een actor door voorbereiden van een oordeel van een rechtbank voor publicatie. @nl
toolkit definition: Egy kifejezési forma, amely magában foglalja egy ágens közreműködését egy bíróság ítéleteinek közlésre való előkészítésében. @hu
toolkit definition: Eine Expression, zu der ein Akteur beiträgt, indem er die Urteilsbegründung zur Veröffentlichung vorbereitet. @de
toolkit definition: Ekspressio, jonka tekemiseen toimija osallistuu valmistelemalla tuomioistuimen lausunnon julkaistavaksi.
toolkit definition: Espressione che include un contributo da parte di un agente nel preparare il parere di tribunale per la pubblicazione. @it
toolkit definition: Et uttrykk som inkluderer et bidrag fra en agent i form av å klargjøre en domstols kjennelser for utgivelse. @no
toolkit definition: Expression qui intègre une contribution de la part d’un agent consistant à préparer une opinion d’un tribunal aux fins de publication. @fr
toolkit definition: Expressió que inclou una contribució d’un agent preparant una opinió d’un tribunal per a la seva publicació. @ca
toolkit definition: Izteiksme, kas ietver aģenta ieguldījumu, sagatavojot tiesas atzinumu publicēšanai. @lv
toolkit definition: Udtryk, som omfatter en agents bidrag ved at klargøre en domstols afgørelser til publicering. @da
toolkit definition: Väljendus, millesse tegija on andnud panuse, valmistades avaldamiseks ette kohtu seisukohad. @et
toolkit definition: Μια έκφραση ενός έργου που ενσωματώνει τη συνεισφορά της προετοιμασίας των δικαστικών αποφάσεων προς δημοσίευση. @el
toolkit definition: تعبيرة تتضمن إسهام وكيل في إعداد رأي محكمة للنشر. @ar
toolkit definition: 包括准备用于公布的法院意见的一个行为者的贡献的一种内容表达 @zh-hans
toolkit label: Akteur als Gerichtsstenografin/Gerichtsstenograf von @de
toolkit label: agent rapporteur judiciaire de @fr
toolkit label: agent relator d’un tribunal de @ca
toolkit label: agent, som er retsstenograf af @da
toolkit label: bírósági jegyzőkönyvvezető ágense: @hu
toolkit label: court reporter agent of @en
toolkit label: ir tiesas sekretārs (aģents) @lv
toolkit label: kohtureporter (tegija) väljenduses @et
toolkit label: protokollfører for (agent) @no
toolkit label: rechtbankverslaggever-actor van @nl
toolkit label: stenografo del tribunale agente di @it
toolkit label: tuomioistuimen kirjuri (toimija) ekspressiossa
toolkit label: yazman temsilcisi @tr
toolkit label: στενογράφος φορέας του @el
toolkit label: وكيل كاتب محكمة @ar
toolkit label: ……的法院书记官行为者 @zh-hans
has subproperty: tuomioistuimen kirjuri (henkilö) ekspressiossa
has subproperty: tuomioistuimen kirjuri (yhteistoimija) ekspressiossa
has subproperty: P50148
lexical alias: courtReporterAgentOf.en
status: Published
type: Property
domain: C10002
label: bírósági jegyzőkönyvvezető ágense a következőnek: @hu
label: er agent, som er retsstenograf af @da
label: er protokollfører for (agent) @no
label: est un agent rapporteur judiciaire de @fr
label: ir tiesas sekretārs (aģents) @lv
label: is court reporter agent of @en
label: is rechtbankverslaggever-actor van @nl
label: ist Akteur als Gerichtsstenografin/Gerichtsstenograf von @de
label: kohtureporter (tegija) väljenduses @et
label: yazman temsilcisidir @tr
label: è stenografo del tribunale agente di @it
label: és agent relator d’un tribunal de @ca
label: είναι στενογράφος φορέας του @el
label: هو وكيل كاتب محكمة لـ @ar
label: 是……的法院书记官行为者 @zh-hans
sub property of: yhdistymään osallinen toimija ekspressiossa
alternative label: Gerichtsstenograf von @de
alternative label: bírósági jegyzőkönyvvezetője: @hu
alternative label: court reporter of @en
alternative label: kirjurina oikeudenkäyntiasiakirjoissa
alternative label: kohtureporter väljenduses @et
alternative label: protokollfører for @no
alternative label: rapporteur judiciaire de @fr
alternative label: relator d’un tribunal de @ca
alternative label: reportero judicial de @es
alternative label: retsstenograf af @da
alternative label: stenografo del tribunale di @it
alternative label: yazman @tr
alternative label: στενογράφος του @el
alternative label: كاتب محكمة @ar
alternative label: ……的法院书记官 @zh-hans
definition: Bir temsilciyi, bir mahkeme görüşünü yayınlamak üzere hazırlayan bir temsilcinin katkısını içeren bir anlatımla ilişkilendirir. @tr
definition: Correla un agente a un'espressione che include un contributo da parte di un agente nel preparare il parere di tribunale per la pubblicazione. @it
definition: Hozzákapcsol egy ágenst egy kifejezési formához, amely magában foglalja egy ágens közreműködését egy bíróság ítéleteinek közlésre való előkészítésében. @hu
definition: Liittää toimijan ekspressioon, jonka tekemiseen toimija osallistuu valmistelemalla tuomioistuimen lausunnon julkaistavaksi.
definition: Met un agent en relation avec une expression qui intègre une contribution de la part d’un agent consistant à préparer une opinion d’un tribunal aux fins de publication. @fr
definition: Relaciona un agent amb una expressió que inclou una contribució d’un agent preparant una opinió d’un tribunal per a la seva publicació. @ca
definition: Relateert een actor aan een expressie die omvat een bijdrage door een actor door voorbereiden van een oordeel van een rechtbank voor publicatie. @nl

esipuheen kirjoittajana ekspressiossa
has element type: 2
instruction number: 18.5
toolkit definition: An expression that includes a contribution of providing a preface to an original work. (Deprecated) @en
toolkit definition: Egy mű kifejezési formája, amely hozzájárulást testesít meg azzal, hogy előszóval lát el egy eredeti művet. @hu
toolkit definition: Eine Expression eines Werks, bei der ein Akteur ein Geleitwort zum Originalwerk liefert. @de
toolkit definition: Et uttrykk av et verk som omfatter et bidrag i form av å tilføre et forord til originalverket. @no
toolkit definition: Expression d’une œuvre qui intègre une contribution consistant à fournir une préface à une œuvre originale. @fr
toolkit definition: Expressió d’una obra que incorpora una contribució que proporciona un prefaci a l’obra original. @ca
toolkit definition: Teoksen ekspressio, joka sisältää kirjoitetun esipuheen.
toolkit definition: Udtryk af et værk der inkorporerer et bidrag ved at sørge for et forord til et oprindeligt værk. @da
toolkit definition: Μια έκφραση ενός έργου που ενσωματώνει τη συνεισφορά του προλόγου σε ένα πρωτότυπο έργο. @el
toolkit label: Verfasser eines Geleitwortes von @de
toolkit label: előszó írója @hu
toolkit label: escriptor d’un prefaci de @ca
toolkit label: esipuheen kirjoittajana ekspressiossa
toolkit label: forfatter av forord til @no
toolkit label: forfatter til forord til @da
toolkit label: préfacier de @fr
toolkit label: writer of preface of (Deprecated) @en
toolkit label: συγγραφέας του προλόγου του @el
has subproperty: P50149
lexical alias: writerOfPrefaceOf.en
status: Deprecated
type: Property
domain: C10002
label: előszavának írója @hu
label: er forfatter til forord til @da
label: est un préfacier de @fr
label: is writer of preface of (Deprecated) @en
label: ist Verfasser eines Geleitwortes von @de
label: és escriptor d’un prefaci de @ca
label: είναι συγγραφέας του προλόγου του @el
sub property of: oheisteksti
definition: Egy ágenst (személyt, családot vagy testületet), aki/amely egy mű kifejezési formájához hozzájárul azzal, hogy egy eredeti művet előszóval lát el, hozzákapcsol egy kifejezési formához. @hu
definition: Liittää toimijan teoksen ekspressioon, joka sisältää kirjoitetun esipuheen.
definition: Met un agent qui contribue à une expression d’une œuvre en fournissant une préface à une œuvre originale en relation avec une expression. @fr
definition: Relaciona un agent, que contribueix a una expressió d’una obra proporcionant un prefaci a l’obra original, amb una expressió. @ca
definition: Relaterer en agent, der har bidraget til et udtryk af et værk ved at sørge for et forord til det originale værk til et udtryk. @da
definition: Relates an agent to an expression that includes a contribution of providing a preface to an original work. (Deprecated) @en
definition: Setzt einen Akteur, der an einer Expression eines Werks mitwirkt, indem er ein Geleitwort zum Originalwerk liefert, mit einer Expression in Beziehung. @de
definition: Συνδέεει έναν φορέα, ο οποίος συνεισφέρει σε μια έκφραση ενός έργου παρέχοντας έναν πρόλογο στο πρωτότυπο έργο, με μια έκφραση. @el

kartantekijänä kartassa (ekspressio)
has element type: 2
instruction number: 18.5
toolkit definition: An expression that includes a contribution of providing additional cartography or modifying previous cartography. (Deprecated) @en
toolkit definition: Egy mű kifejezési formája, amely hozzájárulást testesít meg azzal, hogy további kartográfiát ad hozzá vagy módosítja a korábbi kartográfiát. @hu
toolkit definition: Eine Expression eines Werks, bei der ein Akteur zusätzliche Kartografie liefert oder vorhandene Kartografie modifiziert. @de
toolkit definition: Et uttrykk av et verk som omfatter et bidrag i form av å tilføre ytterligere kartografi eller ved å endre tidligere kartografi. @no
toolkit definition: Expression d’une œuvre qui intègre une contribution consistant à fournir une cartographie additionnelle ou à modifier une cartographie antérieure. @fr
toolkit definition: Expressió d’una obra que incorpora una contribució que proporciona o bé una cartografia addicional o bé modificant la cartografia anterior. @ca
toolkit definition: Teoksen ekspressio, joka sisältää täydennettyä kartta-aineistoa tai joka on syntynyt muokkaamalla aiempaa karttateosta.
toolkit definition: Udtryk af et værk der inkorporerer et bidrag ved at tilføje ekstra kartografi, eller ved at modificere tidligere kartografi. @da
toolkit definition: Μια έκφραση ενός έργου που ενσωματώνει τη συνεισφορά μέσω της παροχής πρόσθετης χαρτογράφησης ή τροποποίησης της προηγούμενης χαρτογράφησης. @el
toolkit label: Kartograf (Expression) von @de
toolkit label: cartographe (expression) de @fr
toolkit label: cartographer of expression of (Deprecated) @en
toolkit label: cartògraf (expressió) de @ca
toolkit label: kartograf (udtryk) til @da
toolkit label: kartograf (uttrykk) for @no
toolkit label: kartta (ekspressio)
toolkit label: térképésze (kifejezési forma) @hu
toolkit label: χαρτογράφος (έκφραση) του @el
has subproperty: P50150
lexical alias: cartographerOfExpressionOf.en
status: Deprecated
type: Property
domain: C10002
label: er kartograf (udtryk) til @da
label: est un cartographe (expression) de @fr
label: is cartographer of expression of (Deprecated) @en
label: ist Kartograf (Expression) von @de
label: térképésze (kifejezési forma) @hu
label: és cartògraf (expressió) de @ca
label: είναι χαρτογράφος (έκφραση) του @el
sub property of: is contributor to aggregated content of (Deprecated)
definition: Egy ágenst (személyt, családot vagy testületet), aki/amely egy mű kifejezési formájához hozzájárul azzal, hogy további kartográfiát nyújt, vagy korábbi kartográfiát módosít, hozzákapcsol egy kifejezési formához. @hu
definition: Liittää toimijan teoksen ekspressioen, joka sisältää täydennettyä kartta-aineistoa tai joka on syntynyt muokkaamalla aiempaa karttateosta.
definition: Met un agent qui contribue à une expression d’une œuvre en fournissant une cartographie additionnelle ou en modifiant une cartographie antérieure en relation avec une expression. @fr
definition: Relaciona un agent, que contribueix a una expressió d’una obra o bé proporcionant una cartografia addicional o bé modificant la cartografia anterior, amb una expressió. @ca
definition: Relaterer en agent, der har bidraget til et udtryk af et værk ved at sørge for ekstra kartografi eller ved at modificere tidligere kartografi til et udtryk @da
definition: Relates an agent to an expression that includes a contribution of providing additional cartography or modifying previous cartography. (Deprecated) @en
definition: Setzt einen Akteur, der zu einer Expression eines Werks beiträgt, indem er zusätzliche Kartografie liefert oder vorhandene Kartografie modifiziert, mit einer Expression in Beziehung. @de
definition: Συνδέει έναν φορέα, ο οποίος συνεισφέρει σε μια έκφραση ενός έργου παρέχοντας πρόσθετη χαρτογράφηση ή τροποποιώντας την προηγούμενη χαρτογράφηση, με μια έκφραση. @el

koreografina koreografiassa (ekspressio)
has element type: 2
instruction number: 18.5
toolkit definition: An expression that includes a contribution of providing additional choreography, or by modifies previous choreography. (Deprecated) @en
toolkit definition: Egy mű kifejezési formája, amely hozzájárulást testesít meg azzal, hogy további koreográfiát ad hozzá vagy módosítja a korábbi koreográfiát. @hu
toolkit definition: Eine Expression eines Werks, bei der ein Akteur durch Hinzufügen einer zusätzlichen Choreografie oder durch Modifizierung der Original-Choreografie beiträgt. @de
toolkit definition: Et uttrykk av et verk som omfatter et bidrag i form av å tilføre ytterligere koreografi eller ved å endre tidligere koreografi. @no
toolkit definition: Expression d’une œuvre qui intègre une contribution consistant à fournir une chorégraphie additionnelle ou à modifier une chorégraphie antérieure. @fr
toolkit definition: Expressió d’una obra que incorpora una contribució que proporciona una coreografia addicional o modificant la coreografia anterior. @ca
toolkit definition: Teoksen ekspressio, joka sisältää teoksen täydennetyn koreografian tai aiemman koreografisen teoksen muokkauksen.
toolkit definition: Udtryk af et værk der inkorporerer et bidrag ved at tilføje ekstra koreografi, eller ved at modificere tidligere koreografi. @da
toolkit definition: Μια έκφραση ενός έργου που ενσωματώνει τη συνεισφορά της πρόσθετης χορογραφίας ή της τροποποίησης προηγούμενης χορογραφίας. @el
toolkit label: Choreograf (Expression) von @de
toolkit label: choreographer of expression of (Deprecated) @en
toolkit label: chorégraphe (expression) de @fr
toolkit label: coreògraf (expressió) de @ca
toolkit label: koreograf (udtryk) til @da
toolkit label: koreograf (uttrykk) for @no
toolkit label: koreografina koreografiassa (ekspressio)
toolkit label: koreográfusa (kifejezési forma) @hu
toolkit label: χορογράφος (έκφραση) του @el
has subproperty: P50151
lexical alias: choreographerOfExpressionOf.en
status: Deprecated
type: Property
domain: C10002
label: er koreograf (udtryk) til @da
label: est un chorégraphe (expression) de @fr
label: is choreographer of expression of (Deprecated) @en
label: ist Choreograf (Expression) von @de
label: koreográfusa (kifejezési forma) @hu
label: és coreògraf (expressió) de @ca
label: είναι χορογράφος (έκφραση) του @el
sub property of: is contributor to aggregated content of (Deprecated)
definition: Egy ágenst (személyt, családot vagy testületet), aki/amely egy mű kifejezési formájához hozzájárul azzal, hogy további koreográfiát nyújt, vagy korábbi koreográfiát módosít, hozzákapcsol egy kifejezési formához. @hu
definition: Liittää toimijan teoksen ekspressioon, joka sisältää teoksen täydennetyn koreografian tai aiemman koreografisen teoksen muokkauksen.
definition: Met un agent qui contribue à une expression d’une œuvre en fournissant une chorégraphie additionnelle ou en modifiant une chorégraphie antérieure en relation avec une expression. @fr
definition: Relaciona un agent, que contribueix a una expressió d’una obra proporcionant una coreografia addicional o modificant la coreografia anterior, amb una expressió. @ca
definition: Relaterer en agent, der har bidraget til et udtryk af et værk ved atsørge for ekstra koreografi eller ved at modificere tidligere koreografi til et udtryk. @da
definition: Relates an agent to an expression that includes a contribution of providing additional choreography, or by modifies previous choreography. (Deprecated) @en
definition: Setzt einen Akteur, der zu einer Expression eines Werks durch Hinzufügen einer zusätzlichen Choreografie oder durch Modifizierung der Original-Choreografie beiträgt, mit einer Expression in Beziehung. @de
definition: Συνδέει έναν φορέα, που συνεισφέρει σε μια έκφραση ενός έργου παρέχοντας πρόσθετη χορογραφία ή τροποποιώντας την προηγούμενη χορογραφία, με μια έκφραση. @el

lisätty kommentaari
has element type: 2
instruction number: 18.5
toolkit definition: An expression that includes a contribution of providing an interpretation or critical explanation. (Deprecated) @en
toolkit definition: Egy mű kifejezési formája, amely hozzájárulást testesít meg azzal, hogy egy eredeti művet értelmezéssel vagy kritikai magyarázattal lát el. @hu
toolkit definition: Eine Expression eines Werks, bei der ein Akteur eine Interpretation oder eine kritische Erläuterung des Originalwerks verfasst. @de
toolkit definition: Et uttrykk av et verk som omfatter et bidrag i form av å gi en tilkning eller kritisk forklaring av et originalverk. @no
toolkit definition: Expression d’une œuvre qui intègre une contribution consistant à fournir une interprétation ou une critique d’une œuvre originale. @fr
toolkit definition: Expressió d’una obra que incorpora una contribució que proporciona una interpretació o una explicació crítica d’un obra original. @ca
toolkit definition: Teoksen ekspressio, joka sisältää teoksen tulkinnan tai kriittisen selityksen.
toolkit definition: Udtryk af et værk der inkorporerer et bidrag ved at sørge for en fortolkning eller en kritisk forklaring til et oprindeligt værk. @da
toolkit definition: Μια έκφραση ενός έργου που ενσωματώνει τη συνεισφορά της ερμηνείας ή της κριτικής επεξήγησης ενός πρωτότυπου έργου. @el
toolkit label: Kommentarverfasser von @de
toolkit label: auteur de commentaire ajouté de @fr
toolkit label: escriptor d’un comentari afegit de @ca
toolkit label: forfatter av tilføyd kommentar til @no
toolkit label: forfatter til tilføjet kommentar til @da
toolkit label: hozáadott kommentár írója @hu
toolkit label: lisätty kommentaari
toolkit label: writer of added commentary of (Deprecated) @en
toolkit label: συγγραφέας των πρόσθετων σχολίων του @el
has subproperty: P50152
lexical alias: writerOfAddedCommentaryOf.en
status: Deprecated
type: Property
domain: C10002
label: er forfatter til tilføjet kommentar til @da
label: est un auteur de commentaire ajouté de @fr
label: hozzáadott kommentár írója @hu
label: is writer of added commentary of (Deprecated) @en
label: ist Kommentarverfasser von @de
label: és escriptor d’un comentari afegit de @ca
label: είναι συγγραφέας των πρόσθετων σχολίων του @el
sub property of: oheisteksti
definition: Egy ágenst (személyt, családot vagy testületet), aki/amely egy mű kifejezési formájához hozzájárul azzal, hogy egy eredeti mű értelmezését vagy kritikai magyarázatát adja, hozzákapcsol egy kifejezési formához. @hu
definition: Liittää toimija teoksen ekspressioon, joka sisältää teoksen tulkinnan tai kriittisen selityksen.
definition: Met un agent qui contribue à une expression d’une œuvre en fournissant une interprétation ou une critique d’une œuvre originale en relation avec une expression. @fr
definition: Relaciona un agent, que contribueix a una expressió d’una obra proporcionant una interpretació o una explicació crítica d’un obra original, amb una expressió. @ca
definition: Relaterer en agent, der har bidraget til et udtryk af et værk ved at sørge for en fortolkning eller kritisk forklaring af et oprindeligt værk til et udtryk. @da
definition: Relates an agent to an expression that includes a contribution of providing an interpretation or critical explanation. (Deprecated) @en
definition: Setzt einen Akteur, der an einer Expression eines Werks mitwirkt, indem er eine Interpretation oder eine kritische Erläuterung des Originalwerks verfasst, mit einer Expression in Beziehung. @de
definition: Συνδέει έναν φορέα, ο οποίος συνεισφέρει σε μια έκφραση ενός έργου παρέχοντας μια ερμηνεία ή κριτική επεξήγηση του πρωτότυπου έργου, με μια έκφραση. @el

johdantoteksti
has element type: 2
instruction number: 18.5
toolkit definition: An expression that includes a contribution of providing an introduction. (Deprecated) @en
toolkit definition: Egy mű kifejezési formája, amely hozzájárulást testesít meg azzal, hogy egy egy eredeti művet bevezetéssel lát el. @hu
toolkit definition: Eine Expression eines Werks, bei der ein Akteur eine Einleitung zum Originalwerk liefert. @de
toolkit definition: Et uttrykk av et verk som omfatter et bidrag i form av å tilføre en innledning til originalverket. @no
toolkit definition: Expression d’une œuvre qui intègre une contribution consistant à fournir une introduction à une œuvre originale. @fr
toolkit definition: Expressió d’una obra que incorpora una contribució que proporciona una introducció a una obra original. @ca
toolkit definition: Teoksen ekspressio, joka sisältää alkuperäiseen teokseen kirjoitetun johdannon.
toolkit definition: Udtryk af et værk der inkorporerer et bidrag ved at skrive en indlednig til et oprindeligt værk. @da
toolkit definition: Μια έκφραση ενός έργου που ενσωματώνει τη συνεισφορά της εισαγωγής σε ένα πρωτότυπο έργο. @el
toolkit label: Verfasser einer Einleitung von @de
toolkit label: auteur d’introduction de @fr
toolkit label: bevezetés írója @hu
toolkit label: escriptor d’una introducció de @ca
toolkit label: forfatter av innledning til @no
toolkit label: forfatter til introduktion til @da
toolkit label: johdantoteksti
toolkit label: writer of introduction of (Deprecated) @en
toolkit label: συγγραφέας της εισαγωγής του @el
has subproperty: P50153
lexical alias: writerOfIntroductionOf.en
status: Deprecated
type: Property
domain: C10002
label: bevezetésének írója @hu
label: er forfatter til introduktion til @da
label: est un auteur d’introduction de @fr
label: is writer of introduction of (Deprecated) @en
label: ist Verfasser einer Einleitung von @de
label: és escriptor d’una introducció de @ca
label: είναι συγγραφέας της εισαγωγής του @el
sub property of: oheisteksti
definition: Egy ágenst (személyt, családot vagy testületet), aki/amely egy mű kifejezési formájához hozzájárul azzal, hogy egy eredeti művet bevezetéssel lát el, hozzákapcsol egy kifejezési formához. @hu
definition: Liittää toimijan teoksen ekspressioon, joka sisältää alkuperäiseen teokseen kirjoitetun johdannon.
definition: Met un agent qui contribue à une expression d’une œuvre en fournissant une introduction à une œuvre originale en relation avec une expression. @fr
definition: Relaciona un agent, que contribueix a una expressió d’una obra proporcionant una introducció a una obra original, amb una expressió. @ca
definition: Relaterer en agent, der har bidraget til et udtryk af et værk ved at sørge for en indledning til et oprindeligt værk til et udtryk. @da
definition: Relates an agent to an expression that includes a contribution of providing an introduction. (Deprecated) @en
definition: Setzt einen Akteur, der an einer Expression eines Werks mitwirkt, indem er eine Einleitung zum Originalwerk liefert, mit einer Expression in Beziehung. @de
definition: Συνδέει έναν φορέα, ο οποίος συνεισφέρει σε μια έκφραση ενός έργου παρέχοντας μια εισαγωγή στο πρωτότυπο έργο, με μια έκφραση. @el

oheisteksti
has element type: 2
instruction number: 18.5
toolkit definition: An expression that includes a contribution of providing supplementary textual content such as an introduction or a preface. (Deprecated) @en
toolkit definition: Egy mű kifejezési formája, amely hozzájárulást jelent azzal, hogy egy eredeti művet kiegészítő szöveges tartalommal, például bevezetéssel vagy előszóval lát el. @hu
toolkit definition: Eine Expression eines Werks, bei der ein Akteur ergänzenden Text zum Originalwerk liefert, z. B. eine Einführung, ein Vorwort. @de
toolkit definition: Et uttrykk av et verk som omfatter et bidrag i form av å tilføre supplerende tekstinnhold til originalverket, for eksempel et forord eller en innledning. @no
toolkit definition: Expression d’une œuvre qui intègre une contribution consistant à fournir du contenu textuel supplémentaire tel qu’une introduction ou une préface à une œuvre originale. @fr
toolkit definition: Expressió d’una obra que incorpora una contribució que proporciona un contingut textual suplementari, com ara una introducció o un prefaci, a una obra original. @ca
toolkit definition: Teoksen ekspressio, joka sisältää alkuperäistä teosta täydentävää tekstiä, esim. johdannon tai esipuheen.
toolkit definition: Udtryk af et værk der inkorporerer et bidrag ved at skrive supplerende tekstindhold, som fx en indledning eller et forord, til et oprindeligt værk. @da
toolkit definition: Μια έκφραση ενός έργου που ενσωματώνει τη συνεισφορά ενός συνοδευτικού κειμενικού περιεχομένου, όπως εισαγωγής ή προλόγου σε ένα πρωτότυπο έργο. @el
toolkit label: Verfasser von ergänzendem Text von @de
toolkit label: auteur de contenu textuel supplémentaire de @fr
toolkit label: escriptor de contingut textual suplementari de @ca
toolkit label: forfatter av supplerende tekstinnhold i @no
toolkit label: forfatter til supplerende tekstindhold til @da
toolkit label: kiegészítő szöveges tartalom írója @hu
toolkit label: oheisteksti
toolkit label: writer of supplementary textual content of (Deprecated) @en
toolkit label: συγγραφέας του συμπληρωματικού κειμενικού περιεχομένου του @el
has subproperty: kirjoittajana lisätyssä tekstissä
has subproperty: esipuheen kirjoittajana ekspressiossa
has subproperty: lisätty kommentaari
has subproperty: johdantoteksti
has subproperty: loppusanojen kirjoittajana ekspressiossa
has subproperty: jälkipuheen kirjoittajana ekspressiossa
has subproperty: alkusanojen kirjoittajana ekspressiossa
has subproperty: P50154
lexical alias: writerOfSupplementaryTextualContentOf.en
status: Deprecated
type: Property
domain: C10002
label: er forfatter til supplerende tekstindhold til @da
label: est un auteur de contenu textuel supplémentaire de @fr
label: is writer of supplementary textual content of (Deprecated) @en
label: ist Verfasser von ergänzendem Text von @de
label: kiegészítő szövegtartalmának írója @hu
label: és escriptor de contingut textual suplementari de @ca
label: είναι συγγραφέας του συμπληρωματικού κειμενικού περιεχομένου του @el
sub property of: is author of expression of (Deprecated)
definition: Egy ágenst (személyt, családot vagy testületet), aki/amely egy mű kifejezési formájához hozzájárul azzal, hogy egy eredeti műhöz kiegészítő szöveges tartalmat, mint például bevezetést vagy előszót ad hozzá, hozzákapcsol egy kifejezési formához. @hu
definition: Liittää toimijan teoksen ekspressioon, joka sisältää alkuperäistä teosta täydentävää tekstiä, esim. johdannon tai esipuheen.
definition: Met un agent qui contribue à une expression d’une œuvre en fournissant du contenu textuel supplémentaire tel qu’une introduction ou une préface à une œuvre originale en relation avec une expression. @fr
definition: Relaciona un agent, que contribueix amb una expressió d’una obra proporcionant un contingut textual suplementari, com ara una introducció o un prefaci a una obra original, amb una expressió. @ca
definition: Relaterer en agent, der har bidraget til et udtryk af et værk ved at sørge for supplerende tekstindhold, som fx en indledning eller et forord til et oprindeligt værk til et udtryk. @da
definition: Relates an agent to an expression that includes a contribution of providing supplementary textual content such as an introduction or a preface. (Deprecated) @en
definition: Setzt einen Akteur, der an einer Expression eines Werks mitwirkt, indem er ergänzenden Text zum Originalwerk liefert, z. B. eine Einführung, ein Vorwort, mit einer Expression in Beziehung. @de
definition: Συνδέει έναν φορέα, ο οποίος συνεισφέρει σε μια έκφραση ενός έργου παρέχοντας συνοδευτικό κειμενικό περιεχόμενο, όπως εισαγωγή ή πρόλογο στο πρωτότυπο έργο, με μια έκφραση. @el

ekspression haastateltava (toimija) ekspressiossa
has element type: 2
instruction number: 18.5
toolkit definition: An expression that includes a contribution by an agent of being interviewed, usually by a reporter or some other kind of agent who gathers information. @en
toolkit definition: Een expressie die omvat een bijdrage door een actor door ondervraagd worden, meestal door een journalist of een andere soort actor die informatie verzamelt. @nl
toolkit definition: Egy kifejezési forma, amelyhez hozzátartozik egy ágens felelőssége a válaszadásért egy interjúkészítőnek, rendszerint egy riporternek vagy más információgyűjtő ágensnek. @hu
toolkit definition: Eine Expression, zu der ein Akteur beiträgt, indem er einer Interviewerin/einem Interviewer antwortet. Dabei handelt es sich normalerweise um eine Reporterin/einen Reporter oder einen anderen Akteur, der Informationen zusammenträgt. @de
toolkit definition: Ekspressio, jonka tekemiseen toimija osallistuu vastaamalla haastattelevalle toimijalle, tavallisesti toimittajalle, tai muulle tietoa keräävälle toimijalle.
toolkit definition: Espressione che include un contributo da parte di un agente per essere intervistato, solitamente da reporter o da qualche altro tipo di agente che raccoglie informazioni. @it
toolkit definition: Et uttrykk som inkluderer et bidrag fra en agent i form av å svare på spørsmål fra en intervjuer, reporter eller annen agent som samler inn informasjon. @no
toolkit definition: Expression qui intègre une contribution de la part d’un agent consistant à être interviewé, habituellement par un reporteur ou un autre type d’agent recueillant de l’information. @fr
toolkit definition: Expressió que inclou una contribució d’un agent essent entrevistat, habitualment per un periodista o qualsevol altre tipus d’agent que recull la informació. @ca
toolkit definition: Genellikle bir muhabir veya bilgi toplayan başka bir tür temsilci tarafından röportaj yapılmasına bir temsilcinin katkıda bulunmasını içeren bir anlatım. @tr
toolkit definition: Izteiksme, kas ietver aģenta ieguldījumu, atbildot uz intervētāja, parasti reportiera, aptaujas organizētāja vai kāda cita informācijas apkopotāja jautājumiem. @lv
toolkit definition: Udtryk, som omfatter en agents bidrag ved at besvare spørgsmål fra en interviewer, normalt en journalist eller en anden form for agent, som indsamler information. @da
toolkit definition: Väljendus, millesse tegija on andnud panuse, vastates intervjueerijale, reporterile või muule infot koguvale tegijale. @et
toolkit definition: Μια έκφραση ενός έργου που ενσωματώνει τη συνεισφορά της παραχώρησης συνέντευξης σε έναν συνεντευκτή, συνήθως έναν δημοσιογράφο, δημοσκόπο ή άλλον φορέα συλλογής πληροφοριών. @el
toolkit definition: تعبيرة تتضمن إسهام وكيل يكون ضيف مقابلة عادةً مع مراسل أو وكيل من نوع آخر يجمع معلومات. @ar
toolkit definition: 包括一个被采访（通常由记者或其他某种信息收集的行为者）的一个行为者的贡献的一种内容表达 @zh-hans
toolkit label: Akteur als Interviewte/Interviewter einer Expression von @de
toolkit label: agent entrevistat d’una expressió de @ca
toolkit label: agent interviewé d’une expression de @fr
toolkit label: agent, som er interviewperson for udtryk af @da
toolkit label: anlatımının görüşülen temsilcisidir @tr
toolkit label: ekspression haastateltava (toimija) ekspressiossa
toolkit label: geïnterviewde actor van expressie van @nl
toolkit label: interjúalany ágense a következő kifejezési formának: @hu
toolkit label: interviewee agent of expression of @en
toolkit label: intervistato agente di espressione di @it
toolkit label: intervjueeritav (tegija) väljenduses @et
toolkit label: intervjuobjekt for uttrykk for (agent) @no
toolkit label: ir intervējamais (aģents) izteiksmē @lv
toolkit label: συνεντευξιαζόμενος φορέας της έκφρασης του @el
toolkit label: وكيل ضيف مقابلة في تعبيرة @ar
toolkit label: ……的内容表达的受访者行为者 @zh-hans
has subproperty: ekspression haastateltava (henkilö) ekspressiossa
has subproperty: ekspression haastateltava (yhteistoimija) ekspressiossa
has subproperty: P50155
lexical alias: intervieweeAgentOfExpressionOf.en
status: Published
type: Property
domain: C10002
label: anlatımının görüşülen temsilcisidir @tr
label: er agent, som er interviewperson for udtryk af @da
label: er intervjuobjekt for uttrykk for (agent) @no
label: est un agent interviewé d’une expression de @fr
label: interjúalany ágense a következő kifejezési formának: @hu
label: intervjueeritav (tegija) väljenduses @et
label: ir intervējamais (aģents) izteiksmē @lv
label: is geïnterviewde actor van expressie van @nl
label: is interviewee agent of expression of @en
label: ist Akteur als Interviewte/Interviewter einer Expression von @de
label: è intervistato agente di espressione di @it
label: és agent entrevistat d’una expressió de @ca
label: είναι συνεντευξιαζόμενος φορέας της έκφρασης του @el
label: هو وكيل ضيف مقابلة في تعبيرة لـ @ar
label: 是……的内容表达的受访者行为者 @zh-hans
sub property of: esitykseen osallinen toimija ekspressiossa
alternative label: Interviewter (Expression) von @de
alternative label: entrevistado de expresión de @es
alternative label: entrevistat d’expressió de @ca
alternative label: haastateltavana haastattelussa (ekspressio)
alternative label: interjúalanya a következő kifejezési formának: @hu
alternative label: interviewede for udtryk af @da
alternative label: interviewee of expression of @en
alternative label: interviewé (expression) de @fr
alternative label: intervistato di espressione di @it
alternative label: intervjueeritav väljenduses @et
alternative label: intervjuobjekt for uttrykk for @no
alternative label: συνεντευξιαζόμενος της έκφρασης του @el
alternative label: ضيف مقابلة في تعبيرة @ar
alternative label: ……的内容表达的受访者 @zh-hans
definition: Bir temsilciyi, genellikle bir muhabir veya bilgi toplayan başka bir tür temsilci tarafından görüşülen bir temsilcinin katkısını içeren bir anlatımla ilişkilendirir. @tr
definition: Correla un agente a un'espressione che include un contributo da parte di un agente nell'essere intervistato, solitamente da un giornalista o altro tipo di agente che raccoglie informazioni. @it
definition: Hozzákapcsol egy ágenst egy kifejezési formához, amelyhez hozzátartozik egy ágens felelőssége a válaszadásért egy interjúkészítőnek, rendszerint egy riporternek vagy más információgyűjtő ágensnek. @hu
definition: Liittää toimijan ekspressioon, jonka tekemiseen toimija osallistuu vastaamalla haastattelevalle toimijalle, tavallisesti toimittajalle, tai muulle tietoa keräävälle toimijalle.
definition: Met un agent en relation avec une expression qui intègre une contribution de la part d’un agent consistant à être interviewé, habituellement par un reporteur ou un autre type d’agent recueillant de l’information. @fr
definition: Relaciona un agent amb una expressió que inclou una contribució d’un agent essent entrevistat, habitualment per un periodista o qualsevol altre tipus d’agent que recull la informació. @ca
definition: Relateert een actor aan een expressie die omvat een bijdrage door een actor door ondervraagd worden, meestal door een journalist of een andere soort actor die informatie verzamelt. @nl
definition: Relaterer en agent til et udtryk, som omfatter en agents bidrag ved at besvare spørgsmål fra en interviewer, normalt en journalist eller en anden form for agent, som indsamler information. @da

toimittajana aineistossa
has element type: 2
instruction number: 18.5
see also: kirjoittaja (toimija) teoksessa
toolkit definition: An expression that includes a contribution of revision or clarification of the content, or selection and aggregation of works, or parts of works, by one or more creators. (Deprecated) @en
toolkit definition: Egy mű kifejezési formája, amely hozzájárulást testesít meg azzal, hogy átdolgoz vagy pontosít egy vagy több alkotó által létrehozott tartalmat, műveik vagy műrészleteik szelektálása és összeállítása révén. @hu
toolkit definition: Eine Expression eines Werks, bei der ein Akteur den Inhalt überarbeitet oder erläutert oder Werke oder Teile von Werken von einem oder mehreren geistigen Schöpfern auswählt und zusammenstellt. @de
toolkit definition: Et uttrykk av et verk som omfatter et bidrag i form av å redigere innholdet eller gjøre det klarere, eller ved å velge ut og kombinere verker, eller deler av verker, av én eller flere opphavspersoner. @no
toolkit definition: Expression d’une œuvre qui intègre une contribution consistant à réviser ou à clarifier le contenu, ou bien à choisir et à rassembler des œuvres, ou des parties d’œuvres, d’un ou plusieurs créateurs. @fr
toolkit definition: Expressió d’una obra que incorpora una contribució que revisa o aclareix el contingut, o selecciona i aplega les obres, o les parts d’obres, d’un o més creadors. @ca
toolkit definition: Teoksen ekspressio, joka on syntynyt tarkistamalla tai selkeyttämällä aiempaa sisältöä, tai valitsemalla ja kokoamalla yhden tai useamman teoksen tekijän teoksia tai niiden osia.
toolkit definition: Udtryk af et værk der inkorporerer et bidrag ved at revidere eller præcisere indhold, eller ved at udvælge og sammensætte værker eller dele af værker, af en eller flere ophavspersoner. @da
toolkit definition: Μια έκφραση ενός έργου που ενσωματώνει τη συνεισφορά μέσω της αναθεώρησης ή της αποσαφήνισης του περιεχομένου ή μέσω της συλλογής, επιλογής και επιμέλειας έργων ή μερών έργων από έναν ή περισσότερους δημιουργούς. @el
toolkit label: Herausgeber von @de
toolkit label: editor literari de @ca
toolkit label: editor of (Deprecated) @en
toolkit label: redaktør af @da
toolkit label: szerkesztője @hu
toolkit label: tekstkonsulent for @no
toolkit label: toimittajana aineistossa
toolkit label: éditeur intellectuel de @fr
toolkit label: επιμελητής του @el
has subproperty: P50156
lexical alias: editorOf.en
status: Deprecated
type: Property
domain: C10002
label: er redaktør af @da
label: est un éditeur intellectuel de @fr
label: is editor of (Deprecated) @en
label: ist Herausgeber von @de
label: szerkesztője @hu
label: és editor literari de @ca
label: είναι επιμελητής του @el
sub property of: is contributor to aggregated content of (Deprecated)
definition: Egy ágenst (személyt, családot vagy testületet), aki/amely egy mű kifejezési formájához hozzájárul azzal, hogy egy vagy több alkotó által készített mű tartalmát átvizsgálja vagy pontosítja, vagy műveket vagy művek részeit kiválogatja és összeállítja, hozzákapcsol egy kifejezési formához. @hu
definition: Liittää tomijan teoksen ekspressioon, joka on syntynyt tarkistamalla tai selkeyttämällä aiempaa sisältöä, tai valitsemalla ja kokoamalla yhden tai useamman teoksen tekijän teoksia tai niiden osia.
definition: Met un agent qui contribue à une expression d’une œuvre en révisant ou en clarifiant le contenu, ou bien en choisissant et en rassemblant des œuvres, ou des parties d’œuvres, d’un ou plusieurs créateurs en relation avec une expression. @fr
definition: Relaciona un agent, que contribueix amb una expressió d’una obra revisant o aclarint el contingut, o seleccionant i aplegant les obres, o les parts d’obres, d’un o més creadors, amb una expressió. @ca
definition: Relaterer en agent, der har bidraget til et udtryk af et værk ved at revidere eller præcisere indholdet, eller ved at udvælge og sammensætte værker eller dele af værker, af en eller flere ophavspersoner til et udtryk. @da
definition: Relates an agent to an expression that includes a contribution of revision or clarification of the content, or selection and aggregation of works, or parts of works, by one or more creators. (Deprecated) @en
definition: Setzt einen Akteur, der zu einer Expression eines Werks beiträgt, indem er den Inhalt überarbeitet oder erläutert oder Werke oder Teile von Werken von einem oder mehreren geistigen Schöpfern auswählt und zusammenstellt, mit einer Expression in Beziehung. @de
definition: Συνδέει έναν φορέα, ο οποίος συνεισφέρει σε μια έκφραση ενός έργου μέσω της αναθεώρησης ή αποσαφήνισης του περιεχομένου ή μέσω της επιλογής και συγκέντρωσης έργων ή μερών έργων από έναν ή περισσότερους δημιουργούς, με μια έκφραση. @el
scope note: A közreműködés magába foglalhatja bevezetés, jegyzetek vagy egyéb kritikai anyag hozzáadását, vagy egy mű kifejezési formájának előkészítését gyártáshoz, kiadáshoz vagy terjesztéshez. @hu
scope note: Bidragene kan omfatte tilføjelse af en indledning, noter eller andet vigtigt materiale, eller forberedelse af udtrykket af et værk til produktion, publicering eller distribution. @da
scope note: Contributions may include adding an introduction, notes, or other critical matter, or preparing the expression of a work for production, publication, or distribution. @en
scope note: Dazu gehören eine Einleitung, Anmerkungen oder sonstiges kritisches Material hinzuzufügen oder eine Expression eines Werks für die Herstellung, die Veröffentlichung oder den Vertrieb vorzubereiten. @de
scope note: Les contributions peuvent inclure l’ajout d’une introduction, de notes ou d’autres textes critiques, ou bien la préparation de l’expression d’une œuvre aux fins de production, de publication ou de diffusion/distribution. @fr
scope note: Toimittaja voi osallistua ekspression tekoon lisäämällä johdannon, huomautuksia tai muuta kriittistä sisältöä. Toimittaja voi myös valmistella ekspression tuotantoa, julkaisemista tai jakelua varten.
scope note: Οι συνεισφορές μπορεί να περιλαμβάνουν μια εισαγωγή, σημειώσεις ή άλλο κριτικό υλικό ή προετοιμασία της έκφρασης ενός έργου για παραγωγή, δημοσίευση ή διανομή. @el

lyhentäjä (toimija) ekspressiossa
has element type: 2
instruction number: 18.5
see also: kirjoittaja (toimija) teoksessa
toolkit definition: An expression that includes a contribution by an agent of shortening an expression of another work without changing the general meaning or manner of presentation. @en
toolkit definition: Diğer bir çalışmanın anlatımını, genel anlamı veya sunum biçimini değiştirmeden kısaltmakla görevli bir temsilcinin katkısını içeren bir anlatım. @tr
toolkit definition: Een expressie die omvat een bijdrage door een actor door inkorten van een expressie of ander werk zonder de algemene betekenis of manier van uiteenzetting te wijzigen. @nl
toolkit definition: Egy kifejezési forma, amely magában foglalja egy ágens közreműködését egy másik mű kifejezési formájának lerövidítésével úgy, hogy a prezentáció általános jelentése vagy módja nem változik. @hu
toolkit definition: Eine Expression, zu der ein Akteur beiträgt, indem er eine Expression eines anderen Werks kürzt, ohne die allgemeine Bedeutung oder Art der Darstellung zu verändern. @de
toolkit definition: Ekspressio, jonka tekemiseen toimija osallistuu lyhentämällä toisen teoksen ekspressiota muuttamatta esityksen yleistä sisältöä tai tyyliä.
toolkit definition: Espressione che include un contributo da parte di un agente che riassume un'espressione o un'altra opera senza modificare il significato generale o la modalità di presentazione. @it
toolkit definition: Et uttrykk som inkluderer et bidrag fra en agent i form av forkortelse av et uttrykk av et annet verk og lar særpreg og innhold forbli hovedsakelig uendret. @no
toolkit definition: Expression qui intègre une contribution de la part d’un agent consistant à raccourcir une expression d’une autre œuvre sans en changer le sens général ou le mode de présentation. @fr
toolkit definition: Expressió que inclou una contribució d’un agent escurçant una expressió d’una altra obra sense canviar-ne el significat general o la forma de presentació. @ca
toolkit definition: Izteiksme, kas ietver aģenta ieguldījumu, saīsinot cita darba izteiksmi, nemainot darba nozīmi vai pasniegšanas veidu. @lv
toolkit definition: Udtryk, som omfatter en agents bidrag ved at forkorte udtrykket af et andet værk, uden at ændre den overordnede betydning eller præsentationsmåde. @da
toolkit definition: Väljendus, millesse tegija on andnud panuse, lühendades teise teose väljendust, muutmata üldist tähendust ja esitusviisi. @et
toolkit definition: Μια έκφραση ενός έργου που ενσωματώνει τη συνεισφορά της σύντμησης ή της συρρίκνωσης του πρωτότυπου έργου, αφήνοντας ωστόσο αμετάβλητα τη φύση και το περιεχόμενό του. @el
toolkit definition: تعبيرة تتضمن إسهام وكيل في تلخيص تعبيرة لعمل آخر دون تغيير المعنى العام أو طريقة العرض. @ar
toolkit definition: 包括缩短另一种作品的一种内容表达而不改变其总体意义或呈现方式的一个行为者的贡献的一种内容表达 @zh-hans
toolkit label: Akteur als Kürzende/Kürzender von @de
toolkit label: abbreviatore agente di @it
toolkit label: abridger agent of @en
toolkit label: agent abreujador de @ca
toolkit label: agent abréviateur de @fr
toolkit label: agent, som er forkorter af @da
toolkit label: forkorter av (agent) @no
toolkit label: inkorter-actor van @nl
toolkit label: ir saīsinātājs (aģents) @lv
toolkit label: lyhentäjä (toimija) ekspressiossa
toolkit label: lühendaja (tegija) väljenduses @et
toolkit label: rövidítő ágense: @hu
toolkit label: özetleyen temsilci @tr
toolkit label: είναι συντμητής φορέας του @el
toolkit label: وكيل مُلَخِص @ar
toolkit label: ……的缩编者行为者 @zh-hans
has subproperty: lyhentäjä (henkilö) ekspressiossa
has subproperty: lyhentäjä (yhteistoimija) ekspressiossa
has subproperty: P50157
lexical alias: abridgerAgentOf.en
status: Published
type: Property
domain: C10002
label: er agent, som er forkorter af @da
label: er forkorter av (agent) @no
label: est un agent abréviateur de @fr
label: ir saīsinātājs (aģents) @lv
label: is abridger agent of @en
label: is inkorter-actor van @nl
label: ist Akteur als Kürzende/Kürzender von @de
label: lühendaja (tegija) väljenduses @et
label: rövidítő ágense a következőnek: @hu
label: è abbreviatore agente di @it
label: és agent abreujador de @ca
label: özetleyen temsilcisidir @tr
label: είναι συντμητής φορέας του @el
label: هو وكيل مُلَخِّص لـ @ar
label: 是……的缩编者行为者 @zh-hans
sub property of: tarkastaja (toimija) ekspressiossa
alternative label: Kürzende/Kürzender von @de
alternative label: abbreviatore di @it
alternative label: abreujador de @ca
alternative label: abreviador de @es
alternative label: abridger of @en
alternative label: abréviateur de @fr
alternative label: forkorter af @da
alternative label: forkorter av @no
alternative label: lyhentäjänä aineistossa (ekspressio)
alternative label: lühendaja väljenduses @et
alternative label: rövidítője: @hu
alternative label: özetleyen @tr
alternative label: συντμητής του @el
alternative label: مُلَخِص @ar
alternative label: ……的缩编者 @zh-hans
definition: Bir temsilciyi, genel anlamı veya sunum biçimini değiştirmeden başka bir eserin anlatımını kısaltmak için bir temsilcinin katkısını içeren bir anlatımla ilişkilendirir. @tr
definition: Correla un agente a un'espressione che include un contributo da parte di un agente che riassume un'espressione o un'altra opera senza modificare il significato generale o la modalità di presentazione. @it
definition: Hozzákapcsol egy ágenst egy kifejezési formához, amely magában foglalja egy ágens közreműködését egy másik mű kifejezési formájának lerövidítésével úgy, hogy a prezentáció általános jelentése vagy módja nem változik. @hu
definition: Liittää toimijan ekspressioon, jonka tekemiseen toimija osallistuu lyhentämällä toisen teoksen ekspressiota muuttamatta esityksen yleistä sisältöä tai tyyliä.
definition: Met un agent en relation avec une expression qui intègre une contribution de la part d’un agent consistant à raccourcir une expression d’une autre œuvre sans en changer le sens général ou le mode de présentation. @fr
definition: Relaciona un agent amb una expressió que inclou una contribució d’un agent escurçant una expressió d’una altra obra sense canviar-ne el significat general o la forma de presentació. @ca

äänittäjä (toimija) ekspressiossa
has element type: 2
instruction number: 18.5
toolkit definition: An expression that includes a contribution by an agent of supervising the technical aspects of the audio content of a recording session. @en
toolkit definition: Bir kayıt seansının ses içeriğinin teknik yönlerini denetleyen bir temsilcinin katkısını içeren bir anlatım. @tr
toolkit definition: Een expressie die omvat een bijdrage door een actor door toezicht houden op de technische aspecten van de geluidscontent van een opnamesessie. @nl
toolkit definition: Egy kifejezési forma, amely magában foglalja egy ágens közreműködését a hangtartalom rögzítését szolgáló munkamenet műszaki aspektusainak felügyeletében. @hu
toolkit definition: Eine Expression, zu der ein Akteur beiträgt, indem er die technischen Aspekte des Audio-Inhalts einer Aufnahme überwacht. @de
toolkit definition: Ekspressio, jonka äänisisällön tekemiseen toimija osallistuu valvomalla äänityksen teknistä toteutusta.
toolkit definition: Espressione che include un contributo da parte di un agente nel supervisionare gli aspetti tecnici del contenuto audio di una sessione di registrazione. @it
toolkit definition: Et uttrykk som inkluderer et bidrag fra en agent i form av å styre de tekniske aspektene ved en innspilling. @no
toolkit definition: Expression qui intègre une contribution de la part d’un agent consistant à superviser les aspects techniques du contenu audio d’une séance d’enregistrement. @fr
toolkit definition: Expressió que inclou una contribució d’un agent supervisant els aspectes tècnics del contingut àudio d’una sessió d’enregistrament. @ca
toolkit definition: Izteiksme, kas ietver aģenta ieguldījumu, uzraugot audio satura tehniskos parametrus ieraksta laikā. @lv
toolkit definition: Udtryk, som omfatter en agents bidrag ved at føre tilsyn med de tekniske aspekter af lydindholdet til en lyd- eller videooptagelse. @da
toolkit definition: Väljendus, millesse tegija on andnud panuse, juhendades helisisu salvestamise tehnilisi aspekte. @et
toolkit definition: Μια έκφραση ενός έργου που ενσωματώνει τη συνεισφορά στο ακουστικό περιεχόμενο μέσω της εποπτείας των τεχνικών πτυχών μιας ηχογράφησης. @el
toolkit definition: تعبيرة تتضمن إسهام وكيل بالإشراف على الجوانب الفنية لمحتوى صوتي لجلسة تسجيل. @ar
toolkit definition: 包括监督一个录制过程中的音频内容的技术方面的一个行为者的贡献的一种内容表达 @zh-hans
toolkit label: Akteur als Aufnahmetechnikerin/Aufnahmetechniker von @de
toolkit label: Kayıt mühendisi @tr
toolkit label: agent enginyer de so de @ca
toolkit label: agent preneur de son de @fr
toolkit label: agent, som er indspilningstekniker af @da
toolkit label: hangrögzítő ágense: @hu
toolkit label: ingegnere della registrazione agente di @it
toolkit label: innspillingstekniker for (agent) @no
toolkit label: ir ierakstu inženieris (aģents) @lv
toolkit label: opnametechnicus-actor van @nl
toolkit label: recording engineer agent of @en
toolkit label: salvestusinsener (tegija) väljenduses @et
toolkit label: äänittäjä (toimija) ekspressiossa
toolkit label: μηχανικός ηχογράφησης φορέας του @el
toolkit label: وكيل مهندس تسجيل @ar
toolkit label: ……的录制工程师行为者 @zh-hans
has subproperty: äänittäjä (henkilö) ekspressiossa
has subproperty: äänittäjä (yhteistoimija) ekspressiossa
has subproperty: P50158
lexical alias: recordingEngineerAgentOf.en
status: Published
type: Property
domain: C10002
label: er agent, som er indspilningstekniker af @da
label: er innspillingstekniker for (agent) @no
label: est un agent preneur de son de @fr
label: hangrögzítő ágense a következőnek: @hu
label: ir ierakstu inženieris (aģents) @lv
label: is opnametechnicus-actor van @nl
label: is recording engineer agent of @en
label: ist Akteur als Aufnahmetechnikerin/Aufnahmetechniker von @de
label: salvestusinsener (tegija) väljenduses @et
label: ses kayıt mühendisi temsilcisidir @tr
label: è ingegnere della registrazione agente di @it
label: és agent enginyer de so de @ca
label: είναι μηχανικός ηχογράφησης φορέας του @el
label: هو وكيل مهندس تسجيل لـ @ar
label: 是……的录制工程师行为者 @zh-hans
sub property of: ääniteknikko (toimija) ekspressiossa
alternative label: Aufnahmetechniker von @de
alternative label: Kayıt mühendisi @tr
alternative label: enginyer de so de @ca
alternative label: hangrögzítője: @hu
alternative label: indspilningstekniker af @da
alternative label: ingegnere di registrazione di @it
alternative label: ingeniero de grabación de @es
alternative label: innspillingstekniker for @no
alternative label: preneur de son de @fr
alternative label: recording engineer of @en
alternative label: salvestusinsener väljenduses @et
alternative label: äänittäjänä taltioinnissa
alternative label: μηχανικός ηχογράφησης του @el
alternative label: مهندس تسجيل @ar
alternative label: ……的录制工程师 @zh-hans
definition: Bir temsilciyi, ses kayıt oturumundaki ses içeriğinin teknik yönlerini denetleyen bir temsilcinin katkısını içeren bir anlatımla ilişkilendirir. @tr
definition: Correla un agente a un'espressione che include un contributo da parte di un agente nel supervisionare gli aspetti tecnici del contenuto audio di una sessione di registrazione. @it
definition: Hozzákapcsol egy ágenst egy kifejezési formához, amely magában foglalja egy ágens közreműködését a hangtartalom rögzítését szolgáló munkamenet műszaki aspektusainak felügyeletében. @hu
definition: Liittää toimijan ekspressioon, jonka äänisisällön tekemiseen toimija osallistuu valvomalla äänityksen teknistä toteutusta.
definition: Met un agent en relation avec une expression qui intègre une contribution de la part d’un agent consistant à superviser les aspects techniques du contenu audio d’une séance d’enregistrement. @fr
definition: Relaciona un agent amb una expressió que inclou una contribució d’un agent supervisant els aspectes tècnics del contingut àudio d’una sessió d’enregistrament. @ca
definition: Relateert een actor aan een expressie die omvat een bijdrage door een actor door toezicht houden op de technische aspecten van de geluidscontent van een opnamesessie. @nl

kuvittajana kuvituksessa
has element type: 2
instruction number: 18.5
toolkit definition: An expression that includes a contribution of supplementing the content with drawings, diagrams, photographs, etc. (Deprecated) @en
toolkit definition: Egy mű kifejezési formája, amely hozzájárulást jelent azzal, hogy az elsődleges tartalmat kiegészíti rajzokkal, ábrákkal, fényképekkel stb. @hu
toolkit definition: Eine Expression eines Werks, bei der ein Akteur den primären Inhalt mit Zeichnungen, Diagrammen, Fotografien usw. ergänzt. @de
toolkit definition: Et uttrykk av et verk som omfatter et bidrag i form av å tilføye tegninger, diagrammer, fotografier, etc. til hovedinnholdet. @no
toolkit definition: Expression d’une œuvre qui intègre une contribution consistant à compléter le contenu principal avec des dessins, des diagrammes, des photographies, etc. @fr
toolkit definition: Expressió d’una obra que incorpora una contribució que complementa el contingut principal amb dibuixos, diagrames, fotografies, etc. @ca
toolkit definition: Teoksen ekspressio, jonka pääasiallista sisältöä on täydennetty piirroksilla, valokuvilla, kaavioilla tms.
toolkit definition: Udtryk af et værk der inkorporerer et bidrag ved at supplere hovedindholdet med tegninger, diagrammer, fotos, etc. @da
toolkit definition: Μια έκφραση ενός έργου που ενσωματώνει τη συνεισφορά της συμπλήρωσης του κύριου περιεχομένου με σχέδια, σκίτσα, διαγράμματα, φωτογραφίες κ.λπ. @el
toolkit label: Illustrator von @de
toolkit label: illustrateur de @fr
toolkit label: illustrator of (Deprecated) @en
toolkit label: illustrator til @da
toolkit label: illustratør av @no
toolkit label: illusztrátora @hu
toolkit label: il·lustrador de @ca
toolkit label: kuvittajana kuvituksessa
toolkit label: εικονογράφος του @el
has subproperty: P50159
lexical alias: illustratorOf.en
status: Deprecated
type: Property
domain: C10002
label: er illustrator til @da
label: est un illustrateur de @fr
label: illusztrátora @hu
label: is illustrator of (Deprecated) @en
label: ist Illustrator von @de
label: és il·lustrador de @ca
label: είναι εικονογράφος του @el
sub property of: is contributor to aggregated content of (Deprecated)
definition: Egy ágenst (személyt, családot vagy testületet), aki/amely egy mű kifejezési formájához hozzájárul azzal, hogy az elsődleges tartalmat rajzokkal, ábrákkal, fotókkal stb. egészíti ki, hozzákapcsol egy kifejezési formához. @hu
definition: Liittää toimijan teoksen ekspressioon, jonka pääasiallista sisältöä on täydennetty piirroksilla, valokuvilla, kaavioilla tms.
definition: Met un agent qui contribue à une expression d’une œuvre en complétant le contenu principal avec des dessins, des diagrammes, des photographies, etc. en relation avec une expression. @fr
definition: Relaciona un agent, que contribueix amb una expressió d’una obra complementant el contingut principal amb dibuixos, diagrames, fotografies, etc., amb una expressió. @ca
definition: Relaterer en agent, der har bidraget til et udtryk af et værk ved at supplere hovedindholdet med tegninger, diagrammer, fotos etc. til et udtryk. @da
definition: Relates an agent to an expression that includes a contribution of supplementing the content with drawings, diagrams, photographs, etc. (Deprecated) @en
definition: Setzt einen Akteur, der an einer Expression eines Werks mitwirkt, indem er den primären Inhalt mit Zeichnungen, Diagrammen, Fotografien usw. ergänzt, mit einer Expression in Beziehung. @de
definition: Συνδέει έναν φορέα, ο οποίος συνεισφέρει σε μια έκφραση ενός έργου συμπληρώνοντας το κύριο περιεχόμενο με σχέδια, σκίτσα, διαγράμματα, φωτογραφίες κ.λπ., με μια έκφραση. @el

taltioija (toimija) ekspressiossa
has element type: 2
instruction number: 18.5
toolkit definition: An expression that includes a contribution by an agent of using a recording device to capture sound or video during a recording session, including field recordings of natural sounds, folkloric events, music, or other performances. @en
toolkit definition: Doğal seslerin, folklorik olayların, müziğin veya diğer performansların saha kayıtları dahil olmak üzere, bir kayıt seansı sırasında ses veya video yakalamak için bir kayıt cihazı kullanan bir temsilcinin katkısını içeren bir anlatım. @tr
toolkit definition: Een expressie die omvat een bijdrage door een actor door gebruik van een opnameapparaat om geluid of beeld vast te leggen gedurende een opnamesessie. @nl
toolkit definition: Egy kifejezési forma, amely magában foglalja egy ágens közreműködését hang vagy videó rögzítését szolgáló felvevő eszköz használatában egy felvétel során, beleértve természetes hangokat, folklór eseményeket, zenét vagy egyéb előadásokat. @hu
toolkit definition: Eine Expression, zu der ein Akteur beiträgt, indem er mit einem Aufnahmegerät Ton oder Video aufnimmt. Darunter fallen Field Recordings natürlicher Geräusche, folkloristische Events, Musik oder ähnliches. @de
toolkit definition: Ekspressio, jonka tekemiseen toimija osallistuu käyttämällä tallennuslaitetta äänen tai videon taltioimiseen tallennustilanteessa, mukaan lukien luonnonäänten, folklorististen tapahtumien, musiikin tms. kenttätallennukset.
toolkit definition: Espressione che include un contributo da parte di un agente nell'utilizzo di un dispositivo di registrazione per acquisire suono o video durante una sessione di registrazione, incluse registrazioni sul campo di suoni naturali, eventi folkloristici, musica o altre esibizioni. @it
toolkit definition: Et uttrykk som inkluderer et bidrag fra en agent i form av å bruke en opptaksenhet til å ta opp lyd eller video under en opptaksøkt, inkludert feltopptak av naturlyder, arrangementer knyttet til folkeminne, musikk eller annen framføring. @no
toolkit definition: Expression qui intègre une contribution de la part d’un agent consistant à utiliser un appareil d’enregistrement pour capter le son ou la vidéo durant une séance d’enregistrement, y compris les enregistrements de terrain de sons naturels, de prestations folkloriques, de musique ou d’autres prestations. @fr
toolkit definition: Expressió que inclou una contribució d’un agent usant un mecanisme d’enregistrament per a capturar so o vídeo durant una sessió d’enregistrament, inclosos els enregistraments de camp de sons naturals, d’esdeveniments folklòrics, de música o d’altres actuacions. @ca
toolkit definition: Izteiksme, kas ietver aģenta ieguldījumu, izmantojot ierakstu ierīces, lai iegūtu skaņas vai video ierakstus, tai skaitā dabas skaņu, brīvdabas pasākumu, dzīvās mūzikas u.tml. ierakstus. @lv
toolkit definition: Udtryk, som omfatter en agents ved at bruge et optageudstyr til at fange lyd eller video under en optagelse, inkl. feltoptagelser af naturlige lyde, folkloristiske begivenheder eller andre optrædener. @da
toolkit definition: Väljendus, millesse tegija on andnud panuse, jäädvustades salvestamise ajal salvestusseadmega heli või videopilti, kaasa arvatud loodushäälte, rahvaluule, muusika jms salvestamine välitöödel. @et
toolkit definition: Μια έκφραση ενός έργου που ενσωματώνει τη συνεισφορά της χρήσης μηχανημάτων ηχογράφησης για την καταγραφή ήχου ή/και βίντεο κατά τη διάρκεια ηχογράφησης, περιλαμβανομένων ηχογραφήσεων φυσικών ήχων, λαογραφικών συμβάντων, μουσικής κ.λπ. @el
toolkit definition: تعبيرة تتضمن إسهام وكيل في استخدام جهاز تسجيل لالتقاط الصوت أو الفيديو أثناء جلسة تسجيل، بما في ذلك التسجيلات الخارجية للأصوات الطبيعية أو الفعاليات الفولكلورية أو الموسيقى أو العروض الأخرى. @ar
toolkit definition: 包括通过采用录制设备在录制期间摄录声音或视频（包括自然声音、民俗活动、音乐或其他表演的现场录制）的一个行为者的贡献的一种内容表达 @zh-hans
toolkit label: Akteur als Tonmeisterin/Tonmeister von @de
toolkit label: agent operador d’enregistrament de @ca
toolkit label: agent opérateur d’enregistrement de @fr
toolkit label: agent som gjør opptak av @no
toolkit label: agent, som er tonemester af @da
toolkit label: fonico agente di @it
toolkit label: ir ierakstu operators (aģents) @lv
toolkit label: kayıtçısı @tr
toolkit label: operaator (tegija) väljenduses @et
toolkit label: opnamemaker-actor van @nl
toolkit label: recordist agent of @en
toolkit label: rögzítő ágense: @hu
toolkit label: taltioija (toimija) ekspressiossa
toolkit label: καταγραφέας φορέας του @el
toolkit label: وكيل فني تسجيل @ar
toolkit label: ……的录制者行为者 @zh-hans
has subproperty: taltioija (henkilö) ekspressiossa
has subproperty: taltioija (yhteistoimija) ekspressiossa
has subproperty: P50160
lexical alias: recordistAgentOf.en
status: Published
type: Property
domain: C10002
label: er agent som gjør opptak av @no
label: er agent, som er tonemester af @da
label: est un agent opérateur d’enregistrement de @fr
label: ir ierakstu operators (aģents) @lv
label: is opnamemaker-actor van @nl
label: is recordist agent of @en
label: ist Akteur als Tonmeisterin/Tonmeister von @de
label: operaator (tegija) väljenduses @et
label: rögzítő ágense a következőnek: @hu
label: ses kayıt teknisyeni temsilcsidir @tr
label: è fonico agente di @it
label: és agent operador d’enregistrament de @ca
label: είναι καταγραφέας φορέας του @el
label: هو وكيل فني تسجيل لـ @ar
label: 是……的录制者行为者 @zh-hans
sub property of: esitykseen osallinen toimija ekspressiossa
alternative label: Tonmeister von @de
alternative label: fonico di @it
alternative label: helioperaator väljenduses @et
alternative label: kayıtçısı @tr
alternative label: operaator väljenduses @et
alternative label: operador d’enregistrament de @ca
alternative label: opérateur d’enregistrement de @fr
alternative label: person som gjør opptak av @no
alternative label: recordist of @en
alternative label: rögzítője: @hu
alternative label: sonidista de @es
alternative label: tonemester af @da
alternative label: videooperaator väljenduses @et
alternative label: äänittäjänä tai kameraoperaattorina taltioinnissa
alternative label: καταγραφέας του @el
alternative label: فني تسجيل @ar
alternative label: ……的录制者 @zh-hans
definition: Bir temsilciyi, doğal seslerin, folklorik olayların, müziğin veya diğer performansların saha kayıtları da dahil olmak üzere, bir kayıt oturumu sırasında ses veya video kaydetmek için bir kayıt cihazı kullanan temsilcisinin katkısını içeren bir anlatımla ilişkilendirir. @tr
definition: Correla un agente a un'espressione che include un contributo da parte di un agente nell'utilizzo di un dispositivo di registrazione per acquisire suono o video durante una sessione di registrazione, incluse registrazioni sul campo di suoni naturali, eventi folkloristici, musica o altre esibizioni. @it
definition: Hozzákapcsol egy ágenst egy kifejezési formához, amely magában foglalja egy ágens közreműködését hang vagy videó rögzítését szolgáló felvevő eszköz használatában egy felvétel során, beleértve természetes hangokat, folklór eseményeket, zenét vagy egyéb előadásokat. @hu
definition: Liittää toimijan ekspressioon, jonka tekemiseen toimija osallistuu käyttämällä tallennuslaitetta äänen tai videon taltioimiseen tallennustilanteessa, mukaan lukien luonnonäänten, folklorististen tapahtumien, musiikin tms. kenttätallennukset.
definition: Met un agent en relation avec une expression qui intègre une contribution de la part d’un agent consistant à utiliser un appareil d’enregistrement pour capter le son ou la vidéo durant une séance d’enregistrement, y compris les enregistrements de terrain de sons naturels, de prestations folkloriques, de musique ou d’autres prestations. @fr

ekspression tekijä (toimija) ekspressiossa
has element type: 2
toolkit definition: An expression that involves a responsibility of an agent for creation or contribution. @en
toolkit definition: Bir temsilcinin yaratma veya katkıda bulunma sorumluluğunu içeren bir anlatım. @tr
toolkit definition: Een expressie die met zich meebrengt een verantwoordelijkheid van een actor voor creatie of bijdrage. @nl
toolkit definition: Eine Expression, bei der ein Akteur für die Erstellung oder Mitwirkung verantwortlich ist. @de
toolkit definition: Ekspressio, jossa toimijan vastuulla on luoda ekspressio tai osallistua sen tekemiseen.
toolkit definition: Espressione che implica una responsabilità di un agente per la creazione o contributo. @it
toolkit definition: Et uttrykk som involverer ansvar fra en agent for skapelse eller bidrag. @no
toolkit definition: Expression qui comporte une responsabilité de la part d’un agent en ce qui concerne la création ou la contribution. @fr
toolkit definition: Expressió que implica una responsabilitat d’un agent en la creació o la contribució. @ca
toolkit definition: Izteiksme, kas ietver aģenta atbildību par radīšanu vai ieguldījumu. @lv
toolkit definition: Udtryk, som involverer en agents ansvar for skabelse eller bidrag. @da
toolkit definition: Väljendus, mis sisaldab tegija vastutust väljenduse loomise või sellesse antud panuse eest. @et
toolkit definition: létrehozója a következő kifejezési formának: @hu
toolkit definition: Μια έκφραση που ενσωματώνει μια συνεισφορά. @el
toolkit definition: تعبيرة تنطوي على مسئولية وكيل عن الإبداع أو الإسهام . @ar
toolkit definition: 涉及创作或贡献的一个行为者的责任的一种内容表达 @zh-hans
toolkit label: Akteur als Mitwirkende/Mitwirkender von @de
toolkit label: Egy kifejezési forma, amelyhez hozzátartozik egy ágens felelőssége a létrehozásért vagy a közreműködésért. @hu
toolkit label: agent creador d’una expressió de @ca
toolkit label: agent créateur d’une expression de @fr
toolkit label: agent, som er ophav til udtryk af @da
toolkit label: anlatımın yaratıcı temsilcisi @tr
toolkit label: creator agent of expression of @en
toolkit label: creatore agebte di espressione di @it
toolkit label: ekspression tekijä (toimija) ekspressiossa
toolkit label: ir radītājs (aģents) izteiksmei @lv
toolkit label: maker-actor van expressie van @nl
toolkit label: skaper av uttrykk av (agent) @no
toolkit label: väljenduse looja (tegija) väljenduses @et
toolkit label: δημιουργός φορέας της έκφρασης του @el
toolkit label: وكيل منشئ تعبيرة @ar
toolkit label: ……的内容表达的创作者行为者 @zh-hans
has subproperty: kääntäjä (toimija) ekspressiossa
has subproperty: esittämisestä vastaava toimija ekspressiossa
has subproperty: tarkastaja (toimija) ekspressiossa
has subproperty: yhdistymään osallinen toimija ekspressiossa
has subproperty: ekspression tekijä (henkilö) ekspressiossa
has subproperty: ekspression tekijä (yhteistoimija) ekspressiossa
has subproperty: P50161
lexical alias: creatorAgentOfExpressionOf.en
status: Published
type: Property
domain: C10002
label: anlatımının yaratıcı temsilcisidir @tr
label: er agent, som er ophav til udtryk af @da
label: er skaper av uttrykk av (agent) @no
label: est un agent créateur d’une expression de @fr
label: ir radītājs (aģents) izteiksmei @lv
label: is creator agent of expression of @en
label: is maker-actor van expressie van @nl
label: ist Akteur als Mitwirkende/Mitwirkender von @de
label: létrehozó ágense a következő kifejezési formának: @hu
label: väljenduse looja (tegija) väljenduses @et
label: è creatore agente di espressione di @it
label: és agent creador d’una expressió de @ca
label: είναι δημιουργός φορέας της έκφρασης του @el
label: هو وكيل منشئ تعبيرة لـ @ar
label: 是……的内容表达的创作者行为者 @zh-hans
sub property of: toimijaan liittyvä ekspressio
alternative label: Mitwirkender von @de
alternative label: Szerkesztők, fordítók, hangszerelők, előadók stb. idetartoznak. @hu
alternative label: anlatımın yaratıcısı @tr
alternative label: bidragsyter til @no
alternative label: contribuidor de @es
alternative label: contributeur de @fr
alternative label: contributor of @en
alternative label: creador de expresión de @es
alternative label: creator of expression of @en
alternative label: creatore di espressione di @it
alternative label: créateur d’une expression de @fr
alternative label: kaastööline väljenduses @et
alternative label: katkıda bulunan @tr
alternative label: közreműködője: @hu
alternative label: ophav til udryk af @da
alternative label: skaper av uttrykk av @no
alternative label: väljenduse looja väljenduses @et
alternative label: δημιουργός της έκφρασης του @el
alternative label: συντελεστής του @el

nykyinen omistaja (toimija) kappaleessa
has element type: 2
instruction number: 18.5
toolkit definition: An item that involves a responsibility of an agent for current legal possession. @en
toolkit definition: Een item dat met zich meebrengt een verantwoordelijkheid van een actor betreffende huidig wettelijk bezit. @nl
toolkit definition: Egy példány, amelyhez hozzátartozik egy ágens jelenlegi tulajdonjog iránti felelőssége. @hu
toolkit definition: Ein Exemplar, das sich derzeit im rechtmäßigen Besitz eines Akteurs befindet. @de
toolkit definition: Eksemplar, mis kuulub praegu õiguspäraselt tegijale. @et
toolkit definition: Eksemplar, som involverer en agents ansvar for lovlig besiddelse p.t. @da
toolkit definition: Et eksemplar som involverer ansvar for en agent i form av å for tiden være den rettmessige eieren. @no
toolkit definition: Item che implica una responsabilità di un agente nel possesso legale attuale. @it
toolkit definition: Item qui comporte une responsabilité de la part d’un agent en ce qui concerne la propriété légale actuelle. @fr
toolkit definition: Kappale, joka tällä hetkellä on laillisesti toimijan omistuksessa.
toolkit definition: Mevcut yasal mülkiyet için bir temsilcinin sorumluluğunu içeren bir kopya. @tr
toolkit definition: Vienība, kas ietver aģenta atbildību par pašreizējo likumīgo īpašumu. @lv
toolkit definition: Ítem que implica una responsabilitat d’un agent en la possessió legal actual. @ca
toolkit definition: Ένα αντίτυπο που επί του παρόντος βρίσκεται υπό τη νόμιμη κατοχή ενός φορέα. @el
toolkit definition: مفردة تنطوي على مسئولية وكيل عن الملكية القانونية الحالية. @ar
toolkit definition: 涉及一个当前法定所有权的一个行为者的责任的一个单件 @zh-hans
toolkit label: Akteur als gegenwärtige Eigentümerin/gegenwärtiger Eigentümer von @de
toolkit label: agent propietari actual de @ca
toolkit label: agent propriétaire actuel de @fr
toolkit label: agent, som er nuværende ejer af @da
toolkit label: current owner agent of @en
toolkit label: huidige eigenaar-actor van @nl
toolkit label: ir pašreizējais īpašnieks (aģents) @lv
toolkit label: jelenlegi tulajdonos ágense: @hu
toolkit label: nykyinen omistaja (toimija) kappaleessa
toolkit label: nåværende eier av (agent) @no
toolkit label: praegune omanik (tegija) eksemplarile @et
toolkit label: proprietario attuale agente di @it
toolkit label: şu anki sahibi olan temsilci @tr
toolkit label: τρέχων κάτοχος φορέας του @el
toolkit label: وكيل مالك حاليا @ar
toolkit label: ……的当前拥有者行为者 @zh-hans
has subproperty: tallettaja (toimija) kappaleessa
has subproperty: nykyinen omistaja (henkilö) kappaleessa
has subproperty: nykyinen omistaja (yhteistoimija) kappaleessa
has subproperty: P50162
lexical alias: currentOwnerAgentOf.en
status: Published
type: Property
domain: C10002
label: er agent, som er nuværende ejer af @da
label: er nåværende eier av (agent) @no
label: est un agent propriétaire actuel de @fr
label: ir pašreizējais īpašnieks (aģents) @lv
label: is current owner agent of @en
label: is huidige eigenaar-actor van @nl
label: ist Akteur als gegenwärtige Eigentümerin/gegenwärtiger Eigentümer von @de
label: jelenlegi tulajdonos ágense a következőnek: @hu
label: mevcut sahip temsilcisidir @tr
label: praegune omanik (tegija) eksemplarile @et
label: è agente proprietario attuale @it
label: és agent propietari actual de @ca
label: είναι τρέχων κάτοχος φορέας του @el
label: هو وكيل مالك حاليا لـ @ar
label: 是……的当前拥有者行为者 @zh-hans
sub property of: omistaja (toimija) kappaleessa
alternative label: Gegenwärtiger Eigentümer von @de
alternative label: current owner of @en
alternative label: dueño actual de @es
alternative label: jelenlegi tulajdonosa: @hu
alternative label: nuværende ejer af @da
alternative label: nykyisenä omistajana kappaleelle
alternative label: nåværende eier av @no
alternative label: praegune omanik eksemplarile @et
alternative label: propietari actual de @ca
alternative label: proprietario attuale di @it
alternative label: propriétaire actuel de @fr
alternative label: şu anki sahibi @tr
alternative label: τρέχων κάτοχος του @el
alternative label: مالك حاليا @ar
alternative label: ……的当前拥有者 @zh-hans
definition: Bir temsilciyi, mevcut yasal mülkiyet için bir temsilcinin sorumluluğunu içeren bir kopyayla ilişkilendirir. @tr
definition: Correla un agente con itemche implica la responsabilità di un agente nel possesso legale attuale. @it
definition: Hozzákapcsol egy ágenst egy példányhoz, amelyhez hozzátartozik egy ágens jelenlegi tulajdonjog iránti felelőssége. @hu
definition: Liittää toimijan kappaleeseen, joka tällä hetkellä on laillisesti toimijan omistuksessa.
definition: Met un agent en relation avec un item qui comporte une responsabilité de la part d’un agent en ce qui concerne la propriété légale actuelle. @fr
definition: Relaciona un agent amb un ítem que implica una responsabilitat d’un agent en la possessió legal actual. @ca

entinen omistaja (toimija) kappaleessa
has element type: 2
instruction number: 18.5
toolkit definition: An item that involves a responsibility of an agent for former legal possession. @en
toolkit definition: Een item dat met zich meebrengt een verantwoordelijkheid van een actor betreffende voormalig wettelijk bezit. @nl
toolkit definition: Egy példány, amelyhez hozzátartozik egy ágens korábbi tulajdonjog iránti felelőssége. @hu
toolkit definition: Ein Exemplar, das früher im rechtmäßigen Besitz eines Akteurs war. @de
toolkit definition: Eksemplar, mis kuulus varem õiguspäraselt tegijale. @et
toolkit definition: Eksemplar, som involverer en agents ansvar for tidligere at have haft lovlig besiddelse. @da
toolkit definition: Eski yasal mülkiyet için bir temsilcinin sorumluluğunu içeren bir kopya. @tr
toolkit definition: Et eksemplar som involverer ansvar for en agen i form av å være en tidligere rettmessig eier. @no
toolkit definition: Item che implica la responsabilità di un agente del possesso legale precedente. @it
toolkit definition: Item qui comporte une responsabilité de la part d’un agent en ce qui concerne la propriété légale antérieure. @fr
toolkit definition: Kappale, jonka toimija on aiemmin laillisesti omistanut.
toolkit definition: Vienība, kas ietver aģenta atbildību par bijušo likumīgo īpašumu. @lv
toolkit definition: Ítem que implica una responsabilitat d’un agent en la possessió legal anterior. @ca
toolkit definition: Ένα αντίτυπο το οποίο προηγούμενα βρισκόταν υπό τη νόμιμη κατοχή ενός φορέα. @el
toolkit definition: مفردة تنطوي على مسئولية وكيل عن الملكية القانونية السابقة. @ar
toolkit definition: 涉及一个先前法定所有权的一个行为者的责任的一个单件 @zh-hans
toolkit label: Akteur als frühere Eigentümerin/früherer Eigentümer von @de
toolkit label: agent propietari anterior de @ca
toolkit label: agent, som er tidligere ejer af @da
toolkit label: ancien agent propriétaire de @fr
toolkit label: endine omanik (tegija) eksemplarile @et
toolkit label: entinen omistaja (toimija) kappaleessa
toolkit label: former owner agent of @en
toolkit label: ir agrākais īpašnieks (aģents) @lv
toolkit label: korábbi tulajdonosa: @hu
toolkit label: proprietario precedente agente di @it
toolkit label: tidligere eier av (agent) @no
toolkit label: voormalige eigenaar-actor van @nl
toolkit label: önceki sahibi olan temsilci @tr
toolkit label: προηγούμενος ιδιοκτήτης φορέας του @el
toolkit label: وكيل مالك سابقا @ar
toolkit label: ……的先前拥有者行为者 @zh-hans
has subproperty: lahjoittaja (toimija) kappaleelle
has subproperty: myyjä (toimija) kappaleelle
has subproperty: aiempi omistaja (henkilö) kappaleessa
has subproperty: aiempi omistaja (yhteistoimija) kappaleessa
has subproperty: P50163
lexical alias: formerOwnerAgentOf.en
status: Published
type: Property
domain: C10002
label: Ist Akteur als frühere Eigentümerin/früherer Eigentümer von @de
label: endine omanik (tegija) eksemplarile @et
label: er agent, som er tidligere ejer af @da
label: er tidligere eier av (agent) @no
label: eski sahip temsilcisidir @tr
label: est un ancien agent propriétaire de @fr
label: ir agrākais īpašnieks (aģents) @lv
label: is former owner agent of @en
label: is voormalige eigenaar-actor van @nl
label: korábbi tulajdonos ágense a következőnek: @hu
label: è precedente proprietario agente di @it
label: és agent propietari anterior de @ca
label: είναι προηγούμενος κάτοχος φορέας του @el
label: هو وكيل مالك سابقا @ar
label: 是……的先前拥有者行为者 @zh-hans
sub property of: omistaja (toimija) kappaleessa
alternative label: Früherer Eigentümer von @de
alternative label: aiempana omistajana kappaleelle
alternative label: ancien propriétaire de @fr
alternative label: dueño anterior de @es
alternative label: endine omanik eksemplarile @et
alternative label: former owner of @en
alternative label: korábbi tulajdonosa: @hu
alternative label: propietari anterior de @ca
alternative label: proprietario precedente di @it
alternative label: tidligere eier av @no
alternative label: tidligere ejer af @da
alternative label: önceki sahibi @tr
alternative label: προηγούμενος ιδιοκτήτης του @el
alternative label: مالك سابقا @ar
alternative label: ……的先前拥有者 @zh-hans
definition: Bir temsilciyi, önceki yasal mülkiyet için bir temsilcinin sorumluluğunu içeren bir kopyayla ilişkilendirir. @tr
definition: Correla un agente con itemche implica la responsabilità di un agente nel possesso legale precedente. @it
definition: Hozzákapcsol egy ágenst egy példányhoz, amelyhez hozzátartozik egy ágens korábbi tulajdonjog iránti felelőssége. @hu
definition: Liittää toimijan kappaleeseen, jonka toimija on aiemmin laillisesti omistanut.
definition: Met un agent en relation avec un item qui comporte une responsabilité de la part d’un agent en ce qui concerne la propriété légale antérieure. @fr

säilyttäjä (toimija) kappaleessa
has element type: 2
instruction number: 18.5
toolkit definition: An item that involves a responsibility of an agent for legal custody. @en
toolkit definition: Een item dat met zich meebrengt een verantwoordelijkheid van een actor voor wettelijke bewaring. @nl
toolkit definition: Egy példány, amelyhez hozzátartozik egy ágens megőrzés iránti felelőssége. @hu
toolkit definition: Ein Exemplar, das sich in der rechtmäßigen Verwahrung eines Akteurs befindet. @de
toolkit definition: Eksemplar, mis on tegija õiguspärasel vastutaval hoiul. @et
toolkit definition: Eksemplar, som involverer en agents ansvar for lovlig forvaring. @da
toolkit definition: Et eksemplar som involverer ansvar for en agent i form av lovlig forvaring. @no
toolkit definition: Item che implica la responsabilità di un agente della custodia legale. @it
toolkit definition: Item qui comporte une responsabilité de la part d’un agent en ce qui concerne la garde légale. @fr
toolkit definition: Kappale, joka on laillisesti toimijan säilytyksessä.
toolkit definition: Vienība, kas ietver aģenta atbildību par likumīgu pārvaldību. @lv
toolkit definition: Yasal velayet için bir temsilcinin sorumluluğunu içeren bir kopya. @tr
toolkit definition: Ítem que implica una responsabilitat d’un agent en la custòdia legal. @ca
toolkit definition: Ένα αντίτυπο υπό τη νόμιμη επιμέλεια φύλαξης ενός φορέα. @el
toolkit definition: مفردة تنطوي على مسئولية وكيل عن الوصاية القانونية. @ar
toolkit definition: 涉及合法保管的一个行为者的责任的一个单件 @zh-hans
toolkit label: Akteur als Verwahrerin/Verwahrer von @de
toolkit label: agent dipositari de @ca
toolkit label: agent dépositaire de @fr
toolkit label: agent, som er forvalter af @da
toolkit label: bewaarder-actor van @nl
toolkit label: custodian agent of @en
toolkit label: despositario agente di @it
toolkit label: ir pārvaldītājs (aģents) @lv
toolkit label: koruyucu temsilci @tr
toolkit label: letétkezelő ágense: @hu
toolkit label: oppbevarer av (agent) @no
toolkit label: säilyttäjä (toimija) kappaleessa
toolkit label: vastutav hoidja (tegija) eksemplarile @et
toolkit label: φύλακας φορέας του @el
toolkit label: وكيل وصي على @ar
toolkit label: ……的保管者行为者 @zh-hans
has subproperty: säilyttäjä (henkilö) kappaleessa
has subproperty: säilyttäjä (yhteistoimija) kappaleessa
has subproperty: P50164
lexical alias: custodianAgentOf.en
status: Published
type: Property
domain: C10002
label: er agent, som er forvalter af @da
label: er oppbevarer av (agent) @no
label: est un agent dépositaire de @fr
label: ir pārvaldītājs (aģents) @lv
label: is bewaarder-actor van @nl
label: is custodian agent of @en
label: ist Akteur als Verwahrerin/Verwahrer von @de
label: koruyucu temsilcisidir @tr
label: letétkezelő ágense a következőnek: @hu
label: vastutav hoidja (tegija) eksemplarile @et
label: è depositario agente di @it
label: és agent dipositari de @ca
label: είναι φύλακας φορέας του @el
label: هو وكيل وصي على @ar
label: 是……的保管者行为者 @zh-hans
sub property of: toimijaan liittyvä kappale
alternative label: Verwahrer von @de
alternative label: custodian of @en
alternative label: custodio de @es
alternative label: despositario di @it
alternative label: dipositari de @ca
alternative label: dépositaire de @fr
alternative label: forvalter af @da
alternative label: koruyucu @tr
alternative label: letétkezelője: @hu
alternative label: oppbevarer av @no
alternative label: säilyttäjänä kappaleelle
alternative label: vastutav hoidja eksemplarile @et
alternative label: θεματοφύλακας του @el
alternative label: وصي على @ar
alternative label: ……的保管者 @zh-hans
definition: Bir temsilciyi, yasal velayete ilişkin bir temsilcinin sorumluluğunu içeren bir kopyayla ilişkilendirir. @tr
definition: Correla un agente con itemche implica la responsabilità di un agente nella custodia legale. @it
definition: Hozzákapcsol egy ágenst egy példányhoz, amelyhez hozzátartozik egy ágens megőrzés iránti felelőssége. @hu
definition: Liittää toimijan kappaleeseen, joka on laillisesti toimijan säilytyksessä.
definition: Met un agent en relation avec un item qui comporte une responsabilité de la part d’un agent en ce qui concerne la garde légale. @fr
definition: Relaciona un agent amb un ítem que implica una responsabilitat d’un agent en la custòdia legal. @ca
definition: Relateert een actor aan een item dat met zich meebrengt een verantwoordelijkheid van een actor voor wettelijke bewaring. @nl

omistaja (toimija) kappaleessa
has element type: 2
toolkit definition: An item that involves a responsibility of an agent for legal possession. @en
toolkit definition: Een item dat met zich meebrengt een verantwoordelijkheid van een actor voor wettelijk bezit. @nl
toolkit definition: Egy példány, amelyhez hozzátartozik egy ágens tulajdonjog iránti felelőssége. @hu
toolkit definition: Ein Exemplar, das im rechtmäßigen Besitz eines Akteurs ist. @de
toolkit definition: Eksemplar, mis kuulub või on kuulunud õiguspäraselt tegijale. @et
toolkit definition: Eksemplar, som involverer en agents ansvar for lovlig besiddelse. @da
toolkit definition: Et eksemplar som involverer ansvar for en agent i form av rettmessig eierskap. @no
toolkit definition: Item che implica la responsabilità di un agente del possesso legale. @it
toolkit definition: Item qui comporte une responsabilité de la part d’un agent en ce qui concerne la propriété légale. @fr
toolkit definition: Kappale, joka on laillisesti toimijan omistuksessa.
toolkit definition: Vienība, kas ietver aģenta atbildību par likumīgu īpašumu. @lv
toolkit definition: Yasal mülkiyet için bir temsilcinin sorumluluğunu içeren bir kopya. @tr
toolkit definition: Ítem que implica una responsabilitat d’un agent en la possessió legal actual o anterior. @ca
toolkit definition: Ένα αντίτυπο υπό τη νόμιμη κατοχή ενός φορέα. @el
toolkit definition: مفردة تنطوي على مسئولية وكيل عن الملكية القانونية. @ar
toolkit definition: 涉及法定所有权的一个行为者的责任的一个单件 @zh-hans
toolkit label: Akteur als Eigentümerin/Eigentümer von @de
toolkit label: Sahip temsilcisi @tr
toolkit label: agent propietari de @ca
toolkit label: agent propriétaire de @fr
toolkit label: agent, som er ejer af @da
toolkit label: eier av (agent) @no
toolkit label: eigenaar-actor van @nl
toolkit label: ir īpašnieks (aģents) @lv
toolkit label: omanik (tegija) eksemplarile @et
toolkit label: omistaja (toimija) kappaleessa
toolkit label: owner agent of @en
toolkit label: possessore agente di @it
toolkit label: tulajdonos ágense: @hu
toolkit label: κάτοχος φορέας του @el
toolkit label: وكيل مالك @ar
toolkit label: ……的拥有者行为者 @zh-hans
has subproperty: nykyinen omistaja (toimija) kappaleessa
has subproperty: entinen omistaja (toimija) kappaleessa
has subproperty: omistaja (henkilö) kappaleessa
has subproperty: omistaja (yhteistoimija) kappaleessa
has subproperty: P50165
lexical alias: ownerAgentOf.en
status: Published
type: Property
domain: C10002
label: er agent, som er ejer af @da
label: er eier av (agent) @no
label: est un agent propriétaire de @fr
label: ir īpašnieks (aģents) @lv
label: is eigenaar-actor van @nl
label: is owner agent of @en
label: ist Akteur als Eigentümerin/Eigentümer von @de
label: omanik (tegija) eksemplarile @et
label: sahip temsilcisidir @tr
label: tulajdonos ágense a következőnek: @hu
label: è possessore agente di @it
label: és agent propietari de @ca
label: είναι κάτοχος φορέας του @el
label: هو وكيل مالك لـ @ar
label: 是……的拥有者行为者 @zh-hans
sub property of: toimijaan liittyvä kappale
alternative label: Eigentümer @de
alternative label: Sahip @tr
alternative label: dueño de @es
alternative label: eier av @no
alternative label: ejer af @da
alternative label: omanik eksemplarile @et
alternative label: omistajana kappaleelle
alternative label: owner of @en
alternative label: possessore di @it
alternative label: propietari de @ca
alternative label: propriétaire de @fr
alternative label: tulajdonosa: @hu
alternative label: κάτοχος του @el
alternative label: مالك @ar
alternative label: ……的拥有者 @zh-hans
definition: Bir temsilciyi, yasal mülkiyete ilişkin bir temsilcinin sorumluluğunu içeren bir kopyayla ilişkilendirir. @tr
definition: Correla un agente con itemche implica la responsabilità di un agente nel possesso legale. @it
definition: Hozzákapcsol egy ágenst egy példányhoz, amelyhez hozzátartozik egy ágens tulajdonjog iránti felelőssége. @hu
definition: Liittää toimijan kappaleeseen, joka on laillisesti toimijan omistuksessa.
definition: Met un agent en relation avec un item qui comporte une responsabilité de la part d’un agent en ce qui concerne la propriété légale. @fr
definition: Relaciona un agent amb un ítem que implica una responsabilitat d’un agent en la possessió legal actual o anterior. @ca

teoksella kunnioitettu toimija teoksessa
has element type: 2
instruction number: 18.5
toolkit definition: A work that marks the esteem of and respect for an agent. @en
toolkit definition: Bir temsilcinin itibarını ve saygısını simgeleyen bir eser. @tr
toolkit definition: Darbs, ar kuru godināts aģents. @lv
toolkit definition: Een werk dat toont de waardering en respect voor een actor. @nl
toolkit definition: Ein Werk, das einen Akteur ehrt. @de
toolkit definition: Et verk som markerer aktelse og respekt for en agent. @no
toolkit definition: Obra que marca l’estima i el respecte per un agent. @ca
toolkit definition: Opera che esprime la stima e il rispetto per un agente. @it
toolkit definition: Teos, joka osoittaa arvostusta ja kunnioitusta toimijalle.
toolkit definition: Teos, mis märgib lugupidamist ja austust tegija vastu. @et
toolkit definition: Værk, som markerer en hædring af en agent. @da
toolkit definition: méltatottja: @hu
toolkit definition: Œuvre qui marque l’estime et le respect pour un agent. @fr
toolkit definition: Ένα έργο που τιμά έναν φορέα. @el
toolkit definition: عمل يدل على تقدير واحترام لوكيل. @ar
toolkit definition: 表示对一个行为者尊重或尊敬的一种作品 @zh-hans
toolkit label: Akteur als Gefeierte/Gefeierter eines Werks von @de
toolkit label: Egy mű, amely jelzi egy ágens megbecsülését és tiszteletét. @hu
toolkit label: agent homenatjat d’obra de @ca
toolkit label: agent honoré d’une œuvre de @fr
toolkit label: agent, som beæres af værk af @da
toolkit label: agente onorato di opera di @it
toolkit label: austusavalduse saaja (tegija) teoses @et
toolkit label: aģentu godinošais darbs @lv
toolkit label: beæret agent av verk for @no
toolkit label: eserinin onurlandırılan temsilcisidir @tr
toolkit label: geëerde actor van werk van @nl
toolkit label: honouree agent of work of @en
toolkit label: teoksella kunnioitettu toimija teoksessa
toolkit label: τιμώμενος φορέας του έργου του @el
toolkit label: وكيل مكرم بعمل @ar
toolkit label: ……的作品的被纪念者行为者 @zh-hans
has subproperty: teoksella kunnioitettu henkilö teoksessa
has subproperty: teoksella kunnioitettu yhteistoimija teoksessa
has subproperty: P50166
lexical alias: honoureeAgentOfWorkOf.en
status: Published
type: Property
domain: C10002
label: austusavalduse saaja (tegija) teoses @et
label: aģentu godinošais darbs @lv
label: er agent, som beæres af værk af @da
label: er beæret agent av verk for @no
label: eserinin onurlandırılan temsilcisidir @tr
label: est un agent honoré d’une œuvre de @fr
label: is geëerde actor van werk van @nl
label: is honouree agent of work of @en
label: ist Akteur als Gefeierte/Gefeierter eines Werks von @de
label: méltatott ágense a következő műnek: @hu
label: è onorato agente di opera di @it
label: és agent homenatjat d’una obra de @ca
label: είναι τιμώμενος φορέας του έργου του @el
label: هو وكيل مكرم بعمل لـ @ar
label: 是……的作品的被纪念者行为者 @zh-hans
sub property of: toimijaan liittyvä teos
alternative label: Gefeierter von @de
alternative label: agent honoré de @fr
alternative label: agent, som beæres af værk af @da
alternative label: agente homenajeado de obra de @es
alternative label: agente onorato di opera di @it
alternative label: austusavalduse saaja teoses @et
alternative label: beæret for @no
alternative label: eserinin onurlandırılanıdır @tr
alternative label: homenajeado de @es
alternative label: homenajeado de obra de @es
alternative label: honoree agent of work of @en
alternative label: honoree of @en
alternative label: honouree of work of @en
alternative label: kopyasının onurlandırılan temsilcisidir @tr
alternative label: méltatottja a következő műnek: @hu
alternative label: τιμώμενος του @el
alternative label: τιμώμενος του έργου του @el
alternative label: وكيل مكرم بعمل @ar
alternative label: ……的作品的被纪念者 @zh-hans
alternative label: ……的作品的被纪念者行为者 @zh-hans
alternative label: ……的被纪念者 @zh-hans
definition: Bir temsilciyi, bir temsilci için duyulan saygıyı ve hürmeti gösteren bir eserle ilişkilendirir. @tr

kappaleella kunnioitettu toimija kappaleessa
has element type: 2
instruction number: 18.5
toolkit definition: An item that marks the esteem of and respect for an agent. @en
toolkit definition: Bir temsilcinin itibarını ve ona duyulan saygıyı gösteren bir kopya. @tr
toolkit definition: Een item dat toont de waardering en respect voor een actor. @nl
toolkit definition: Ein Exemplar, das einen Akteur ehrt. @de
toolkit definition: Eksemplar, mis märgib lugupidamist ja austust tegija vastu. @et
toolkit definition: Eksemplar, som markerer en hædring af en agent. @da
toolkit definition: Et eksemplar som markerer aktelse og repekt for en agent. @no
toolkit definition: Item che esprime la stima e il rispetto per un agente. @it
toolkit definition: Item qui marque l’estime et le respect pour un agent. @fr
toolkit definition: Kappale, joka osoittaa arvostusta ja kunnioitusta toimijalle.
toolkit definition: Vienība, ar kuru godināts aģents. @lv
toolkit definition: méltatottja (példány): @hu
toolkit definition: Ítem que marca l’estima i el respecte per un agent. @ca
toolkit definition: Ένα αντίτυπο που τιμά έναν φορέα. @el
toolkit definition: مفردة تدل على تقدير واحترام لوكيل. @ar
toolkit definition: 表示对一个行为者尊重或尊敬的一个单件 @zh-hans
toolkit label: Akteur als Gefeierte/Gefeierter eines Exemplars von @de
toolkit label: Egy példány, amely jelzi egy ágens megbecsülését és tiszteletét. @hu
toolkit label: agent homenatjat d’un ítem de @ca
toolkit label: agent honoré d’un item de @fr
toolkit label: agent, som beæres af eksemplar af @da
toolkit label: agente onorato di item di @it
toolkit label: austusavalduse saaja (tegija) eksemplaris @et
toolkit label: aģentu godinošā vienība @lv
toolkit label: beæret agent av eksemplar for @no
toolkit label: geëerde actor van item van @nl
toolkit label: honouree agent of item of @en
toolkit label: kappaleella kunnioitettu toimija kappaleessa
toolkit label: kopyasının onurlandırılan temsilcisidir @tr
toolkit label: τιμώμενος φορέας του αντιτύπου του @el
toolkit label: وكيل مكرم بمفردة @ar
toolkit label: ……的单件的被纪念者行为者 @zh-hans
has subproperty: kappaleella kunnioitettu henkilö kappaleessa
has subproperty: kappaleella kunnioitettu yhteistoimija kappaleessa
has subproperty: P50167
lexical alias: honoureeAgentOfItemOf.en
status: Published
type: Property
domain: C10002
label: austusavalduse saaja (tegija) eksemplaris @et
label: aģentu godinošā vienība @lv
label: er agent, som beæres af eksemplar af @da
label: er beæret agent av eksemplar for @no
label: est un agent honoré d’un item de @fr
label: is geëerde actor van item van @nl
label: is honouree agent of item of @en
label: ist Akteur als Gefeierte/Gefeierter eines Exemplars von @de
label: kopyasının onurlandırılan temsilcisidir @tr
label: méltatott ágense a következő példánynak: @hu
label: è onorato agente di item di @it
label: és agent homenatjat d’un ítem de @ca
label: είναι τιμώμενος φορέας του αντιτύπου του @el
label: وكيل مكرم بمفردة @ar
label: 是……的单件的被纪念者行为者 @zh-hans
sub property of: toimijaan liittyvä kappale
alternative label: Gefeierter (Exemplar) von @de
alternative label: agent honoré (item) de @fr
alternative label: agent, som beæres af eksemplar af @da
alternative label: agente homenajeado de ítem de @es
alternative label: agente onorato di item di @it
alternative label: austusavalduse saaja eksemplaris @et
alternative label: beæret av eksemplar for @no
alternative label: homenajeado (ítem) de @es
alternative label: honoree (item) of @en
alternative label: honoree agent of item of @en
alternative label: honouree (item) of @en
alternative label: méltatottja (példány): @hu
alternative label: τιμώμενος του αντιτύπου του @el
alternative label: ……的单件的被纪念者行为者 @zh-hans
alternative label: ……（单件）的被纪念者 @zh-hans
definition: Bir temsilciyi, bir temsilciye duyulan saygısını ve hürmetini gösteren bir kopyayla ilişkilendirir. @tr
definition: Correla un agente a un item che esprime la stima e il rispetto per un agente. @it
definition: Hozzákapcsol egy ágenst egy példányhoz, amely jelzi egy ágens megbecsülését és tiszteletét. @hu
definition: Liittää toimijan kappaleeseen, joka osoittaa arvostusta ja kunnioitusta toimijalle.
definition: Met un agent en relation avec un item qui marque l’estime et le respect pour un agent. @fr
definition: Relaciona un agent amb un ítem que marca l’estima i el respecte per un agent. @ca
definition: Relateert een actor aan een item dat toont de waardering en respect voor een actor. @nl

lähetyksestä vastaava toimija manifestaatiossa
has element type: 2
instruction number: 18.5
toolkit definition: A manifestation that involves a responsibility of an agent for broadcasting to an audience via radio, television, webcast, etc. @en
toolkit definition: Bir temsilcinin radyo, televizyon, web yayını vb. yoluyla bir izleyici kitlesine yayın yapma sorumluluğunu içeren bir gösterim. @tr
toolkit definition: Een manifestatie die met zich meebrengt een verantwoordelijkheid van een actor voor uitzending naar een publiek via radio, televisie, webcast etc. @nl
toolkit definition: Egy megjelenési forma, amelyhez hozzátartozik egy ágens felelőssége műsorszórásért, amely a közönség felé rádión, televízión, webes közvetítésen stb. keresztül történik. @hu
toolkit definition: Eine Manifestation, bei der ein Akteur für die Ausstrahlung über Hörfunk, Fernsehen oder Webcast und so weiter verantwortlich ist. @de
toolkit definition: En manifestasjon som involverer ansvar for en agent i form av kringkasting til et publikum via radio, fjernsyn, webcast, etc. @no
toolkit definition: Kehastus, mis sisaldab tegija vastutust avalikkusele levitamise eest raadio, televisiooni, veebi vms kaudu. @et
toolkit definition: Manifestaatio, jossa toimija on vastuussa radio-, televisio-, suoratoisto- tms. lähetyksen toteuttamisesta yleisölle.
toolkit definition: Manifestació que implica una responsabilitat d’un agent per la difusió a uns destinataris mitjançant la ràdio, la televisió, el web, etc. @ca
toolkit definition: Manifestation qui comporte une responsabilité de la part d’un agent en ce qui concerne la diffusion à un public par la radio, la télévision, la webdiffusion, etc. @fr
toolkit definition: Manifestation, som involverer en agents ansvar for at transmittere til et publikum via radio, tv, webcast etc. @da
toolkit definition: Manifestazione che implica una responsabilità di un agente nella trasmissione a un pubblico via radio, televisione, web, etc. @it
toolkit definition: Manifestācija, kas ietver aģenta atbildību par pārraidi, izmantojot radio, televīziju, tīmekļa apraidi u.tml. @lv
toolkit definition: Μια εκδήλωση που εκπέμπεται προς ένα ακροατήριο μέσω ραδιοφώνου, τηλεόρασης, web εκπομπής κ.λπ. . @el
toolkit definition: تجسيدة تنطوي على مسئولية وكيل عن البث إلى جمهور عبر الإذاعة والتلفزيون والإنترنت، الخ. @ar
toolkit definition: 涉及一个通过广播、电视、网路直播等向听众播音的一个行为者的责任的一种载体表现 @zh-hans
toolkit label: Akteur als Sender von @de
toolkit label: agent diffuseur audiovisuel de @fr
toolkit label: agent difusor audiovisual de @ca
toolkit label: agent, som er broadcaster af @da
toolkit label: broadcaster agent of @en
toolkit label: diffusore agente di @it
toolkit label: ir raidorganizācija (aģents) @lv
toolkit label: kringkaster av (agent) @no
toolkit label: leviedastaja (tegija) kehastuses @et
toolkit label: lähetyksestä vastaava toimija manifestaatiossa
toolkit label: műsorszolgáltató ágense: @hu
toolkit label: uitzender-actor van @nl
toolkit label: yayıncı temsilcisi @tr
toolkit label: ευρυεκπομπέας φορέας του @el
toolkit label: وكيل مذيع @ar
toolkit label: ……的广播者行为者 @zh-hans
has subproperty: lähetyksestä vastaava henkilö manifestaatiossa
has subproperty: lähetyksestä vastaava yhteistoimija manifestaatiossa
has subproperty: P50168
lexical alias: broadcasterAgentOf.en
status: Published
type: Property
domain: C10002
label: er agent, som er broadcaster af @da
label: er kringkaster av (agent) @no
label: est un agent diffuseur audiovisuel de @fr
label: ir raidorganizācija (aģents) @lv
label: is broadcaster agent of @en
label: is uitzender-actor van @nl
label: ist Akteur als Sender von @de
label: leviedastaja (tegija) kehastuses @et
label: műsorszolgáltató ágense a következőnek: @hu
label: yayıncı temsilcisidir @tr
label: è diffusore agente di @it
label: és agent difusor audiovisual de @ca
label: είναι ευρυεκπομπέας φορέας του @el
label: هو وكيل مذيع لـ @ar
label: 是……的广播者行为者 @zh-hans
sub property of: kustantaja (toimija) manifestaatiossa
alternative label: Sender von @de
alternative label: broadcaster af @da
alternative label: broadcaster of @en
alternative label: diffuseur audiovisuel de @fr
alternative label: diffusore di @it
alternative label: entitat de difusió de @ca
alternative label: kringkaster av @no
alternative label: leviedastaja kehastuses @et
alternative label: műsorszolgáltatója: @hu
alternative label: transmisor de @es
alternative label: vastaavana lähetyksessä
alternative label: yayıncısı @tr
alternative label: εκφωνητής του @el
alternative label: ευρυεκπομπέας του @el
alternative label: مذيع @ar
alternative label: ……的广播者 @zh-hans
definition: Bir temsilciyi, bir kitleye radyo, televizyon, genel ağ yayını aracılığıyla yayın yapma sorumluluğunu içeren bir gösterimle ilişkilendirir @tr
definition: Correla un agente a una manifestazione che implica una responsabilità di un agente nella trasmissione a un pubblico via radio, televisione, web, etc. @it
definition: Hozzákapcsol egy ágenst egy megjelenési formához, amelyhez hozzátartozik egy ágens felelőssége műsorszórásért, amely a közönség felé rádión, televízión, webes közvetítésen stb. keresztül történik. @hu
definition: Liittää toimijan manifestaatioon, jossa toimija on vastuussa radio-, televisio-, suoratoisto- tms. lähetyksen toteuttamisesta yleisölle.
definition: Met un agent en relation avec une manifestation qui comporte une responsabilité de la part d’un agent en ce qui concerne la diffusion à un public par la radio, la télévision, la webdiffusion, etc. @fr
definition: Relaciona un agent amb una manifestació que implica una responsabilitat d’un agent per la difusió a uns destinataris mitjançant la ràdio, la televisió, el web, etc. @ca

elokuvan jakelija (toimija) manifestaatiossa
has element type: 2
instruction number: 18.5
toolkit definition: A manifestation that involves a responsibility of an agent for distribution of a moving image to theaters or other channels. @en
toolkit definition: Een manifestatie die met zich meebrengt een verantwoordelijkheid van een actor voor distributie van een bewegend beeld naar theaters of andere kanalen. @nl
toolkit definition: Egy megjelenési forma, amelyhez hozzátartozik egy ágens felelőssége mozgóképszínházak vagy más csatornák útján történő terjesztéséért. @hu
toolkit definition: Eine Manifestation, bei der ein Akteur für den Vertrieb eines Bewegtbilds an Kinos oder andere Vertriebskanäle verantwortlich ist. @de
toolkit definition: En manifestasjon som involverer ansvar for en agent i form av distribusjon av levende bilder til kinoer eller andre kanaler. @no
toolkit definition: Hareketli bir görüntünün sinemalara veya diğer kanallara dağıtılması için bir temsilcinin sorumluluğunu içeren bir gösterim. @tr
toolkit definition: Kehastus, mis sisaldab tegija vastutust filmi levitamise eest kinodesse või muudesse levikanalitesse. @et
toolkit definition: Manifestaatio, jonka jakelusta elokuvateattereille tai muille jakelukanaville toimija on vastuussa.
toolkit definition: Manifestació que implica una responsabilitat d’un agent en la distribució d’una imatge en moviment a cinemes o a altres canals de distribució. @ca
toolkit definition: Manifestation qui comporte une responsabilité de la part d’un agent en ce qui concerne la distribution d’images animées aux salles de cinéma ou aux autres réseaux de distribution. @fr
toolkit definition: Manifestation, som involverer en agents ansvar for distribution af et levende billede til biografer eller andre distributionskanaler. @da
toolkit definition: Manifestazione che implica una responsabilità di un agente nella distribuzione di un'immagine in movimento a teatri o altri canali. @it
toolkit definition: Manifestācija, kas ietver aģenta atbildību par filmas izplatīšanu kinoteātriem vai caur citiem izplatīšanas kanāliem. @lv
toolkit definition: Μια εκδήλωση κινητής εικόνας που διανέμεται στα θέατρα ή σε άλλα κανάλια διανομής. @el
toolkit definition: تجسيدة تنطوي على مسئولية وكيل عن توزيع فيلم على قاعات العرض أو عبر قنوات أخرى. @ar
toolkit definition: 涉及向剧院或其他渠道发行动态图像的一个行为者的责任的一种载体表现 @zh-hans
toolkit label: Akteur als Filmvertrieb von @de
toolkit label: agent distributeur de cinéma de @fr
toolkit label: agent distribuïdor de pel·lícules de @ca
toolkit label: agent, som er filmdistributør af @da
toolkit label: distributore di film agente di @it
toolkit label: elokuvan jakelija (toimija) manifestaatiossa
toolkit label: film dağıtıcısı temsilcisi @tr
toolkit label: film distributor agent of @en
toolkit label: filmdistributeur-actor van @nl
toolkit label: filmdistributør av (agent) @no
toolkit label: filmilevitaja (tegija) kehastuses @et
toolkit label: filmterjesztő ágense: @hu
toolkit label: ir filmas izplatītājs (aģents) @lv
toolkit label: διανομέας ταινίας φορέας του @el
toolkit label: وكيل موزع أفلام @ar
toolkit label: ……的电影发行者行为者 @zh-hans
has subproperty: elokuvan jakelija (henkilö) manifestaatiossa
has subproperty: elokuvan jakelija (yhteistoimija) manifestaatiossa
has subproperty: P50169
lexical alias: filmDistributorAgentOf.en
status: Published
type: Property
domain: C10002
label: er agent, som er filmdistributør af @da
label: er filmdistributør av (agent) @no
label: est un agent distributeur de cinéma de @fr
label: film dağıtımcısı temsilcisidir @tr
label: filmilevitaja (tegija) kehastuses @et
label: filmterjesztő ágense a következőnek: @hu
label: ir filmas izplatītājs (aģents) @lv
label: is film distributor agent of @en
label: is filmdistributeur-actor van @nl
label: ist Akteur als Filmvertrieb von @de
label: è distributore agente di film di @it
label: és agent distribuïdor de pel·lícules de @ca
label: είναι διανομέας ταινίας φορέας του @el
label: هو وكيل موزع أفلام لـ @ar
label: 是……的电影发行者行为者 @zh-hans
sub property of: jakelija (toimija) manifestaatiossa
alternative label: Filmvertrieb von @de
alternative label: agent distributeur de film de @fr
alternative label: distribuidor fílmico de @es
alternative label: distributeur de cinéma de @fr
alternative label: distributore di film di @it
alternative label: distribuïdor de pel·lícules de @ca
alternative label: film dağıtıcısı @tr
alternative label: film distributor of @en
alternative label: filmdistributør af @da
alternative label: filmdistributør av @no
alternative label: filmilevitaja kehastuses @et
alternative label: filmterjesztője: @hu
alternative label: jakelijana elokuvassa
alternative label: διανομέας ταινίας του @el
alternative label: موزع أفلام @ar
alternative label: ……的电影发行者 @zh-hans
definition: Bir temsilciyi, hareketli bir görüntüyü tiyatro ve kanallara dağıtma sorumluluğunu içeren bir gösterimle ilişkilendirir. @tr
definition: Correla un agente a una manifestazione che che implica una responsabilità di un agente nella distribuzione di un'immagine in movimento a teatri o altri canali. @it
definition: Hozzákapcsol egy ágenst egy megjelenési formához, amelyhez hozzátartozik egy ágens felelőssége mozgóképszínházak vagy más csatornák útján történő terjesztéséért. @hu
definition: Liittää toimijan manifestaatioon, jonka jakelusta elokuvateattereille tai muille jakelukanaville toimija on vastuussa.
definition: Met un agent en relation avec une manifestation qui comporte une responsabilité de la part d’un agent en ce qui concerne la distribution d’images animées aux salles de cinéma ou aux autres réseaux de distribution. @fr
definition: Relaciona un agent amb una manifestació que implica una responsabilitat d’un agent en la distribució d’una imatge en moviment a cinemes o a altres canals de distribució. @ca

graafinen suunnittelija (toimija) manifestaatiossa
has element type: 2
instruction number: 18.5
toolkit definition: A manifestation that involves a responsibility of an agent for the entire graphic design of a book, including arrangement of type and illustration, choice of materials, and process used. @en
toolkit definition: Een manifestatie die met zich meebrengt een verantwoordelijkheid van een actor voor het complete grafische ontwerp van een boek, inclusief indeling van font en illustratie, keuze van materialen en gebruikte methode. @nl
toolkit definition: Egy megjelenési forma, amelyhez hozzátartozik egy ágens felelőssége egy könyv teljes grafikai tervezéséért, beleértve a nyomdai betűtípus és az illusztrációk elrendezését, az anyagválasztást és az alkalmazott eljárást. @hu
toolkit definition: Eine Manifestation, bei der ein Akteur für das gesamte grafische Design eines Buchs, einschließlich Schriftbild, Bildgestaltung, Materialwahl und angewandter Verfahren, verantwortlich ist. @de
toolkit definition: En manifestasjon som involverer ansvar for en agent for hele den grafiske utformingen av en bok, inkludert oppsett av skrifttype og illustrasjoner, valg av materialer og hvilke prosesser som brukes. @no
toolkit definition: Kehastus, mis sisaldab tegija vastutust raamatu graafilise kujunduse eest, sealhulgas trükiteksti ja illustratsioonide paigutuse, materjalide valiku ja valmistamismenetluste eest. @et
toolkit definition: Manifestaatio, jossa toimija on vastuussa koko kirjan graafisesta suunnittelusta, taitosta, materiaalien valinnasta ja käytettävistä valmistusmenetelmistä.
toolkit definition: Manifestació que implica una responsabilitat d’un agent en tot el disseny gràfic d’un llibre, inclosa la composició tipogràfica i la il·lustració, la tria dels materials i el procés utilitzat. @ca
toolkit definition: Manifestation qui comporte une responsabilité de la part d’un agent en ce qui concerne toute la conception graphique d’un livre, y compris la composition typographique, l’arrangement des illustrations, le choix des matériaux et le procédé utilisé. @fr
toolkit definition: Manifestation, som involverer en agents ansvar for hele det grafiske design af en bog, inkl. opsætning af tekst og illustrationer, materialevalg og anvendt proces. @da
toolkit definition: Manifestazione che implica una responsabilità di un agente nell'intera progettazione grafica di un libro, inclusa la disposizione dei caratteri e dell'illustrazione, la scelta dei materiali e il processo utilizzato. @it
toolkit definition: Manifestācija, kas ietver aģenta atbildību par grāmatas grafisko dizainu, tajā skaitā par izkātojuma veidu un ilustrācijām, materiālu izvēli un izmantoto procesu. @lv
toolkit definition: Tip ve resim düzenlemesi, malzeme seçimi ve kullanılan süreç dahil bir kitabın tüm grafik tasarımından sorumlu temsilcinin sorumluluğunu içeren bir gösterim. @tr
toolkit definition: Μια εκδήλωση που κατασκευάζεται από έναν φορέα υπεύθυνο για τον συνολικό γραφικό σχεδιασμό ενός βιβλίου, περιλαμβανομένων της διάταξης των τυπογραφικών στοιχείων και της εικονογράφησης, της επιλογής των υλικών και της χρησιμοποιούμενης επεξεργασίας. @el
toolkit definition: تجسيدة تنطوي على مسئولية وكيل عن التصميم الجرافيكي لكتاب بالكامل، ويشمل ذلك تنسيق الحروف، والإيضاحيات، واختيار المواد، والعمليات المستخدمة. @ar
toolkit definition: 涉及一种图书的整体平面设计（包括字体和插图的设计、材料的选取和工艺流程的使用等）的一个行为者的责任的一种载体表现 @zh-hans
toolkit label: Akteur als Buchgestalterin/Buchgestalter von @de
toolkit label: agent dissenyador gràfic de @ca
toolkit label: agent maquettiste de livre de @fr
toolkit label: agent, som er bogdesigner af @da
toolkit label: boekontwerper-actor van @nl
toolkit label: bokdesigner for (agent) @no
toolkit label: book designer agent of @en
toolkit label: disegnatore di libro agente di @it
toolkit label: graafinen suunnittelija (toimija) manifestaatiossa
toolkit label: ir grāmatas dizainers (aģents) @lv
toolkit label: kitap tasarımcısı temsilcisi @tr
toolkit label: könyvtervező ágense: @hu
toolkit label: raamatukujundaja (tegija) kehastuses @et
toolkit label: σχεδιαστής βιβλίου φορέας του @el
toolkit label: وكيل مصمم كتاب @ar
toolkit label: ……的图书设计者行为者 @zh-hans
has subproperty: graafinen suunnittelija (henkilö) manifestaatiossa
has subproperty: graafinen suunnittelija (yhteistoimija) manifestaatiossa
has subproperty: P50170
lexical alias: bookDesignerAgentOf.en
status: Published
type: Property
domain: C10002
label: er agent, som er bogdesigner af @da
label: er bokdesigner for (agent) @no
label: est un agent maquettiste de livre de @fr
label: ir grāmatas dizainers (aģents) @lv
label: is boekontwerper-actor van @nl
label: is book designer agent of @en
label: ist Akteur als Buchgestalterin/Buchgestalter von @de
label: kitap tasarımcısı temsilcisidir @tr
label: könyvtervező ágense a következőnek: @hu
label: raamatukujundaja (tegija) kehastuses @et
label: è agente designer di libro @it
label: és agent dissenyador gràfic de @ca
label: είναι σχεδιαστής βιβλίου φορέας του @el
label: هو وكيل مصمم كتب لـ @ar
label: 是……的图书设计者行为者 @zh-hans
sub property of: manifestaation tekijä (toimija) manifestaatiossa
alternative label: Buchgestalter von @de
alternative label: bogdesigner af @da
alternative label: bokdesigner for @no
alternative label: book designer of @en
alternative label: designer di libro @it
alternative label: diseñador del libro de @es
alternative label: dissenyador gràfic de @ca
alternative label: kirjan graafinen suunnittelu
alternative label: kitap tasarımcısı @tr
alternative label: könyvtervezője: @hu
alternative label: maquettiste de livre de @fr
alternative label: raamatukujundaja kehastuses @et
alternative label: σχεδιαστής βιβλίου του @el
alternative label: مصمم كتب @ar
alternative label: ……的图书设计者 @zh-hans
definition: Bir temsilciyi, yazı ve resim düzenlemesi, malzeme seçimi ve kullanılan süreç dahil bir kitabın tüm grafik tasarımından sorumlu temsilcinin sorumluluğunu içeren bir gösterimiyle ilişkilendirir. @tr
definition: Correla un agente a una manifestazione che che implica una responsabilità di un agente nell'intera progettazione grafica di un libro, inclusa la disposizione dei caratteri e dell'illustrazione, la scelta dei materiali e il processo utilizzato. @it
definition: Hozzákapcsol egy ágenst egy megjelenési formához, amelyhez hozzátartozik egy ágens felelőssége egy könyv teljes grafikai tervezéséért, beleértve a nyomdai betűtípus és az illusztrációk elrendezését, az anyagválasztást és az alkalmazott eljárást. @hu
definition: Liittää toimijan manifestaatioon, jossa toimija on vastuussa koko kirjan graafisesta suunnittelusta, taitosta, materiaalien valinnasta ja käytettävistä valmistusmenetelmistä.
definition: Met un agent en relation avec une manifestation qui comporte une responsabilité de la part d’un agent en ce qui concerne toute la conception graphique d’un livre, y compris la composition typographique, l’arrangement des illustrations, le choix des matériaux et le procédé utilisé. @fr
definition: Relaciona un agent amb una manifestació que implica una responsabilitat d’un agent en tot el disseny gràfic d’un llibre, inclosa la composició tipogràfica i la il·lustració, la tria dels materials i el procés utilitzat. @ca
definition: Relateert een actor aan een manifestatie die met zich meebrengt een verantwoordelijkheid van een actor voor het complete grafische ontwerp van een boek, inclusief indeling van font en illustratie, keuze van materialen en gebruikte methode. @nl

kaivertaja (toimija) manifestaatiossa
has element type: 2
instruction number: 18.5
toolkit definition: A manifestation that involves a responsibility of an agent for cutting letters, figures, etc., on a surface such as a wooden or metal plate used for printing. @en
toolkit definition: Baskı için kullanılan ahşap veya metal bir levha gibi bir yüzey üzerine harf, şekil vb. kesmek için bir temsilcinin sorumluluğunu içeren bir gösterim. @tr
toolkit definition: Een manifestatie die met zich meebrengt een verantwoordelijkheid van een actor voor het snijden van letters, figuren etc., in een ondergrond zoals een houten of metalen plaat gebruikt voor het drukken. @nl
toolkit definition: Egy megjelenés forma, amelyhez hozzátartozik egy ágens felelőssége betűknek, számoknak stb. nyomtatáshoz használt fa- vagy fémlemez felületére történő metszéséért. @hu
toolkit definition: Eine Manifestation, bei der ein Akteur für das Schneiden von Buchstaben, figürliche Darstellungen oder andere Zeichen in eine Oberfläche, wie zum Beispiel eine Holz- oder Metallplatte, die zum Drucken benutzt wird, verantwortlich ist. @de
toolkit definition: En manifestasjon som involverer ansvar for en agent i form av utskjæring av bokstaver, figurer, etc. i en overflate som en tre- eller metallplate som brukes til trykking. @no
toolkit definition: Kehastus, mis sisaldab tegija vastutust tähtede, kujundite jms lõikamise eest trükkimiseks kasutatava puidust, metallist või muust materjalist plaadi pinnale. @et
toolkit definition: Manifestaatio, jossa toimija on vastuussa manifestaation valmistamisesta kaivertamalla kirjaimia, kuvioita tms. painamisessa käytettävälle pinnalle, kuten puu- tai metallipinnalle.
toolkit definition: Manifestació que implica una responsabilitat d’un agent en la gravació de lletres, figures, etc., sobre una superfície com ara una planxa de fusta o de metall usada en la impressió. @ca
toolkit definition: Manifestation qui comporte une responsabilité de la part d’un agent consistant à graver des lettres, des figures, etc. sur une surface telle qu’une plaque de bois ou de métal utilisée pour l’impression. @fr
toolkit definition: Manifestation, som involverer en agents ansvar for at udskære bogstaver, figurer etc. på en overflade såsom en træ- eller metalplade, som anvendes til trykning. @da
toolkit definition: Manifestazione che implica la responsabilità di un agente per l'incisione di lettere, figure, etc., su una superficie come una lastra di legno o metallo utilizzata per la stampa. @it
toolkit definition: Manifestācija, kas ietver aģenta atbildību par burtu, zīmju u.tml. iegriešanu uz drukāšanai izmantojama materiāla virsmas (piemēram, uz koka vai metāla plāksnes). @lv
toolkit definition: Μια εκδήλωση που κατασκευάζεται από έναν φορέα υπεύθυνο για την κοπή γραμμάτων, ψηφίων κ.λπ. σε μια επιφάνεια, όπως μια ξύλινη ή μεταλλική πλάκα που χρησιμοποιείται για την εκτύπωση. @el
toolkit definition: تجسيدة تنطوي على مسئولية وكيل عن نقش الحروف والأشكال، الخ، على سطح مثل لوح خشبي أو معدني يستخدم للطباعة. @ar
toolkit definition: 涉及通过在木版或金属版等表面上雕刻字母、图形等以用于印刷的一个行为者的责任的一种载体表现 @zh-hans
toolkit label: Akteur als Stecherin/Stecher von @de
toolkit label: agent gravador de @ca
toolkit label: agent graveur de @fr
toolkit label: agent, som er gravør af @da
toolkit label: engraver agent of @en
toolkit label: graveerija (tegija) kehastuses @et
toolkit label: graveur-actor van @nl
toolkit label: gravør av (agent) @no
toolkit label: gravür sanatçısı temsilcisi @tr
toolkit label: incisore agente di @it
toolkit label: ir gravieris (aģents) @lv
toolkit label: kaivertaja (toimija) manifestaatiossa
toolkit label: vésnök ágense: @hu
toolkit label: χαράκτης φορέας του @el
toolkit label: وكيل نقّاش @ar
toolkit label: ……的雕版者行为者 @zh-hans
has subproperty: kaivertaja (henkilö) manifestaatiossa
has subproperty: kaivertaja (yhteistoimija) manifestaatiossa
has subproperty: P50171
lexical alias: engraverAgentOf.en
status: Published
type: Property
domain: C10002
label: er agent, som er gravør af @da
label: er gravør av (agent) @no
label: est un agent graveur de @fr
label: graveerija (tegija) kehastuses @et
label: gravür sanatçısı temsilcisidir @tr
label: ir gravieris (aģents) @lv
label: is engraver agent of @en
label: is graveur-actor van @nl
label: ist Akteur als Stecherin/Stecher von @de
label: vésnök ágense a következőnek: @hu
label: è agente incisore di @it
label: és agent gravador de @ca
label: είναι χαράκτης φορέας του @el
label: هو وكيل نقّاش لـ @ar
label: 是……的雕版者行为者 @zh-hans
sub property of: kuvalaatan valmistaja (toimija) manifestaatiossa
alternative label: Stecher von @de
alternative label: engraver of @en
alternative label: grabador de @es
alternative label: gravador de @ca
alternative label: graveerija kehastuses @et
alternative label: graveur de @fr
alternative label: gravør af @da
alternative label: gravør av @no
alternative label: gravür sanatçısı @tr
alternative label: incisore di @it
alternative label: kaivertajana painotuotteessa
alternative label: vésnöke: @hu
alternative label: χαράκτης του @el
alternative label: نقّاش @ar
alternative label: ……的雕版者 @zh-hans
definition: Bir temsilciyi, baskı için kullanılan ahşap veya metal gibi bir plaka yüzey üzerinde, harf, rakam vb...yi kesmekle görevli bir temsilcinin sorumluluğunu içeren bir gösterimle ilişkilendirir. @tr
definition: Correla un agente a una manifestazione che implica la responsabilità di un agente per l'incisione di lettere, figure, etc., su una superficie come una lastra di legno o metallo utilizzata per la stampa. @it
definition: Hozzákapcsol egy ágenst egy megjelenés formához, amelyhez hozzátartozik egy ágens felelőssége betűknek, számoknak stb. nyomtatáshoz használt fa- vagy fémlemez felületére történő metszéséért. @hu
definition: Liittää toimijan manifestaatioon, jossa toimija on vastuussa manifestaation valmistamisesta kaivertamalla kirjaimia, kuvioita tms. painamisessa käytettävälle pinnalle, kuten puu- tai metallipinnalle.
definition: Met un agent en relation avec une manifestation qui comporte une responsabilité de la part d’un agent consistant à graver des lettres, des figures, etc. sur une surface telle qu’une plaque de bois ou de métal utilisée pour l’impression. @fr
definition: Relaciona un agent amb una manifestació que implica una responsabilitat d’un agent en la gravació de lletres, figures, etc., sobre una superfície com ara una planxa de fusta o de metall usada en la impressió. @ca
definition: Relateert een actor aan een manifestatie die met zich meebrengt een verantwoordelijkheid van een actor voor het snijden van letters, figuren etc., in een ondergrond zoals een houten of metalen plaat gebruikt voor het drukken. @nl

pistekirjoituksen tekijä (toimija) manifestaatiossa
has element type: 2
instruction number: 18.5
toolkit definition: A manifestation that involves a responsibility of an agent for embossing braille cells using a stylus, special embossing printer, or other device. @en
toolkit definition: Bir kalem, özel kabartma yazıcı veya başka bir cihaz kullanarak braille hücrelerini kabartmak için bir temsilcinin sorumluluğunu içeren bir gösterim. @tr
toolkit definition: Een manifestatie die met zich meebrengt een verantwoordelijkheid van een actor voor het pregen van braille cellen met gebruikmaking van een stylus, speciale preegdrukmachine of ander instrument. @nl
toolkit definition: Egy megjelenési forma, amelyhez hozzátartozik egy ágens felelőssége braille-cellák dombornyomásáért íróvessző, speciális dombornyomtató vagy más eszköz használatával. @hu
toolkit definition: Eine Manifestation, bei der ein Akteur für das Prägen von Braillezeichen verantwortlich ist, indem er einen Griffel, einen speziellen Brailledrucker oder ein anderes Gerät verwendet. @de
toolkit definition: En manifestasjon som involverer ansvar for en agent i form av preging av brailleceller ved hjelp av pren, punktskriftmaskin eller annen innretning. @no
toolkit definition: Kehastus, mis sisaldab tegija vastutust spetsiaalse kirjutusvahendi, punktkirjaprinteri või muu seadmega punktkirjamärkide tegemise eest. @et
toolkit definition: Manifestaatio, jonka tekemisestä toimija on vastuussa tuottamalla pistekirjoitusmerkkejä piirtimen, erityistulostimen tai muun laitteen avulla.
toolkit definition: Manifestació que implica una responsabilitat d’un agent en el repujat de punts braille amb un punxó, una impressora especial d’estampar o un altre mecanisme. @ca
toolkit definition: Manifestation qui comporte une responsabilité de la part d’un agent consistant à embosser des cellules braille au moyen d’un poinçon, d’une imprimante spéciale ou d’un autre appareil. @fr
toolkit definition: Manifestation, som involverer en agents ansvar for at præge punktskriftsceller vha. en stift, særlig prægeprinter eller anden anordning. @da
toolkit definition: Manifestazione che implica la responsabilità di un agente per lo sbalzo di punti braille utilizzando uno stilo, una speciale stampante a sbalzo o altro dispositivo. @it
toolkit definition: Manifestācija, kas ietver aģenta atbildību par Braila raksta matricas iespiešanu, izmantojot irbuli, īpaša ciļņa iespieduma printeri vai citu ierīci. @lv
toolkit definition: Μια εκδήλωση που κατασκευάζεται από έναν φορέα υπεύθυνο για την ανάγλυφη εκτύπωση μπράιγ μέσω της χρήσης ενός ειδικού εκτυπωτή ανάγλυφης εκτύπωσης ή άλλης συσκευής. @el
toolkit definition: تجسيدة تنطوي على مسئولية وكيل عن نقش حروف برايل باستخدام قلم أو طابعة خاصة للنقش أو أي أداة أخرى. @ar
toolkit definition: 涉及通过使用刻写针、专门的压纹机或其他设备压印布莱叶盲文的一个行为者的责任的一种载体表现 @zh-hans
toolkit label: Akteur als Brailleschriftprägerin/Brailleschriftpräger von @de
toolkit label: Braille-dombornyomó ágense: @hu
toolkit label: agent estampador braille de @ca
toolkit label: agent producteur braille de @fr
toolkit label: agent, som er punktskriftspræger af @da
toolkit label: braille embosser agent of @en
toolkit label: braille kabartmacısı temsilcisi @tr
toolkit label: brailleerder-actor van @nl
toolkit label: ir iespiedējs Braila rakstā (aģents) @lv
toolkit label: pistekirjoituksen tekijä (toimija) manifestaatiossa
toolkit label: punktkirja kirjutaja (tegija) kehastuses @et
toolkit label: punktskriftpreger for (agent) @no
toolkit label: stampatore braille agente di @it
toolkit label: τυπογράφος μπράιγ φορέας του @el
toolkit label: وكيل نقاش حروف برايل @ar
toolkit label: ……的布莱叶盲文点字制作者行为者 @zh-hans
has subproperty: pistekirjoituksen tekijä (henkilö) manifestaatiossa
has subproperty: pistekirjoituksen tekijä (yhteistoimija) manifestaatiossa
has subproperty: P50172
lexical alias: brailleEmbosserAgentOf.en
status: Published
type: Property
domain: C10002
label: Braille-dombornyomó ágense a következőnek: @hu
label: braille kabartmacısı temsilcisidir @tr
label: er agent, som er punktskriftspræger af @da
label: er punktskriftpreger for (agent) @no
label: est un agent producteur braille de @fr
label: ir iespiedējs Braila rakstā (aģents) @lv
label: is braille embosser agent of @en
label: is brailleerder-actor van @nl
label: ist Akteur als Brailleschriftprägerin/Brailleschriftpräger von @de
label: punktkirja kirjutaja (tegija) kehastuses @et
label: è agente stampatore braille di @it
label: és agent estampador braille de @ca
label: είναι τυπογράφος μπράιγ φορέας του @el
label: هو وكيل نقّاش حروف برايل لـ @ar
label: 是……的布莱叶盲文点字制作者行为者 @zh-hans
sub property of: valmistaja (toimija) manifestaatiossa
alternative label: Braille-dombornyomója: @hu
alternative label: Brailleschriftpräger von @de
alternative label: braille embosser of @en
alternative label: braille kabartmacısı @tr
alternative label: braillepræger af @da
alternative label: estampador braille de @ca
alternative label: grabador en relieve de @es
alternative label: producteur braille de @fr
alternative label: punktkirja kirjutaja kehastuses @et
alternative label: punktskriftpreger for @no
alternative label: stampatore braille di @it
alternative label: valmistajana pistekirjoituksessa
alternative label: τυπογράφος μπράιγ του @el
alternative label: نقَّاش حروف برايل @ar
alternative label: ……的布莱叶盲文点字制作者 @zh-hans
definition: Bir temsilciyi, bir kalem, özel kabartma yazıcı veya başka bir cihaz kullanarak braille hücrelerini kabartmakla görevli olan temsilcinin sorumluluğunu içeren bir gösterimle ilişkilendirir. @tr
definition: Correla un agente a una manifestazione che implica la responsabilità di un agente per lo sbalzo di punti braille utilizzando uno stilo, una speciale stampante a sbalzo o altro dispositivo. @it
definition: Hozzákapcsol egy ágenst egy megjelenési formához, amelyhez hozzátartozik egy ágens felelőssége braille-cellák dombornyomásáért íróvessző, speciális dombornyomtató vagy más eszköz használatával. @hu
definition: Liittää toimijan manifestaatioon, jonka tekemisestä toimija on vastuussa tuottamalla pistekirjoitusmerkkejä piirtimen, erityistulostimen tai muun laitteen avulla.
definition: Met un agent en relation avec une manifestation qui comporte une responsabilité de la part d’un agent consistant à embosser des cellules braille au moyen d’un poinçon, d’une imprimante spéciale ou d’un autre appareil. @fr
definition: Relaciona un agent amb una manifestació que implica una responsabilitat d’un agent en el repujat de punts braille amb un punxó, una impressora especial d’estampar o un altre mecanisme. @ca
definition: Relateert een actor aan een manifestatie die met zich meebrengt een verantwoordelijkheid van een actor voor het pregen van braille cellen met gebruikmaking van een stylus, speciale preegdrukmachine of ander instrument. @nl

kuvalaatan valmistaja (toimija) manifestaatiossa
has element type: 2
instruction number: 18.5
toolkit definition: A manifestation that involves a responsibility of an agent for making a relief, intaglio, or planographic printing surface. @en
toolkit definition: Bir temsilcinin kabartma, çukur baskı veya planografik baskı yüzeyi yapmak için sorumluluğunu içeren bir gösterim. @tr
toolkit definition: Een manifestatie die met zich meebrengt een verantwoordelijkheid van een actor voor het maken van een relief, intaglio of vlakdruk oppervlak. @nl
toolkit definition: Egy megjelenési forma, amelyhez hozzátartozik egy ágens felelőssége egy relief, egy mélynyomásos vagy síknyomásos felület készítéséért. @hu
toolkit definition: Eine Manifestation, bei der ein Akteur für die Herstellung einer Hochdruck-, Tiefdruck- oder Flachdruckoberfläche verantwortlich ist. @de
toolkit definition: En manifestasjon som involverer ansvar for en agent i form av skaping av overflate for relieff-, intaglio- eller plantrykk. @no
toolkit definition: Kehastus, mis sisaldab tegija vastutust kõrgtrüki, sügavtrüki või lametrüki teel tõmmiste tegemise eest. @et
toolkit definition: Manifestaatio, jossa toimija on vastuussa kohokuvan, syväpainon tai laakapainon painopinnan valmistamisesta.
toolkit definition: Manifestació que implica una responsabilitat d’un agent en la fabricació d’una superfície d’impressió en relleu, gravada en profunditat o planogràfica. @ca
toolkit definition: Manifestation qui comporte une responsabilité de la part d’un agent consistant à préparer un élément d’impression en relief, en creux ou planographique. @fr
toolkit definition: Manifestation, som involverer en agents ansvar for at lave en relief-, dybtryks- eller fladtryksoverflade. @da
toolkit definition: Manifestazione che implica la responsabilità di un agente per la realizzazione di una superficie a rilievo, intaglio o stampa planografica. @it
toolkit definition: Manifestācija, kas ietver aģenta atbildību par reljefa, dobspiedes vai gludspieduma drukāšanas virsmas izveidi. @lv
toolkit definition: Μια εκδήλωση που κατασκευάζεται από έναν φορέα υπεύθυνο για τη δημιουργία μιας ανάγλυφης επιφάνειας εκτύπωσης, μιας βαθυτυπίας ή μιας επιπεδοτυπίας. @el
toolkit definition: تجسيدة تنطوي على مسئولية وكيل عن عمل سطح طباعة بارزة، أو غائرة، أو مستوية. @ar
toolkit definition: 涉及制作浮雕、凹版或平版印刷表面的一个行为者的责任的一种载体表现 @zh-hans
toolkit label: Akteur als Druckgrafikerin/Druckgrafiker von @de
toolkit label: agent gravador d’estampes de @ca
toolkit label: agent graveur d’estampe de @fr
toolkit label: agent, som er grafiker af @da
toolkit label: graafika trükkija (tegija) kehastuses @et
toolkit label: grafiker for (agent) @no
toolkit label: grafiker temsilcisi @tr
toolkit label: incisore agente di @it
toolkit label: ir gravīru meistars (aģents) @lv
toolkit label: kuvalaatan valmistaja (toimija) manifestaatiossa
toolkit label: nyomtatványkészítő ágense: @hu
toolkit label: prentmaker-actor van @nl
toolkit label: printmaker agent of @en
toolkit label: χαράκτης φορέας του @el
toolkit label: وكيل طبّاع @ar
toolkit label: ……的印版制作者行为者 @zh-hans
has subproperty: kaivertaja (toimija) manifestaatiossa
has subproperty: litografi (toimija) manifestaatiossa
has subproperty: etsaaja (toimija) mainifestaatiossa
has subproperty: kollotypian valmistaja (toimija) manifestaatiossa
has subproperty: kuvalaatan valmistaja (henkilö) manifestaatiossa
has subproperty: kuvalaatan valmistaja (yhteistoimija) manifestaatiossa
has subproperty: P50173
lexical alias: printmakerAgentOf.en
status: Published
type: Property
domain: C10002
label: baskı sanatçısı temsilcisidir @tr
label: er agent, som er grafiker af @da
label: er grafiker for (agent) @no
label: est un agent graveur d’estampe de @fr
label: graafika trükkija (tegija) kehastuses @et
label: ir gravīru meistars (aģents) @lv
label: is prentmaker-actor van @nl
label: is printmaker agent of @en
label: ist Akteur als Druckgrafikerin/Druckgrafiker von @de
label: nyomtatványkészítő ágense a következőnek: @hu
label: è incisore agente di @it
label: és agent gravador d’estampes de @ca
label: είναι χαράκτης φορέας του @el
label: هو وكيل طبّاع لـ @ar
label: 是……的印版制作者行为者 @zh-hans
sub property of: manifestaation tekijä (toimija) manifestaatiossa
alternative label: Druckgrafiker von @de
alternative label: graafika trükkija kehastuses @et
alternative label: grafiker @tr
alternative label: grafiker af @da
alternative label: grafiker for @no
alternative label: gravador d’estampes de @ca
alternative label: graveur d’estampe de @fr
alternative label: impresor de @es
alternative label: incisore di @it
alternative label: nyomtatványkészítője: @hu
alternative label: printmaker of @en
alternative label: valmistajana kuvalaatassa
alternative label: χαράκτης του @el
alternative label: طبّاع @ar
alternative label: ……的印版制作者 @zh-hans
definition: Bir temsilciyi, kabartma, çukur baskı veya planografik baskı yüzeyi yapmakla görevli temsilcinin sorumluluğunu içeren bir gösterimle ilişkilendirir. @tr
definition: Correla un agente a una manifestazione che implica la responsabilità di un agente per la realizzazione di una superficie a rilievo, intaglio o stampa planografica. @it
definition: Hozzákapcsol egy ágenst egy megjelenési formához, amelyhez hozzátartozik egy ágens felelőssége egy relief, egy mélynyomásos vagy síknyomásos felület készítéséért. @hu

valaja (toimija) manifestaatiossa
has element type: 2
instruction number: 18.5
toolkit definition: A manifestation that involves a responsibility of an agent for pouring a liquid or molten substance into a mold and leaving it to solidify to take the shape of the mold. @en
toolkit definition: Een manifestatie die met zich meebrengt een verantwoordelijkheid van een actor voor het gieten van een vloeistof of gesmolten substantie in een mal en het laten stollen om de vorm van de mal aan te laten nemen. @nl
toolkit definition: Egy megjelenési forma, amelyhez hozzátartozik egy ágens felelőssége folyékony vagy olvasztott anyag öntőformába öntéséért, hogy az ott megszilárduljon és fölvegye az öntőforma formáját. @hu
toolkit definition: Eine Manifestation, bei der ein Akteur dafür verantwortlich ist, eine Flüssigkeit oder eine geschmolzene Substanz in eine Form zu gießen, die in der Gießform verbleibt, bis sie ausgehärtet ist. @de
toolkit definition: En manifestasjon som involverer ansvar for en agent i form av å å helle et flytende eller smeltet stoff i en støpeform og la det stivne i denne formen. @no
toolkit definition: Kehastus, mis sisaldab tegija vastutust vedela või sulatatud materjali valuvormi valamise ja valuvormi kuju võtmiseks tahkuda laskmise eest. @et
toolkit definition: Manifestaatio, jonka valmistamisesta toimija on vastuussa muovaamalla sulatettua tai nestemäistä ainetta muotin avulla.
toolkit definition: Manifestació que implica una responsabilitat d’un agent en l’abocament d’un líquid o una substància fosa en un motlle tot deixant que se solidifiqui perquè prengui la forma del motlle. @ca
toolkit definition: Manifestation qui comporte une responsabilité de la part d’un agent consistant à verser un liquide ou une substance fondue dans un moule et à laisser ce liquide ou cette substance se solidifier pour prendre la forme du moule. @fr
toolkit definition: Manifestation, som involverer en agents ansvar for at hælde en væske eller et varmt, flydende stof i en form og lade det størkne, så det tager facon efter formen. @da
toolkit definition: Manifestazione che implica la responsabilità di un agente nel versare un liquido o sostanza fusa in uno stampo e lasciarlo solidificare per assumere la forma dello stampo. @it
toolkit definition: Manifestācija, kas ietver aģenta atbildību par šķidruma vai izkausētas vielas ieliešanu veidnē un atstāšanu sacietēt, lai tā saglabātu formu. @lv
toolkit definition: Sıvı veya erimiş bir maddenin bir kalıba dökülmesi ve kalıbın şeklini alması için katılaşmaya bırakılması ile görevli temsilcinin sorumluluğunu içeren bir gösterim. @tr
toolkit definition: Μια εκδήλωση που κατασκευάζεται από έναν φορέα υπεύθυνο για την έκχυση υγρής ή τηγμένης ουσίας και τη στερεοποίησή της μέχρι να πάρει το σχήμα του καλουπιού. @el
toolkit definition: تجسيدة تنطوي على مسئولية وكيل عن صب مادة سائلة أو منصهرة في قالب وتركها للتصلب لأخذ شكل القالب. @ar
toolkit definition: 涉及将液体或融化的物质倒入模具中使其按模具固化成型的一个行为者的责任的一种载体表现 @zh-hans
toolkit label: Akteur als Formgießerin/Formgießer von @de
toolkit label: agent emmotllador de @ca
toolkit label: agent fondeur de @fr
toolkit label: agent, som er støber af @da
toolkit label: caster agent of @en
toolkit label: dökümcü temsilcisi @tr
toolkit label: fonditore agente di @it
toolkit label: gieter-actor van @nl
toolkit label: ir atliešanas meistars (aģents) @lv
toolkit label: støper av (agent) @no
toolkit label: valaja (tegija) kehastuses @et
toolkit label: valaja (toimija) manifestaatiossa
toolkit label: öntvénykészítő ágense: @hu
toolkit label: αναδευτήρας φορέας του @el
toolkit label: وكيل عامل صب @ar
toolkit label: ……的铸造者行为者 @zh-hans
has subproperty: valaja (henkilö) manifestaatiossa
has subproperty: valaja (yhteistoimija) manifestaatiossa
has subproperty: P50174
lexical alias: casterAgentOf.en
status: Published
type: Property
domain: C10002
label: dökümcü temsilcisidir @tr
label: er agent, som er støber af @da
label: er støper av (agent) @no
label: est un agent fondeur de @fr
label: ir atliešanas meistars (aģents) @lv
label: is caster agent of @en
label: is gieter-actor van @nl
label: ist Akteur als Formgießerin/Formgießer von @de
label: valaja (tegija) kehastuses @et
label: è fonditore agente di @it
label: és agent emmotllador de @ca
label: öntvénykészítő ágense a következőnek: @hu
label: είναι αναδευτήρας φορέας του @el
label: هو وكيل عامل صب لـ @ar
label: 是……的铸造者行为者 @zh-hans
sub property of: manifestaation tekijä (toimija) manifestaatiossa
alternative label: Formgießer von @de
alternative label: caster of @en
alternative label: dökümcü @tr
alternative label: emmotllador de @ca
alternative label: fondeur de @fr
alternative label: fonditore di @it
alternative label: fundidor de @es
alternative label: støber af @da
alternative label: støper av @no
alternative label: valaja kehastuses @et
alternative label: valajana valoksessa
alternative label: öntvénykészítője: @hu
alternative label: αναδευτήρας του @el
alternative label: عامل صب @ar
alternative label: ……的铸造者 @zh-hans
definition: Bir temsilciyi, sıvı veya erimiş bir maddenin bir kalıba dökülmesi ve kalıbın şeklini alması için katılaşmaya bırakılması ile görevli temsilcinin sorumluluğunu içeren bir gösterimle ilişkilendirir. @tr
definition: Correla un agente a una manifestazione che implica la responsabilità di un agente nel versare un liquido o sostanza fusa in uno stampo e lasciarlo solidificare per assumere la forma dello stampo. @it
definition: Hozzákapcsol egy ágenst egy megjelenési formához, amelyhez hozzátartozik egy ágens felelőssége folyékony vagy olvasztott anyag öntőformába öntéséért, hogy az ott megszilárduljon és fölvegye az öntőforma formáját. @hu
definition: Liittää toimijan manifestaatioon, jonka valmistamisesta toimija on vastuussa muovaamalla sulatettua tai nestemäistä ainetta muotin avulla.
definition: Met un agent en relation avec une manifestation qui comporte une responsabilité de la part d’un agent consistant à verser un liquide ou une substance fondue dans un moule et à laisser ce liquide ou cette substance se solidifier pour prendre la forme du moule. @fr
definition: Relaciona un agent amb una manifestació que implica una responsabilitat d’un agent en l’abocament d’un líquid o una substància fosa en un motlle tot deixant que se solidifiqui perquè prengui la forma del motlle. @ca
definition: Relateert een actor aan een manifestatie die met zich meebrengt een verantwoordelijkheid van een actor voor het gieten van een vloeistof of gesmolten substantie in een mal en het laten stollen om de vorm van de mal aan te laten nemen. @nl

litografi (toimija) manifestaatiossa
has element type: 2
instruction number: 18.5
toolkit definition: A manifestation that involves a responsibility of an agent for preparing a stone or plate for lithographic printing. @en
toolkit definition: Een manifestatie die met zich meebrengt een verantwoordelijkheid van een actor voor het prepareren van een steen of plaat voor lithografisch drukken. @nl
toolkit definition: Egy megjelenési forma, amelyhez hozzátartozik egy ágens felelőssége egy kő vagy lemez litográfiai nyomtatáshoz történő előkészítéséért. @hu
toolkit definition: Eine Manifestation, bei der ein Akteur für die Vorbereitung eines Steins oder einer Platte für lithografischen Druck verantwortlich ist. @de
toolkit definition: En manifestasjon som involverer ansvar for en agent i form av å klargjøre en stein eller plate for litografisk trykk. @no
toolkit definition: Kehastus, mis sisaldab tegija vastutust kivi või plaadi litograafiliste tõmmiste jaoks ettevalmistamise eest. @et
toolkit definition: Litografik baskı için bir taş veya plaka hazırlamakla görevli temsilcinin sorumluluğunu içeren bir gösterim. @tr
toolkit definition: Manifestaatio, jossa toimija on vastuussa litografiassa käytetyn kivilaatan tai muun painolaatan valmistamisesta.
toolkit definition: Manifestació que implica una responsabilitat d’un agent en la preparació d’una pedra o una planxa per a la impressió litogràfica. @ca
toolkit definition: Manifestation qui comporte une responsabilité de la part d’un agent consistant à préparer une pierre ou une plaque pour l’impression lithographique. @fr
toolkit definition: Manifestation, som involverer en agents ansvar for at klargøre en sten eller plade til litografisk trykning. @da
toolkit definition: Manifestazione che implica la responsabilità di un agente nel preparare una pietra o lastra per la stampa litografica. @it
toolkit definition: Manifestācija, kas ietver aģenta atbildību par akmens vai iespiedplates sagatavošanu drukāšanai litogrāfijas tehnikā. @lv
toolkit definition: Μια εκδήλωση που κατασκευάζεται από έναν φορέα υπεύθυνο για την προετοιμασία ενός λίθου ή πλάκας για λιθογραφική εκτύπωση, περιλαμβανομένου ενός γραφίστα ο οποίος δημιουργεί κατευθείαν πάνω στην επιφάνεια ένα σχέδιο από το οποίο θα γίνει η εκτύπωση. @el
toolkit definition: تجسيدة تنطوي على مسئولية وكيل عن تجهيز حجر أو لوح للطباعة الحجرية. @ar
toolkit definition: 涉及制作用于平版印刷的石头或平版的一个行为者的责任的一种载体表现 @zh-hans
toolkit label: Akteur als Lithografin/Lithograf von @de
toolkit label: Taş basmacı temsilcisi @tr
toolkit label: agent lithographe de @fr
toolkit label: agent litògraf de @ca
toolkit label: agent, som er litograf af @da
toolkit label: ir litogrāfs (aģents) @lv
toolkit label: kőnyomatkészítő ágense: @hu
toolkit label: lithograaf-actor van @nl
toolkit label: lithographer agent of @en
toolkit label: litograaf (tegija) kehastuses @et
toolkit label: litograf av (agent) @no
toolkit label: litografi (toimija) manifestaatiossa
toolkit label: litografo agente di @it
toolkit label: λιθογράφος φορέας του @el
toolkit label: وكيل طبَّاع على احجر @ar
toolkit label: ……的平版制作者行为者 @zh-hans
has subproperty: litografi (henkilö) manifestaatiossa
has subproperty: litografi (yhteistoimija) manifestaatiossa
has subproperty: P50175
lexical alias: lithographerAgentOf.en
status: Published
type: Property
domain: C10002
label: er agent, som er litograf af @da
label: er litograf av (agent) @no
label: est un agent lithographe de @fr
label: ir litogrāfs (aģents) @lv
label: is lithograaf-actor van @nl
label: is lithographer agent of @en
label: ist Akteur als Lithografin/Lithograf von @de
label: kőnyomatkészítő ágense a következőnek: @hu
label: litograaf (tegija) kehastuses @et
label: taş baskı sanatçısı temsilcisidir @tr
label: è litografo agente di @it
label: és agent litògraf de @ca
label: είναι λιθογράφος φορέας του @el
label: هو وكيل طبّاع على حجر لـ @ar
label: 是……的平版制作者行为者 @zh-hans
sub property of: kuvalaatan valmistaja (toimija) manifestaatiossa
alternative label: A litográfus egy grafikusművész, aki közvetlenül azon a felületen készít tervet, amelyről a nyomtatás történik. @hu
alternative label: Lithograf von @de
alternative label: lithographe de @fr
alternative label: lithographer of @en
alternative label: litograaf kehastuses @et
alternative label: litograf af @da
alternative label: litograf av @no
alternative label: litografina painotuotteessa
alternative label: litografo di @it
alternative label: litògraf de @ca
alternative label: litógrafo de @es
alternative label: taş basmacı @tr
alternative label: λιθογράφος του @el
alternative label: طبّاع على الحجر @ar
alternative label: ……的平版制作者 @zh-hans
definition: Bir temsilciyi, taş baskı için bir taş veya plaka hazırlamakla görevli bir temsilcinin sorumluluğunu içeren bir gösterimle ilişkilendirir. @tr
definition: Correla un agente a una manifestazione che implica la responsabilità di un agente nel preparare una pietra o lastra per la stampa litografica. @it
definition: Hozzákapcsol egy ágenst egy megjelenési formához, amelyhez hozzátartozik egy ágens felelőssége egy kő vagy lemez litográfiai nyomtatáshoz történő előkészítéséért. @hu
definition: Liittää toimijan manifestaatioon, jossa toimija on vastuussa litografiassa käytetyn kivilaatan tai muun painolaatan valmistamisesta.
definition: Met un agent en relation avec une manifestation qui comporte une responsabilité de la part d’un agent consistant à préparer une pierre ou une plaque pour l’impression lithographique. @fr
definition: Relaciona un agent amb una manifestació que implica una responsabilitat d’un agent en la preparació d’una pedra o una planxa per a la impressió litogràfica. @ca
definition: Relateert een actor aan een manifestatie die met zich meebrengt een verantwoordelijkheid van een actor voor het prepareren van een steen of plaat voor lithografisch drukken. @nl

painolaatan valmistaja (toimittaja) manifestaatiossa
has element type: 2
instruction number: 18.5
toolkit definition: A manifestation that involves a responsibility of an agent for preparing plates used in the making of printed images or text. @en
toolkit definition: Basılı resimler veya metin yapmada kullanılan plakaları hazırlamakla görevli temsilcinin sorumluluğunu içeren bir gösterim. @tr
toolkit definition: Een manifestatie die met zich meebrengt een verantwoordelijkheid van een actor voor het prepareren van platen gebruikt in de productie van gedrukte beelden of tekst. @nl
toolkit definition: Egy megjelenési forma, amelyhez hozzátartozik egy ágens felelőssége nyomólemezek előkészítéséért nyomtatott képek vagy szövegek előállításához. @hu
toolkit definition: Eine Manifestation, bei der ein Akteur für die Anfertigung von Druckformen für die Produktion von gedruckten Bildern oder gedrucktem Text verantwortlich ist. @de
toolkit definition: En manifestasjon som involverer ansvar for en agent i form av klargjøring av trykkplater som brukes ved produksjon av trykte bilder eller tekst. @no
toolkit definition: Kehastus, mis sisaldab tegija vastutust piltide või teksti trükkimiseks mõeldud plaatide ettevalmistamise eest. @et
toolkit definition: Manifestaatio, jossa toimija on vastuussa painettujen kuvien tai tekstin tuottamisessa käytettyjen painolaattojen tai -levyjen valmistuksesta.
toolkit definition: Manifestació que implica una responsabilitat d’un agent en la preparació de les planxes usades en l’elaboració d’imatges impreses o text imprès. @ca
toolkit definition: Manifestation qui comporte une responsabilité de la part d’un agent consistant à préparer les planches utilisées pour la réalisation d’images ou de textes imprimés. @fr
toolkit definition: Manifestation, som involverer en agents ansvar for at forberede plader, som anvendes til fremstilling af trykte billeder eller tekst. @da
toolkit definition: Manifestazione che implica la responsabilità di un agente per la preparazione di lastre utilizzate nella produzione di immagini o testi a stampa. @it
toolkit definition: Manifestācija, kas ietver aģenta atbildību par plākšņu sagatavošanu, ko izmanto iespiestu attēlu vai teksta izgatavošanā. @lv
toolkit definition: Μια εκδήλωση που κατασκευάζεται από έναν φορέα υπεύθυνο για την προετοιμασία των πλακών που χρησιμοποιούνται για την παραγωγή έντυπων εικόνων ή κειμένων. @el
toolkit definition: تجسيدة تنطوي على مسئولية وكيل عن إعداد اللوحات المستخدمة في إنتاج الصور المطبوعة أو النص. @ar
toolkit definition: 涉及准备用于制作图像和/或文字印刷平版的一个行为者的责任的一种载体表现 @zh-hans
toolkit label: Akteur als Druckformherstellerin/Druckformhersteller von @de
toolkit label: agent clicheur de @fr
toolkit label: agent gravador de planxes de @ca
toolkit label: agent, som er plademager af @da
toolkit label: ir presformas izgatavotājs (aģents) @lv
toolkit label: nyomólemez-készítő ágense: @hu
toolkit label: painolaatan valmistaja (toimittaja) manifestaatiossa
toolkit label: plaatmaker-actor van @nl
toolkit label: plaka yapıcı temsilcisi @tr
toolkit label: platemaker agent of @en
toolkit label: stampatore di lamiera agente di @it
toolkit label: trykkplatemaker for (agent) @no
toolkit label: trükiplaadi valmistaja (tegija) kehastuses @et
toolkit label: κατασκευαστής εκτυπωτικής πλάκας φορέας του @el
toolkit label: وكيل محضر سطح طباعي @ar
toolkit label: ……的制版者行为者 @zh-hans
has subproperty: painolaatan valmistaja (henkilö) manifestaatiossa
has subproperty: painolaatan valmistaja (yhteistoimija) manifestaatiossa
has subproperty: P50176
lexical alias: platemakerAgentOf.en
status: Published
type: Property
domain: C10002
label: er agent, som er plademager af @da
label: er trykkplatemaker for (agent) @no
label: est un agent clicheur de @fr
label: ir presformas izgatavotājs (aģents) @lv
label: is plaatmaker-actor van @nl
label: is platemaker agent of @en
label: ist Akteur als Druckformherstellerin/Druckformhersteller von @de
label: levhacı temsilcisidir @tr
label: nyomólemez-készítő ágense a következőnek: @hu
label: trükiplaadi valmistaja (tegija) kehastuses @et
label: è stampatore di lamiera agente di @it
label: és agent gravador de planxes de @ca
label: είναι κατασκευαστής εκτυπωτικής πλάκας φορέας του @el
label: هو وكيل مُحضِّر سطح الطباعة @ar
label: 是……的制版者行为者 @zh-hans
sub property of: manifestaation tekijä (toimija) manifestaatiossa
alternative label: Druckformhersteller von @de
alternative label: fabricante de placas de @es
alternative label: gravador de planxes de @ca
alternative label: graveur de planches de @fr
alternative label: nyomólemez-készítője: @hu
alternative label: plademager af @da
alternative label: plaka yapıcı @tr
alternative label: platemaker of @en
alternative label: stampatore di lamiera @it
alternative label: trykkplatemaker for @no
alternative label: trükiplaadi valmistaja kehastuses @et
alternative label: valmistajana painolaatassa
alternative label: κατασκευαστής εκτυπωτικής πλάκας @el
alternative label: مُحضر سطح طباعة @ar
alternative label: ……的制版者 @zh-hans
definition: Bir temsilciyi, basılı resimler veya metin yapmada kullanılan plakaları hazırlamakla görevli temsilcinin sorumluluğunu içeren bir gösterimle ilişkilendirir. @tr
definition: Correla un agente a una manifestazione che implica la responsabilità di un agente per la preparazione di lastre utilizzate nella produzione di immagini o testi a stampa. @it
definition: Hozzákapcsol egy ágenst egy megjelenési formához, amelyhez hozzátartozik egy ágens felelőssége nyomólemezek előkészítéséért nyomtatott képek vagy szövegek előállításához. @hu
definition: Liittää toimijan manifestaatioon, jossa toimija on vastuussa painettujen kuvien tai tekstin tuottamisessa käytettyjen painolaattojen tai -levyjen valmistuksesta.
definition: Met un agent en relation avec une manifestation qui comporte une responsabilité de la part d’un agent consistant à préparer les planches utilisées pour la réalisation d’images ou de textes imprimés. @fr
definition: Relaciona un agent amb una manifestació que implica una responsabilitat d’un agent en la preparació de les planxes usades en l’elaboració d’imatges impreses o text imprès. @ca
definition: Relateert een actor aan een manifestatie die met zich meebrengt een verantwoordelijkheid van een actor voor het prepareren van platen gebruikt in de productie van gedrukte beelden of tekst. @nl

etsaaja (toimija) mainifestaatiossa
has element type: 2
instruction number: 18.5
toolkit definition: A manifestation that involves a responsibility of an agent for subjecting metal, glass, or some other surface used for printing, to acid or another corrosive substance. @en
toolkit definition: Baskı için kullanılan metal, cam veya diğer bazı yüzeyleri asit veya başka bir aşındırıcı maddeye maruz bırakmakla görevli temsilcinin sorumluluğunu içeren bir gösterim. @tr
toolkit definition: Een manifestatie die met zich meebrengt een verantwoordelijkheid van een actor voor het onderwerpen van metaal, glas of een ander oppervlak gebruikt voor drukken, aan zuur of andere bijtende substantie. @nl
toolkit definition: Egy megjelenési forma, amelyhez hozzátartozik egy ágens felelőssége nyomtatáshoz használt fém-, üveg- vagy valamilyen más felület savnak vagy más maró anyagnak történő alávetéséért. @hu
toolkit definition: Eine Manifestation, bei der ein Akteur dafür verantwortlich ist, Metall, Glas oder eine andere Oberfläche, die zum Drucken benutzt wird, mit Säure oder einer anderen ätzenden Substanz zu behandeln. @de
toolkit definition: En manifestasjon som involverer ansvar for en agent i form av å utsette metall, glass eller et annet overflatemateriale som brukes til trykking, for syre eller et annet etsende stoff. @no
toolkit definition: Kehastus, mis sisaldab tegija vastutust trükkimiseks kasutatava metallist, klaasist või muust materjalist pinna töötlemise eest happe või muu söövitava ainega. @et
toolkit definition: Manifestaatio, jossa toimija on vastuussa metallin, lasin tms. pinnan etsaamisesta hapon tai muun syövyttävän aineen avulla.
toolkit definition: Manifestació que implica una responsabilitat d’un agent sotmetent a l’àcid, o a qualsevol altra substància corrosiva, el metall, el vidre o qualsevol altra superfície usada en la impressió. @ca
toolkit definition: Manifestation qui comporte une responsabilité de la part d’un agent consistant à soumettre à l’acide ou à une autre substance corrosive du métal, du verre ou une autre surface utilisée pour l’impression. @fr
toolkit definition: Manifestation, som involverer en agents ansvar for at udsætte metal, glas eller en anden overflade, som anvendes til trykning, for syre eller et andet ætsende stof. @da
toolkit definition: Manifestazione che implica la responsabilità di un agente per l'esposizione di metallo, vetro o altra superficie utilizzata per la stampa, all'acido o altra sostanza corrosiva. @it
toolkit definition: Manifestācija, kas ietver aģenta atbildību par metāla, stikla vai citas virsmas pakļaušanu skābei vai citai kodīgai vielai, kas tikusi izmantota drukāšanai. @lv
toolkit definition: Μια εκδήλωση που κατασκευάζεται από έναν φορέα υπεύθυνο για την υποβολή μετάλλου, γυαλιού ή κάποιας άλλης επιφάνειας που χρησιμοποιείται για εκτύπωση, σε οξύ ή άλλη οξειδωτική ουσία. @el
toolkit definition: تجسيدة تنطوي على مسئولية وكيل عن غمر معدن أو زجاج أو أي سطح آخر يستخدم للطباعة، في حامض، أو في أي مادة أخرى كاوية. @ar
toolkit definition: 涉及使用酸或其他腐蚀性物质施于用来印刷的金属、玻璃或其他表面上的一个行为者的责任的一种载体表现 @zh-hans
toolkit label: Akteur als Radiererin/Radierer von @de
toolkit label: acquafortista agente di @it
toolkit label: agent aiguafortista de @ca
toolkit label: agent aquafortiste de @fr
toolkit label: agent, som er raderer af @da
toolkit label: etcher agent of @en
toolkit label: etsaaja (toimija) mainifestaatiossa
toolkit label: etser av (agent) @no
toolkit label: etser-actor van @nl
toolkit label: ir ofortists (aģents) @lv
toolkit label: karckészítő ágense: @hu
toolkit label: oymacı temsilcisi @tr
toolkit label: söövitaja (tegija) kehastuses @et
toolkit label: οξυγράφος φορέας του @el
toolkit label: وكيل حَفَّارُ بالزِنْكُوغْراف (الكليشيهات) @ar
toolkit label: ……的蚀刻者行为者 @zh-hans
has subproperty: etsaaja (henkilö) manifestaatiossa
has subproperty: etsaaja (yhteistoimija) manifestaatiossa
has subproperty: P50177
lexical alias: etcherAgentOf.en
status: Published
type: Property
domain: C10002
label: er agent, som er raderer af @da
label: er etser av (agent) @no
label: est un agent aquafortiste de @fr
label: ir ofortists (aģents) @lv
label: is etcher agent of @en
label: is etser-actor van @nl
label: ist Akteur als Radiererin/Radierer von @de
label: karckészítő ágense a következőnek: @hu
label: oymacı temsilcisidir @tr
label: söövitaja (tegija) kehastuses @et
label: è acquafortista agente di @it
label: és agent aiguafortista de @ca
label: είναι οξυγράφος φορέας του @el
label: هو وكيل حَفَّارُ بالزِنْكُوغْراف (الكليشيهات) لـ @ar
label: 是……的蚀刻者行为者 @zh-hans
sub property of: kuvalaatan valmistaja (toimija) manifestaatiossa
alternative label: Radierer von @de
alternative label: acquafortista di @it
alternative label: aguafuertista de @es
alternative label: aiguafortista de @ca
alternative label: aquafortiste de @fr
alternative label: etcher of @en
alternative label: etsaajana etsauksessa
alternative label: etser av @no
alternative label: karckészítője: @hu
alternative label: oymacı @tr
alternative label: raderer af @da
alternative label: söövitaja kehastuses @et
alternative label: οξυγράφος του @el
alternative label: حَفَّارُ زِنْكُوغْراف (الكليشيهات) @ar
alternative label: ……的蚀刻者 @zh-hans
definition: Bir temsilciyi, baskı için kullanılan metal, cam veya diğer bazı yüzeyleri asit veya başka bir aşındırıcı maddeye maruz bırakmakla görevli temsilcinin sorumluluğunu içeren bir gösterimle ilişkilendirir. @tr
definition: Correla un agente a una manifestazione che implica la responsabilità di un agente per l'esposizione di metallo, vetro o altra superficie utilizzata per la stampa, all'acido o altra sostanza corrosiva. @it
definition: Hozzákapcsol egy ágenst egy megjelenési formához, amelyhez hozzátartozik egy ágens felelőssége nyomtatáshoz használt fém-, üveg- vagy valamilyen más felület savnak vagy más maró anyagnak történő alávetéséért. @hu
definition: Liittää toimijan manifestaatioon, jossa toimija on vastuussa metallin, lasin tms. pinnan etsaamisesta hapon tai muun syövyttävän aineen avulla.
definition: Met un agent en relation avec une manifestation qui comporte une responsabilité de la part d’un agent consistant à soumettre à l’acide ou à une autre substance corrosive du métal, du verre ou une autre surface utilisée pour l’impression. @fr
definition: Relaciona un agent amb una manifestació que implica una responsabilitat d’un agent sotmetent a l’àcid, o a qualsevol altra substància corrosiva, el metall, el vidre o qualsevol altra superfície usada en la impressió. @ca
definition: Relateert een actor aan een manifestatie die met zich meebrengt een verantwoordelijkheid van een actor voor het onderwerpen van metaal, glas of een ander oppervlak gebruikt voor drukken, aan zuur of andere bijtende substantie. @nl

kollotypian valmistaja (toimija) manifestaatiossa
has element type: 2
instruction number: 18.5
toolkit definition: A manifestation that involves a responsibility of an agent for preparing a hardened film of gelatin or other colloid that has ink-receptive and ink-repellent surfaces and that is used to make prints using a photomechanical process. @en
toolkit definition: Een manifestatie die met zich meebrengt een verantwoordelijkheid van een actor voor het gebruiken van een fotomechanisch proces voor het maken van afdrukken direct vanaf een verharde film van gelatine of ander colloïde dat inktopnemende en inktafstotende oppervlakken heeft. @nl
toolkit definition: Egy megjelenési forma, amelyhez hozzátartozik egy ágens felelőssége nyomtatványok fotómechanikai eljárással történő közvetlen előállításáért, amihez festékfelvevő és festéktaszító felülettel rendelkező zselatin vagy más kolloid megkeményedett filmjét használja. @hu
toolkit definition: Eine Manifestation, bei der ein Akteur für die Verwendung eines fotomechanischen Verfahrens zur Herstellung von Abzügen direkt von einem gehärteten Film aus Gelatine oder einem anderen Kolloid, der druckerfarbenaufnehmende und -abweisende Oberflächen aufweist, verantwortlich ist. @de
toolkit definition: En manifestasjon som involverer ansvar for en agent i form av å bruke en fotomekanisk prosess for å lage kopier direkte fra en stivnet film av gelatin eller et annet kolloid som har overflater som er mottagelige for blekk og motstandige mot blekk. @no
toolkit definition: Kehastus, mis sisaldab tegija vastutust fotomehaanilises protsessis tõmmiste tegemise eest otse želatiini või muu kolloidi tahkunud kihilt, mille pind osalt seob värvainet, osalt ei seo. @et
toolkit definition: Manifestaatio, jonka valmistamisesta toimija on vastuussa tekemällä vedoksia suoraan kovettuneelta gelatiinifilmiltä tai muulta materiaalilta, jossa on mustetta imeviä ja hylkiviä pintoja.
toolkit definition: Manifestació que implica una responsabilitat d’un agent en la preparació d’una pel·lícula endurida de gelatina o d’un altre col·loide que té superfícies que accepten o rebutgen la tinta i que s’usa per fer gravats usant un procés fotomecànic. @ca
toolkit definition: Manifestation qui comporte une responsabilité de la part d’un agent consistant à préparer un film durci de gélatine ou d’un autre colloïde présentant des surfaces réceptives et répulsives à l’encre et servant à réaliser des images imprimées à l’aide d’un procédé photomécanique. @fr
toolkit definition: Manifestation, som involverer en agents ansvar for en fotomekanisk proces, hvorved der laves tryk direkte fra et hærdet gelatinelag eller andet kolloid, som har blækmodtagelige og blækafvisende overflader. @da
toolkit definition: Manifestazione che implica la responsabilità di un agente per l'utilizzo di un processo fotomeccanico per ottenere stampe direttamente da una pellicola indurita di gelatina o altro colloide che abbia superfici recettive e repellenti all'inchiostro. @it
toolkit definition: Manifestācija, kas ietver aģenta atbildību par fotomehānisku procesu, lai izgatavotu izdrukas tieši no plates, kas pārklāta ar gaismjutīga hromželatīna slāni vai citu koloīdu, kuram ir tinti piesaistošas un tinti atgrūdošas virsmas. @lv
toolkit definition: Mürekkep alıcı ve mürekkep tutmayan yüzeylere sahip olan ve bir fotomekanik süreç kullanarak baskı yapmak için kullanılan sertleştirilmiş bir jelatin filmi veya diğer jelleri hazırlamakla görevli temsilcinin sorumluluğunu içeren bir gösterim. @tr
toolkit definition: Μια εκδήλωση που κατασκευάζεται από έναν φορέα υπεύθυνο για τη χρήση μιας φωτομηχανικής διαδικασίας για τη δημιουργία εκτυπώσεων κατευθείαν από ένα σκληρυμένο φιλμ ζελατίνης ή άλλο κολλοειδές, το οποίο έχει μελανο-δεκτικές και μελανο-απωθητικές επιφάνειες. @el
toolkit definition: تجسيدة تنطوي على مسئولية وكيل عن استخدام عمليات ميكانيكية ضوئية لإنتاج المطبوعات مباشرة من فيلم صلد من الجيلاتين أو غيره من المواد الغروية التي تحتوي على أسطح مستقبلة أو طاردة للحبر. @ar
toolkit definition: 涉及利用一面吸墨而另一面不吸墨的明胶或其他硬胶片进行影印的一个行为者的责任的一种载体表现 @zh-hans
toolkit label: Akteur als Lichtdruckerin/Lichtdrucker von @de
toolkit label: agent fototipista de @ca
toolkit label: agent phototypeur de @fr
toolkit label: agent, som er lystrykker af @da
toolkit label: collotipista agente di @it
toolkit label: collotyper agent of @en
toolkit label: fénynyomatkészítő ágense: @hu
toolkit label: ir fotogravieris (aģents) @lv
toolkit label: kollotypian valmistaja (toimija) manifestaatiossa
toolkit label: kollotüübi valmistaja (tegija) kehastuses @et
toolkit label: lichtdrukker-actor van @nl
toolkit label: lystrykker av (agent) @no
toolkit label: taş baskıcı temsilcisi @tr
toolkit label: κατασκευαστής κολλοτυπίας φορέας του @el
toolkit label: وكيل طبّاع صور فوتوغرافية @ar
toolkit label: ……的珂罗版制作者行为者 @zh-hans
has subproperty: kollotypian valmistaja (henkilö) manifestaatiossa
has subproperty: kollotypian valmistaja (yhteistoimija) manifestaatiossa
has subproperty: P50178
lexical alias: collotyperAgentOf.en
status: Published
type: Property
domain: C10002
label: er agent, som er lystrykker af @da
label: er lystrykker av (agent) @no
label: est un agent phototypeur de @fr
label: fénynyomatkészítő ágense a következőnek: @hu
label: ir fotogravieris (aģents) @lv
label: is collotyper agent of @en
label: is lichtdrukker-actor van @nl
label: ist Akteur als Lichtdruckerin/Lichtdrucker von @de
label: kollotüübi valmistaja (tegija) kehastuses @et
label: kolotip baskıcı temsilcisidir @tr
label: è collotipista agente di @it
label: és agent fototipista de @ca
label: είναι κατασκευαστής κολλοτυπίας φορέας του @el
label: هو وكيل طبّاع صور فوتوغرافية @ar
label: 是……的珂罗版制作者行为者 @zh-hans
sub property of: kuvalaatan valmistaja (toimija) manifestaatiossa
alternative label: Lichtdrucker von @de
alternative label: agent collotypiste de @fr
alternative label: collotyper of @en
alternative label: colotipiador de @es
alternative label: fototipista de @ca
alternative label: fototipografo di @it
alternative label: fénynyomatkészítője: @hu
alternative label: kollotüübi valmistaja kehastuses @et
alternative label: lystrykker af @da
alternative label: lystrykker av @no
alternative label: phototypeur de @fr
alternative label: taş baskıcı @tr
alternative label: valmistajana kollotypioinnissa
alternative label: κατασκευαστής κολλοτυπίας του @el
alternative label: طبّاع صور فوتوغرافية لـ @ar
alternative label: ……的珂罗版制作者 @zh-hans
definition: Bir temsilciyi, bir fotomekanik işlem kullanarak baskı yapmak için kullanılan, mürekkep alıcı ve mürekkep itici yüzeylere sahip sertleştirilmiş bir jelatin veya diğer kolloid filmi hazırlamakla görevli bir temsilcinin sorumluluğunu içeren bir gösterimle ilişkilendirir. @tr
definition: Correla un agente a una manifestazione che implica la responsabilità di un agente per l'utilizzo di un processo fotomeccanico per ottenere stampe direttamente da una pellicola indurita di gelatina o altro colloide che abbia superfici recettive e repellenti all'inchiostro. @it
definition: Hozzákapcsol egy ágenst egy megjelenési formához, amelyhez hozzátartozik egy ágens felelőssége nyomtatványok fotómechanikai eljárással történő közvetlen előállításáért, amihez festékfelvevő és festéktaszító felülettel rendelkező zselatin vagy más kolloid megkeményedett filmjét használja. @hu
definition: Liittää toimijan manifestaatioon, jonka valmistamisesta toimija on vastuussa tekemällä vedoksia suoraan kovettuneelta gelatiinifilmiltä tai muulta materiaalilta, jossa on mustetta imeviä ja hylkiviä pintoja.
definition: Met un agent en relation avec une manifestation qui comporte une responsabilité de la part d’un agent consistant à préparer un film durci de gélatine ou d’un autre colloïde présentant des surfaces réceptives et répulsives à l’encre et servant à réaliser des images imprimées à l’aide d’un procédé photomécanique. @fr
definition: Relaciona un agent amb una manifestació que implica una responsabilitat d’un agent en la preparació d’una pel·lícula endurida de gelatina o d’un altre col·loide que té superfícies que accepten o rebutgen la tinta i que s’usa per fer gravats usant un procés fotomecànic. @ca

painaja (toimija) manifestaatiossa
has element type: 2
instruction number: 18.5
toolkit definition: A manifestation that involves a responsibility of an agent for manufacturing a printed manifestation that embodies text, notated music, cartographic content, notated movement, or still image content using a device that transfers ink or a similar medium to a surface. @en
toolkit definition: Daktilo veya plakalardan basılı metin, notalı müzik veya diğer içeriklerin üretilmesiyle görevli temsilcinin sorumluluğunu içeren bir gösterim. @tr
toolkit definition: Een manifestatie die met zich meebrengt een verantwoordelijkheid van een actor voor het vervaardigen van gedrukte tekst, bladmuziek of andere content vanaf zetsel of platen. @nl
toolkit definition: Egy megjelenési forma, amelyhez hozzátartozik egy ágens felelőssége egy nyomtatott szöveg, zenei lejegyzés vagy egyéb tartalom nyomdai szedésből vagy lemezekből történő gyártásáért. @hu
toolkit definition: Eine Manifestation, bei der ein Akteur für die Herstellung von gedrucktem Text, Noten oder anderem Inhalt durch Drucktypen oder Druckformen verantwortlich ist. @de
toolkit definition: En manifestasjon som involverer ansvar for en agent i form av framstilling av trykt tekst, nedskrevet musikk eller annet innhold fra typer eller plater. @no
toolkit definition: Kehastus, mis sisaldab tegija vastutust trükilaolt või -plaadilt teksti, nootide vm sisu trükkimise eest. @et
toolkit definition: Manifestaatio, jossa toimija on vastuussa painolaatalta tai -levyltä painetun tekstin, nuottiaineiston tai muun sisällön valmistamisesta.
toolkit definition: Manifestació que implica una responsabilitat d’un agent en la fabricació d’una manifestació impresa que materialitza text, música notada, contingut cartogràfic, moviment notat o contingut d’imatge fixa usant un mecanisme que transfereix tinta o un mitjà similar a una superfície. @ca
toolkit definition: Manifestation qui comporte une responsabilité de la part d’un agent consistant à fabriquer une manifestation imprimée matérialisant du texte, de la musique notée, un contenu cartographique, du mouvement noté ou un contenu visuel fixe à l’aide d’un dispositif qui transfère de l’encre ou un médium semblable sur une surface. @fr
toolkit definition: Manifestation, som involverer en agents ansvar for fremstillingen af trykt tekst, noteret musik etc. fra typer eller plader. @da
toolkit definition: Manifestazione che implica la responsabilità di un agente per la produzione di testo, musica notata o altro contenuto a stampa a partire da caratteri o lastre. @it
toolkit definition: Manifestācija, kas ietver aģenta atbildību par iespiesta teksta, nošu vai cita veida satura izgatavošanu no burtu salikuma vai plāksnēm. @lv
toolkit definition: Μια εκδήλωση έντυπου κειμένου, μουσικής σημειογραφίας κ.λπ. που κατασκευάζεται από έναν φορέα υπεύθυνο μέσω τυπογραφικών στοιχείων ή πλακών, όπως ένα βιβλίο, εφημερίδα, περιοδικό, αφίσα, παρτιτούρα κ.λπ. @el
toolkit definition: تجسيدة تنطوي على مسئولية وكيل عن إنتاج نص مطبوع أو موسيقى مدونة أو محتوى من نموذج أو من لوحات أخرى. @ar
toolkit definition: 涉及用活字或平版印刷文字、乐谱或其他内容的一个行为者的责任的一种载体表现 @zh-hans
toolkit label: Akteur als Druckerin/Drucker von @de
toolkit label: Yazıcı temsilcisi @tr
toolkit label: agent impressor de @ca
toolkit label: agent imprimeur de @fr
toolkit label: agent, som er trykker af @da
toolkit label: drukker-actor van @nl
toolkit label: ir iespiedējs (aģents) @lv
toolkit label: nyomdász ágense: @hu
toolkit label: painaja (toimija) manifestaatiossa
toolkit label: printer agent of @en
toolkit label: stampatore agente di @it
toolkit label: trykker av (agent) @no
toolkit label: trükkija (tegija) kehastuses @et
toolkit label: τυπογράφος φορέας του @el
toolkit label: وكيل طبَّاع لـ @ar
toolkit label: ……的印刷者行为者 @zh-hans
has subproperty: painaja (henkilö) manifestaatiossa
has subproperty: painaja (yhteistoimija) manifestaatiossa
has subproperty: P50179
lexical alias: printerAgentOf.en
status: Published
type: Property
domain: C10002
label: er agent, som er trykker af @da
label: er trykker av (agent) @no
label: est un agent imprimeur de @fr
label: ir iespiedējs (aģents) @lv
label: is drukker-actor van @nl
label: is printer agent of @en
label: ist Akteur als Druckerin/Drucker von @de
label: matbaacı temsilcisidir @tr
label: nyomdász ágense a következőnek: @hu
label: trükkija (tegija) kehastuses @et
label: è stampatore agente di @it
label: és agent impressor de @ca
label: είναι τυπογράφος φορέας του @el
label: وكيل فني طباعة @ar
label: 是……的印刷者行为者 @zh-hans
sub property of: valmistaja (toimija) manifestaatiossa
alternative label: Drucker von @de
alternative label: Yazıcı @tr
alternative label: impresor de @es
alternative label: impressor de @ca
alternative label: imprimeur de @fr
alternative label: nyomdásza: @hu
alternative label: painajana painotuotteessa
alternative label: printer of @en
alternative label: stampatore di @it
alternative label: trykker af @da
alternative label: trykker av @no
alternative label: trükikoda kehastuses @et
alternative label: trükkal kehastuses @et
alternative label: trükkija kehastuses @et
alternative label: τυπογράφος του @el
alternative label: فني طباعة @ar
alternative label: ……的印刷者 @zh-hans
definition: Bir temsilciyi, yazı veya plakalardan basılı metin, notalı müzik veya diğer içeriklerin üretilmesiyle görevli temsilcinin sorumluluğunu içeren bir göstermile ilişkilendirir. @tr
definition: Correla un agente a una manifestazione che implica la responsabilità di un agente per la produzione di testo, musica notata o altro contenuto a stampa a partire da caratteri o lastre. @it
definition: Hozzákapcsol egy ágenst egy megjelenési formához, amelyhez hozzátartozik egy ágens felelőssége egy nyomtatott szöveg, zenei lejegyzés vagy egyéb tartalom nyomdai szedésből vagy lemezekből történő gyártásáért. @hu
definition: Liittää toimijan manifestaatioon, jossa toimija on vastuussa painolaatalta tai -levyltä painetun tekstin, nuottiaineiston tai muun sisällön valmistamisesta.
definition: Met un agent en relation avec une manifestation qui comporte une responsabilité de la part d’un agent consistant à fabriquer une manifestation imprimée matérialisant du texte, de la musique notée, un contenu cartographique, du mouvement noté ou un contenu visuel fixe à l’aide d’un dispositif qui transfère de l’encre ou un médium semblable sur une surface. @fr

esittämisestä vastaava toimija ekspressiossa
has element type: 2
instruction number: 18.5
toolkit definition: An expression that is embodied in a manifestation that includes a statement of an "X presents:" credit for an agent who is probably associated with production, finance, or distribution of an expression of a moving image work in some way. @en
toolkit definition: Bir hareketli bir görüntünün üretimi, finansmanı veya dağıtımıyla bir şekilde bağlantılı olan bir temsilciye yönlendirme yapan "X sunar:" açıklamasını içeren bir gösterimde somutlaşan bir anlatım. @tr
toolkit definition: Een expressie die is verwezenlijkt in een manifestatie dat omvat een vermelding van een "X presenteert:" creditatie voor een actor die waarschijnlijk op één of andere manier geassocieerd is met productie, financiën of distributie van een expressie van een bewegend beeldwerk. @nl
toolkit definition: Egy megjelenési formában megtestesülő kifejezési forma, amelynek „az X bemutatja:” stáblistaeleme arra az ágensre vonatkozik, amely valószínűleg valamilyen módon egy mozgóképmű kifejezési formájának előállításához, finanszírozásához vagy terjesztéséhez kapcsolódik. @hu
toolkit definition: Eine Expression, die in einer Manifestation verkörpert ist, die die Angabe X präsentiert: für einen Akteur enthält, der wahrscheinlich irgendwie mit der Produktion, Finanzierung oder dem Vertrieb einer Expression eines Bewegtbildwerks in Verbindung steht. @de
toolkit definition: Ekspressio, joka sisältyy manifestaatioon, jonka alku- tai lopputekstit sisältävät merkinnän "X esittää:" toimijasta, joka liittyy todennäköisesti liikkuvan kuvan teoksen ekspression tuotantoon, rahoitukseen tai jakeluun jollakin tavoin.
toolkit definition: Espressione con un riconoscimento "X presenta" in una manifestazione di un'immagine in movimento per un agente che è probabilmente associato in qualche modo alla produzione, finanziamento o distribuzione. @it
toolkit definition: Et uttrykk med en kreditering av typen "X presenterer" i en manifestasjon i form av levende bilder for en agent som sannsynligvis er involvert i produksjon, finansiering eller distribusjon på noe vis. @no
toolkit definition: Expression qui est matérialisée dans une manifestation dont le générique inclut, sous la forme « X présente », un agent qui est probablement associé d’une façon quelconque à la production, au financement ou à la distribution d’une expression d’une œuvre d’images animées. @fr
toolkit definition: Expressió que es materialitza en una manifestació que inclou una menció de crèdits en una forma "X presenta:" per a un agent que està probablement associat d’alguna manera amb la producció, el finançament o la distribució d’una expressió d’una obra d’imatge en moviment. @ca
toolkit definition: Izteiksme ar fāzi titros “X piedāvā”: aģenta manifestāciju kustīgu attēlu materiāliem un kurš, iespējams, ir saistīts ar izgatavošanu, finansēm vai izplatīšanu. @lv
toolkit definition: Udtryk, der er indeholdt i en manifestation, der inkluderer ophavsangivelsen: "X præsenterer:" for en agent, som sandsynligvis er knyttet til produktion, finansiering eller distribution af et udtryk af et levende billedværk på en eller anden måde. @da
toolkit definition: Väljendus, mille teostamisel osalenud tegijat on nimetatud filmi kehastuse tiitrites vormis "X esitleb". Tegija on tõenäoliselt mingil viisil seotud filmi tootmise, rahastamise või levitamisega. @et
toolkit definition: Μια εκδήλωση για υλικό κινητής εικόνας που αναφέρεται σε ένα "X presents:" παρέχει αναγνώριση για έναν φορέα, ο οποίος πιθανόν να συνδέεται με κάποιον τρόπο με την παραγωγή, τη χρηματοδότηση ή τη διανομή. @el
toolkit definition: يربط وكيلا بتعبيرة ذات اعتمادات "X presents:& quot&؛ في تجسيدة لصور متحركة لوكيل قد يكون مرتبطا بطريقة ما بالإنتاج أو التمويل أو التوزيع. @ar
toolkit definition: 被具体化在一种载体表现（包括一个动态图像作品的一种内容表达的摄制人员名单中以“某某 出品”（X presents）的方式被提及的且与该片的制作、财务或发行等有某些联系的一个行为者）中的一种内容表达 @zh-hans
toolkit label: Akteur als Präsentatorin/Präsentator von @de
toolkit label: agent presentador de @ca
toolkit label: agent présentateur de @fr
toolkit label: agent, som er præsentator af @da
toolkit label: bemutató ágense: @hu
toolkit label: esitleja (tegija) väljenduses @et
toolkit label: esittämisestä vastaava toimija ekspressiossa
toolkit label: ir piedāvātājs (aģents) @lv
toolkit label: presentatore agente di @it
toolkit label: presenter agent of @en
toolkit label: presenterende actor van @nl
toolkit label: programleder for (agent) @no
toolkit label: sunucu temsilcisi @tr
toolkit label: παρουσιαστής φορέας του @el
toolkit label: وكيل مُقدم @ar
toolkit label: ……的出品人行为者 @zh-hans
has subproperty: esittämisestä vastaava henkilö ekspressiossa
has subproperty: esittämisestä vastaava yhteistoimija ekspressiossa
has subproperty: P50180
lexical alias: presenterAgentOf.en
status: Published
type: Property
domain: C10002
label: bemutató ágense a következőnek: @hu
label: er agent, som er præsentator af @da
label: er programleder for (agent) @no
label: esitleja (tegija) väljenduses @et
label: est un agent présentateur de @fr
label: ir piedāvātājs (aģents) @lv
label: is presenter agent of @en
label: is presenterende actor van @nl
label: ist Akteur als Präsentatorin/Präsentator von @de
label: sunucu temsilcisidir @tr
label: è agente presentatore di @it
label: és agent presentador de @ca
label: είναι παρουσιαστής φορέας του @el
label: هو وكيل مقدم لـ @ar
label: 是……的出品人行为者 @zh-hans
sub property of: ekspression tekijä (toimija) ekspressiossa
alternative label: Präsentator von @de
alternative label: bemutatója: @hu
alternative label: esitleja väljenduses @et
alternative label: esittämisestä vastaavana elokuvaproduktiossa
alternative label: presentador de @ca
alternative label: presentatore di @it
alternative label: presenter of @en
alternative label: programleder for @no
alternative label: programvært af @da
alternative label: présentateur de @fr
alternative label: sunucu @tr
alternative label: παρουσιαστής του @el
alternative label: مقدم @ar
alternative label: ……的出品人 @zh-hans
definition: Bir temsilciyi, muhtemelen bir şekilde bir anlatımın yapım, finans veya dağıtımla bağlantılı olan bir temsilci için hareketli bir görüntü kaynağında "X sunar" atfına sahip bir bildirim içeren bir gösterimde somutlaştırılan bir anlatımla ilişkilendirir. @tr
definition: Correla un agente a un'espressione con un riconoscimento "X presenta" in una manifestazione di un'immagine in movimento per un agente che è probabilmente associato in qualche modo alla produzione, finanziamento o distribuzione. @it
definition: Hozzákapcsol egy ágenst egy megjelenési formában megtestesülő kifejezési formához, amelynek „az X bemutatja:” stáblistaeleme arra az ágensre vonatkozik, amely valószínűleg valamilyen módon egy mozgóképmű kifejezési formájának előállításához, finanszírozásához vagy terjesztéséhez kapcsolódik. @hu
definition: Liittää toimijan ekspressioon, joka sisältyy manifestaatioon, jonka alku- tai lopputekstit sisältävät merkinnän "X esittää:" toimijasta, joka liittyy todennäköisesti liikkuvan kuvan teoksen ekspression tuotantoon, rahoitukseen tai jakeluun jollakin tavoin.
definition: Met un agent en relation avec une expression qui est matérialisée dans une manifestation dont le générique inclut, sous la forme « X présente », un agent qui est probablement associé d’une façon quelconque à la production, au financement ou à la distribution d’une expression d’une œuvre d’images animées. @fr
definition: Relaciona un agent amb una expressió que es materialitza en una manifestació que inclou una menció de crèdits en una forma "X presenta:" per a un agent que està probablement associat d’alguna manera amb la producció, el finançament o la distribució d’una expressió d’una obra d’imatge en moviment. @ca
definition: Relateert een actor aan een expressie die is verwezenlijkt in een manifestatie dat omvat een vermelding van een "X presenteert:" creditatie voor een actor die waarschijnlijk op één of andere manier geassocieerd is met productie, financiën of distributie van een expressie van een bewegend beeldwerk. @nl
definition: Relaterer en agent til et udtryk, der er indeholdt i en manifestation, der inkluderer ophavsangivelsen: "X præsenterer:" for en agent, som sandsynligvis er knyttet til produktion, finansiering eller distribution af et udtryk af et levende billedværk på en eller anden måde. @da

muuna toimijana manifestaatiossa
has element type: 3
toolkit definition: A manifestation that involves a responsibility other than producing, publishing, distributing, or manufacturing. (Deprecated) @en
toolkit definition: Egy ágenssel (személlyel, családdal vagy testülettel) kapcsolatos megjelenési forma, aki nem producer, kiadó, terjesztő vagy gyártó. @hu
toolkit definition: Eine Manifestation, bei der ein Akteur, außer ein Erzeuger, ein Verleger, ein Vertrieb oder ein Hersteller, mit einer Manifestation in Verbindung steht. @de
toolkit definition: En manifestasjon som forbindes med en agent som ikke er produsent, utgiver, distributør eller tilvirker. @no
toolkit definition: Manifestaatio, johon liittyvä toimija on muussa kuin kustantajan, jakajan tai valmistajan roolissa.
toolkit definition: Manifestació associada amb un agent diferent d’un productor, un editor, un distribuïdor o un fabricant. @ca
toolkit definition: Manifestation associée à un agent autre qu’un producteur, un éditeur, un diffuseur ou distributeur ou bien un fabricant. @fr
toolkit definition: Manifestation, der er knyttet til en agent, bortset fra producer, udgiver, distributør, eller producent. @da
toolkit definition: Μια εκδήλωση που συνδέεται με έναν φορέα άλλον από τον παραγωγό, εκδότη, διαθέτη ή κατασκευαστή. @el
toolkit label: Sonstiger Akteur, der mit einer Manifestation in Verbindung steht von @de
toolkit label: altre agent associat amb una manifestació de @ca
toolkit label: anden agent, der er knyttet til manifestation af @da
toolkit label: annen agent som forbindes med manifestasjon av @no
toolkit label: autre agent associé à une manifestation de @fr
toolkit label: megjelenési formájához kötődő másik ágens @hu
toolkit label: muuna toimijana manifestaatiossa
toolkit label: other agent associated with manifestation of (Deprecated) @en
toolkit label: άλλος φορέας συνδεδεμένος με μια εκδήλωση του @el
has subproperty: P50181
lexical alias: otherAgentManifestationOf.en
status: Deprecated
type: Property
domain: C10002
label: er anden agent, der er knyttet til manifestation af @da
label: est un autre agent associé à une manifestation de @fr
label: is other agent associated with manifestation of (Deprecated) @en
label: ist sonstiger Akteur, der mit einer Manifestation in Verbindung steht von @de
label: megjelenési formájához kötődő másik ágens @hu
label: és altre agent associat amb una manifestació de @ca
label: είναι άλλος φορέας συνδεδεμένος με την εκδήλωση του @el
sub property of: toimijaan liittyvä manifestaatio
definition: Egy ágenst (személyt, családot vagy testületet), aki/amely nem mint producer, kiadó, terjesztő vagy gyártó, összeköttetésben áll egy megjelenési formával, hozzákapcsol egy megjelenési formához. @hu
definition: Liittää toimijan manifestaatioon, johon liittyvä toimija on muussa kuin kustantajan, jakajan tai valmistajan roolissa.
definition: Met un agent, autre qu’un producteur, un éditeur, un diffuseur ou distributeur ou bien un fabricant, associé à une manifestation en relation avec une manifestation. @fr
definition: Relaciona un agent, diferent d’un productor, un editor, un distribuïdor o un fabricant associat amb una manifestació, amb una manifestació. @ca
definition: Relaterer en agent, bortset fra en producer, udgiver, distributør, eller producent, der er knyttet til en manifestation til en manifestation. @da
definition: Relates an agent to a manifestation that involves a responsibility other than producing, publishing, distributing, or manufacturing. (Deprecated) @en
definition: Setzt einen Akteur, außer einen Erzeuger, Verleger, Vertrieb oder Hersteller, der mit einer Manifestation in Verbindung steht, mit einer Manifestation in Beziehung. @de
definition: Συνδέει έναν φορέα, άλλον από τον παραγωγό, τον εκδότη, τον διαθέτη ή τον κατασκευαστή που συνδέεται με την εκδήλωση, με μια εκδήλωση. @el
scope note: Bogdesignere, plademagere, etc. er omfattet. @da
scope note: Book designers, platemakers, etc., are included. (Deprecated) @en
scope note: Dazu gehören Buchgestalter, Druckformenhersteller usw. @de
scope note: Könyvtervezők, lemezkészítők stb. beletartoznak. @hu
scope note: Muita manifestaatioon liittyviä toimijoita ovat kirjan ulkoasun suunnittelijat, painolaattojen valmistajat tms.
scope note: Sont inclus les graphistes, les graveurs de planches, etc. @fr
scope note: Περιλαμβάνονται σχεδιαστές βιβλίου, κατασκευαστές μήτρας κ.λπ. @el

muuna toimijana kappaleessa
has element type: 3
toolkit definition: An item that involves a responsibility other than owning or having custody. (Deprecated) @en
toolkit definition: Egy ágenssel (személlyel, családdal vagy testülettel) kapcsolatos példány, aki nem tulajdonos vagy gondnok. @hu
toolkit definition: Ein Exemplar, mit dem ein Akteur in Verbindung steht, aber dessen Eigentümer oder Verwahrer er nicht ist. @de
toolkit definition: Eksemplar der er knyttet til en agent, bortset fra en ejer eller forvalter. @da
toolkit definition: Et eksemplar som forbindes med en agent som ikke er en eier eller oppbevarer. @no
toolkit definition: Item associé à un agent autre qu’un propriétaire ou un dépositaire. @fr
toolkit definition: Kappale, johon liittyvä toimija on muussa kuin omistajan tai säilyttäjän roolissa.
toolkit definition: Ítem associat amb un agent diferent d’un propietari o un dipositari. @ca
toolkit definition: Ένα αντίτυπο που συνδέεται με έναν φορέα, ο οποίος διαφέρει από τον ιδιοκτήτη ή θεματοφύλακα. @el
toolkit label: Sonstiger Akteur, der mit einem Exemplar in Verbindung steht von @de
toolkit label: altre agent associat amb un ítem de @ca
toolkit label: anden agent, der er knyttet til eksemplar af @da
toolkit label: annen agent som forbindes med eksemplar av @no
toolkit label: autre agent associé à un item de @fr
toolkit label: muuna toimijana kappaleessa
toolkit label: other agent associated with item of (Deprecated) @en
toolkit label: példányához kötődő másik ágens @hu
toolkit label: άλλος φορέας συνδεδεμένος με ένα αντίτυπό του @el
has subproperty: P50182
lexical alias: otherAgentItemOf.en
status: Deprecated
type: Property
domain: C10002
label: er anden agent, der er knyttet til eksemplar af @da
label: est un autre agent associé à un item de @fr
label: is other agent associated with item of (Deprecated) @en
label: ist sonstiger Akteur, der mit einem Exemplar in Verbindung steht von @de
label: példányához kötődő másik ágens @hu
label: és altre agent associat amb un ítem de @ca
label: είναι άλλος φορέας συνδεδεμένος με το αντίτυπο του @el
sub property of: toimijaan liittyvä kappale
definition: Egy ágenst (személyt, családot vagy testületet), aki/amely nem mint tulajdonos vagy letétkezelő gondnok, összeköttetésben áll egy példánnyal, hozzákapcsol egy példányhoz. @hu
definition: Liittää toimijan kappaleeseen, johon liittyvä on muussa kuin omistajan tai säilyttäjän roolissa
definition: Met un agent, autre qu’un propriétaire ou un dépositaire, associé à un item en relation avec un item. @fr
definition: Relaciona un agent, diferent d’un propietari o un dipositari associat amb un ítem, amb un ítem. @ca
definition: Relaterer en agent, bortset fra en ejere eller forvalter, der er knyttet til et eksemplar til et eksemplar. @da
definition: Relates an agent to an item that involves a responsibility other than owning or having custody. (Deprecated) @en
definition: Setzt einen Akteur, der mit einem Exemplar in Verbindung steht, aber nicht der Eigentümer oder der Verwahrer ist, mit einem Exemplar in Beziehung. @de
definition: Συνδέει έναν φορέα, άλλον από τον ιδιοκτήτη ή επιστάτη ή φύλακα που συνδέεται με ένα αντίτυπο. με ένα αντίτυπο. @el
scope note: Curators, binders, restorationists, etc., are included. (Deprecated) @en
scope note: Dazu gehören Kuratoren, Buchbinder, Restauratoren usw. @de
scope note: Kuratorer, indbindere, restauratører, etc. er omfattet. @da
scope note: Kurátorok, kötők, resaturátorok stb. beletartoznak. @hu
scope note: Myös kuraattorit, kirjansitojat, restauroijat jne.
scope note: Sont inclus les conservateurs, les relieurs, les restaurateurs, etc. @fr
scope note: Περιλαμβάνονται έφοροι, φύλακες, βιβλιοδέτες, συντηρητές κ.λπ. @el

leikkaaja (toimija) ekspressiossa
has element type: 2
instruction number: 18.5
toolkit definition: An expression that includes a contribution by an agent of assembling, arranging, and trimming film, video, or other moving image formats, including both visual and audio aspects. @en
toolkit definition: Een expressie die omvat een bijdrage door een actor door samenstellen, arrangeren en couperen van film, video of andere bewegend beeld-vormen, inclusief zowel visuele als geluidaspecten. @nl
toolkit definition: Egy kifejezési forma, amely magában foglal film, videó vagy más mozgóképformátum összeállításával, elrendezésével és vágásával járó közreműködést, beleértve mind a vizuális, mind az audió szempontokat. @hu
toolkit definition: Eine Expression, zu der ein Akteur beiträgt, indem er für das Zusammensetzen, Arrangieren und Nachschneiden von Film-, Video- oder anderen Bewegtbildformaten zuständig ist. Darunter fallen Video- und Audio-Eigenschaften. @de
toolkit definition: Ekspressio, jonka tekemiseen toimija osallistuu elokuvan, videon tai muiden elokuvaformaattien kokoamisessa, järjestämisessä ja leikkauksessa sekä kuvan että äänen osalta.
toolkit definition: Espressione che comprende contributo da parte di un agente per l'assemblaggio, organizzazione e taglio di film, video o altri formati di immagini in movimento, inclusi gli aspetti sia visivi sia audio. @it
toolkit definition: Et uttrykk som inkluderer et bidrag fra en agent i form av å sette sammen, arrangere og klippe film, video eller andre formater for levende bilder, inkludert både bilde- og lydaspekter. @no
toolkit definition: Expression qui intègre une contribution de la part d’un agent consistant à assembler, à agencer et à découper du film, de la vidéo ou d’autres formats d’images animées, y compris les aspects visuels et sonores. @fr
toolkit definition: Expressió que inclou una contribució d’un agent aplegant, arranjant i retallant pel·lícules, vídeos o altres formats d’imatge en moviment, inclosos tant els aspectes visuals com els d’àudio. @ca
toolkit definition: Film, video veya diğer hareketli görüntü formatlarının montajı, düzenlenmesi ve kırpılmasından oluşan, hem görsel hem de işitsel yönleri içeren bir temsilcinin katkısını içeren bir anlatım. @tr
toolkit definition: Izteiksme, kas ietver aģenta ieguldījumu, montējot, pārkārtojot un saīsinot filmas, video vai citu kustīga attēla formātu, ietverot gan vizuālos, gan audio aspektus. @lv
toolkit definition: Udtryk, som omfatter en agents bidrag ved at sammensætte, arrangere og klippe film, video eller andre levende billedformater, inkl. både visuelle og lydmæssige aspekter. @da
toolkit definition: Väljendus, millesse tegija on andnud panuse, monteerides, järjestades ja lõigates filmist, videost jm liikuvast pildist koosnevaid formaate, hõlmates nii visuaalseid kui ka heli aspekte. @et
toolkit definition: Μια έκφραση που ενσωματώνει τη συνεισφορά της συλλογής, επιλογής, οργάνωσης και προετοιμασίας φιλμ, βίντεο ή άλλων μορφότυπων κινητής εικόνας, περιλαμβανομένων οπτικών και ακουστικών πτυχών. @el
toolkit definition: تعبيرة تتضمن إسهام وكيل في تجميع فيلم، أو فيديو أو شكل آخر من أشكال الصور المتحركة وترتيبها واقتطاعها، بما في ذلك الجوانب المرئية والمسموعة. @ar
toolkit definition: 包括对影片、视频或其他动态图像格式（包括视频和音频方面）的汇编、编排和剪辑的一个行为者的贡献的一种内容表达 @zh-hans
toolkit label: Akteur als Filmeditorin/Filmeditor von @de
toolkit label: agent editor d’una obra d’imatge en moviment de @ca
toolkit label: agent monteur d’une œuvre d’images animées de @fr
toolkit label: agent, som er klipper af levende billedværk af @da
toolkit label: editor agent of moving image work of @en
toolkit label: editore agente di opera cinematografica di @it
toolkit label: filmeditor-actor van bewegend beeldwerk van @nl
toolkit label: filmiteose monteerija (tegija) väljenduses @et
toolkit label: hareketli görüntü eserinin editör temsilcisi @tr
toolkit label: ir filmas montāžas redaktors (aģents) @lv
toolkit label: leikkaaja (toimija) ekspressiossa
toolkit label: redigerer av verk i form av levende bilder (agent) @no
toolkit label: vágó ágense a következő mozgóképműnek: @hu
toolkit label: επιμελητής φορέας του έργου κινητής εικόνας του @el
toolkit label: وكيل محرر لعمل صور متحركة @ar
toolkit label: ……的动态图像作品的剪辑师行为者 @zh-hans
has subproperty: leikkaaja (henkilö) ekspressiossa
has subproperty: leikkaaja (yhteistoimija) ekspressiossa
has subproperty: P50183
lexical alias: editorAgentOfMovingImageWorkOf.en
status: Published
type: Property
domain: C10002
label: er agent, som er klipper af levende billedværk af @da
label: er redigerer av verk i form av levende bilder (agent) @no
label: est un agent monteur d’une œuvre d’images animées de @fr
label: filmiteose monteerija (tegija) väljenduses @et
label: hareketli görüntü eserinin editör temsilcisidir @tr
label: ir filmas montāžas redaktors (aģents) @lv
label: is editor agent of moving image work of @en
label: is filmeditor-actor van bewegend beeldwerk van @nl
label: ist Akteur als Filmeditorin/Filmeditor von @de
label: vágó ágense a következő mozgóképműnek: @hu
label: è editore agente di opera cinematografica di @it
label: és agent editor d’una obra d’imatge en moviment de @ca
label: είναι επιμελητής φορέας του έργου κινητής εικόνας του @el
label: هو وكيل محرر لعمل صور متحركة لـ @ar
label: 是……的动态图像作品的剪辑师行为者 @zh-hans
sub property of: esitykseen osallinen toimija ekspressiossa
alternative label: Filmeditor von @de
alternative label: editor de obra de imágenes en movimiento de @es
alternative label: editor d’una obra d’imatge en moviment de @ca
alternative label: editor of moving image work of @en
alternative label: editore di film opera di @it
alternative label: filmiteose monteerija väljenduses @et
alternative label: hareketli görüntü eserinin editörü @tr
alternative label: klipper af levende billedværk af @da
alternative label: leikkaus
alternative label: monteur d’œuvre d’images animées de @fr
alternative label: redigerer av verk i form av levende bilder @no
alternative label: vágója a következő mozgóképműnek: @hu
alternative label: επιμελητής του έργου κινητής εικόνας του @el
alternative label: محرر لعمل صور متحركة لـ @ar
alternative label: ……动态图像作品的剪辑师 @zh-hans
definition: Bir temsilciyi hem görsel hem de işitsel yönler dahil olmak üzere film, video veya diğer hareketli görüntü formatlarını bir araya getirme, düzenleme ve kısaltma katkısını içeren bir anlatımla ilişkilendirir. @tr
definition: Correla un agente a un'espressione che comprende contributo da parte di un agente per l'assemblaggio, organizzazione e taglio di film, video o altri formati di immagini in movimento, inclusi gli aspetti sia visivi sia audio. @it
definition: Hozzákapcsol egy ágenst egy kifejezési formához, amely magában foglal film, videó vagy más mozgóképformátum összeállításával, elrendezésével és vágásával járó közreműködést, beleértve mind a vizuális, mind az audió szempontokat. @hu
definition: Liittää toimijan ekspressioon, jonka tekemiseen toimija osallistuu elokuvan, videon tai muiden elokuvaformaattien kokoamisessa, järjestämisessä ja leikkauksessa sekä kuvan että äänen osalta.
definition: Met un agent en relation avec une expression qui intègre une contribution de la part d’un agent consistant à assembler, à agencer et à découper du film, de la vidéo ou d’autres formats d’images animées, y compris les aspects visuels et sonores. @fr
definition: Relaciona un agent amb una expressió que inclou una contribució d’un agent aplegant, arranjant i retallant pel·lícules, vídeos o altres formats d’imatge en moviment, inclosos tant els aspectes visuals com els d’àudio. @ca
definition: Relateert een actor aan een expressie die omvat een bijdrage door een actor door samenstellen, arrangeren en couperen van film, video of andere bewegend beeld-vormen, inclusief zowel visuele als geluidaspecten. @nl

ohjelmoija (toimija) teoksessa
has element type: 2
instruction number: 18.5
toolkit definition: A work that involves a responsibility of an agent for creating a computer program. @en
toolkit definition: Bir bilgisayar programı oluşturmak için bir temsilcinin sorumluluğunu içeren bir eser. @tr
toolkit definition: Darbs, kas ietver aģenta atbildību par datorprogrammas izveidi. @lv
toolkit definition: Een werk dat met zich meebrengt een verantwoordelijkheid van een actor voor programmeren voor een computer. @nl
toolkit definition: Egy mű, amelyhez hozzátartozik egy ágens felelőssége számítógépes programozásért. @hu
toolkit definition: Ein Werk, bei dem ein Akteur für die Schaffung eines Computerprogramms verantwortlich ist. @de
toolkit definition: Et verk som involverer ansvar for en agent i form av dataprogrammering. @no
toolkit definition: Obra que implica una responsabilitat d’un agent en la creació d’un programa d’ordinador. @ca
toolkit definition: Opera che implica una responsabilità di un agente per la programmazione informatica. @it
toolkit definition: Teos, jossa toimija on vastuussa tietokoneohjelman luomisesta.
toolkit definition: Teos, mis sisaldab tegija vastutust programmeerimise eest. @et
toolkit definition: Værk, som involverer en agents ansvar for computerprogrammering. @da
toolkit definition: Œuvre qui comporte une responsabilité de la part d’un agent consistant à créer un programme informatique. @fr
toolkit definition: Ένα έργο που περιλαμβάνει την ευθύνη της δημιουργίας ενός προγράμματος υπολογιστή. @el
toolkit definition: عمل يترتب عليه مسئولية وكيل عن البرمجة الحاسبوبية. @ar
toolkit definition: 涉及创建一个计算机程序的一个行为者的责任的一种作品 @zh-hans
toolkit label: Akteur als Programmiererin/Programmierer von @de
toolkit label: agent programador de @ca
toolkit label: agent programmeur de @fr
toolkit label: agent, som er programmør af @da
toolkit label: ir programmētājs (aģents) @lv
toolkit label: ohjelmoija (toimija) teoksessa
toolkit label: programcı temsilcisi @tr
toolkit label: programmatore agente di @it
toolkit label: programmeerija (tegija) teoses @et
toolkit label: programmer agent of @en
toolkit label: programmerer for (agent) @no
toolkit label: programmeur-actor van @nl
toolkit label: programozó ágense: @hu
toolkit label: προγραμματιστής φορέας του @el
toolkit label: وكيل مبرمج @ar
toolkit label: ……的编程者行为者 @zh-hans
has subproperty: ohjelmoija (henkilö) teoksessa
has subproperty: ohjelmoija (yhteistoimija) teoksessa
has subproperty: P50184
lexical alias: programmerAgentOf.en
status: Published
type: Property
domain: C10002
label: er agent, som er programmør af @da
label: er programmerer for (agent) @no
label: est un agent programmeur de @fr
label: ir programmētājs (aģents) @lv
label: is programmer agent of @en
label: is programmeur-actor van @nl
label: ist Akteur als Programmiererin/Programmierer von @de
label: programcı temsilcisidir @tr
label: programmeerija (tegija) teoses @et
label: programozó ágense a következőnek: @hu
label: è programmatore agente di @it
label: és agent programador de @ca
label: είναι προγραμματιστής φορέας του @el
label: هو وكيل مبرمج لـ @ar
label: 是……的编程者行为者 @zh-hans
sub property of: teoksen tekijä (toimija) teoksessa
alternative label: Programmierer von @de
alternative label: ohjelmointi
alternative label: programador de @ca
alternative label: programcı @tr
alternative label: programmatore di libro @it
alternative label: programmeerija teoses @et
alternative label: programmer of @en
alternative label: programmerer for @no
alternative label: programmeur de @fr
alternative label: programmør af @da
alternative label: programozója: @hu
alternative label: προγραμματιστής του @el
alternative label: مبرمج @ar
alternative label: ……的编程者 @zh-hans
definition: Bir temsilciyi, bilgisayar programı oluşturmaya ilişkin bir temsilcinin sorumluluğu içeren br eserle ilişkilendirir. @tr
definition: Correla un agente a un'opera che implica una responsabilità di un agente per la programmazione informatica. @it
definition: Hozzákapcsol egy ágenst egy műhöz, amelyhez hozzátartozik egy ágens felelőssége számítógépes programozásért. @hu
definition: Liittää toimijan teokseen, jossa toimija on vastuussa tietokoneohjelman luomisesta.
definition: Met un agent en relation avec une œuvre qui comporte une responsabilité de la part d’un agent consistant à créer un programme informatique. @fr
definition: Relaciona un agent amb una obra que implica una responsabilitat d’un agent en la creació d’un programa d’ordinador. @ca
definition: Relateert een actor aan een werk dat met zich meebrengt een verantwoordelijkheid van een actor voor programmeren voor een computer. @nl
definition: Relaterer en agent til et verk som involverer ansvar for en agent i form av dataprogrammering. @no

designer (toimija) teoksessa
has element type: 2
instruction number: 18.5
toolkit definition: A work that involves a responsibility of an agent for designing an object. @en
toolkit definition: Bir nesneyi tasarlamak için bir temsilcinin sorumluluğunu içeren bir eser. @tr
toolkit definition: Darbs, kas ietver aģenta atbildību par objekta dizaina radīšanu. @lv
toolkit definition: Een werk dat met zich meebrengt een verantwoordelijkheid van een actor voor het ontwerpen van een object. @nl
toolkit definition: Egy mű, amelyhez hozzátartozik egy ágens felelőssége egy tárgy tervezéséért. @hu
toolkit definition: Ein Werk, bei dem ein Akteur für die Gestaltung des Designs eines Objekts verantwortlich ist. @de
toolkit definition: Et verk som involverer ansvar for en agent i form av utforming av en gjenstand. @no
toolkit definition: Obra que implica una responsabilitat d’un agent en el disseny d’un objecte. @ca
toolkit definition: Opera che implica una responsabilità di un agente per la progettazione di oggetto. @it
toolkit definition: Teos, jossa toimija on vastuussa kohteen suunnittelusta tai muotoilusta.
toolkit definition: Teos, mis sisaldab tegija vastutust objekti kujunduse eest. @et
toolkit definition: Værk, som involverer en agents ansvar for at designe et objekt. @da
toolkit definition: Œuvre qui comporte une responsabilité de la part d’un agent consistant à concevoir un objet. @fr
toolkit definition: Ένα έργο που περιλαμβάνει την ευθύνη του σχεδιασμού ενός αντικειμένου. @el
toolkit definition: عمل يترتب عليه مسئولية وكيل عن تصميم كائن. @ar
toolkit definition: 涉及设计一个物体的一个行为者的责任的一种作品 @zh-hans
toolkit label: Akteur als Designerin/Designer von @de
toolkit label: agent designer de @fr
toolkit label: agent dissenyador de @ca
toolkit label: agent, som er designer af @da
toolkit label: designer (toimija) teoksessa
toolkit label: designer agent of @en
toolkit label: designer agente di @it
toolkit label: designer av (agent) @no
toolkit label: ir dizainers (aģents) @lv
toolkit label: kujundaja (tegija) teoses @et
toolkit label: ontwerper-actor van @nl
toolkit label: tasarımcı temsilci @tr
toolkit label: tervező ágense: @hu
toolkit label: σχεδιαστής φορέας του @el
toolkit label: وكيل مصمم @ar
toolkit label: ……的设计者行为者 @zh-hans
has subproperty: designer (henkilö) teoksessa
has subproperty: designer (yhteistoimija) teoksessa
has subproperty: P50185
lexical alias: designerAgentOf.en
status: Published
type: Property
domain: C10002
label: er agent, som er designer af @da
label: er designer av (agent) @no
label: est un agent designer de @fr
label: ir dizainers (aģents) @lv
label: is designer agent of @en
label: is ontwerper-actor van @nl
label: ist Akteur als Designerin/Designer von @de
label: kujundaja (tegija) teoses @et
label: tasarımcı temsilcisidir @tr
label: tervező ágense a következőnek: @hu
label: è designer agente di @it
label: és agent dissenyador de @ca
label: είναι σχεδιαστής φορέας του @el
label: هو وكيل مصمم لـ @ar
label: 是……的设计者行为者 @zh-hans
sub property of: teoksen tekijä (toimija) teoksessa
alternative label: Designer von @de
alternative label: designer af @da
alternative label: designer av @no
alternative label: designer de @fr
alternative label: designer di @it
alternative label: designer of @en
alternative label: designerina teoksessa
alternative label: disainer teoses @et
alternative label: diseñador de @es
alternative label: dissenyador de @ca
alternative label: kujundaja teoses @et
alternative label: tasarımcı @tr
alternative label: tervezője: @hu
alternative label: σχεδιαστής του @el
alternative label: مصمم @ar
alternative label: ……的设计者 @zh-hans
definition: Bir temsilciyi, bir nesneyi tasarlamaya ilişkin bir temsilcinin sorumluluğunu içeren bir eserle ilişkilendirir. @tr
definition: Correla un agente a un'opera che implica una responsabilità di un agente per la progettazione di un oggetto. @it
definition: Hozzákapcsol egy ágenst egy műhöz, amelyhez hozzátartozik egy ágens felelőssége egy tárgy tervezéséért. @hu
definition: Liittää toimijan teokseen, jossa toimija on vastuussa kohteen suunnittelusta tai muotoilusta.
definition: Met un agent en relation avec une œuvre qui comporte une responsabilité de la part d’un agent consistant à concevoir un objet. @fr
definition: Relaciona un agent amb una obra que implica una responsabilitat d’un agent en el disseny d’un objecte. @ca

teoksen kartantekijä (toimija) teoksessa
has element type: 2
instruction number: 18.5
toolkit definition: A work that involves a responsibility of an agent for creating a cartographic work. @en
toolkit definition: Darbs, kas ietver aģenta atbildību par karti, atlantu, globusu vai citu kartogrāfijas materiālu. @lv
toolkit definition: Een werk dat met zich meebrengt een verantwoordelijkheid van een actor voor het creëren van een cartografisch werk. @nl
toolkit definition: Egy mű, amelyhez hozzátartozik egy ágens felelőssége egy kartográfiai mű létrehozásáért. @hu
toolkit definition: Ein Werk, bei dem ein Akteur für die Schaffung eines kartografischen Werks verantwortlich ist. @de
toolkit definition: Et verk som involverer ansvar for en agent i form av et kartografisk verk. @no
toolkit definition: Kartografik bir eser oluşturmak için bir temsilcinin sorumluluğunu içeren bir çalışma. @tr
toolkit definition: Obra que implica una responsabilitat d’un agent en la creació d’una obra cartogràfica. @ca
toolkit definition: Opera che implica una responsabilità di un agente per un'opera cartografica. @it
toolkit definition: Teos, joka on kartografinen teos, jonka luomisesta toimija on vastuussa.
toolkit definition: Teos, mis sisaldab tegija vastutust kartograafilise teose eest. @et
toolkit definition: Værk, som involverer en agents ansvar for at skabe et kartografisk værk. @da
toolkit definition: Œuvre qui comporte une responsabilité de la part d’un agent consistant à créer une œuvre cartographique. @fr
toolkit definition: Ένα χαρτογραφικό έργο που περιλαμβάνει την ευθύνη της δημιουργίας ενός χάρτη, ενός άτλαντα, μιας υδρόγειας σφαίρας ή άλλου χαρτογραφικού έργου. @el
toolkit definition: عمل يترتب عليه مسئولية وكيل عن أعمال رسم الخرائط. @ar
toolkit definition: 涉及创作一种地图作品的一个行为者的责任的一种作品 @zh-hans
toolkit label: Akteur als Kartografin/Kartograf eines Werks von @de
toolkit label: agent cartographe d’une œuvre de @fr
toolkit label: agent cartògraf d’una obra de @ca
toolkit label: agent, som er kartograf for værk af @da
toolkit label: cartograaf-actor van werk van @nl
toolkit label: cartografo agente di opera di @it
toolkit label: cartographer agent of work of @en
toolkit label: eserin kartograf temsilcisi @tr
toolkit label: ir kartogrāfs (aģents) darbam @lv
toolkit label: kartograf for (agent) @no
toolkit label: teoksen kartantekijä (toimija) teoksessa
toolkit label: teose kartograaf (tegija) teoses @et
toolkit label: térképész ágense a következő műnek: @hu
toolkit label: χαρτογράφος φορέας του έργου του @el
toolkit label: وكيل رسام خرائط لعمل @ar
toolkit label: ……的作品的地图绘制者行为者 @zh-hans
has subproperty: teoksen kartantekijä (henkilö) teoksessa
has subproperty: teoksen kartantekijä (yhteistoimija) teoksessa
has subproperty: P50186
lexical alias: cartographerAgentOfWorkOf.en
status: Published
type: Property
domain: C10002
label: er agent, som er kartograf for værk af @da
label: er kartograf for (agent) @no
label: eserinin kartograf temsilcisidir @tr
label: est un agent cartographe d’une œuvre de @fr
label: ir kartogrāfs (aģents) darbam @lv
label: is cartograaf-actor van werk van @nl
label: is cartographer agent of work of @en
label: ist Akteur als Kartografin/Kartograf eines Werks von @de
label: teose kartograaf (tegija) teoses @et
label: térképész ágense a következő műnek: @hu
label: è cartografo agente di @it
label: és agent cartògraf d’una obra de @ca
label: είναι χαρτογράφος φορέας του έργου του @el
label: هو وكيل رسام خرائط لعمل لـ @ar
label: 是……的作品的地图绘制者行为者 @zh-hans
sub property of: teoksen tekijä (toimija) teoksessa
alternative label: Kartografin/Kartograf von @de
alternative label: cartografo di opera di @it
alternative label: cartographe de @fr
alternative label: cartographer of @en
alternative label: cartògraf de @ca
alternative label: cartógrafo de @es
alternative label: kartantekijänä kartografisessa teoksessa
alternative label: kartograf @tr
alternative label: kartograf af @da
alternative label: kartograf for @no
alternative label: teose kartograaf teoses @et
alternative label: térképésze: @hu
alternative label: χαρτογράφος του έργου του @el
alternative label: رسام خرائط لـ @ar
alternative label: ……的地图绘制者 @zh-hans
definition: Bir temsilciyi, kartografik bir eser oluşturmaya ilişkin bir temsilcinin sorumluluğunu içeren bir eserle ilişkilendirir. @tr
definition: Correla un agente a un'opera che implica una responsabilità di un agente per un'opera cartografica. @it
definition: Hozzákapcsol egy ágenst egy műhöz, amelyhez hozzátartozik egy ágens felelőssége egy kartográfiai mű létrehozásáért. @hu
definition: Liittää toimijan teokseen, joka on kartografinen teos, jonka luomisesta toimija on vastuussa.
definition: Met un agent en relation avec une œuvre qui comporte une responsabilité de la part d’un agent consistant à créer une œuvre cartographique. @fr
definition: Relaciona un agent amb una obra que implica una responsabilitat d’un agent en la creació d’una obra cartogràfica. @ca
definition: Relateert een actor aan een werk dat met zich meebrengt een verantwoordelijkheid van een actor voor het creëren van een cartografisch werk. @nl

teoksen säveltäjä (toimija) musiikkiteoksessa
has element type: 2
instruction number: 18.5
toolkit definition: A work that involves a responsibility of an agent for creating a musical work. @en
toolkit definition: Bir müzik eseri yaratmak için bir temsilcinin sorumluluğunu içeren bir eser. @tr
toolkit definition: Een werk dat is een muziekwerk dat met zich meebrengt een verantwoordelijkheid van een actor voor muziek. @nl
toolkit definition: Egy zenemű, amelyhez hozzátartozik egy ágens felelőssége a zenéért. @hu
toolkit definition: Ein Musikwerk, bei dem ein Akteur für die Musik verantwortlich ist. @de
toolkit definition: Et musikalsk verk som involverer ansvar for en agent i form av musikk. @no
toolkit definition: Muusikateos, mis sisaldab tegija vastutust muusika loomise eest. @et
toolkit definition: Mūzikas darbs, kas ietver aģenta atbildību par mūzikas radīšanu. @lv
toolkit definition: Obra que implica una responsabilitat d’un agent en la creació d’una obra musical. @ca
toolkit definition: Opera musicale che implica una responsabilità di un agente per la musica. @it
toolkit definition: Teos, joka on musiikkiteos, jonka luomisesta toimija on vastuussa.
toolkit definition: Værk, der er et musikværk, som involverer en agents ansvar for musik. @da
toolkit definition: Œuvre qui comporte une responsabilité de la part d’un agent consistant à créer une œuvre musicale. @fr
toolkit definition: Ένα μουσικό έργο που περιλαμβάνει την ευθύνη ενός φορέα για μουσική. @el
toolkit definition: عمل موسيقي يترتب عليه مسئولية وكيل عن الموسيقى. @ar
toolkit definition: 涉及创作一种音乐作品的一个行为者的责任的一种作品 @zh-hans
toolkit label: Akteur als Komponistin/Komponist eines Werks von @de
toolkit label: agent compositeur d’une œuvre de @fr
toolkit label: agent compositor d’una obra de @ca
toolkit label: agent, som er komponist af værk af @da
toolkit label: componist-actor van werk van @nl
toolkit label: composer agent of work of @en
toolkit label: compositore agente di opera di @it
toolkit label: eserin besteci temsilcisi @tr
toolkit label: ir komponists (aģents) darbam @lv
toolkit label: komponist av (agent) @no
toolkit label: teoksen säveltäjä (toimija) musiikkiteoksessa
toolkit label: teose helilooja (tegija) teoses @et
toolkit label: zeneszerző ágense a következő műnek: @hu
toolkit label: συνθέτης φορέας του έργου του @el
toolkit label: وكيل ملحن عمل @ar
toolkit label: ……的作品的作曲者行为者 @zh-hans
has subproperty: teoksen säveltäjä (henkilö) musiikkiteoksessa
has subproperty: teoksen säveltäjä (yhteistoimija) musiikkiteoksessa
has subproperty: P50187
lexical alias: composerAgentOfWorkOf.en
status: Published
type: Property
domain: C10002
label: er agent, som er komponist af værk af @da
label: er komponist av (agent) @no
label: eserinin besteci temsilcisidir @tr
label: est un agent compositeur d’une œuvre de @fr
label: ir komponists (aģents) darbam @lv
label: is componist-actor van werk van @nl
label: is composer agent of work of @en
label: ist Akteur als Komponistin/Komponist eines Werks von @de
label: teose helilooja (tegija) teoses @et
label: zeneszerző ágense a következő műnek: @hu
label: è compositore agente di @it
label: és agent compositor d’una obra de @ca
label: είναι συνθέτης φορέας του έργου του @el
label: هو وكيل ملحن عمل لـ @ar
label: 是……的作品的作曲者行为者 @zh-hans
sub property of: teoksen tekijä (toimija) teoksessa
alternative label: Komponistin/Komponist von @de
alternative label: besteci @tr
alternative label: composer of @en
alternative label: compositeur de @fr
alternative label: compositor de @ca
alternative label: compositore di @it
alternative label: komponist af værk af @da
alternative label: komponist av @no
alternative label: sävellys
alternative label: teose helilooja teoses @et
alternative label: zeneszerzője: @hu
alternative label: συνθέτης του έργου του @el
alternative label: ملحن لـ @ar
alternative label: ……的作曲者 @zh-hans
definition: Bir temsilcinin bir müzik eseri oluşturma sorumluluğunu içeren bir eserle ilişkilendirir. @tr
definition: Correla un agente a un'opera musicale che implica una responsabilità di un agente per la musica. @it
definition: Hozzákapcsol egy ágenst egy zeneműhöz, amelyhez hozzátartozik egy ágens felelőssége a zenéért. @hu
definition: Liittää toimijan teokseen, joka on musiikkiteos, jonka luomisesta toimija on vastuussa.
definition: Met un agent en relation avec une œuvre qui comporte une responsabilité de la part d’un agent consistant à créer une œuvre musicale. @fr
definition: Relaciona un agent amb una obra que implica una responsabilitat d’un agent en la creació d’una obra musical. @ca
definition: Relateert een actor aan een muziekwerk dat met zich meebrengt een verantwoordelijkheid van een actor voor muziek. @nl
definition: Relaterer en agent til et musikalsk verk som involverer ansvar for en agent i form av musikk. @no

keksijä (toimija) teoksessa
has element type: 2
instruction number: 18.5
toolkit definition: A work that involves a responsibility of an agent for creating a new device or process. @en
toolkit definition: Darbs, kas ietver aģenta atbildību par jaunas ierīces vai procesa radīšanu. @lv
toolkit definition: Een werk dat met zich meebrengt een verantwoordelijkheid van een actor voor het creëren van een nieuw apparaat of proces. @nl
toolkit definition: Egy mű, amelyhez hozzátartozik egy ágens felelőssége egy új eszköz vagy eljárás létrehozásáért. @hu
toolkit definition: Ein Werk, bei dem ein Akteur für die Schaffung eines neuen Geräts oder Prozesses verantwortlich ist. @de
toolkit definition: Et verk som involverer ansvar for en agent i form av en ny innretning eller prosess. @no
toolkit definition: Obra que implica una responsabilitat d’un agent en la creació d’un mecanisme o procés nou. @ca
toolkit definition: Opera che implica una responsabilità di un agente per un nuovo dispositivo o processo. @it
toolkit definition: Teos, jossa toimija on vastuussa uuden välineen tai menetelmän luomisesta.
toolkit definition: Teos, mis sisaldab tegija vastutust uue seadme või protsessi eest. @et
toolkit definition: Værk, som involverer en agents ansvar for at skabe en ny anordning eller proces. @da
toolkit definition: Yeni bir cihaz veya süreç oluşturmak için bir temsilcinin sorumluluğunu içeren bir çalışma. @tr
toolkit definition: Œuvre qui comporte une responsabilité de la part d’un agent consistant à créer un nouveau dispositif ou procédé. @fr
toolkit definition: Ένα έργο που περιλαμβάνει την ευθύνη της δημιουργίας μιας νέας συσκευής ή διαδικασίας. @el
toolkit definition: عمل يترتب عليه مسئولية وكيل عن ابتكار جهاز أو عملية جديدة. @ar
toolkit definition: 涉及创建一个新装置或新过程的一个行为者的责任的一种作品 @zh-hans
toolkit label: Akteur als Erfinderin/Erfinder von @de
toolkit label: agent inventeur de @fr
toolkit label: agent inventor de @ca
toolkit label: agent, som er opfinder af @da
toolkit label: feltaláló ágense: @hu
toolkit label: inventor agent of @en
toolkit label: inventore agente di @it
toolkit label: ir izgudrotājs (aģents) @lv
toolkit label: keksijä (toimija) teoksessa
toolkit label: leiutaja (tegija) teoses @et
toolkit label: mucit temsilcisidir @tr
toolkit label: oppfinner av (agent) @no
toolkit label: uitvinder-actor van @nl
toolkit label: εφευρέτης φορέας του @el
toolkit label: وكيل مخترع @ar
toolkit label: ……的发明者行为者 @zh-hans
has subproperty: keksijä (henkilö) teoksessa
has subproperty: keksijä (yhteistoimija) teoksessa
has subproperty: P50188
lexical alias: inventorAgentOf.en
status: Published
type: Property
domain: C10002
label: er agent, som er opfinder af @da
label: er oppfinner av (agent) @no
label: est un agent inventeur de @fr
label: feltaláló ágense a következőnek: @hu
label: ir izgudrotājs (aģents) @lv
label: is inventor agent of @en
label: is uitvinder-actor van @nl
label: ist Akteur als Erfinderin/Erfinder von @de
label: leiutaja (tegija) teoses @et
label: mucit temsilcisidir @tr
label: è inventore agente di @it
label: és agent inventor de @ca
label: είναι εφευρέτης φορέας του @el
label: هو وكيل مخترع لـ @ar
label: 是……的发明者行为者 @zh-hans
sub property of: teoksen tekijä (toimija) teoksessa
alternative label: Erfinderin/Erfinder von @de
alternative label: feltalálója: @hu
alternative label: inventeur de @fr
alternative label: inventor de @ca
alternative label: inventor of @en
alternative label: inventore di @it
alternative label: keksintö
alternative label: leiutaja teoses @et
alternative label: opfinder af @da
alternative label: oppfinner av @no
alternative label: εφευρέτης του @el
alternative label: مخترع @ar
alternative label: ……的发明者 @zh-hans
definition: Bir temsilciyi, yeni bir cihaz veya süreç oluşturmaya ilişkin bir temsilcinin sorumluluğunu içeren bir eserle ilişkilendirir. @tr
definition: Correla un agente a un'opera che implica una responsabilità di un agente per un nuovo dispositivo o processo. @it
definition: Hozzákapcsol egy ágenst egy műhöz, amelyhez hozzátartozik egy ágens felelőssége egy új eszköz vagy eljárás létrehozásáért. @hu
definition: Liittää toimijan teokseen, jossa toimija on vastuussa uuden välineen tai menetelmän luomisesta.
definition: Met un agent en relation avec une œuvre qui comporte une responsabilité de la part d’un agent consistant à créer un nouveau dispositif ou procédé. @fr
definition: Relaciona un agent amb una obra que implica una responsabilitat d’un agent en la creació d’un mecanisme o procés nou. @ca
definition: Relateert een actor aan een werk dat met zich meebrengt een verantwoordelijkheid van een actor voor het creëren van een nieuw apparaat of proces. @nl
definition: Relaterer en agent til et verk som involverer ansvar for en agent i form av en ny innretning eller prosess. @no
definition: Relaterer en agent til et værk, som involverer en agents ansvar for at skabe en ny anordning eller proces. @da

kokoaja (toimija) teoksessa
has element type: 2
instruction number: 18.5
see also: toimittajana aineistossa
toolkit definition: A work that involves a responsibility of an agent for creating a metadata description set. @en
toolkit definition: Bir üstveri seti oluşturmak için bir temsilcinin sorumluluğunu içeren bir çalışma. @tr
toolkit definition: Darbs, kas ietver aģenta atbildību par datu un informācijas atlasi, sakārtošanu, apkopošanu un rediģēšanu tādam darbam kā bibliogrāfija vai rādītājs. @lv
toolkit definition: Een werk dat met zich meebrengt een verantwoordelijkheid van een actor voor selecteren, arrangeren, verzamelen en redigeren van data en informatie voor een werk zoals een bibliografie of een adresboek. @nl
toolkit definition: Egy mű, amelyhez hozzátartozik egy ágens felelőssége a kiválasztásáért, elrendezésért, aggregálásért, adatok és információk szerkesztéséért egy olyan mű számára, mint egy bibliográfia vagy egy címtár. @hu
toolkit definition: Ein Werk, bei dem ein Akteur für das Selektieren, Gliedern, Aggregieren und Editieren von Daten und Informationen für ein Werk, zum Beispiel einer Bibliografie oder eines Verzeichnisses, verantwortlich ist. @de
toolkit definition: Et verk som involverer ansvar for en agent i form av å velge ut, arrangere, samle og redigere data og informasjon for et verk som en bibliografi eller en fortegnelse. @no
toolkit definition: Obra que implica una responsabilitat d’un agent en la creació d’un conjunt de descripció de metadades. @ca
toolkit definition: Opera che implica una responsabilità di un agente nella selezione, disposizione, aggregazione e redazione di dati e informazioni per un'opera come una bibliografia o una directory. @it
toolkit definition: Teos, jossa toimija on vastuussa metatietokokonaisuuden luomisesta.
toolkit definition: Teos, mis sisaldab tegija vastutust andmete ja info valimise, korrastamise, koondamise ja toimetamise eest teose, nt bibliograafia või teatmiku jaoks. @et
toolkit definition: Værk, som involverer en agents ansvar for at udvælge, arrangere, sammenlægge og redigere data og information til et værk, såsom en bibliografi eller en fortegnelse. @da
toolkit definition: Œuvre qui comporte une responsabilité de la part d’un agent consistant à créer un ensemble de métadonnées descriptives. @fr
toolkit definition: Ένα έργο που περιλαμβάνει την ευθύνη της δημιουργίας ενός νέου έργου, όπως μιας βιβλιογραφίας ή ενός οδηγού μέσω της επιλογής, της οργάνωσης, της συλλογής και της επιμέλειας δεδομένων, πληροφοριών κ.λπ. @el
toolkit definition: عمل يترتب عليه مسئولية وكيل عن اختيار بيانات ومعلومات للعمل وترتيبها وتجميعها وتحريرها في ببليوجرافيا أو في دليل. @ar
toolkit definition: 涉及创建一个元数据描述集的一个行为者的责任的一种作品 @zh-hans
toolkit label: Akteur als Zusammenstellende/Zusammenstellender von @de
toolkit label: agent compilador de @ca
toolkit label: agent compilateur de @fr
toolkit label: agent, som er kompilator af @da
toolkit label: compilatore agente di @it
toolkit label: compiler agent of @en
toolkit label: derleyici temsilci @tr
toolkit label: ir sastādītājs (aģents) @lv
toolkit label: kokoaja (toimija) teoksessa
toolkit label: koostaja (tegija) teoses @et
toolkit label: samensteller-actor van @nl
toolkit label: utarbeider av (agent) @no
toolkit label: összeállító ágense: @hu
toolkit label: συμπιλητής φορέας του @el
toolkit label: وكيل جامع @ar
toolkit label: ……的编纂者行为者 @zh-hans
has subproperty: kokoaja (henkilö) teoksessa
has subproperty: kokoaja (yhteistoimija) teoksessa
has subproperty: kokoelman luetteloija (toimija) teokselle
has subproperty: P50189
lexical alias: compilerAgentOf.en
status: Published
type: Property
domain: C10002
label: derleyici temsilcisidir @tr
label: er agent, som er kompilator af @da
label: er utarbeider av (agent) @no
label: est un agent compilateur de @fr
label: ir sastādītājs (aģents) @lv
label: is compiler agent of @en
label: is samensteller-actor van @nl
label: ist Akteur als Zusammenstellende/Zusammenstellender von @de
label: koostaja (tegija) teoses @et
label: è compilatore agente di @it
label: és agent compilador de @ca
label: összeállító ágense a következőnek: @hu
label: είναι συμπιλητής φορέας του @el
label: وكيل جامع لـ @ar
label: 是……的编纂者行为者 @zh-hans
sub property of: aggregaattori (toimija) teoksessa
alternative label: Nem tartozik ide sem egy mű kifejezési formájának tartalmi felülvizsgálata vagy tisztázása, sem a művek vagy műrészek kifejezési formáinak kiválasztása és összeállítása. @hu
alternative label: Zusammenstellender von @de
alternative label: compilador de @ca
alternative label: compilateur de @fr
alternative label: compilatore di @it
alternative label: compiler of @en
alternative label: derleyici @tr
alternative label: kokoajana teoksessa
alternative label: kompilator af @da
alternative label: koostaja teoses @et
alternative label: utarbeider av @no
alternative label: συμπιλητής του @el
alternative label: جامع @ar
alternative label: ……的编纂者 @zh-hans
definition: Bir temsilciyi, bir üstveri seti oluşturmaya ilişkin bir temsilcinin sorumluluğunu içeren bir eserle ilişkilendirir. @tr
definition: Correla un agente a un'opera che implica una responsabilità di un agente nella selezione, disposizione, aggregazione e redazione di dati e informazioni per un'opera come una bibliografia o una directory. @it
definition: Hozzákapcsol egy ágenst egy műhöz, amelyhez hozzátartozik egy ágens felelőssége a kiválasztásáért, elrendezésért, aggregálásért, adatok és információk szerkesztéséért egy olyan mű számára, mint egy bibliográfia vagy egy címtár. @hu
definition: Liittää toimijan teokseen, jossa toimija on vastuussa metatietokokonaisuuden luomisesta.
definition: Met un agent en relation avec une œuvre qui comporte une responsabilité de la part d’un agent consistant à créer un ensemble de métadonnées descriptives. @fr
definition: Relaciona un agent amb una obra que implica una responsabilitat d’un agent en la creació d’un conjunt de descripció de metadades. @ca

teoksen valokuvaaja (toimija) teoksessa
has element type: 2
instruction number: 18.5
toolkit definition: A work that involves a responsibility of an agent for creating a photographic work. @en
toolkit definition: Bir fotoğrafik çalışma yaratmak için bir temsilcinin sorumluluğunu içeren bir eser. @tr
toolkit definition: Darbs, kas ietver aģenta atbildību par fotografēšanu. @lv
toolkit definition: Een werk dat is een fotografisch werk dat met zich meebrengt een verantwoordelijkheid van een actor voor fotografie. @nl
toolkit definition: Egy fényképészeti mű, amelyhez hozzátartozik egy ágens felelőssége a fotózásért. @hu
toolkit definition: Ein fotografisches Werk, bei dem ein Akteur für die Fotografie verantwortlich ist. @de
toolkit definition: Et verk som involverer ansvar for en agent i form av fotografi. @no
toolkit definition: Obra que implica una responsabilitat d’un agent en la creació d’una obra fotogràfica. @ca
toolkit definition: Opera che implica una responsabilità di un agente per la fotografia. @it
toolkit definition: Teos, joka on valokuvateos, jonka luomisesta toimija on vastuussa.
toolkit definition: Teos, mis sisaldab tegija vastutust fotograafia eest. @et
toolkit definition: Værk, der er et fotografisk værk, som involverer en agents ansvar for fotografi. @da
toolkit definition: Œuvre qui comporte une responsabilité de la part d’un agent consistant à créer une œuvre photographique. @fr
toolkit definition: Ένα φωτογραφικό έργο που περιλαμβάνει την ευθύνη ενός φορέα για τη φωτογραφία. @el
toolkit definition: عمل عبارة عن عمل فوتوغرافي يترتب عليه مسئولية وكيل عن التصوير. @ar
toolkit definition: 涉及创作一种摄影作品的一个行为者的责任的一种作品 @zh-hans
toolkit label: Akteur als Fotografin/Fotograf eines Werks von @de
toolkit label: Eserin fotoğrafçı temsilcisi @tr
toolkit label: agent fotògraf d’una obra de @ca
toolkit label: agent photographe d’une œuvre de @fr
toolkit label: agent, som er fotograf af værk af @da
toolkit label: fotograaf-actor van werk van @nl
toolkit label: fotograf av (agent) @no
toolkit label: fotografo agente di opera di @it
toolkit label: fényképész ágense a következő műnek: @hu
toolkit label: ir fotogrāfs (aģents) @lv
toolkit label: photographer agent of work of @en
toolkit label: teoksen valokuvaaja (toimija) teoksessa
toolkit label: teose fotograaf (tegija) teoses @et
toolkit label: φωτογράφος φορέας του έργου του @el
toolkit label: وكيل مصور عمل @ar
toolkit label: ……作品的摄影者行为者 @zh-hans
has subproperty: teoksen valokuvaaja (henkilö) teoksessa
has subproperty: teoksen valokuvaaja (yhteistoimija) teoksessa
has subproperty: P50190
lexical alias: photographerAgentOfWorkOf.en
status: Published
type: Property
domain: C10002
label: er agent, som er fotograf af værk af @da
label: er fotograf av (agent) @no
label: eserinin fotoğrafçı temsilcisidir @tr
label: est un agent photographe d’une œuvre de @fr
label: fényképész ágense a következő műnek: @hu
label: ir fotogrāfs (aģents) @lv
label: is fotograaf-actor van werk van @nl
label: is photographer agent of work of @en
label: ist Akteur als Fotografin/Fotograf eines Werks von @de
label: teose fotograaf (tegija) teoses @et
label: è fotografo agente di @it
label: és agent fotògraf d’una obra de @ca
label: είναι φωτογράφος φορέας του έργου του @el
label: هو وكيل مصور عمل @ar
label: 是……作品的摄影者行为者 @zh-hans
sub property of: teoksen tekijä (toimija) teoksessa
alternative label: Fotografin/Fotograf von @de
alternative label: fotograf af @da
alternative label: fotograf av @no
alternative label: fotografo di opera di @it
alternative label: fotoğrafçı @tr
alternative label: fotògraf de @ca
alternative label: fotógrafo de @es
alternative label: fényképésze: @hu
alternative label: photographe de @fr
alternative label: photographer of @en
alternative label: teose fotograaf teoses @et
alternative label: valokuvaajana teoksessa
alternative label: φωτογράφος του έργου του @el
alternative label: مصور @ar
alternative label: ……的摄影者 @zh-hans
definition: Bir temsilciyi, fotoğrafik bir eser oluşturmaya ilişkin bir temsilcinin sorumluluğunu içeren bir eserle ilişkilendirir. @tr
definition: Correla un agente a un'opera che implica una responsabilità di un agente per la fotografia. @it
definition: Hozzákapcsol egy ágenst egy fényképészeti műhöz, amelyhez hozzátartozik egy ágens felelőssége a fotózásért. @hu
definition: Liittää toimijan teokseen, joka on valokuvateos, jonka luomisesta toimija on vastuussa.
definition: Met un agent en relation avec une œuvre qui comporte une responsabilité de la part d’un agent consistant à créer une œuvre photographique. @fr
definition: Relaciona un agent amb una obra que implica una responsabilitat d’un agent en la creació d’una obra fotogràfica. @ca
definition: Relateert een actor aan een werk dat is een fotografisch werk dat met zich meebrengt een verantwoordelijkheid van een actor voor fotografie. @nl

teoksen haastattelija (toimija) teoksessa
has element type: 2
instruction number: 18.5
toolkit definition: A work that involves a responsibility of an agent for acting as an interviewer, reporter, pollster, or some other kind of agent who gathers information. @en
toolkit definition: Bir temsilcinin görüşmeci, muhabir, anketör veya bilgi toplayan başka türde bir temsilci olarak hareket etme sorumluluğunu içeren bir çalışma. @tr
toolkit definition: Darbs, kas ietver aģenta atbildību, darbojoties kā intervētājs, reportieris, aptaujas organizētājs vai kāds cits informācijas apkopotājs. @lv
toolkit definition: Een werk dat met zich meebrengt een verantwoordelijkheid van een actor voor optreden als een interviewer, verslaggever, opiniepeiler of een andere soort actor die informatie verzamelt. @nl
toolkit definition: Egy mű, amelyhez hozzátartozik egy ágens felelőssége interjúkészítőként, riporterként, közvélemény-kutatóként, vagy valamilyen más információgyűjtő ágensként. @hu
toolkit definition: Ein Werk, bei dem ein Akteur als Interviewerin/Interviewer, Reporterin/Reporter, Meinungsforscherin/Meinungsforscher oder anderer Akteur Informationen zusammenträgt. @de
toolkit definition: Et verk som involverer ansvar for en agent i form av å fungere som intervjuer, reporter eller en annen agent som samler inn informasjon. @no
toolkit definition: Obra que implica una responsabilitat d’un agent actuant com un entrevistador, un periodista, un enquestador o qualsevol altre tipus d’agent que recull la informació. @ca
toolkit definition: Opera che implica una responsabilità di un agente nell'agire come intervistatore, giornalista, sondaggista o qualche altro genere di agente che raccoglie informazioni. @it
toolkit definition: Teos, jonka luomisesta toimija on vastuussa toimimalla haastattelijana, toimittajana, mielipidetutkijana tai jonkinlaisena muuna tietoja keräävänä toimijana.
toolkit definition: Teos, mis sisaldab tegija vastutust tegutsemise eest intervjueerija, reporteri, küsitleja või muu infot koguva tegijana. @et
toolkit definition: Værk, som involverer en agents ansvar for at optræde som interviewer, journalist, meningsmåler eller en anden form for agent, som indsamler information. @da
toolkit definition: Œuvre qui comporte une responsabilité de la part d’un agent consistant à agir à titre d’intervieweur, de reporteur, de sondeur ou d’autre type d’agent recueillant de l’information. @fr
toolkit definition: Ένα έργο που περιλαμβάνει την ευθύνη της δημιουργίας [εφόσον ο φορέας] ενεργεί ως συνεντευκτής, δημοσιογράφος, δημοσκόπος ή ως κάποιος άλλος φορέας συγκέντρωσης πληροφοριών. @el
toolkit definition: يربط وكيلا بعمل يترتب عليه مسئولية وكيل يعمل كمحاور أو مراسل أو مستطلع رأي أو وكيل من نوع آخر يجمع معلومات. @ar
toolkit definition: 涉及担当采访者、记者、民意调查员行为者或其他类型信息搜集的一个行为者的责任的一种作品 @zh-hans
toolkit label: Akteur als Interviewerin/Interviewer eines Werks von @de
toolkit label: agent entrevistador d’una obra de @ca
toolkit label: agent intervieweur d’une œuvre de @fr
toolkit label: agent, som er interviewer for værk af @da
toolkit label: eserinin görüşmeci temsilcisidir @tr
toolkit label: interjúkészítő ágense a következő műnek: @hu
toolkit label: interviewer agent of work of @en
toolkit label: interviewer-actor van werk van @nl
toolkit label: intervistatore agente di opera di @it
toolkit label: intervjueerija (tegija) teoses @et
toolkit label: intervjuer for verk for (agent) @no
toolkit label: ir intervētājs (aģents) darbā @lv
toolkit label: teoksen haastattelija (toimija) teoksessa
toolkit label: συνεντευκτής φορέας του έργου του @el
toolkit label: وكيل محاور في عمل لـ @ar
toolkit label: ……作品的采访者行为者 @zh-hans
has subproperty: teoksen haastattelija (henkilö) teoksessa
has subproperty: teoksen haastattelija (yhteistoimija) teoksessa
has subproperty: P50191
lexical alias: interviewerAgentOfWorkOf.en
status: Published
type: Property
domain: C10002
label: er agent, som er interviewer for værk af @da
label: er intervjuer for verk for (agent) @no
label: eserinin görüşmeci temsilcisidir @tr
label: est un agent intervieweur d’une œuvre de @fr
label: interjúkészítő ágense a következő műnek: @hu
label: intervjueerija (tegija) teoses @et
label: ir intervētājs (aģents) darbā @lv
label: is interviewer agent of work of @en
label: is interviewer-actor van werk van @nl
label: ist Akteur als Interviewerin/Interviewer eines Werks von @de
label: è intervistatore agente di @it
label: és agent entrevistador d’una obra de @ca
label: είναι συνεντευκτής φορέας του έργου του @el
label: هو وكيل محاور في عمل لـ @ar
label: 是……作品的采访者行为者 @zh-hans
sub property of: teoksen tekijä (toimija) teoksessa
alternative label: Interviewer von @de
alternative label: entrevistador de @ca
alternative label: haastattelijana haastattelussa
alternative label: interjúkészítője: @hu
alternative label: interviewer af @da
alternative label: interviewer of @en
alternative label: intervieweur de @fr
alternative label: intervistatore di opera di @it
alternative label: intervjueerija teoses @et
alternative label: intervjuer av @no
alternative label: συνεντευκτής του έργου του @el
alternative label: محاور @ar
alternative label: ……的采访者 @zh-hans
definition: Bir temsilciyi, görüşmeci, muhabir, anketör veya bilgi toplayan başka bir tür temsilci olarak hareket eden bir temsilcinin sorumluluğunu içeren bir eserle ilişkilendirir. @tr
definition: Correla un agente a un'opera che implica una responsabilità di un agente nell'agire come intervistatore, giornalista, sondaggista o qualche altro genere di agente che raccoglie informazioni. @it
definition: Hozzákapcsol egy ágenst egy műhöz, amelyhez hozzátartozik egy ágens felelőssége interjúkészítőként, riporterként, közvélemény-kutatóként, vagy valamilyen más információgyűjtő ágensként. @hu
definition: Liittää toimijan teokseen, jonka luomisesta toimija on vastuussa toimimalla haastattelijana, toimittajana, mielipidetutkijana tai jonkinlaisena muuna tietoja keräävänä toimijana.
definition: Met un agent en relation avec une œuvre qui comporte une responsabilité de la part d’un agent consistant à agir à titre d’intervieweur, de reporteur, de sondeur ou d’autre type d’agent recueillant de l’information. @fr
definition: Relaciona un agent amb una obra que implica una responsabilitat d’un agent actuant com un entrevistador, un periodista, un enquestador o qualsevol altre tipus d’agent que recull la informació. @ca
definition: Relateert een actor aan een werk dat met zich meebrengt een verantwoordelijkheid van een actor voor optreden als een interviewer, verslaggever, opiniepeiler of een andere soort actor die informatie verzamelt. @nl
definition: Relaterer en agent til et verk som involverer ansvar for en agent i form av å fungere som intervjuer, reporter eller en annen agent som samler inn informasjon. @no
definition: Relaterer en agent til et værk, som involverer en agents ansvar for at optræde som interviewer, journalist, meningsmåler eller en anden form for agent, som indsamler information. @da

taiteilija (toimija) teoksessa
has element type: 2
instruction number: 18.5
toolkit definition: A work that involves a responsibility of an agent for conceiving, and often implementing, an original graphic design, drawing, painting, etc. @en
toolkit definition: Darbs, kas ietver aģenta atbildību par oriģinālu estampa, zīmējuma, gleznas u.tml. radīšanu un īstenošanu. @lv
toolkit definition: Een werk dat met zich meebrengt een verantwoordelijkheid van een actor voor bedenken, en vaak uitvoeren, van een oorspronkelijk grafisch ontwerp, tekening, schilderij etc. @nl
toolkit definition: Egy mű, amelyhez hozzátartozik egy ágens felelőssége egy eredeti grafikai terv, rajz, festmény stb. elgondolásáért és gyakran kivitelezéséért is. @hu
toolkit definition: Ein Werk, bei dem ein Akteur für die Konzeption und oft auch Umsetzung einer originalen grafischen Gestaltung, einer Zeichnung oder eines Gemäldes und so weiter verantwortlich ist. @de
toolkit definition: Et verk som involverer ansvar for en agent i form av å skape, og ofte implementere, original grafisk design, tegning, maleri, etc. @no
toolkit definition: Obra que implica una responsabilitat d’un agent concebent, i sovint realitzant, un disseny gràfic, un dibuix, una pintura, etc. original. @ca
toolkit definition: Opera che implica una responsabilità di un agente per la concezione, e spesso per lo sviluppo, di un progetto grafico, disegno, dipinto, etc. originale. @it
toolkit definition: Teos, jossa toimija on vastuussa alkuperäisen graafisen suunnitelman, piirroksen, maalauksen tms. luomisesta.
toolkit definition: Teos, mis sisaldab tegija vastutust originaalse graafilise kujunduse, joonistuse, maali vms kavandamise ja sageli ka teostamise eest. @et
toolkit definition: Værk, som involverer en agents ansvar for at udtænke, og ofte udføre, et originalt grafisk design, en original tegning, et originalt maleri etc. @da
toolkit definition: Özgün bir grafik tasarım, çizim, resim vb. tasarlamak ve sıklıkla uygulamak için bir temsilcinin sorumluluğunu içeren bir çalışma. @tr
toolkit definition: Œuvre qui comporte une responsabilité de la part d’un agent consistant à concevoir et souvent à réaliser un graphisme, une peinture, un dessin, etc. original. @fr
toolkit definition: Ένα έργο που περιλαμβάνει την ευθύνη της δημιουργίας μέσω της σύλληψης και συχνά μέσω της εφαρμογής ενός πρωτότυπου γραφικού σχεδίου, σκίτσου, πίνακα ζωγραφικής κ.λπ. @el
toolkit definition: عمل يترتب عليه مسئولية وكيل عن وضع تصور لتصميم جرافيكي، أو لرسم، أو للوحة زيتية أصلية، إلخ وغالبا تنفيذه. @ar
toolkit definition: 涉及构思并经常是完成原创图形设计、绘图、绘画等的一个行为者的责任的一种作品 @zh-hans
toolkit label: Akteur als Künstlerin/Künstler von @de
toolkit label: agent artista de @ca
toolkit label: agent artiste de @fr
toolkit label: agent, som er kunstner af @da
toolkit label: artist agent of @en
toolkit label: artista agente di @it
toolkit label: ir mākslinieks (aģents) @lv
toolkit label: kunstenaar-actor van @nl
toolkit label: kunstner for (agent) @no
toolkit label: kunstnik (tegija) teoses @et
toolkit label: művész ágense: @hu
toolkit label: sanatçı temsilcisi @tr
toolkit label: taiteilija (toimija) teoksessa
toolkit label: καλλιτέχνης φορέας του @el
toolkit label: وكيل فنان @ar
toolkit label: ……的美术家行为者 @zh-hans
has subproperty: kuvanveistäjä (toimija) teoksessa
has subproperty: kalligrafi (toimija) teoksessa
has subproperty: kirjataiteilija (toimija) teoksessa
has subproperty: taiteilija (henkilö) teoksessa
has subproperty: taiteilija (yhteistoimija) teoksessa
has subproperty: P50192
lexical alias: artistAgentOf.en
status: Published
type: Property
domain: C10002
label: er agent, som er kunstner af @da
label: er kunstner for (agent) @no
label: est un agent artiste de @fr
label: ir mākslinieks (aģents) @lv
label: is artist agent of @en
label: is kunstenaar-actor van @nl
label: ist Akteur als Künstlerin/Künstler von @de
label: kunstnik (tegija) teoses @et
label: művész ágense a következőnek: @hu
label: sanatçı temsilcisidir @tr
label: è artista agente di @it
label: és agent artista de @ca
label: είναι καλλιτέχνης φορέας του @el
label: هو وكيل فنان لـ @ar
label: 是……的美术家行为者 @zh-hans
sub property of: teoksen tekijä (toimija) teoksessa
alternative label: Künstler von @de
alternative label: artist of @en
alternative label: artista de @ca
alternative label: artista di @it
alternative label: artiste de @fr
alternative label: kunstner af @da
alternative label: kunstner for @no
alternative label: kunstnik teoses @et
alternative label: művésze: @hu
alternative label: sanatçı @tr
alternative label: taiteilijana teoksessa
alternative label: καλλιτέχνης του @el
alternative label: فنان @ar
alternative label: ……的美术家 @zh-hans
definition: Bir temsilciyi, orijinal bir grafik tasarım, çizim, resim vb. tasarlama ve sıklıkla uygulamaya ilişikin bir temsilcinin sorumluluğunu içeren bir eserle ilişkilendirir. @tr
definition: Correla un agente a un'opera che implica una responsabilità di un agente per la concezione, e spesso per lo sviluppo, di un progetto grafico, disegno, dipinto, etc. originale. @it
definition: Hozzákapcsol egy ágenst egy műhöz, amelyhez hozzátartozik egy ágens felelőssége egy eredeti grafikai terv, rajz, festmény stb. elgondolásáért és gyakran kivitelezéséért is. @hu
definition: Liittää toimijan teokseen, jossa toimija on vastuussa alkuperäisen graafisen suunnitelman, piirroksen, maalauksen tms. luomisesta.
definition: Met un agent en relation avec une œuvre qui comporte une responsabilité de la part d’un agent consistant à concevoir et souvent à réaliser un graphisme, une peinture, un dessin, etc. original. @fr

teoksen haastateltava (toimija) teoksessa
has element type: 2
instruction number: 18.5
toolkit definition: A work that involves a responsibility of an agent for responding to an interviewer, usually a reporter, pollster, or some other kind of agent who gathers information. @en
toolkit definition: Bir görüşmeciye, genellikle bir muhabire, anketöre veya bilgi toplayan başka bir tür temsilciye yanıt verme konusunda bir temsilcinin sorumluluğunu içeren bir çalışma. @tr
toolkit definition: Darbs, kas ietver aģenta atbildību, atbildot uz intervētāja, parasti reportiera, aptaujas organizētāja vai kāda cita informācijas apkopotāja jautājumiem. @lv
toolkit definition: Een werk dat met zich meebrengt een verantwoordelijkheid van een actor voor reageren op een interviewer, verslaggever, opiniepeiler of een andere soort actor die informatie verzamelt. @nl
toolkit definition: Egy mű, amelyhez hozzátartozik egy ágens felelőssége egy interjúkészítőnek, általában riporternek, közvélemény-kutatónak, vagy valamilyen más információgyűjtő ágensnek, adott válaszért. @hu
toolkit definition: Ein Werk, bei dem ein Akteur einer Interviewerin/einem Interviewer antwortet. Dabei handelt es sich normalerweise um eine Reporterin/einen Reporter, eine Meinungsforscherin/einen Meinungsforscher oder anderen Akteur, die/der Informationen zusammenträgt. @de
toolkit definition: Et verk som involverer ansvar for en agent i form av å svare på spørsmål fra en intervjuer, reporter eller annen agent som samler inn informasjon. @no
toolkit definition: Obra que implica una responsabilitat d’un agent responent a un entrevistador, habitualment un periodista, un enquestador o qualsevol altre tipus d’agent que recull la informació. @ca
toolkit definition: Opera che implica una responsabilità di un agente nel rispondere ad intervistatore, solitamente giornalista, sondaggista, o qualche altro genere di un agente che raccoglie informazioni. @it
toolkit definition: Teos, jossa toimija on vastuussa teoksen luomisesta vastaamalla haastattelijalle, tavallisesti toimittajalle, mielipidetutkijalle tai muulle tietoa keräävälle toimijalle.
toolkit definition: Teos, mis sisaldab tegija vastutust intervjueerijale, reporterile, küsitlejale või muule infot koguvale tegijale vastamise eest. @et
toolkit definition: Værk, som involverer en agents ansvar for at besvare spørgsmål fra en interviewer, normalt en journalist, meningsmåler eller en anden form for agent, som indsamler information. @da
toolkit definition: Œuvre qui comporte une responsabilité de la part d’un agent consistant à répondre à un intervieweur, habituellement un reporteur, un sondeur ou un autre type d’agent recueillant de l’information. @fr
toolkit definition: Ένα έργο που περιλαμβάνει την ευθύνη της δημιουργίας [εφόσον ο φορέας] ενεργεί ως αποκρινόμενος στον λαμβάνοντα τη συνέντευξη, συνήθως δημοσιογράφο, δημοσκόπο ή κάποιον άλλον φορέα συλλογής πληροφοριών. @el
toolkit definition: عمل يترتب عليه مسئولية وكيل عن الاستجابة لمحاور، وعادة ما يكون مراسلًا أو مستطلع رأي أو وكيل من نوع آخر يجمع معلومات. @ar
toolkit definition: 涉及回答采访者、记者、民意调查员或其他类型信息搜集行为者的一个行为者的责任的一种作品 @zh-hans
toolkit label: Akteur als Interviewte/Interviewter eines Werks von @de
toolkit label: agent entrevistat d’una obra de @ca
toolkit label: agent interviewé d’une œuvre de @fr
toolkit label: agent, som er interviewperson for værk af @da
toolkit label: eserinin görüşülen temsilcisidir @tr
toolkit label: geïnterviewde actor van werk van @nl
toolkit label: interjúalany ágense a következő műnek: @hu
toolkit label: interviewee agent of work of @en
toolkit label: intervistato agente di opera di @it
toolkit label: intervjueeritav (tegija) teoses @et
toolkit label: intervjuobjekt for verk for (agent) @no
toolkit label: ir intervējamais (aģents) darbā @lv
toolkit label: teoksen haastateltava (toimija) teoksessa
toolkit label: συνεντευξιαζόμενος φορέας του έργου του @el
toolkit label: وكيل ضيف مقابلة في عمل @ar
toolkit label: ……的作品的受访者行为者 @zh-hans
has subproperty: teoksen haastateltava (henkilö) teoksessa
has subproperty: teoksen haastateltava (yhteistoimija) teoksessa
has subproperty: P50193
lexical alias: intervieweeAgentOfWorkOf.en
status: Published
type: Property
domain: C10002
label: er agent, som er interviewperson for værk af @da
label: er intervjuobjekt for verk for (agent) @no
label: eserinin görüşülen temsilcisidir @tr
label: est un agent interviewé d’une œuvre de @fr
label: interjúalany ágense a következő műnek: @hu
label: intervjueeritav (tegija) teoses @et
label: ir intervējamais (aģents) darbā @lv
label: is geïnterviewde actor van werk van @nl
label: is interviewee agent of work of @en
label: ist Akteur als Interviewte/Interviewter eines Werks von @de
label: è intervistato agente di @it
label: és agent entrevistat d’una obra de @ca
label: είναι συνεντευξιαζόμενος φορέας του έργου του @el
label: هو وكيل ضيف مقابلة في عمل لـ @ar
label: 是……的作品的受访者行为者 @zh-hans
sub property of: teoksen tekijä (toimija) teoksessa
alternative label: Interviewter von @de
alternative label: entrevistado de @es
alternative label: entrevistat de @ca
alternative label: haastateltavana haastattelussa
alternative label: interjúalanya: @hu
alternative label: interviewede af @da
alternative label: interviewee of @en
alternative label: interviewé de @fr
alternative label: intervistato di opera di @it
alternative label: intervjueeritav teoses @et
alternative label: intervjuobjekt for verk for @no
alternative label: συνεντευξιαζόμενος του έργου του @el
alternative label: ضيف مقابلة في عمل @ar
alternative label: ……的受访者 @zh-hans
definition: Bir temsilciyi, genellikle bir muhabir, anketör veya bilgi toplayan başka bir tür temsilci ile olan bir görüşmeciye yanıt verme konusunda bir temsilcinin sorumluluğunu içeren bir eserle ilişkilendirir. @tr
definition: Correla un agente a un'opera che implica una responsabilità di un agente nel rispondere a un intervistatore, solitamente giornalista, sondaggista, o qualche altro genere di agente che raccoglie informazioni. @it
definition: Hozzákapcsol egy ágenst egy műhöz, amelyhez hozzátartozik egy ágens felelőssége egy interjúkészítőnek, általában riporternek, közvélemény-kutatónak, vagy valamilyen más információgyűjtő ágensnek, adott válaszért. @hu
definition: Liittää toimijan teokseen, jossa toimija on vastuussa teoksen luomisesta vastaamalla haastattelijalle, tavallisesti toimittajalle, mielipidetutkijalle tai muulle tietoa keräävälle toimijalle.
definition: Met un agent en relation avec une œuvre qui comporte une responsabilité de la part d’un agent consistant à répondre à un intervieweur, habituellement un reporteur, un sondeur ou un autre type d’agent recueillant de l’information. @fr
definition: Relaciona un agent amb una obra que implica una responsabilitat d’un agent responent a un entrevistador, habitualment un periodista, un enquestador o qualsevol altre tipus d’agent que recull la informació. @ca
definition: Relateert een actor aan een werk dat met zich meebrengt een verantwoordelijkheid van een actor voor reageren op een interviewer, verslaggever, opiniepeiler of een andere soort actor die informatie verzamelt. @nl
definition: Relaterer en agent til et verk som involverer ansvar for en agent i form av å svare på spørsmål fra en intervjuer, reporter eller annen agent som samler inn informasjon. @no

koreografi (toimija) teoksessa
has element type: 2
instruction number: 18.5
toolkit definition: A work that involves a responsibility of an agent for creating a choreographic work. @en
toolkit definition: Een werk dat met zich meebrengt een verantwoordelijkheid van een actor voor het creëren van een choreografisch werk. @nl
toolkit definition: Egy mű, amelyhez hozzátartozik egy ágens felelőssége egy koreografikus mű létrehozásáért. @hu
toolkit definition: Ein Werk, bei dem ein Akteur für die Schaffung eines choreografischen Werks verantwortlich ist. @de
toolkit definition: Et koreografisk verk som involverer ansvar for en agent i form av koreografi. @no
toolkit definition: Horeogrāfisks darbs, kas ietver aģenta atbildību par horeogrāfiju. @lv
toolkit definition: Koreograafiline teos, mis sisaldab tegija vastutust koreograafia eest. @et
toolkit definition: Koreografik bir eser oluşturmak için bir temsilcinin sorumluluğunu içeren bir eser. @tr
toolkit definition: Obra que implica una responsabilitat d’un agent en la creació d’una obra coreogràfica. @ca
toolkit definition: Opera coreografica che implica la responsabilità di un agente per la coreografia. @it
toolkit definition: Teos, joka on koreografinen teos, jonka luomisesta toimjia on vastuussa.
toolkit definition: Værk, som involverer en agents ansvar for at skabe et koreografisk værk. @da
toolkit definition: Œuvre qui comporte une responsabilité de la part d’un agent consistant à créer une œuvre chorégraphique. @fr
toolkit definition: Ένα έργο κίνησης που περιλαμβάνει την ευθύνη της δημιουργίας του. @el
toolkit definition: عمل راقص يترتب عليه مسئولية وكيل عن وضع الألحان الراقصة. @ar
toolkit definition: 涉及创作编舞作品的一个行为者的责任的一种作品 @zh-hans
toolkit label: Akteur als Choreografin/Choreograf von @de
toolkit label: agent chorégraphe de @fr
toolkit label: agent coreògraf de @ca
toolkit label: agent, som er koreograf af @da
toolkit label: choreograaf-actor van @nl
toolkit label: choreographer agent of @en
toolkit label: coreografo agente di @it
toolkit label: ir horeogrāfs (aģents) @lv
toolkit label: koreograaf (tegija) teoses @et
toolkit label: koreograf for (agent) @no
toolkit label: koreograf temsilcisi @tr
toolkit label: koreografi (toimija) teoksessa
toolkit label: koreográfus ágense: @hu
toolkit label: χορογράφος φορέας του @el
toolkit label: وكيل مصمم رقصات لـ @ar
toolkit label: ……的编舞者行为者 @zh-hans
has subproperty: koreografi (henkilö) teoksessa
has subproperty: koreografi (yhteistoimija) teoksessa
has subproperty: P50194
lexical alias: choreographerAgentOf.en
status: Published
type: Property
domain: C10002
label: er agent, som er koreograf af @da
label: er koreograf for (agent) @no
label: est un agent chorégraphe de @fr
label: ir horeogrāfs (aģents) @lv
label: is choreograaf-actor van @nl
label: is choreographer agent of @en
label: ist Akteur als Choreografin/Choreograf von @de
label: koreograaf (tegija) teoses @et
label: koreograf temsilcisidir @tr
label: koreográfus ágense a következőnek: @hu
label: è coreografo agente di @it
label: és agent coreògraf de @ca
label: είναι χορογράφος φορέας του @el
label: هو وكيل مصمم رقصات لـ @ar
label: 是……的编舞者行为者 @zh-hans
sub property of: teoksen tekijä (toimija) teoksessa
alternative label: Choreograf von @de
alternative label: choreographer of @en
alternative label: chorégraphe de @fr
alternative label: coreografo di opera di @it
alternative label: coreògraf de @ca
alternative label: coreógrafo de @es
alternative label: koreograaf teoses @et
alternative label: koreograf @tr
alternative label: koreograf af @da
alternative label: koreograf for verk for @no
alternative label: koreografina koreografiassa
alternative label: koreográfusa: @hu
alternative label: χορογράφος του έργου του @el
alternative label: واضع الألحان الراقصة لـ @ar
alternative label: ……的编舞者 @zh-hans
definition: Bir temsilciyi, koreografik bir eser oluşturmaya ilişkin bir temsilcinin sorumluluğunu içeren bir eserle ilişkilendirir. @tr
definition: Correla un agente a un'opera coreografica che implica la responsabilità di un agente per la coreografia. @it
definition: Hozzákapcsol egy ágenst egy műhöz, amelyhez hozzátartozik egy ágens felelőssége egy koreografikus mű létrehozásáért. @hu
definition: Liittää toimijan teokseen, joka on koreografinen teos, jonka luomisesta toimija on vastuussa.
definition: Met un agent en relation avec une œuvre qui comporte une responsabilité de la part d’un agent consistant à créer une œuvre chorégraphique. @fr
definition: Relaciona un agent amb una obra que implica una responsabilitat d’un agent en la creació d’una obra coreogràfica. @ca
definition: Relateert een actor aan een werk dat met zich meebrengt een verantwoordelijkheid van een actor voor het creëren van een choreografisch werk. @nl

kirjoittaja (toimija) teoksessa
has element type: 2
instruction number: 18.5
toolkit definition: A work that involves a responsibility of an agent for creating a textual work. @en
toolkit definition: Darbs, kas ietver aģenta atbildību par tekstuāla darba radīšanu. @lv
toolkit definition: Een werk dat met zich meebrengt een verantwoordelijkheid van een actor voor het creëren van een tekstwerk. @nl
toolkit definition: Egy mű, amelyhez hozzátartozik egy ágens felelőssége egy szöveges mű létrehozásáért. @hu
toolkit definition: Ein Werk, bei dem ein Akteur für die Schaffung eines textlichen Werks verantwortlich ist. @de
toolkit definition: Et verk som involverer ansvar for en agent i form av å skape et tekstlig verk. @no
toolkit definition: Metinsel bir çalışma oluşturmak için bir temsilcinin sorumluluğunu içeren bir eser. @tr
toolkit definition: Obra que implica una responsabilitat d’un agent en la creació d’una obra textual. @ca
toolkit definition: Opera che implica la responsabilità di un agente per la creazione di un'opera testuale. @it
toolkit definition: Tekstiteos, jonka luomisesta toimija on vastuussa.
toolkit definition: Teos, mis sisaldab tegija vastutust tekstteose loomise eest. @et
toolkit definition: Værk, som involverer en agents ansvar for at skabe et tekstværk. @da
toolkit definition: Œuvre qui comporte une responsabilité de la part d’un agent consistant à créer une œuvre textuelle. @fr
toolkit definition: Ένα έργο το οποίο είναι κυρίως κειμενικό ως προς το περιεχόμενο, ανεξάρτητα από τον τύπο του μέσου μετάδοσης ή το γένος/είδος [και] το οποίο περιλαμβάνει την ευθύνη της δημιουργίας του. @el
toolkit definition: عمل يترتب عليه مسئولية وكيل عن إنشاء عمل نصي. @ar
toolkit definition: 涉及创作一种文字作品的一个行为者的责任的一种作品 @zh-hans
toolkit label: Akteur als Verfasserin/Verfasser von @de
toolkit label: agent auteur de @fr
toolkit label: agent autor de @ca
toolkit label: agent, som er forfatter af @da
toolkit label: auteur-actor van @nl
toolkit label: author agent of @en
toolkit label: autore agente di @it
toolkit label: forfatter av (agent) @no
toolkit label: ir autors (aģents) @lv
toolkit label: kirjoittaja (toimija) teoksessa
toolkit label: szerző ágense: @hu
toolkit label: tekstteose autor (tegija) teoses @et
toolkit label: yazar temsilcisi @tr
toolkit label: συγγραφέας φορέας του @el
toolkit label: وكيل مؤلف @ar
toolkit label: ……的著者行为者 @zh-hans
has subproperty: käsikirjoittaja (toimija) teoksessa
has subproperty: sanoittaja (toimija) teoksessa
has subproperty: libretisti (toimija) teoksessa
has subproperty: kokousten raportoija (toimija) teoksessa
has subproperty: kirjoittaja (henkilö) teoksessa
has subproperty: kirjoittaja (yhteistoimija) teoksessa
has subproperty: P50195
lexical alias: authorAgentOf.en
status: Published
type: Property
domain: C10002
label: er agent, som er forfatter af @da
label: er forfatter av (agent) @no
label: est un agent auteur de @fr
label: ir autors (aģents) @lv
label: is auteur-actor van @nl
label: is author agent of @en
label: ist Akteur als Verfasserin/Verfasser von @de
label: szerző ágense a következőnek: @hu
label: tekstteose autor (tegija) teoses @et
label: yazar temsilcisidir @tr
label: è autore agente di @it
label: és agent autor de @ca
label: είναι συγγραφέας φορέας του @el
label: هو وكيل مؤلف لـ @ar
label: 是……的著者行为者 @zh-hans
sub property of: teoksen tekijä (toimija) teoksessa
alternative label: Verfasser von @de
alternative label: auteur de @fr
alternative label: author of @en
alternative label: autor de @ca
alternative label: autor teoses @et
alternative label: autore di @it
alternative label: forfatter af @da
alternative label: forfatter av @no
alternative label: kirjoittajana teoksessa
alternative label: szerzője: @hu
alternative label: tekstteose autor teoses @et
alternative label: yazar @tr
alternative label: συγγραφέας του @el
alternative label: مؤلف @ar
alternative label: ……的著者 @zh-hans
definition: Bir temsilciyi, metinsel bir eser oluşturmaya ilişkin bir temsilcinin sorumluluğunu içeren bir eserle ilişkilendirir. @tr
definition: Correla un agente a un'opera che implica la responsabilità di un agente per la creazione di un'opera testuale. @it
definition: Hozzákapcsol egy ágenst egy műhöz, amelyhez hozzátartozik egy ágens felelőssége egy szöveges mű létrehozásáért. @hu

arkkitehti (toimija) teoksessa
has element type: 2
instruction number: 18.5
toolkit definition: A work that involves a responsibility of an agent for creating an architectural design, including a pictorial representation intended to show how a building or other structure will look when completed. @en
toolkit definition: Bir binanın veya başka bir yapının tamamlandığında nasıl görüneceğini göstermeyi amaçlayan görsel bir temsil de dahil olmak üzere, bir temsilcinin mimari bir tasarım oluşturma sorumluluğunu içeren bir çalışma. @tr
toolkit definition: Darbs, kas ietver aģenta atbildību par arhitektūras projekta radīšanu, ieskaitot projekta skici, lai parādītu, kā ēka vai cita struktūra izskatīsies, kad tā tiks pabeigta. @lv
toolkit definition: Een werk dat met zich meebrengt een verantwoordelijkheid van een actor voor het creëren van een architectonisch ontwerp, omvattende een picturale representatie bedoeld te laten zien hoe een gebouw of andere structuur er na voltooiing uit zal zien. @nl
toolkit definition: Egy mű, amelyhez hozzátartozik egy ágens felelőssége egy építészeti terv létrehozásáért, beleértve egy képi reprezentációt, amely bemutatja, hogy egy épület vagy más szerkezet hogyan fog kinézni, amikor elkészül. @hu
toolkit definition: Ein Werk, bei dem ein Akteur für die Schaffung eines architektonischen Entwurfs verantwortlich ist, einschließlich einer bildlichen Darstellung, die zeigt, wie ein Gebäude oder eine andere Konstruktion nach der Fertigstellung aussehen soll. @de
toolkit definition: Et verk som involverer ansvar for en agent i form av arkitekturdesign, inkludert en billedlig representasjon som er ment å vise hvordan en bygning eller annen struktur vil se ut når den er fullført. @no
toolkit definition: Obra que implica una responsabilitat d’un agent en la creació d’un disseny arquitectònic, inclosa una representació il·lustrada concebuda per mostrar com serà un edifici o qualsevol altra estructura una vegada complet. @ca
toolkit definition: Opera che implica la responsabilità di un agente nella creazione di un progetto architettonico, inclusa una rappresentazione pittorica destinata a mostrare come apparirà un edificio o altra struttura una volta completato. @it
toolkit definition: Teos, jossa toimija on vastuussa arkkitehtisuunnitelman luomisesta, mukaan lukien kuvaesityksestä, jonka tarkoitus on näyttää, miltä rakennus tai muu rakennelma näyttää valmiina.
toolkit definition: Teos, mis sisaldab tegija vastutust arhitektuurse kujunduse loomise eest, k.a pildiline esitus näitamaks, kuidas ehitis või muu konstruktsioon valmides välja hakkab nägema. @et
toolkit definition: Værk, som involverer en agents ansvar for at skabe et arkitektonisk design, inkl. en billedrepræsentation, som skal vise, hvordan en bygning eller anden struktur vil se ud, når den er færdig. @da
toolkit definition: Œuvre qui comporte une responsabilité de la part d’un agent consistant à créer une conception architecturale, y compris une représentation illustrée conçue pour montrer à quoi ressemblera un bâtiment ou une autre structure une fois la construction terminée. @fr
toolkit definition: Ένα έργο που περιλαμβάνει την ευθύνη της δημιουργίας ενός αρχιτεκτονικού σχεδίου, περιλαμβανομένης μιας οπτικής αναπαράστασης, με στόχο να δείξει π.χ., την όψη του κτηρίου όταν αυτό θα έχει ολοκληρωθεί. @el
toolkit definition: عمل يترتب عليه مسئولية وكيل عن إنشاء تصميم معماري، ويشمل ذلك إعداد عرض تصويري يبين كيف سيبدو المبنى أو أي بناء آخر عند اكتماله. @ar
toolkit definition: 涉及建筑设计（包括用于展示建筑或其他结构完成之后外观效果的绘画作品）创作的一个行为者的责任的一种作品 @zh-hans
toolkit label: Akteur als Architektin/Architekt von @de
toolkit label: agent architecte de @fr
toolkit label: agent arquitecte de @ca
toolkit label: agent, som er arkitekt af @da
toolkit label: architect agent of @en
toolkit label: architect-actor van @nl
toolkit label: architetto agente di @it
toolkit label: arhitekt (tegija) teoses @et
toolkit label: arkitekt for (agent) @no
toolkit label: arkkitehti (toimija) teoksessa
toolkit label: ir arhitekts (aģents) @lv
toolkit label: mimar temsilci @tr
toolkit label: építész ágense: @hu
toolkit label: αρχιτέκτων φορέας του @el
toolkit label: وكيل مهندس معماري @ar
toolkit label: ……的建筑设计师行为者 @zh-hans
has subproperty: maisema-arkkitehti (toimija) teoksessa
has subproperty: arkkitehti (henkilö) teoksessa
has subproperty: arkkitehti (yhteistoimija) teoksessa
has subproperty: P50196
lexical alias: architectAgentOf.en
status: Published
type: Property
domain: C10002
label: arhitekt (tegija) teoses @et
label: er agent, som er arkitekt af @da
label: er arkitekt for (agent) @no
label: est un agent architecte de @fr
label: ir arhitekts (aģents) @lv
label: is architect agent of @en
label: is architect-actor van @nl
label: ist Akteur als Architektin/Architekt von @de
label: mimar temsilcisidir @tr
label: è architetto agente di @it
label: építész ágense a következőnek: @hu
label: és agent arquitecte de @ca
label: είναι αρχιτέκτων φορέας του @el
label: هو وكيل مهندس معماري لـ @ar
label: 是……的建筑设计师行为者 @zh-hans
sub property of: teoksen tekijä (toimija) teoksessa
alternative label: Architekt von @de
alternative label: architect of @en
alternative label: architecte de @fr
alternative label: architetto di @it
alternative label: arhitekt teoses @et
alternative label: arkitekt af @da
alternative label: arkitekt for @no
alternative label: arkkitehtinä teoksessa
alternative label: arquitecte de @ca
alternative label: arquitecto de @es
alternative label: mimar @tr
alternative label: építésze: @hu
alternative label: αρχιτέκτων του @el
alternative label: مهندس معماري @ar
alternative label: ……的建筑设计师 @zh-hans
definition: Bir temsilciyi, bir binanın veya başka bir yapının tamamlandığında nasıl görüneceğini göstermeyi amaçlayan resimli bir sunum da dahil olmak üzere, bir mimari tasarım oluşturmaya ilişkin bir temsilcinin sorumluluğunu içeren bir eserle ilişkilendirir. @tr
definition: Correla un agente a un'opera che implica la responsabilità di un agente nella creazione di un progetto architettonico, inclusa una rappresentazione pittorica destinata a mostrare come apparirà un edificio o altra struttura una volta completato. @it
definition: Hozzákapcsol egy ágenst egy műhöz, amelyhez hozzátartozik egy ágens felelőssége egy építészeti terv létrehozásáért, beleértve egy képi reprezentációt, amely bemutatja, hogy egy épület vagy más szerkezet hogyan fog kinézni, amikor elkészül. @hu
definition: Liittää toimijan teokseen, jossa toimija on vastuussa arkkitehtisuunnitelman luomisesta, mukaan lukien kuvaesityksestä, jonka tarkoitus on näyttää, miltä rakennus tai muu rakennelma näyttää valmiina.
definition: Met un agent en relation avec une œuvre qui comporte une responsabilité de la part d’un agent en ce qui concerne une conception architecturale, y compris une représentation illustrée conçue pour montrer à quoi ressemblera un bâtiment ou une autre structure une fois la construction terminée. @fr
definition: Relaciona un agent amb una obra que implica una responsabilitat d’un agent en la creació d’un disseny arquitectònic, inclosa una representació il·lustrada concebuda per mostrar com serà un edifici o qualsevol altra estructura una vegada complet. @ca

elokuvantekijä (toimija) teoksessa
has element type: 2
instruction number: 18.5
toolkit definition: A work that involves a responsibility of an agent for creating an independent or personal film. @en
toolkit definition: Bağımsız veya kişisel bir film yaratmak için bir temsilcinin sorumluluğunu içeren bir çalışma. @tr
toolkit definition: Darbs, kas ietver aģenta atbildību par neatkarīgas vai privātas filmas veidošanu un izpildi visos aspektos. @lv
toolkit definition: Een werk dat met zich meebrengt een verantwoordelijkheid van een actor voor het creëren van een zelfstandige of persoonlijke film. @nl
toolkit definition: Ein Werk, bei dem ein Akteur für die Schaffung eines unabhängigen oder privaten Films verantwortlich ist. @de
toolkit definition: Et verk som involverer ansvar for en agent i form av å skape en uavhengig eller personlig film. @no
toolkit definition: Obra que implica una responsabilitat d’un agent en la creació d’una pel·lícula cinematogràfica independent o personal. @ca
toolkit definition: Opera che implica la responsabilità di un agente per un film indipendente o personale. @it
toolkit definition: Teos, jossa toimija on vastuussa riippumattoman tai henkilökohtaisen elokuvan luomisesta.
toolkit definition: Teos, mis sisaldab tegija vastutust sõltumatu või autorifilmi eest. @et
toolkit definition: Værk, som involverer en agents ansvar for en indiefilm eller personlig film. @da
toolkit definition: filmkészítője: @hu
toolkit definition: Œuvre qui comporte une responsabilité de la part d’un agent consistant à créer un film indépendant ou personnel. @fr
toolkit definition: Ένα έργο που περιλαμβάνει την ευθύνη της δημιουργίας ενός ανεξάρτητου ή προσωπικού φιλμ. @el
toolkit definition: عمل يترتب عليه مسئولية وكيل عن فيلم مستقل أو شخصي. @ar
toolkit definition: 涉及创作一部独立或个人电影的一个行为者的责任的一种作品 @zh-hans
toolkit label: Akteur als Filmemacherin/Filmemacher von @de
toolkit label: Egy mű, amelyhez hozzátartozik egy ágens felelőssége egy független- vagy magánfilm létrehozásáért. @hu
toolkit label: agent cineasta de @ca
toolkit label: agent cinéaste de @fr
toolkit label: agent, som er filmskaber af @da
toolkit label: elokuvantekijä (toimija) teoksessa
toolkit label: film üreticisi temsilcisi @tr
toolkit label: filmitegija (tegija) teoses @et
toolkit label: filmmaker agent of @en
toolkit label: filmmaker-actor van @nl
toolkit label: filmskaper av (agent) @no
toolkit label: ir filmas veidotājs (aģents) @lv
toolkit label: regista cinematografico agente di @it
toolkit label: σκηνοθέτης φορέας του @el
toolkit label: وكيل صانع أفلام @ar
toolkit label: ……的制片人行为者 @zh-hans
has subproperty: elokuvantekijä (henkilö) teoksessa
has subproperty: elokuvantekijä (yhteistoimija) teoksessa
has subproperty: P50197
lexical alias: filmmakerAgentOf.en
status: Published
type: Property
domain: C10002
label: er agent, som er filmskaber af @da
label: er filmskaper av (agent) @no
label: est un agent cinéaste de @fr
label: film üreticisi temsilcisidir @tr
label: filmitegija (tegija) teoses @et
label: filmkészítő ágense a következőnek: @hu
label: ir filmas veidotājs (aģents) @lv
label: is filmmaker agent of @en
label: is filmmaker-actor van @nl
label: ist Akteur als Filmemacherin/Filmemacher von @de
label: è regista cinematografico agente di @it
label: és agent cineasta de @ca
label: είναι σκηνοθέτης φορέας του @el
label: هو وكيل صانع أفلام لـ @ar
label: 是……的制片人行为者 @zh-hans
sub property of: teoksen tekijä (toimija) teoksessa
alternative label: Egy filmkészítő egyénileg felelős egy film koncepciójáért és összes aspektusának végrehajtásáért. @hu
alternative label: Filmemacherin/Filmemacher von @de
alternative label: cineasta de @ca
alternative label: cinéaste de @fr
alternative label: elokuvantekijänä teoksessa
alternative label: film üreticisi @tr
alternative label: filmitegija teoses @et
alternative label: filmmaker of @en
alternative label: filmskaber af @da
alternative label: filmskaper av @no
alternative label: regista cinematografico di @it
alternative label: σκηνοθέτης του @el
alternative label: صانع أفلام @ar
alternative label: ……的制片人 @zh-hans
definition: Bir temsilciyi, bağımsız veya kişisel bir film yaratma sorumluluğunu içeren bir eserle ilişkilendirir. @tr
definition: Correla un agente a un'opera che implica la responsabilità di un agente per un film indipendente o personale. @it
definition: Hozzákapcsol egy ágenst egy műhöz, amelyhez hozzátartozik egy ágens felelőssége egy független- vagy magánfilm létrehozásáért. @hu
definition: Liittää toimijan teokseen, jossa toimija on vastuussa riippumattoman tai henkilökohtaisen elokuvan luomisesta.
definition: Met un agent en relation avec une œuvre qui comporte une responsabilité de la part d’un agent consistant à créer un film indépendant ou personnel. @fr
definition: Relaciona un agent amb una obra que implica una responsabilitat d’un agent en la creació d’una pel·lícula cinematogràfica independent o personal. @ca
definition: Relateert een actor aan een werk dat met zich meebrengt een verantwoordelijkheid van een actor voor het creëren van een zelfstandige of persoonlijke film. @nl
definition: Relaterer en agent til et verk som involverer ansvar for en agent i form av å skape en uavhengig eller personlig film. @no

lavastussuunnittelija (toimija) ekspressiossa
has element type: 2
instruction number: 18.5
toolkit definition: An expression that includes a contribution by an agent of designing the overall visual appearance of a moving image production. @en
toolkit definition: Een expressie die omvat een bijdrage door een actor door ontwerpen van het totale visuele uiterlijk van een bewegend beeld-productie. @nl
toolkit definition: Egy kifejezési forma, amely magában foglalja egy tervező ágens közreműködését egy mozgókép-produkció általános vizuális megjelenésében. @hu
toolkit definition: Eine Expression, zu der ein Akteur beiträgt, indem er für die Gestaltung des gesamten visuellen Erscheinungsbilds einer Bewegtbildproduktion verantwortlich ist. @de
toolkit definition: Ekspressio, johon toimija osallistuu suunnittelemalla liikkuvan kuvan tuotannon visuaalisen kokonaisilmeen.
toolkit definition: Espressione che include un contributo da parte di un agente nella progettazione dell'aspetto visivo complessivo di una produzione di immagini in movimento. @it
toolkit definition: Et uttrykk som inkluderer et bidrag fra en agent i form av å designe det generelle visuelle uttrykket til en produksjon med levende bilder. @no
toolkit definition: Expression qui intègre une contribution de la part d’un agent consistant à concevoir l’aspect visuel global d’une production d’images animées. @fr
toolkit definition: Expressió que inclou una contribució d’un agent dissenyant l’aparença visual general d’una producció d’imatge en moviment. @ca
toolkit definition: Hareketli bir görüntü prodüksiyonunun genel görsel görünümünün tasarlanmasında bir temsilcinin katkısını içeren bir anlatım. @tr
toolkit definition: Izteiksme, kas ietver aģenta ieguldījumu, izstrādājot kustīga attēla vispārējo vizuālo izskatu. @lv
toolkit definition: Udtryk, som omfatter en agents bidrag ved at designe en levende billedproduktions overordnede visuelle udtryk. @da
toolkit definition: Väljendus, millesse tegija on andnud panuse, kujundades liikuvast pildist koosneva produktsiooni visuaalse üldilme. @et
toolkit definition: Μια έκφραση που ενσωματώνει τη συνεισφορά του συνολικού σχεδιασμού της οπτικής εμφάνισης μιας παραγωγής κινητής εικόνας. @el
toolkit definition: تعبيرة تتضمن إسهام وكيل في تصميم الصورة المرئية العامة لإنتاج أفلام. @ar
toolkit definition: 包括设计动态图像制作整体视觉效果的一个行为者的贡献的一种内容表达 @zh-hans
toolkit label: Akteur als Szenenbildnerin/Szenenbildner von @de
toolkit label: agent chef décorateur de @fr
toolkit label: agent dissenyador de producció de @ca
toolkit label: agent, som er produktionsdesigner af @da
toolkit label: designer di produzione agente di @it
toolkit label: ir filmas scenogrāfs (aģents) @lv
toolkit label: kunstnik-lavastaja (tegija) väljenduses @et
toolkit label: lavastussuunnittelija (toimija) ekspressiossa
toolkit label: látványtervező ágense: @hu
toolkit label: productieontwerper-actor van @nl
toolkit label: production designer agent of @en
toolkit label: produksjonsdesigner for (agent) @no
toolkit label: Üretim tasarımcı temsilcisi @tr
toolkit label: σχεδιαστής παραγωγής φορέας του @el
toolkit label: وكيل مصمم إنتاج @ar
toolkit label: ……的制作设计者行为者 @zh-hans
has subproperty: lavastussuunnittelija (henkilö) ekspressiossa
has subproperty: lavastussuunnittelija (yhteistoimija) ekspressiossa
has subproperty: P50198
lexical alias: productionDesignerAgentOf.en
status: Published
type: Property
domain: C10002
label: er agent, som er produktionsdesigner af @da
label: er produksjonsdesigner for (agent) @no
label: est un agent chef décorateur de @fr
label: ir filmas scenogrāfs (aģents) @lv
label: is productieontwerper-actor van @nl
label: is production designer agent of @en
label: ist Akteur als Szenenbildnerin/Szenenbildner von @de
label: kunstnik-lavastaja (tegija) väljenduses @et
label: látványtervező ágense a következőnek: @hu
label: yapım tasarımcısı temsilcisidir @tr
label: è designer di produzione agente di @it
label: és agent dissenyador de producció de @ca
label: είναι σχεδιαστής παραγωγής φορέας του @el
label: هو وكيل مصمم إنتاج لـ @ar
label: 是……的制作设计者行为者 @zh-hans
sub property of: esitykseen osallinen toimija ekspressiossa
alternative label: Szenenbildner von @de
alternative label: chef décorateur de @fr
alternative label: designer di produzione di @it
alternative label: diseñador de producción de @es
alternative label: dissenyador de producció de @ca
alternative label: kunstnik-lavastaja väljenduses @et
alternative label: lavastussuunnittelijana produktiossa
alternative label: látványtervezője: @hu
alternative label: production designer of @en
alternative label: produksjonsdesigner for @no
alternative label: produktionsdesigner af @da
alternative label: Üretim tasarımcısı @tr
alternative label: σχεδιαστής παραγωγής του @el
alternative label: مصمم إنتاج @ar
alternative label: ……的制作设计者 @zh-hans
definition: Bir temsilciyi, hareketli bir görüntü yapımının genel görsel görünümünü tasarlayan bir temsilcinin katkısını içeren bir anlatımıla ilişkilendirir. @tr
definition: Correla un agente a un'espressione che include un contributo da parte di un agente nella progettazione dell'aspetto visivo complessivo di una produzione di immagini in movimento. @it
definition: Hozzákapcsol egy ágenst egy kifejezési formához, amely magában foglalja egy tervező ágens közreműködését egy mozgókép-produkció általános vizuális megjelenésében. @hu
definition: Liittää toimijan ekspressioon, johon toimija osallistuu suunnittelemalla liikkuvan kuvan tuotannon visuaalisen kokonaisilmeen.
definition: Met un agent en relation avec une expression qui intègre une contribution de la part d’un agent consistant à concevoir l’aspect visuel global d’une production d’images animées. @fr
definition: Relaciona un agent amb una expressió que inclou una contribució d’un agent dissenyant l’aparença visual general d’una producció d’imatge en moviment. @ca
definition: Relateert een actor aan een expressie die omvat een bijdrage door een actor door ontwerpen van het totale visuele uiterlijk van een bewegend beeld-productie. @nl

jakelija (toimija) manifestaatiossa
has element type: 2
toolkit definition: A manifestation that involves a responsibility of an agent for distribution. @en
toolkit definition: Dağıtım için bir temsilcinin sorumluluğunu içeren bir gösterim. @tr
toolkit definition: Een manifestatie die met zich meebrengt een verantwoordelijkheid van een actor voor distributie. @nl
toolkit definition: Egy megjelenési forma, amelyhez hozzátartozik egy ágens felelőssége a terjesztésért. @hu
toolkit definition: Eine Manifestation, bei der ein Akteur für den Vertrieb verantwortlich ist. @de
toolkit definition: En manifestasjon som involverer ansvar for en agent i form av distribusjon. @no
toolkit definition: Kehastus, mis sisaldab tegija vastutust levitamise eest. @et
toolkit definition: Manifestaatio, jonka jakelusta toimija on vastuussa.
toolkit definition: Manifestació que implica una responsabilitat d’un agent en la distribució. @ca
toolkit definition: Manifestation qui comporte une responsabilité de la part d’un agent en ce qui concerne la diffusion ou la distribution. @fr
toolkit definition: Manifestation, som involverer en agents ansvar for distribution. @da
toolkit definition: Manifestazione che implica la responsabilità di un agente nella distribuzione. @it
toolkit definition: Manifestācija, kas ietver aģenta atbildību par izplatīšanu. @lv
toolkit definition: Μια εκδήλωση η οποία διανέμεται. @el
toolkit definition: تجسيدة تنطوي على مسئولية وكيل عن التوزيع. @ar
toolkit definition: 涉及发行的一个行为者的责任的一种载体表现 @zh-hans
toolkit label: Akteur als Vertrieb von @de
toolkit label: agent diffuseur ou distributeur de @fr
toolkit label: agent distribuïdor de @ca
toolkit label: agent, som er distributør af @da
toolkit label: dağıtıcı temsilci @tr
toolkit label: distributeur-actor van @nl
toolkit label: distributor agent of @en
toolkit label: distributore agente di @it
toolkit label: distributør av (agent) @no
toolkit label: ir izplatītājs (aģents) @lv
toolkit label: jakelija (toimija) manifestaatiossa
toolkit label: levitaja (tegija) kehastuses @et
toolkit label: terjesztő ágense: @hu
toolkit label: διανομέας φορέας του @el
toolkit label: وكيل موزع @ar
toolkit label: ……的发行者行为者 @zh-hans
has subproperty: elokuvan jakelija (toimija) manifestaatiossa
has subproperty: jakelija (henkilö) manifestaatiossa
has subproperty: jakelija (yhteistoimija) manifestaatiossa
has subproperty: P50199
lexical alias: distributorAgentOf.en
status: Published
type: Property
domain: C10002
label: dağıtımcı temsilcisidir @tr
label: er agent, som er distributør af @da
label: er distributør av (agent) @no
label: est un agent diffuseur ou distributeur de @fr
label: ir izplatītājs (aģents) @lv
label: is distributeur-actor van @nl
label: is distributor agent of @en
label: ist Akteur als Vertrieb von @de
label: levitaja (tegija) kehastuses @et
label: terjesztő ágense a következőnek: @hu
label: è distributore agente di @it
label: és agent distribuïdor de @ca
label: είναι διανομέας φορέας του @el
label: هو وكيل موزع لـ @ar
label: 是……的发行者行为者 @zh-hans
sub property of: toimijaan liittyvä manifestaatio
alternative label: Vertrieb von @de
alternative label: agente distribuidor de @es
alternative label: dağıtıcı @tr
alternative label: diffuseur ou distributeur de @fr
alternative label: distributor of @en
alternative label: distributore di @it
alternative label: distributør af @da
alternative label: distributør av @no
alternative label: distribuïdor de @ca
alternative label: jakelija aineistossa
alternative label: levitaja kehastuses @et
alternative label: terjesztője: @hu
alternative label: διαθέτης του @el
alternative label: موزع @ar
alternative label: ……的发行者 @zh-hans
definition: Bir temsilciyi, dağıtma için sorumluluğunu içeren bir gösterimle ilişkilendirir. @tr
definition: Correla un agente a una manifestazione che implica la responsabilità di un agente nella distribuzione. @it
definition: Hozzákapcsol egy ágenst egy megjelenési formához, amelyhez hozzátartozik egy ágens felelőssége a terjesztésért. @hu
definition: Liittää toimijan manifestaatioon, jonka jakelusta toimija on vastuussa.
definition: Met un agent en relation avec une manifestation qui comporte une responsabilité de la part d’un agent en ce qui concerne la diffusion ou la distribution. @fr
definition: Relaciona un agent amb una manifestació que implica una responsabilitat d’un agent en la distribució. @ca
definition: Relateert een actor aan een manifestatie die met zich meebrengt een verantwoordelijkheid van een actor voor distributie. @nl

julkaisemattoman manifestaation tuottaja (toimija) manifestaatiossa
has element type: 2
toolkit definition: A manifestation that involves a responsibility of an agent for inscribing, fabrication, construction, etc. @en
toolkit definition: Een manifestatie die met zich meebrengt een verantwoordelijkheid van een actor voor afschrijven, fabriceren, construeren etc. @nl
toolkit definition: Egy megjelenési forma, amelyhez hozzátartozik egy ágens íráshoz, összeállításhoz, készítéshez stb. fűződő felelőssége. @hu
toolkit definition: Eine Manifestation, bei der ein Akteur für das Gravieren, Fabrizieren, Konstruieren oder eine andere Herstellungsmethode verantwortlich ist. @de
toolkit definition: En manifestasjon som involverer ansvar for en agent i form av inskripsjon, fabrikasjon, konstruksjon, etc. @no
toolkit definition: Julkaisematon manifestaatio, jossa toimija on vastuussa kaiverruksesta, valmistuksesta, kokoonpanosta tms.
toolkit definition: Kehastus, mis sisaldab tegija vastutust inskribeerimise, tootmise, ehitamise vms eest. @et
toolkit definition: Manifestació que implica una responsabilitat d’un agent en la inscripció, la fabricació, la construcció, etc. @ca
toolkit definition: Manifestation qui comporte une responsabilité de la part d’un agent en ce qui concerne la scription, la fabrication, la construction, etc. @fr
toolkit definition: Manifestation, som involverer en agents ansvar for indskrift, fremstilling, konstruktion etc. @da
toolkit definition: Manifestazione che implica la responsabilità di un agente nella scrittura, fabbricazione, costruzione, etc. @it
toolkit definition: Manifestācija, kas ietver aģenta atbildību par pierakstīšanu, izgatavošanu, radīšanu u.tml. @lv
toolkit definition: Yazma, üretim, yapım vb. için bir temsilcinin sorumluluğunu içeren bir gösterim. @tr
toolkit definition: Μια εκδήλωση η οποία εγγράφεται, κατασκευάζεται, δομείται κ.λπ. @el
toolkit definition: تجسيدة تنطوي على مسئولية وكيل عن الكتابة، التصنيع، البنية، إلخ. @ar
toolkit definition: 涉及镌刻、制造、构建等的一个行为者的责任的一种载体表现 @zh-hans
toolkit label: Akteur als Erzeugerin/Erzeuger einer unveröffentlichten Manifestation von @de
toolkit label: agent producteur d’une manifestation non publiée de @fr
toolkit label: agent productor d’una manifestació no publicada de @ca
toolkit label: agent, som er producer af upubliceret manifestation af @da
toolkit label: avaldamata kehastuse tootja (tegija) kehastuses @et
toolkit label: előállító ágense a következő kiadatlan megjelenési formának: @hu
toolkit label: ir nepublicētas manifestācijas izgatavotājs (aģents) @lv
toolkit label: julkaisemattoman manifestaation tuottaja (toimija) manifestaatiossa
toolkit label: producer agent of unpublished manifestation of @en
toolkit label: productie-actor van ongepubliceerde manifestatie van @nl
toolkit label: produsent av upublisert manifestasjon av (agent) @no
toolkit label: produttore agente di manifestazione non pubblicata di @it
toolkit label: yayınlanmamış gösterimin yapımcı temsilcisi @tr
toolkit label: παραγωγός φορέας μη δημοσιευμένης εκδήλωσης του @el
toolkit label: وكيل منتج تجسيدة غير منشورة @ar
toolkit label: ……的非出版载体表现的制作者行为者 @zh-hans
has subproperty: julkaisemattoman manifestaation tuottaja (henkilö) manifestaatiossa
has subproperty: julkaisemattoman manifestaation tuottaja (yhteistoimja) manifestaatiossa
has subproperty: P50200
lexical alias: producerAgentOfUnpublishedManifestationOf.en
status: Published
type: Property
domain: C10002
label: avaldamata kehastuse tootja (tegija) kehastuses @et
label: előállító ágense a következő kiadatlan megjelenési formának: @hu
label: er agent, som er producer af upubliceret manifestation af @da
label: er produsent av upublisert manifestasjon av (agent) @no
label: est un agent producteur d’une manifestation non publiée de @fr
label: ir nepublicētas manifestācijas izgatavotājs (aģents) @lv
label: is producent-actor van ongepubliceerde manifestatie van @nl
label: is producer agent of unpublished manifestation of @en
label: ist Akteur als Erzeugerin/Erzeuger einer unveröffentlichten Manifestation von @de
label: yayınlanmamış gösteriminin yapımcı temsilcisidir @tr
label: è produttore agente di manifestazione non pubblicata @it
label: és agent productor d’una manifestació no publicada de @ca
label: είναι παραγωγός φορέας μη δημοσιευμένης εκδήλωσης του @el
label: هو وكيل منتج تجسيدة غير منشورة لـ @ar
label: 是……的非出版载体表现的制作者行为者 @zh-hans
sub property of: manifestaation tekijä (toimija) manifestaatiossa
alternative label: Erzeuger einer unveröffentlichten Manifestation von @de
alternative label: avaldamata kehastuse tootja kehastuses @et
alternative label: előállítója a következő kiadatlan megjelenési formának: @hu
alternative label: producer af upubliceret manifestation af @da
alternative label: producer of unpublished manifestation of @en
alternative label: producteur d’une manifestation non publiée de @fr
alternative label: productor de manifestación inédita de @es
alternative label: productor d’una manifestació no publicada de @ca
alternative label: produsent av upublisert manifestasjon av @no
alternative label: produttore di manifestazione non pubblicata di @it
alternative label: tuottajana julkaisemattomassa aineistossa
alternative label: yayınlanmamış gösterimin yapımcısı @tr
alternative label: παραγωγός μη δημοσιευμένης εκδήλωσης του @el
alternative label: منتج تجسيدة غير منشورة @ar
alternative label: ……的非出版载体表现的制作者 @zh-hans
definition: Bir temsilciyi, yazma, üretme, ve yapma vb. sorumluluğunu içeren bir gösterimle ilişkilendirir @tr
definition: Correla un agente a una manifestazione che implica la responsabilità di un agente nella scrittura, fabbricazione, costruzione, etc. @it
definition: Hozzákapcsol egy ágenst egy megjelenési formához, amelyhez hozzátartozik egy ágens íráshoz, összeállításhoz, készítéshez stb. fűződő felelőssége. @hu
definition: Liittää toimijan julkaisemattomaan manifestaatioon, jossa toimija on vastuussa kaiverruksesta, valmistuksesta, kokoonpanosta tms.
definition: Met un agent en relation avec une manifestation qui comporte une responsabilité de la part d’un agent en ce qui concerne la scription, la fabrication, la construction, etc. @fr
definition: Relaciona un agent amb una manifestació que implica una responsabilitat d’un agent en la inscripció, la fabricació, la construcció, etc. @ca
definition: Relateert een actor aan een manifestatie die met zich meebrengt een verantwoordelijkheid van een actor voor afschrijven, fabriceren, construeren etc. @nl
definition: Relaterer en agent til en manifestasjon som involverer ansvar for en agent i form av inskripsjon, fabrikasjon, konstruksjon, etc. @no

tuottaja (toimija) teoksessa
has element type: 2
toolkit definition: A work that involves a responsibility of an agent for most of the business aspects of a production for screen, sound recording, television, webcast, etc. @en
toolkit definition: Darbs, kas ietver aģenta atbildību par filmas, mūzikas ierakstu, televīzijas, tīmekļa pārraižu u.tml. biznesa aspektiem. @lv
toolkit definition: Een werk dat met zich meebrengt een verantwoordelijkheid van een actor voor het merendeel van de zakelijke aspecten van een productie voor scherm, geluidsopname, televisie, webcast etc. @nl
toolkit definition: Ein Werk, bei dem ein Akteur für die meisten geschäftlichen Aspekte einer Produktion für die Leinwand, für eine Tonaufnahme, für das Fernsehen, für einen Webcast und so weiter verantwortlich ist. @de
toolkit definition: Ekran, ses kaydı, televizyon, web yayını vb. için bir prodüksiyonun ticari yönlerinin çoğu için bir temsilcinin sorumluluğunu içeren bir eser. @tr
toolkit definition: Et verk som involverer ansvar for en agent i form av de fleste forretningsmessige aspektene ved en produksjon for film eller fjernsyn, lydinnspilling, webcast, etc. @no
toolkit definition: Obra que implica una responsabilitat d’un agent en la majoria dels aspectes comercials d’una producció d’una pel·lícula, d’un enregistrament sonor, d’un programa de televisió, d’una emissió web, etc. @ca
toolkit definition: Opera che implica la responsabilità di un agente per gran parte degli aspetti commerciali si una produzione per video, registrazione sonora, televisione, web cast, etc. @it
toolkit definition: Teos, jossa toimija on vastuussa suurimmasta osasta elokuva-, äänite-, televisio-, suoratoisto- tms. tuotannon liiketoiminnallisista tehtävistä.
toolkit definition: Teos, mis sisaldab tegija vastutust enamiku äriliste aspektide eest filmide, helisalvestiste, telesaadete, veebiülekannete jms tootmisel. @et
toolkit definition: Værk, som involverer en agents ansvar for størstedelen af de forretningsmæssige aspekter ved en produktion beregnet til lærred, lydoptagelse, tv, webcast etc. @da
toolkit definition: producere: @hu
toolkit definition: Œuvre qui comporte une responsabilité de la part d’un agent en ce qui concerne la majeure partie des aspects commerciaux de la production d’un film, d’un enregistrement audio, d’une émission de télévision, d’une webémission, etc. @fr
toolkit definition: Ένα έργο που περιλαμβάνει την ευθύνη για τις περισσότερες επιχειρηματικές πτυχές μιας παραγωγής επί της οθόνης, ηχογράφησης, τηλεοπτικής, διαδικτυακής εκπομπής κ.λπ. @el
toolkit definition: عمل يترتب عليه مسئولية وكيل عن معظم جوانب العمل في إنتاج للشاشة، وللتسجيل الصوتي، وللتلفزيون، وللبث عبر الإنترنت، إلخ. @ar
toolkit definition: 涉及对银幕、录音、电视、网络直播等制作的大部分商业运作的一个行为者的责任的一种作品 @zh-hans
toolkit label: Akteur als Produzentin/Produzent von @de
toolkit label: Egy mű, amelyhez hozzátartozik egy ágens felelőssége képernyőre kerülő műsor, hangfelvétel, televíziós, webes közvetítés, stb. legtöbb üzleti vonatkozásáért. @hu
toolkit label: agent producteur de @fr
toolkit label: agent productor de @ca
toolkit label: agent, som er producer af @da
toolkit label: ir producents (aģents) @lv
toolkit label: producent-actor van @nl
toolkit label: producer agent of @en
toolkit label: produsent for (agent) @no
toolkit label: produtsent (tegija) teoses @et
toolkit label: produttore agente di @it
toolkit label: tuottaja (toimija) teoksessa
toolkit label: yapımcı temsilcisi @tr
toolkit label: παραγωγός φορέας του @el
toolkit label: وكيل منتج @ar
toolkit label: ……的制作者行为者 @zh-hans
has subproperty: elokuvatuottaja (toimija) teoksessa
has subproperty: radiotuottaja (toimija) teoksessa
has subproperty: televisiotuottaja (toimija) teoksessa
has subproperty: äänituottaja (toimija) teoksessa
has subproperty: tuottaja (henkilö) teoksessa
has subproperty: tuottaja (yhteistoimija) teoksessa
has subproperty: P50201
lexical alias: producerAgentOf.en
status: Published
type: Property
domain: C10002
label: er agent, som er producer af @da
label: er produsent for (agent) @no
label: est un agent producteur de @fr
label: ir producents (aģents) @lv
label: is producent-actor van @nl
label: is producer agent of @en
label: ist Akteur als Produzentin/Produzent von @de
label: producer ágense a következőnek: @hu
label: produtsent (tegija) teoses @et
label: yapımcı temsilcisidir @tr
label: è produttore agente di @it
label: és agent productor de @ca
label: είναι παραγωγός φορέας του @el
label: هو وكيل منتج لـ @ar
label: 是……的制作者行为者 @zh-hans
sub property of: teoksen tekijä (toimija) teoksessa
alternative label: Egy producer általában felelős az adománygyűjtésért, a produkció irányításáért, a kulcsfontosságú személyzet felvételéért, a forgalmazók megszervezéséért stb. @hu
alternative label: Produzent von @de
alternative label: producer af @da
alternative label: producer of @en
alternative label: producteur de @fr
alternative label: productor de @ca
alternative label: produsent for @no
alternative label: produtsent teoses @et
alternative label: produttore di @it
alternative label: tuottajana teoksessa
alternative label: yapımcı @tr
alternative label: παραγωγός του @el
alternative label: منتج @ar
alternative label: ……的制作者 @zh-hans
definition: Bir temsilciyi, ekran, ses kaydı, televizyon, web yayını vb. içerikli yapımın ticari yönlerinin çoğuna ilişkin bir temsilcinin sorumluluğunu içeren bir eserle ilişkilendirir. @tr
definition: Correla un agente a un'opera che implica la responsabilità di un agente per la maggior parte degli aspetti commerciali di una produzione per la proiezione, registrazione del suono, televisione, trasmissione via web, etc. @it
definition: Hozzákapcsol egy ágenst egy műhöz, amelyhez hozzátartozik egy ágens felelőssége képernyőre kerülő műsor, hangfelvétel, televíziós, webes közvetítés, stb. legtöbb üzleti vonatkozásáért. @hu
definition: Liittää toimijan teokseen, jossa toimija on vastuussa suurimmasta osasta elokuva-, äänite-, televisio-, suoratoisto- tms. tuotannon liiketoiminnallisista tehtävistä.
definition: Met un agent en relation avec une œuvre qui comporte une responsabilité de la part d’un agent en ce qui concerne la majeure partie des aspects commerciaux de la production d’un film, d’un enregistrement audio, d’une émission de télévision, d’une webémission, etc. @fr

valmistaja (toimija) manifestaatiossa
has element type: 2
toolkit definition: A manifestation that involves a responsibility of an agent for printing, duplicating, casting, etc. @en
toolkit definition: Basım, çoğaltma, rol dağıtımı vb. için bir temsilcinin sorumluluğunu içeren bir gösterim. @tr
toolkit definition: Een manifestatie die met zich meebrengt een verantwoordelijkheid van een actor voor drukken, vermenigvuldigen, gieten etc. @nl
toolkit definition: Egy megjelenési forma, amelyhez hozzátartozik egy ágens felelőssége a nyomtatásért, sokszorosításért, öntésért, stb. @hu
toolkit definition: Eine Manifestation, bei der ein Akteur für den Druck, die Vervielfältigung, den Guss und so weiter verantwortlich ist. @de
toolkit definition: En manifestasjon som involverer ansvar for en agent i form av trykking, mangfoldiggjøring, støping, etc. @no
toolkit definition: Kehastus, mis sisaldab tegija vastutust trükkimise, paljundamise, valamise vms eest. @et
toolkit definition: Manifestaatio, jonka painamisesta, monistamisesta, kirjasinten valamisesta tms. toimija on vastuussa.
toolkit definition: Manifestació que implica una responsabilitat d’un agent en la impressió, la reproducció, el modelat, etc. @ca
toolkit definition: Manifestation qui comporte une responsabilité de la part d’un agent en ce qui concerne l’impression, la reproduction, le moulage, etc. @fr
toolkit definition: Manifestation, som involverer en agents ansvar for trykning, duplikering, støbning etc. @da
toolkit definition: Manifestazione che implica la responsabilità di un agente per la stampa, duplicazione, fusione, etc. @it
toolkit definition: Manifestācija, kas ietver aģenta atbildību par iespiešanu, pavairošanu u.tml. @lv
toolkit definition: Μια εκδήλωση η οποία εκτυπώνεται, αντιγράφεται, χυτεύεται κ.λπ. @el
toolkit definition: تجسيدة من جانب وكيل تنطوي على مسئولية عن الطباعة أو النسخ أو الصب أو ما إلى ذلك. @ar
toolkit definition: 涉及印刷、复制、铸造等的一个行为者的责任的一种载体表现 @zh-hans
toolkit label: Akteur als Herstellerin/Hersteller von @de
toolkit label: agent fabricant de @ca
toolkit label: agent, som er producent af @da
toolkit label: costruttore agente di @it
toolkit label: gyártó ágense: @hu
toolkit label: ir ražotājs (aģents) @lv
toolkit label: manufacturer agent of @en
toolkit label: tilvirker av (agent) @no
toolkit label: valmistaja (tegija) kehastuses @et
toolkit label: valmistaja (toimija) manifestaatiossa
toolkit label: vervaardiger-actor van @nl
toolkit label: üretici temsilcisi @tr
toolkit label: κατασκευαστής φορέας του @el
toolkit label: وكيل مُصنع @ar
toolkit label: ……的生产者行为者 @zh-hans
has subproperty: pistekirjoituksen tekijä (toimija) manifestaatiossa
has subproperty: painaja (toimija) manifestaatiossa
has subproperty: valmistaja (henkilö) manifestaatiossa
has subproperty: valmistaja (yhteistoimija) manifestaatiossa
has subproperty: P50202
lexical alias: manufacturerAgentOf.en
status: Published
type: Property
domain: C10002
label: er agent, som er producent af @da
label: er tilvirker av (agent) @no
label: est un agent fabricant de @fr
label: gyártó ágense a következőnek: @hu
label: ir ražotājs (aģents) @lv
label: is manufacturer agent of @en
label: is vervaardiger-actor van @nl
label: ist Akteur als Herstellerin/Hersteller von @de
label: valmistaja (tegija) kehastuses @et
label: è costruttore agente di @it
label: és agent fabricant de @ca
label: üretici temsilcisidir @tr
label: είναι κατασκευαστής φορέας του @el
label: هو وكيل مُصّنع لـ @ar
label: 是……的生产者行为者 @zh-hans
sub property of: toimijaan liittyvä manifestaatio
alternative label: Hersteller von @de
alternative label: costruttore di @it
alternative label: fabricant de @ca
alternative label: fabricante de @es
alternative label: gyártója: @hu
alternative label: manufacturer of @en
alternative label: producent af @da
alternative label: tilvirker av @no
alternative label: valmistaja kehastuses @et
alternative label: valmistajana aineistossa
alternative label: üreticisi @tr
alternative label: κατασκευαστής του @el
alternative label: مُصنِّع @ar
alternative label: ……的生产者 @zh-hans
definition: Bir temsilciyi, basım, çoğaltma, döküm vb. gibi sorumluluk içeren bir gösterim ile ilişkilendirir. @tr
definition: Correla un agente a una manifestazione che implica la responsabilità di un agente per la stampa, duplicazione, fusione, etc. @it
definition: Hozzákapcsol egy ágenst egy megjelenési formához, amelyhez hozzátartozik egy ágens felelőssége a nyomtatásért, sokszorosításért, öntésért, stb. @hu
definition: Liittää toimijan manifestaatioon, jonka painamisesta, monistamisesta, kirjasinten valamisesta tms. toimija on vastuussa.
definition: Met un agent en relation avec une manifestation qui comporte une responsabilité de la part d’un agent en ce qui concerne l’impression, la reproduction, le moulage, etc. @fr
definition: Relaciona un agent amb una manifestació que implica una responsabilitat d’un agent en la impressió, la reproducció, el modelat, etc. @ca
definition: Relateert een actor aan een manifestatie die met zich meebrengt een verantwoordelijkheid van een actor voor drukken, vermenigvuldigen, gieten etc. @nl
definition: Relaterer en agent til en manifestasjon som involverer ansvar for en agent i form av trykking, mangfoldiggjøring, støping, etc. @no

kustantaja (toimija) manifestaatiossa
has element type: 2
toolkit definition: A manifestation that involves a responsibility of an agent for publishing, releasing, or issuing. @en
toolkit definition: Een manifestatie die met zich meebrengt een verantwoordelijkheid van een actor voor uitgeven, uitbrengen of uitvaardigen. @nl
toolkit definition: Egy megjelenési forma, amelyhez hozzátartozik egy ágens felelőssége közzétételért, kiadásért vagy kibocsátásért. @hu
toolkit definition: Eine Manifestation, bei der ein Akteur für das Veröffentlichen, die Freigabe oder die Herausgabe verantwortlich ist. @de
toolkit definition: En manifestasjon som involverer ansvar for en agent i form av publisering, tilgjengeliggjøring eller utgivelse. @no
toolkit definition: Kehastus, mis sisaldab tegija vastutust avaldamise, väljalaskmise või väljaandmise eest. @et
toolkit definition: Manifestaatio, jonka kustantamisesta, julkaisemisesta tai ilmestymisestä toimija on vastuussa.
toolkit definition: Manifestació que implica una responsabilitat d’un agent en la publicació, la posada en circulació o l’emissió. @ca
toolkit definition: Manifestation qui comporte une responsabilité de la part d’un agent en ce qui concerne la publication, la mise à disposition ou l’édition. @fr
toolkit definition: Manifestation, som involverer en agents ansvar for publicering, frigivelse eller udgivelse. @da
toolkit definition: Manifestazione che implica la responsabilità di un agente per la pubblicazione, distribuzione o emissione. @it
toolkit definition: Manifestācija, kas ietver aģenta atbildību par publicēšanu, izlaišanu vai izdošanu. @lv
toolkit definition: Yayınlama veya piyasaya sürmek için bir temsilcinin sorumluluğunu içeren bir gösterim. @tr
toolkit definition: Μια εκδήλωση η οποία δημοσιεύεται, κυκλοφορεί ή εκδίδεται. @el
toolkit definition: تجسيدة تنطوي على مسئولية وكيل عن النشر، أو التحرير، أو الإصدار. @ar
toolkit definition: 涉及出版、发布或发行的一个行为者的责任的一种载体表现 @zh-hans
toolkit label: Akteur als Verlag von @de
toolkit label: agent editor de @ca
toolkit label: agent éditeur de @fr
toolkit label: agent, som er udgiver af @da
toolkit label: editore agente di @it
toolkit label: ir izdevējs (aģents) @lv
toolkit label: kiadó ágense: @hu
toolkit label: kirjastaja (tegija) kehastuses @et
toolkit label: kustantaja (toimija) manifestaatiossa
toolkit label: publisher agent of @en
toolkit label: uitgever-actor van @nl
toolkit label: utgiver av (agent) @no
toolkit label: yayıncı temsilcisi @tr
toolkit label: εκδότης φορέας του @el
toolkit label: وكيل ناشر @ar
toolkit label: ……的出版者行为者 @zh-hans
has subproperty: lähetyksestä vastaava toimija manifestaatiossa
has subproperty: kustantaja (henkilö) manifestaatiossa
has subproperty: kustantaja (yhteistoimija) manifestaatiossa
has subproperty: P50203
lexical alias: publisherAgentOf.en
status: Published
type: Property
domain: C10002
label: er agent, som er udgiver af @da
label: er utgiver av (agent) @no
label: est un agent éditeur de @fr
label: ir izdevējs (aģents) @lv
label: is publisher agent of @en
label: is uitgever-actor van @nl
label: ist Akteur als Verlag von @de
label: kiadó ágense a következőnek: @hu
label: kirjastaja (tegija) kehastuses @et
label: yayıncı temsilcisidir @tr
label: è editore agente di @it
label: és agent editor de @ca
label: είναι εκδότης φορέας του @el
label: هو وكيل ناشر لـ @ar
label: 是……的出版者行为者 @zh-hans
sub property of: manifestaation tekijä (toimija) manifestaatiossa
alternative label: Verlag von @de
alternative label: editor de @ca
alternative label: editore di @it
alternative label: editorial de @es
alternative label: kiadója: @hu
alternative label: kirjastaja kehastuses @et
alternative label: kustantajana aineistossa
alternative label: publisher of @en
alternative label: udgiver af @da
alternative label: utgiver av @no
alternative label: yayımcısı @tr
alternative label: éditeur de @fr
alternative label: εκδότης του @el
alternative label: ناشر @ar
alternative label: ……的出版者 @zh-hans
definition: Bir temsilciyi, bir temsilcinin yayınlama, piyasaya sürme ve çıkarma sorumluluğunu içeren bir gösterimle ilişkilendirir. @tr
definition: Correla un agente a una manifestazione che implica la responsabilità di un agente per la pubblicazione, distribuzione o emissione. @it
definition: Hozzákapcsol egy ágenst egy megjelenési formához, amelyhez hozzátartozik egy ágens felelőssége közzétételért, kiadásért vagy kibocsátásért. @hu
definition: Liittää toimijan manifestaatioon, jonka kustantamisesta, julkaisemisesta tai ilmestymisestä toimija on vastuussa.
definition: Met un agent en relation avec une manifestation qui comporte une responsabilité de la part d’un agent en ce qui concerne la publication, la mise à disposition ou l’édition. @fr
definition: Relaciona un agent amb una manifestació que implica una responsabilitat d’un agent en la publicació, la posada en circulació o l’emissió. @ca
definition: Relateert een actor aan een manifestatie die met zich meebrengt een verantwoordelijkheid van een actor voor uitgeven, uitbrengen of uitvaardigen. @nl

teoksen tekijä (toimija) teoksessa
has element type: 2
toolkit definition: A work that involves a responsibility of an agent for creation. @en
toolkit definition: Bir temsilcinin yaratım sorumluluğunu içeren bir eser. @tr
toolkit definition: Darbs, kas ietver aģenta atbildību par radīšanu. @lv
toolkit definition: Een werk dat met zich meebrengt een verantwoordelijkheid van een actor voor creatie. @nl
toolkit definition: Egy mű, amelyhez hozzátartozik egy ágens felelőssége a létrehozásért. @hu
toolkit definition: Ein Werk, bei dem ein Akteur für dessen Schaffung verantwortlich ist. @de
toolkit definition: Et verk som involverer ansvar for en agent i form av skapelse. @no
toolkit definition: Obra que implica una responsabilitat d’un agent en la creació. @ca
toolkit definition: Opera che che implica una responsabilità di un agente per la creazione. @it
toolkit definition: Teos, jonka luomisesta toimija on vastuussa.
toolkit definition: Teos, mis sisaldab tegija vastutust teose loomise eest. @et
toolkit definition: Værk, som involverer en agents ansvar for skabelse. @da
toolkit definition: Œuvre qui comporte une responsabilité de la part d’un agent en ce qui concerne la création. @fr
toolkit definition: Ένα έργο που περιλαμβάνει την ευθύνη ενός φορέα για τη δημιουργία. @el
toolkit definition: عمل يترتب عليه مسئولية وكيل عن الإنشاء. @ar
toolkit definition: 涉及创作的一个行为者的责任的一种作品 @zh-hans
toolkit label: Akteur als geistige Schöpferin/geistiger Schöpfer eines Werks von @de
toolkit label: agent creador d’una obra de @ca
toolkit label: agent créateur d’une œuvre de @fr
toolkit label: agent, som er ophav til værk af @da
toolkit label: creator agent of work of @en
toolkit label: creatore agente di opera di @it
toolkit label: eserin yaratıcı temsilcisi @tr
toolkit label: ir radītājs (aģents) darbam @lv
toolkit label: létrehozó ágense a következő műnek: @hu
toolkit label: maker-actor van werk van @nl
toolkit label: opphaver for verk for (agent) @no
toolkit label: teoksen tekijä (toimija) teoksessa
toolkit label: teose autor (tegija) teoses @et
toolkit label: δημιουργός φορέας του έργου του @el
toolkit label: وكيل منشئ عمل @ar
toolkit label: ……的作品的创作者行为者 @zh-hans
has subproperty: ohjelmoija (toimija) teoksessa
has subproperty: designer (toimija) teoksessa
has subproperty: teoksen kartantekijä (toimija) teoksessa
has subproperty: teoksen säveltäjä (toimija) musiikkiteoksessa
has subproperty: keksijä (toimija) teoksessa
has subproperty: teoksen valokuvaaja (toimija) teoksessa
has subproperty: teoksen haastattelija (toimija) teoksessa
has subproperty: taiteilija (toimija) teoksessa
has subproperty: teoksen haastateltava (toimija) teoksessa
has subproperty: koreografi (toimija) teoksessa
has subproperty: kirjoittaja (toimija) teoksessa
has subproperty: arkkitehti (toimija) teoksessa
has subproperty: elokuvantekijä (toimija) teoksessa
has subproperty: tuottaja (toimija) teoksessa
has subproperty: uudelleenmiksaaja (toimija) teoksessa
has subproperty: roolittaja (toimija) teoksessa
has subproperty: aggregaattori (toimija) teoksessa
has subproperty: teoksen tekijä (henkilö) teoksessa
has subproperty: teoksen tekijä (yhteistoimija) teoksessa
has subproperty: muodostaja (toimija) kokoelmalle
has subproperty: P50204
lexical alias: creatorAgentOfWorkOf.en
status: Published
type: Property
domain: C10002
label: er agent, som er ophav til værk af @da
label: er opphaver for verk for (agent) @no
label: eserinin yaratıcı temsilcisidir @tr
label: est un agent créateur d’une œuvre de @fr
label: ir radītājs (aģents) darbam @lv
label: is creator agent of work of @en
label: is maker-actor van werk van @nl
label: ist Akteur als geistige Schöpferin/geistiger Schöpfer eines Werks von @de
label: létrehozó ágense a következő műnek: @hu
label: teose autor (tegija) teoses @et
label: è creatore agente di @it
label: és agent creador d’una obra de @ca
label: είναι δημιουργός φορέας του έργου του @el
label: هو وكيل منشئ عمل @ar
label: 是……的作品的创作者行为者 @zh-hans
sub property of: toimijaan liittyvä teos
alternative label: Geistige Schöpferin/Geistiger Schöpfer von @de
alternative label: creador de @ca
alternative label: creator of @en
alternative label: creatore di opera di @it
alternative label: créateur de @fr

ohjaaja (toimija) teoksessa
has element type: 2
instruction number: 18.5
toolkit definition: A work that involves a responsibility of an agent for the general management and supervision of a filmed performance, a radio or television program, etc. @en
toolkit definition: Darbs, kas ietver aģenta atbildību par vispārējo vadību un par filmētā materiāla, radio vai televīzijas raidījuma, u.tml. uzraudzību. @lv
toolkit definition: Een werk dat met zich meebrengt een verantwoordelijkheid van een actor voor het algemene beheer en toezicht van een gefilmde uitvoering, een radio- of televisieprogramma etc. @nl
toolkit definition: Egy mű, amelyhez hozzátartozik egy ágens felelőssége egy filmforgatás, egy rádió- vagy televízióműsor, stb. általános menedzseléséért és felügyeletéért. @hu
toolkit definition: Ein Werk, bei dem ein Akteur für das allgemeine Management und die Leitung einer verfilmten Darbietung, einer Hörfunk- oder Fernsehsendung und so weiter verantwortlich ist. @de
toolkit definition: Et verk som involverer ansvar for en agent i form av generell ledelse av en filmet forestilling, et radio- eller fjernsynsprogram, etc. @no
toolkit definition: Filme alınmış bir performansın, bir radyo veya televizyon programı vb. genel yönetimi ve denetimi için bir temsilcinin sorumluluğunda olan bir eser. @tr
toolkit definition: Manifestazione che implica la responsabilità di un agente per la gestione e supervisione generale di un'interpretazione filmata, programma radio o televisivo, etc. @it
toolkit definition: Obra que implica una responsabilitat d’un agent en la gestió general i la supervisió d’una actuació filmada, d’un programa radiofònic o de televisió, etc. @ca
toolkit definition: Teos, jossa toimija on vastuussa elokuvatun esityksen, radio- tai televisio-ohjelman tms. yleisestä johtamisesta.
toolkit definition: Teos, mis sisaldab tegija vastutust filmitava etenduse, raadio- või telesaate vms üldise juhtimise ja juhendamise eest. @et
toolkit definition: Værk, som involverer en agents ansvar for den generelle ledelse af- og tilsyn med en filmoptagelse, et radio- eller tv-program etc. @da
toolkit definition: Œuvre qui comporte une responsabilité de la part d’un agent consistant à assurer la gestion et la supervision générales d’une prestation filmée, d’une émission de radio ou de télévision, etc. @fr
toolkit definition: Ένα έργο που περιλαμβάνει την ευθύνη για τη γενική διαχείριση και εποπτεία μιας κινηματογραφικής παράστασης, ενός ραδιοφωνικού ή τηλεοπτικού προγράμματος κ.λπ. @el
toolkit definition: عمل يترتب عليه مسئولية وكيل عن الإدارة العامة، والإشراف على أداء مصور، أو برنامج إذاعي أو تليفزيوني، إلخ. @ar
toolkit definition: 涉及电影表演、广播或电视节目等的全面管理和监督的一个行为者的责任的一种作品 @zh-hans
toolkit label: Akteur als Regisseurin/Regisseur von @de
toolkit label: agent realitzador de @ca
toolkit label: agent réalisateur de @fr
toolkit label: agent, som er instruktør af @da
toolkit label: director agent of @en
toolkit label: direttore agente di @it
toolkit label: ir režisors (aģents) @lv
toolkit label: ohjaaja (toimija) teoksessa
toolkit label: regisseur-actor van @nl
toolkit label: regissør av (agent) @no
toolkit label: rendező ágense: @hu
toolkit label: režissöör (tegija) teoses @et
toolkit label: yönetmen temsilcisi @tr
toolkit label: σκηνοθέτης φορέας του @el
toolkit label: وكيل مخرج @ar
toolkit label: ……的导演行为者 @zh-hans
has subproperty: elokuvaohjaaja (toimija) teoksessa
has subproperty: radio-ohjaaja (toimija) teoksessa
has subproperty: televisio-ohjaaja (toimija) teoksessa
has subproperty: ohjaaja (henkilö) teoksessa
has subproperty: ohjaaja (yhteistoimija) teoksessa
has subproperty: P50205
lexical alias: directorAgentOf.en
status: Published
type: Property
domain: C10002
label: er agent, som er instruktør af @da
label: er regissør av (agent) @no
label: est un agent réalisateur de @fr
label: ir režisors (aģents) @lv
label: is director agent of @en
label: is regisseur-actor van @nl
label: ist Akteur als Regisseurin/Regisseur von @de
label: rendező ágense a következőnek: @hu
label: režissöör (tegija) teoses @et
label: yönetmen temsilcisidir @tr
label: è direttore agente di @it
label: és agent realitzador de @ca
label: είναι σκηνοθέτης φορέας του @el
label: هو وكيل مخرج لـ @ar
label: 是……的导演行为者 @zh-hans
sub property of: toimijaan liittyvä teos
alternative label: Regisseur von @de
alternative label: director de @es
alternative label: director of @en
alternative label: direttore di @it
alternative label: instruktør af @da
alternative label: ohjaajana taltioinnissa
alternative label: realitzador de @ca
alternative label: regissør av @no
alternative label: rendezője: @hu
alternative label: režissöör teoses @et
alternative label: réalisateur de @fr
alternative label: yönetmeni @tr
alternative label: σκηνοθέτης του @el
alternative label: مخرج @ar
alternative label: ……的导演 @zh-hans
definition: Bir temsilciyi, filme alınmış bir performansın, bir radyo veya televizyon programının vb. genel yönetimi ve denetimine ilişkin bir temsilcinin sorumluluğunu içeren eserle ilişkilendirir. @tr
definition: Correla un agente a una manifestazione che implica la responsabilità di un agente per la gestione e supervisione generale di un'interpretazione filmata, programma radio o televisivo, etc. @it
definition: Hozzákapcsol egy ágenst egy műhöz, amelyhez hozzátartozik egy ágens felelőssége egy filmforgatás, egy rádió- vagy televízióműsor, stb. általános menedzseléséért és felügyeletéért. @hu
definition: Liittää toimijan teokseen, jossa toimija on vastuussa elokuvatun esityksen, radio- tai televisio-ohjelman tms. yleisestä johtamisesta.

kappaleen entisöijä (toimija) kappaleessa
has element type: 2
instruction number: 18.5
toolkit definition: An item that involves a responsibility of an agent for compensation of degradation by bringing it back to a state as close as possible to its original condition using a set of technical, editorial, and intellectual procedures. @en
toolkit definition: Bir takım teknik, editoryal ve entelektüel prosedürler kullanarak orijinal durumuna mümkün olduğunca yakın bir duruma geri getirerek bozulmanın telafisi için bir temsilcinin sorumluluğunu içeren bir kopya. @tr
toolkit definition: Een item dat met zich meebrengt een verantwoordelijkheid van een actor voor compensatie van verval door het terug te brengen in een staat zo dicht mogelijk bij de oorspronkelijke conditie gebruikmakend van een verzameling van technische, redactionele en intellectuele procedures. @nl
toolkit definition: Ein Exemplar, bei dem ein Akteur für die technischen, redaktionellen und intellektuellen Verfahren verantwortlich ist, die darauf abzielen, die Zersetzung eines Exemplars auszugleichen, indem es in einen Zustand zurückversetzt wird, der seiner ursprünglichen Beschaffenheit möglichst nahe kommt. @de
toolkit definition: Eksemplar, mis sisaldab tegija vastutust rea tehniliste, toimetuslike ja intellektuaalsete toimingute eest, mille eesmärk on taastada kahjustatud eksemplari seisund võimalikult originaalseisundi lähedaseks. @et
toolkit definition: Eksemplar, som involverer en agents ansvar for kompensation for nedslidning ved at føre det tilbage til en tilstand, som er så tæt så muligt på sin oprindelige tilstand vha. en række af tekniske, redaktionsmæssige og intellektuelle procedurer. @da
toolkit definition: Et eksemplar som involverer ansvar for en agent for restaurering til en tilstand som er så lik originaltilstanden som mulig ved å kompensere for nedbrytningen av et eksemplar ved hjelp av tekniske og intellektuelle metoder. @no
toolkit definition: Item che implica la responsabilità di un agente nel compensare una degradazione riportandolo a uno stato il più possibile vicino alla sua condizione originale usando un insieme di procedure tecniche, editoriali e intellettuali. @it
toolkit definition: Item qui comporte une responsabilité de la part d’un agent consistant à compenser sa dégradation en le ramenant à un état aussi près que possible de sa condition originelle au moyen d’un ensemble de procédures techniques, éditoriales et intellectuelles. @fr
toolkit definition: Kappale, jossa toimija on vastuussa teknisistä, toimituksellisista ja tiedollisista toimenpiteistä joiden tarkoitus on palauttaa huonokuntoinen kappale mahdollisimman lähelle sen alkuperäistä kuntoa.
toolkit definition: Vienība, kas ietver aģenta atbildību par vienības bojāejas novēršanu, atgriežot to stāvoklī pēc iespējas tuvāk sākotnējam, izmantojot tehnisko, redakcionālo un intelektuālo procedūru kopumu. @lv
toolkit definition: restaurátor ágense a következő példánynak: @hu
toolkit definition: Ítem que implica una responsabilitat d’un agent per la compensació de la seva degradació retornant-lo a un estat que s’aproximi al màxim a la seva condició original usant un conjunt de procediments tècnics, editorials i intel·lectuals. @ca
toolkit definition: Ένα αντίτυπο που υποβάλλεται σε ένα σύνολο τεχνικών, συντακτικών και διανοητικών διαδικασιών που στοχεύουν στην αποκατάσταση της αποδόμησής του επαναφέροντάς το όσο το δυνατόν εγγύτερα στην αρχική του κατάσταση. @el
toolkit definition: مفردة تنطوي على مسئولية وكيل عن التعويض عن تدهور حالتها عن طريق إعادتها إلى حالتها الأصلية قدر المستطاع باستخدام مجموعة من الإجراءات الفنية والتحريرية والمتعلقة بالملكية الفكرية. @ar
toolkit definition: 涉及为弥补损毁而担负一系列技术、编辑和智力操作、使之尽可能恢复到原始状态的一个行为者的责任的一个单件 @zh-hans
toolkit label: Akteur als Restauratorin/Restaurator eines Exemplars von @de
toolkit label: Egy példány, amelyhez hozzátartozik egy ágens felelőssége technikai, szerkesztői és intellektuális eljárások alkalmazásáért, amivel ellensúlyozza egy példány romlását, hogy az eredeti állapotához a lehető legközelebb állítsa azt vissza. @hu
toolkit label: agent restaurador d’un ítem de @ca
toolkit label: agent restaurateur d’un item de @fr
toolkit label: agent, som er konservator af eksemplar af @da
toolkit label: ir restaurators (aģents) vienībai @lv
toolkit label: kappaleen entisöijä (toimija) kappaleessa
toolkit label: konservator av eksemplar av (agent) @no
toolkit label: kopyanın restorasyon uzmanı temsilcisi @tr
toolkit label: restaurator-actor van item van @nl
toolkit label: restauratore agente di item di @it
toolkit label: restaureerija (tegija) eksemplarile @et
toolkit label: restorationist agent of item of @en
toolkit label: συντηρητής φορέας του αντιτύπου του @el
toolkit label: وكيل أخصائي ترميم مفردة @ar
toolkit label: ……的单件的修复者行为者 @zh-hans
has subproperty: kappaleen entisöijä (henkilö) kappaleessa
has subproperty: kappaleen entisöijä (yhteistoimija) kappaleessa
has subproperty: P50206
lexical alias: restorationistAgentOfItemOf.en
status: Published
type: Property
domain: C10002
label: er agent, som er konservator af eksemplar af @da
label: er konservator av eksemplar av (agent) @no
label: est un agent restaurateur d’un item de @fr
label: ir restaurators (aģents) vienībai @lv
label: is restaurator-actor van item van @nl
label: is restorationist agent of item of @en
label: ist Akteur als Restauratorin/Restaurator eines Exemplars von @de
label: kopyasının restorasyon uzmanı temsilcisidir @tr
label: restaureerija (tegija) eksemplarile @et
label: restaurátor ágense a következő példánynak: @hu
label: è restauratore agente di @it
label: és agent restaurador d’un ítem de @ca
label: είναι συντηρητής φορέας του αντιτύπου του @el
label: هو وكيل أخصائي ترميم مفردة لـ @ar
label: 是……的单件的修复者行为者 @zh-hans
sub property of: toimijaan liittyvä kappale
alternative label: Restaurator (Exemplar) von @de
alternative label: ennistaja eksemplarile @et
alternative label: entisöijänä kappaleessa
alternative label: konservator af @da
alternative label: konservator av @no
alternative label: restauracionista de @es
alternative label: restaurador de @ca
alternative label: restaurateur (item) de @fr
alternative label: restauratore di @it
alternative label: restaureerija eksemplarile @et
alternative label: restaurátora: @hu
alternative label: restorasyon uzmanı @tr
alternative label: restorationist of @en
alternative label: συντηρητής του @el
alternative label: أخصائي ترميم @ar
alternative label: ……的修复者 @zh-hans
definition: Bir temsilciyi bir dizi teknik, yayın ve entelektüel prosedür kullanarak orijinal durumuna mümkün olduğunca yakın bir duruma geri getirerek bozulmayı telafi eten temsilcinin sorumluluğunu içeren bir kopyayla ilişkilendirir. @tr
definition: Correla un agente a un item che implica la responsabilità di un agente nel compensare una degradazione riportandolo a uno stato il più possibile vicino alla sua condizione originale usando un insieme di procedure tecniche, editoriali e intellettuali. @it
definition: Hozzákapcsol egy ágenst egy példányhoz, amelyhez hozzátartozik egy ágens felelőssége technikai, szerkesztői és intellektuális eljárások alkalmazásáért, amivel ellensúlyozza egy példány romlását, hogy az eredeti állapotához a lehető legközelebb állítsa azt vissza. @hu
definition: Liittää toimijan kappaleeseen, jossa toimija on vastuussa teknisistä, toimituksellisista ja tiedollisista toimenpiteistä joiden tarkoitus on palauttaa huonokuntoinen kappale mahdollisimman lähelle sen alkuperäistä kuntoa.
definition: Met un agent en relation avec un item qui comporte une responsabilité de la part d’un agent consistant à compenser sa dégradation en le ramenant à un état aussi près que possible de sa condition originelle au moyen d’un ensemble de procédures techniques, éditoriales et intellectuelles. @fr
definition: Relaciona un agent amb un ítem que implica una responsabilitat d’un agent per la compensació de la seva degradació retornant-lo a un estat que s’aproximi al màxim a la seva condició original usant un conjunt de procediments tècnics, editorials i intel·lectuals. @ca

kuvaaja (toimija) teoksessa
has element type: 2
instruction number: 18.5
toolkit definition: A work that involves a responsibility of an agent for capturing images, either electronically or on film or video stock, and often selecting and arranging the lighting. @en
toolkit definition: Darbs, kas ietver aģenta atbildību par attēlu uzņemšanu elektroniski vai uz filmas, vai video un bieži izvēlas, un izvieto apgaismojumu. @lv
toolkit definition: Een werk dat met zich meebrengt een verantwoordelijkheid van een actor voor het vastleggen van beelden, elektronisch of op film- of videomateriaal, en vaak het selecteren en arrangeren van de belichting. @nl
toolkit definition: Ein Werk, bei dem ein Akteur für die Aufzeichnung von Bildern, entweder elektronisch oder auf Film- oder Videomaterial, verantwortlich ist und häufig die Belichtung auswählt und arrangiert. @de
toolkit definition: Elektronik olarak veya film veya video stoğunda görüntü yakalamak ve genellikle aydınlatmayı seçmek ve düzenlemek için bir temsilcinin sorumluluğunu içeren bir çalışma. @tr
toolkit definition: Et verk som involverer ansvar for en agent i form av å filme levende bilder, enten elektronisk eller på film, og ofte valg og arrangement av lyssetting. @no
toolkit definition: Obra que implica una responsabilitat d’un agent en la captura d’imatges, ja sigui electrònicament o sobre pel·lícula o vídeo, i que sovint selecciona i organitza la il·luminació. @ca
toolkit definition: Opera che implica la responsabilità di un agente per l'acquisizione di immagini, elettronicamente o su pellicola o video, e spesso nella scelta e organizzazione dell'illuminazione. @it
toolkit definition: Teos, jossa toimija on vastuussa kuvien tallentamisesta joko sähköisesti tai filmille tai videolle, usein myös valaistuksen valitsemisesta ja järjestämisestä.
toolkit definition: Teos, mis sisaldab tegija vastutust pildi jäädvustamise eest kas elektrooniliselt või filmi- või videolindile ning sageli valgustuse valimise ja ülesseadmise eest. @et
toolkit definition: Værk, som involverer en agents ansvar for at optage billeder, enten elektronisk eller på film eller video, og ofte også for at udvælge og arrangere lyssætningen. @da
toolkit definition: operatőre: @hu
toolkit definition: Œuvre qui comporte une responsabilité de la part d’un agent consistant à capter des images, de manière électronique ou bien sur film ou vidéo, et qui, souvent, choisit et dispose l’éclairage. @fr
toolkit definition: Ένα έργο που περιλαμβάνει την ευθύνη της σύλληψης των εικόνων, είτε ηλεκτρονικά είτε με φιλμ είτε με βίντεο και συχνά της επιλογής και οργάνωσης του φωτισμού. @el
toolkit definition: يربط وكيلا بعمل يترتب عليه مسئولية وكيل عن التقاط الصور، إما إلكترونيًا أو في فيلم أو في مقاطع فيديو، وغالبا ما يكون مسئولا عن اختيار الإضاءة وتوزيعها. @ar
toolkit definition: 涉及通过电子、胶片或视频存储方式摄录影像、且经常负责灯光的选择和布置的一个行为者的责任的一种作品 @zh-hans
toolkit label: Akteur als Kamerafrau/Kameramann von @de
toolkit label: Egy mű, amelyhez hozzátartozik egy ágens felelőssége képek elektronikusan, filmen vagy videoállományon történő rögzítéséért, gyakran a világítás kiválasztásáért és elrendezéséért is. @hu
toolkit label: agent directeur de la photographie de @fr
toolkit label: agent director de fotografia de @ca
toolkit label: agent, som er filmfotograf af @da
toolkit label: agente direttore di fotografia di @it
toolkit label: cameraregisseur-actor van @nl
toolkit label: director agent of photography of @en
toolkit label: filmfotograf for (agent) @no
toolkit label: görüntü yönetmeni temsilcisi @tr
toolkit label: ir kinooperators (aģents) @lv
toolkit label: kuvaaja (toimija) teoksessa
toolkit label: operaator-lavastaja (tegija) teoses @et
toolkit label: διευθυντής φωτογραφίας φορέας του @el
toolkit label: هو وكيل مدير التصوير لـ @ar
toolkit label: ……的摄影指导行为者 @zh-hans
has subproperty: kuvaaja (henkilö) teoksessa
has subproperty: kuvaaja (yhteistoimija) teoksessa
has subproperty: P50207
lexical alias: directorAgentOfPhotographyOf.en
status: Published
type: Property
domain: C10002
label: er agent, som er filmfotograf af @da
label: er filmfotograf for (agent) @no
label: est un agent directeur de la photographie de @fr
label: görüntü yönetmeni temsilcisidir @tr
label: ir kinooperators (aģents) @lv
label: is cameraregisseur-actor van @nl
label: is director agent of photography of @en
label: ist Akteur als Kamerafrau/Kameramann von @de
label: operaator-lavastaja (tegija) teoses @et
label: operatőr ágense a következőnek: @hu
label: è direttore della fotografia agente di @it
label: és agent director de fotografia de @ca
label: είναι διευθυντής φωτογραφίας φορέας του @el
label: هو وكيل مدير التصوير لـ @ar
label: 是……的摄影指导行为者 @zh-hans
sub property of: toimijaan liittyvä teos
alternative label: Egy film operatőrét vezető operatőrnek is nevezik. @hu
alternative label: Kameramann von @de
alternative label: directeur de la photographie de @fr
alternative label: director de fotografia de @ca
alternative label: director de fotografía de @es
alternative label: director of photography of @en
alternative label: direttore di fotografia di @it
alternative label: filmfotograf af @da
alternative label: filmfotograf for @no
alternative label: görüntü yönetmeni @tr
alternative label: kuvaajana teoksessa
alternative label: operaator-lavastaja teoses @et
alternative label: διευθυντής φωτογραφίας του @el
alternative label: ……的摄影指导 @zh-hans
definition: Bir temsilciyi, elektronik olarak veya film ya da video stoğunda görüntü yakalama ve genellikle ışıklandırma seçme ve düzenlemekle görevli bir temsilcinin sorumluluğunu içeren bir eserle ilişkilendirir. @tr
definition: Correla un agente a un'opera che implica la responsabilità di un agente per l'acquisizione di immagini, elettronicamente o su pellicola o video, e spesso nella scelta e organizzazione dell'illuminazione. @it
definition: Hozzákapcsol egy ágenst egy műhöz, amelyhez hozzátartozik egy ágens felelőssége képek elektronikusan, filmen vagy videoállományon történő rögzítéséért, gyakran a világítás kiválasztásáért és elrendezéséért is. @hu
definition: Liittää toimijan teokseen, jossa toimija on vastuussa kuvien tallentamisesta joko sähköisesti tai filmille tai videolle, usein myös valaistuksen valitsemisesta ja järjestämisestä.
definition: Met un agent en relation avec une œuvre qui comporte une responsabilité de la part d’un agent consistant à capter des images, de manière électronique ou bien sur film ou vidéo, et qui, souvent, choisit et dispose l’éclairage. @fr
definition: Relaciona un agent amb una obra que implica una responsabilitat d’un agent en la captura d’imatges, ja sigui electrònicament o sobre pel·lícula o vídeo, i que sovint selecciona i organitza la il·luminació. @ca
definition: Relateert een actor aan een werk dat met zich meebrengt een verantwoordelijkheid van een actor voor het vastleggen van beelden, elektronisch of op film- of videomateriaal, en vaak het selecteren en arrangeren van de belichting. @nl
definition: Relaterer en agent til et verk som involverer ansvar for en agent i form av å filme levende bilder, enten elektronisk eller på film, og ofte valg og arrangement av lyssetting. @no

teoksen omistuksen kohde (toimija) teoksessa
has element type: 2
instruction number: 18.5
toolkit definition: A work that involves a responsibility of an agent for being commemorated. @en
toolkit definition: Bir temsilcinin anılma sorumluluğunu içeren bir eser. @tr
toolkit definition: Darbs, kas ietver aģenta atbildību par tai adresēto veltījumu. @lv
toolkit definition: Een werk dat met zich meebrengt een verantwoordelijkheid van een actor om herdacht te worden. @nl
toolkit definition: Egy mű, amely magában foglalja egy ágensnek azt a felelősségét, amiért megemlékeznek róla. @hu
toolkit definition: Ein Werk, das einem Akteur gewidmet ist. @de
toolkit definition: Et verk som involverer ansvar for en agent i form av å bli minnet. @no
toolkit definition: Obra que implica una responsabilitat d’un agent de ser commemorat. @ca
toolkit definition: Opera che implica la responsabilità di un agente per essere commemorato. @it
toolkit definition: Teos, joka on omistettu toimijalle.
toolkit definition: Teos, mis on tegijale pühendatud. @et
toolkit definition: Værk, som involverer en agents ansvar for at blive fejret. @da
toolkit definition: Œuvre qui comporte une responsabilité de la part d’un agent consistant à être commémoré. @fr
toolkit definition: Ένα έργο το οποίο είναι αφιερωμένο σε έναν φορέα. @el
toolkit definition: يربط وكيلا بعمل يترتب عليه مسئولية وكيل عن الاحتفال بذكراه. @ar
toolkit definition: 涉及被纪念的一个行为者的责任的一种作品 @zh-hans
toolkit label: Akteur als Widmungsempfängerin/Widmungsempfänger eines Werks von @de
toolkit label: agent dedicatari d’una obra de @ca
toolkit label: agent dédicataire d’une œuvre de @fr
toolkit label: agent som et verk er dedikert til @no
toolkit label: agent, som er tilegnet i værk af @da
toolkit label: dedicatario agente di opera di @it
toolkit label: dedicatee agent of work of @en
toolkit label: dedikált ágense a következő műnek: @hu
toolkit label: eserin adandığı temsilci @tr
toolkit label: ir veltījuma adresāts (aģents) darbā @lv
toolkit label: opgedragene-actor van work van @nl
toolkit label: teoksen omistuksen kohde (toimija) teoksessa
toolkit label: teose pühenduse saaja (tegija) teoses @et
toolkit label: αποδέκτης αφιέρωσης φορέας του έργου του @el
toolkit label: هو وكيل مُهدى إليه لـ @ar
toolkit label: ……的作品的被题献者行为者 @zh-hans
has subproperty: teoksen omistuksen kohde (henkilö) teoksessa
has subproperty: teoksen omistuksen kohde (yhteistoimija) teoksessa
has subproperty: P50208
lexical alias: dedicateeAgentOfWorkOf.en
status: Published
type: Property
domain: C10002
label: dedikált ágense a következő műnek: @hu
label: er agent som et verk er dedikert til @no
label: er agent, som er tilegnet i værk af @da
label: eserinin ithaf edilen temsilcisidir @tr
label: est un agent dédicataire d’une œuvre de @fr
label: ir veltījuma adresāts (aģents) darbā @lv
label: is dedicatee agent of work of @en
label: is opgedragene-actor van work van @nl
label: ist Akteur als Widmungsempfängerin/Widmungsempfänger eines Werks von @de
label: teose pühenduse saaja (tegija) teoses @et
label: è dedicatario di opera agente di @it
label: és agent dedicatari d’una obra de @ca
label: είναι αποδέκτης αφιέρωσης φορέας του έργου του @el
label: هو وكيل مُهدى إليه عمل لـ @ar
label: 是……的作品的被题献者行为者 @zh-hans
sub property of: toimijaan liittyvä teos
alternative label: Widmungsempfänger von @de
alternative label: adanmış @tr
alternative label: dedicatari de @ca
alternative label: dedicatario de @es
alternative label: dedicatario di un'opera di @it
alternative label: dedicatee of @en
alternative label: dedikeret til @da
alternative label: dedikáltja: @hu
alternative label: dédicataire de @fr
alternative label: omistuskirjoituksen kohteena teoksessa
alternative label: teose pühenduse saaja teoses @et
alternative label: verk dedikert til @no
alternative label: αποδέκτης αφιέρωσης του έργου του @el
alternative label: مُهدى إليه @ar
alternative label: ……的被题献者 @zh-hans
definition: Bir temsilciyi, bir temsilcinin anılma sorumluluğunu içeren bir eserle ilişkilendirir. @tr
definition: Correla un agente a un'opera che implica la responsabilità di un agente per essere commemorato. @it
definition: Hozzákapcsol egy ágenst egy műhöz, amely magában foglalja egy ágensnek azt a felelősségét, amiért megemlékeznek róla. @hu
definition: Liittää toimijan teokseen, joka on omistettu toimijalle.
definition: Met un agent en relation avec une œuvre qui comporte une responsabilité de la part d’un agent consistant à être commémoré. @fr
definition: Relaciona un agent amb una obra que implica una responsabilitat d’un agent de ser commemorat. @ca
definition: Relateert een actor aan een werk dat met zich meebrengt een verantwoordelijkheid van een actor om herdacht te worden. @nl

vastaanottaja (toimija) teoksessa
has element type: 2
instruction number: 18.5
toolkit definition: A work or a portion of a work that is addressed to an agent. @en
toolkit definition: Bir temsilciye hitap eden bir eser veya eserin bir bölümü. @tr
toolkit definition: Darbs vai darba daļa, kas adresēta aģentam. @lv
toolkit definition: Een werk of een deel van een werk dat is gericht aan een actor. @nl
toolkit definition: Egy ágensnek címzett mű, vagy műrészlet. @hu
toolkit definition: Ein Werk oder ein Teil eines Werks, das an einen Akteur adressiert ist. @de
toolkit definition: Et verk eller en del av et verk som er adressert til en agent. @no
toolkit definition: Obra o una part d’una obra que s’adreça a un agent. @ca
toolkit definition: Opera o una porzione di un'opera indirizzata a un agente. @it
toolkit definition: Teos tai teoksen osa, joka on osoitettu toimijalle.
toolkit definition: Teos või teose osa, mis on adresseeritud tegijale. @et
toolkit definition: Værk eller en del af et værk, som er adresseret til en agent. @da
toolkit definition: Œuvre ou portion d’œuvre qui est adressée à un agent. @fr
toolkit definition: Ένα έργο ή μέρος ενός έργου το οποίο απευθύνεται σε έναν φορέα. @el
toolkit definition: يربط وكيلا بعمل أو بجزء من عمل مرسل إلى وكيل. @ar
toolkit definition: 要被一个行为者接受的一种作品或作品的一部分 @zh-hans
toolkit label: Akteur als Adressatin/Adressat von @de
toolkit label: addressee agent of @en
toolkit label: adressaat (tegija) teoses @et
toolkit label: adressat for (agent) @no
toolkit label: agent destinataire de @fr
toolkit label: agent destinatari de @ca
toolkit label: agent, som er adressat af @da
toolkit label: címzett ágense: @hu
toolkit label: destinatrio agente di @it
toolkit label: geadresseerde actor van @nl
toolkit label: ir adresāts (aģents) @lv
toolkit label: muhatap temsilci @tr
toolkit label: vastaanottaja (toimija) teoksessa
toolkit label: παραλήπτης φορέας του @el
toolkit label: هو وكيل مرسل إليه لـ @ar
toolkit label: ……的接受者行为者 @zh-hans
has subproperty: vastaanottaja (henkilö) teoksessa
has subproperty: vastaanottaja (yhteistoimija) teoksessa
has subproperty: P50209
lexical alias: addresseeAgentOf.en
status: Published
type: Property
domain: C10002
label: adressaat (tegija) teoses @et
label: címzett ágense a következőnek: @hu
label: er adressat for (agent) @no
label: er agent, som er adressat af @da
label: est un agent destinataire de @fr
label: ir adresāts (aģents) @lv
label: is addressee agent of @en
label: is geadresseerde actor van @nl
label: ist Akteur als Adressatin/Adressat von @de
label: muhatap temsilcisidir @tr
label: è destinatario agente di @it
label: és agent destinatari de @ca
label: είναι παραλήπτης φορέας του @el
label: هو وكيل مرسل إليه لـ @ar
label: 是……的接受者行为者 @zh-hans
sub property of: toimijaan liittyvä teos
alternative label: Adressat von @de
alternative label: addressee of @en
alternative label: adressaat teoses @et
alternative label: adressat for @no
alternative label: címzettje: @hu
alternative label: destinataire de @fr
alternative label: destinatari de @ca
alternative label: destinatario de @es
alternative label: destinatrio di @it
alternative label: modtager af @da
alternative label: muhatap @tr
alternative label: vastaanottajana teoksessa
alternative label: παραλήπτης του @el
alternative label: مرسل إليه @ar
alternative label: ……的接受者 @zh-hans
definition: Bir temsilciyi, temsilcinin bir eserle muhatap olduğu eser veya eserin bir bölümü ile ilişkilendirir. @tr
definition: Correla un agente a un'opera o una porzione di un'opera indirizzata a un agente. @it
definition: Hozzákapcsol egy ágenst egy ágensnek címzett műhöz, vagy műrészlethez. @hu
definition: Liittää toimijan teokseen tai teoksen osaan, joka on osoitettu toimijalle.
definition: Met un agent en relation avec une œuvre ou portion d’œuvre qui est adressée à un agent. @fr
definition: Relaciona un agent amb una obra o una part d’una obra que s’adreça a un agent. @ca
definition: Relateert een actor aan een werk of een deel van een werk dat is gericht aan een actor. @nl

kappaleen omistuksen kohde (toimija) kappaleessa
has element type: 2
instruction number: 18.5
toolkit definition: An item that acknowledges the inspiration or support of an agent. @en
toolkit definition: Bir temsilcinin ilhamını veya desteğini kabul eden bir kopya. @tr
toolkit definition: Een item dat erkent de inspiratie of steun van een actor. @nl
toolkit definition: Egy példány, amely elismeri egy ágens ösztönzését vagy támogatását. @hu
toolkit definition: Ein Exemplar, das einem Akteur gewidmet ist. @de
toolkit definition: Eksemplar, millega avaldatakse tänu tegija innustuse või toetuse eest. @et
toolkit definition: Eksemplar, som anerkender inspirationen eller støtten fra en agent. @da
toolkit definition: Et eksemplar som anerkjenner inspirasjonen eller støtten fra en agent. @no
toolkit definition: Item che attesta l'ispirazione o il supporto di un agente. @it
toolkit definition: Item qui reconnaît l’inspiration ou le soutien d’un agent. @fr
toolkit definition: Kappale, joka on omistettu sitä innoittaneelle tai tukeneelle toimijalle.
toolkit definition: Vienība, kas ir veltījums aģentam. @lv
toolkit definition: Ítem que reconeix la inspiració i el suport d’un agent. @ca
toolkit definition: Ένα αντίτυπο το οποίο αφιερώνεται σε έναν φορέα. @el
toolkit definition: يربط وكيلا بمفردة تقر بإلهام وكيل أو بدعمه. @ar
toolkit definition: 对一个行为者的启发或支持表示感谢的一个单件 @zh-hans
toolkit label: Akteur als Widmungsempfängerin/Widmungsempfänger eines Exemplars von @de
toolkit label: agent dedicatari d’un ítem de @ca
toolkit label: agent dédicataire d’un item de @fr
toolkit label: agent som et eksemplar er dedikert til @no
toolkit label: agent, som er tilegnet i eksemplar af @da
toolkit label: aģentam veltītā vienība @lv
toolkit label: dedicatario agente di item di @it
toolkit label: dedicatee agent of item of @en
toolkit label: dedikált ágense a következő példánynak: @hu
toolkit label: eksemplari pühenduse saaja (tegija) eksemplaris @et
toolkit label: kappaleen omistuksen kohde (toimija) kappaleessa
toolkit label: kopyanın adandığı temsilci @tr
toolkit label: opgedragene-actor van item van @nl
toolkit label: αποδέκτης αφιέρωσης φορέας του αντιτύπου του @el
toolkit label: هو وكيل مُهدى إليه لـ @ar
toolkit label: ……的单件的被题献者行为者 @zh-hans
has subproperty: kappaleen omistuksen kohde (henkilö) kappaleessa
has subproperty: kappaleen omistuksen kohde (yhteistoimija) kappaleessa
has subproperty: P50210
lexical alias: dedicateeAgentOfItemOf.en
status: Published
type: Property
domain: C10002
label: aģentam veltītā vienība @lv
label: dedikált ágense a következő példánynak: @hu
label: eksemplari pühenduse saaja (tegija) eksemplaris @et
label: er agent som et eksemplar er dedikert til @no
label: er agent, som er tilegnet i eksemplar af @da
label: est un agent dédicataire d’un item de @fr
label: is dedicatee agent of item of @en
label: is opgedragene-actor van item van @nl
label: ist Akteur als Widmungsempfängerin/Widmungsempfänger eines Exemplars von @de
label: kopyasının ithaf edilen temsilcisidir @tr
label: è dedicatario agente di item agente di @it
label: és agent dedicatari d’un ítem de @ca
label: είναι αποδέκτης αφιέρωσης φορέας του αντιτύπου του @el
label: هو وكيل مُهدى إليه لـ @ar
label: 是……的单件的被题献者行为者 @zh-hans
sub property of: toimijaan liittyvä kappale
alternative label: Widmungsempfänger (Exemplar) von @de
alternative label: adanmış (kopya) @tr
alternative label: dedicatari (ítem) de @ca
alternative label: dedicatario (ítem) de @es
alternative label: dedicatario di item di @it
alternative label: dedicatee (item) of @en
alternative label: dedikeret (eksemplar) til @da
alternative label: dedikáltja (példány): @hu
alternative label: dédicataire (item) de @fr
alternative label: eksemplar dedikert til @no
alternative label: eksemplari pühenduse saaja eksemplaris @et
alternative label: omistuskirjoituksen kohteena kappaleessa
alternative label: αποδέκτης αφιέρωσης του αντιτύπου του @el
alternative label: مهدى إليه (مفردة) لـ @ar
alternative label: ……的被题献者（单件） @zh-hans
definition: Bir temsilciyi, bir temsilcinin fikir veya desteğini onaylayan kopyayla ilişkilendirir. @tr
definition: Correla un agente a un item che attesta l'ispirazione o il supporto di un agente. @it
definition: Hozzákapcsol egy ágenst egy példányhoz, amely elismeri egy ágens ösztönzését vagy támogatását. @hu
definition: Liittää toimijan kappaleeseen, joka on omistettu sitä innoittaneelle tai tukeneelle toimijalle.
definition: Met un agent en relation avec un item qui reconnaît l’inspiration ou le soutien d’un agent. @fr
definition: Relaciona un agent amb un ítem que reconeix la inspiració i el suport d’un agent. @ca
definition: Relateert een actor aan een item dat erkent de inspiratie of steun van een actor. @nl

asiantuntija (toimija) teoksessa
has element type: 2
instruction number: 18.5
toolkit definition: A work that involves a responsibility of an agent for providing consultation services, and often making recommendations, to a creator of a work. @en
toolkit definition: Bir eserin yaratıcısına danışmanlık hizmetleri sağlama ve genellikle tavsiyelerde bulunma konusunda bir temsilcinin sorumluluğunu içeren bir eser. @tr
toolkit definition: Darbs, kas ietver aģenta atbildību par konsultāciju pakalpojumu un ieteikumu sniegšanu citam aģentam, kas ir darba radītājs. @lv
toolkit definition: Een werk dat met zich meebrengt een verantwoordelijkheid van een actor voor het leveren van diensten van raadgeving, en vaak het doen van aanbevelingen, aan een maker van een werk. @nl
toolkit definition: Egy mű, amelyhez hozzátartozik egy ágens felelőssége tanácsadó szolgáltatásért és gyakran egy mű létrehozójának tett javaslatokért is. @hu
toolkit definition: Ein Werk, bei dem ein Akteur einer geistigen Schöpferin/einem geistigen Schöpfer Beratungsdienste anbietet und häufig Empfehlungen macht. @de
toolkit definition: Et verk som involverer ansvar for en agent i form av å levere konsulenttjenester og ofte å gi anbefalinger til en opphaver av et verk. @no
toolkit definition: Obra que implica una responsabilitat d’un agent proporcionant serveis d’assessorament, i que sovint fa recomanacions, a un creador d’una obra. @ca
toolkit definition: Opera che implica la responsabilità di un agente nel fornire servizi di consulenza, spesso facendo raccomandazioni, al creatore dell'opera. @it
toolkit definition: Teos, jossa toimija on vastuussa asiantuntijapalveluiden tarjoamisesta ja suositusten antamisesta teoksen tekijälle.
toolkit definition: Teos, mis sisaldab tegija vastutust konsultatsiooni ja sageli ka soovituste andmise eest teose autorile. @et
toolkit definition: Værk, som involverer en agents ansvar for at yde rådgivning og ofte komme med anbefalinger til et ophav til et værk. @da
toolkit definition: Œuvre qui comporte une responsabilité de la part d’un agent consistant à fournir des services de consultation et souvent à faire des recommandations à un créateur d’une œuvre. @fr
toolkit definition: Ένα έργο που περιλαμβάνει την ευθύνη της παροχής υπηρεσιών συμβουλευτικής και συχνά κάνει συστάσεις σε κάποιον άλλον φορέα, ο οποίος αναπαρίσταται ως ο δημιουργός ενός έργου. @el
toolkit definition: يربط وكيلا بعمل يترتب عليه مسئولية وكيل عن تقديم خدمات استشارية، وغالبا ما يقدم مقترحات إلى منشئ عمل. @ar
toolkit definition: 涉及向作品创作者提供咨询服务并经常提供建议的一个行为者的责任的一种作品 @zh-hans
toolkit label: Akteur als Beraterin/Berater von @de
toolkit label: agent consultant de @fr
toolkit label: agent consultor de @ca
toolkit label: agent, som er rådgiver af @da
toolkit label: asiantuntija (toimija) teoksessa
toolkit label: consulenteagente di @it
toolkit label: consultant agent of @en
toolkit label: consultant-actor van @nl
toolkit label: danışman temsilcisi @tr
toolkit label: ir konsultants (aģents) @lv
toolkit label: konsulent for (agent) @no
toolkit label: konsultant (tegija) teoses @et
toolkit label: tanácsadó ágense: @hu
toolkit label: σύμβουλος φορέας του @el
toolkit label: هو وكيل مرسل إليه لـ @ar
toolkit label: ……的顾问行为者 @zh-hans
has subproperty: asiantuntija (henkilö) teoksessa
has subproperty: asiantuntija (yhteistoimija) teoksessa
has subproperty: P50211
lexical alias: consultantAgentOf.en
status: Published
type: Property
domain: C10002
label: danışman temsilcisidir @tr
label: er agent, som er rådgiver af @da
label: er konsulent for (agent) @no
label: est un agent consultant de @fr
label: ir konsultants (aģents) @lv
label: is consultant agent of @en
label: is consultant-actor van @nl
label: ist Akteur als Beraterin/Berater von @de
label: konsultant (tegija) teoses @et
label: tanácsadó ágense a következőnek: @hu
label: è consulente agente di @it
label: és agent consultor de @ca
label: είναι σύμβουλος φορέας του @el
label: هو وكيل مرسل إليه لـ @ar
label: 是……的顾问行为者 @zh-hans
sub property of: toimijaan liittyvä teos
alternative label: Berater von @de
alternative label: asiantuntijana teoksessa
alternative label: consulente di @it
alternative label: consultant de @fr
alternative label: consultant of @en
alternative label: consultor de @ca
alternative label: danışman @tr
alternative label: konsulent for @no
alternative label: konsultant teoses @et
alternative label: rådgiver af @da
alternative label: tanácsadója: @hu
alternative label: σύμβουλος του @el
alternative label: استشاري @ar
alternative label: ……的顾问 @zh-hans
definition: Bir temsilciyi, bir eserin yaratıcısına danışmanlık hizmeti sağlama ve genellikle tavsiyelerde bulunmaya ilişkin bir temsilcinin sorumluluğunu içeren bir eserle ilişkilendirir. @tr
definition: Correla un agente a un'opera che implica la responsabilità di un agente nel fornire servizi di consulenza, spesso facendo raccomandazioni, al creatore dell'opera. @it
definition: Hozzákapcsol egy ágenst egy műhöz, amelyhez hozzátartozik egy ágens felelőssége tanácsadó szolgáltatásért és gyakran egy mű létrehozójának tett javaslatokért is. @hu
definition: Liittää toimijan teokseen, jossa toimija on vastuussa asiantuntijapalveluiden tarjoamisesta ja suositusten antamisesta teoksen tekijälle.
definition: Met un agent en relation avec une œuvre qui comporte une responsabilité de la part d’un agent consistant à fournir des services de consultation et souvent à faire des recommandations à un créateur d’une œuvre. @fr
definition: Relaciona un agent amb una obra que implica una responsabilitat d’un agent proporcionant serveis d’assessorament, i que sovint fa recomanacions, a un creador d’una obra. @ca
definition: Relateert een actor aan een werk dat met zich meebrengt een verantwoordelijkheid van een actor voor het leveren van diensten van raadgeving, en vaak het doen van aanbevelingen, aan een maker van een werk. @nl
definition: Relaterer en agent til et verk som involverer ansvar for en agent i form av å levere konsulenttjenester og ofte å gi anbefalinger til en opphaver av et verk. @no

pöytäkirjan laatija (toimija) ekspressiossa
has element type: 2
instruction number: 18.5
toolkit definition: An expression that includes a contribution by an agent of recording the minutes of a meeting. @en
toolkit definition: Een expressie die omvat een bijdrage door een actor door vastleggen van de notulen van een bijeenkomst. @nl
toolkit definition: Egy kifejezési forma, amely magában foglalja egy ágens közreműködését egy értekezlet jegyzőkönyvének rögzítésében. @hu
toolkit definition: Eine Expression, zu der ein Akteur beiträgt, indem er für das Aufzeichnen des Protokolls einer Sitzung verantwortlich ist. @de
toolkit definition: Ekspressio, jossa toimija on osallisena kokouksen pöytäkirjan laatimisessa.
toolkit definition: Espressione che include un contributo da parte di un agente per registrare le minute (appunti) di una riunione. @it
toolkit definition: Et uttrykk som inkluderer et bidrag fra en agent i form av å ta referat fra et møte. @no
toolkit definition: Expression qui intègre une contribution de la part d’un agent consistant à rédiger le procès-verbal d’une réunion. @fr
toolkit definition: Expressió que inclou una contribució d’un agent en l’enregistrament de les notes d’una reunió. @ca
toolkit definition: Izteiksme, kas ietver aģenta ieguldījumu, rakstot sanāksmes protokolu. @lv
toolkit definition: Toplantı tutanaklarını kaydeden bir temsilcinin katkısını içeren bir anlatım. @tr
toolkit definition: Udtryk, som omfatter en agents bidrag ved at tage referat ved et møde. @da
toolkit definition: Väljendus, millesse tegija on andnud panuse kohtumist protokollides. @et
toolkit definition: Μια έκφραση που ενσωματώνει τη συνεισφορά της καταγραφής των πρακτικών μιας συνάντησης. @el
toolkit definition: يربط وكيلا بتعبيرة تتضمن إسهام وكيل بتسجيل محاضر اجتماع. @ar
toolkit definition: 包括写会议记录的一个行为者的贡献的一种内容表达 @zh-hans
toolkit label: Akteur als Protokollantin/Protokollant von @de
toolkit label: agent procès-verbaliste de @fr
toolkit label: agent responsable de notes de @ca
toolkit label: agent, som er referent af @da
toolkit label: ir protokolists (aģents) @lv
toolkit label: jegyzőkönyvvezető ágense: @hu
toolkit label: minute taker agent of @en
toolkit label: notulist-actor van @nl
toolkit label: protokollija (tegija) väljenduses @et
toolkit label: pöytäkirjan laatija (toimija) ekspressiossa
toolkit label: referent for (agent) @no
toolkit label: toplantıyı kayda geçiren temsilcisi @tr
toolkit label: verbalizzatore agente di @it
toolkit label: πρακτικογράφος φορέας του @el
toolkit label: هو وكيل مدون محاضر الاجتماعات لـ @ar
toolkit label: ……的会议记录者行为者 @zh-hans
has subproperty: pöytäkirjan laatija (henkilö) ekspressiossa
has subproperty: pöytäkirjan laatija (yhteistoimija) ekspressiossa
has subproperty: P50212
lexical alias: minuteTakerAgentOf.en
status: Published
type: Property
domain: C10002
label: er agent, som er referent af @da
label: er referent for (agent) @no
label: est un agent procès-verbaliste de @fr
label: ir protokolists (aģents) @lv
label: is minute taker agent of @en
label: is notulist-actor van @nl
label: ist Akteur als Protokollantin/Protokollant von @de
label: jegyzőkönyvvezető ágense a következőnek: @hu
label: protokollija (tegija) väljenduses @et
label: zabıt katibi temsilcisidir @tr
label: è verbalizzatore agente di @it
label: és agent responsable de notes de @ca
label: είναι πρακτικογράφος φορέας του @el
label: هو وكيل مدون لمحضر اجتماع لـ @ar
label: 是……的会议记录者行为者 @zh-hans
sub property of: yhdistymään osallinen toimija ekspressiossa
alternative label: Protokollant von @de
alternative label: jegyzőkönyvvezetője: @hu
alternative label: laatijana pöytäkirjassa
alternative label: minute taker of @en
alternative label: procès-verbaliste de @fr
alternative label: protokollija väljenduses @et
alternative label: referent af @da
alternative label: referent for @no
alternative label: responsable de notes de @ca
alternative label: tomador de minutas de @es
alternative label: toplantıyı kayda geçiren @tr
alternative label: verbalizzatore di @it
alternative label: πρακτικογράφος του @el
alternative label: ……的会议记录者 @zh-hans
definition: Bir temsilciyi, toplantının tutanaklarını kaydeden bir temsilcinin katkısını içeren bir anlatımla ilişkilendirir. @tr
definition: Correla un agente a un'espressione che include un contributo da parte di un agente per registrare le minute di una riunione. @it
definition: Hozzákapcsol egy ágenst egy kifejezési formához, amely magában foglalja egy ágens közreműködését egy értekezlet jegyzőkönyvének rögzítésében. @hu
definition: Liittää toimijan ekspressioon, jossa toimija on osallisena kokouksen pöytäkirjan laatimisessa.
definition: Met un agent en relation avec une expression qui intègre une contribution de la part d’un agent consistant à rédiger le procès-verbal d’une réunion. @fr
definition: Relaciona un agent amb una expressió que inclou una contribució d’un agent en l’enregistrament de les notes d’una reunió. @ca
definition: Relateert een actor aan een expressie die omvat een bijdrage door een actor door vastleggen van de notulen van een bijeenkomst. @nl
definition: Relaterer en agent til et udtryk, som omfatter en agents bidrag ved at tage referat ved et møde. @da

elokuvatuottaja (toimija) teoksessa
has element type: 2
instruction number: 18.5
toolkit definition: A work that involves a responsibility of an agent for most of the business aspects of the production of a film. @en
toolkit definition: Bir filmin yapımının ticari yönlerinin çoğu için bir temsilcinin sorumluluğunu içeren bir eser. @tr
toolkit definition: Darbs, kas ietver aģenta atbildību par filmas uzņemšanas finansiālajiem aspektiem. @lv
toolkit definition: Een werk dat met zich meebrengt een verantwoordelijkheid van een actor voor het merendeel van de zakelijke aspecten van de productie van een film. @nl
toolkit definition: Egy mű, amelyhez hozzátartozik egy ágens felelőssége egy filmprodukció legtöbb üzleti vonatkozásáért. @hu
toolkit definition: Ein Werk, bei dem ein Akteur für die meisten geschäftlichen Aspekte bei der Produktion eines Films verantwortlich ist. @de
toolkit definition: Et verk som involverer ansvar for en agent i form av de fleste forretningsmessige aspektene ved produksjon av en film. @no
toolkit definition: Obra que implica una responsabilitat d’un agent en la majoria dels aspectes comercials de la producció d’una pel·lícula. @ca
toolkit definition: Opera che implica la responsabilità di un agente per la maggior parte degli aspetti commerciali della produzione di un film. @it
toolkit definition: Teos, jossa toimija on vastuussa suurimmasta osasta elokuvan liiketoimintaa.
toolkit definition: Teos, mis sisaldab tegija vastutust enamiku äriliste aspektide eest filmi tootmisel. @et
toolkit definition: Værk, som involverer en agents ansvar for størstedelen af de forretningsmæssige aspekter ved en film. @da
toolkit definition: Œuvre qui comporte une responsabilité de la part d’un agent en ce qui concerne la majeure partie des aspects commerciaux de la production d’un film. @fr
toolkit definition: Ένα έργο που περιλαμβάνει την ευθύνη της παραγωγής για τις περισσότερες επιχειρηματικές πτυχές ενός φιλμ. @el
toolkit definition: عمل يترتب عليه مسئولية وكيل عن معظم الجوانب التجارية لإنتاج فيلم. @ar
toolkit definition: 涉及电影制作的大部分商业运作的一个行为者的责任的一种作品 @zh-hans
toolkit label: Akteur als Filmproduzentin/Filmproduzent von @de
toolkit label: agent producteur de cinéma de @fr
toolkit label: agent productor cinematogràfic de @ca
toolkit label: agent, som er filmproducer af @da
toolkit label: elokuvatuottaja (toimija) teoksessa
toolkit label: film producer agent of @en
toolkit label: film yapımcısı temsilcisi @tr
toolkit label: filmiprodutsent (tegija) teoses @et
toolkit label: filmproducent-actor van @nl
toolkit label: filmproducer ágense: @hu
toolkit label: filmprodusent av (agent) @no
toolkit label: ir filmas producents (aģents) @lv
toolkit label: produttore cinematografico agente di @it
toolkit label: παραγωγός ταινίας φορέας του @el
toolkit label: وكيل منتج لفيلم لـ @ar
toolkit label: ……的电影制作人行为者 @zh-hans
has subproperty: elokuvatuottaja (henkilö) teoksessa
has subproperty: elokuvatuottaja (yhteistoimija) teoksessa
has subproperty: P50213
lexical alias: filmProducerAgentOf.en
status: Published
type: Property
domain: C10002
label: er agent, som er filmproducer af @da
label: er filmprodusent av (agent) @no
label: est un agent producteur de cinéma de @fr
label: film yapımcısı temsilcisidir @tr
label: filmiprodutsent (tegija) teoses @et
label: filmproducer ágense a következőnek: @hu
label: ir filmas producents (aģents) @lv
label: is film producer agent of @en
label: is filmproducent-actor van @nl
label: ist Akteur als Filmproduzentin/Filmproduzent von @de
label: è produttore cinematografico agente di @it
label: és agent productor cinematogràfic de @ca
label: είναι παραγωγός ταινίας φορέας του @el
label: هو وكيل منتج لفيلم لـ @ar
label: 是……的电影制作人行为者 @zh-hans
sub property of: tuottaja (toimija) teoksessa
alternative label: Filmproduzent von @de
alternative label: agent producteur de film de @fr
alternative label: film producer of @en
alternative label: film yapımcısı @tr
alternative label: filmiprodutsent teoses @et
alternative label: filmproducer af @da
alternative label: filmproducere: @hu
alternative label: filmprodusent av @no
alternative label: producteur de cinéma de @fr
alternative label: productor cinematogràfic de @ca
alternative label: productor fílmico de @es
alternative label: produttore cinematografico di @it
alternative label: tuottajana elokuvassa
alternative label: παραγωγός ταινίας του @el
alternative label: منتج الفيلم @ar
alternative label: ……的电影制作人 @zh-hans
definition: Bir temsilciyi, bir filmin yapımının çoğu ticari yönüne ilişkin bir temsilcinin sorumluluğunu içeren bir eserle ilişkilendirir. @tr
definition: Correla un agente a un'opera che implica la responsabilità di un agente per la maggior parte degli aspetti commerciali della produzione di un film. @it
definition: Hozzákapcsol egy ágenst egy műhöz, amelyhez hozzátartozik egy ágens felelőssége egy filmprodukció legtöbb üzleti vonatkozásáért. @hu
definition: Liittää toimijan teokseen, jossa toimija on vastuussa suurimmasta osasta elokuvan liiketoimintaa.
definition: Met un agent en relation avec une œuvre qui comporte une responsabilité de la part d’un agent en ce qui concerne la majeure partie des aspects commerciaux de la production d’un film. @fr
definition: Relaciona un agent amb una obra que implica una responsabilitat d’un agent en la majoria dels aspectes comercials de la producció d’una pel·lícula. @ca

radiotuottaja (toimija) teoksessa
has element type: 2
instruction number: 18.5
toolkit definition: A work that involves a responsibility of an agent for most of the business aspects of the production of a radio program. @en
toolkit definition: Bir radyo programının yapımının ticari yönlerinin çoğu için bir temsilcinin sorumluluğunu içeren bir eser. @tr
toolkit definition: Darbs, kas ietver aģenta atbildību par radio raidījuma darbības/biznesa aspektiem. @lv
toolkit definition: Een werk dat met zich meebrengt een verantwoordelijkheid van een actor voor het merendeel van de zakelijke aspecten van het produceren van een radioprogramma. @nl
toolkit definition: Egy mű, amelyhez hozzátartozik egy ágens felelőssége egy rádióműsor legtöbb üzleti vonatkozásáért. @hu
toolkit definition: Ein Werk, bei dem ein Akteur für die meisten geschäftlichen Aspekte einer Hörfunksendung verantwortlich ist. @de
toolkit definition: Et verk som involverer ansvar for en agent i form av de fleste forretningsmessige aspektene ved produksjon av et radioprogram. @no
toolkit definition: Obra que implica una responsabilitat d’un agent en la majoria dels aspectes comercials de la producció d’un programa radiofònic. @ca
toolkit definition: Opera che implica la responsabilità di un agente per la maggior parte degli aspetti commerciali della produzione di un programma radiofonico. @it
toolkit definition: Teos, jossa toimija on vastuussa suurimmasta osasta radio-ohjelman liiketoimintaa.
toolkit definition: Teos, mis sisaldab tegija vastutust enamiku äriliste aspektide eest raadiosaate tootmisel. @et
toolkit definition: Værk, som involverer en agents ansvar for størstedelen af de foretningsmæssige aspekter ved et radioprogram. @da
toolkit definition: Œuvre qui comporte une responsabilité de la part d’un agent en ce qui concerne la majeure partie des aspects commerciaux de la production d’une émission de radio. @fr
toolkit definition: Ένα έργο που περιλαμβάνει την ευθύνη της παραγωγής για τις περισσότερες επιχειρηματικές πτυχές ενός ραδιοφωνικού προγράμματος. @el
toolkit definition: عمل يترتب عليه مسئولية وكيل عن معظم الجوانب التجارية لإنتاج برنامج إذاعي. @ar
toolkit definition: 涉及广播节目制作的大部分商业运作的一个行为者的责任的一种作品 @zh-hans
toolkit label: Akteur als Hörfunkproduzentin/Hörfunkproduzent von @de
toolkit label: agent productor radiofònic de @ca
toolkit label: agent producteur de radio de @fr
toolkit label: agent, som er radioproducer af @da
toolkit label: ir radio raidījuma producents (aģents) @lv
toolkit label: produttore radiofonico agente di @it
toolkit label: raadioprodutsent (tegija) teoses @et
toolkit label: radio producer agent of @en
toolkit label: radioproducent-actor van @nl
toolkit label: radioprodusent for (agent) @no
toolkit label: radiotuottaja (toimija) teoksessa
toolkit label: radyo yapımcısı temsilcisi @tr
toolkit label: rádióproducer ágense: @hu
toolkit label: ραδιοφωνικός παραγωγός φορέας του @el
toolkit label: وكيل منتج إذاعي لـ @ar
toolkit label: ……的广播制作人行为者 @zh-hans
has subproperty: radiotuottaja (henkilö) teoksessa
has subproperty: radiotuottaja (yhteistoimija) teoksessa
has subproperty: P50214
lexical alias: radioProducerAgentOf.en
status: Published
type: Property
domain: C10002
label: er agent, som er radioproducer af @da
label: er radioprodusent for (agent) @no
label: est un agent producteur de radio de @fr
label: ir radio raidījuma producents (aģents) @lv
label: is radio producer agent of @en
label: is radioproducent-actor van @nl
label: ist Akteur als Hörfunkproduzentin/Hörfunkproduzent von @de
label: raadioprodutsent (tegija) teoses @et
label: radyo yapımcısı temsilcisidir @tr
label: rádióproducer ágense a következőnek: @hu
label: è produttore radiofonico agente di @it
label: és agent productor radiofònic de @ca
label: είναι ραδιοφωνικός παραγωγός φορέας του @el
label: هو وكيل منتج إذاعي لـ @ar
label: 是……的广播制作人行为者 @zh-hans
sub property of: tuottaja (toimija) teoksessa
alternative label: Hörfunkproduzent von @de
alternative label: producteur de radio de @fr
alternative label: productor de radio de @es
alternative label: productor radiofònic de @ca
alternative label: produttore radiofonico di @it
alternative label: raadioprodutsent teoses @et
alternative label: radio producer of @en
alternative label: radioproducer af @da
alternative label: radioprodusent for @no
alternative label: radyo yapımcısı @tr
alternative label: rádióproducere: @hu
alternative label: tuottajana radio-ohjelmassa
alternative label: ραδιοφωνικός παραγωγός του @el
alternative label: منتج إذاعي لـ @ar
alternative label: ……的广播制作人 @zh-hans
definition: Bir temsilciyi, bir radyo programı yapımının çoğu ticari yönüne ilişkin bir temsilcinin sorumluluğunu içeren bir eserle ilişkilendirir. @tr
definition: Correla un agente a un'opera che implica la responsabilità di un agente per la maggior parte degli aspetti commerciali della produzione di un programma radiofonico. @it
definition: Hozzákapcsol egy ágenst egy műhöz, amelyhez hozzátartozik egy ágens felelőssége egy rádióműsor legtöbb üzleti vonatkozásáért. @hu
definition: Liittää toimijan teokseen, jossa toimija on vastuussa suurimmasta osasta radio-ohjelman liiketoimintaa.
definition: Met un agent en relation avec une œuvre qui comporte une responsabilité de la part d’un agent en ce qui concerne la majeure partie des aspects commerciaux de la production d’une émission de radio. @fr
definition: Relaciona un agent amb una obra que implica una responsabilitat d’un agent en la majoria dels aspectes comercials de la producció d’un programa radiofònic. @ca
definition: Relateert een actor aan een werk dat met zich meebrengt een verantwoordelijkheid van een actor voor het merendeel van de zakelijke aspecten van het produceren van een radioprogramma. @nl

televisiotuottaja (toimija) teoksessa
has element type: 2
instruction number: 18.5
toolkit definition: A work that involves a responsibility of an agent for most of the business aspects of the production of a television program. @en
toolkit definition: Bir televizyon programının yapımının ticari yönlerinin çoğu için bir temsilcinin sorumluluğunu içeren bir eser. @tr
toolkit definition: Darbs, kas ietver aģenta atbildību par televīzijas raidījuma biznesa aspektiem. @lv
toolkit definition: Een werk dat met zich meebrengt een verantwoordelijkheid van een actor voor het merendeel van de zakelijke aspecten van de productie van een televisieprogramma. @nl
toolkit definition: Egy mű, amelyhez hozzátartozik egy ágens felelőssége egy televízióműsor legtöbb üzleti vonatkozásáért. @hu
toolkit definition: Ein Werk, bei dem ein Akteur für die meisten geschäftliche Aspekte einer Fernsehsendung verantwortlich ist. @de
toolkit definition: Et verk som involverer ansvar for en agent i form av de fleste forretningsmessige aspektene ved produksjon av et fjernsynsprogram. @no
toolkit definition: Obra que implica una responsabilitat d’un agent en la majoria dels aspectes comercials de la producció d’un programa de televisió. @ca
toolkit definition: Opera che implica la responsabilità di un agente per la maggior parte degli aspetti commerciali della produzione di un programma televisivo. @it
toolkit definition: Teos, jossa toimija on vastuussa suurimmasta osasta televisio-ohjelman liiketoimintaa.
toolkit definition: Teos, mis sisaldab tegija vastutust enamiku äriliste aspektide eest telesaate tootmisel. @et
toolkit definition: Værk, som involverer en agents ansvar for størstedelen af de forretningsmæssige aspekter ved et tv-program. @da
toolkit definition: Œuvre qui comporte une responsabilité de la part d’un agent en ce qui concerne la majeure partie des aspects commerciaux de la production d’une émission de télévision. @fr
toolkit definition: Ένα έργο που περιλαμβάνει την ευθύνη της παραγωγής για τις περισσότερες επιχειρηματικές πτυχές ενός τηλεοπτικού προγράμματος. @el
toolkit definition: عمل يترتب عليه مسئولية وكيل عن معظم الجوانب التجارية لإنتاج برنامج تليفزيوني. @ar
toolkit definition: 涉及电视节目制作的大部分商业运作的一个行为者的责任的一种作品 @zh-hans
toolkit label: Akteur als Fernsehproduzentin/Fernsehproduzent von @de
toolkit label: agent producteur de télévision de @fr
toolkit label: agent productor de televisió de @ca
toolkit label: agent, som er tv-producer af @da
toolkit label: fjernsynsprodusent for (agent) @no
toolkit label: ir televīzijas raidījuma producents (aģents) @lv
toolkit label: produttore televisivo agente di @it
toolkit label: teleprodutsent (tegija) teoses @et
toolkit label: televisieproducent-actor van @nl
toolkit label: television producer agent of @en
toolkit label: televisiotuottaja (toimija) teoksessa
toolkit label: televizyon yapımcısı temsilcisi @tr
toolkit label: televízió-producer ágense: @hu
toolkit label: τηλεοπτικός παραγωγός φορέας του @el
toolkit label: وكيل منتج تليفزيوني @ar
toolkit label: ……的电视制作人行为者 @zh-hans
has subproperty: televisiotuottaja (henkilö) teoksessa
has subproperty: televisiotuottaja (yhteistoimija) teoksessa
has subproperty: P50215
lexical alias: televisionProducerAgentOf.en
status: Published
type: Property
domain: C10002
label: er agent, som er tv-producer af @da
label: er fjernsynsprodusent for (agent) @no
label: est un agent producteur de télévision de @fr
label: ir televīzijas raidījuma producents (aģents) @lv
label: is televisieproducent-actor van @nl
label: is television producer agent of @en
label: ist Akteur als Fernsehproduzentin/Fernsehproduzent von @de
label: teleprodutsent (tegija) teoses @et
label: televizyon yapımcısının temsilcisidir @tr
label: televízió-producer ágense a következőnek: @hu
label: è produttore televisivo agente di @it
label: és agent productor de televisió de @ca
label: είναι τηλεοπτικός παραγωγός φορέας του @el
label: هو وكيل منتج تليفزيوني لـ @ar
label: 是……的电视制作人行为者 @zh-hans
sub property of: tuottaja (toimija) teoksessa
alternative label: Fernsehproduzent von @de
alternative label: fjernsynsprodusent for @no
alternative label: producteur de télévision de @fr
alternative label: productor de televisió de @ca
alternative label: productor televisivo de @es
alternative label: produttore televisivo di @it
alternative label: teleprodutsent teoses @et
alternative label: television producer of @en
alternative label: televizyon yapımcısı @tr
alternative label: televízió-producere: @hu
alternative label: tuottajana televisio-ohjelmassa
alternative label: tv-producer af @da
alternative label: τηλεοπτικός παραγωγός του @el
alternative label: منتج تليفزيوني @ar
alternative label: ……的电视制作人 @zh-hans
definition: Bir temsilciyi, bir televizyon programı yapımının çoğu ticari yönüne ilişkin bir temsilcinin sorumluluğunu içeren bir eserle ilişkilendirir. @tr
definition: Correla un agente a un'opera che implica la responsabilità di un agente per la maggior parte degli aspetti commerciali della produzione di un programma televisivo. @it
definition: Hozzákapcsol egy ágenst egy műhöz, amelyhez hozzátartozik egy ágens felelőssége egy televízióműsor legtöbb üzleti vonatkozásáért. @hu
definition: Liittää toimijan teokseen, jossa toimija on vastuussa suurimmasta osasta televisio-ohjelman liiketoimintaa.
definition: Met un agent en relation avec une œuvre qui comporte une responsabilité de la part d’un agent en ce qui concerne la majeure partie des aspects commerciaux de la production d’une émission de télévision. @fr
definition: Relaciona un agent amb una obra que implica una responsabilitat d’un agent en la majoria dels aspectes comercials de la producció d’un programa de televisió. @ca
definition: Relateert een actor aan een werk dat met zich meebrengt een verantwoordelijkheid van een actor voor het merendeel van de zakelijke aspecten van de productie van een televisieprogramma. @nl

kirjoittajana lisätylle sanoitukselle
has element type: 2
instruction number: 18.5
see also: sanoittaja (toimija) teoksessa
toolkit definition: An expression that includes a contribution of adding written words to music. (Deprecated) @en
toolkit definition: Egy zenemű kifejezési formája, amely hozzájárulást testesít meg azzal, hogy egy kifejezési formához szavakat ír. @hu
toolkit definition: Eine Expression eines Musikwerks, bei der ein Akteur für das Verfassen von Texten, das dem Musikwerk beigefügt wird, verantwortlich ist. @de
toolkit definition: Et uttrykk av et musikalsk verk som omfatter et bidrag i form av å skrive ord som tilføyes til et uttrykk. @no
toolkit definition: Expression d’une œuvre musicale qui intègre une contribution consistant à écrire des paroles ajoutées à une expression. @fr
toolkit definition: Expressió d’una obra musical que incorpora una contribució que escriu paraules afegides a una expressió. @ca
toolkit definition: Musiikkiteoksen ekspressio, joka sisältää lisätyn sanoituksen.
toolkit definition: Udtryk af et musikværk der inkorporerer et bidrag ved at skrive ord, der er tilføjet til et udtryk. @da
toolkit definition: Μια έκφραση ενός μουσικού έργου που ενσωματώνει τη συνεισφορά της συγγραφής και της προσθήκης στίχων σε μια έκφραση. @el
toolkit label: Verfasser von zusätzlichen Lyrics von @de
toolkit label: auteur de paroles ajoutées de @fr
toolkit label: escriptor de lletres de cançons afegides de @ca
toolkit label: forfatter af tilføjede sangtekster til @da
toolkit label: forfatter av tilføyd sangtekst til @no
toolkit label: hozzáadott szöveg írója @hu
toolkit label: kirjoittajana lisätylle sanoitukselle
toolkit label: writer of added lyrics of (Deprecated) @en
toolkit label: συγγραφέας των πρόσθετων στίχων του @el
has subproperty: P50216
lexical alias: writerOfAddedLyricsOf.en
status: Deprecated
type: Property
domain: C10002
label: er forfatter af tilføjede sangtekster til @da
label: est un auteur de paroles ajoutées de @fr
label: hozzáadott dalszövegének írója @hu
label: is writer of added lyrics of (Deprecated) @en
label: ist Verfasser von zusätzlichen Lyrics von @de
label: és escriptor de lletres de cançons afegides de @ca
label: είναι συγγραφέας των πρόσθετων στίχων του @el
sub property of: kirjoittajana lisätyssä tekstissä
definition: Egy zenemű kifejezési formájához hozzáadott szavak íróját hozzákapcsolja egy kifejezési formához. @hu
definition: Liittää toimijan musiikkiteoksen ekspressioon, joka sisältää lisätyn sanoituksen.
definition: Met un auteur de paroles ajoutées à une expression d’une œuvre musicale en relation avec une expression. @fr
definition: Relaciona un escriptor de paraules afegides amb una expressió d’una obra musical amb una expressió. @ca
definition: Relaterer en forfatter af ord, der er tilføjet til et udtryk af et musikværk til et udtryk. @da
definition: Relates an agent to an expression that includes a contribution of adding written words to music. (Deprecated) @en
definition: Setzt einen Verfasser eines Texts, der einer Expression eines Musikwerks beigefügt wird, mit einer Expression in Beziehung. @de
definition: Συνδέει έναν συγγραφέα στίχων, οι οποίοι προστίθενται σε μια έκφραση ενός μουσικού έργου, με μια έκφραση. @el

ääninäyttelijä (toimija) ekspressiossa
has element type: 2
instruction number: 18.5
toolkit definition: An expression that includes a contribution by an agent of providing the voice for characters in radio and audio productions and for animated characters in moving image works, as well as voice-overs in radio and television commercials, dubbed expressions, etc. @en
toolkit definition: Een expressie die omvat een bijdrage door een actor in het leveren van een stem aan personages in radio- en geluidsproducties en aan animatiepersonages in bewegend beeld-werken, alsook voice-overs in radio- en televisiereclames, nagesynchroniseerde expressies etc. @nl
toolkit definition: Egy kifejezési forma, amely magában foglalja egy ágens közreműködését azzal, hogy rádió- és audió-produkciók szereplőinek, mozgóképművek animált karaktereinek adja hangját, valamint rádiós és televíziós reklámokban, szinkronizált forrásokban stb. hangalámondást szolgáltat. @hu
toolkit definition: Eine Expression, zu der ein Akteur beiträgt, indem er seine Stimme Charakteren in Hörfunk- und Audioproduktionen und animierten Charakteren in Bewegtbildwerken leiht und Begleitkommentare in Hörfunk- oder Fernsehwerbung, untertitelten Expressionen und so weiter zur Verfügung stellt. @de
toolkit definition: Ekspressio, jonka tekemiseen toimija osallistuu antamalla äänen hahmoille radio- ja äänituotannoissa ja animoiduille hahmoille elokuvateoksissa sekä esiintymällä radio- ja TV-mainoksissa, dubatuissa ekspressioissa tms.
toolkit definition: Et uttrykk som inkluderer et bidrag fra en agent i form av å gi stemme til rollefigurer i radio- og lydproduksjoner og for animerte rollefigurer i filmverk, levere fortellerstemme til radio- og fjernsynsreklamer, dubbede uttrykk, etc. @no
toolkit definition: Expression qui intègre une contribution de la part d’un agent consistant à prêter sa voix à des personnages dans des productions radiophoniques et audio et à des personnages animés dans des œuvres d’images animées, de même qu’à prêter sa voix hors champ dans des messages publicitaires à la radio et à la télévision, du doublage, etc. @fr
toolkit definition: Expressió que inclou una contribució d’un agent prestant la seva veu als personatges de les produccions radiofòniques i d’àudio i als personatges animats de les obres d’imatge en moviment, així com les veus en off en els anuncis publicitaris de ràdio i televisió, les expressions doblades, etc. @ca
toolkit definition: Izteiksme, kas ietver aģenta ieguldījumu, ierunājot tēlus radio un audio uzvedumos un animācijas filmās, kā arī nodrošinot aizkadra balsi radio un televīzijas reklāmās, dublētajās izteiksmēs u.tml. @lv
toolkit definition: Radyo ve ses yapımlarındaki karakterlerin ve hareketli görüntü işlerindeki animasyon karakterlerinin yanı sıra radyo ve televizyon reklamlarındaki seslendirmeler, dublajlı ifadeler vb. için bir temsilcinin katkısını içeren bir anlatım. @tr
toolkit definition: Udtryk, som omfatter en agents bidrag ved at lægge stemme til figurer i radio- og audioproduktioner og til animerede figurer i levende billedværker, og tillige ved at indtale voice-overs i radio- og tv-reklamer, eftersynkroniserede udtryk etc. @da
toolkit definition: Väljendus, millesse tegija on andnud panuse, andes hääle raadio- ja audioproduktsiooni tegelastele ning liikuvast pildist koosnevate teoste animategelastele, samuti esinedes häälega raadio- ja telereklaamis, dubleeritud väljendustes vms. @et
toolkit definition: Μια έκφραση που ενσωματώνει τη συνεισφορά της υποκριτικής μέσω του δανεισμού φωνής για χαρακτήρες ραδιοφωνικών και ακουστικών παραγωγών και για έργα κινουμένων σχεδίων, καθώς επίσης για αφηγήσεις σε ραδιοτηλεοπτικές διαφημίσεις, μεταγλωττισμένες εκφράσεις κ.λπ. @el
toolkit definition: تعبيرة تتضمن إسهام وكيل بالتمثيل الصوتي لشخصيات في إنتاج إذاعي وسمعي، وشخصيات كرتونية في أعمال الصور المتحركة، إضافة إلى التعليق الصوتي في إعلانات الإذاعة والتليفزيون، والتعبيرات المدبلجة، إلخ. @ar
toolkit definition: 包括为在广播和音频制作中的角色和为动态图像作品中的动画角色提供人声以及为广播和电视广告提供画外音、配音等的一个行为者的贡献的一种内容表达 @zh-hans
toolkit label: Akteur als Sprecherin/Sprecher einer Rolle von @de
toolkit label: agent acteur vocal de @fr
toolkit label: agent actor de veu de @ca
toolkit label: agent, som er dubber af @da
toolkit label: hääle esitaja (tegija) väljenduses @et
toolkit label: ir balss aktieris (aģents) @lv
toolkit label: seslendirme sanatçısı temsilcisi @tr
toolkit label: stemacteur-actor van @nl
toolkit label: stemmeskuespiller for (agent) @no
toolkit label: szinkronszínész ágense: @hu
toolkit label: voice actor agent of @en
toolkit label: ääninäyttelijä (toimija) ekspressiossa
toolkit label: ηθοποιός φωνής φορέας του @el
toolkit label: وكيل ممثل صوتي @ar
toolkit label: ……的声音演员行为者 @zh-hans
has subproperty: ääninäyttelijä (henkilö) ekspressiossa
has subproperty: ääninäyttelijä (yhteistoimija) ekspressiossa
has subproperty: P50217
lexical alias: voiceActorAgentOf.en
status: Published
type: Property
domain: C10002
label: er agent, som er dubber af @da
label: er stemmeskuespiller for (agent) @no
label: est un agent acteur vocal de @fr
label: hääle esitaja (tegija) väljenduses @et
label: ir balss aktieris (aģents) @lv
label: is stemacteur-actor van @nl
label: is voice actor agent of @en
label: ist Akteur als Sprecherin/Sprecher einer Rolle von @de
label: seslendirme sanatçısı temsilcisidir @tr
label: szinkronszínész ágense a következőnek: @hu
label: és agent actor de veu de @ca
label: είναι ηθοποιός φωνής φορέας του @el
label: هو وكيل ممثل صوتي لـ @ar
label: 是……的声音演员行为者 @zh-hans
sub property of: näyttelijä (toimija) ekspressiossa
alternative label: Synchronsprecher von @de
alternative label: actor de voz de @es
alternative label: dubber af @da
alternative label: hääle esitaja väljenduses @et
alternative label: intèrpret de veu de @ca
alternative label: seslendirme sanatçısı @tr
alternative label: stemmeskuespiller for @no
alternative label: szinkronszínésze: @hu
alternative label: voice actor of @en
alternative label: voix de @fr
alternative label: ääninäyttelijänä tallenteessa
alternative label: ηθοποιός φωνής του @el
alternative label: ممثل صوتي @ar
alternative label: ……的声音演员 @zh-hans
definition: Bir temsilciyi, radyo ve ses yapımlarındaki karakterler ve hareketli görüntü eserlerindeki animasyon karakterlerini seslendirmenin yanı sıra radyo ve televizyon reklamlarındaki seslendirmeler, dublajlı ifadeler vb. konusunda ses veren bir temsilcinin katkısını içeren bir anlatımla ilişkilendirir. @tr
definition: Hozzákapcsol egy ágenst egy kifejezési formához, amely magában foglalja egy ágens közreműködését azzal, hogy rádió- és audió-produkciók szereplőinek, mozgóképművek animált karaktereinek adja hangját, valamint rádiós és televíziós reklámokban, szinkronizált forrásokban stb. hangalámondást szolgáltat. @hu
definition: Liittää toimijan ekspressioon, jonka tekemiseen toimija osallistuu antamalla äänen hahmoille radio- ja äänituotannoissa ja animoiduille hahmoille elokuvateoksissa sekä esiintymällä radio- ja TV-mainoksissa, dubatuissa ekspressioissa tms.
definition: Met un agent en relation avec une expression qui intègre une contribution de la part d’un agent consistant à prêter sa voix à des personnages dans des productions radiophoniques et audio et à des personnages animés dans des œuvres d’images animées, de même qu’à prêter sa voix hors champ dans des messages publicitaires à la radio et à la télévision, du doublage, etc. @fr
definition: Relaciona un agent amb una expressió que inclou una contribució d’un agent prestant la seva veu als personatges de les produccions radiofòniques i d’àudio i als personatges animats de les obres d’imatge en moviment, així com les veus en off en els anuncis publicitaris de ràdio i televisió, les expressions doblades, etc. @ca
definition: Relateert een actor aan een expressie die omvat een bijdrage door een actor in het leveren van een stem aan personages in radio- en geluidsproducties en aan animatiepersonages in bewegend beeld-werken, alsook voice-overs in radio- en televisiereclames, nagesynchroniseerde expressies etc. @nl
definition: Relaterer en agent til et udtryk, som omfatter en agents bidrag ved at lægge stemme til figurer i radio- og audioproduktioner og til animerede figurer i levende billedværker, og tillige ved at indtale voice-overs i radio- og tv-reklamer, eftersynkroniserede udtryk etc. @da
definition: Relaterer en agent til et uttrykk som inkluderer et bidrag fra en agent i form av å gi stemme til rollefigurer i radio- og lydproduksjoner og for animerte rollefigurer i filmverk, levere fortellerstemme til radio- og fjernsynsreklamer, dubbede uttrykk, etc. @no
definition: Relates an agent to an expression that includes a contribution by an agent of providing the voice for characters in radio and audio productions and for animated characters in moving image works, as well as voice-overs in radio and television commercials, dubbed expressions, etc. @en
definition: Sasaista aģentu ar izteiksmi, kas ietver aģenta ieguldījumu, ierunājot tēlus radio un audio uzvedumos un animācijas filmās, kā arī nodrošinot aizkadra balsi radio un televīzijas reklāmās, dublētajās izteiksmēs u.tml. @lv
definition: Seostab tegija väljendusega, millesse tegija on andnud panuse, andes hääle raadio- ja audioproduktsiooni tegelastele ning liikuvast pildist koosnevate teoste animategelastele, samuti esinedes häälega raadio- ja telereklaamis, dubleeritud väljendustes vms. @et

toimijaan liittyvä yhteisö
has element type: 1
toolkit definition: A corporate body who is associated with an agent being identified. @en
toolkit definition: Asutus, kes on seotud identifitseeritava tegijaga. @et
toolkit definition: Collectivité qui est associée à un agent en cours d’identification. @fr
toolkit definition: Een corporatie die geassocieerd is met een actor die wordt geïdentificeerd. @nl
toolkit definition: Egy azonosított ágenshez kapcsolódó testület. @hu
toolkit definition: Eine Körperschaft, die mit einem Akteur in Verbindung steht. @de
toolkit definition: En korporasjon som forbindes med en identifisert agent. @no
toolkit definition: Ente associato all'agente che si sta identificando. @it
toolkit definition: Entitat corporativa que s’associa amb un agent que s’identifica. @ca
toolkit definition: Institūcija, kas saistīta ar aģentu. @lv
toolkit definition: Kimliği belirlenen bir temsilciyle ilişkili olan bir tüzel kişi. @tr
toolkit definition: Korporation, som er knyttet til en agent, som identificeres. @da
toolkit definition: Yhteisö, johon identifioitavana oleva toimija liittyy.
toolkit definition: Ένα συλλογικό όργανο που συνδέεται με τον προσδιοριζόμενο φορέα. @el
toolkit definition: هيئة مرتبطة بوكيل معروف الهوية @ar
toolkit definition: 和所标识的一个行为者相关的一个团体 @zh-hans
toolkit label: Temsilcinin tüzel kişiyle ilişkisi @tr
toolkit label: ar aģentu saistītā institūcija @lv
toolkit label: collectivité en relation avec un agent @fr
toolkit label: ente correlato di agente @it
toolkit label: entitat corporativa relacionada amb un agent @ca
toolkit label: gerelateerde corporatie van actor @nl
toolkit label: korporasjon relatert til agent @no
toolkit label: korporation relateret til agent @da
toolkit label: mit Akteur in Beziehung stehende Körperschaft @de
toolkit label: related corporate body of agent @en
toolkit label: tegijaga seotud asutus @et
toolkit label: toimijaan liittyvä yhteisö
toolkit label: ágenshez kapcsolódó testület: @hu
toolkit label: σχετικό συλλογικό όργανο του φορέα @el
toolkit label: هيئة مرتبطة بوكيل @ar
toolkit label: 行为者的相关团体 @zh-hans
has subproperty: henkilöön liittyvä yhteisö
has subproperty: yhteistoimijaan liittyvä yhteisö
has subproperty: toimijan sponsoroima yhteisö
has subproperty: toimijan perustama yhteisö
has subproperty: P50218
lexical alias: relatedCorporateBodyOfAgent.en
status: Published
type: Property
domain: C10002
label: a pour collectivité en relation avec un agent @fr
label: ar aģentu saistītā institūcija @lv
label: ha come ente correlato di agente @it
label: har korporasjon relatert til agent @no
label: har korporation relateret til agent @da
label: has related corporate body of agent @en
label: hat mit Akteur in Beziehung stehende Körperschaft @de
label: heeft gerelateerde corporatie van actor @nl
label: tegijaga seotud asutus @et
label: temsilcinin ilgili tüzel kişisi ile ilişkilidir @tr
label: té com a entitat corporativa relacionada amb un agent @ca
label: ágenshez kapcsolódó testület a következő: @hu
label: έχει σχετικό συλλογικό όργανο του φορέα @el
label: له هيئة مرتبطة بوكيل @ar
label: 有行为者的相关团体 @zh-hans
sub property of: toimijaan liittyvä yhteistoimija
sub property of: P00009
definition: Bir temsilciyi, kimliği belirlenen bir temsilciyle bağlantılı olan bir tüzel kişiyle ilişkilendirir. @tr
definition: Correla un agente a un ente associato all'agente che si sta identificando. @it
definition: Hozzákapcsol egy ágenst egy azonosított ágenshez kapcsolódó testülethez. @hu
definition: Liittää toimijan yhteisöön, johon identifioitavana oleva toimija liittyy.
definition: Met un agent en relation avec une collectivité qui est associée à un agent en cours d’identification. @fr
definition: Relaciona un agent amb una entitat corporativa que s’associa amb un agent que s’identifica. @ca
definition: Relateert een actor aan een corporatie die geassocieerd is met een actor die wordt geïdentificeerd. @nl
definition: Relaterer en agent til en korporasjon som forbindes med en identifisert agent. @no
definition: Relaterer en agent til en korporation, som er knyttet til en agent, som identificeres. @da
definition: Relates an agent to a corporate body who is associated with an agent being identified. @en
definition: Sasaista aģentu ar institūciju, kas saistīta ar aģentu. @lv
definition: Seostab tegija asutusega, kes on seotud identifitseeritava tegijaga. @et
definition: Setzt einen Akteur in Beziehung zu einer Körperschaft, die mit einem Akteur in Verbindung steht. @de
definition: Συνδέει έναν φορέα με ένα συλλογικό όργανο που συνδέεται με έναν ταυτοποιημένο φορέα. @el
definition: يربط وكيلا بهيئة مرتبطة بوكيل معروف الهوية. @ar
definition: 将一个行为者与和所标识的一个行为者相关的一个团体关联起来。 @zh-hans

toimijaan liittyvä suku
has element type: 1
toolkit definition: A family who is associated with an agent being identified. @en
toolkit definition: Dzimta/ģimene, kas saistīta aģentu. @lv
toolkit definition: Een familie die geassocieerd is met een actor die wordt geïdentificeerd. @nl
toolkit definition: Egy azonosított ágenshez kapcsolódó család. @hu
toolkit definition: Eine Familie, die mit einem Akteur in Verbindung steht. @de
toolkit definition: En familie som forbindes med en identifisert agent. @no
toolkit definition: Famiglia associata all'agente che si sta identificando. @it
toolkit definition: Familie, som er knyttet til en agent, som identificeres. @da
toolkit definition: Famille qui est associée à un agent en cours d’identification. @fr
toolkit definition: Família que s’associa amb un agent que s’identifica. @ca
toolkit definition: Kimliği belirlenen bir temsilciyle bağlantısı olan bir aile. @tr
toolkit definition: Perekond, kes on seotud identifitseeritava tegijaga. @et
toolkit definition: Suku, johon identifioitavana oleva toimija liittyy.
toolkit definition: Μια οικογένεια που συνδέεται με τον προσδιοριζόμενο φορέα. @el
toolkit definition: عائلة مرتبطة بوكيل معروف الهوية. @ar
toolkit definition: 和所标识的一个行为者相关的一个家族 @zh-hans
toolkit label: ar aģentu saistītā dzimta/ģimene @lv
toolkit label: famiglia correlata di agente @it
toolkit label: familie relateret til agent @da
toolkit label: familie relatert til agent @no
toolkit label: famille en relation avec un agent @fr
toolkit label: família relacionada amb un agent @ca
toolkit label: gerelateerde familie van actor @nl
toolkit label: mit Akteur in Beziehung stehende Familie @de
toolkit label: related family of agent @en
toolkit label: tegijaga seotud perekond @et
toolkit label: temsilciyle ilişkili aile @tr
toolkit label: toimijaan liittyvä suku
toolkit label: ágenshez kapcsolódó család: @hu
toolkit label: σχετική οικογένεια του φορέα @el
toolkit label: عائلة مرتبطة بوكيل @ar
toolkit label: 行为者的相关家族 @zh-hans
has subproperty: henkilöön liittyvä suku
has subproperty: yhteistoimijaan liittyvä suku
has subproperty: P50219
lexical alias: relatedFamilyOfAgent.en
status: Published
type: Property
domain: C10002
label: a pour famille en relation avec un agent @fr
label: ar aģentu saistītā dzimta/ģimene @lv
label: ha come famiglia correlata di agente @it
label: har familie relateret til agent @da
label: har familie relatert til agent @no
label: has related family of agent @en
label: hat mit Akteur in Beziehung stehende Familie @de
label: heeft gerelateerde familie van actor @nl
label: tegijaga seotud perekond @et
label: temsilcinin ilgili ailesi ile ilişkilidir @tr
label: té com a família relacionada amb un agent @ca
label: ágenshez kapcsolódó család a következő: @hu
label: έχει σχετική οικογένεια του φορέα @el
label: له عائلة مرتبطة بوكيل @ar
label: 有行为者的相关家族 @zh-hans
sub property of: toimijaan liittyvä yhteistoimija
sub property of: P00008
definition: Bir temsilciyi, kimliği belirlenen bir temsilciyle bağlantılı olan bir aileyle ilişkilendirir. @tr
definition: Correla un agente a una famiglia associata all'agente che si sta identificando. @it
definition: Hozzákapcsol egy ágenst egy azonosított ágenshez kapcsolodó családhoz. @hu
definition: Liittää toimijan sukuun, johon identifioitavana oleva toimija liittyy.
definition: Met un agent en relation avec une famille qui est associée à un agent en cours d’identification. @fr
definition: Relaciona un agent amb una família que s’associa amb un agent que s’identifica. @ca
definition: Relateert een actor aan een familie die geassocieerd is met een actor die wordt geïdentificeerd. @nl
definition: Relaterer en agent til en familie som forbindes med en identifisert agent. @no
definition: Relaterer en agent til en familie, som er knyttet til en agent, som identificeres. @da
definition: Relates an agent to a family who is associated with an agent being identified. @en
definition: Sasaista aģentu ar dzimtu/ģimeni, kas saistīta aģentu. @lv
definition: Seostab tegija perekonnaga, kes on seotud identifitseeritava tegijaga. @et
definition: Setzt einen Akteur in Beziehung zu einer Familie, die mit einem Akteur in Verbindung steht. @de
definition: Συνδέει έναν φορέα με μια οικογένεια που συνδέεται με έναν ταυτοποιημένο φορέα. @el
definition: يربط وكيلا بعائلة مرتبطة بوكيل معروف الهوية. @ar
definition: 将一个行为者与和所标识的一个行为者相关的一个家族关联起来。 @zh-hans

toimijaan liittyvä henkilö
has element type: 1
toolkit definition: A person who is associated with an agent being identified. @en
toolkit definition: Een persoon die geassocieerd is met een actor die wordt geïdentificeerd. @nl
toolkit definition: Egy azonosított ágenshez kapcsolódó személy. @hu
toolkit definition: Eine Person, die mit einem Akteur in Verbindung steht. @de
toolkit definition: En person som forbindes med en identifisert agent. @no
toolkit definition: Henkilö, johon identifioitavana oleva toimija liittyy.
toolkit definition: Isik, kes on seotud identifitseeritava tegijaga. @et
toolkit definition: Person, som er knyttet til en agent, som identificeres. @da
toolkit definition: Persona associata all'agente che si sta identificando. @it
toolkit definition: Persona que s’associa amb un agent que s’identifica. @ca
toolkit definition: Persona, kura saistīta ar aģentu. @lv
toolkit definition: Personne qui est associée à un agent en cours d’identification. @fr
toolkit definition: Tanımlanan bir temsilciyle bağlantılı olan bir kişi. @tr
toolkit definition: Ένα φυσικό πρόσωπο που συνδέεται με τον προσδιοριζόμενο φορέα. @el
toolkit definition: شخص مرتبط بوكيل معروف الهوية. @ar
toolkit definition: 和所标识的一个行为者相关的一个个人 @zh-hans
toolkit label: ar aģentu saistītā persona @lv
toolkit label: gerelateerde persoon van actor @nl
toolkit label: mit Akteur in Beziehung stehende Person @de
toolkit label: person relateret til agent @da
toolkit label: person relatert til agent @no
toolkit label: persona correlata di agente @it
toolkit label: persona relacionada amb un agent @ca
toolkit label: personne en relation avec un agent @fr
toolkit label: related person of agent @en
toolkit label: tegijaga seotud isik @et
toolkit label: temsilciyle ilişkili kişi @tr
toolkit label: toimijaan liittyvä henkilö
toolkit label: ágenshez kapcsolódó személy: @hu
toolkit label: σχετικό φυσικό πρόσωπο του φορέα @el
toolkit label: شخص مرتبط بوكيل @ar
toolkit label: 行为者的相关个人 @zh-hans
has subproperty: henkilöön liittyvä henkilö
has subproperty: yhteistoimijaan liittyvä henkilö
has subproperty: P50220
lexical alias: relatedPersonOfAgent.en
status: Published
type: Property
domain: C10002
label: a pour personne en relation avec un agent @fr
label: ar aģentu saistītā persona @lv
label: ha come persona correlata di agente @it
label: har person relateret til agent @da
label: har person relatert til agent @no
label: has related person of agent @en
label: hat mit Akteur in Beziehung stehende Person @de
label: heeft gerelateerde persoon van actor @nl
label: tegijaga seotud isik @et
label: temsilcinin ilgili kişisi ile ilişkilidir @tr
label: té com a persona relacionada amb un agent @ca
label: ágenshez kapcsolódó személy a következő: @hu
label: έχει σχετικό φυσικό πρόσωπο του φορέα @el
label: له شخص مرتبط بوكيل @ar
label: 有行为者的相关个人 @zh-hans
sub property of: toimijaan liittyvä toimija
sub property of: P00007
definition: Bir temsilciyi, tanımlanan bir temsilciyle bağlantılı olan bir kişiyle ilişkilendirir. @tr
definition: Correla un agente a una persona associata all'agente che si sta identificando. @it
definition: Hozzákapcsol egy ágenst egy azonosított ágenshez kapcsolódó személyhez. @hu
definition: Liittää toimijan henkilöön, johon identifioitavana oleva toimija liittyy.
definition: Met un agent en relation avec une personne qui est associée à un agent en cours d’identification. @fr
definition: Relaciona un agent amb una persona que s’associa amb un agent que s’identifica. @ca
definition: Relateert een actor aan een persoon die geassocieerd is met een actor die wordt geïdentificeerd. @nl
definition: Relaterer en agent til en person som forbindes med en identifisert agent. @no
definition: Relaterer en agent til en person, som er knyttet til en agent, som identificeres. @da
definition: Relates an agent to a person who is associated with an agent being identified. @en
definition: Sasaista aģentu ar personu, kura saistīta ar aģentu. @lv
definition: Seostab tegija isikuga, kes on seotud identifitseeritava tegijaga. @et
definition: Setzt einen Akteur in Beziehung zu einer Person, die mit einem Akteur in Verbindung steht. @de
definition: Συνδέει έναν φορέα με ένα φυσικό πρόσωπο που συνδέεται με έναν ταυτοποιημένο φορέα. @el
definition: يربط وكيلا بشخص مرتبط بوكيل معروف الهوية @ar
definition: 将一个行为者与和所标识的一个行为者相关的一个个人关联起来。 @zh-hans

maisema-arkkitehti (toimija) teoksessa
has element type: 2
instruction number: 18.5
toolkit definition: A work that involves a responsibility of an agent for creating landscapes. @en
toolkit definition: Bir temsilcinin peyzaj oluşturma sorumluluğunu içeren bir çalışma @tr
toolkit definition: Darbs, kas ietver aģenta atbildību par ainavu arhitektūras aspektiem. @lv
toolkit definition: Een werk dat met zich meebrengt een verantwoordelijkheid van een actor voor het creëren van landschappen. @nl
toolkit definition: Egy mű, amelyhez hozzátartozik egy ágens felelőssége a tájépítészet építészeti vonatkozásaiért. @hu
toolkit definition: Ein Werk, bei dem ein Akteur für die Schaffung von Landschaften verantwortlich ist. @de
toolkit definition: Et verk som involverer ansvar for en agent i form av landskapsarkitektoniske aspekter. @no
toolkit definition: Obra que implica una responsabilitat d’un agent en la creació de paisatges. @ca
toolkit definition: Opera che implica la responsabilità di un agente per gli aspetti architettonici del paesaggio. @it
toolkit definition: Teos, jonka maisemoinnin luomisesta toimija on vastuussa.
toolkit definition: Teos, mis sisaldab tegija vastutust maastikukujunduse arhitektuursete aspektide eest. @et
toolkit definition: Værk, som involverer en agents ansvar for at skabe landskaber. @da
toolkit definition: Œuvre qui comporte une responsabilité de la part d’un agent consistant à créer des paysages. @fr
toolkit definition: Ένα έργο τοπίου, το οποίο περιλαμβάνει την ευθύνη της αρχιτεκτονικής του. @el
toolkit definition: عمل يترتب عليه مسئولية وكيل عن تنسيق المواقع الخارجية. @ar
toolkit definition: 涉及创作景观的一个行为者的责任的一种作品 @zh-hans
toolkit label: Akteur als Landschaftsarchitektin/Landschaftsarchitekt von @de
toolkit label: agent architecte paysagiste de @fr
toolkit label: agent arquitecte paisatgista de @ca
toolkit label: agent, som er landskabsarkitekt af @da
toolkit label: architetto paesaggista agente di @it
toolkit label: ir ainavu arhitekts (aģents) @lv
toolkit label: landscape architect agent of @en
toolkit label: landschapsarchitect-actor van @nl
toolkit label: landskapsarkitekt for (agent) @no
toolkit label: maastikuarhitekt (tegija) teoses @et
toolkit label: maisema-arkkitehti (toimija) teoksessa
toolkit label: peyzaj mimarı temsilcisidir @tr
toolkit label: tájépítész ágense: @hu
toolkit label: αρχιτέκτων τοπίου φορέας του @el
toolkit label: وكيل مهندس تنسيق المواقع الخارجية @ar
toolkit label: ……的景观设计师行为者 @zh-hans
has subproperty: maisema-arkkitehti (henkilö) teoksessa
has subproperty: maisema-arkkitehti (yhteistoimija) teoksessa
has subproperty: P50221
lexical alias: landscapeArchitectAgentOf.en
status: Published
type: Property
domain: C10002
label: er agent, som er landskabsarkitekt af @da
label: er landskapsarkitekt for (agent) @no
label: est un agent architecte paysagiste de @fr
label: ir ainavu arhitekts (aģents) @lv
label: is landscape architect agent of @en
label: is landschapsarchitect-actor van @nl
label: ist Akteur als Landschaftsarchitektin/Landschaftsarchitekt von @de
label: maastikuarhitekt (tegija) teoses @et
label: peyzaj mimarı temsilcisidir @tr
label: tájépítész ágense a következőnek: @hu
label: è architetto paesaggista agente di @it
label: és agent arquitecte paisatgista de @ca
label: είναι αρχιτέκτων τοπίου φορέας του @el
label: هو وكيل مهندس معماري لـ @ar
label: 是……的景观设计师行为者 @zh-hans
sub property of: arkkitehti (toimija) teoksessa
alternative label: Landschaftsarchitektin/Landschaftsarchitekt von @de
alternative label: architecte paysagiste de @fr
alternative label: architetto paesaggista di @it
alternative label: arquitecte paisatgista de @ca
alternative label: arquitecto paisajista de @es
alternative label: landscape architect of @en
alternative label: landskabsarkitekt af @da
alternative label: landskapsarkitekt for @no
alternative label: maastikuarhitekt teoses @et
alternative label: maisema-arkkitehtina maisemasuunnitelmassa
alternative label: peyzaj mimarı @tr
alternative label: tájépítésze: @hu
alternative label: αρχιτέκτων τοπίου του @el
alternative label: مهندس تنسيق المواقع الخارجية @ar
alternative label: ……的景观设计师 @zh-hans
definition: Bir temsilciyi, bir temsilcinin peyzaj yaratmaya ilişkin sorumluluğunu içeren bir eserle ilişkilendirir. @tr
definition: Correla un agente a un'opera che implica la responsabilità di un agente per gli aspetti architettonici del paesaggio. @it
definition: Hozzákapcsol egy ágenst egy műhöz, amelyhez hozzátartozik egy ágens felelőssége a tájépítészet építészeti vonatkozásaiért. @hu
definition: Liittää toimijan teokseen, jonka maisemoinnin luomisesta toimija on vastuussa.
definition: Met un agent en relation avec une œuvre qui comporte une responsabilité de la part d’un agent consistant à créer des paysages. @fr
definition: Relaciona un agent amb una obra que implica una responsabilitat d’un agent en la creació de paisatges. @ca
definition: Relateert een actor aan een werk dat met zich meebrengt een verantwoordelijkheid van een actor voor het creëren van landschappen. @nl

kuvanveistäjä (toimija) teoksessa
has element type: 2
instruction number: 18.5
toolkit definition: A work that involves a responsibility of an agent for three-dimensional modeling, carving, or similar technique. @en
toolkit definition: Darbs, kas ietver aģenta atbildību par trīsdimensionālu modelēšanu, grebšanu vai līdzīgu tehniku. @lv
toolkit definition: Een werk dat met zich meebrengt een verantwoordelijkheid van een actor voor driedimensionaal modelleren, snijden of gelijksoortige techniek. @nl
toolkit definition: Egy mű, amelyhez hozzátartozik egy ágens felelőssége háromdimenziós modellezésért, faragásért vagy hasonló technikáért. @hu
toolkit definition: Ein Werk, bei dem ein Akteur für dreidimensionales Modellieren, Schnitzen oder ähnliche Techniken verantwortlich ist. @de
toolkit definition: Et verk som involverer ansvar for en agent i form av tre-dimensjonal modellering, utskjæring eller lignende teknikker. @no
toolkit definition: Obra que implica una responsabilitat d’un agent en el modelatge, la talla o una tècnica tridimensional similar. @ca
toolkit definition: Opera che implica la responsabilità di un agente per la modellazione tridimensionale, scultura o tecnica simile. @it
toolkit definition: Teos, jossa toimija on vastuussa kolmiulotteisen teoksen luomisesta muovaamalla, veistämällä tai vastaavalla tekniikalla.
toolkit definition: Teos, mis sisaldab tegija vastutust kolmemõõtmelise modelleerimise, nikerdamise või muu sellise tehnika eest. @et
toolkit definition: Værk, som involverer en agents ansvar for tredimensionel modellering, udskæring eller lignende teknik. @da
toolkit definition: Üç boyutlu modelleme, oyma veya benzeri bir teknik için bir temsilcinin sorumluluğunu içeren bir eser. @tr
toolkit definition: Œuvre qui comporte une responsabilité de la part d’un agent consistant à utiliser le modelage, la taille ou une technique similaire pour une œuvre tridimensionnelle. @fr
toolkit definition: Ένα τρισδιάστατο έργο που περιλαμβάνει την καλλιτεχνική ευθύνη του μοντελισμού, της γλυπτικής ή μιας παρόμοιας τεχνικής. @el
toolkit definition: عمل يترتب عليه مسئولية وكيل عن النمذجة ثلاثية الأبعاد، أو النحت، أو تقنية مماثلة. @ar
toolkit definition: 涉及三维模型、雕刻或类似技术的一个行为者的责任的一种作品 @zh-hans
toolkit label: Akteur als Bildhauerin/Bildhauer von @de
toolkit label: agent escultor de @ca
toolkit label: agent sculpteur de @fr
toolkit label: agent, som er skulptør af @da
toolkit label: beeldhouwer-actor van @nl
toolkit label: heykeltıraş temsilcisi @tr
toolkit label: ir tēlnieks (aģents) @lv
toolkit label: kuvanveistäjä (toimija) teoksessa
toolkit label: sculptor agent of @en
toolkit label: scultore agente di @it
toolkit label: skulptor (tegija) teoses @et
toolkit label: skulptør av (agent) @no
toolkit label: szobrász ágense: @hu
toolkit label: γλύπτης φορέας του @el
toolkit label: وكيل نحات @ar
toolkit label: ……的雕塑家行为者 @zh-hans
has subproperty: kuvanveistäjä (henkilö) teoksessa
has subproperty: kuvanveistäjä (yhteistoimija) teoksessa
has subproperty: P50222
lexical alias: sculptorAgentOf.en
status: Published
type: Property
domain: C10002
label: er agent, som er skulptør af @da
label: er skulptør av (agent) @no
label: est un agent sculpteur de @fr
label: heykeltıraş temsilcisidir @tr
label: ir tēlnieks (aģents) @lv
label: is beeldhouwer-actor van @nl
label: is sculptor agent of @en
label: ist Akteur als Bildhauerin/Bildhauer von @de
label: skulptor (tegija) teoses @et
label: szobrász ágense a következőnek: @hu
label: è scultore agente di @it
label: és agent escultor de @ca
label: είναι γλύπτης φορέας του @el
label: هو وكيل نحات لـ @ar
label: 是……的雕塑家行为者 @zh-hans
sub property of: taiteilija (toimija) teoksessa
alternative label: Bildhauer von @de
alternative label: billedhugger af @da
alternative label: escultor de @ca
alternative label: heykeltıraş @tr
alternative label: kuvanveistäjänä teoksessa
alternative label: sculpteur de @fr
alternative label: sculptor of @en
alternative label: scultore di @it
alternative label: skulptor teoses @et
alternative label: skulptør av @no
alternative label: szobrásza: @hu
alternative label: γλύπτης του @el
alternative label: نحات @ar
alternative label: ……的雕塑家 @zh-hans
definition: Bir temsilciyi, üç boyutlu modelleme, oyma veya benzer teknik için bir temsilcinin sorumluluğunu içeren bir eserle ilişkilendirir. @tr
definition: Correla un agente a un'opera che implica la responsabilità di un agente per la modellazione tridimensionale, scultura o tecnica simile. @it
definition: Hozzákapcsol egy ágenst egy műhöz, amelyhez hozzátartozik egy ágens felelőssége háromdimenziós modellezésért, faragásért vagy hasonló technikáért. @hu
definition: Liittää toimijan teokseen, jossa toimija on vastuussa kolmiulotteisen teoksen luomisesta muovaamalla, veistämällä tai vastaavalla tekniikalla.
definition: Met un agent en relation avec une œuvre qui comporte une responsabilité de la part d’un agent consistant à utiliser le modelage, la taille ou une technique similaire pour une œuvre tridimensionnelle. @fr
definition: Relaciona un agent amb una obra que implica una responsabilitat d’un agent en el modelatge, la talla o una tècnica tridimensional similar. @ca
definition: Relateert een actor aan een werk dat met zich meebrengt een verantwoordelijkheid van een actor voor driedimensionaal modelleren, snijden of gelijksoortige techniek. @nl
definition: Relaterer en agent til et verk som involverer ansvar for en agent i form av tre-dimensjonal modellering, utskjæring eller lignende teknikker. @no

käsikirjoittaja (toimija) teoksessa
has element type: 2
instruction number: 18.5
toolkit definition: A work that involves a responsibility of an agent for authoring a screenplay, script, or scene. @en
toolkit definition: Bir senaryo, metin veya sahne yazmak için bir temsilcinin sorumluluğunu içeren bir çalışma. @tr
toolkit definition: Darbs, kas ietver aģenta atbildību par scenārija, uzveduma plāna vai ainas radīšanu. @lv
toolkit definition: Een werk dat met zich meebrengt een verantwoordelijkheid van een actor voor schrijven van een scenario, script of scène. @nl
toolkit definition: Egy mű, amelyhez hozzátartozik egy ágens felelőssége egy forgatókönyv, szövegkönyv vagy jelenet szerzőségéért. @hu
toolkit definition: Ein Werk, bei dem ein Akteur für das Verfassen eines Drehbuchs, eines Skripts oder einer Szene verantwortlich ist. @de
toolkit definition: Et verk som involverer ansvar for en agent i form av å forfatte et skuespill, et manus eller en scene. @no
toolkit definition: Obra que implica una responsabilitat d’un agent en l’autoria d’un guió, un argument o una escena. @ca
toolkit definition: Opera che implica la responsabilità di un agente come autore di una sceneggiatura, copione o scena. @it
toolkit definition: Teos, jossa toimija on vastuussa käsikirjoituksen tai kohtauksen kirjoittamisesta.
toolkit definition: Teos, mis sisaldab tegija vastutust stsenaariumi või stseeni kirjutamise eest. @et
toolkit definition: Værk, som involverer en agents ansvar for at forfatte en drejebog, et manuskript eller en scene. @da
toolkit definition: Œuvre qui comporte une responsabilité de la part d’un agent consistant à être l’auteur d’un scénario, d’un script ou d’une scène. @fr
toolkit definition: Ένα έργο που περιλαμβάνει την ευθύνη της συγγραφής του σεναρίου, των διαλόγων ή των σκηνών. @el
toolkit definition: عمل يترتب عليه مسئولية وكيل عن تأليف نص سينمائي، أو سيناريو، أو مشهد. @ar
toolkit definition: 涉及写作影视剧剧本、脚本或场景的一个行为者的责任的一种作品 @zh-hans
toolkit label: Akteur als Drehbuchautorin/Drehbuchautor von @de
toolkit label: agent guionista de @ca
toolkit label: agent scénariste de @fr
toolkit label: agent, som er manuskriptforfatter af @da
toolkit label: forgatókönyvíró ágense: @hu
toolkit label: ir scenārists (aģents) @lv
toolkit label: käsikirjoittaja (toimija) teoksessa
toolkit label: manusforfatter for (agent) @no
toolkit label: scenarioschrijver-actor van @nl
toolkit label: sceneggiatore agente di @it
toolkit label: screenwriter agent of @en
toolkit label: senarist temsilcisi @tr
toolkit label: stsenarist (tegija) teoses @et
toolkit label: σεναριογράφος φορέας του @el
toolkit label: وكيل كاتب سيناريو @ar
toolkit label: ……的影视剧编剧行为者 @zh-hans
has subproperty: käsikirjoittaja (henkilö) teoksessa
has subproperty: käsikirjoittaja (yhteistoimija) teoksessa
has subproperty: P50223
lexical alias: screenwriterAgentOf.en
status: Published
type: Property
domain: C10002
label: er agent, som er manuskriptforfatter af @da
label: er manusforfatter for (agent) @no
label: est un agent scénariste de @fr
label: forgatókönyvíró ágense a következőnek: @hu
label: ir scenārists (aģents) @lv
label: is scenarioschrijver-actor van @nl
label: is screenwriter agent of @en
label: ist Akteur als Drehbuchautorin/Drehbuchautor von @de
label: senarist temsilcisidir @tr
label: stsenarist (tegija) teoses @et
label: è sceneggiatore agente di @it
label: és agent guionista de @ca
label: είναι σεναριογράφος φορέας του @el
label: هو وكيل كاتب سيناريو لـ @ar
label: 是……的影视剧编剧行为者 @zh-hans
sub property of: kirjoittaja (toimija) teoksessa
alternative label: Drehbuchautor von @de
alternative label: forgatókönyvírója: @hu
alternative label: guionista de @ca
alternative label: käsikirjoittajana teoksessa
alternative label: manusforfatter af @da
alternative label: manusforfatter for @no
alternative label: sceneggiatore di @it
alternative label: screenwriter of @en
alternative label: scénariste de @fr
alternative label: senarist @tr
alternative label: stsenarist teoses @et
alternative label: σεναριογράφος του @el
alternative label: كاتب سيناريو @ar
alternative label: ……的影视剧编剧 @zh-hans
definition: Bir temsilciyi, senaryo, metin veya sahne yazmakla görevli bir temsilcinin sorumluluğunu içeren bir eserle ilişkilendirir. @tr
definition: Correla un agente a un'opera che implica la responsabilità di un agente come autore di una sceneggiatura, copione o scena. @it
definition: Hozzákapcsol egy ágenst egy műhöz, amelyhez hozzátartozik egy ágens felelőssége egy forgatókönyv, szövegkönyv vagy jelenet szerzőségéért. @hu
definition: Liittää toimijan teokseen, jossa toimija on vastuussa käsikirjoituksen tai kohtauksen kirjoittamisesta.
definition: Met un agent en relation avec une œuvre qui comporte une responsabilité de la part d’un agent consistant à être l’auteur d’un scénario, d’un script ou d’une scène. @fr
definition: Relaciona un agent amb una obra que implica una responsabilitat d’un agent en l’autoria d’un guió, un argument o una escena. @ca
definition: Relateert een actor aan een werk dat met zich meebrengt een verantwoordelijkheid van een actor voor schrijven van een scenario, script of scène. @nl
definition: Relaterer en agent til et verk som involverer ansvar for en agent i form av å forfatte et skuespill, et manus eller en scene. @no

sanoittaja (toimija) teoksessa
has element type: 2
instruction number: 18.5
see also: libretisti (toimija) teoksessa
toolkit definition: A work that involves a responsibility of an agent for authoring the words of a popular song, including a song from a musical. @en
toolkit definition: Bir müzikalden bir şarkı da dahil olmak üzere popüler bir şarkının sözlerini yazmak için bir temsilcinin sorumluluğunu içeren bir çalışma. @tr
toolkit definition: Darbs, kas ietver aģenta atbildību par dziesmas vārdiem, ieskaitot dziesmas no mūzikla. @lv
toolkit definition: Een werk dat met zich meebrengt een verantwoordelijkheid van een actor voor schrijven van de woorden van een populair lied, inclusief een lied uit een musical. @nl
toolkit definition: Egy mű, amelyhez hozzátartozik egy ágens felelőssége egy könyűzenei dalszöveg szerzőségéért, musicaldalt is beleértve. @hu
toolkit definition: Ein Werk, bei dem ein Akteur für das Verfassen des Texts eines populären Lieds, einschließlich eines Lieds aus einem Musical, verantwortlich ist. @de
toolkit definition: Et verk som involverer ansvar for en agent i form av å forfatte teksten til en populær sang, inkludert en sang fra en musikal. @no
toolkit definition: Obra que implica una responsabilitat d’un agent en l’autoria de les paraules d’una cançó popular, inclosa una cançó d’un musical. @ca
toolkit definition: Opera che implica la responsabilità di un agente come come autore delle parole di una canzone, inclusa una canzone di un musical. @it
toolkit definition: Teos, jossa toimija on vastuussa populaarimusiikkiin kuuluvan laulun (mukaan lukien musikaalilaulun) sanojen kirjoittamisesta.
toolkit definition: Teos, mis sisaldab tegija vastutust levilaulu (k.a laul muusikalist) sõnade kirjutamise eest. @et
toolkit definition: Værk, som involverer en agents ansvar for at forfatte ordene til en populær sang, inkl. en sang fra en musical. @da
toolkit definition: Œuvre qui comporte une responsabilité de la part d’un agent consistant à être l’auteur des paroles d’une chanson populaire, y compris une chanson d’une comédie musicale. @fr
toolkit definition: Ένα έργο που περιλαμβάνει την ευθύνη της συγγραφής των στίχων ενός δημοφιλούς τραγουδιού, περιλαμβανομένων του τραγουδιού ή των τραγουδιών ενός μιούζικαλ. @el
toolkit definition: عمل يترتب عليه مسئولية وكيل عن تأليف كلمات أغنية، ويشمل ذلك أغنية في مسرحية موسيقية. @ar
toolkit definition: 涉及流行歌曲（包括音乐剧中的歌曲）歌词的写作的一个行为者的责任的一种作品 @zh-hans
toolkit label: Akteur als Textdichterin/Textdichter von @de
toolkit label: agent lletrista de @ca
toolkit label: agent parolier de @fr
toolkit label: agent, som er tekstforfatter af @da
toolkit label: dalszövegíró ágense: @hu
toolkit label: ir dziesmas teksta autors (aģents) @lv
toolkit label: liedtekstschrijver-actor van @nl
toolkit label: lyricist agent of @en
toolkit label: paroliere agente di @it
toolkit label: sangtekstforfatter av (agent) @no
toolkit label: sanoittaja (toimija) teoksessa
toolkit label: sõnade autor (tegija) teoses @et
toolkit label: söz yazarı temsilcisi @tr
toolkit label: στιχουργός φορέας του @el
toolkit label: وكيل كاتب أغاني @ar
toolkit label: ……的作词者行为者 @zh-hans
has subproperty: sanoittaja (henkilö) teoksessa
has subproperty: sanoittaja (yhteistoimija) teoksessa
has subproperty: P50224
lexical alias: lyricistAgentOf.en
status: Published
type: Property
domain: C10002
label: dalszövegíró ágense a következőnek: @hu
label: er agent, som er tekstforfatter af @da
label: er sangtekstforfatter av (agent) @no
label: est un agent parolier de @fr
label: ir dziesmas teksta autors (aģents) @lv
label: is liedtekstschrijver-actor van @nl
label: is lyricist agent of @en
label: ist Akteur als Textdichterin/Textdichter von @de
label: sõnade autor (tegija) teoses @et
label: söz yazarı temsilcisidir @tr
label: è paroliere agente di @it
label: és agent lletrista de @ca
label: είναι στιχουργός φορέας του @el
label: هو وكيل كاتب أغاني لـ @ar
label: 是……的作词者行为者 @zh-hans
sub property of: kirjoittaja (toimija) teoksessa
alternative label: Musical párbeszédeinek szerzősége nem tartozik ide. @hu
alternative label: Textdichter von @de
alternative label: letrista de @es
alternative label: lletrista de @ca
alternative label: lyricist of @en
alternative label: parolier de @fr
alternative label: paroliere di @it
alternative label: sangskriver af @da
alternative label: sangtekstforfatter av @no
alternative label: sanoittajana teoksessa
alternative label: sõnade autor teoses @et
alternative label: söz yazarı @tr
alternative label: στιχουργός του @el
alternative label: كاتب أغاني لـ @ar
alternative label: ……的作词者 @zh-hans
definition: Bir temsilciyi, müzikalden bir şarkı da dahil olmak üzere popüler bir şarkının sözlerini yazmakla görevli bir temsilcinin sorumluluğunu içeren bir eserle ilişkilendirir. @tr
definition: Correla un agente a un'opera che implica la responsabilità di un agente come autore delle parole di una canzone, inclusa una canzone di un musical. @it
definition: Hozzákapcsol egy ágenst egy műhöz, amelyhez hozzátartozik egy ágens felelőssége egy könyűzenei dalszöveg szerzőségéért, musicaldalt is beleértve. @hu
definition: Liittää toimijan teokseen, jossa toimija on vastuussa populaarimusiikkiin kuuluvan laulun (mukaan lukien musikaalilaulun) sanojen kirjoittamisesta.
definition: Met un agent en relation avec une œuvre qui comporte une responsabilité de la part d’un agent consistant à être l’auteur des paroles d’une chanson populaire, y compris une chanson d’une comédie musicale. @fr
definition: Relaciona un agent amb una obra que implica una responsabilitat d’un agent en l’autoria de les paraules d’una cançó popular, inclosa una cançó d’un musical. @ca

libretisti (toimija) teoksessa
has element type: 2
instruction number: 18.5
see also: sanoittaja (toimija) teoksessa
toolkit definition: A work that involves a responsibility of an agent for authoring the words of an opera or other musical stage work, or an oratorio. @en
toolkit definition: Bir opera veya diğer müzikal sahne eserinin veya bir oratoryonun sözlerinin yazılmasında bir temsilcinin sorumluluğunu içeren bir eser. @tr
toolkit definition: Darbs, kas ietver aģenta atbildību par tekstu operai vai citam muzikālam skatuves darbam, vai oratorijai. @lv
toolkit definition: Een werk dat met zich meebrengt een verantwoordelijkheid van een actor voor schrijven van de woorden van een opera of ander muzikaal podiumwerk of een oratorium. @nl
toolkit definition: Egy mű, amelyhez hozzátartozik egy ágens felelőssége egy opera vagy más zenés színpadi mű vagy egy oratórium szövegének szerzőségéért. @hu
toolkit definition: Ein Werk, bei dem ein Akteur für das Verfassen des Texts einer Oper, eines sonstigen Bühnenwerks oder eines Oratoriums verantwortlich ist. @de
toolkit definition: Et verk som involverer ansvar for en agent i form av å forfatte ordene i operaer, operetter, musikalske sceneverk eller oratorier. @no
toolkit definition: Obra que implica una responsabilitat d’un agent en l’autoria de les paraules d’una òpera o una altra obra escènica musical o d’un oratori. @ca
toolkit definition: Opera che implica la responsabilità di un agente come autore dei testi di un'opera lirica, altra opera musicale da palcoscenico o oratorio. @it
toolkit definition: Teos, jossa toimija on vastuussa musiikki- tai koreografisen teoksen, kuten oopperan, baletin tai muun musiikillisen näyttämöteoksen tai oratorion sanojen kirjoittamisesta.
toolkit definition: Teos, mis sisaldab tegija vastutust ooperi või muu muusikalise lavateose või oratooriumi sõnade kirjutamise eest. @et
toolkit definition: Værk, som involverer an agents ansvar for at forfatte ordene til en opera eller andet musikalsk sceneværk eller oratorium. @da
toolkit definition: Œuvre qui comporte une responsabilité de la part d’un agent consistant à être l’auteur des paroles d’un opéra ou d’une autre œuvre musicale scénique ou d’un oratorio. @fr
toolkit definition: Ένα έργο που περιλαμβάνει την ευθύνη της συγγραφής των στίχων μιας όπερας ή κάποιου άλλου μουσικού σκηνικού έργου ή ενός ορατορίου. @el
toolkit definition: عمل يترتب عليه مسئولية وكيل عن تأليف أوبرا أو عمل مسرحي موسيقي، أو موسيقى دينية. @ar
toolkit definition: 涉及歌剧或其他舞台音乐作品或者清唱剧的歌词的写作的一个行为者的责任的一种作品 @zh-hans
toolkit label: Akteur als Librettistin/Librettist von @de
toolkit label: agent librettiste de @fr
toolkit label: agent llibretista de @ca
toolkit label: agent, som er librettist af @da
toolkit label: ir libretists (aģents) @lv
toolkit label: libretist (tegija) teoses @et
toolkit label: libretisti (toimija) teoksessa
toolkit label: librettist agent of @en
toolkit label: librettist for (agent) @no
toolkit label: librettist-actor van @nl
toolkit label: librettista agente di @it
toolkit label: librettista ágense: @hu
toolkit label: opera metni yazarı temsilcisi @tr
toolkit label: λιμπρετίστας φορέας του @el
toolkit label: وكيل واضع كلمات الأوبرا @ar
toolkit label: ……的台本作者行为者 @zh-hans
has subproperty: libretisti (henkilö) teoksessa
has subproperty: libretisti (yhteistoimija) teoksessa
has subproperty: P50225
lexical alias: librettistAgentOf.en
status: Published
type: Property
domain: C10002
label: er agent, som er librettist af @da
label: er librettist for (agent) @no
label: est un agent librettiste de @fr
label: ir libretists (aģents) @lv
label: is librettist agent of @en
label: is librettist-actor van @nl
label: ist Akteur als Librettistin/Librettist von @de
label: libretist (tegija) teoses @et
label: librettista ágense a következőnek: @hu
label: libretto yazarı temsilcisidir @tr
label: è librettista agente di @it
label: és agent llibretista de @ca
label: είναι λιμπρετίστας φορέας του @el
label: هو وكيل واضع كلمات الأوبر لـ @ar
label: 是……的台本作者行为者 @zh-hans
sub property of: kirjoittaja (toimija) teoksessa
alternative label: Librettist von @de
alternative label: Opera metni yazarı @tr
alternative label: libretist teoses @et
alternative label: libretista de @es
alternative label: libretistinä musiikkiteoksessa
alternative label: librettist af @da
alternative label: librettist for @no
alternative label: librettist of @en
alternative label: librettista di @it
alternative label: librettiste de @fr
alternative label: librettistája: @hu
alternative label: llibretista de @ca
alternative label: λιμπρετίστας του @el
alternative label: واضع كلمات الأوبرا @ar
alternative label: ……的台本作者 @zh-hans
definition: Bir temsilciyi, bir operanın veya başka bir müzikal sahne eserinin veya bir oratoryonun sözlerini yazmakla görevli bir temsilcinin sorumluluğunu içeren bir eserle ilişkilendirir. @tr
definition: Correla un agente a un'opera che implica la responsabilità di un agente come autore dei testi di un'opera lirica, altra opera musicale da palcoscenico o oratorio. @it
definition: Hozzákapcsol egy ágenst egy műhöz, amelyhez hozzátartozik egy ágens felelőssége egy opera vagy más zenés színpadi mű vagy egy oratórium szövegének szerzőségéért. @hu
definition: Liittää toimijan teokseen, jossa toimija on vastuussa musiikki- tai koreografisen teoksen, kuten oopperan, baletin tai muun musiikillisen näyttämöteoksen tai oratorion sanojen kirjoittamisesta.
definition: Met un agent en relation avec une œuvre qui comporte une responsabilité de la part d’un agent consistant à être l’auteur des paroles d’un opéra ou d’une autre œuvre musicale scénique ou d’un oratorio. @fr
definition: Relaciona un agent amb una obra que implica una responsabilitat d’un agent en l’autoria de les paraules d’una òpera o una altra obra escènica musical o d’un oratori. @ca

toimijan sponsoroima teos
has element type: 2
instruction number: 18.5
toolkit definition: A work that involves a responsibility of an agent for sponsoring some aspect of a work. @en
toolkit definition: Bir çalışmanın bazı yönlerini maddi olarak desteklemek için bir temsilcinin sorumluluğunu içeren bir çalışma. @tr
toolkit definition: Darbs, kas ietver aģenta atbildību par kāda darba aspekta sponsorēšanu. @lv
toolkit definition: Een werk dat met zich meebrengt een verantwoordelijkheid van een actor voor het sponsoren van een aspect van een werk. @nl
toolkit definition: Egy mű, amelyhez hozzátartozik egy ágens felelőssége egy mű szponzorálásának valamely vonatkozásáért. @hu
toolkit definition: Ein Werk, bei dem ein Akteur für die finanzielle Unterstützung einzelner Aspekte verantwortlich ist. @de
toolkit definition: Et verk som involverer ansvar for en agent i form av sponsing av enkelte aspekter ved et verk. @no
toolkit definition: Obra que implica una responsabilitat d’un agent en el patrocini d’algun aspecte d’una obra. @ca
toolkit definition: Opera che implica la responsabilità di agenteper la sponsorizzazione di alcuni aspetti di un'opera. @it
toolkit definition: Teos, jonka sponsoroimisesta toimija on vastuussa.
toolkit definition: Teos, mis sisaldab tegija vastutust teose mingil viisil toetamise eest. @et
toolkit definition: Værk, som involverer en agents ansvar for at sponsorere et aspekt af et værk. @da
toolkit definition: Œuvre qui comporte une responsabilité de la part d’un agent consistant à parrainer un aspect quelconque d’une œuvre. @fr
toolkit definition: Ένα έργο που περιλαμβάνει την ευθύνη της χρηματοδότησης κάποιας πτυχής ενός έργου, π.χ., επιδοτούμενη έρευνα, χρηματοδότηση συμβάντος. @el
toolkit definition: عمل يترتب عليه مسئولية وكيل عن رعاية بعض جوانب العمل. @ar
toolkit definition: 涉及赞助一种作品某些方面的一个行为者的责任的一种作品 @zh-hans
toolkit label: Akteur als Träger eines Werks von @de
toolkit label: gesponsord werk van actor @nl
toolkit label: obra patrocinada per un agent @ca
toolkit label: opera sponsorizzata di agente @it
toolkit label: sponsor for verk for (agent) @no
toolkit label: sponsored work of agent @en
toolkit label: sponsors (aģents) darbam @lv
toolkit label: tegija toetatud teos @et
toolkit label: temsilcinin sponsor olduğu eser @tr
toolkit label: toimijan sponsoroima teos
toolkit label: værk sponsoreret af agent @da
toolkit label: ágens által szponzorált mű: @hu
toolkit label: œuvre parrainée d’un agent @fr
toolkit label: επιχορηγούμενο έργο του φορέα @el
toolkit label: عمل يرعاه وكيل @ar
toolkit label: 行为者的被赞助作品 @zh-hans
has subproperty: yhteistoimijan sponsoroima teos
has subproperty: henkilön sponsoroima teos
has subproperty: P50226
lexical alias: sponsoredWorkOfAgent.en
status: Published
type: Property
domain: C10002
label: a pour œuvre parrainée d’un agent @fr
label: ha come opera sponsorizzata di agente @it
label: har sponsor for verk for (agent) @no
label: har værk sponsoreret af agent @da
label: has sponsored work of agent @en
label: hat Akteur als Träger eines Werks von @de
label: heeft gesponsord werk van actor @nl
label: sponsors (aģents) darbam @lv
label: tegija toetatud teos @et
label: temsilcinin sponsor olduğu eser ile ilişkilidir @tr
label: té com a obra patrocinada per un agent @ca
label: ágens szponzorált műve a következő: @hu
label: έχει επιχορηγούμενο έργο του φορέα @el
label: له عمل يرعاه وكيل @ar
label: 有行为者的被赞助作品 @zh-hans
sub property of: toimijaan liittyvä teos
alternative label: Egy mű alapját képező kutatás finanszírozása és esemény szponzorálása is idetartozik. @hu
alternative label: Sponsor von @de
alternative label: entitat patrocinadora de @ca
alternative label: organismo patrocinador de @es
alternative label: organismo promotore di @it
alternative label: parraineur de @fr
alternative label: sponsor for @no
alternative label: sponsor olan kuruluş @tr
alternative label: sponsor teoses @et
alternative label: sponsorerende institution af @da
alternative label: sponsoring body of @en
alternative label: sponsoroitu
alternative label: φορέας επιχορήγησης του @el
alternative label: جهة راعية @ar
alternative label: ……的赞助团体 @zh-hans
definition: Bir temsilciyi, bir eserin bazı yönlerine sponsorluk yapma konusunda bir temsilcinin sorumluluğunu içeren bir çalışmayla ilişkilendirir. @tr
definition: Correla un agente a un'opera che implica la responsabilità di agente per la sponsorizzazione di alcuni aspetti di un'opera. @it
definition: Hozzákapcsol egy ágenst egy műhöz, amelyhez hozzátartozik egy ágens felelőssége egy mű szponzorálásának valamely vonatkozásáért. @hu
definition: Liittää toimijan teokseen, jonka sponsoroimisesta toimija on vastuussa.
definition: Met un agent en relation avec une œuvre qui comporte une responsabilité de la part d’un agent consistant à parrainer un aspect quelconque d’une œuvre. @fr
definition: Relaciona un agent amb una obra que implica una responsabilitat d’un agent en el patrocini d’algun aspecte d’una obra. @ca
definition: Relateert een actor aan een werk dat met zich meebrengt een verantwoordelijkheid van een actor voor het sponsoren van een aspect van een werk. @nl

loppusanojen kirjoittajana ekspressiossa
has element type: 2
instruction number: 18.5
toolkit definition: An expression that includes a contribution of providing an afterword. (Deprecated) @en
toolkit definition: Egy kifejezési forma, amely közreműködést testesít meg azzal, hogy egy eredeti művet utószóval lát el. @hu
toolkit definition: Eine Expression, bei der ein Akteur ein Nachwort zum Originalwerk liefert. @de
toolkit definition: Ekspressio, johon sisältyy alkuperäiseen teokseen kirjoitetut loppusanat.
toolkit definition: Et uttrykk som omfatter et bidrag i form av å tilføre et etterord til originalverket. @no
toolkit definition: Expression d’une œuvre qui intègre une contribution consistant à fournir un après-propos à une œuvre originale. @fr
toolkit definition: Expressió que incorpora una contribució que proporciona un epíleg a una obra original. @ca
toolkit definition: Udtryk, der inkorporerer et bidrag ved at sørge for et efterord til et oprindeligt værk. @da
toolkit definition: Μια έκφραση που ενσωματώνει τη συνεισφορά ενός επίλογου στο πρωτότυπο έργο. @el
toolkit label: Verfasser eines Nachworts von @de
toolkit label: auteur d’après-propos de @fr
toolkit label: escriptor d’un epíleg de @ca
toolkit label: forfatter av epilog til @no
toolkit label: forfatter til efterord til @da
toolkit label: loppusanojen kirjoittajana ekspressiossa
toolkit label: utószó írója @hu
toolkit label: writer of afterword of (Deprecated) @en
toolkit label: συγγραφέας του επιλόγου του @el
has subproperty: P50227
lexical alias: writerOfAfterwordOf.en
status: Deprecated
type: Property
domain: C10002
label: er forfatter til efterord til @da
label: est un auteur d’après-propos de @fr
label: is writer of afterword of (Deprecated) @en
label: ist Verfasser eines Nachworts von @de
label: utószavának írója @hu
label: és escriptor d’un epíleg de @ca
label: είναι συγγραφέας του επιλόγου του @el
sub property of: oheisteksti
definition: Egy ágenst (személyt, családot vagy testületet), aki/amely egy mű kifejezési formájához hozzájárul azzal, hogy egy eredeti művet utószóval lát el, hozzákapcsol egy kifejezési formához. @hu
definition: Liittää toimijan ekspressioon, johon sisältyy alkuperäiseen teokseen kirjoitetut loppusanat.
definition: Met un agent qui contribue à une expression d’une œuvre en fournissant un après-propos à une œuvre originale en relation avec une expression. @fr
definition: Relaciona un agent, que contribueix amb una expressió d’una obra proporcionant un epíleg a una obra original, amb una expressió. @ca
definition: Relaterer en agent der har bidraget til et udtryk af et værk ved at sørge for et oprindeligt værk med et efterord til et udtryk. @da
definition: Relates an agent to an expression that includes a contribution of providing an afterword. (Deprecated) @en
definition: Setzt einen Akteur mit einer Expression, bei der ein Akteur ein Nachwort zum Originalwerk liefert, in Beziehung. @de
definition: Συνδέει έναν φορέα, ο οποίος συνεισφέρει σε μια έκφραση ενός έργου παρέχοντας έναν επίλογο στο πρωτότυπο έργο, με μια έκφραση. @el

jälkipuheen kirjoittajana ekspressiossa
has element type: 2
instruction number: 18.5
toolkit definition: An expression that includes a contribution of providing a postface. (Deprecated) @en
toolkit definition: Egy kifejezési forma, amely közreműködést testesít meg azzal, hogy egy eredeti művet utóirattal lát el. @hu
toolkit definition: Eine Expression, bei der ein Akteur ein Postscriptum zum Originalwerk liefert. @de
toolkit definition: Ekspressio, johon sisältyy alkuperäiseen teokseen kirjoitettu jälkipuhe.
toolkit definition: Et uttrykk som omfatter et bidrag i form av å tilføre et etterord til originalverket. @no
toolkit definition: Expression d’une œuvre qui intègre une contribution consistant à fournir une postface à une œuvre originale. @fr
toolkit definition: Expressió que incorpora una contribució que proporciona un postfaci a una obra original. @ca
toolkit definition: Udtryk, der inkorporerer et bidrag ved at sørge for en efterskrift til et oprindeligt værk. @da
toolkit definition: Μια έκφραση που ενσωματώνει τη συνεισφορά ενός επίλογου στο πρωτότυπο έργο. @el
toolkit label: Verfasser eines Postscriptums von @de
toolkit label: escriptor d’un postfaci de @ca
toolkit label: forfatter av etterord til @no
toolkit label: forfatter til efterskrift til @da
toolkit label: jälkipuheen kirjoittajana ekspressiossa
toolkit label: postfacier de @fr
toolkit label: utóirat írója @hu
toolkit label: writer of postface of (Deprecated) @en
toolkit label: συγγραφέας του επιλόγου του @el
has subproperty: P50228
lexical alias: writerOfPostfaceOf.en
status: Deprecated
type: Property
domain: C10002
label: er forfatter til efterskrift til @da
label: est un postfacier de @fr
label: is writer of postface of (Deprecated) @en
label: ist Verfasser eines Postscriptums von @de
label: utóiratának írója @hu
label: és escriptor d’un postfaci de @ca
label: είναι συγγραφέας του επιλόγου του @el
sub property of: oheisteksti
definition: Egy ágenst (személyt, családot vagy testületet), aki/amely egy mű kifejezési formájához hozzájárul azzal, hogy egy eredeti művet utóirattal lát el, hozzákapcsol egy kifejezési formához. @hu
definition: Liittää toimijan ekspressioon, johon sisältyy alkuperäiseen teokseen kirjoitettu jälkipuhe.
definition: Met un agent qui contribue à une expression d’une œuvre en fournissant une postface à une œuvre originale en relation avec une expression. @fr
definition: Relaciona un agent, que contribueix amb una expressió d’una obra proporcionant un postfaci a una obra original, amb una expressió. @ca
definition: Relaterer en agent, der bidrager til et udtryk af et værk ved at sørge for en efterskrift til et oprindeligt værk til et udtryk. @da
definition: Relates an agent to an expression that includes a contribution of providing a postface. (Deprecated) @en
definition: Setzt einen Akteur mit einer Expression, bei der ein Akteur ein Postscriptum zum Originalwerk liefert, in Beziehung. @de
definition: Συνδέει έναν φορέα, ο οποίος συνεισφέρει σε μια έκφραση ενός έργου παρέχοντας έναν επίλογο σε ένα πρωτότυπο έργο, με μια έκφραση. @el

jakautunut yhteisö
has element type: 2
instruction number: 29.5
toolkit definition: A corporate body who split or divided into another corporate body. @en
toolkit definition: Asutus, mille jagunemise tulemus on teine asutus. @et
toolkit definition: Collectivité qui s’est scindée ou s’est divisée pour former une autre collectivité. @fr
toolkit definition: Een corporatie die gesplitst of onderverdeeld is in een andere corporatie. @nl
toolkit definition: Egy testület, amely szétválik vagy más testület részévé válik. @hu
toolkit definition: Eine Körperschaft, die sich in eine andere Körperschaft gespalten oder geteilt hat. @de
toolkit definition: En korporasjon som ble delt opp i en annen korporasjon. @no
toolkit definition: Ente predecessore che si è suddiviso o frazionato in altri enti. @it
toolkit definition: Entitat corporativa que s’escindeix o es divideix per formar una altra entitat corporativa. @ca
toolkit definition: Institūcija, kas sadalīta vairākās jaunās institūcijās. @lv
toolkit definition: Korporation, som opdeles eller opsplittes ind i en anden korporation. @da
toolkit definition: Una entidad corporativa que se separa o divide en otra entidad corporativa. @es
toolkit definition: Yhteisö, joka on jakautunut toiseen yhteisöön.
toolkit definition: Öteki tüzel kişiyi ayıran veya bölen bir tüzel kişi. @tr
toolkit definition: Ένα συλλογικό όργανο το οποίο διασπάστηκε ή διαχωρίστηκε σε κάποιο άλλο συλλογικό όργανο. @el
toolkit definition: هيئة انفصلت أو انقسمت إلى هيئة أخرى. @ar
toolkit definition: 被分出或被划分成另一个团体的一个团体 @zh-hans
toolkit label: Vorgängerin/Vorgänger einer Aufteilung @de
toolkit label: bölünmenin öncüsü @tr
toolkit label: forgænger til opdeling @da
toolkit label: forløper til oppdeling @no
toolkit label: jagunemiseelne asutus @et
toolkit label: jakautunut yhteisö
toolkit label: predecesora de la división @es
toolkit label: predecessor abans d’una escissió @ca
toolkit label: predecessor of split @en
toolkit label: predecessore di suddivisione @it
toolkit label: prédécesseur avant scission @fr
toolkit label: sadalītā institūcija @lv
toolkit label: szétválás előtti jogelődje: @hu
toolkit label: voorganger van splitsing @nl
toolkit label: πρόγονος του διαχωρισμού @el
toolkit label: سابقة نتيجة انفصال @ar
toolkit label: 分出团体的前身 @zh-hans
has subproperty: P50229
lexical alias: predecessorOfSplit.en
status: Published
type: Property
domain: C10005
label: a pour prédécesseur avant scission @fr
label: ana kuruluş ile ilişkilidir @tr
label: ha come predecessore di suddivisione @it
label: har forgænger til opdeling @da
label: har forløper til oppdeling @no
label: has predecessor of split @en
label: hat Vorgängerin/Vorgänger einer Aufteilung @de
label: heeft voorganger van splitsing @nl
label: jagunemiseelne asutus @et
label: sadalītā institūcija @lv
label: szétválás előtti jogelődje a következő: @hu
label: té com a predecessor abans d’una escissió @ca
label: έχει πρόγονο του διαχωρισμού @el
label: لها هيئة سابقة نتيجة انفصال @ar
label: 有分出团体的前身 @zh-hans
sub property of: yhteisön edeltäjä
alternative label: jakautumista edeltänyt yhteisö
definition: Bir tüzel kişiyi, öteki tüzel kişiyi ayıran veya bölen bir tüzel kişiyle ilişkilidir @tr
definition: Correla un ente a un ente che si è separato o diviso in un altro ente. @it
definition: Hozzákapcsol egy testületet egy testülethez, amely szétválik vagy más testület részévé válik. @hu
definition: Liittää yhteisön yhteisöön, joka on jakautunut toiseen yhteisöön.
definition: Met une collectivité en relation avec une collectivité qui s’est scindée ou s’est divisée pour former une autre collectivité. @fr
definition: Relaciona una entitat corporativa amb una entitat corporativa que s’escindeix o es divideix per formar una altra entitat corporativa. @ca
definition: Relateert een corporatie aan een corporatie die gesplitst of onderverdeeld is in een andere corporatie. @nl
definition: Relaterer en korporasjon til en korporasjon som ble delt opp i en annen korporasjon. @no
definition: Relaterer en korporation til en korporation, som opdeles eller opsplittes ind i en anden korporation. @da
definition: Relates a corporate body to a corporate body who split or divided into another corporate body. @en
definition: Sasaista institūciju ar institūciju, kas sadalīta vairākās jaunās institūcijās. @lv
definition: Seostab asutuse asutusega, mille jagunemise tulemus on teine asutus. @et
definition: Setzt eine Körperschaft in Beziehung zu einer Körperschaft, die sich in eine andere Körperschaft gespalten oder geteilt hat. @de
definition: Συνδέει ένα συλλογικό όργανο με ένα συλλογικό όργανο το οποίο διασπάστηκε ή διαχωρίστηκε σε κάποιο άλλο συλλογικό όργανο. @el
definition: يربط هيئة بهيئة انفصلت أو انقسمت إلى هيئة أخرى. @ar
definition: 将一个团体与被分出或被划分成另一个团体的一个团体关联起来。 @zh-hans

yhteisöjäsen yhteisössä
has element type: 2
instruction number: 29.5
toolkit definition: A corporate body of whom a corporate body is a member. @en
toolkit definition: Asutus, mille liige asutus on. @et
toolkit definition: Collectivité dont une collectivité est membre. @fr
toolkit definition: Een corporatie waarvan een corporatie lid is. @nl
toolkit definition: Egy testület, amelynek egy testület a tagja. @hu
toolkit definition: Eine Körperschaft, deren Mitglied eine Körperschaft ist. @de
toolkit definition: En korporasjon som en korporasjon er medlem av. @no
toolkit definition: Ente di cui un ente è membro. @it
toolkit definition: Entitat corporativa de la qual una entitat corporativa n’és un membre. @ca
toolkit definition: Institūcija, kas ir institūcija @lv
toolkit definition: Korporation, som en korporation er medlem af. @da
toolkit definition: Una entidad corporativa formada de la membresía de otras entidades corporativas. @es
toolkit definition: Yhteisö, jossa yhteisö on jäsenenä.
toolkit definition: bir tüzel kişinin üyesi olduğu bir tüzel kişi @tr
toolkit definition: Ένα συλλογικό όργανο που διαμορφώθηκε από τις συνδρομές άλλων συλλογικών οργάνων. @el
toolkit definition: هيئة تكون فيها هيئة عضوا. @ar
toolkit definition: 一个团体是其一个成员的一个团体 @zh-hans
toolkit label: Körperschaft als Mitglied einer Körperschaft von @de
toolkit label: asutuse liige (asutus) asutuses @et
toolkit label: collectivité membre d’une collectivité de @fr
toolkit label: corporate body member of corporate body of @en
toolkit label: corporatief lid van corporatie van @nl
toolkit label: ente membro di ente @it
toolkit label: entidad corporativa por membresía @es
toolkit label: entitat corporativa membre d’una entitat corporativa de @ca
toolkit label: ir institūcijas dalībnieks (institūcija) @lv
toolkit label: korporation, som er medlem af korporation af @da
toolkit label: medlemskorporasjon av korporasjon for @no
toolkit label: testületi tagja a következő testületnek: @hu
toolkit label: tüzel kişinin tüzel kişi üyesi @tr
toolkit label: yhteisöjäsen yhteisössä
toolkit label: συλλογικό όργανο μέλος του συλλογικού οργάνου του @el
toolkit label: هيئة عضو في هيئة @ar
toolkit label: ……的团体的团体成员 @zh-hans
has subproperty: P50230
lexical alias: corporateBodyMemberOfCorporateBodyOf.en
status: Published
type: Property
domain: C10005
label: asutuse liige (asutus) asutuses @et
label: er korporation, som er medlem af korporation af @da
label: er medlemskorporasjon av korporasjon for @no
label: est une collectivité membre d’une collectivité de @fr
label: ir institūcijas dalībnieks (institūcija) @lv
label: is corporate body member of corporate body of @en
label: is corporatief lid van corporatie van @nl
label: ist Körperschaft als Mitglied einer Körperschaft von @de
label: kolektif temsilcisinin tüzel kişi üyesidir @tr
label: testületi tagja a következő testületnek: @hu
label: è ente membro di ente di @it
label: és entitat corporativa membre d’una entitat corporativa de @ca
label: είναι συλλογικό όργανο μέλος του συλλογικού οργάνου του @el
label: هي هيئة عضو في هيئة @ar
label: 是……的团体的团体成员 @zh-hans
sub property of: yhteisöön liittyvä yhteisö
sub property of: yhteisöjäsen yhteistoimijassa
alternative label: Dachorganisation @de
alternative label: collectivité d’affiliation @fr
alternative label: ente appartenente @it
alternative label: entitat corporativa federativa @ca
alternative label: korporationsmedlemskab @da
alternative label: medlemskorporasjon @no
alternative label: membership corporate body @en
alternative label: organismo corporativo de membresía @es
alternative label: tagsággal rendelkező testület: @hu
alternative label: tüzel kişi üyeliği @tr
alternative label: yhteisön laajempi jäsenyhteisö
alternative label: μέλος συλλογικό όργανο @el
alternative label: عضوية هيئة @ar
alternative label: 团体成员身份 @zh-hans
definition: Bir tüzel kişiyi, üyesi olduğu bir tüzel kişi ile ilişkilendirir. @tr
definition: Correla un ente a un ente di cui un ente è membro. @it
definition: Hozzákapcsol egy testületet egy testülethez, amelynek egy testület a tagja. @hu
definition: Liittää yhteisön yhteisöön, joka on muodostunut muiden yhteisöjen jäsenyydestä.
definition: Met une collectivité en relation avec une collectivité dont une collectivité est membre. @fr
definition: Relaciona una entitat corporativa amb una entitat corporativa de la qual una entitat corporativa n’és un membre. @ca
definition: Relateert een corporatie aan een corporatie waarvan een corporatie lid is. @nl

yhteisön yhteisöjäsen
has element type: 2
instruction number: 29.5
toolkit definition: A corporate body who is a member of a corporate body. @en
toolkit definition: Asutus, mis on asutuse liige. @et
toolkit definition: Collectivité qui est membre d’une collectivité. @fr
toolkit definition: Een corporatie die een lid is van een corporatie. @nl
toolkit definition: Egy testület, amely egy testület tagja. @hu
toolkit definition: Eine Körperschaft, die Mitglied einer Körperschaft ist. @de
toolkit definition: En korporasjon som er medlem av en korporasjon. @no
toolkit definition: Ente che è membro di un ente. @it
toolkit definition: Entitat corporativa que és un membre d’una entitat corporativa. @ca
toolkit definition: Institūcija, kas ir institūcijas dalībniece. @lv
toolkit definition: Korporation, som er et medlem af en korporation. @da
toolkit definition: Una entidad corporativa que es miembro de otra entidad corporativa. @es
toolkit definition: Yhteisö, joka on toisen yhteisön jäsenyhteisö.
toolkit definition: bir tüzel kişinin bir üyesi olan bir tüzel kişi. @tr
toolkit definition: Ένα συλλογικό όργανο το οποίο είναι μέλος κάποιου άλλου συλλογικού οργάνου. @el
toolkit definition: هيئة هي عضو في هيئة. @ar
toolkit definition: 是一个团体的一个成员的一个团体 @zh-hans
toolkit label: Mitglied einer Körperschaft (Körperschaft) @de
toolkit label: asutuse liige (asutus) @et
toolkit label: collectivité membre d’une collectivité @fr
toolkit label: corporate body member of corporate body @en
toolkit label: corporatief lid van corporatie @nl
toolkit label: ente membro di ente @it
toolkit label: institūcijas dalībnieks (institūcija) @lv
toolkit label: korporation, som er medlem af korporation @da
toolkit label: medlemskorporasjon @no
toolkit label: membre corporatiu d’una entitat corporativa @ca
toolkit label: miembro corporativo @es
toolkit label: testület testületi tagja: @hu
toolkit label: tüzel kişinin tüzel kişi üyesi @tr
toolkit label: yhteisön yhteisöjäsen
toolkit label: εταιρικό μέλος του συλλογικού οργάνου @el
toolkit label: هيئة عضو في هيئة @ar
toolkit label: 团体的团体成员 @zh-hans
has subproperty: P50231
lexical alias: corporateBodyMemberOfCorporateBody.en
status: Published
type: Property
domain: C10005
label: a pour collectivité membre d’une collectivité @fr
label: asutuse liige (asutus) @et
label: ha come ente membro di ente @it
label: har korporation, som er medlem af korporation @da
label: har medlemskorporasjon @no
label: has corporate body member of corporate body @en
label: heeft corporatief lid van corporatie @nl
label: institūcijas dalībnieks (institūcija) @lv
label: ist Mitglied einer Körperschaft (Körperschaft) @de
label: testület testületi tagja a következő: @hu
label: té com a entitat corporativa membre d’una entitat corporativa @ca
label: tüzel kişinin tüzel kişi üyesi ile ilişkilidir @tr
label: έχει εταιρικό μέλος του συλλογικού οργάνου @el
label: لها هيئة عضو في هيئة @ar
label: 有团体的团体成员 @zh-hans
sub property of: yhteisöön liittyvä yhteisö
sub property of: yhteistoimijan yhteisöjäsen
alternative label: Körperschaftliches Mitglied @de
alternative label: collectivité membre @fr
alternative label: corporate member @en
alternative label: ente componente @it
alternative label: korporasjonsmedlem @no
alternative label: korporationsmedlem @da
alternative label: liige (asutus) @et
alternative label: membre corporatiu @ca
alternative label: miembro corporativo @es
alternative label: testületi tag: @hu
alternative label: tüzel üye @tr
alternative label: yhteisöjäsen
alternative label: εταιρικό μέλος @el
alternative label: عضو هيئة @ar
alternative label: 团体成员 @zh-hans
definition: Bir tüzel kişiyi, bir tüzel kişiliğin üyesi olan bir tüzel kişilikle ilişkilendirir. @tr
definition: Correla un ente a un ente che è membro di un ente. @it
definition: Hozzákapcsol egy testületet egy testülethez, amely egy testület tagja. @hu
definition: Liittää yhteisön yhteisöön, joka on toisen yhteisön jäsenyhteisö.
definition: Met une collectivité en relation avec une collectivité qui est membre d’une collectivité. @fr
definition: Relaciona una entitat corporativa amb una entitat corporativa que és un membre d’una entitat corporativa. @ca

yhdistynyt yhteisö
has element type: 2
instruction number: 29.5
toolkit definition: A corporate body who forms another corporate body by merging with one or more other corporate bodies. @en
toolkit definition: Asutus, mis moodustas teise asutuse, ühinedes ühe või mitme muu asutusega. @et
toolkit definition: Bir veya daha fazla tüzel kişiyle birleşerek başka bir tüzel kişiyi oluşturan bir tüzel kişi @tr
toolkit definition: Collectivité qui forme une autre collectivité en fusionnant avec une ou plusieurs autres collectivités. @fr
toolkit definition: Een corporatie die een andere corporatie vormt door te fuseren met één of meer andere corporaties. @nl
toolkit definition: Egy testület, amely egy vagy több más testülettel egyesülve egy másik testületet alkot. @hu
toolkit definition: Eine Körperschaft, die durch Fusion mit einer Körperschaft oder mehreren anderen Körperschaften eine Körperschaft bildet. @de
toolkit definition: En korporasjon som skapte en annen korporasjonen ved å slås sammen med én eller flere andre korporasjoner. @no
toolkit definition: Ente che ha formato un altro ente per accorpamento con uno o più altri enti. @it
toolkit definition: Entitat corporativa que forma una altra entitat corporativa en fusionar-se amb una o més entitats corporatives. @ca
toolkit definition: Institūcija, kas piedalās apvienošanās procesā un veido citu institūciju. @lv
toolkit definition: Korporation, som danner en anden korporation gennem sammenlægning med en eller flere andre korporationer. @da
toolkit definition: Una entidad corporativa que forma otra entidad corporativa mediante la fusión con otra u otras entidades corporativas. @es
toolkit definition: Yhteisö, joka muodostaa uuden yhteisön yhdistymällä yhden tai useamman muun yhteisön kanssa.
toolkit definition: Ένα συλλογικό όργανο το οποίο δημιούργησε κάποιο άλλο συλλογικό όργανο μέσω της συγχώνευσής του με ένα ή περισσότερα συλλογικά όργανα. @el
toolkit definition: هيئة شكلت هيئة أخرى عن طريق الاندماج مع هيئة أو أكثر . @ar
toolkit definition: 通过与一个或多个团体合并而形成另一个团体的一个团体 @zh-hans
toolkit label: Beteiligte/Beteiligter an einer Fusion @de
toolkit label: apvienošanās dalībnieks @lv
toolkit label: beolvadás alkotóeleme: @hu
toolkit label: birleşmenin bileşeni @tr
toolkit label: component de fusió @ca
toolkit label: component of merger @en
toolkit label: componente de una fusión @es
toolkit label: componente di accorpamento @it
toolkit label: composante de fusion @fr
toolkit label: del af sammenlægning @da
toolkit label: element i sammenslåing @no
toolkit label: onderdeel van fusie @nl
toolkit label: yhdistynyt yhteisö
toolkit label: ühinenud asutus @et
toolkit label: συστατικό μιας συγχώνευσης @el
toolkit label: مكون اندماج @ar
toolkit label: 合并的组成部分 @zh-hans
has subproperty: P50232
lexical alias: componentOfMerger.en
status: Published
type: Property
domain: C10005
label: a pour composante de fusion @fr
label: apvienošanās dalībnieks @lv
label: beolvadás alkotóeleme a következő: @hu
label: birleşme bileşeni ile ilişkilidir @tr
label: ha come componente di accorpamento @it
label: har del af sammenlægning @da
label: har element i sammenslåing @no
label: has component of merger @en
label: hat Beteiligte/Beteiligten an einer Fusion @de
label: heeft onderdeel van fusie @nl
label: té com a component de fusió @ca
label: ühinenud asutus @et
label: έχει συστατικό της συγχώνευσης @el
label: لها مكون اندماج @ar
label: 有合并的组成部分 @zh-hans
sub property of: yhteisön edeltäjä
definition: Bir tüzel kişiyi, bir veya daha fazla farklı tüzel kişiler ile birleşmesi ile farklı tüzel kişi oluşturan bir tüzel kişi ile ilişkilendirir. @tr
definition: Correla un ente a un ente che ha formato un altro ente per accorpamento con uno o più altri enti. @it
definition: Hozzákapcsol egy testületet egy testülethez, amely egy vagy több más testülettel egyesülve egy másik testületet alkot. @hu
definition: Liittää yhteisön yhteisöön, joka muodostaa uuden yhteisön yhdistymällä yhden tai useamman muun yhteisön kanssa.
definition: Met une collectivité en relation avec une collectivité qui forme une autre collectivité en fusionnant avec une ou plusieurs autres collectivités. @fr
definition: Relaciona una entitat corporativa amb una entitat corporativa que forma una altra entitat corporativa en fusionar-se amb una o més entitats corporatives. @ca
definition: Relateert een corporatie aan een corporatie die een andere corporatie vormt door te fuseren met één of meer andere corporaties. @nl
definition: Relaterer en korporasjon til en korporasjon som skapte en annen korporasjonen ved å slås sammen med én eller flere andre korporasjoner. @no
definition: Relaterer en korporation til en korporation, som danner en anden korporation gennem sammenlægning med en eller flere andre korporationer. @da
definition: Relates a corporate body to a corporate body who forms another corporate body by merging with one or more other corporate bodies. @en
definition: Sasaista institūciju ar institūciju, kas piedalās apvienošanās procesā un veido citu institūciju. @lv
definition: Seostab asutuse asutusega, mis moodustas teise asutuse, ühinedes ühe või mitme muu asutusega. @et
definition: Setzt eine Körperschaft in Beziehung zu einer Körperschaft, die durch Fusion mit einer Körperschaft oder mehreren anderen Körperschaften eine Körperschaft bildet. @de
definition: Συνδέει ένα συλλογικό όργανο με ένα συλλογικό όργανο το οποίο δημιούργησε κάποιο άλλο συλλογικό όργανο μέσω της συγχώνευσής του με ένα ή περισσότερα συλλογικά όργανα. @el
definition: يربط هيئة بهيئة قامت بتشكيل هيئة أخرى عن طريق الاندماج مع هيئة أو أكثر من الهيئات الأخرى. @ar
definition: 将一个团体与通过与一个或多个团体合并而形成另一个团体的一个团体关联起来。 @zh-hans

henkilöjäsen suvussa
has element type: 2
instruction number: 29.5
toolkit definition: A family of whom a person is a member. @en
toolkit definition: Bir kişinin üye olduğu bir aile. @tr
toolkit definition: Dzimta/ģimene, kam pievienojas persona. @lv
toolkit definition: Een familie waarvan een persoon lid is. @nl
toolkit definition: Egy család, amelynek egy személy a tagja. @hu
toolkit definition: Eine Familie, zu der eine Person gehört. @de
toolkit definition: En familie som en person er medlem av. @no
toolkit definition: Famiglia di cui una persona è membro. @it
toolkit definition: Familie, som en person er medlem af. @da
toolkit definition: Famille dont une personne est membre. @fr
toolkit definition: Família de la qual una persona n’és membre. @ca
toolkit definition: Perekond, mille liige isik on. @et
toolkit definition: Suku, johon henkilö kuuluu.
toolkit definition: Una familia a la cual la persona pertenece. @es
toolkit definition: Μια οικογένεια στην οποία ανήκει ένα φυσικό πρόσωπο. @el
toolkit definition: عائلة لديها شخص عضو. @ar
toolkit definition: 一个个人是其成员的一个家族 @zh-hans
toolkit label: Ailenin üyesi olan kişi @tr
toolkit label: Person als Familienmitglied von @de
toolkit label: familia @es
toolkit label: henkilöjäsen suvussa
toolkit label: ir dzimtas/ģimenes dalībnieks (persona) @lv
toolkit label: medlem av familie for (person) @no
toolkit label: perekonna liige (isik) perekonnas @et
toolkit label: person member of family of @en
toolkit label: person, som er medlem af familie af @da
toolkit label: persona membre d’una família de @ca
toolkit label: persona membro di famiglia @it
toolkit label: personne membre d’une famille de @fr
toolkit label: persoonlijk lid van familie van @nl
toolkit label: személy tagja a következő családnak: @hu
toolkit label: φυσικό πρόσωπο μέλος της οικογένειας του @el
toolkit label: شخص عضو في عائلة @ar
toolkit label: ……家族的个人成员 @zh-hans
has subproperty: henkilöstä polveutuva suku
has subproperty: tunnettu jäsen suvussa
has subproperty: P50233
lexical alias: personMemberOfFamilyOf.en
status: Published
type: Property
domain: C10004
label: ailesinin kişi üyesidir @tr
label: er medlem av familie for (person) @no
label: er person, som er medlem af familie af @da
label: est une personne membre d’une famille de @fr
label: ir dzimtas/ģimenes dalībnieks (persona) @lv
label: is person member of family of @en
label: is persoonlijk lid van familie van @nl
label: ist Person als Familienmitglied von @de
label: perekonna liige (isik) perekonnas @et
label: személy tagja a következő családnak: @hu
label: è membro persona di famiglia @it
label: és persona membre d’una família de @ca
label: είναι φυσικό πρόσωπο μέλος της οικογένειας του @el
label: هو شخص عضو في عائلة لـ @ar
label: 是……家族的个人成员 @zh-hans
sub property of: henkilöön liittyvä suku
sub property of: henkilöjäsen yhteistoimijassa
alternative label: Familie @de
alternative label: aile @tr
alternative label: családja: @hu
alternative label: famiglia @it
alternative label: familia @es
alternative label: familie @da
alternative label: famille @fr
alternative label: family @en
alternative label: família @ca
alternative label: perekond @et
alternative label: suku
alternative label: οικογένεια @el
alternative label: عائلة @ar
alternative label: 家族 @zh-hans
definition: Bir kişiyi, üye olduğu bir ailenin kişisiyle ilişkilendirir. @tr
definition: Correla una persona a una famiglia di cui una persona è membro. @it
definition: Hozzákapcsol egy személyt egy családhoz, amelynek egy személy a tagja. @hu
definition: Liittää henkilön sukuun, johon henkilö kuuluu.
definition: Met une personne en relation avec une famille dont une personne est membre. @fr

toimihenkilönä yhteisössä
has element type: 2
instruction number: 29.5
toolkit definition: A corporate body in which a person holds an office. @en
toolkit definition: Asutus, kus isik peab ametit. @et
toolkit definition: Collectivité au sein de laquelle une personne exerce une fonction de responsabilité. @fr
toolkit definition: Een corporatie waar een persoon een functie beoefent. @nl
toolkit definition: Egy testület, amelyben egy személy hivatalt visel. @hu
toolkit definition: Eine Körperschaft, in der eine Person ein Amt innehat. @de
toolkit definition: En korporasjon der en person har en ledende stilling. @no
toolkit definition: Ente in cui una persona ha una carica. @it
toolkit definition: Entitat corporativa en la qual una persona té un càrrec. @ca
toolkit definition: Institūcija, kur persona ieņem amatu. @lv
toolkit definition: Korporation, hvor en person har et embede. @da
toolkit definition: Ofisi bulunan tüzel kişi @tr
toolkit definition: Una entidad corporativa en la cual una persona tiene un cargo. @es
toolkit definition: Yhteisö, jota henkilö johtaa tai jossa hän on viranhaltijana.
toolkit definition: Ένα συλλογικό όργανο του οποίου ηγείται ή στο οποίο το φυσικό πρόσωπο κατέχει μια θέση. @el
toolkit definition: يربط شخصا بهيئة يشغل شخص منصبا فيها. @ar
toolkit definition: 一个个人在其中任职的一个团体 @zh-hans
toolkit label: Leitende Angestellte/Leitender Angestellter von @de
toolkit label: ametnik asutuses @et
toolkit label: directiu de @ca
toolkit label: dirigeant de @fr
toolkit label: embedsmand i @da
toolkit label: entidad corporativa sede @es
toolkit label: functionaris van @nl
toolkit label: funzionario di @it
toolkit label: görevli @tr
toolkit label: ir amatpersona @lv
toolkit label: leder for @no
toolkit label: officer of @en
toolkit label: tisztviselője: @hu
toolkit label: toimihenkilönä yhteisössä
toolkit label: υπάλληλος του @el
toolkit label: مسؤول عن @ar
toolkit label: ……的任职者 @zh-hans
has subproperty: pääjohtajana yhteisössä
has subproperty: edunvalvojana yhteisössä
has subproperty: P50234
lexical alias: officerOf.en
status: Published
type: Property
domain: C10004
label: ametnik asutuses @et
label: er embedsmand i @da
label: er leder for @no
label: est un dirigeant de @fr
label: ir amatpersona @lv
label: is functionaris van @nl
label: is officer of @en
label: ist leitende Angestellte/leitender Angestellter von @de
label: kurumsal yetkilisidir @tr
label: tisztviselője a következőnek: @hu
label: è funzionario di @it
label: és directiu de @ca
label: είναι υπάλληλος του @el
label: هو مسؤول عن @ar
label: 是……的任职者 @zh-hans
sub property of: henkilöön liittyvä yhteisö
alternative label: virkamiehenä yhteisössä
definition: Correla una persona a un ente in cui una persona ha una carica. @it
definition: Hozzákapcsol egy személyt egy testülethez, amelyben egy személy hivatalt visel. @hu
definition: Liittää henkilön yhteisöön, jota henkilö johtaa tai jossa hän on viranhaltijana.
definition: Met une personne en relation avec une collectivité au sein de laquelle une personne exerce une fonction de responsabilité. @fr
definition: Relaciona una persona amb una entitat corporativa en la qual una persona té un càrrec. @ca
definition: Relateert een persoon aan een corporatie waar een persoon een functie beoefent. @nl
definition: Relaterer en person til en korporasjon der en person har en ledende stilling. @no
definition: Relaterer en person til en korporation, hvor en person har et embede. @da
definition: Relates a person to a corporate body in which a person holds an office. @en
definition: Sasaista personu ar institūciju, kur persona ieņem amatu. @lv
definition: Seostab isiku asutusega, kus isik peab ametit. @et
definition: Setzt eine Person in Beziehung zu einer Körperschaft, in der eine Person ein Amt innehat. @de
definition: bir kişiyi, bir yer tutan kişiyi tüzel kişilikle ilişkilendirir. @tr
definition: Συνδέει ένα φυσικό πρόσωπο με ένα συλλογικό όργανο, του οποίου ηγείται ή στο οποίο το φυσικό πρόσωπο κατέχει μια θέση. @el
definition: يربط شخصا بهيئة يشغل شخص منصبا فيها . @ar
definition: 将一个个人与一个个人在其中任职的一个团体关联起来。 @zh-hans

suvun käyttämä kieli
has element type: 5
instruction number: 10.8
toolkit definition: A language that is used by a family in its communications. @en
toolkit definition: Bir ailenin iletişiminde kullandığı dil. @tr
toolkit definition: Een taal die gebruikt is door een familie in haar communicatie. @nl
toolkit definition: Egy nyelv, amelyet egy család saját kommunikációjában használ. @hu
toolkit definition: Eine Sprache, die eine Familie bei ihrer Kommunikation verwendet. @de
toolkit definition: Et språk som brukes av en familie i sin kommunikasjon. @no
toolkit definition: Keel, mida perekond suhtluses kasutab. @et
toolkit definition: Kieli, jota suku käyttää viestinnässään.
toolkit definition: Langue qu’une famille utilise pour sa communication. @fr
toolkit definition: Lingua utilizzata da una famiglia nelle sue comunicazioni. @it
toolkit definition: Llengua que és usada per una família en les seves comunicacions. @ca
toolkit definition: Sprog, som en familie anvender i sin kommunikation. @da
toolkit definition: Una lengua que una familia usa para sus comunicaciones. @es
toolkit definition: Valoda, kuru dzimta/ģimene lieto saziņā. @lv
toolkit definition: Μια γλώσσα την οποία χρησιμοποιεί η οικογένεια στις επικοινωνίες της. @el
toolkit definition: لغة تستخدمها العائلة في اتصالاتها. @ar
toolkit definition: 一个家族在其交流中所用的语言 @zh-hans
toolkit label: Ailenin dili @tr
toolkit label: Sprache einer Familie @de
toolkit label: család nyelve: @hu
toolkit label: dzimtas/ģimenes valoda @lv
toolkit label: language of family @en
toolkit label: langue d’une famille @fr
toolkit label: lengua de la familia @es
toolkit label: lingua di famiglia @it
toolkit label: llengua d’una família @ca
toolkit label: perekonna keel @et
toolkit label: sprog for familie @da
toolkit label: språk for familie @no
toolkit label: suvun käyttämä kieli
toolkit label: taal van familie @nl
toolkit label: γλώσσα της οικογένειας @el
toolkit label: لغة عائلة @ar
toolkit label: 家族的语言 @zh-hans
has subproperty: P50235
lexical alias: languageOfFamily.en
status: Published
type: Property
domain: C10008
label: a pour langue d’une famille @fr
label: ailenin dili ile ilişkilidir @tr
label: család nyelve a következő: @hu
label: dzimtas/ģimenes valoda @lv
label: ha come lingua di famiglia @it
label: har sprog for familie @da
label: har språk for familie @no
label: has language of family @en
label: hat Sprache einer Familie @de
label: heeft taal van familie @nl
label: perekonna keel @et
label: té com a llengua d’una família @ca
label: έχει γλώσσα της οικογένειας @el
label: لها لغة عائلة @ar
label: 有家族的语言 @zh-hans
sub property of: yhteistoimijan käyttämä kieli
definition: Bir aileyi, ailenin kullandığı dille ilişkilendirir. @tr
definition: Correla una famiglia a una lingua utilizzata da una famiglia nelle sue comunicazioni. @it
definition: Hozzákapcsol egy családot egy nyelvhez, amelyet egy család használ saját kommunikációjában. @hu
definition: Liittää suvun kieleen, jota suku käyttää viestinnässään.
definition: Met une famille en relation avec une langue qu’une famille utilise pour sa communication. @fr
definition: Relaciona una família amb una llengua que és usada per una família en les seves comunicacions. @ca
definition: Relateert een familie aan een taal die gebruikt is door een familie in haar communicatie. @nl
definition: Relaterer en familie til et sprog, som en familie anvender i sin kommunikation. @da
definition: Relaterer en familie til et språk som brukes av en familie i sin kommunikasjon. @no
definition: Relates a family to a language that is used by a family in its communications. @en
definition: Sasaista dzimtu/ģimeni ar valodu, kuru dzimta/ģimene lieto saziņā. @lv
definition: Seostab perekonna keelega, mida perekond suhtluses kasutab. @et
definition: Setzt eine Familie in Beziehung zu einer Sprache, die eine Familie bei ihrer Kommunikation verwendet. @de
definition: Συνδέει μια οικογένεια με μια γλώσσα την οποία χρησιμοποιεί η οικογένεια στις επικοινωνίες της. @el
definition: يربط أسرة بلغة تستخدمها عائلة في اتصالاتها. @ar
definition: 将一个家族与一个家族在其交流中所用的语言关联起来。 @zh-hans

yhteisön toiminta-aika
has element type: 2
instruction number: 11.4.5
toolkit definition: A timespan during which a corporate body is active in its primary field of endeavor. @en
toolkit definition: Ajanjakso, jonka aikana yhteisö on ollut aktiivinen ensisijaisella toiminta-alallaan.
toolkit definition: Ajavahemik, millal asutus on olnud oma peamisel tegevusalal aktiivne. @et
toolkit definition: Arco di tempo nel quale un ente è attivo nel suo principale campo di impegno. @it
toolkit definition: Bir tüzel kişiliğin, asıl faaliyet alanında aktif olduğu bir zaman aralığı. @tr
toolkit definition: Een tijdspanne gedurende welke een corporatie actief is in haar primaire werkveld. @nl
toolkit definition: Egy időtartam, amely alatt egy testület fő működési területén aktív. @hu
toolkit definition: Ein Zeitraum, in dem eine Körperschaft in ihrem primären Tätigkeitsfeld aktiv ist. @de
toolkit definition: Et tidsrom hvor en korporasjon er aktiv innenfor sitt hovedvirkeområde. @no
toolkit definition: Interval de temps durant el qual una entitat corporativa està en actiu en el seu camp d’activitat principal. @ca
toolkit definition: Laikposms, kurā institūcija ir aktīva savā darbības jomā. @lv
toolkit definition: Laps de temps pendant lequel une collectivité est active dans son principal champ d’activité. @fr
toolkit definition: Tidsperiode, hvori en korporation er aktiv i sit primære virkefelt. @da
toolkit definition: Una fecha o rango de fechas que indican el período en el que la entidad corporativa estaba activa. @es
toolkit definition: Μια χρονολογία ή εύρος χρονολογιών ενδεικτικών της περιόδου κατά την οποία ένα συλλογικό όργανο έδρασε/ήταν ενεργό. @el
toolkit definition: فترة زمنية كانت الهيئة خلالها نشطة في مجال عملها الأساسي. @ar
toolkit definition: 一个团体在其主要努力领域活跃的时间段 @zh-hans
toolkit label: Wirkungszeitraum einer Körperschaft @de
toolkit label: aktivitetsperiode for korporation @da
toolkit label: asutuse tegutsemisaeg @et
toolkit label: institūcijas darbības periods @lv
toolkit label: period of activity of corporate body @en
toolkit label: periode for aktivitet for korporasjon @no
toolkit label: periode van activiteit van corporatie @nl
toolkit label: periodo di attività di ente @it
toolkit label: període d’activitat d’una entitat corporativa @ca
toolkit label: período de actividad de la entidad corporativa @es
toolkit label: période d’activité d’une collectivité @fr
toolkit label: testület tevékenységének időszaka: @hu
toolkit label: tüzel kişinin faaliyet süresi @tr
toolkit label: verksamhetstid för institutionen @sv
toolkit label: yhteisön toiminta-aika
toolkit label: περίοδος της δραστηριοποίησης του συλλογικού οργάνου @el
toolkit label: فترة نشاط الهيئة @ar
toolkit label: 团体的活跃期 @zh-hans
has subproperty: P50236
lexical alias: periodOfActivityOfCorporateBody.en
status: Published
type: Property
domain: C10005
label: a pour période d’activité d’une collectivité @fr
label: asutuse tegutsemisaeg @et
label: ha come periodo di attività di ente @it
label: har aktivitetsperiode for korporation @da
label: har periode for aktivitet for korporasjon @no
label: har verksamhetstid för institutionen @sv
label: has period of activity of corporate body @en
label: hat Wirkungszeitraum einer Körperschaft @de
label: heeft periode van activiteit van corporatie @nl
label: institūcijas darbības periods @lv
label: testület tevékenységiének időszaka a következő: @hu
label: té com a període d’activitat d’una entitat corporativa @ca
label: tüzel kişinin faaliyet dönemi ile ilişkilidir @tr
label: έχει περίοδο της δραστηριοποίησης του συλλογικού οργάνου @el
label: له فترة نشاط هيئة @ar
label: 有团体的活跃期 @zh-hans
sub property of: yhteisöön liittyvä ajanjakso
sub property of: yhteistoimijan toiminta-aika
alternative label: yhteisön toimintaan liittyvä ajanjakso
definition: Correla un ente a un arco di tempo nel quale un ente è attivo nel suo principale campo di impegno. @it
definition: Hozzákapcsol egy testületet egy időtartamhoz, amely alatt egy testület fő működési területén aktív. @hu
definition: Liittää yhteisön ajanjaksoon, jonka aikana yhteisö on ollut aktiivinen ensisijaisella toiminta-alallaan.
definition: Met une collectivité en relation avec un laps de temps pendant lequel une collectivité est active dans son principal champ d’activité. @fr
definition: Relaciona una entitat corporativa amb un interval de temps durant el qual una entitat corporativa està en actiu en el seu camp d’activitat principal. @ca
definition: Relateert een corporatie aan een tijdspanne gedurende welke een corporatie actief is in haar primaire werkveld. @nl
definition: Relaterer en korporasjon til et tidsrom hvor en korporasjon er aktiv innenfor sitt hovedvirkeområde. @no
definition: Relaterer en korporation til en tidsperiode, hvori en korporation er aktiv i sit primære virkefelt. @da
definition: Relates a corporate body to a timespan during which a corporate body is active in its primary field of endeavor. @en
definition: Sasaista institūciju ar laikposmu, kurā institūcija ir aktīva savā darbības jomā. @lv
definition: Seostab asutuse ajavahemikuga, millal asutus on olnud oma peamisel tegevusalal aktiivne. @et
definition: Setzt eine Körperschaft in Beziehung zu einem Zeitraum, in dem eine Körperschaft in ihrem primären Tätigkeitsfeld aktiv ist. @de
definition: bir tüzel kişiyi, kendi öncelikli çalışma alanında uğraşma etkinliği sırasında bir zaman aralığı bir tüzel kişi ile ilgilidir. @tr
definition: Συνδέει ένα συλλογικό όργανο με μια χρονολογία ή εύρος χρονολογιών ενδεικτικών της περιόδου κατά την οποία ήταν ενεργό ένα συλλογικό όργανο. @el
definition: يربط هيئة بفترة زمنية كانت الهيئة خلالها نشطة في مجال عملها الأساسي. @ar
definition: 将一个团体与一个团体在其主要努力领域活跃的时间段关联起来。 @zh-hans

yhteisön kategoria
has element type: 5
instruction number: 11.7.1.4
toolkit definition: A type to which a corporate body belongs. @en
toolkit definition: Bir tüzel kişinin ait olduğu tür. @tr
toolkit definition: Een type waartoe een corporatie behoort. @nl
toolkit definition: Egy típus, amelyhez egy testület tartozik. @hu
toolkit definition: Eine Art, zu der eine Körperschaft gehört. @de
toolkit definition: En type som en korporasjon tilhører. @no
toolkit definition: Tipo a cui un ente appartiene. @it
toolkit definition: Tipus al qual pertany una entitat corporativa. @ca
toolkit definition: Type auquel une collectivité appartient. @fr
toolkit definition: Type, som en korporation tilhører. @da
toolkit definition: Tyyppi, johon yhteisö kuuluu.
toolkit definition: Tüüp, millesse asutus kuulub. @et
toolkit definition: Veids, pie kura pieder institūcija. @lv
toolkit definition: Μια κατηγοριοποίηση για έναν τύπο συλλογικού οργάνου. @el
toolkit definition: نوع تنتمي إليه هيئة. @ar
toolkit definition: 一个团体所属于的一种类型 @zh-hans
toolkit label: Kategorie einer Körperschaft @de
toolkit label: asutuse kategooria @et
toolkit label: categoria di ente @it
toolkit label: categoria d’entitat corporativa @ca
toolkit label: categorie van corporatie @nl
toolkit label: category of corporate body @en
toolkit label: catégorie de collectivité @fr
toolkit label: institūcijas kategorija @lv
toolkit label: kategori af korporation @da
toolkit label: kategori av korporasjon @no
toolkit label: testület kategóriája: @hu
toolkit label: tipo de entidad corporativa @es
toolkit label: tüzel kişi kategorisi @tr
toolkit label: yhteisön kategoria
toolkit label: κατηγορία του συλλογικού οργάνου @el
toolkit label: فئة الهيئة @ar
toolkit label: 团体的类别 @zh-hans
has subproperty: julkishallinnollisen yhteisön kategoria
has subproperty: P50237
lexical alias: categoryOfCorporateBody.en
status: Published
type: Property
domain: C10005
label: a pour catégorie de collectivité @fr
label: asutuse kategooria @et
label: ha come categoria di ente @it
label: har kategori af korporation @da
label: har kategori av korporasjon @no
label: has category of corporate body @en
label: hat Kategorie einer Körperschaft @de
label: heeft categorie van corporatie @nl
label: institūcijas kategorija @lv
label: testület kategóriája a következő: @hu
label: té com a categoria d’entitat corporativa @ca
label: tüzel kişinin kategorisi ile ilişkilidir @tr
label: έχει κατηγορία του συλλογικού οργάνου @el
label: له فئة لهيئة @ar
label: 有团体的类别 @zh-hans
sub property of: yhteistoimijan kategoria
alternative label: asutuse tüüp @et
alternative label: testület típusa: @hu
alternative label: tipo de organismo corporativo @es
alternative label: tipo di ente @it
alternative label: tipus d’entitat corporativa @ca
alternative label: type af korporation @da
alternative label: type de collectivité @fr
alternative label: type korporasjon @no
alternative label: type of corporate body @en
alternative label: tüzel kişinin türü @tr
alternative label: yhteisön tyyppi
alternative label: τύπος του συλλογικού οργάνου @el
alternative label: نوع الهيئة @ar
alternative label: 团体的类型 @zh-hans
definition: Bir tüzel kişiyi, üyesi olan bir tür tüzel kişilik ile ilişkilidir. @tr
definition: Correla un ente a un tipo a cui un ente appartiene. @it
definition: Hozzákapcsol egy testületet ahhoz a típushoz, amelyhez a testület tartozik. @hu
definition: Liittää yhteisön tyyppiin, johon yhteisö kuuluu.
definition: Met une collectivité en relation avec un type auquel une collectivité appartient. @fr
definition: Relaciona una entitat corporativa amb un tipus al qual pertany una entitat corporativa. @ca
definition: Relateert een corporatie aan een type waartoe een corporatie behoort. @nl
definition: Relaterer en korporasjon til en type som en korporasjon tilhører. @no

julkishallinnollisen yhteisön kategoria
has element type: 5
instruction number: 11.7.1.5
toolkit definition: A type to which a government belongs. @en
toolkit definition: Bir hükümetin ait olduğu bir tür @tr
toolkit definition: Een type waartoe een regering behoort. @nl
toolkit definition: Egy típus, amelyhez a igazgatási szerv tartozik. @hu
toolkit definition: Eine Art, zu der eine Gebietskörperschaft gehört. @de
toolkit definition: En type som en myndighet tilhører. @no
toolkit definition: Tipo a cui un governo appartiene. @it
toolkit definition: Tipus al qual pertany un govern. @ca
toolkit definition: Type auquel un gouvernement appartient. @fr
toolkit definition: Type, som en myndighed tilhører. @da
toolkit definition: Tyyppi, johon julkishallinnollinen yhteisö kuuluu.
toolkit definition: Tüüp, millesse valitsus kuulub. @et
toolkit definition: Veids, pie kura pieder jurisdikcija. @lv
toolkit definition: Μια κατηγοριοποίηση για έναν τύπο συλλογικού οργάνου. @el
toolkit definition: نوع تنتمي إليه حكومة. @ar
toolkit definition: 一个政府所属于的一种类型 @zh-hans
toolkit label: Kategorie einer Gebietskörperschaft @de
toolkit label: categoria de govern @ca
toolkit label: categoria di governo @it
toolkit label: categorie van regering @nl
toolkit label: category of government @en
toolkit label: catégorie de gouvernement @fr
toolkit label: hükümet kategorisi @tr
toolkit label: igazgatási szerv kategóriája: @hu
toolkit label: julkishallinnollisen yhteisön kategoria
toolkit label: jurisdikcijas kategorija @lv
toolkit label: kategori af myndighed @da
toolkit label: kategori av myndighet @no
toolkit label: tipo de jurisdicción @es
toolkit label: valitsuse kategooria @et
toolkit label: κατηγορία της δικαιοδοσίας @el
toolkit label: فئة حكومة @ar
toolkit label: 政府的类别 @zh-hans
has subproperty: P50238
lexical alias: categoryOfGovernment.en
status: Published
type: Property
domain: C10005
label: a pour catégorie de gouvernement @fr
label: ha come categoria di governo @it
label: har kategori af myndighed @da
label: har kategori av myndighet @no
label: has category of government @en
label: hat Kategorie einer Gebietskörperschaft @de
label: heeft categorie van regering @nl
label: hükümetin kategorisi ile ilişkilidir @tr
label: igazgatási szerv kategóriája a következő: @hu
label: jurisdikcijas kategorija @lv
label: té com a categoria de govern @ca
label: valitsuse kategooria @et
label: έχει κατηγορία της κυβέρνησης @el
label: له فئة حكومة @ar
label: 有政府的类别 @zh-hans
sub property of: yhteisön kategoria
alternative label: hükümetin türü @tr
alternative label: igazgatási szerv típusa: @hu
alternative label: joghatóság típusa: @hu
alternative label: tipo de gobierno @es
alternative label: tipo de jurisdicción @es
alternative label: tipo di giurisdizione @it
alternative label: type af myndighed @da
alternative label: type de gouvernement @fr
alternative label: type de juridiction @fr
alternative label: type jurisdiksjon @no
alternative label: type myndighet @no
alternative label: type of government @en
alternative label: type of jurisdiction @en
alternative label: valitsuse tüüp @et
alternative label: võimkonna kategooria @et
alternative label: yargının türü @tr
alternative label: τύπος της δικαιοδοσίας @el
alternative label: τύπος της κυβέρνησης @el
alternative label: نوع حكومة @ar
alternative label: 政府的类型 @zh-hans
alternative label: 行政管辖区的类型 @zh-hans
definition: Bir hükümet üyesi olan bir tür tüzel bir kişi ile ilişkilidir. @tr
definition: Correla un ente a un tipo a cui un governo appartiene. @it

muu määrite
has element type: 6
instruction number: 11.7.1.6
toolkit definition: A characteristic other than place that is associated with corporate body, date associated with corporate body, associated institution, type of corporate body, or type of jurisdiction. (Deprecated) @en
toolkit definition: Característica diferent d’un lloc associat amb una entitat corporativa, una data associada amb una entitat corporativa, una institució associada, un tipus d’entitat corporativa o un tipus de jurisdicció. @ca
toolkit definition: Caractéristique autre qu’un lieu associé à une collectivité, une date associée à une collectivité, une institution associée, un type de collectivité ou un type de juridiction. @fr
toolkit definition: Egy, a testülethez kötődő jellemző, amely nem hely, nem egy testülethez kapcsolódó dátum, egy kapcsolt intézmény, testülettípus, joghatásköri típus. @hu
toolkit definition: Eine Eigenschaft, außer einem Ort, der mit einer Körperschaft in Verbindung steht, einem Datum, das mit einer Körperschaft in Verbindung steht, einer in Verbindung stehenden Institution, einer Art einer Körperschaft oder einer Art einer Gebietskörperschaft. @de
toolkit definition: En annen egenskap enn sted som forbindes med en korporasjon, tidspunkt som forbindes med en korporasjon, tilknyttet institusjon, type korporasjon eller type jurisdiksjon. @no
toolkit definition: Karakteristika anden end sted, knyttet til korporation, år eller dato knyttet til korporation, tilknyttet institution, type af korporation eller jurisdiktion. @da
toolkit definition: Yhteisöön liittyvä määrite, joka on muu kuin paikka, yhteisöön liittyvä ajanjakso, liittyvä yhteisö, yhteisön tyyppi tai hallintoalueen tyyppi.
toolkit definition: Ένα χαρακτηριστικό άλλο από τον συνδεδεμένο με το συλλογικό όργανο τόπο, τη συνδεδεμένη με το συλλογικό όργανο χρονολογία, το συνδεδεμένο ίδρυμα, τον τύπο του συλλογικού οργάνου ή τον τύπο της δικαιοδοσίας. @el
toolkit label: Sonstige Kennzeichnung @de
toolkit label: altra designació @ca
toolkit label: anden betegnelse @da
toolkit label: annen betegnelse @no
toolkit label: autre désignation @fr
toolkit label: muu määrite
toolkit label: más megnevezés @hu
toolkit label: other designation (Deprecated) @en
toolkit label: otra designación @es
toolkit label: άλλος προσδιορισμός @el
has subproperty: P50239
lexical alias: otherDesignation.en
status: Deprecated
type: Property
domain: C10005
label: a pour autre désignation @fr
label: har anden betegnelse @da
label: has other designation (Deprecated) @en
label: hat sonstige Kennzeichnung @de
label: té com a altra designació @ca
label: van más elnevezése @hu
label: έχει άλλον προσδιορισμό @el
sub property of: muu yhteisöön liittyvä määrite
definition: Egy testületet hozzákapcsol egy másik megnevezéshez. @hu
definition: Liittää yhteisön muuhun määritteeseen.
definition: Met une collectivité en relation avec une autre désignation. @fr
definition: Relaciona una entitat corporativa amb una altra designació. @ca
definition: Relaterer en korporation til en anden betegnelse. @da
definition: Relates a corporate body to another designation. (Deprecated) @en
definition: Setzt eine Körperschaft mit einer Eigenschaft, außer einem Ort, der mit einer Körperschaft in Verbindung steht, einem Datum, das mit einer Körperschaft in Verbindung steht, einer in Verbindung stehenden Institution, einer Art einer Körperschaft oder einer Art einer Gebietskörperschaft, in Beziehung. @de
definition: Συνδέει ένα συλλογικό όργανο με κάποιον άλλον προσδιορισμό @el

laajempi emoyhtiö
has element type: 2
instruction number: 29.5
toolkit definition: A corporate body who acts for a local affiliated body and others at a broader organizational level. @en
toolkit definition: Asutus, mis tegutseb kohaliku sidusasutuse ja teiste jaoks laiemal organisatsioonilisel tasandil. @et
toolkit definition: Collectivité qui agit pour une collectivité affiliée locale et pour d’autres à un niveau organisationnel plus vaste. @fr
toolkit definition: Een corporatie die optreedt voor een lokaal aangesloten orgaan en anderen op een breder organisatorisch niveau. @nl
toolkit definition: Egy testület, amely a helyi tagszervezete és mások érdekében tágabb szervezeti szinten jár el. @hu
toolkit definition: Eine Körperschaft, die für eine lokale Filiale und für andere, auf einer größeren organisatorischen Ebene, handelt. @de
toolkit definition: En korporasjon som handler på vegne av en lokal, tilknyttet korporasjon og andre på et høyere organisasjonsnivå. @no
toolkit definition: Ente che agisce per un ente localmente affiliato e altri a un livello organizzativo più ampio. @it
toolkit definition: Entitat corporativa que actua en un nivell organitzatiu més ampli per a una entitat afiliada local i per a altres entitats. @ca
toolkit definition: Institūcija, kas pārvalda lokālas filiāles. @lv
toolkit definition: Korporation, som agerer for en lokalt tilknyttet korporation og andre på et bredere organisatorisk niveau. @da
toolkit definition: Laajempi yhteisö, jolla on yhteys paikallisiin tytäryhtiöihin organisaatiorakenteen kautta.
toolkit definition: Una entidad corporativa que actúa para la entidad afiliada local y otras en un nivel organizacional más amplio. @es
toolkit definition: Yerel bir bağlı kuruluş ve diğerleri adına daha geniş bir organizasyonel düzeyde hareket eden bir tüzel kişi. @tr
toolkit definition: Ένα συλλογικό όργανο το οποίο ενεργεί για ένα τοπικό συνδεδεμένο όργανο και άλλα (-ους) σε ένα ευρύτερο οργανωτικό επίπεδο. @el
toolkit definition: هيئة تعمل لصالح هيئة محلية تابعة ولهيئات أخرى على مستوى تنظيمي أوسع. @ar
toolkit definition: 为一个本地隶属团体行为并为一个更广泛的组织层次其他团体行为的一个团体 @zh-hans
toolkit label: Dachverband @de
toolkit label: breder aangesloten orgaan @nl
toolkit label: bredere tilknyttet korporation @da
toolkit label: broader affiliated body @en
toolkit label: collectivité affiliée plus vaste @fr
toolkit label: daha geniş bağlı kuruluş @tr
toolkit label: entidad afiliada amplia @es
toolkit label: entitat afiliada més àmplia @ca
toolkit label: felettes tagszervezet: @hu
toolkit label: laajempi emoyhtiö
toolkit label: laiem sidusasutus @et
toolkit label: organismo affiliato più ampio @it
toolkit label: overordnet tilknyttet korporasjon @no
toolkit label: pārvaldošā institūcija @lv
toolkit label: ευρύτερο συνδεδεμένο όργανο @el
toolkit label: هيئة تابعة أوسع نطاقا @ar
toolkit label: 更广泛的隶属团体 @zh-hans
has subproperty: P50240
lexical alias: broaderAffiliatedBody.en
status: Published
type: Property
domain: C10005
label: a pour collectivité affiliée plus vaste @fr
label: daha geniş bağlı kuruluş ile ilişkilidir @tr
label: felettes tagszervezete a következő: @hu
label: ha come organismo affiliato più ampio @it
label: har bredere tilknyttet korporation @da
label: har overordnet tilknyttet korporasjon @no
label: has broader affiliated body @en
label: hat Dachverband @de
label: heeft breder aangesloten orgaan @nl
label: laiem sidusasutus @et
label: pārvaldošā institūcija @lv
label: té com a entitat afiliada més àmplia @ca
label: έχει ευρύτερο συνδεδεμένο όργανο @el
label: لها تبعية لهيئة أوسع @ar
label: 有更广泛的隶属团体 @zh-hans
sub property of: yhteisöön liittyvä yhteisö
definition: Bir tüzel kişiyi, daha geniş bir örgütlülük düzeyinde gayri ve yerli bir kişi eklemek için hareket eden tüzel bir kişiyle ilişkilendirir. @tr
definition: Correla un ente a un ente che agisce per un ente localmente affiliato e altri a un livello organizzativo più ampio. @it
definition: Hozzákapcsol egy testületet egy testülethez, amely a helyi tagszervezete és mások érdekében tágabb szervezeti szinten jár el. @hu
definition: Liittää yhteisön laajempaan yhteisöön, jolla on yhteys paikallisiin tytäryhtiöihin organisaatiorakenteen kautta.
definition: Met une collectivité en relation avec une collectivité qui agit pour une collectivité affiliée locale et pour d’autres à un niveau organisationnel plus vaste. @fr
definition: Relaciona una entitat corporativa amb una entitat corporativa que actua en un nivell organitzatiu més ampli per a una entitat afiliada local i per a altres entitats. @ca
definition: Relateert een corporatie aan een corporatie die optreedt voor een lokaal aangesloten orgaan en anderen op een breder organisatorisch niveau. @nl
definition: Relaterer en korporasjon til en korporasjon som handler på vegne av en lokal, tilknyttet korporasjon og andre på et høyere organisasjonsnivå. @no
definition: Relaterer en korporation til en korporation, som agerer for en lokalt tilknyttet korporation og andre på et bredere organisatorisk niveau. @da
definition: Relates a corporate body to a corporate body who acts for a local affiliated body and others at a broader organizational level. @en
definition: Sasaista institūciju ar institūciju, kas pārvalda lokālas filiāles. @lv
definition: Seostab asutuse asutusega, mis tegutseb kohaliku sidusasutuse ja teiste jaoks laiemal organisatsioonilisel tasandil. @et
definition: Setzt eine Körperschaft in Beziehung zu einer Körperschaft, die für eine lokale Filiale und für andere, auf einer größeren organisatorischen Ebene, handelt. @de
definition: Συνδέει ένα συλλογικό όργανο με ένα συλλογικό όργανο το οποίο ενεργεί για ένα τοπικό συνδεδεμένο όργανο και άλλα (-ους) σε ένα ευρύτερο οργανωτικό επίπεδο. @el
definition: يربط هيئة بهيئة تعمل لصالح هيئة محلية تابعة وهيئات أخرى على مستوى تنظيمي أوسع نطاقا. @ar
definition: 将一个团体与为一个本地隶属团体行为并为一个更广泛的组织层次其他团体行为的一个团体关联起来。 @zh-hans

paikallinen tytäryhtiö
has element type: 2
instruction number: 29.5
toolkit definition: A corporate body that is local who is affiliated with a broader body which acts for it and others at a broader organizational level. @en
toolkit definition: Collectivité locale qui est affiliée à une collectivité plus vaste agissant pour elle et pour d’autres à un niveau organisationnel plus vaste. @fr
toolkit definition: Een lokale corporatie die aangesloten is bij een breder orgaan dat optreedt voor zichzelf en anderen op een breder organisatorisch niveau. @nl
toolkit definition: Egy helyi testület, amely része egy felettes testületnek, amely annak és másoknak az érdekében cselekszik szélesebb szervezeti szinten. @hu
toolkit definition: Eine lokale Körperschaft, die mit einem Dachverband verbunden ist, der für sie und andere auf einer größeren organisatorischen Ebene handelt. @de
toolkit definition: En lokal korporasjon tilknyttet en overordnet korporasjon som handler på dens og andres vegne på et høyere organisasjonsnivå. @no
toolkit definition: Ente locale affiliato con un ente più ampio che agisce per esso e altri a un livello organizzativo più ampio. @it
toolkit definition: Entitat corporativa que és local que està afiliada amb una entitat més àmplia que actua per a aquella i per a altres entitats en un nivell organitzatiu més ampli. @ca
toolkit definition: Kendisi ve diğerleri için daha geniş bir örgütsel düzeyde hareket eden daha geniş bir kuruma bağlı yerel bir tüzel kişilik. @tr
toolkit definition: Kohalik asutus, mis on seotud suurema asutusega, mis tegutseb kohaliku sidusasutuse ja teiste jaoks laiemal organisatsioonilisel tasandil. @et
toolkit definition: Lokal korporation, som er tilknyttet et bredere organ, som agerer for den og andre på et bredere organisatorisk niveau. @da
toolkit definition: Lokālas nozīmes institūcija, kas ir filiāle plašākai institūcijai. @lv
toolkit definition: Paikallinen yhteisö, jolla on yhteys emoyhtiön edustamaan laajempaan organisaatioon.
toolkit definition: Una entidad corporativa afiliada a otra más amplia que actúa para ella y para otras en un nivel organizacional más amplio. @es
toolkit definition: Ένα τοπικό συλλογικό όργανο συνδεδεμένο με ένα ευρύτερο όργανο, το οποίο ενεργεί εκ μέρους του και άλλων σε ένα ευρύτερο οργανωτικό επίπεδο. @el
toolkit definition: هيئة محلية تابعة لهيئة أوسع نطاقا، تعمل لصالحها ولهيئات أخرى على مستوى تنظيمي أوسع. @ar
toolkit definition: 作为本地的并隶属于一个更广泛的团体、为其并为一个更广泛的组织层次其他团体行为的一个团体 @zh-hans
toolkit label: Lokaler Partner @de
toolkit label: Yerel bağlı kuruluş @tr
toolkit label: affiliato locale @it
toolkit label: afiliado local @es
toolkit label: collectivité affiliée locale @fr
toolkit label: entitat afiliada local @ca
toolkit label: helyi tagszervezet: @hu
toolkit label: institūcijas filiāle @lv
toolkit label: kohalik sidusasutus @et
toolkit label: local affiliate @en
toolkit label: lokaal aangeslotene @nl
toolkit label: lokal filial @da
toolkit label: lokal tilknyttet korporasjon @no
toolkit label: paikallinen tytäryhtiö
toolkit label: τοπική σύνδεση @el
toolkit label: تابع محلي @ar
toolkit label: 本地隶属 @zh-hans
has subproperty: P50241
lexical alias: localAffiliate.en
status: Published
type: Property
domain: C10005
label: a pour collectivité affiliée locale @fr
label: ha come affiliato locale @it
label: har lokal filial @da
label: har lokal tilknyttet korporasjon @no
label: has local affiliate @en
label: hat lokalen Partner @de
label: heeft lokaal aangeslotene @nl
label: helyi tagszervezete a következő: @hu
label: institūcijas filiāle @lv
label: kohalik sidusasutus @et
label: té com a entitat afiliada local @ca
label: yerel bağlı kuruluş ile ilişkilidir @tr
label: έχει τοπική σύνδεση @el
label: لها تابع محلي @ar
label: 有本地隶属 @zh-hans
sub property of: yhteisöön liittyvä yhteisö
definition: Bir tüzel kişiyi, kendisi ve daha geniş bir organizasyonel düzeyde diğerleri için hareket eden daha geniş bir kuruluşa bağlı olan yerel bir tüzel kuruluşla ilişkilendirir. @tr
definition: Correla un ente a un ente locale che è affiliato con un ente più ampio che agisce per esso e altri a un livello organizzativo più ampio. @it
definition: Hozzákapcsol egy testületet egy helyi testülethez, amely része egy felettes testületnek, amely annak és másoknak az érdekében cselekszik szélesebb szervezeti szinten. @hu
definition: Liittää yhteisön paikalliseen yhteisöön, jolla on yhteys emoyhtiön edustamaan laajempaan organisaatioon.
definition: Met une collectivité en relation avec une collectivité locale qui est affiliée à une collectivité plus vaste agissant pour elle et pour d’autres à un niveau organisationnel plus vaste. @fr
definition: Relaciona una entitat corporativa amb una entitat corporativa que és local que està afiliada amb una entitat més àmplia que actua per a aquella i per a altres entitats en un nivell organitzatiu més ampli. @ca
definition: Relateert een corporatie aan een lokale corporatie die aangesloten is bij een breder orgaan dat optreedt voor zichzelf en anderen op een breder organisatorisch niveau. @nl
definition: Relaterer en korporasjon til en lokal korporasjon tilknyttet en overordnet korporasjon som handler på dens og andres vegne på et høyere organisasjonsnivå. @no
definition: Relaterer en korporation til en lokal korporation, som er tilknyttet et bredere organ, som agerer for den og andre på et bredere organisatorisk niveau. @da
definition: Relates a corporate body to a corporate body that is local who is affiliated with a broader body which acts for it and others at a broader organizational level. @en
definition: Sasaista institūciju ar lokālas nozīmes institūciju, kas ir filiāle plašākai institūcijai. @lv
definition: Seostab asutuse kohaliku asutusega, mis on seotud suurema asutusega, mis tegutseb kohaliku sidusasutuse ja teiste jaoks laiemal organisatsioonilisel tasandil. @et
definition: Setzt eine Körperschaft in Beziehung zu einer lokalen Körperschaft, die mit einem Dachverband verbunden ist, der für sie und andere auf einer größeren organisatorischen Ebene handelt. @de
definition: Συνδέει ένα συλλογικό όργανο με ένα τοπικό συλλογικό όργανο συνδεδεμένο με ένα ευρύτερο όργανο, το οποίο ενεργεί εκ μέρους του και άλλων σε ένα ευρύτερο οργανωτικό επίπεδο. @el
definition: يربط هيئة بهيئة محلية تابعة لهيئة أوسع نطاقا، تعمل لصالحها ولهيئات أخرى على مستوى تنظيمي أوسع. @ar
definition: 将一个团体与作为本地的并隶属于一个更广泛的团体、为其并为一个更广泛的组织层次其他团体行为的一个团体关联起来。 @zh-hans

paperinvalmistaja (toimija) manifestaatiossa
has element type: 2
instruction number: 18.5
toolkit definition: A manifestation that involves a responsibility of an agent for making paper. @en
toolkit definition: Bir temsilcinin kağıt yapımı için sorumluluğunu içeren bir gösterim. @tr
toolkit definition: Een manifestatie die met zich meebrengt een verantwoordelijkheid van een actor voor productie van papier. @nl
toolkit definition: Egy megjelenési forma, amelyhez hozzátartozik egy ágens felelőssége a papír előállításáért. @hu
toolkit definition: Eine Manifestation, bei der ein Akteur für die Produktion von Papier verantwortlich ist. @de
toolkit definition: En manifestasjon som involverer ansvar for en agent i form av å produsere papir. @no
toolkit definition: Kehastus, mis sisaldab tegija vastutust paberi tootmise eest. @et
toolkit definition: Manifestaatio, jossa käytettävän paperin valmistamisesta toimija on vastuussa.
toolkit definition: Manifestació que implica una responsabilitat d’un agent en l’elaboració del paper. @ca
toolkit definition: Manifestation qui comporte une responsabilité de la part d’un agent consistant à confectionner du papier. @fr
toolkit definition: Manifestation, som involverer en agents ansvar for at producere papir. @da
toolkit definition: Manifestazione che implica una responsabilità di un agente per la produzione di carta. @it
toolkit definition: Manifestācija, kas ietver aģenta atbildību par papīra izgatavošanu. @lv
toolkit definition: Μια εκδήλωση που χρησιμοποιεί χαρτί, το οποίο παράγεται για την κατασκευή μιας εκδήλωσης. @el
toolkit definition: تجسيدة تنطوي على مسئولية وكيل عن إنتاج الورق. @ar
toolkit definition: 涉及造纸的一个行为者的责任的一种载体表现 @zh-hans
toolkit label: Akteur als Papiermacherin/Papiermacher von @de
toolkit label: Kağıt üreticisi temsilcisi @tr
toolkit label: agent paperer de @ca
toolkit label: agent papetier de @fr
toolkit label: agent, som er papirproducent af @da
toolkit label: cartaio agente di @it
toolkit label: ir papīra izgatavotājs (aģents) @lv
toolkit label: paberivalmistaja (tegija) kehastuses @et
toolkit label: paperinvalmistaja (toimija) manifestaatiossa
toolkit label: papermaker agent of @en
toolkit label: papiermaker-actor van @nl
toolkit label: papirprodusent for (agent) @no
toolkit label: papírgyártó ágense: @hu
toolkit label: χαρτοποιός φορέας του @el
toolkit label: وكيل صانع ورق @ar
toolkit label: ……的造纸者行为者 @zh-hans
has subproperty: paperinvalmistaja (henkilö) manifestaatiossa
has subproperty: paperinvalmistaja (yhteistoimija) manifestaatiossa
has subproperty: P50242
lexical alias: papermakerAgentOf.en
status: Published
type: Property
domain: C10002
label: er agent, som er papirproducent af @da
label: er papirprodusent for (agent) @no
label: est un agent papetier de @fr
label: ir papīra izgatavotājs (aģents) @lv
label: is papermaker agent of @en
label: is papiermaker-actor van @nl
label: ist Akteur als Papiermacherin/Papiermacher von @de
label: kağıt üreticisi temsilcisidir @tr
label: paberivalmistaja (tegija) kehastuses @et
label: papírgyártó ágense a következőnek: @hu
label: è cartaio agente di @it
label: és agent paperer de @ca
label: είναι χαρτοποιός φορέας του @el
label: هو وكيل صانع ورق لـ @ar
label: 是……的造纸者行为者 @zh-hans
sub property of: toimijaan liittyvä manifestaatio
alternative label: Kağıt üreticisi @tr
alternative label: Papiermacher von @de
alternative label: cartaio di @it
alternative label: paberivalmistaja kehastuses @et
alternative label: papelero de @es
alternative label: paperer de @ca
alternative label: paperinvalmistajana manifestaatiossa
alternative label: papermaker of @en
alternative label: papetier de @fr
alternative label: papirproducent af @da
alternative label: papirprodusent for @no
alternative label: papírgyártója: @hu
alternative label: χαρτοποιός του @el
alternative label: صانع ورق @ar
alternative label: ……的造纸者 @zh-hans
definition: Bir temsilciyi, bir temsilcinin kağıt yapma sorumluluğunu içeren bir gösterimle ilişkilendirir. @tr
definition: Correla un agente a una manifestazione che implica una responsabilità di un agente per la produzione di carta. @it
definition: Hozzákapcsol egy ágenst egy megjelenési formához, amelyhez hozzátartozik egy ágens felelőssége a papír előállításáért. @hu
definition: Liittää toimijan manifestaatioon, jossa käytettävän paperin valmistamisesta toimija on vastuussa.
definition: Met un agent en relation avec une manifestation qui comporte une responsabilité de la part d’un agent consistant à confectionner du papier. @fr
definition: Relaciona un agent amb una manifestació que implica una responsabilitat d’un agent en l’elaboració del paper. @ca
definition: Relateert een actor aan een manifestatie die met zich meebrengt een verantwoordelijkheid van een actor voor productie van papier. @nl

visuaalisten tehosteiden tekijä (toimija) ekspressiossa
has element type: 2
instruction number: 18.5
toolkit definition: An expression that includes a contribution by an agent of designing and creating post-production visual effects. @en
toolkit definition: Een expressie die omvat een bijdrage door een actor door ontwerpen en creëren van post-productie visuele effecten. @nl
toolkit definition: Egy kifejezési forma, amely magában foglalja egy ágens közreműködését utómunkálati vizuális effektusok tervezésében és létrehozásában. @hu
toolkit definition: Eine Expression, zu der ein Akteur beiträgt, indem er in der Postproduktion visuelle Effekte entwirft und erstellt. @de
toolkit definition: Ekspressio, jonka tekemiseen toimija osallistuu suunnittelemalla ja luomalla visuaaliset tehosteet jälkituotantovaiheessa.
toolkit definition: Espressione che include un contributo da parte di un agente nella progettazione e creazione di effetti visivi in post-produzione. @it
toolkit definition: Et uttrykk som inkluderer et bidrag fra en agent som utformer og skaper visuelle effekter i etterproduksjon. @no
toolkit definition: Expression qui intègre une contribution de la part d’un agent consistant à concevoir et à créer des effets visuels en postproduction. @fr
toolkit definition: Expressió que inclou una contribució d’un agent en el disseny i la creació dels efectes visuals de postproducció. @ca
toolkit definition: Izteiksme, kas ietver aģenta ieguldījumu, izstrādājot un radot kustīga attēla pēcapstrādes vizuālos efektus. @lv
toolkit definition: Prodüksiyon sonrası görsel efektleri tasarlayan ve yaratan bir temsilcinin katkısını içeren bir anlatım. @tr
toolkit definition: Udtryk, som omfatter en agents bidrag ved at designe og skabe visuelle effekter efter produktionen. @da
toolkit definition: Väljendus, millesse tegija on andnud panuse, kavandades ja luues järelproduktsiooni ajal visuaalseid efekte. @et
toolkit definition: Μια έκφραση ενός έργου κινητής εικόνας που περιλαμβάνει την ευθύνη του σχεδιασμού και της δημιουργίας οπτικών εφέ στο μεταπαραγωγικό στάδιο. @el
toolkit definition: تعبيرة تتضمن إسهام وكيل في تصميم وإنشاء مؤثرات مرئية لما بعد الإنتاج. @ar
toolkit definition: 包括设计并创作制作后视觉效果的一个行为者的贡献的一种内容表达 @zh-hans
toolkit label: Akteur als Visual-effects-Provider von @de
toolkit label: aanbieder visuele effecten-actor van @nl
toolkit label: agent fournisseur d’effets visuels de @fr
toolkit label: agent proveïdor d’efectes visuals de @ca
toolkit label: agent, som er leverandør af visuelle effekter af @da
toolkit label: görsel efekt sağlayıcı temsilci @tr
toolkit label: ir vizuālo efektu mākslinieks (aģents) @lv
toolkit label: leverandør av visuelle effekter for (agent) @no
toolkit label: operatore degli effetti visivi agente di @it
toolkit label: visuaalefektide tootja (tegija) väljenduses @et
toolkit label: visuaalisten tehosteiden tekijä (toimija) ekspressiossa
toolkit label: visual effects provider agent of @en
toolkit label: vizuális effektusokat szolgáltató ágense: @hu
toolkit label: παροχέας οπτικών αποτελεσμάτων φορέας του @el
toolkit label: وكيل مورد مؤثرات مرئية @ar
toolkit label: ……的视觉效果提供者行为者 @zh-hans
has subproperty: visuaalisten tehosteiden tekijä (henkilö) ekspressiossa
has subproperty: visuaalisten tehosteiden tekijä (yhteistoimija) ekspressiossa
has subproperty: P50243
lexical alias: visualEffectsProviderAgentOf.en
status: Published
type: Property
domain: C10002
label: Görsel efektler sağlayıcısı temsilcisidir @tr
label: er agent, som er leverandør af visuelle effekter af @da
label: er leverandør av visuelle effekter for (agent) @no
label: est un agent fournisseur d’effets visuels de @fr
label: ir vizuālo efektu mākslinieks (aģents) @lv
label: is aanbieder visuele effecten-actor van @nl
label: is visual effects provider agent of @en
label: ist Akteur als Visual-effects-Provider von @de
label: visuaalefektide tootja (tegija) väljenduses @et
label: vizuális effektusokat szolgáltató ágense a következőnek: @hu
label: è operatore di effetti visivi agente di @it
label: és agent proveïdor d’efectes visuals de @ca
label: είναι παροχέας οπτικών αποτελεσμάτων φορέας του @el
label: هو وكيل مورد مؤثرات مرئية لـ @ar
label: 是……的视觉效果提供者行为者 @zh-hans
sub property of: esitykseen osallinen toimija ekspressiossa
alternative label: Visual-effects-Provider von @de
alternative label: fornitore di effetti visuali di @it
alternative label: fournisseur d’effets visuels de @fr
alternative label: görsel efekt sağlayıcısı @tr
alternative label: leverandør af visuelle effekter af @da
alternative label: leverandør av visuelle effekter for @no
alternative label: proveedor de efectos visuales de @es
alternative label: proveïdor d’efectes visuals de @ca
alternative label: visuaalefektide tootja väljenduses @et
alternative label: visuaalisten tehosteiden tekijänä elokuvassa
alternative label: visual effects provider of @en
alternative label: vizuális effektusok szolgáltatója: @hu
alternative label: παροχέας οπτικών αποτελεσμάτων του @el
alternative label: مورد مؤثرات مرئية @ar
alternative label: ……的视觉效果提供者 @zh-hans
definition: Bir temsilciyi, yapım sonrası görsel efektleri tasarlayan ve oluşturan bir temsilcinin katkısını içeren bir anlatımla ilişkilendirir. @tr
definition: Correla un agente a un'espressione che include un contributo da parte di un agente nella progettazione e creazione di effetti visivi in post-produzione. @it
definition: Hozzákapcsol egy ágenst egy kifejezési formához, amely magában foglalja egy ágens közreműködését utómunkálati vizuális effektusok tervezésében és létrehozásában. @hu
definition: Liittää toimijan ekspressioon, jonka tekemiseen toimija osallistuu suunnittelemalla ja luomalla visuaaliset tehosteet jälkituotantovaiheessa.
definition: Met un agent en relation avec une expression qui intègre une contribution de la part d’un agent consistant à concevoir et à créer des effets visuels en postproduction. @fr
definition: Relaciona un agent amb una expressió que inclou una contribució d’un agent en el disseny i la creació dels efectes visuals de postproducció. @ca
definition: Relateert een actor aan een expressie die omvat een bijdrage door een actor door ontwerpen en creëren van post-productie visuele effecten. @nl

erikoistehosteiden tekijä (toimija) ekspressiossa
has element type: 2
instruction number: 18.5
toolkit definition: An expression that includes a contribution by an agent of designing and creating on-set special effects, such as on-set mechanical effects and in-camera optical effects. @en
toolkit definition: Een expressie die omvat een bijdrage door een actor door ontwerpen en creëren van op-de-set speciale effecten, zoals op-de-set mechanische effecten en in-camera optische effecten. @nl
toolkit definition: Egy kifejezési forma, amely magában foglalja egy ágens közreműködését olyan helyszíni speciális effektusok tervezésében és létrehozásában, mint a mechanikai és kamerán belüli optikai hatások. @hu
toolkit definition: Eine Expression, zu der ein Akteur beiträgt, indem er am Set Spezialeffekte, wie zum Beispiel mechanische Effekte am Set und optische Effekte in der Kamera, entwirft und erstellt. @de
toolkit definition: Ekspressio, jonka tekemiseen toimija osallistuu suunnittelemalla ja luomalla taltioinnin aikana tapahtuvat erikoistehosteet, kuten mekaaniset tehosteet ja kameralla toteutettavat optiset tehosteet.
toolkit definition: Espressione che include un contributo da parte di un agente nella progettazione e creazione di effetti speciali sul set, quali effetti meccanici sul set ed effetti ottici della telecamera. @it
toolkit definition: Et uttrykk som inkluderer et bidrag fra en agent som utformer og skaper spesialeffekter under innspilling, for eksempel mekaniske effekter på settet eller optiske effekter i kameraet. @no
toolkit definition: Expression qui intègre une contribution de la part d’un agent consistant à concevoir et à créer des effets spéciaux de plateau tels que des effets mécaniques de plateau et des effets d’optique dans la caméra. @fr
toolkit definition: Expressió que inclou una contribució d’un agent en el disseny i la creació d’efectes especials de plató, com ara efectes mecànics de plató i efectes òptics de càmera. @ca
toolkit definition: Izteiksme, kas ietver aģenta ieguldījumu, izstrādājot un radot scēnu specefektus, piemēram, radot scēnas mehāniskos efektus un kameras specifiskos optiskos efektus. @lv
toolkit definition: Set içi mekanik efektler ve kamera içi optik efektler gibi set içi özel efektlerin tasarlanması ve yaratılması konusunda bir temsilcinin katkısını içeren bir anlatım. @tr
toolkit definition: Udtryk, som omfatter en agents bidrag ved at designe og skabe specialeffekter på stedet, såsom mekaniske effekter og optiske kameraeffekter. @da
toolkit definition: Väljendus, millesse tegija on andnud panuse, kavandades ja luues salvestusaegsed eriefektid, nt salvestusaegsed mehaanilised efektid ja kaameraga tehtavad optilised efektid. @et
toolkit definition: Μια έκφραση μιας κινητής εικόνας ή ενός ακουστικού έργου η οποία περιλαμβάνει την ευθύνη του σχεδιασμού και της δημιουργίας κατά τη διάρκεια των γυρισμάτων ειδικών εφέ, όπως on-set μηχανικών εφέ και in-camera οπτικών εφέ. @el
toolkit definition: تعبيرة تتضمن إسهام وكيل في تصميم مؤثرات خاصة وإنشائها في موقع التصوير، مثل المؤثرات الميكانيكية والمؤثرات البصرية بالكاميرا. @ar
toolkit definition: 包括设计并创作现场特殊效果（例如现场机械效果和相机光学效果）的一个行为者的贡献的一种内容表达 @zh-hans
toolkit label: Akteur als Special-effects-Provider von @de
toolkit label: aanbieder speciale effecten-actor van @nl
toolkit label: agent fournisseur d’effets spéciaux de @fr
toolkit label: agent proveïdor d’efectes especials de @ca
toolkit label: agent, som er leverandør af specialeffekter af @da
toolkit label: eriefektide tootja (tegija) väljenduses @et
toolkit label: erikoistehosteiden tekijä (toimija) ekspressiossa
toolkit label: ir specefektu mākslinieks (aģents) @lv
toolkit label: leverandør av spesialeffekter for (agent) @no
toolkit label: operatore degli effetti speciali agente di @it
toolkit label: special effects provider agent of @en
toolkit label: speciális effektusokat szolgáltató ágens: @hu
toolkit label: özel efekt sağlayıcı temsilci @tr
toolkit label: παροχέας ειδικών αποτελεσμάτων φορέας του @el
toolkit label: وكيل مورد مؤثرات مرئية الخاصة @ar
toolkit label: ……的特殊效果提供者行为者 @zh-hans
has subproperty: erikoistehosteiden tekijä (henkilö) ekspressiossa
has subproperty: erikoistehosteiden tekijä (yhteistoimija) ekspressiossa
has subproperty: P50244
lexical alias: specialEffectsProviderAgentOf.en
status: Published
type: Property
domain: C10002
label: er agent, som er leverandør af specialeffekter af @da
label: er leverandør av spesialeffekter for (agent) @no
label: eriefektide tootja (tegija) väljenduses @et
label: est un agent fournisseur d’effets spéciaux de @fr
label: ir specefektu mākslinieks (aģents) @lv
label: is aanbieder speciale effecten-actor van @nl
label: is special effects provider agent of @en
label: ist Akteur als Special-effects-Provider von @de
label: speciális effektusokat szolgáltató ágense a következőnek: @hu
label: Özel efekt sağlayıcısı temsilcisi @tr
label: è operatore di effetti speciali agente di @it
label: és agent proveïdor d’efectes especials de @ca
label: είναι παροχέας ειδικών αποτελεσμάτων φορέας του @el
label: هو وكيل مورد مؤثرات خاصة لـ @ar
label: 是……的特殊效果提供者行为者 @zh-hans
sub property of: esitykseen osallinen toimija ekspressiossa
alternative label: Special-effects-Provider von @de
alternative label: eriefektide tootja väljenduses @et
alternative label: erikoistehosteiden tekijänä ekspressiossa
alternative label: fornitore di effetti speciali di @it
alternative label: fournisseur d’effets spéciaux de @fr
alternative label: leverandør af specialeffekter af @da
alternative label: leverandør av spesialeffekter for @no
alternative label: proveedor de efectos especiales de @es
alternative label: proveïdor d’efectes especials de @ca
alternative label: special effects provider of @en
alternative label: speciális effektusok szolgáltatója: @hu
alternative label: özel efekt sağlayıcı @tr
alternative label: παροχέας ειδικών αποτελεσμάτων του @el
alternative label: مورد مؤثرات خاصة @ar
alternative label: ……的特殊效果提供者 @zh-hans
definition: Bir temsilciyi, mekanik efektler ve kamera ışık efektleri gibi sette özel efektlerin tasarlayan ve oluşturan bir temsilcinin katkısını içeren bir anlatımla ilişkilendirir. @tr
definition: Correla un agente a un'espressione che include un contributo da parte di un agente nella progettazione e creazione di effetti speciali sul set, quali effetti meccanici sul set ed effetti ottici della telecamera. @it
definition: Hozzákapcsol egy ágenst egy kifejezési formához, amely magában foglalja egy ágens közreműködését olyan helyszíni speciális effektusok tervezésében és létrehozásában, mint a mechanikai és kamerán belüli optikai hatások. @hu
definition: Liittää toimijan ekspressioon, jonka tekemiseen toimija osallistuu suunnittelemalla ja luomalla taltioinnin aikana tapahtuvat erikoistehosteet, kuten mekaaniset tehosteet ja kameralla toteutettavat optiset tehosteet.
definition: Met un agent en relation avec une expression qui intègre une contribution de la part d’un agent consistant à concevoir et à créer des effets spéciaux de plateau tels que des effets mécaniques de plateau et des effets d’optique dans la caméra. @fr
definition: Relaciona un agent amb una expressió que inclou una contribució d’un agent en el disseny i la creació d’efectes especials de plató, com ara efectes mecànics de plató i efectes òptics de càmera. @ca
definition: Relateert een actor aan een expressie die omvat een bijdrage door een actor door ontwerpen en creëren van op-de-set speciale effecten, zoals op-de-set mechanische effecten en in-camera optische effecten. @nl

tekstaaja (toimija) ekspressiossa
has element type: 2
instruction number: 18.5
toolkit definition: An expression that includes a contribution by an agent of drawing text and graphic sound effects for a comic book, graphic novel, etc. @en
toolkit definition: Bir çizgi roman için metin ve grafik ses efektleri çizen bir temsilcinin katkısını içeren bir anlatım. @tr
toolkit definition: Een expressie die omvat een bijdrage door een actor door tekenen van tekst en grafische geluidseffecten voor een comic, stripboek etc. @nl
toolkit definition: Egy kifejezési forma, amely magában foglalja egy ágens közreműködését képregény, képregényalbum stb. szövegének és grafikai hangeffektusainak rajzolásában. @hu
toolkit definition: Eine Expression, zu der ein Akteur beiträgt, indem er für ein Comicbuch, eine Graphic Novel und so weiter Text und grafische Toneffekte zeichnet. @de
toolkit definition: Ekspressio, jossa toimija osallistuu sarjakuvan, sarjakuvaromaanin tms. ekspression tekemiseen piirtämällä tekstin ja graafiset äänitehosteet.
toolkit definition: Espressione che include un contributo da parte di un agente nel disegno di testo ed effetti sonori grafici per un fumetto, graphic novel, etc. @it
toolkit definition: Et uttrykk som inkluderer et bidrag fra en agent i form av å tegne tekst og grafiske lydeffekter for en tegneserie, tegneserieroman, etc. @no
toolkit definition: Expression qui intègre une contribution de la part d’un agent consistant à dessiner le texte et les effets sonores graphiques pour une bande dessinée, un roman graphique, etc. @fr
toolkit definition: Expressió que inclou una contribució d’un agent en el dibuix de text i d’efectes sonors gràfics d’un còmic, una novel·la gràfica, etc. @ca
toolkit definition: Izteiksme, kas ietver aģenta ieguldījumu, zīmējot tekstu un skaņu efektus grafiskā formā komiksu grāmatai, grafiskam romānam u.tml. @lv
toolkit definition: Udtryk, som omfatter en agents bidrag ved at tegne tekst og grafiske lydeffekter til en tegneserie, graphic novel etc. @da
toolkit definition: Väljendus, millesse tegija on andnud panuse, joonistades teksti ja graafilisi helijäljendusi koomiksi, graafilise romaani vms jaoks. @et
toolkit definition: Μια έκφραση ενός κόμικ, νουβέλας με γραφικά κ.λπ., η οποία ενσωματώνει τη συνεισφορά της εικονογράφησης. @el
toolkit definition: تعبيرة تتضمن إسهام وكيل برسم النص وتصميم المؤثرات الصوتية المصاحبة لرسومات قصة مصورة أو رواية مصورة، إلخ. @ar
toolkit definition: 包括一个为漫画书、图解小说等绘制文字和图案声音效果的一个行为者的贡献的一种内容表达 @zh-hans
toolkit label: Akteur als Letterer von @de
toolkit label: Hat sanatçısı temsilcisi @tr
toolkit label: agent lettreur de @fr
toolkit label: agent retolista de @ca
toolkit label: agent, som er bogstavstegner af @da
toolkit label: betűrajzoló ágense: @hu
toolkit label: compilatore di dialoghi per fumetti agente du @it
toolkit label: ir komiksa teksta rakstītājs (aģents) @lv
toolkit label: letteraar-actor van @nl
toolkit label: letterer agent of @en
toolkit label: letterer for (agent) @no
toolkit label: tekstaaja (toimija) ekspressiossa
toolkit label: tekstijoonistaja (tegija) väljenduses @et
toolkit label: σχεδιαστής γραμμάτων επιγραφών φορέας του @el
toolkit label: وكيل رسّام حروف لـ @ar
toolkit label: ……的字母图案画者行为者 @zh-hans
has subproperty: tekstaaja (henkilö) ekspressiossa
has subproperty: tekstaaja (yhteistoimija) ekspressiossa
has subproperty: P50245
lexical alias: lettererAgentOf.en
status: Published
type: Property
domain: C10002
label: betűrajzoló ágense a következőnek: @hu
label: er agent, som er bogstavtegner af @da
label: er letterer for (agent) @no
label: est un agent lettreur de @fr
label: ir komiksa teksta rakstītājs (aģents) @lv
label: is letteraar-actor van @nl
label: is letterer agent of @en
label: ist Akteur als Letterer von @de
label: tekstijoonistaja (tegija) väljenduses @et
label: yazı tasarımcısı temsilcisidir @tr
label: è compilatore di dialoghi per fumetti agente di @it
label: és agent retolista de @ca
label: είναι σχεδιαστής γραμμάτων επιγραφών φορέας του @el
label: هو وكيل رسّام حروف لـ @ar
label: 是……的字母图案画者行为者 @zh-hans
sub property of: yhdistymään osallinen toimija ekspressiossa
alternative label: Hat sanatçısı @tr
alternative label: Letterer von @de
alternative label: betűrajzolója: @hu
alternative label: bogstavstegner af @da
alternative label: compilatore di dialoghi per fumetti di @it
alternative label: letterer for @no
alternative label: letterer of @en
alternative label: lettreur de @fr
alternative label: retolista de @ca
alternative label: rotulista de @es
alternative label: tekstaajana ekspressiossa
alternative label: tekstijoonistaja väljenduses @et
alternative label: σχεδιαστής γραμμάτων επιγραφών του @el
alternative label: رسّام حروف @ar
alternative label: ……的字母图案画者 @zh-hans
definition: Bir temsilciyi, bir çizgi roman, grafik roman vb. için metin ve grafik ses efektleri çizen bir temsilcinin katkısını içeren bir anlatımla ilişkilendirir. @tr
definition: Correla un agente a un'espressione che include un contributo da parte di un agente nel disegno di testo ed effetti sonori grafici per un fumetto, graphic novel, etc. @it
definition: Hozzákapcsol egy ágenst egy kifejezési formához, amely magában foglalja egy ágens közreműködését képregény, képregényalbum stb. szövegének és grafikai hangeffektusainak rajzolásában. @hu
definition: Liittää toimijan ekspressioon, jossa toimija osallistuu sarjakuvan, sarjakuvaromaanin tms. ekspression tekemiseen piirtämällä tekstin ja graafiset äänitehosteet.
definition: Met un agent en relation avec une expression qui intègre une contribution de la part d’un agent consistant à dessiner le texte et les effets sonores graphiques pour une bande dessinée, un roman graphique, etc. @fr
definition: Relaciona un agent amb una expressió que inclou una contribució d’un agent en el dibuix de text i d’efectes sonors gràfics d’un còmic, una novel·la gràfica, etc. @ca
definition: Relateert een actor aan een expressie die omvat een bijdrage door een actor door tekenen van tekst en grafische geluidseffecten voor een comic, stripboek etc. @nl

kalligrafi (toimija) teoksessa
has element type: 2
instruction number: 18.5
toolkit definition: A work that involves a responsibility of an agent for calligraphy where the focus of interest lies in the aesthetic value of the penmanship or graphic artistry, regardless of whether the same agent is also responsible for the inscribed text. @en
toolkit definition: Darbs, kas ietver aģenta atbildību par kaligrāfiju, kurā galvenā uzmanība tiek pievērsta mākslinieciskās vai grafiskās meistarības estētiskajai vērtībai, neatkarīgi no tā, vai tā pati grupa ir atbildīgs arī par uzrakstīto tekstu @lv
toolkit definition: Een werk dat met zich meebrengt een verantwoordelijkheid van een actor voor kalligrafie waar de aandacht primair uitgaat naar de esthetische waarde van de schrijfkunst of grafische kunstenaarschap, ongeacht of dezelfde actor ook verantwoordelijk is voor de inscriptie. @nl
toolkit definition: Egy mű, amelyhez hozzátartozik egy ágens szépírással kapcsolatos felelőssége, ahol az érdeklődés középpontjában a kézírás esztétikai értéke vagy a grafika művészisége áll, tekintet nélkül arra, hogy ugyanaz az ágens a lejegyzett szöveg szerzője is egyben vagy sem. @hu
toolkit definition: Ein Werk, bei dem ein Akteur für die Kalligrafie verantwortlich ist, bei der der ästhetische Wert der Schreibkunst oder die grafische Kunstfertigkeit im Mittelpunkt des Interesses liegt, unabhängig davon, ob derselbe Akteur auch für den aufgeschriebenen Text verantwortlich ist. @de
toolkit definition: Et verk som involverer ansvar for en agent i form av kalligrafi hvor fokuset er rettet mot den estetiske verdien av pennekunsten eller den kunstneriske dyktigheten, uavhengig av om den samme agenten også er ansvarlig for den inskriberte teksten. @no
toolkit definition: Obra que implica una responsabilitat d’un agent en la cal·ligrafia on el centre de l’interès se situa en el valor estètic de la cal·ligrafia o del grafisme, independentment de si el mateix agent és també responsable del text inscrit. @ca
toolkit definition: Opera che implica la responsabilità di un agente per la calligrafia dove il centro dell'interesse sta nel valore estetico della scrittura o della perizia grafica, a prescindere che lo stesso agente sia responsabile anche del testo scritto. @it
toolkit definition: Teos, jossa toimija on vastuussa kalligrafiasta, jossa pääpaino on käsin kirjoittamisen tai graafisen taiteen esteettisissä arvoissa, riippumatta siitä, onko sama toimija myös vastuussa kirjoitetusta tekstistä.
toolkit definition: Teos, mis sisaldab tegija vastutust ilukirja eest. Ilukirja põhirõhk on kirjakunsti või graafilise kunstnikutöö esteetilisel väärtusel, olenemata sellest, kas sama tegija on vastutav ka kirjutatud teksti eest. @et
toolkit definition: Værk, som involverer en agents ansvar for kalligrafi, hvor fokus ligger på den æstetiske værdi af skrivekunsten eller den kunstneriske grafiske dygtighed, uagtet om den samme agent også har forfattet den indskrevne tekst. @da
toolkit definition: Yazılı metinden aynı temsilcinin sorumlu olup olmadığına bakılmaksızın, ilgi odağı hattatlığın veya grafik sanatının estetik değerinde olan hat sanatı için bir temsilcinin sorumluluğunu içeren bir eser. @tr
toolkit definition: Œuvre qui comporte une responsabilité de la part d’un agent en ce qui concerne la calligraphie où l’accent est mis sur la valeur esthétique de la calligraphie ou du graphisme, peu importe que le même agent soit aussi responsable du texte calligraphié. @fr
toolkit definition: Ένα έργο καλλιγραφίας που περιλαμβάνει την καλλιτεχνική ευθύνη, όπου το ενδιαφέρον εστιάζει στην αισθητική αξία της καλλιγραφίας ή της γραφικής δεξιοτεχνίας, ανεξάρτητα από το αν πρόκειται για το ίδιο φυσικό πρόσωπο κ.λπ., το οποίο είναι υπεύθυνο για το εγγραφόμενο κείμενο. @el
toolkit definition: عمل يترتب عليه مسئولية وكيل عن الخط حيث ينصب الاهتمام على القيمة الجمالية لفن الخط أو فن الرسم، بغض النظر عن مسئولية هذا الوكيل أيضًا عن النص المكتوب. @ar
toolkit definition: 涉及书法（其中兴趣重点是书法或图形艺术的美学价值，不管同一行为者是否负责题写文字）的一个行为者的责任的一种作品 @zh-hans
toolkit label: Akteur als Kalligrafin/Kalligraf von @de
toolkit label: agent calligraphe de @fr
toolkit label: agent cal·lígraf de @ca
toolkit label: agent, som er kalligraf af @da
toolkit label: calligrafo agente di @it
toolkit label: calligrapher agent of @en
toolkit label: ir kaligrāfs (aģents) @lv
toolkit label: kaligraf temsilcisi @tr
toolkit label: kalligraaf (tegija) teoses @et
toolkit label: kalligraaf-actor van @nl
toolkit label: kalligraf for (agent) @no
toolkit label: kalligrafi (toimija) teoksessa
toolkit label: kalligráfus ágense: @hu
toolkit label: καλλιγράφος φορέας του @el
toolkit label: وكيل خطاط @ar
toolkit label: ……的书法者行为者 @zh-hans
has subproperty: kalligrafi (henkilö) teoksessa
has subproperty: kalligrafi (yhteistoimija) teoksessa
has subproperty: P50246
lexical alias: calligrapherAgentOf.en
status: Published
type: Property
domain: C10002
label: er agent, som er kalligraf af @da
label: er kalligraf for (agent) @no
label: est un agent calligraphe de @fr
label: ir kaligrāfs (aģents) @lv
label: is calligrapher agent of @en
label: is kalligraaf-actor van @nl
label: ist Akteur als Kalligrafin/Kalligraf von @de
label: kaligraf temsilcisidir @tr
label: kalligraaf (tegija) teoses @et
label: kalligráfus ágense a következőnek: @hu
label: è calligrafo agente di @it
label: és agent cal·lígraf de @ca
label: είναι καλλιγράφος φορέας του @el
label: هو وكيل خطاط لـ @ar
label: 是……的书法者行为者 @zh-hans
sub property of: taiteilija (toimija) teoksessa
alternative label: Kalligraf von @de
alternative label: calligrafo di @it
alternative label: calligraphe de @fr
alternative label: calligrapher of @en
alternative label: cal·lígraf de @ca
alternative label: calígrafo de @es
alternative label: kaligraf @tr
alternative label: kalligraaf teoses @et
alternative label: kalligraf af @da
alternative label: kalligraf for @no
alternative label: kalligrafina kalligrafiassa
alternative label: kalligráfusa: @hu
alternative label: καλλιγράφος του @el
alternative label: خطّاط لـ @ar
alternative label: ……的书法者 @zh-hans
definition: Bir temsilciyi, yazılı metinden aynı temsilcinin sorumlu olup olmadığına bakılmaksızın, ilgi odağının hattatlığın veya grafik sanatının estetik değerinde olduğu bir kaligrafiye ilişkin bir temsilcinin sorumluluğunu içeren bir eserle ilişkilendirir. @tr
definition: Correla un agente a un'opera che implica la responsabilità di un agente per la calligrafia dove il centro dell'interesse sta nel valore estetico della scrittura o della perizia grafica, a prescindere che lo stesso agente sia responsabile anche del testo scritto. @it
definition: Hozzákapcsol egy ágenst egy műhöz, amelyhez hozzátartozik egy ágens szépírással kapcsolatos felelőssége, ahol az érdeklődés középpontjában a kézírás esztétikai értéke vagy a grafika művészisége áll, tekintet nélkül arra, hogy ugyanaz az ágens a lejegyzett szöveg szerzője is egyben vagy sem. @hu
definition: Liittää toimijan teokseen, jossa toimija on vastuussa kalligrafiasta, jossa pääpaino on käsin kirjoittamisen tai graafisen taiteen esteettisissä arvoissa, riippumatta siitä, onko sama toimija myös vastuussa kirjoitetusta tekstistä.
definition: Met un agent en relation avec une œuvre qui comporte une responsabilité de la part d’un agent en ce qui concerne la calligraphie où l’accent est mis sur la valeur esthétique de la calligraphie ou du graphisme, peu importe que le même agent soit aussi responsable du texte calligraphié. @fr
definition: Relaciona un agent amb una obra que implica una responsabilitat d’un agent en la cal·ligrafia on el centre de l’interès se situa en el valor estètic de la cal·ligrafia o del grafisme, independentment de si el mateix agent és també responsable del text inscrit. @ca
definition: Relateert een actor aan een werk dat met zich meebrengt een verantwoordelijkheid van een actor voor kalligrafie waar de aandacht primair uitgaat naar de esthetische waarde van de schrijfkunst of grafische kunstenaarschap, ongeacht of dezelfde actor ook verantwoordelijk is voor de inscriptie. @nl

kirjataiteilija (toimija) teoksessa
has element type: 2
instruction number: 18.5
toolkit definition: A work that involves a responsibility of an agent for exploiting the book form or altering its physical structure. @en
toolkit definition: Darbs, kas ietver aģenta atbildību par grāmatas formas izmantošanu vai tās fiziskās struktūras pārveidošanu. @lv
toolkit definition: Een werk dat met zich meebrengt een verantwoordelijkheid van een actor voor het benutten van de vorm van het boek of veranderen van de fysieke structuur. @nl
toolkit definition: Egy mű, amelyhez hozzátartozik egy ágens felelőssége a könyvforma kiaknázásáért vagy fizikai szerkezetének megváltoztatásáért. @hu
toolkit definition: Ein Werk, bei dem ein Akteur für die Verwertung der Buchform oder für die Veränderung ihrer physischen Struktur verantwortlich ist. @de
toolkit definition: Et verk som som involverer ansvar for en agent i form av å utnytte bokformen eller å gjøre endringer i dens fysiske struktur. @no
toolkit definition: Kitap biçiminden yararlanmak veya fiziksel yapısını değiştirmek için bir temsilcinin sorumluluğunu içeren bir eser. @tr
toolkit definition: Obra que implica una responsabilitat d’un agent en l’explotació de la forma llibre o en la modificació de la seva estructura física. @ca
toolkit definition: Opera che implica la responsabilità di un agente per la valorizzazione del formato del libro o l'alterazione della sua struttura fisica. @it
toolkit definition: Teos, jossa toimija on vastuussa kirjan muodon hyödyntämisestä tai sen fyysisen rakenteen muuttamisesta.
toolkit definition: Teos, mis sisaldab tegija vastutust raamatu vormi rakendamise või selle füüsilise struktuuri muutmise eest. @et
toolkit definition: Værk, som involverer en agents ansvar for at udnytte bogformen eller ændre dens fysiske struktur. @da
toolkit definition: Œuvre qui comporte une responsabilité de la part d’un agent consistant à exploiter la forme livre ou à modifier sa structure physique. @fr
toolkit definition: Ένα έργο που περιλαμβάνει την καλλιτεχνική ευθύνη για τη δημιουργία έργων τέχνης, τα οποία αξιοποιούν τη μορφή του βιβλίου ή μεταβάλλουν τη φυσική του δομή ως μέρος του περιεχομένου. @el
toolkit definition: عمل يترتب عليه مسئولية وكيل عن استغلال شكل الكتاب أو تغيير بنيته المادية. @ar
toolkit definition: 涉及开发图书外形或改变其物理结构的一个行为者的责任的一种作品 @zh-hans
toolkit label: Akteur als Buchkünstlerin/Buchkünstler von @de
toolkit label: agent artista de llibre d’art de @ca
toolkit label: agent artiste du livre de @fr
toolkit label: agent, som er bogkunstner af @da
toolkit label: boekkunstenaar-actor van @nl
toolkit label: bokkunstner for (agent) @no
toolkit label: book artist agent of @en
toolkit label: book artist di @it
toolkit label: ir grāmatu mākslinieks (aģents) @lv
toolkit label: kirjataiteilija (toimija) teoksessa
toolkit label: kitap sanatçısı temsilcisi @tr
toolkit label: könyvművész ágense: @hu
toolkit label: raamatukunstnik (tegija) teoses @et
toolkit label: βιβλίο του καλλιτέχνη φορέας του @el
toolkit label: وكيل رسّام كتب مصورة لــ @ar
toolkit label: ……的图书美术家行为者 @zh-hans
has subproperty: kirjataiteilija (henkilö) teoksessa
has subproperty: kirjataiteilija (yhteistoimija) teoksessa
has subproperty: P50247
lexical alias: bookArtistAgentOf.en
status: Published
type: Property
domain: C10002
label: er agent, som er bogkunstner af @da
label: er bokkunstner for (agent) @no
label: est un agent artiste du livre de @fr
label: ir grāmatu mākslinieks (aģents) @lv
label: is boekkunstenaar-actor van @nl
label: is book artist agent of @en
label: ist Akteur als Buchkünstlerin/Buchkünstler von @de
label: kitap sanatçısı temsilcisidir @tr
label: könyvművész ágense a következőnek: @hu
label: raamatukunstnik (tegija) teoses @et
label: è book artist di @it
label: és agent artista de llibre d’art de @ca
label: είναι βιβλίο του καλλιτέχνη φορέας του @el
label: هو وكيل رسام كتب لـ @ar
label: 是……的图书美术家行为者 @zh-hans
sub property of: taiteilija (toimija) teoksessa
alternative label: Buchkünstlerin/Buchkünstler von @de
alternative label: artista de llibre d’art de @ca
alternative label: artista del libro de @es
alternative label: artiste du livre de @fr
alternative label: bogkunstner af @da
alternative label: bokkunstner for @no
alternative label: book artist of @en
alternative label: grafico di @it
alternative label: kirjataiteilijana taideteoksessa
alternative label: kitap sanatçısı @tr
alternative label: könyvművésze: @hu
alternative label: raamatukunstnik teoses @et
alternative label: βιβλίο του καλλιτέχνη του @el
alternative label: رسّام كتب صورة لـ @ar
alternative label: ……的图书美术家 @zh-hans
definition: Bir temsilciyi, kitap biçiminden yararlanmak veya fiziksel yapısını değiştirmekle görevli bir temsilcinin sorumluluğunu içeren bir eserle ilişkilendirir. @tr
definition: Correla un agente a un'opera che implica la responsabilità di un agente per la valorizzazione del formato del libro o l'alterazione della sua struttura fisica. @it
definition: Hozzákapcsol egy ágenst egy műhöz, amelyhez hozzátartozik egy ágens felelőssége a könyvforma kiaknázásáért vagy fizikai szerkezetének megváltoztatásáért. @hu
definition: Liittää toimijan teokseen, jossa toimija on vastuussa kirjan muodon hyödyntämisestä tai sen fyysisen rakenteen muuttamisesta.
definition: Met un agent en relation avec une œuvre qui comporte une responsabilité de la part d’un agent consistant à exploiter la forme livre ou à modifier sa structure physique. @fr
definition: Relaciona un agent amb una obra que implica una responsabilitat d’un agent en l’explotació de la forma llibre o en la modificació de la seva estructura física. @ca
definition: Relateert een actor aan een werk dat met zich meebrengt een verantwoordelijkheid van een actor voor het benutten van de vorm van het boek of veranderen van de fysieke structuur. @nl

kokousten raportoija (toimija) teoksessa
has element type: 2
instruction number: 18.5
see also: pöytäkirjan laatija (toimija) ekspressiossa
toolkit definition: A work that involves a responsibility of an agent for reporting on the proceedings of meetings of an organization. @en
toolkit definition: Bir organizasyonun toplantılarının bildirilerini raporlamak için bir temsilcinin sorumluluğunu içeren bir eser. @tr
toolkit definition: Darbs, kas ietver aģenta atbildību par ziņošanu par organizācijas sanāksmju norisi. @lv
toolkit definition: Een werk dat met zich meebrengt een verantwoordelijkheid van een actor voor het rapporteren van handelingen van bijeenkomsten van een organisatie. @nl
toolkit definition: Egy mű, amelyhez hozzátartozik egy ágens felelőssége egy szervezet üléseinek lefolyásáról szóló jelentésért. @hu
toolkit definition: Ein Werk, bei dem ein Akteur für das Berichten über den Ablauf von Sitzungen einer Organisation verantwortlich ist. @de
toolkit definition: Et verk som involverer ansvar for en agent i fom av å rapportere fra møter i en organisasjon. @no
toolkit definition: Obra que implica una responsabilitat d’un agent en la redacció de les actes de les reunions d’una organització. @ca
toolkit definition: Opera che implica la responsabilità di un agente per la redazione dei verbali degli incontri di un'organizzazione. @it
toolkit definition: Teos, jossa toimijan vastuulla on raportoida organisaation kokousmenettelyistä.
toolkit definition: Teos, mis sisaldab tegija vastutust organisatsiooni koosolekute toimingutest aruande kirjutamise eest. @et
toolkit definition: Værk, som involverer en agents ansvar for at rapportere om udviklingerne ved en organisations møder. @da
toolkit definition: Œuvre qui comporte une responsabilité de la part d’un agent consistant à rédiger les comptes rendus des réunions d’une organisation. @fr
toolkit definition: Ένα έργο που περιλαμβάνει την ευθύνη της σύνταξης των πρακτικών των συναντήσεων ενός οργανισμού. @el
toolkit definition: عمل يترتب عليه مسئولية وكيل عن إعداد تقرير عن وقائع اجتماعات مؤسسة. @ar
toolkit definition: 涉及一个组织的会议文集报告的一个行为者的责任的一种作品 @zh-hans
toolkit label: Akteur als Berichterstatterin/Berichterstatter von @de
toolkit label: Raportör temsilcisi @tr
toolkit label: agent rapporteur de @fr
toolkit label: agent relator de @ca
toolkit label: agente relatore di @it
toolkit label: aruande koostaja (tegija) teoses @et
toolkit label: ir ziņotājs (aģents) @lv
toolkit label: kokousten raportoija (toimija) teoksessa
toolkit label: raportőr ágense: @hu
toolkit label: rapporteur agent of @en
toolkit label: rapporteur-actor van @nl
toolkit label: rapportør af @da
toolkit label: rapportør for (agent) @no
toolkit label: εισηγητής φορέας του @el
toolkit label: وكيل مقرر لـ @ar
toolkit label: ……的会务报告人行为者 @zh-hans
has subproperty: kokousten raportoija (henkilö) teoksessa
has subproperty: kokousten raportoija (yhteistoimija) teoksessa
has subproperty: P50248
lexical alias: rapporteurAgentOf.en
status: Published
type: Property
domain: C10002
label: aruande koostaja (tegija) teoses @et
label: er agent, som er rapportør af @da
label: er rapportør for (agent) @no
label: est un agent rapporteur de @fr
label: ir ziņotājs (aģents) @lv
label: is rapporteur agent of @en
label: is rapporteur-actor van @nl
label: ist Akteur als Berichterstatterin/Berichterstatter von @de
label: raportör temsilcisidir @tr
label: raportőr ágense a következőnek: @hu
label: è relatore agente di @it
label: és agent relator de @ca
label: είναι εισηγητής φορέας του @el
label: هو وكيل مقرر لـ @ar
label: 是……的会务报告人行为者 @zh-hans
sub property of: kirjoittaja (toimija) teoksessa
alternative label: Berichterstatter von @de
alternative label: Raportör @tr
alternative label: aruande koostaja teoses @et
alternative label: raportoijana kokouksessa
alternative label: raportőre: @hu
alternative label: rapporteur de @fr
alternative label: rapporteur of @en
alternative label: rapportør af @da
alternative label: rapportør for @no
alternative label: relator de @ca
alternative label: relatore di @it
alternative label: εισηγητής του @el
alternative label: مقرر لـ @ar
alternative label: ……的会务报告人 @zh-hans
definition: Bir temsilciyi, bir kuruluşun toplantılarının tutanaklarını raporlamak için bir temsilcinin sorumluluğunu içeren bir eserle ilişkilendirir. @tr
definition: Correla un agente a un'opera che implica la responsabilità di un agente per la redazione dei verbali degli incontri di un'organizzazione. @it
definition: Hozzákapcsol egy ágenst egy műhöz, amelyhez hozzátartozik egy ágens felelőssége egy szervezet üléseinek lefolyásáról szóló jelentésért. @hu
definition: Liittää toimijan teokseen, jossa toimijan vastuulla on raportoida organisaation kokousmenettelyistä.
definition: Met un agent en relation avec une œuvre qui comporte une responsabilité de la part d’un agent consistant à rédiger les comptes rendus des réunions d’une organisation. @fr
definition: Relaciona un agent amb una obra que implica una responsabilitat d’un agent en la redacció de les actes de les reunions d’una organització. @ca
definition: Relateert een actor aan een werk dat met zich meebrengt een verantwoordelijkheid van een actor voor het rapporteren van handelingen van bijeenkomsten van een organisatie. @nl

henkilö aiheena teoksessa
has element type: 2
toolkit definition: A work that is about a person. @en
toolkit definition: Bir kişi hakkındaki bir eser. @tr
toolkit definition: Darbs, kura temats ir persona. @lv
toolkit definition: Een werk dat gaat over een persoon. @nl
toolkit definition: Egy mű, amely egy személyről szól. @hu
toolkit definition: Ein Werk, das von einer Person handelt. @de
toolkit definition: Et verk som handler om en person. @no
toolkit definition: Obra que tracta d’una persona. @ca
toolkit definition: Opera che tratta di una persona. @it
toolkit definition: Teos, joka käsittelee henkilöä.
toolkit definition: Teos, mis on isiku kohta. @et
toolkit definition: Værk, som handler om en person. @da
toolkit definition: Œuvre qui traite d’une personne. @fr
toolkit definition: Ένα έργο που αφορά σε ένα φυσικό πρόσωπο. @el
toolkit definition: عمل عن شخص. @ar
toolkit definition: 关于一个个人的一种作品 @zh-hans
toolkit label: Person als Thema von @de
toolkit label: emne for (person) @no
toolkit label: henkilö aiheena teoksessa
toolkit label: ir temats (persona) @lv
toolkit label: konu alınan kişi @tr
toolkit label: person, som er emne af @da
toolkit label: persona de matèria de @ca
toolkit label: persona soggetto di @it
toolkit label: personne sujet de @fr
toolkit label: persoon als onderwerp van @nl
toolkit label: subject person of @en
toolkit label: személy tárgya: @hu
toolkit label: teema (isik) teoses @et
toolkit label: θέμα φυσικό πρόσωπο του @el
toolkit label: شخص موضوع لـ @ar
toolkit label: ……的主题个人 @zh-hans
has subproperty: henkilöä kuvaava teos
has subproperty: P50249
lexical alias: subjectPersonOf.en
status: Published
type: Property
domain: C10004
label: Konu kişisidir @tr
label: er emne for (person) @no
label: er person, som er emne af @da
label: est une personne sujet de @fr
label: ir temats (persona) @lv
label: is persoon als onderwerp van @nl
label: is subject person of @en
label: ist Person als Thema von @de
label: személy tárgya a következőnek: @hu
label: teema (isik) teoses @et
label: è persona soggetto di @it
label: és persona de matèria de @ca
label: είναι θέμα φυσικό πρόσωπο του @el
label: هو شخص موضوع لـ @ar
label: 是……的主题个人 @zh-hans
sub property of: henkilöön liittyvä teos
sub property of: toimija aiheena teoksessa
alternative label: (kişinin) konusu @tr
alternative label: Thema von (Person) @de
alternative label: aiheena teoksessa (henkilö)
alternative label: emne af (person) @da
alternative label: subject of (person) @en
alternative label: sujet de (personne) @fr
alternative label: tema de (persona) @es
alternative label: tárgya a következőnek (személy): @hu
alternative label: شخص موضوع @ar
alternative label: （个人）的主题 @zh-hans
definition: Bir kişiyi, bir kişi hakkında olan bir eserle ilişkilendirir. @tr
definition: Correla una persona a un'opera che tratta di una persona. @it
definition: Hozzákapcsol egy személyt egy műhöz, amely egy személyről szól. @hu
definition: Liittää henkilön teokseen, joka käsittelee henkilöä.
definition: Met une personne en relation avec une œuvre qui traite d’une personne. @fr
definition: Relaciona una persona amb una obra que tracta d’una persona. @ca
definition: Relateert een persoon aan een werk dat gaat over een persoon. @nl
definition: Relaterer en person til et verk som handler om en person. @no
definition: Relaterer en person til et værk, som handler om en person. @da
definition: Relates a person to a work that is about a person. @en
definition: Sasaista personu ar darbu, kura temats ir persona. @lv
definition: Seostab isiku teosega, mis on isiku kohta. @et
definition: Setzt eine Person in Beziehung zu einem Werk, das von einer Person handelt. @de

suku aiheena teoksessa
has element type: 2
toolkit definition: A work that is about a family. @en
toolkit definition: Bir aile hakkındaki eser. @tr
toolkit definition: Darbs, kura temats ir dzimta/ģimene. @lv
toolkit definition: Een werk dat gaat over een familie. @nl
toolkit definition: Egy mű, amely egy családról szól. @hu
toolkit definition: Ein Werk, das von einer Familie handelt. @de
toolkit definition: Et verk som handler om en familie. @no
toolkit definition: Obra que tracta d’una família. @ca
toolkit definition: Opera che tratta di una famiglia. @it
toolkit definition: Teos, joka käsittelee sukua.
toolkit definition: Teos, mis on perekonna kohta. @et
toolkit definition: Værk, som handler om en familie. @da
toolkit definition: Œuvre qui traite d’une famille. @fr
toolkit definition: Ένα έργο που αφορά σε μια οικογένεια. @el
toolkit definition: عمل عن عائلة. @ar
toolkit definition: 关于一个家族的一种作品 @zh-hans
toolkit label: Familie als Thema von @de
toolkit label: család tárgya: @hu
toolkit label: emne for (familie) @no
toolkit label: famiglia soggetto di @it
toolkit label: familie als onderwerp van @nl
toolkit label: familie, som er emne af @da
toolkit label: famille sujet de @fr
toolkit label: família de matèria de @ca
toolkit label: ir temats (dzimta/ģimene) @lv
toolkit label: konu alınan aile @tr
toolkit label: subject family of @en
toolkit label: suku aiheena teoksessa
toolkit label: teema (perekond) teoses @et
toolkit label: θέμα οικογένεια του @el
toolkit label: عائلة موضوع لـ @ar
toolkit label: ……的主题家族 @zh-hans
has subproperty: sukua kuvaava teos
has subproperty: P50250
lexical alias: subjectFamilyOf.en
status: Published
type: Property
domain: C10008
label: család tárgya a következőnek: @hu
label: er emne for (familie) @no
label: er familie, som er emne af @da
label: est une famille sujet de @fr
label: ir temats (dzimta/ģimene) @lv
label: is familie als onderwerp van @nl
label: is subject family of @en
label: ist Familie als Thema von @de
label: konu ailesidir @tr
label: teema (perekond) teoses @et
label: è famiglia soggetto di @it
label: és família de matèria de @ca
label: είναι θέμα οικογένεια του @el
label: هي عائلة موضوع لـ @ar
label: 是……的主题家族 @zh-hans
sub property of: sukuun liittyvä teos
sub property of: yhteistoimija aiheena teoksessa
alternative label: (ailenin) konusu @tr
alternative label: Thema von (Familie) @de
alternative label: aiheena teoksessa (suku)
alternative label: emne af (familie) @da
alternative label: subject of (family) @en
alternative label: sujet de (famille) @fr
alternative label: tema de (familia) @es
alternative label: tárgya a következőnek (család): @hu
alternative label: عائلة موضوع @ar
alternative label: （家族）的主题 @zh-hans
definition: Bir aileyi, bir aile hakkında olan bir eserle ilişkilendirir. @tr
definition: Collega una famiglia a un'opera che tratta di una famiglia. @it
definition: Hozzákapcsol egy családot egy műhöz, amely egy családról szól. @hu
definition: Liittää suvun teokseen, joka käsittelee sukua.
definition: Met une famille en relation avec une œuvre qui traite d’une famille. @fr
definition: Relaciona una família amb una obra que tracta d’una família. @ca
definition: Relateert een familie aan een werk dat gaat over een familie. @nl
definition: Relaterer en familie til et verk som handler om en familie. @no
definition: Relaterer en familie til et værk, som handler om en familie. @da
definition: Relates a family to a work that is about a family. @en
definition: Sasaista dzimtu/ģimeni ar darbu, kura temats ir dzimta/ģimene. @lv
definition: Seostab perekonna teosega, mis on perekonna kohta. @et
definition: Setzt eine Familie in Beziehung zu einem Werk, das von einer Familie handelt. @de

yhteisö aiheena teoksessa
has element type: 2
toolkit definition: A work that is about a corporate body. @en
toolkit definition: Bir tüzel kişi hakkındaki bir eser. @tr
toolkit definition: Darbs, kura temats ir institūcija. @lv
toolkit definition: Een werk dat gaat over een corporatie. @nl
toolkit definition: Egy mű, amely egy testületről szól. @hu
toolkit definition: Ein Werk, das von einer Körperschaft handelt. @de
toolkit definition: Et verk som handler om en korporasjon. @no
toolkit definition: Obra que tracta d’una entitat corporativa. @ca
toolkit definition: Opera che tratta di un ente. @it
toolkit definition: Teos, joka käsittelee yhteisöä.
toolkit definition: Teos, mis on asutuse kohta. @et
toolkit definition: Værk, som handler om en korporation. @da
toolkit definition: Œuvre qui traite d’une collectivité. @fr
toolkit definition: Ένα έργο που αφορά σε ένα συλλογικό όργανο. @el
toolkit definition: عمل عن هيئة. @ar
toolkit definition: 关于一个团体的一种作品 @zh-hans
toolkit label: Körperschaft als Thema von @de
toolkit label: collectivité sujet de @fr
toolkit label: corporatie als onderwerp van @nl
toolkit label: emne for (korporasjon) @no
toolkit label: ente soggetto di @it
toolkit label: entitat corporativa de matèria de @ca
toolkit label: ir temats (institūcija) @lv
toolkit label: konu alınan tüzel kişilik @tr
toolkit label: korporation, som er emne af @da
toolkit label: subject corporate body of @en
toolkit label: teema (asutus) teoses @et
toolkit label: testület tárgya: @hu
toolkit label: yhteisö aiheena teoksessa
toolkit label: θέμα συλλογικό όργανο του @el
toolkit label: هيئة موضوع لـ @ar
toolkit label: ……的主题团体 @zh-hans
has subproperty: yhteisöä kuvaava teos
has subproperty: P50251
lexical alias: subjectCorporateBodyOf.en
status: Published
type: Property
domain: C10005
label: er emne for (korporasjon) @no
label: er korporation, som er emne af @da
label: est une collectivité sujet de @fr
label: ir temats (institūcija) @lv
label: is corporatie als onderwerp van @nl
label: is subject corporate body of @en
label: ist Körperschaft als Thema von @de
label: konunun tüzel kişisi @tr
label: teema (asutus) teoses @et
label: testület tárgya a következőnek: @hu
label: è ente soggetto di @it
label: és entitat corporativa de matèria de @ca
label: είναι θέμα συλλογικό όργανο του @el
label: هي هيئة موضوع لـ @ar
label: 是……的主题团体 @zh-hans
sub property of: yhteisöön liittyvä teos
sub property of: yhteistoimija aiheena teoksessa
alternative label: (tüzel kişinin) konusu @tr
alternative label: Thema von (Körperschaft) @de
alternative label: aiheena teoksessa (yhteisö)
alternative label: emne af (korporation) @da
alternative label: subject of (corporate body) @en
alternative label: sujet de (collectivité) @fr
alternative label: tema de (organismo corporativo) @es
alternative label: tárgya a következőnek (testület): @hu
alternative label: موضوع لـ (هيئة) @ar
alternative label: （团体）的主题 @zh-hans
definition: Bir tüzel kişiyi, bir tüzel kişiliğe ilişkin bir eserle ilişkilendirir. @tr
definition: Collega un ente a un'opera che tratta di un ente. @it
definition: Hozzákapcsol egy testületet egy műhöz, amely egy testületről szól. @hu
definition: Liittää yhteisön teokseen, joka käsittelee yhteisöä.
definition: Met une collectivité en relation avec une œuvre qui traite d’une collectivité. @fr
definition: Relaciona una entitat corporativa amb una obra que tracta d’una entitat corporativa. @ca
definition: Relateert een corporatie aan een werk dat gaat over een corporatie. @nl
definition: Relaterer en korporasjon til et verk som handler om en korporasjon. @no
definition: Relaterer en korporation til et værk, som handler om en korporation. @da
definition: Relates a corporate body to a work that is about a corporate body. @en
definition: Sasaista institūciju ar darbu, kura temats ir institūcija. @lv
definition: Seostab asutuse teosega, mis on asutuse kohta. @et
definition: Setzt eine Körperschaft in Beziehung zu einem Werk, das von einer Körperschaft handelt. @de

loppututkinnon suorittanut
has element type: 2
instruction number: 29.5
toolkit definition: A person who receives an academic degree from a granting institution or faculty. @en
toolkit definition: Bir enstitü veya fakülteden akademik derece alan bir kişi. @tr
toolkit definition: Een persoon die een academische graad ontvangt van een verstrekkende instelling of faculteit. @nl
toolkit definition: Egy személy, aki tudományos fokozatot kap egy annak odaítélésére jogosult intézménytől vagy egyetemi kartól. @hu
toolkit definition: Eine Person, die einen akademischen Grad von einer verleihenden Institution oder Fakultät erhält. @de
toolkit definition: En person som mottar en akademisk grad ved en utdanningsinstitusjon. @no
toolkit definition: Henkilö, jolle laitos tai tiedekunta on myöntänyt akateemisen loppututkinnon.
toolkit definition: Isik, kes on saanud akadeemilise kraadi kraadi andvalt asutuselt või teaduskonnalt. @et
toolkit definition: Person, som modtager en akademisk grad fra en tildelende institution eller fakultet. @da
toolkit definition: Persona che riceve un grado accademico da un'istituzione o facoltà che lo conferisce. @it
toolkit definition: Persona que rep una titulació acadèmica d’una institució que concedeix un títol acadèmic. @ca
toolkit definition: Persona, kura ieguvusi akadēmisko grādu augstskolā. @lv
toolkit definition: Personne qui reçoit un grade universitaire d’une institution ou d’une faculté conférant un grade universitaire. @fr
toolkit definition: Una persona que recibe un grado académico de una institución o facultad otorgante. @es
toolkit definition: Ένα φυσικό πρόσωπο που λαμβάνει ένα ανώτερου εκπαιδευτικού επιπέδου πτυχίο από ένα ίδρυμα ή σχολή. @el
toolkit definition: شخص يحصل على درجة أكاديمية من مؤسسة أو كلية مانحة. @ar
toolkit definition: 从一个授予机构或院系获得学位的一个个人 @zh-hans
toolkit label: Graduierte/Graduierter @de
toolkit label: absolvents @lv
toolkit label: afgestudeerde @nl
toolkit label: akademiker @no
toolkit label: dimittend @da
toolkit label: diplomás: @hu
toolkit label: diplômé @fr
toolkit label: graduado @es
toolkit label: graduate @en
toolkit label: kraadi saanud isik @et
toolkit label: laureato @it
toolkit label: loppututkinnon suorittanut
toolkit label: mezun @tr
toolkit label: titulat @ca
toolkit label: πτυχιούχος @el
toolkit label: خريج @ar
toolkit label: 毕业生 @zh-hans
has subproperty: P50252
lexical alias: graduate.en
status: Published
type: Property
domain: C10005
label: a pour diplômé @fr
label: absolvents @lv
label: diplomása a következő: @hu
label: ha come laureato @it
label: har akademiker @no
label: har dimittend @da
label: has graduate @en
label: hat Graduierte/Graduierten @de
label: heeft afgestudeerde @nl
label: kraadi saanud isik @et
label: mezun ile ilişkilidir @tr
label: té com a titulat @ca
label: έχει πτυχιούχο @el
label: لها خريج @ar
label: 有毕业生 @zh-hans
sub property of: yhteisöön liittyvä henkilö
alternative label: απόφοιτος @el
definition: Bir tüzel kişiyi, bir enstitü veya fakülteden akademik derece alan bir kişiyle ilişkilendirir. @tr
definition: Collega un ente a una persona che riceve un grado accademico da un'istituzione o facoltà che lo conferisce. @it
definition: Hozzákapcsol egy testületet egy személyhez, aki tudományos fokozatot kap egy annak odaítélésére jogosult intézménytől vagy egyetemi kartól. @hu
definition: Liittää yhteisön henkilöön, jolle laitos tai tiedekunta on myöntänyt akateemisen loppututkinnon.
definition: Met une collectivité en relation avec une personne qui reçoit un grade universitaire d’une institution ou d’une faculté conférant un grade universitaire. @fr
definition: Relaciona una entitat corporativa amb una persona que rep una titulació acadèmica d’una institució que concedeix un títol acadèmic. @ca
definition: Relateert een corporatie aan een persoon die een academische graad ontvangt van een verstrekkende instelling of faculteit. @nl
definition: Relaterer en korporasjon til en person som mottar en akademisk grad ved en utdanningsinstitusjon. @no
definition: Relaterer en korporation til en person, som modtager en akademsk grad fra en tildelende institution eller fakultet. @da
definition: Relates a corporate body to a person who receives an academic degree from a granting institution or faculty. @en
definition: Sasaista institūciju ar personu, kura ieguvusi akadēmisko grādu augstskolā. @lv
definition: Seostab asutuse isikuga, kes on saanud akadeemilise kraadi kraadi andvalt asutuselt või teaduskonnalt. @et
definition: Setzt eine Körperschaft in Beziehung zu einer Person, die einen akademischen Grad von einer verleihenden Institution oder Fakultät erhält. @de
definition: Συνδέει ένα συλλογικό όργανο με ένα φυσικό πρόσωπο που λαμβάνει ένα ανώτερου εκπαιδευτικού επιπέδου πτυχίο από ένα ίδρυμα ή σχολή. @el
definition: يربط هيئة بشخص يحصل على درجة أكاديمية من مؤسسة أو كلية مانحة. @ar
definition: 将一个团体与从一个授予机构或院系获得学位的一个个人关联起来。 @zh-hans

tutkinnon myöntänyt oppilaitos
has element type: 2
instruction number: 29.5
toolkit definition: A corporate body who is an institution or faculty that grants an academic degree to a person. @en
toolkit definition: Asutus või teaduskond, kes on andnud isikule akadeemilise kraadi. @et
toolkit definition: Augstskola, kuru persona absolvējusi. @lv
toolkit definition: Bir kişiye akademik derece veren bir enstitü veya fakülte olan bir tüzel kişi. @tr
toolkit definition: Collectivité qui consiste en une institution ou une faculté qui confère un grade universitaire à une personne. @fr
toolkit definition: Een corporatie die is een instelling of faculteit die een academische graad verstrekt aan een persoon. @nl
toolkit definition: Egy testület, egy intézmény vagy egyetemi kar, amely tudományos fokozatot ad egy személynek. @hu
toolkit definition: Eine grad-verleihenden Institution oder Fakultät (Körperschaft), die einer Person einen akademischen Grad verleiht. @de
toolkit definition: En institusjon eller et fakultet som har tildelt personen en akademisk grad. @no
toolkit definition: Entitat corporativa que és una institució o facultat que concedeix un títol acadèmic a una persona. @ca
toolkit definition: Istituzione o facoltà che ha conferito un titolo accademico a una persona. @it
toolkit definition: Korporation, der er en institution eller fakultet, som tildeler en akademisk grad til en person. @da
toolkit definition: Una institución o facultad que otorgó un grado académico a la persona. @es
toolkit definition: Yhteisö, joka on laitos tai tiedekunta, joka on myöntänyt henkilölle akateemisen loppututkinnon.
toolkit definition: Ένα ίδρυμα ή σχολή, η οποία απένειμε ένα ανώτερου εκπαιδευτικού επιπέδου πτυχίο σε ένα φυσικό πρόσωπο. @el
toolkit definition: مؤسسة أو كلية تمنح درجة أكاديمية لشخص. @ar
toolkit definition: 作为授予一个个人学位的机构或院系的一个团体 @zh-hans
toolkit label: Graduierte/Graduierter von @de
toolkit label: afgestudeerde van @nl
toolkit label: akademiker fra @no
toolkit label: dimittend af @da
toolkit label: diplomása: @hu
toolkit label: diplômé de @fr
toolkit label: graduado de @es
toolkit label: graduate of @en
toolkit label: ir absolvējis @lv
toolkit label: kraadi saaja asutusest @et
toolkit label: laureato di @it
toolkit label: mezun @tr
toolkit label: titulat de @ca
toolkit label: tutkinnon myöntänyt oppilaitos
toolkit label: πτυχιούχος του @el
toolkit label: خريج عن @ar
toolkit label: ……的毕业生 @zh-hans
has subproperty: P50253
lexical alias: graduateOf.en
status: Published
type: Property
domain: C10004
label: diplomása a következőnek: @hu
label: er akademiker fra @no
label: er dimittend af @da
label: est un diplômé de @fr
label: ir absolvējis @lv
label: is afgestudeerde van @nl
label: is graduate of @en
label: ist Graduierte/Graduierter von @de
label: kraadi saaja asutusest @et
label: mezunudur @tr
label: è laureato di @it
label: és titulat de @ca
label: είναι πτυχιούχος του @el
label: هو خريج في @ar
label: 是……的毕业生 @zh-hans
sub property of: henkilöön liittyvä yhteisö
alternative label: απόφοιτος του @el
definition: Bir kişiyi, bir kişiye akademik derece veren bir enstitü veya fakülte olan bir tüzel kişilikle ilişkilendirir. @tr
definition: Correla una persona a un'istituzione o facoltà che ha conferito un titolo accademico a una persona. @it
definition: Hozzákapcsol egy személyt egy testülethez, egy intézményhez vagy egyetemi karhoz, amely tudományos fokozatot ad egy személynek. @hu
definition: Liittää henkilön yhteisöön, joka on laitos tai tiedekunta, joka on myöntänyt henkilölle akateemisen loppututkinnon.
definition: Met une personne en relation avec une collectivité qui consiste en une institution ou une faculté qui confère un grade universitaire à une personne. @fr
definition: Relaciona una persona amb una entitat corporativa que és una institució o facultat que concedeix un títol acadèmic a una persona. @ca
definition: Relateert een persoon aan een corporatie die is een instelling of faculteit die een academische graad verstrekt aan een persoon. @nl
definition: Relaterer en person til en institusjon eller et fakultet som har tildelt personen en akademisk grad. @no
definition: Relaterer en person til en korporation, der er en institution eller fakultet, som tildeler en akademisk grad til en person. @da
definition: Relates a person to a corporate body who is an institution or faculty that grants an academic degree to a person. @en
definition: Sasaista personu ar institūciju, kas ir augstskola, kuru persona absolvējusi. @lv
definition: Seostab isiku asutuse või teaduskonnaga, kes on andnud isikule akadeemilise kraadi. @et
definition: Setzt eine Person in Beziehung zu einer grad-verleihenden Institution oder Fakultät (Körperschaft), die einer Person einen akademischen Grad verleiht. @de
definition: Συνδέει ένα φυσικό πρόσωπο με ένα ίδρυμα ή σχολή, η οποία απένειμε ένα ανώτερου εκπαιδευτικού επιπέδου πτυχίο σε ένα φυσικό πρόσωπο. @el
definition: يربط شخصا بمؤسسة أو كلية تمنح درجة أكاديمية لشخص. @ar
definition: 将一个个人与作为授予一个个人学位的机构或院系的一个团体关联起来。 @zh-hans

alkusanojen kirjoittajana ekspressiossa
has element type: 2
instruction number: 18.5
toolkit definition: An expression that includes a contribution of providing a foreword. (Deprecated) @en
toolkit definition: Egy mű kifejezési módja, amely közreműködést testesít meg azzal, hogy egy eredeti művet előszóval lát el. @hu
toolkit definition: Eine Expression eines Werks, bei der ein Akteur ein Vorwort zum Originalwerk liefert. @de
toolkit definition: Et uttrykk av et verk som omfatter et bidrag i form av å tilføre et forord til originalverket. @no
toolkit definition: Expression d’une œuvre qui intègre une contribution consistant à fournir un avant-propos à une œuvre originale. @fr
toolkit definition: Expressió d’una obra que incorpora una contribució que proporciona un pròleg a una obra original. @ca
toolkit definition: Teoksen ekspressio, joka sisältää alkuperäiseen teokseen kirjoitetun esipuheen.
toolkit definition: Udtryk af et værk, der inkorporerer et bidrag ved at skrive en indledning til et oprindeligt værk. @da
toolkit definition: Μια έκφραση που ενσωματώνει τη συνεισφορά ενός προλόγου στο πρωτότυπο έργο. @el
toolkit label: Verfasser eines Vorworts von @de
toolkit label: alkusanojen kirjoittajana ekspressiossa
toolkit label: auteur d’avant-propos de @fr
toolkit label: előszó írója @hu
toolkit label: escriptor d’un pròleg de @ca
toolkit label: forfatter av forord til @no
toolkit label: forfatter til indledning til @da
toolkit label: writer of foreword of (Deprecated) @en
toolkit label: συγγραφέας του προλόγου του @el
has subproperty: P50254
lexical alias: writerOfForewordOf.en
status: Deprecated
type: Property
domain: C10002
label: előszó írója @hu
label: er forfatter til indledning til @da
label: est un auteur d’avant-propos de @fr
label: is writer of foreword of (Deprecated) @en
label: ist Verfasser eines Vorworts von @de
label: és escriptor d’un pròleg de @ca
label: είναι συγγραφέας του προλόγου του @el
sub property of: oheisteksti
definition: Egy ágenst (személyt, családot vagy testületet), aki/amely hozzájárul egy mű kifejezési formájához azzal, hogy egy eredeti művet előszóval lát el, hozzákapcsol egy kifejezési formához. @hu
definition: Liittää toimijan teoksen ekspressioon, joka sisältää alkuperäiseen teokseen kirjoitetun esipuheen.
definition: Met un agent qui contribue à une expression d’une œuvre en fournissant un avant-propos à une œuvre originale en relation avec une expression. @fr
definition: Relaciona un agent, que contribueix a una expressió d’una obra proporcionant un pròleg a una obra original, amb una expressió. @ca
definition: Relaterer en agent, der bidrager til et udtryk af et værk ved at skrive en indledning til et oprindeligt værk til et udtryk. @da
definition: Relates an agent to an expression that includes a contribution of providing a foreword. (Deprecated) @en
definition: Setzt einen Akteur, der an einer Expression eines Werks mitwirkt, indem er ein Vorwort zum Originalwerk liefert, mit einer Expression in Beziehung. @de
definition: Συνδέει έναν φορέα, ο οποίος συνεισφέρει σε μια έκφραση ενός έργου παρέχοντας έναν πρόλογο στο πρωτότυπο έργο, με μια έκφραση. @el

äänisuunnittelija (toimija) ekspressiossa
has element type: 2
instruction number: 18.5
toolkit definition: An expression that includes a contribution by an agent of designing and creating audio or sound components. @en
toolkit definition: Een expressie die omvat een bijdrage door een actor door ontwerpen en creëren van audio- en geluidseffecten. @nl
toolkit definition: Egy kifejezési forma, amely magában foglalja egy ágens közreműködését audio- vagy hangösszetevők tervezésében és létrehozásában. @hu
toolkit definition: Eine Expression, zu der ein Akteur beiträgt, indem er Tonelemente entwirft und erstellt. @de
toolkit definition: Ekspressio, jonka tekemiseen toimija osallistuu suunnittelemalla ja luomalla äänikomponentteja.
toolkit definition: Espressione che include un contributo da parte di un agente per la progettazione e creazione di componenti audio o sonori. @it
toolkit definition: Et uttrykk som inkluderer et bidrag fra en agent som utformer og skaper lyd og lydkomponenter. @no
toolkit definition: Expression qui intègre une contribution de la part d’un agent consistant à concevoir et à créer des effets audio ou sonores. @fr
toolkit definition: Expressió que inclou una contribució d’un agent en el disseny i la creació de components àudio o sonors. @ca
toolkit definition: Izteiksme, kas ietver aģenta ieguldījumu, izstrādājot un radot audio vai skaņas komponentus. @lv
toolkit definition: Ses veya ses bileşenleri tasarlayan ve yaratan bir temsilcinin katkısını içeren bir anlatım. @tr
toolkit definition: Udtryk, som omfatter en agents bidrag ved at designe og skabe audio- eller lyddele. @da
toolkit definition: Väljendus, millesse tegija on andnud panuse, kavandades ja luues selle helikomponendid. @et
toolkit definition: Μια έκφραση ενός έργου που ενσωματώνει τη συνεισφορά του σχεδιασμού και της δημιουργίας ακουστικών ή ηχητικών συστατικών. @el
toolkit definition: تعبيرة تتضمن إسهام وكيل في تصميم عناصر سمعية أو صوتية وإنشائها. @ar
toolkit definition: 包括设计并创作音频或音响组成部分的一个行为者的贡献的一种内容表达 @zh-hans
toolkit label: Akteur als Tongestalterin/Tongestalter von @de
toolkit label: agent concepteur sonore de @fr
toolkit label: agent dissenyador de so de @ca
toolkit label: agent, som er lyddesigner af @da
toolkit label: agente progettista del suono @it
toolkit label: geluidsontwerper-actor van @nl
toolkit label: hangtervező ágense: @hu
toolkit label: helikujundaja (tegija) väljenduses @et
toolkit label: ir skaņu mākslinieks (aģents) @lv
toolkit label: lyddesigner for (agent) @no
toolkit label: ses tasarımcı temsilci @tr
toolkit label: sound designer agent of @en
toolkit label: äänisuunnittelija (toimija) ekspressiossa
toolkit label: σχεδιαστής ήχου φορέας του @el
toolkit label: وكيل مصمم صوت @ar
toolkit label: ……的音响设计者行为者 @zh-hans
has subproperty: äänisuunnittelija (henkilö) ekspressiossa
has subproperty: äänisuunnittelija (yhteistoimija) ekspressiossa
has subproperty: P50255
lexical alias: soundDesignerAgentOf.en
status: Published
type: Property
domain: C10002
label: Ses tasarımcısı temsilcisi @tr
label: er agent, som er lyddesigner af @da
label: er lyddesigner for (agent) @no
label: est un agent concepteur sonore de @fr
label: hangtervező ágense a következőnek: @hu
label: helikujundaja (tegija) väljenduses @et
label: ir skaņu mākslinieks (aģents) @lv
label: is geluidsontwerper-actor van @nl
label: is sound designer agent of @en
label: ist Akteur als Tongestalterin/Tongestalter von @de
label: è progettista del suono @it
label: és agent dissenyador de so de @ca
label: είναι σχεδιαστής ήχου φορέας του @el
label: هو وكيل مصمم صوت لـ @ar
label: 是……的音响设计者行为者 @zh-hans
sub property of: esitykseen osallinen toimija ekspressiossa
alternative label: Tongestalterin/Tongestalter von @de
alternative label: concepteur sonore de @fr
alternative label: diseñador de sonido de @es
alternative label: dissenyador de so de @ca
alternative label: hangtervezője: @hu
alternative label: helikujundaja väljenduses @et
alternative label: lyddesigner af @da
alternative label: lyddesigner for @no
alternative label: pogettista del suono di @it
alternative label: ses tasarımcısı @tr
alternative label: sound designer of @en
alternative label: äänisuunnittelijana ekspressiossa
alternative label: σχεδιαστής ήχου του @el
alternative label: مصمم صوت @ar
alternative label: ……的音响设计者 @zh-hans
definition: Bir temsilciyi, ses veya ses bileşenleri tasarlayan ve oluşturan temsilcinin katkısını içeren bir anlatımla ilişkilendirir. @tr
definition: Correla un agente a un'espressione che include un contributo da parte di un agente per la progettazione e creazione di componenti audio o sonori. @it
definition: Hozzákapcsol egy ágenst egy kifejezési formához, amely magában foglalja egy ágens közreműködését audio- vagy hangösszetevők tervezésében és létrehozásában. @hu
definition: Liittää toimijan ekspressioon, jonka tekemiseen toimija osallistuu suunnittelemalla ja luomalla äänikomponentteja.
definition: Met un agent en relation avec une expression qui intègre une contribution de la part d’un agent consistant à concevoir et à créer des effets audio ou sonores. @fr
definition: Relaciona un agent amb una expressió que inclou una contribució d’un agent en el disseny i la creació de components àudio o sonors. @ca
definition: Relateert een actor aan een expressie die omvat een bijdrage door een actor door ontwerpen en creëren van audio- en geluidseffecten. @nl

valosuunnittelija (toimija) ekspressiossa
has element type: 2
instruction number: 18.5
toolkit definition: An expression that includes a contribution by an agent of designing and creating lighting components. @en
toolkit definition: Aydınlatma bileşenleri tasarlayan ve yaratan bir temsilcinin katkısını içeren bir anlatım. @tr
toolkit definition: Een expressie die omvat een bijdrage door een actor door ontwerpen en creëren van lichteffecten. @nl
toolkit definition: Egy kifejezési forma, amely magában foglalja egy ágens közreműködését világítási összetevők tervezésében és létrehozásában. @hu
toolkit definition: Eine Expression, zu der ein Akteur beiträgt, indem er Lichtelemente entwirft und erstellt. @de
toolkit definition: Ekspressio, jonka tekemiseen toimija osallistuu suunnittelemalla ja luomalla valokomponentteja.
toolkit definition: Espressione che include un contributo da parte di un agente per progettare e creare componenti di illuminazione. @it
toolkit definition: Et uttrykk som inkluderer et bidrag fra en agent som utformer og skaper lyskomponenter. @no
toolkit definition: Expression qui intègre une contribution de la part d’un agent consistant à concevoir et à créer des effets de lumière. @fr
toolkit definition: Expressió que inclou una contribució d’un agent en el disseny i creació de components luminotècnics. @ca
toolkit definition: Izteiksme, kas ietver aģenta ieguldījumu, izstrādājot un radot apgaismojuma efektus. @lv
toolkit definition: Udtryk, som omfatter en agents bidrag ved at designe og skabe belysningsdele. @da
toolkit definition: Väljendus, millesse tegija on andnud panuse, kavandades ja luues selle valguskomponendid. @et
toolkit definition: Μια έκφραση ενός έργου που ενσωματώνει τη συνεισφορά του σχεδιασμού και της δημιουργίας συστατικών φωτισμού. @el
toolkit definition: تعبيرة تتضمن إسهام وكيل في تصميم عناصر الإضاءة وإنشائها. @ar
toolkit definition: 包括设计并创作灯光组成部分的一个行为者的贡献的一种内容表达 @zh-hans
toolkit label: Akteur als Lichtgestalterin/Lichtgestalter von @de
toolkit label: Işık tasarımcısı temsilcisi @tr
toolkit label: agent dissenyador d’il·luminació de @ca
toolkit label: agent éclairagiste de @fr
toolkit label: agent, som er belysningsdesigner af @da
toolkit label: ir gaismu mākslinieks (aģents) @lv
toolkit label: lichtontwerper-actor van @nl
toolkit label: lighting designer agent of @en
toolkit label: lysdesigner for (agent) @no
toolkit label: progettista dell'illuminazione agente @it
toolkit label: valguskujundaja (tegija) väljenduses @et
toolkit label: valosuunnittelija (toimija) ekspressiossa
toolkit label: világítástervező ágense: @hu
toolkit label: σχεδιαστής φωτισμού φορέας του @el
toolkit label: وكيل مصمم إضاءة @ar
toolkit label: ……的灯光设计者行为者 @zh-hans
has subproperty: valosuunnittelija (henkilö) ekspressiossa
has subproperty: valosuunnittelija (yhteistoimija) ekspressiossa
has subproperty: P50256
lexical alias: lightingDesignerAgentOf.en
status: Published
type: Property
domain: C10002
label: er agent, som er belysningsdesigner af @da
label: er lysdesigner for (agent) @no
label: est un agent éclairagiste de @fr
label: ir gaismu mākslinieks (aģents) @lv
label: is lichtontwerper-actor van @nl
label: is lighting designer agent of @en
label: ist Akteur als Lichtgestalterin/Lichtgestalter von @de
label: valguskujundaja (tegija) väljenduses @et
label: világítástervező ágense a következőnek: @hu
label: è progettista dell'illuminazione @it
label: és agent dissenyador d’il·luminació de @ca
label: ışık tasarımcısı temsilcisidir @tr
label: είναι σχεδιαστής φωτισμού φορέας του @el
label: هو وكيل مصمم إضاءة لـ @ar
label: 是……的灯光设计者行为者 @zh-hans
sub property of: esitykseen osallinen toimija ekspressiossa
alternative label: Işık tasarımcısı @tr
alternative label: Lichtgestalter von @de
alternative label: belysningsdesigner af @da
alternative label: diseñador de iluminación de @es
alternative label: dissenyador d’il·luminació de @ca
alternative label: lighting designer of @en
alternative label: lysdesigner for @no
alternative label: pogettista dell'illuminazione di @it
alternative label: valguskujundaja väljenduses @et
alternative label: valosuunnittelijana ekspressiossa
alternative label: világítástervezője: @hu
alternative label: éclairagiste de @fr
alternative label: σχεδιαστής φωτισμού του @el
alternative label: مصمم الإضاءة @ar
alternative label: ……的灯光设计者 @zh-hans
definition: Bir temsilciyi, aydınlatma bileşenlerini tasarlayan ve oluşturan bir temsilcisinin katkısını içeren bir anlatımla ilişkilendirir. @tr
definition: Correla un agente a un'espressione che include un contributo da parte di un agente nella progettazione e creazione di componenti per l'illuminazione. @it
definition: Hozzákapcsol egy ágenst egy kifejezési formához, amely magában foglalja egy ágens közreműködését világítási összetevők tervezésében és létrehozásában. @hu
definition: Liittää toimijan ekspressioon, jonka tekemiseen toimija osallistuu suunnittelemalla ja luomalla valokomponentteja.
definition: Met un agent en relation avec une expression qui intègre une contribution de la part d’un agent consistant à concevoir et à créer des effets de lumière. @fr
definition: Relaciona un agent amb una expressió que inclou una contribució d’un agent en el disseny i creació de components luminotècnics. @ca
definition: Relateert een actor aan een expressie die omvat een bijdrage door een actor door ontwerpen en creëren van lichteffecten. @nl

opinnäytteen tarkastaja teoksessa
has element type: 2
instruction number: 18.5
toolkit definition: A work that involves a responsibility for serving on a committee that supervises a thesis or dissertation of a student. @en
toolkit definition: Bir öğrencinin tezini veya doktora çalışmasını denetleyen bir komitede görev alma sorumluluğunu içeren bir çalışma. @tr
toolkit definition: Darbs, kas ietver personas ieguldījumu, darbojoties komisijā, kas piešķir akadēmisko grādu. @lv
toolkit definition: Een werk dat met zich meebrengt een verantwoordelijkheid voor zitting hebben in een commissie die een scriptie of proefschrift van een student begeleidt. @nl
toolkit definition: Egy mű, amelyhez hozzátartozik egy olyan bizottságban való szolgálat felelőssége, amely felügyeli egy hallgató szakdolgozatát vagy disszertációját. @hu
toolkit definition: Ein Werk, das mit einer Verantwortung verbunden ist, Mitglied eines Ausschusses zu sein, der eine Hochschulschrift von einer Studentin/einem Studenten beaufsichtigt. @de
toolkit definition: Et verk som involverer ansvar for å delta i en komité som veileder en students avhandling eller masteroppgave. @no
toolkit definition: Obra que implica una responsabilitat de formar part d’un comitè que supervisa una tesi o una dissertació d’un estudiant. @ca
toolkit definition: Opera che implica la responsabilità per la partecipazione a una commissione che supervisiona una tesi o dissertazione di uno studente. @it
toolkit definition: Teos, jossa henkilö on vastuussa akateemisen opinnäytteen tai väitöskirjan tarkastaneessa komiteassa toimimisesta.
toolkit definition: Teos, mis sisaldab vastutust osalemise eest üliõpilase väitekirja ülevaatavas nõukogus. @et
toolkit definition: Værk, som involverer et ansvar for at være medlem af et udvalg, som fører tilsyn med en students speciale eller afhandling. @da
toolkit definition: Œuvre qui comporte une responsabilité consistant à siéger à un comité qui supervise une thèse ou un mémoire d’un étudiant. @fr
toolkit definition: Ένα έργο που περιλαμβάνει την ευθύνη ενός μέλους επιτροπής που επιβλέπει μια διατριβή ή διδακτορική έρευνα ενός έργου. @el
toolkit definition: عمل يترتب عليه مسئولية العمل في لجنة تشرف على رسالة جامعية أو أطروحة لطالب. @ar
toolkit definition: 涉及指导学生论文的一个委员会中的责任的一种作品 @zh-hans
toolkit label: Mitglied eines Graduierungsausschusses von @de
toolkit label: bölüm komitesi üyesi @tr
toolkit label: degree committee member of @en
toolkit label: diplomabizottsági tagja: @hu
toolkit label: graad commissie-lid van @nl
toolkit label: ir grāda piešķīrējkomisijas dalībnieks @lv
toolkit label: kraadinõukogu liige teoses @et
toolkit label: medlem af kandidatudvalg i @da
toolkit label: medlem av bedømmelseskomité for @no
toolkit label: membre de comité de thèse de @fr
toolkit label: membre d’un comitè acadèmic de @ca
toolkit label: membro della commissione di laurea di @it
toolkit label: opinnäytteen tarkastaja teoksessa
toolkit label: μέλος συμβουλευτικής επιτροπής του @el
toolkit label: عضو لجنة درجة أكاديمية @ar
toolkit label: ……的学位委员会成员 @zh-hans
has subproperty: P50257
lexical alias: degreeCommitteeMemberOf.en
status: Published
type: Property
domain: C10004
label: diplomabizottsági tagja a következőnek: @hu
label: er medlem af kandidatudvalg @da
label: er medlem av bedømmelseskomité for @no
label: est un membre de comité de thèse de @fr
label: ir grāda piešķīrējkomisijas dalībnieks @lv
label: is degree committee member of @en
label: is graad commissie-lid van @nl
label: ist Mitglied eines Graduierungsausschusses von @de
label: kraadinõukogu liige teoses @et
label: tez komitesi üyesidir @tr
label: è membro della commissione di laurea di @it
label: és membre d’un comitè acadèmic de @ca
label: είναι μέλος συμβουλευτικής επιτροπής του @el
label: هو عضو لجنة تمنح درجة أكاديمية لـ @ar
label: 是……的学位委员会成员 @zh-hans
sub property of: teoksen tekijä (henkilö) teoksessa
alternative label: tarkastajana opinnäytteessä
definition: Bir kişiyi, bir öğrencinin tezini veya bitirme tezini denetleyen bir komitede görev yapma sorumluluğunu içeren bir eserle ilişkilendirir. @tr
definition: Correla una persona a un'opera che implica la responsabilità per la partecipazione a una commissione che supervisiona una tesi o dissertazione di uno studente. @it
definition: Hozzákapcsol egy személyt egy műhöz, amelyhez hozzátartozik egy olyan bizottságban való szolgálat felelőssége, amely felügyeli egy hallgató szakdolgozatát vagy disszertációját. @hu
definition: Liittää henkilön teokseen, jossa henkilö on vastuussa akateemisen opinnäytteen tai väitöskirjan tarkastaneessa komiteassa toimimisesta.
definition: Met une personne en relation avec une œuvre qui comporte une responsabilité consistant à siéger à un comité qui supervise une thèse ou un mémoire d’un étudiant. @fr
definition: Relaciona una persona amb una obra que implica una responsabilitat de formar part d’un comitè que supervisa una tesi o una dissertació d’un estudiant. @ca
definition: Relateert een persoon aan een werk dat met zich meebrengt een verantwoordelijkheid voor zitting hebben in een commissie die een scriptie of proefschrift van een student begeleidt. @nl
definition: Relaterer en person til et verk som involverer ansvar for å delta i en komité som veileder en students avhandling eller masteroppgave. @no
definition: Relaterer en person til et værk, som involverer et ansvar for at være medlem af et udvalg, som fører tilsyn med en students speciale eller afhandling. @da
definition: Relates a person to a work that involves a responsibility for serving on a committee that supervises a thesis or dissertation of a student. @en
definition: Sasaista personu ar darbu, kas ietver personas ieguldījumu, darbojoties komisijā, kas piešķir akadēmisko grādu. @lv
definition: Seostab isiku teosega, mis sisaldab vastutust osalemise eest üliõpilase väitekirja ülevaatavas nõukogus. @et
definition: Setzt eine Person in Beziehung zu einem Werk, das mit einer Verantwortung verbunden ist, Mitglied eines Ausschusses zu sein, der eine Hochschulschrift von einer Studentin/einem Studenten beaufsichtigt. @de
definition: Συνδέει ένα φυσικό πρόσωπο, το οποίο συνιστά μέλος επιτροπής εποπτείας διατριβής ή διδακτορικής έρευνας, με ένα έργο. @el
definition: يربط شخصا بعمل يترتب عليه مسئولية العمل في لجنة تشرف على أطروحة أو رسالة جامعية لطالب. @ar
definition: 将一个个人与涉及指导学生论文的一个委员会中的责任的一种作品关联起来。 @zh-hans

yhteisö vastaajana kanteessa
has element type: 2
instruction number: 18.5
toolkit definition: A work that involves a responsibility of a corporate body being accused in a criminal proceeding or sued in a civil proceeding. @en
toolkit definition: Bir ceza davasında tüzel kişi olarak suçlanma veya bir hukuk davasında dava edilme sorumluluğunu içeren bir eser. @tr
toolkit definition: Darbs, kas ietver atbildību par to, ka institūcija apsūdzēta kriminālprocesā vai iesūdzēta civillietā. @lv
toolkit definition: Een werk dat met zich meebrengt een verantwoordelijkheid van beschuldigd worden als een corporatie in een civielrechtelijke procedure. @nl
toolkit definition: Egy mű, amelyhez hozzátartozik annak felelőssége, hogy egy testületet egy büntetőeljárásban megvádolnak, vagy egy polgári perben beperelnek. @hu
toolkit definition: Ein Werk, das mit einer Verantwortung verbunden ist, als Körperschaft in einem Strafverfahren angeklagt oder in einem Zivilverfahren verklagt zu werden. @de
toolkit definition: Et verk som involverer et ansvar for å være en korporasjon som er tiltalt i en straffesak eller saksøkt i en sivilrettslig sak. @no
toolkit definition: Obra que implica una responsabilitat d’una entitat corporativa com a part acusada en un procés penal o demandada en un procés civil. @ca
toolkit definition: Opera che implica la responsabilità di essere accusato come ente in un procedimento penale o querelato in un procedimento civile. @it
toolkit definition: Teos, joka sisältää yhteisöön kohdistuvan syytteen rikosoikeudenkäynnissä tai haasteen siviilioikeudenkäynnissä.
toolkit definition: Teos, mis sisaldab asutuse vastu esitatud süüdistust kriminaalkohtumenetluses või hagi tsiviilkohtumenetluses. @et
toolkit definition: Værk, som involverer et ansvar for at være anklaget, som en korporation, i en straffesag eller sagsøgt i en civilsag. @da
toolkit definition: Œuvre qui comporte une responsabilité de la part d’une collectivité accusée dans une poursuite criminelle ou poursuivie dans une poursuite civile. @fr
toolkit definition: Ένα έργο που περιλαμβάνει την ευθύνη για ένα συλλογικό όργανο, εναντίον του οποίου ασκείται αγωγή στο πλαίσιο αστικής διαδικασίας. @el
toolkit definition: عمل يترتب عليه تحمل مسئولية اتهامها كهيئة في دعوى جنائية أو مقاضاتها في دعوى مدنية. @ar
toolkit definition: 涉及在刑事或民事诉讼中被控告的一个团体的责任的一种作品 @zh-hans
toolkit label: Körperschaft als Angeklagte/Angeklagter/Beklagte/Beklagter von @de
toolkit label: alperes testülete: @hu
toolkit label: collectivité défenderesse de @fr
toolkit label: defendant corporate body of @en
toolkit label: ente che si difendedi @it
toolkit label: entitat corporativa acusada de @ca
toolkit label: ir atbildētājs (institūcija) @lv
toolkit label: kostja (asutus) teoses @et
toolkit label: sagsøgt korporation af @da
toolkit label: saksøkt korporasjon for @no
toolkit label: sanık tüzel kişi @tr
toolkit label: verweerder-corporatie van @nl
toolkit label: yhteisö vastaajana kanteessa
toolkit label: εναγόμενο συλλογικό όργανο του @el
toolkit label: هيئة مدعى عليها @ar
toolkit label: ……的被告团体 @zh-hans
has subproperty: yhteisövastaaja rikosoikeudessa teoksessa
has subproperty: yhteisövastaaja siviilioikeudessa teoksessa
has subproperty: P50258
lexical alias: defendantCorporateBodyOf.en
status: Published
type: Property
domain: C10005
label: alperes testülete a következőnek: @hu
label: davalı tüzel kişidir @tr
label: er sagsøgt korporation af @da
label: er saksøkt korporasjon for @no
label: est une collectivité défenderesse de @fr
label: ir atbildētājs (institūcija) @lv
label: is defendant corporate body of @en
label: is verweerder-corporatie van @nl
label: ist Körperschaft als Angeklagte/Angeklagter/Beklagte/Beklagter von @de
label: kostja (asutus) teoses @et
label: è difendente ente di @it
label: és entitat corporativa acusada de @ca
label: είναι εναγόμενο συλλογικό όργανο του @el
label: هي هيئة مدعى عليها لـ @ar
label: 是……的被告团体 @zh-hans
sub property of: er korporation, som er ophav til værk af
alternative label: süüdistatav (asutus) teoses @et
alternative label: yhteisö kohteena kanteessa
definition: Bir tüzel kişiyi, bir ceza davasında tüzel kişi olarak suçlanma veya bir hukuk davasında dava edilme sorumluluğunu içeren bir eserle ilişkilendirir. @tr
definition: Collega un ente a un'opera che implica la responsabilità di essere accusato come ente in un procedimento penale o querelato in procedimento civile. @it
definition: Hozzákapcsol egy testületet egy műhöz, amelyhez hozzátartozik annak felelőssége, hogy egy testületet egy büntetőeljárásban megvádolnak, vagy egy polgári perben beperelnek. @hu
definition: Liittää yhteisön teokseen, joka sisältää yhteisöön kohdistuvan syytteen rikosoikeudenkäynnissä tai haasteen siviilioikeudenkäynnissä.
definition: Met une collectivité en relation avec une œuvre qui comporte une responsabilité de la part d’une collectivité accusée dans une poursuite criminelle ou poursuivie dans une poursuite civile. @fr
definition: Relaciona una entitat corporativa amb una obra que implica una responsabilitat d’una entitat corporativa com a part acusada en un procés penal o demandada en un procés civil. @ca
definition: Relateert een corporatie aan een werk dat met zich meebrengt een verantwoordelijkheid van beschuldigd worden als een corporatie in een civielrechtelijke procedure. @nl
definition: Relaterer en korporasjon til et verk som involverer et ansvar for å være en korporasjon som er tiltalt i en straffesak eller saksøkt i en sivilrettslig sak. @no
definition: Relaterer en korporation til et værk, som involverer et ansvar for at være anklaget, som en korporation, i en straffesag eller sagsøgt i en civilsag. @da
definition: Relates a corporate body to work that involves a responsibility of a corporate body being accused in a criminal proceeding or sued in a civil proceeding. @en
definition: Sasaista institūciju ar darbu, kas ietver atbildību par to, ka institūcija apsūdzēta kriminālprocesā vai iesūdzēta civillietā. @lv
definition: Seostab asutuse teosega, mis sisaldab asutuse vastu esitatud süüdistust kriminaalkohtumenetluses või hagi tsiviilkohtumenetluses. @et
definition: Setzt eine Körperschaft in Beziehung zu einem Werk, das mit einer Verantwortung verbunden ist, als Körperschaft in einem Strafverfahren angeklagt oder in einem Zivilverfahren verklagt zu werden. @de
definition: Συνδέει ένα συλλογικό όργανο, το οποίο ασκεί αγωγή στο πλαίσιο αστικής διαδικασίας, με ένα έργο. @el
definition: يربط هيئة بعمل يترتب عليه مسئولية اتهامها كهيئة في دعوى جنائية، أو مقاضاتها في دعوى مدنية. @ar
definition: 将一个团体与涉及在刑事或民事诉讼中被控告的一个团体的责任的一种作品关联起来。 @zh-hans

henkilö vastaajana kanteessa
has element type: 2
instruction number: 18.5
toolkit definition: A work that involves a responsibility of a person being accused in a criminal proceeding or sued in a civil proceeding. @en
toolkit definition: Bir ceza davasında kişi olarak suçlanma veya bir hukuk davasında dava edilme sorumluluğunu içeren bir çalışma. @tr
toolkit definition: Darbs, kas ietver atbildību par to, ka persona apsūdzēta kriminālprocesā vai iesūdzēta civillietā. @lv
toolkit definition: Een werk dat met zich meebrengt een verantwoordelijkheid van beschuldigd worden als een persoon in een civielrechtelijke procedure. @nl
toolkit definition: Egy mű, amelyhez hozzátartozik annak felelőssége, hogy egy személyt egy büntetőeljárásban megvádolnak, vagy egy polgári perben beperelnek. @hu
toolkit definition: Ein Werk, das mit einer Verantwortung verbunden ist, als Person in einem Strafverfahren angeklagt oder in einem Zivilverfahren verklagt zu werden. @de
toolkit definition: Et verk som involverer et ansvar for å være en person som er tiltalt i en straffesak eller saksøkt i en sivilrettslig sak. @no
toolkit definition: Obra que implica una responsabilitat d’una persona com a part acusada en un procés penal o demandada en un procés civil. @ca
toolkit definition: Opera che implica la responsabilità di essere accusato come persona in un procedimento penale o querelato in un procedimento civile. @it
toolkit definition: Teos, joka sisältää henkilöön kohdistuvan syytteen rikosoikeudenkäynnissä tai haasteen siviilioikeudenkäynnissä.
toolkit definition: Teos, mis sisaldab isiku vastu esitatud süüdistust kriminaalkohtumenetluses või hagi tsiviilkohtumenetluses. @et
toolkit definition: Værk, som involverer et ansvar for at være en person, som er anklaget i en straffesag eller sagsøgt i en civilsag. @da
toolkit definition: Œuvre qui comporte une responsabilité de la part d’une personne accusée dans une poursuite criminelle ou poursuivie dans une poursuite civile. @fr
toolkit definition: Ένα έργο που περιλαμβάνει την ευθύνη για ένα φυσικό πρόσωπο, εναντίον του οποίου ασκείται αγωγή στο πλαίσιο αστικής διαδικασίας. @el
toolkit definition: عمل يترتب عليه تحمل مسئولية اتهامه كشخص في دعوى جنائية أو مقاضاته في دعوى مدنية. @ar
toolkit definition: 涉及在刑事或民事诉讼中被控告的一个个人的责任的一种作品 @zh-hans
toolkit label: Person als Angeklagte/Angeklagter/Beklagte/Beklagter von @de
toolkit label: alperes személye: @hu
toolkit label: defendant person of @en
toolkit label: henkilö vastaajana kanteessa
toolkit label: ir atbildētājs (persona) @lv
toolkit label: kostja (isik) teoses @et
toolkit label: persona acusada de @ca
toolkit label: persona che si difende di @it
toolkit label: personne défenderesse de @fr
toolkit label: sagsøgt person af @da
toolkit label: saksøkt person for @no
toolkit label: sanık kişi @tr
toolkit label: verweerder-persoon van @nl
toolkit label: εναγόμενο φυσικό πρόσωπο του @el
toolkit label: شخص مدعى عليه @ar
toolkit label: ……的被告个人 @zh-hans
has subproperty: henkilövastaaja rikosoikeudessa teoksessa
has subproperty: henkilövastaaja siviilioikeudessa teoksessa
has subproperty: P50259
lexical alias: defendantPersonOf.en
status: Published
type: Property
domain: C10004
label: alperes személye a következőnek: @hu
label: davalı kişisidir @tr
label: er sagsøgt person af @da
label: er saksøkt person for @no
label: est une personne défenderesse de @fr
label: ir atbildētājs (persona) @lv
label: is defendant person of @en
label: is verweerder-persoon van @nl
label: ist Person als Angeklagte/Angeklagter/Beklagte/Beklagter von @de
label: kostja (isik) teoses @et
label: è difendente persona di @it
label: és persona acusada de @ca
label: είναι εναγόμενο φυσικό πρόσωπο του @el
label: هو شخص مدعى عليه @ar
label: 是……的被告个人 @zh-hans
sub property of: teoksen tekijä (henkilö) teoksessa
alternative label: henkilö kohteena kanteessa
alternative label: süüdistatav (isik) teoses @et
definition: Bir kişiyi, bir ceza yargılamasında kişi olarak suçlanma veya bir hukuk yargılamasında dava edilme sorumluluğunu içeren bir eserle ilişkilendirir. @tr
definition: Correla una persona a un'opera che implica la responsabilità di essere accusato come persona in un procedimento penale o querelato in procedimento civile. @it
definition: Hozzákapcsol egy személyt egy műhöz, amelyhez hozzátartozik annak felelőssége, hogy egy személyt egy büntetőeljárásban megvádolnak, vagy egy polgári perben beperelnek. @hu
definition: Liittää henkilön teokseen, joka sisältää henkilöön kohdistuvan syytteen rikosoikeudenkäynnissä tai haasteen siviilioikeudenkäynnissä.
definition: Met une personne en relation avec une œuvre qui comporte une responsabilité de la part d’une personne accusée dans une poursuite criminelle ou poursuivie dans une poursuite civile. @fr
definition: Relaciona una persona amb una obra que implica una responsabilitat d’una persona com a part acusada en un procés penal o demandada en un procés civil. @ca
definition: Relateert een actor aan een werk dat met zich meebrengt een verantwoordelijkheid van beschuldigd worden als een persoon in een civielrechtelijke procedure. @nl
definition: Relaterer en person et verk som involverer et ansvar for å være en person som er tiltalt i en straffesak eller saksøkt i en sivilrettslig sak. @no
definition: Relaterer en person til et værk, som involverer et ansvar for at være en person, som er anklaget i en straffesag eller sagsøgt i en civilsag. @da
definition: Relates a person to a work that involves a responsibility of a person being accused in a criminal proceeding or sued in a civil proceeding. @en
definition: Sasaista personu ar darbu, kas ietver atbildību par to, ka persona apsūdzēta kriminālprocesā vai iesūdzēta civillietā. @lv
definition: Seostab isiku teosega, mis sisaldab isiku vastu esitatud süüdistust kriminaalkohtumenetluses või hagi tsiviilkohtumenetluses. @et
definition: Setzt eine Person in Beziehung zu einem Werk, das mit einer Verantwortung verbunden ist, als Person in einem Strafverfahren angeklagt oder in einem Zivilverfahren verklagt zu werden. @de
definition: Συνδέει ένα φυσικό πρόσωπο, το οποίο ασκεί αγωγή στο πλαίσιο αστικής διαδικασίας, με ένα έργο. @el
definition: يربط شخص بعمل ينطوي على مسئولية اتهامه كشخص في دعوى جنائية أو مقاضاته في دعوى مدنية. @ar
definition: 将一个个人与涉及在刑事或民事诉讼中被控告的一个个人的责任的一种作品关联起来。 @zh-hans

muu yhteisöön liittyvä paikka
has element type: 3
instruction number: 11.3.3
toolkit definition: A place that is associated with a corporate body other than location of a conference, etc. (Deprecated) @en
toolkit definition: Egy testülethez kötődő hely, amely nem egy konferencia stb. helyszíne. @hu
toolkit definition: Ein Ort, der mit einer Körperschaft in Verbindung steht, außer der Ort einer Konferenz usw. @de
toolkit definition: Et sted som forbindes med en korporasjon, bortsett fra møtested for en konferanse etc. @no
toolkit definition: Lieu, autre que l’emplacement d’un congrès, etc., associé à une collectivité. @fr
toolkit definition: Lloc associat amb una entitat corporativa diferent de la localització d’un congrés, etc. @ca
toolkit definition: Muu yhteisöön liittyvä paikka kuin konferenssin tms. paikka.
toolkit definition: Sted knyttet til en korporation, bortset fra sted for konference etc. @da
toolkit definition: Un lugar asociado con una entidad corporativa diferente al lugar de una conferencia, etc. @es
toolkit definition: Ένας τόπος σχετικός με ένα συλλογικό όργανο, διαφορετικός από την τοποθεσία ενός συνεδρίου κ.λπ. @el
toolkit label: Sonstiger Ort, der mit einer Körperschaft in Verbindung steht @de
toolkit label: altre lloc associat amb una entitat corporativa @ca
toolkit label: andet sted knyttet til korporation @da
toolkit label: annet sted som forbindes med korporasjon @no
toolkit label: autre lieu associé à une collectivité @fr
toolkit label: muu yhteisöön liittyvä paikka
toolkit label: other place associated with corporate body (Deprecated) @en
toolkit label: otro lugar asociado con la entidad corporativa @es
toolkit label: testülethez kötődő másik hely @hu
toolkit label: övrig ort förknippad med institutionen @sv
toolkit label: άλλος τόπος συνδεδεμένος με το συλλογικό όργανο @el
has subproperty: P50260
lexical alias: otherPlaceAssociatedWithCorporateBody.en
status: Deprecated
type: Property
domain: C10005
label: a pour autre lieu associé à une collectivité @fr
label: har andet sted knyttet til korporation @da
label: har övrig ort förknippad med institutionen @sv
label: has other place associated with corporate body (Deprecated) @en
label: hat sonstigen Ort, der mit einer Körperschaft in Verbindung steht @de
label: té com a altre lloc associat amb una entitat corporativa @ca
label: van testülethez kötődő másik helye @hu
label: έχει άλλον τόπο συνδεδεμένο με το συλλογικό όργανο @el
sub property of: yhteisöön liittyvä paikka
definition: Egy testületet hozzákapcsol egy helyhez, amely kötődik egy testülethez, más módon, mint egy konferencia stb. helyszíne. @hu
definition: Liittää yhteisön muuhun yhteisöön liittyvään paikkaan, joka on muu kuin konferenssin tms. paikka.
definition: Met une collectivité en relation avec un lieu, autre que l’emplacement d’un congrès, etc., associé à une collectivité. @fr
definition: Relaciona una entitat corporativa a un lloc associat amb una entitat corporativa diferent de la localització d’un congrés, etc. @ca
definition: Relaterer en korporation til et sted knyttet til en korporation, bortset fra sted for konference etc. @da
definition: Relates a corporate body to a place that is associated with a corporate body other than location of a conference, etc. (Deprecated) @en
definition: Setzt eine Körperschaft mit einem Ort, der mit einer Körperschaft in Verbindung steht, außer der Ort einer Konferenz usw., in Beziehung. @de
definition: Συνδέει ένα συλλογικό όργανο με έναν τόπο σχετικό με ένα συλλογικό όργανο, άλλον από την τοποθεσία ενός συνεδρίου κ.λπ. @el
scope note: A testülethez kötődő egyéb hely magában foglalja a testülethez kötődő országot, államot, tartományt, helyet stb., valamint egy testület központjának a helyszínét. @hu
scope note: Andet sted knyttet til en korporation inkluderer et land, en delstat, en provins, et lokalt sted etc., der knyttes til en korporation og stedet for en korporations hovedkvarter. @da
scope note: Muu yhteisöön liittyvä paikka käsittää osavaltion, maakunnan, kaupungin tms., joka liittyy yhteisöön ja yhteisön pääkonttorin sijaintipaikkaan.
scope note: Other place associated with corporate body includes a country, state, province, local place, etc., associated with a corporate body and the location of headquarters of a corporate body. @en
scope note: Un autre lieu associé à une collectivité comprend un pays, un État, une province, une localité, etc. associée à une collectivité ainsi que l’emplacement du siège social d’une collectivité. @fr
scope note: Zu einem sonstigen Ort, der mit der Körperschaft in Verbindung steht, gehören ein Land, ein Staat, eine Provinz, ein Ort usw., der mit einer Körperschaft in Verbindung steht, und der Sitz einer Körperschaft ist. @de
scope note: Άλλος τόπος συνδεδεμένος με ένα συλλογικό όργανο περιλαμβάνει μια χώρα, πολιτεία/κράτος, επαρχία, πόλη κ.λπ. συνδεδεμένη με ένα συλλογικό όργανο και την τοποθεσία των κεντρικών γραφείων ενός συλλογικού οργάνου. @el

liikkuvaan kuvaan osallistuja (toimija) ekspressiossa
has element type: 2
instruction number: 18.5
see also: esittelijä (toimija) ekspressiossa
toolkit definition: An expression that includes a contribution by an agent of taking an active role as a participant. @en
toolkit definition: Een expressie die omvat een bijdrage door een actor door een actieve rol te nemen als deelnemer. @nl
toolkit definition: Egy kifejezési forma, amely magában foglalja egy résztvevőként aktív szerepet vállaló ágens közreműködését. @hu
toolkit definition: Eine Expression, zu der ein Akteur beiträgt, indem er eine aktive Rolle als Teilnehmer einnimmt. @de
toolkit definition: Ekspressio, jossa toimija on osallisena ei-fiktiivisen liikkuvan kuvan teoksen ekspression tekemisessä ottamalla aktiivisen roolin osallistujana.
toolkit definition: Espressione che include un contributo da parte di un agente nello svolgere un ruolo attivo come partecipante. @it
toolkit definition: Et uttrykk som inkluderer et bidrag fra en agent i form av å ha en aktiv rolle som deltaker. @no
toolkit definition: Expression qui intègre une contribution de la part d’un agent consistant à jouer un rôle actif comme participant. @fr
toolkit definition: Expressió que inclou una contribució d’un agent tenint un paper actiu com a participant. @ca
toolkit definition: Izteiksme, kas ietver aģenta ieguldījumu, aktīvi piedaloties kā dalībnieks. @lv
toolkit definition: Katılımcı olarak aktif bir rol alan bir temsilcinin katkısını içeren bir anlatım. @tr
toolkit definition: Udtryk, som omfatter en agents bidrag ved at påtage sig en aktiv rolle som deltager. @da
toolkit definition: Väljendus, millesse tegija on andnud panuse, olles osalejana aktiivses rollis. @et
toolkit definition: Μια έκφραση ενός έργου μη μυθιστορηματικής κινητής εικόνας, η οποία ενσωματώνει τη συνεισφορά της ενεργούς συμμετοχής. @el
toolkit definition: تعبيرة تتضمن إسهام وكيل في القيام بدور نشط كمشارك . @ar
toolkit definition: 包括一个作为积极参与者的一个行为者的贡献的一种内容表达 @zh-hans
toolkit label: Akteur als On-Screen-Teilnehmerin/On-Screen-Teilnehmer von @de
toolkit label: agent participant en pantalla de @ca
toolkit label: agent participant à l’écran de @fr
toolkit label: agent, som er programmedvirkende af @da
toolkit label: deelnemer in beeld-actor van @nl
toolkit label: deltaker i program for (agent) @no
toolkit label: ekraanil osaleja (tegija) väljenduses @et
toolkit label: ekran katılımcı temsilcisi @tr
toolkit label: ir ekrānā redzamais dalībnieks (aģents) @lv
toolkit label: képernyőn megjelenő résztvevő ágense: @hu
toolkit label: liikkuvaan kuvaan osallistuja (toimija) ekspressiossa
toolkit label: onscreen participant agent of @en
toolkit label: partecipante su schermo agente di @it
toolkit label: οθονικός συμμετέχων φορέας του @el
toolkit label: وكيل مشارك على الشاشة @ar
toolkit label: ……的屏幕参与者行为者 @zh-hans
has subproperty: liikkuvaan kuvaan osallistuja (henkilö) ekspressiossa
has subproperty: liikkuvaan kuvaan osallistuja (yhteistoimija) ekspressiossa
has subproperty: P50261
lexical alias: onscreenParticipantAgentOf.en
status: Published
type: Property
domain: C10002
label: ekraanil osaleja (tegija) väljenduses @et
label: ekran katılımcısı temsilcisidir @tr
label: er agent, som er programmedvirkende af @da
label: er deltaker i program for (agent) @no
label: est un agent participant à l’écran de @fr
label: ir ekrānā redzamais dalībnieks (aģents) @lv
label: is deelnemer in beeld-actor van @nl
label: is onscreen participant agent of @en
label: ist Akteur als On-Screen-Teilnehmerin/On-Screen-Teilnehmer von @de
label: képernyőn megjelenő résztvevő ágense a következőnek: @hu
label: è partecipante su schermo agente di @it
label: és agent participant en pantalla de @ca
label: είναι οθονικός συμμετέχων φορέας του @el
label: هو وكيل مشارك على الشاشة @ar
label: 是……的屏幕参与者行为者 @zh-hans
sub property of: esitykseen osallinen toimija ekspressiossa
alternative label: On-Screen-Teilnehmer von @de
alternative label: deltaker i program for @no
alternative label: ekraanil osaleja väljenduses @et
alternative label: ekran katılımcısı @tr
alternative label: képernyőn megjelenő résztvevője: @hu
alternative label: on-screen participant of @en
alternative label: osallistujana ohjelmassa
alternative label: partecipante su schermo di @it
alternative label: participant en pantalla de @ca
alternative label: participant à l’écran de @fr
alternative label: participante en pantalla de @es
alternative label: programmedvirkende af @da
alternative label: οθονικός συμμετέχων του @el
alternative label: مشارك على الشاشة @ar
alternative label: ……的屏幕参与者 @zh-hans
definition: Bir temsilciyi, bir katılımcı olarak aktif rol alan bir temsilcinin katkısını içeren bir anlatımla ilişkilendirir. @tr
definition: Correla un agente a un'espressione che include un contributo da parte di un agente nello svolgere un ruolo attivo come partecipante. @it
definition: Hozzákapcsol egy ágenst egy kifejezési formához, amely magában foglalja egy résztvevőként aktív szerepet vállaló ágens közreműködését. @hu
definition: Liittää toimijan ekspressioon, jossa toimija on osallisena ei-fiktiivisen liikkuvan kuvan teoksen ekspression tekemisessä ottamalla aktiivisen roolin osallistujana.
definition: Met un agent en relation avec une expression qui intègre une contribution de la part d’un agent consistant à jouer un rôle actif comme participant. @fr
definition: Relaciona un agent amb una expressió que inclou una contribució d’un agent tenint un paper actiu com a participant. @ca

toimeksiantaja (toimija) teoksessa
has element type: 2
instruction number: 18.5
toolkit definition: A work that involves a responsibility of an agent for commissioning a work. @en
toolkit definition: Bir eser için bir temsilcinin sorumluluğunu içeren bir çalışma. @tr
toolkit definition: Darbs, kas ietver aģenta atbildību par darba pasūtīšanu. @lv
toolkit definition: Een werk dat met zich meebrengt een verantwoordelijkheid van een actor voor opdracht geven tot een werk. @nl
toolkit definition: Egy mű, amelyhez hozzátartozik egy ágens felelőssége egy mű megrendeléséért. @hu
toolkit definition: Ein Werk, bei dem ein Akteur dafür verantwortlich ist, ein Werk in Auftrag zu geben. @de
toolkit definition: Et verk som involverer ansvar for en agent i form av å gi et verk som oppdrag. @no
toolkit definition: Obra que implica una responsabilitat d’un agent d’encarregar una obra. @ca
toolkit definition: Opera che implica la responsabilità di un agente nella committenza di un'opera. @it
toolkit definition: Teos, jossa toimija on vastuussa teoksen teettämisestä.
toolkit definition: Teos, mis sisaldab tegija vastutust teose tellimise eest. @et
toolkit definition: Værk, som involverer en agents ansvar for at bestille et værk. @da
toolkit definition: Œuvre qui comporte une responsabilité de la part d’un agent consistant à commander une œuvre. @fr
toolkit definition: Ένα έργο που περιλαμβάνει την ευθύνη για την ανάθεση ενός έργου. @el
toolkit definition: عمل يترتب عليه مسئولية وكيل عن إصدار تكليف بعمل. @ar
toolkit definition: 涉及委托一种作品的一个行为者的责任的一种作品 @zh-hans
toolkit label: Akteur als Auftraggeberin/Auftraggeber von @de
toolkit label: agent comitent de @ca
toolkit label: agent commanditaire de @fr
toolkit label: agent, som er opgavestiller af @da
toolkit label: commissioning agent of @en
toolkit label: ente committente agente di @it
toolkit label: görevlendiren temsilci @tr
toolkit label: ir pasūtītājs (aģents) @lv
toolkit label: megrendelő ágense: @hu
toolkit label: opdrachtgever-actor van @nl
toolkit label: oppdragsgiver for (agent) @no
toolkit label: tellija (tegija) teoses @et
toolkit label: toimeksiantaja (toimija) teoksessa
toolkit label: αναθέτον όργανο φορέας του @el
toolkit label: وكيل جهة تكليف بـ @ar
toolkit label: ……的委托行为者 @zh-hans
has subproperty: toimeksiantaja (henkilö) teoksessa
has subproperty: toimeksiantaja (yhteistoimija) teoksessa
has subproperty: P50262
lexical alias: commissioningAgentOf.en
status: Published
type: Property
domain: C10002
label: er agent, som er opgavestiller af @da
label: er oppdragsgiver for (agent) @no
label: est un agent commanditaire de @fr
label: görevlendiren temsilcisidir @tr
label: ir pasūtītājs (aģents) @lv
label: is commissioning agent of @en
label: is opdrachtgever-actor van @nl
label: ist Akteur als Auftraggeberin/Auftraggeber von @de
label: megrendelő ágense a következőnek: @hu
label: tellija (tegija) teoses @et
label: è committente agente di @it
label: és agent comitent de @ca
label: είναι αναθέτον όργανο φορέας του @el
label: هو وكيل جهة تكليف بـ @ar
label: 是……的委托行为者 @zh-hans
sub property of: toimijaan liittyvä teos
alternative label: Auftraggeber von @de
alternative label: comitent de @ca
alternative label: commanditaire de @fr
alternative label: commissioning body of @en
alternative label: committente di @it
alternative label: görevlendiren kuruluş @tr
alternative label: megrendelője: @hu
alternative label: opgavestiller af @da
alternative label: oppdragsgiver for @no
alternative label: organismo comisionador de @es
alternative label: teettäjänä teokselle
alternative label: tellija teoses @et
alternative label: αναθέτον όργανο του @el
alternative label: جهة تكليف @ar
alternative label: ……的委托团体 @zh-hans
definition: Bir temsilciyi, bir eserin görevlendirilmesine ilişkin bir temsilcinin sorumluluğunu içeren bir eserle ilişkilendirir. @tr
definition: Correla un agente a un'opera che implica la responsabilità di un agente nella committenza di un'opera. @it
definition: Hozzákapcsol egy ágenst egy műhöz, amelyhez hozzátartozik egy ágens felelőssége egy mű megrendeléséért. @hu
definition: Liittää toimijan teokseen, jossa toimija on vastuussa teoksen teettämisestä.
definition: Met un agent en relation avec une œuvre qui comporte une responsabilité de la part d’un agent consistant à commander une œuvre. @fr
definition: Relaciona un agent amb una obra que implica una responsabilitat d’un agent d’encarregar una obra. @ca
definition: Relateert een actor aan een werk dat met zich meebrengt een verantwoordelijkheid van een actor voor opdracht geven tot een werk. @nl

ohjelmistokehittäjä (toimija) ekspressiossa
has element type: 2
instruction number: 18.5
toolkit definition: An expression that includes a contribution by an agent of researching, designing, implementing, or testing software. @en
toolkit definition: Een expressie die omvat een bijdrage door een actor door onderzoeken, ontwerpen, toepassen of testen van software. @nl
toolkit definition: Egy kifejezési forma, amely magában foglalja egy ágens közreműködését szoftver kutatásában, tervezésében, implementálásában vagy tesztelésében. @hu
toolkit definition: Eine Expression, zu der ein Akteur beiträgt, indem er Software untersucht, konzipiert, implementiert oder testet. @de
toolkit definition: Ekspressio, jonka tekemiseen toimija osallistuu tutkimalla, suunnittelemalla, toteuttamalla tai testaamalla ohjelmistoa.
toolkit definition: Espressione che include il contributo da parte di un agente nell'individuare, progettare, implementare o testare un software. @it
toolkit definition: Et uttrykk som inkluderer et bidrag fra en agent i form av å undersøke, designe, implementere eller teste programvare. @no
toolkit definition: Expression qui intègre une contribution de la part d’un agent consistant à effectuer des travaux de recherche, de conception, de mise en œuvre ou de mise à l’essai d’un logiciel. @fr
toolkit definition: Expressió que inclou una contribució d’un agent en la recerca, el disseny, la posada en marxa o l’examen de programari. @ca
toolkit definition: Izteiksme, kas ietver aģenta ieguldījumu, pētot, izstrādājot, ieviešot vai testējot programmatūru. @lv
toolkit definition: Udtryk, som omfatter en agents bidrag ved at researche, designe, implementere eller teste software. @da
toolkit definition: Väljendus, millesse tegija on andnud panuse, uurides, kavandades, juurutades või testides tarkvara. @et
toolkit definition: Yazılım araştırma, tasarlama, uygulama veya test etmede bir temsilcinin katkısını içeren bir anlatım. @tr
toolkit definition: Μια έκφραση ενός έργου που ενσωματώνει τη συνεισφορά της έρευνας, του σχεδιασμού, της εφαρμογής ή της δοκιμής του λογισμικού. @el
toolkit definition: تعبيرة تتضمن إسهام وكيل في البحث عن برمجية، أو تصميمها، أو تنفيذها، أو اختبارها. @ar
toolkit definition: 包括研究、设计、实施或测试软件的一个行为者的贡献的一种内容表达 @zh-hans
toolkit label: Akteur als Softwareentwicklerin/Softwareentwickler von @de
toolkit label: agent desenvolupador de programari de @ca
toolkit label: agent développeur de logiciel de @fr
toolkit label: agent, som er softwareudvikler af @da
toolkit label: ir programmatūras izstrādātājs (aģents) @lv
toolkit label: ohjelmistokehittäjä (toimija) ekspressiossa
toolkit label: programvareutvikler for (agent) @no
toolkit label: software developer agent of @en
toolkit label: softwareontwikkelaar-actor van @nl
toolkit label: sviluppatore di software agente di @it
toolkit label: szoftverfejlesztő ágense: @hu
toolkit label: tarkvaraarendaja (tegija) väljenduses @et
toolkit label: yazılım geliştirici temsilci @tr
toolkit label: εκπονητής λογισμικού φορέας του @el
toolkit label: وكيل مطور برمجيات @ar
toolkit label: ……的软件开发者行为者 @zh-hans
has subproperty: ohjelmistokehittäjä (henkilö) ekspressiossa
has subproperty: ohjelmistokehittäjä (yhteistoimija) ekspressiossa
has subproperty: P50263
lexical alias: softwareDeveloperAgentOf.en
status: Published
type: Property
domain: C10002
label: Yazılımcı temsilcisidir @tr
label: er agent, som er softwareudvikler af @da
label: er programvareutvikler for (agent) @no
label: est un agent développeur de logiciel de @fr
label: ir programmatūras izstrādātājs (aģents) @lv
label: is software developer agent of @en
label: is softwareontwikkelaar-actor van @nl
label: ist Akteur als Softwareentwicklerin/Softwareentwickler von @de
label: szoftverfejlesztő ágense a következőnek: @hu
label: tarkvaraarendaja (tegija) väljenduses @et
label: è sviluppatore software agente di @it
label: és agent desenvolupador de programari de @ca
label: είναι εκπονητής λογισμικού φορέας του @el
label: هو وكيل مطور برمجيات لـ @ar
label: 是……的软件开发者行为者 @zh-hans
sub property of: yhdistymään osallinen toimija ekspressiossa
alternative label: Softwareentwickler von @de
alternative label: desarrollador de software de @es
alternative label: desenvolupador de programari de @ca
alternative label: développeur de logiciel de @fr
alternative label: ohjelmisto
alternative label: programvareutvikler for @no
alternative label: software developer of @en
alternative label: softwareudvikler af @da
alternative label: sviluppatore software di @it
alternative label: szoftverfejlesztője: @hu
alternative label: tarkvaraarendaja väljenduses @et
alternative label: yazılım geliştirici @tr
alternative label: εκπονητής λογισμικού του @el
alternative label: مطور برمجيات @ar
alternative label: ……的软件开发者 @zh-hans
definition: Bir temsilciyi, yazılımın araştırılması, tasarlanması, uygulanması veya test edilmesinde bir temsilcinin katkısını içeren bir anlatımla ilişkilendirir. @tr
definition: Correla un agente a un'espressione che include il contributo da parte di un agente nell'individuare, progettare, implementare o testare un software. @it
definition: Hozzákapcsol egy ágenst egy kifejezési formához, amely magában foglalja egy ágens közreműködését szoftver kutatásában, tervezésében, implementálásában vagy tesztelésében. @hu
definition: Liittää toimijan ekspressioon, jonka tekemiseen toimija osallistuu tutkimalla, suunnittelemalla, toteuttamalla tai testaamalla ohjelmistoa.
definition: Met un agent en relation avec une expression qui intègre une contribution de la part d’un agent consistant à effectuer des travaux de recherche, de conception, de mise en œuvre ou de mise à l’essai d’un logiciel. @fr
definition: Relaciona un agent amb una expressió que inclou una contribució d’un agent en la recerca, el disseny, la posada en marxa o l’examen de programari. @ca
definition: Relateert een actor aan een expressie die omvat een bijdrage door een actor door onderzoeken, ontwerpen, toepassen of testen van software. @nl

yhteisön allekirjoittama valtiosopimus
has element type: 2
instruction number: 18.5
toolkit definition: A work that is signed, ratified, or acceded to a treaty. @en
toolkit definition: Bir antlaşmaya imza atılan, onaylanan veya katılım sağlanan bir eser. @tr
toolkit definition: Darbs, kas ir parakstīts, ratificēts vai pievienots līgumam. @lv
toolkit definition: Een werk dat is getekend, geratificeerd of toegetreden aan een verdrag. @nl
toolkit definition: Egy mű, amely aláírt, ratifikált vagy jóváhagyott egy szerződést. @hu
toolkit definition: Ein Werk, bei dem ein Abkommen unterzeichnet, ratifiziert oder ihm beigetreten wird. @de
toolkit definition: Et verk som undertegnes, ratifiseres eller sluttes til en traktat. @no
toolkit definition: Obra que se signa, ratifica o accedeix a un tractat. @ca
toolkit definition: Opera che è firmata, ratificata, o aderito a un trattato @it
toolkit definition: Teos, joka on allekirjoitettu, ratifioitu tai liitetty valitosopimukseen.
toolkit definition: Teos, mis on alla kirjutatud, ratifitseeritud või sellega on ühinetud. @et
toolkit definition: Værk, som er underskrevet, ratificeret eller tiltrådt til en traktat. @da
toolkit definition: Œuvre qui consiste en un traité qui a été signé, ratifié ou auquel un participant a adhéré. @fr
toolkit definition: Ένα έργο το οποίο έχει υπογραφεί, επικυρωθεί ή προσχωρηθεί σε μια συνθήκη. @el
toolkit definition: عمل معاهدة تم التوقيع عليها، أو التصديق عليها، أو الانضمام إليها. @ar
toolkit definition: 作为被签署、被批准、被同意的一个条约的一种作品 @zh-hans
toolkit label: Vertragspartnerin/Vertragspartner von @de
toolkit label: antlaşma iştirakçısı @tr
toolkit label: deelnemer in verdrag van @nl
toolkit label: ir līgumslēdzējs @lv
toolkit label: part i traktat for @no
toolkit label: partecipante al trattato di @it
toolkit label: participant en un tractat de @ca
toolkit label: participant in treaty of @en
toolkit label: participant à un traité de @fr
toolkit label: rahvusvahelise lepingu osaline teoses @et
toolkit label: résztvevője a következő szerződésnek: @hu
toolkit label: traktatdeltager af @da
toolkit label: yhteisön allekirjoittama valtiosopimus
toolkit label: συμμέτοχος σε συνθήκη του @el
toolkit label: مشارك في معاهدة @ar
toolkit label: ……条约的参与者 @zh-hans
has subproperty: P50264
lexical alias: participantInTreatyOf.en
status: Published
type: Property
domain: C10005
label: antlaşmasının katılımcısıdır @tr
label: er part i traktat for @no
label: er traktatdeltager af @da
label: est un participant à un traité de @fr
label: ir līgumslēdzējs @lv
label: is deelnemer in verdrag van @nl
label: is participant in treaty of @en
label: ist Vertragspartnerin/Vertragspartner von @de
label: rahvusvahelise lepingu osaline teoses @et
label: résztvevője a következő szerződésnek: @hu
label: è partecipante al trattato di @it
label: és participant en un tractat de @ca
label: είναι συμμέτοχος σε συνθήκη του @el
label: هي مشاركة في معاهدة لـ @ar
label: 是……条约的参与者 @zh-hans
sub property of: er korporation, som er ophav til værk af
alternative label: valtiosopimus
definition: Bir tüzel kişiyi, imzalanmış, onaylanmış veya bir antlaşmaya katılmış bir eserle ilişkilendirir. @tr
definition: Collega un ente a un'opera che è firmata, ratificata, o ha aderito a un trattato @it
definition: Hozzákapcsol egy testületet egy műhöz, amely aláírt, ratifikált vagy jóváhagyott egy szerződést. @hu
definition: Liittää yhteisön teokseen, joka on allekirjoitettu, ratifioitu tai liitetty valitosopimukseen.
definition: Met une collectivité en relation avec une œuvre qui consiste en un traité qui a été signé, ratifié ou auquel un participant a adhéré. @fr
definition: Relaciona una entitat corporativa amb una obra que se signa, ratifica o accedeix a un tractat. @ca
definition: Relateert een corporatie aan een werk dat is getekend, geratificeerd of toegetreden aan een verdrag. @nl
definition: Relaterer en korporasjon til et verk som undertegnes, ratifiseres eller sluttes til en traktat. @no
definition: Relaterer en korporation til et værk, som er underskrevet, ratificeret eller tiltrådt til en traktat. @da
definition: Relates a corporate body to a work that is signed, ratified, or acceded to a treaty. @en
definition: Sasaista institūciju ar darbu, kas ir parakstīts, ratificēts vai pievienots līgumam. @lv
definition: Seostab asutuse teosega, mis on alla kirjutatud, ratifitseeritud või sellega on ühinetud. @et
definition: Setzt eine Körperschaft in Beziehung zu einem Werk, bei dem ein Abkommen unterzeichnet, ratifiziert oder ihm beigetreten wird. @de
definition: Συνδέει ένα κυβερνητικό, διεθνές διακυβερνητικό συλλογικό όργανο ή άλλο συλλογικό όργανο, το οποίο έχει υπογράψει, επικυρώσει ή προσχωρήσει σε μια συνθήκη, με ένα έργο. @el
definition: يربط هيئة بعمل معاهدة تم التوقيع عليها، أو التصديق عليها، أو الانضمام إليها. @ar
definition: 将一个团体与作为被签署、被批准、被同意的一个条约的一种作品关联起来。 @zh-hans

tutkija (toimija) teoksessa
has element type: 2
instruction number: 18.5
toolkit definition: A work that involves a responsibility of an agent for research in support of a work. @en
toolkit definition: Bir çalışmayı destekleyen bir araştırma için bir temsilcinin sorumluluğunu içeren bir eser. @tr
toolkit definition: Darbs, kas ietver aģenta atbildību par pētījumu, lai atbalstītu darba radīšanu. @lv
toolkit definition: Een werk dat met zich meebrengt een verantwoordelijkheid van een actor voor onderzoek ter ondersteuning van een werk. @nl
toolkit definition: Egy mű, amelyhez hozzátartozik egy ágens felelőssége egy művet támogató kutatásért. @hu
toolkit definition: Ein Werk, bei dem ein Akteur für die Forschung zur Unterstützung eines Werks verantwortlich ist. @de
toolkit definition: Et verk som involverer ansvar for en agent i form av forskning som støtte for et verk. @no
toolkit definition: Obra que implica una responsabilitat d’un agent en la recerca per donar suport a una obra. @ca
toolkit definition: Opera che implica la responsabilità di un agente nella ricerca a supporto di un'opera. @it
toolkit definition: Teos, jossa toimija on vastuussa tutkimuksesta, joka tukee teoksen syntymistä.
toolkit definition: Teos, mis sisaldab tegija vastutust teose heaks uurimistöö tegemise eest. @et
toolkit definition: Værk, som involverer en agents ansvar for research til at understøtte et værk. @da
toolkit definition: Œuvre qui comporte une responsabilité de la part d’un agent consistant à effectuer des recherches pour aider à la création d’une œuvre. @fr
toolkit definition: Ένα έργο που περιλαμβάνει την ευθύνη της έρευνας υποστηρικτικά προς τη δημιουργία ενός έργου. @el
toolkit definition: عمل يترتب عليه مسئولية وكيل عن البحث لدعم عمل. @ar
toolkit definition: 涉及对一种作品研究支持的一个行为者的责任的一种作品 @zh-hans
toolkit label: Akteur als Forscherin/Forscher von @de
toolkit label: agent investigador de @ca
toolkit label: agent recherchiste de @fr
toolkit label: agent, som er researcher af @da
toolkit label: araştırmacı temsilci @tr
toolkit label: forsker for (agent) @no
toolkit label: ir pētnieks (aģents) @lv
toolkit label: kutató ágense: @hu
toolkit label: onderzoeker-actor van @nl
toolkit label: researcher agent of @en
toolkit label: ricercatore agente di @it
toolkit label: tutkija (toimija) teoksessa
toolkit label: uurija (tegija) teoses @et
toolkit label: ερευνητής φορέας του @el
toolkit label: وكيل باحث لـ @ar
toolkit label: ……的研究者行为者 @zh-hans
has subproperty: tutkija (henkilö) teoksessa
has subproperty: tutkija (yhteistoimija) teoksessa
has subproperty: P50265
lexical alias: researcherAgentOf.en
status: Published
type: Property
domain: C10002
label: araştırmacı temsilcisidir @tr
label: er agent, som er researcher af @da
label: er forsker for (agent) @no
label: est un agent recherchiste de @fr
label: ir pētnieks (aģents) @lv
label: is onderzoeker-actor van @nl
label: is researcher agent of @en
label: ist Akteur als Forscherin/Forscher von @de
label: kutató ágense a következőnek: @hu
label: uurija (tegija) teoses @et
label: è ricercatore agente di @it
label: és agent investigador de @ca
label: είναι ερευνητής φορέας του @el
label: هو وكيل باحث لـ @ar
label: 是……的研究者行为者 @zh-hans
sub property of: toimijaan liittyvä teos
alternative label: Forscher von @de
alternative label: araştırmacı @tr
alternative label: forsker af @da
alternative label: forsker for @no
alternative label: investigador de @ca
alternative label: kutatója: @hu
alternative label: recherchiste de @fr
alternative label: researcher of @en
alternative label: ricercatore di @it
alternative label: tutkimus
alternative label: uurija teoses @et
alternative label: ερευνητής του @el
alternative label: باحث @ar
alternative label: ……的研究者 @zh-hans
definition: Bir temsilciyi, bir eserin desteklenmesine yönelik araştırma için bir temsilcinin sorumluluğunu içeren bir eserle ilişkilendirir. @tr
definition: Correla un agente a un'opera che implica la responsabilità di un agente nella ricerca a supporto di un'opera. @it
definition: Hozzákapcsol egy ágenst egy műhöz, amelyhez hozzátartozik egy ágens felelőssége egy művet támogató kutatásért. @hu
definition: Liittää toimijan teokseen, jossa toimija on vastuussa tutkimuksesta, joka tukee teoksen syntymistä.
definition: Met un agent en relation avec une œuvre qui comporte une responsabilité de la part d’un agent consistant à effectuer des recherches pour aider à la création d’une œuvre. @fr
definition: Relaciona un agent amb una obra que implica una responsabilitat d’un agent en la recerca per donar suport a una obra. @ca
definition: Relateert een actor aan een werk dat met zich meebrengt een verantwoordelijkheid van een actor voor onderzoek ter ondersteuning van een werk. @nl
definition: Relaterer en agent til et verk som involverer ansvar for en agent i form av forskning som støtte for et verk. @no

värittäjä (toimija) ekspressiossa
has element type: 2
instruction number: 18.5
toolkit definition: An expression that includes a contribution by an agent of applying colour to drawings, prints, photographs, maps, moving images, and other visual content. @en
toolkit definition: Een expressie die omvat een bijdrage door een actor door toevoegen van kleur aan tekeningen, afdrukken, foto's, kaarten, bewegende beelden en andere visuele content. @nl
toolkit definition: Egy kifejezési forma, amely magában foglalja egy ágens közreműködését szín felhordásában rajzokra, nyomtatványokra, fényképekre, térképekre, mozgóképekre és más vizuális tartalmakra. @hu
toolkit definition: Eine Expression, zu der ein Akteur beiträgt, indem er Farben auf Zeichnungen, Drucke, Fotografien, Karten, Bewegtbilder und so weiter aufbringt. @de
toolkit definition: Ekspressio, jonka tekemiseen toimija osallistuu värittämällä piirustuksia, vedoksia, valokuvia, karttoja, elokuvia tms.
toolkit definition: Espressione che comprende un contributo da parte di un agente nell'applicare colore a disegni, stampe, fotografie, mappe, immagini in movimento e altri contenuti visivi. @it
toolkit definition: Et uttrykk som inkluderer et bidrag fra en agent i form av å fargelegge tegninger, trykk, fotografier, kart, levende bilder og annet visuelt innhold. @no
toolkit definition: Expression qui intègre une contribution de la part d’un agent consistant à appliquer de la couleur à des dessins, des images imprimées, des photographies, des cartes, des images animées et d’autres contenus visuels. @fr
toolkit definition: Expressió que inclou una contribució d’un agent aplicant color a dibuixos, gravats, fotografies, mapes, imatges en moviment i a qualsevol altre contingut visual. @ca
toolkit definition: Izteiksme, kas ietver aģenta ieguldījumu, izkrāsojot zīmējumu, gravīru, fotogrāfiju, karšu, kustīgo attēlu, u. tml. @lv
toolkit definition: Udtryk, som omfatter en agents bidrag ved at farvelægge tegninger, tryk, fotos, kort, levende billeder og andet visuelt indhold. @da
toolkit definition: Väljendus, millesse tegija on andnud panuse, värvides joonistusi, tõmmiseid, fotosid, kaarte, liikuvaid pilte ja muud visuaalset sisu. @et
toolkit definition: Çizimlere, baskılara, fotoğraflara, haritalara, hareketli resimlere ve diğer görsel içeriğe renk uygulamaları yapan bir temsilcinin katkısını içeren bir anlatım. @tr
toolkit definition: Μια έκφραση ενός έργου που ενσωματώνει τη συνεισφορά της εφαρμογής χρωμάτων στα σχέδια, τα σκίτσα, τις εκτυπώσεις, τις φωτογραφίες, τους χάρτες, τις κινητές εικόνες κ.λπ. @el
toolkit definition: تعبيرة تتضمن إسهام وكيل في تلوين رسومات، ومطبوعات، وصور فوتوغرافية، وخرائط، وصور متحركة، وأي محتوى مرئي آخر. @ar
toolkit definition: 包括将颜色施加于图画、印刷品、照片、地图、动态图像和其他视觉内容上的一个行为者的贡献的一种内容表达 @zh-hans
toolkit label: Akteur als Koloristin/Kolorist von @de
toolkit label: agent colorista de @ca
toolkit label: agent coloriste de @fr
toolkit label: agent, som er farvelægger af @da
toolkit label: colorist ágense a következőnek: @hu
toolkit label: colorista agente di @it
toolkit label: colourist agent of @en
toolkit label: fargelegger av (agent) @no
toolkit label: inkleurder-actor van @nl
toolkit label: ir kolorists (aģents) @lv
toolkit label: koloreerija (tegija) väljenduses @et
toolkit label: renklendirici temsilcisi @tr
toolkit label: värittäjä (toimija) ekspressiossa
toolkit label: επιχρωματιστής φορέας του @el
toolkit label: وكيل فني تلوين @ar
toolkit label: ……的着色者行为者 @zh-hans
has subproperty: värittäjä (henkilö) ekspressiossa
has subproperty: värittäjä (yhteistoimija) ekspressiossa
has subproperty: P50266
lexical alias: colouristAgentOf.en
status: Published
type: Property
domain: C10002
label: colorist ágense a következőnek: @hu
label: er agent, som er farvelægger af @da
label: er fargelegger av (agent) @no
label: est un agent coloriste de @fr
label: ir kolorists (aģents) @lv
label: is colourist agent of @en
label: is inkleurder-actor van @nl
label: ist Akteur als Koloristin/Kolorist von @de
label: koloreerija (tegija) väljenduses @et
label: renklendirici temsilcisidir @tr
label: è colorista agente di @it
label: és agent colorista de @ca
label: είναι επιχρωματιστής φορέας του @el
label: هو وكيل فني تلوين لـ @ar
label: 是……的着色者行为者 @zh-hans
sub property of: yhdistymään osallinen toimija ekspressiossa
alternative label: Akteur als Coloristin/Colorist von @de
alternative label: agente colorista de @es
alternative label: colorist agent of @en
alternative label: colorist of @en
alternative label: colorist ágense: @hu
alternative label: colorista de @es
alternative label: colorista di @it
alternative label: coloriste de @fr
alternative label: coloristja: @hu
alternative label: colourist of @en
alternative label: fargelegger av @no
alternative label: farvelægger af @da
alternative label: koloreerija väljenduses @et
alternative label: renklendirici @tr
alternative label: renklendirici temsilcisi @tr
alternative label: színezője: @hu
alternative label: επιχρωματιστής του @el
alternative label: κολορίστας του @el
alternative label: وكيل فني تلوين لـ @ar
alternative label: ……的着色者 @zh-hans
alternative label: ……的着色者行为者 @zh-hans
definition: Bir temcilsiciyi, çizimlere, baskılara, fotoğraflara, haritalara, hareketli görüntülere ve diğer görsel içeriklere renk uygulayan bir temsilcinin katkısını içeren bir anlatımla ilişkilendirir. @tr

maskeeraaja (toimija) ekspresiossa
has element type: 2
instruction number: 18.5
toolkit definition: An expression that includes a contribution by an agent of applying makeup and prosthetics for a moving image production or for a musical or dramatic presentation or entertainment. @en
toolkit definition: Een expressie die omvat een bijdrage door een actor door aanbrengen van make-up en protheses voor een bewegend beeld-productie of voor een muzikale of dramatische presentatie of vermaak. @nl
toolkit definition: Egy kifejezési forma, amely magában foglalja egy ágens közreműködését makeup és protézisek alkalmazásában egy mozgókép-produkcióhoz, zenei vagy drámai bemutatóhoz, vagy szórakoztató műsorhoz. @hu
toolkit definition: Eine Expression, zu der ein Akteur beiträgt, indem er Schminke und Prothetik für eine Bewegtbildproduktion oder eine musikalische oder dramatische Darbietung oder Aufführung aufträgt. @de
toolkit definition: Ekspressio, jonka tekemiseen toimija osallistuu vastaamalla elokuvan, musikaalin tai näyttämöteoksen maskeerauksesta.
toolkit definition: Espressione che comprende un contributo da parte di un agente nell'applicare trucchi e protesi per una produzione cinematografica o per uno spettacolo o un intrattenimento musicale o teatrale. @it
toolkit definition: Et uttrykk som inkluderer et bidrag fra en agent i form av å bruke sminke og proteser for en produksjon med levende bilder eller en musikalsk eller dramatisk forestilling eller underholdning. @no
toolkit definition: Expression qui intègre une contribution de la part d’un agent consistant à appliquer du maquillage et des prothèses pour une production d’images animées ou bien pour une présentation ou un spectacle musical ou dramatique. @fr
toolkit definition: Expressió que inclou una contribució d’un agent aplicant maquillatge i pròtesis en el cas d’una producció d’imatge en moviment o una representació o un espectacle musical o dramàtic. @ca
toolkit definition: Hareketli bir görüntü üretimi veya müzikal veya dramatik bir sunum veya eğlence için bir temsilcinin makyaj ve protez uygulama katkısını içeren bir anlatım. @tr
toolkit definition: Izteiksme, kas ietver aģenta ieguldījumu, pielietojot dekoratīvo kosmētiku un protezēšanu filmu veidošanā, mūzikas vai dramatiskā uzvedumā vai izklaides pasākumā. @lv
toolkit definition: Udtryk, som omfatter en agents bidrag ved at lægge makeup og påsætte proteser til en levende billedproduktion eller til en musikalsk eller dramatisk præsentation eller til underholdning. @da
toolkit definition: Väljendus, millesse tegija on andnud panuse, tehes grimmi ja proteesgrimmi filmi tootmise, muusika- või draamaetenduse või meelelahutusürituse jaoks. @et
toolkit definition: Μια έκφραση ενός έργου που ενσωματώνει τη συνεισφορά της εφαρμογής μακιγιάζ και προσθετικών για την παραγωγή μιας κινητής εικόνας ή μιας μουσικής ή δραματικής παρουσίασης ή ψυχαγωγίας. @el
toolkit definition: تعبيرة تتضمن إسهام وكيل بوضع مكياج أو أطراف صناعية في إنتاج صور متحركة أو في عرض موسيقي أو درامي أو ترفيهي. @ar
toolkit definition: 包括为动态图像制作或者为音乐或戏剧呈现或娱乐施加化妆品或假体的一个行为者的贡献的一种内容表达 @zh-hans
toolkit label: Akteur als Maskenbildnerin/Maskenbildner von @de
toolkit label: agent maquillador de @ca
toolkit label: agent maquilleur de @fr
toolkit label: agent, som er sminkør af @da
toolkit label: grimmikunstnik (tegija) väljenduses @et
toolkit label: ir grima mākslinieks (aģents) @lv
toolkit label: make-upartiest-actor van @nl
toolkit label: makeup artist agent of @en
toolkit label: makyaj sanatçısı temsilcisi @tr
toolkit label: maskeeraaja (toimija) ekspresiossa
toolkit label: sminkmester ágense: @hu
toolkit label: sminkør for (agent) @no
toolkit label: truccatore agente di @it
toolkit label: ψιμυθιολόγος φορέας του @el
toolkit label: وكيل فنان مكياج @ar
toolkit label: ……的化妆艺术家行为者 @zh-hans
has subproperty: maskeeraaja (henkilö) ekspressiossa
has subproperty: maskeeraaja (yhteistoimija) ekspressiossa
has subproperty: P50267
lexical alias: makeupArtistAgentOf.en
status: Published
type: Property
domain: C10002
label: er agent, som er sminkør af @da
label: er sminkør for (agent) @no
label: est un agent maquilleur de @fr
label: grimmikunstnik (tegija) väljenduses @et
label: ir grima mākslinieks (aģents) @lv
label: is make-upartiest-actor van @nl
label: is makeup artist agent of @en
label: ist Akteur als Maskenbildnerin/Maskenbildner von @de
label: makyaj sanatçısı temsilcisidir @tr
label: sminkmester ágense a következőnek: @hu
label: è truccatore agente di @it
label: és agent maquillador de @ca
label: είναι ψιμυθιολόγος φορέας του @el
label: هو وكيل فنان مكياج لـ @ar
label: 是……的化妆艺术家行为者 @zh-hans
sub property of: esitykseen osallinen toimija ekspressiossa
alternative label: Maskenbildner von @de
alternative label: grimmikunstnik väljenduses @et
alternative label: make-up artist of @en
alternative label: makyaj sanatçısı @tr
alternative label: maquillador de @ca
alternative label: maquilleur de @fr
alternative label: maquillista de @es
alternative label: meikkitaiteilijana ekspressiossa
alternative label: sminkmestere: @hu
alternative label: sminkør af @da
alternative label: sminkør for @no
alternative label: truccatore di @it
alternative label: μακιγιέρ του @el
alternative label: ψιμυθιολόγος του @el
alternative label: فنان مكياج @ar
alternative label: ……的化妆艺术家 @zh-hans
definition: Bir temsilciyi, hareketli bir görüntü prodüksiyonu veya müzikal ya da dramatik bir sunum veya eğlence için makyaj ve protez uygulayan bir temsilcinin katkısını içeren bir anlatımla ilişkilendirir. @tr
definition: Correla un agente a un'espressione che comprende un contributo da parte di un agente nell'applicare trucchi e protesi per una produzione cinematografica o per uno spettacolo o un intrattenimento musicale o teatrale. @it
definition: Hozzákapcsol egy ágenst egy kifejezési formához, amely magában foglalja egy ágens közreműködését makeup és protézisek alkalmazásában egy mozgókép-produkcióhoz, zenei vagy drámai bemutatóhoz, vagy szórakoztató műsorhoz. @hu
definition: Liittää toimijan ekspressioon, jonka tekemiseen toimija osallistuu vastaamalla elokuvan, musikaalin tai näyttämöteoksen maskeerauksesta.
definition: Met un agent en relation avec une expression qui intègre une contribution de la part d’un agent consistant à appliquer du maquillage et des prothèses pour une production d’images animées ou bien pour une présentation ou un spectacle musical ou dramatique. @fr
definition: Relaciona un agent amb una expressió que inclou una contribució d’un agent aplicant maquillatge i pròtesis en el cas d’una producció d’imatge en moviment o una representació o un espectacle musical o dramàtic. @ca

kuoronjohtaja (toimija) ekspressiossa
has element type: 2
instruction number: 18.5
toolkit definition: An expression that includes a contribution by an agent of leading a choral performing group in a musical or dramatic presentation. @en
toolkit definition: Een expressie die omvat een bijdrage door een actor door leiden van een optredende koorgroep in een muzikale of dramatische presentatie. @nl
toolkit definition: Egy kifejezési forma, amely magában foglalja egy zenei vagy drámai bemutatóban énekkari előadó csoportot vezető ágens közreműködését. @hu
toolkit definition: Eine Expression, zu der ein Akteur beiträgt, indem er einen Chor in einer musikalischen oder dramatischen Darbietung leitet. @de
toolkit definition: Ekspressio, jonka tekemiseen toimija osallistuu johtamalla kuoroa musiikki- tai näytelmäesityksessä.
toolkit definition: Espressione che comprende un contributo da parte di un agente nel condurre e guidare un gruppo corale che si esibisce in una rappresentazione musicale o teatrale. @it
toolkit definition: Et uttrykk som inkluderer et bidrag fra en agent i form av å lede et kor i en musikalsk eller dramatisk forestilling. @no
toolkit definition: Expression qui intègre une contribution de la part d’un agent consistant à diriger un groupe de choristes dans une présentation musicale ou dramatique. @fr
toolkit definition: Expressió que inclou una contribució d’un agent dirigint una coral en una representació musical o dramàtica. @ca
toolkit definition: Izteiksme, kas ietver aģenta ieguldījumu, diriģējot izpildītājmākslinieku grupu mūzikas vai dramatiskā uzvedumā. @lv
toolkit definition: Müzikal veya dramatik bir sunumda bir koro performans grubuna liderlik eden bir temsilcinin katkısını içeren bir anlatım. @tr
toolkit definition: Udtryk, som omfatter en agents bidrag ved at lede et optrædende kor i en musikalsk eller dramatisk præsentation. @da
toolkit definition: Väljendus, millesse tegija on andnud panuse, juhatades koori muusika- või draamaetenduses. @et
toolkit definition: Μια έκφραση ενός μουσικού έργου που ενσωματώνει τη συνεισφορά της διεύθυνσης ενός χορωδιακού συνόλου σε μια μουσική ή δραματική παρουσίαση κ.λπ. @el
toolkit definition: تعبيرة تتضمن إسهام وكيل في قيادة فريق كورال في عرض موسيقي أو درامي. @ar
toolkit definition: 包括在音乐或戏剧呈现中领导一个合唱表演团体的一个行为者的贡献的一种内容表达 @zh-hans
toolkit label: Akteur als Chorleiterin/Chorleiter von @de
toolkit label: agent chef de chœur de @fr
toolkit label: agent director de cor de @ca
toolkit label: agent, som er kordirigent af @da
toolkit label: choral conductor agent of @en
toolkit label: direttore di corale agente di @it
toolkit label: ir kordiriģents (aģents) @lv
toolkit label: koordirigent-actor van @nl
toolkit label: koorijuht (tegija) väljenduses @et
toolkit label: kordirigent for (agent) @no
toolkit label: koro şefi temsilcisi @tr
toolkit label: kuoronjohtaja (toimija) ekspressiossa
toolkit label: kórusvezető ágense: @hu
toolkit label: διευθυντής χορωδίας φορέας του @el
toolkit label: وكيل قائد كورال @ar
toolkit label: ……的合唱指挥行为者 @zh-hans
has subproperty: kuoronjohtaja (henkilö) ekspressiossa
has subproperty: kuoronjohtaja (yhteistoimija) ekspressiossa
has subproperty: P50268
lexical alias: choralConductorAgentOf.en
status: Published
type: Property
domain: C10002
label: er agent, som er kordirigent af @da
label: er kordirigent for (agent) @no
label: est un agent chef de chœur de @fr
label: ir kordiriģents (aģents) @lv
label: is choral conductor agent of @en
label: is koordirigent-actor van @nl
label: ist Akteur als Chorleiterin/Chorleiter von @de
label: koorijuht (tegija) väljenduses @et
label: koro şefi temsilcisidir @tr
label: kórusvezető ágense a következőnek: @hu
label: è agente direttore agente di corale agente di @it
label: és agent director de cor de @ca
label: είναι διευθυντής χορωδίας φορέας του @el
label: هو وكيل قائد كورال لـ @ar
label: 是……的合唱指挥行为者 @zh-hans
sub property of: johtaja (toimija) ekspressiossa
alternative label: Chorleiter von @de
alternative label: chef de chœur de @fr
alternative label: choral conductor of @en
alternative label: diettore di corale di @it
alternative label: director coral de @es
alternative label: director de cor de @ca
alternative label: koorijuht väljenduses @et
alternative label: kordirigent af @da
alternative label: kordirigent for @no
alternative label: koro şefi @tr
alternative label: kuoronjohtajana ekspressiossa
alternative label: kórusvezetője: @hu
alternative label: διευθυντής χορωδίας του @el
alternative label: قائد كورال @ar
alternative label: ……的合唱指挥 @zh-hans
definition: Bir temsilciyi, müzikal veya dramatik bir sunumda bir koro performans grubuna liderlik eden bir temsilcinin katkısını içeren bir anlatımla ilişkilendirir. @tr
definition: Correla un agente a un'espressione che comprende un contributo da parte di un agente nel condurre e guidare un gruppo corale che si esibisce in una rappresentazione musicale o teatrale. @it
definition: Hozzákapcsol egy ágenst egy kifejezési formához, amely magában foglalja egy zenei vagy drámai bemutatóban énekkari előadó csoportot vezető ágens közreműködését. @hu
definition: Liittää toimijan ekspressioon, jonka tekemiseen toimija osallistuu johtamalla kuoroa musiikki- tai näytelmäesityksessä.
definition: Met un agent en relation avec une expression qui intègre une contribution de la part d’un agent consistant à diriger un groupe de choristes dans une présentation musicale ou dramatique. @fr
definition: Relaciona un agent amb una expressió que inclou una contribució d’un agent dirigint una coral en una representació musical o dramàtica. @ca
definition: Relateert een actor aan een expressie die omvat een bijdrage door een actor door leiden van een optredende koorgroep in een muzikale of dramatische presentatie. @nl

kapellimestari (toimija) ekspressiossa
has element type: 2
instruction number: 18.5
toolkit definition: An expression that includes a contribution by an agent of conducting and leading an instrumental performing group in a musical or dramatic presentation. @en
toolkit definition: Een expressie die omvat een bijdrage door een actor van dirigeren en leiden van een instrumentaal optredende groep in een muziek- of dramapresentatie. @nl
toolkit definition: Egy kifejezési forma, amely magában foglalja egy zenei vagy drámai bemutatóban hangszeres előadói csoportot vezénylő és vezető ágens közreműködését. @hu
toolkit definition: Eine Expression, zu der ein Akteur beiträgt, indem er eine Instrumentalgruppe in einer musikalischen oder dramatischen Darbietung leitet. @de
toolkit definition: Ekspressio, jonka tekemiseen toimija osallistuu johtamalla soitinryhmää musiikki- tai näytelmäesityksessä tms.
toolkit definition: Espressione che comprende il contributo da parte di un agente nel condurre o guidare un gruppo musicale che si esibisce in una rappresentazione musicate o teatrale. @it
toolkit definition: Et uttrykk som inkluderer et bidrag fra en agent i form av å lede en instrumentalgruppe i en musikalsk eller dramatisk forestilling. @no
toolkit definition: Expression qui intègre une contribution de la part d’un agent consistant à diriger un groupe d’instrumentistes dans une présentation musicale ou dramatique. @fr
toolkit definition: Expressió que inclou una contribució d’un agent dirigint un grup instrumental en una representació musical o dramàtica. @ca
toolkit definition: Izteiksme, kas ietver aģenta ieguldījumu, diriģējot un vadot orķestri muzikālā vai dramatiskā uzvedumā. @lv
toolkit definition: Müzikal veya dramatik bir sunumda enstrümantal bir performans grubunu yöneten ve yönlendiren bir temsilcinin katkısını içeren bir anlatım. @tr
toolkit definition: Udtryk, som omfatter en agents bidrag ved at lede en optrædende instrumentalgruppe i en musikalsk eller dramatisk præsentation. @da
toolkit definition: Väljendus, millesse tegija on andnud panuse, juhatades instrumentaalkoosseisu muusika- või draamaetenduses. @et
toolkit definition: Μια έκφραση ενός μουσικού έργου που ενσωματώνει τη συνεισφορά της διεύθυνσης ενός οργανικού συνόλου σε μια μουσική ή δραματική παρουσίαση κ.λπ. @el
toolkit definition: تعبيرة تتضمن إسهام وكيل في إدارة فرقة عزف وقيادتها في عرض موسيقي أو درامي. @ar
toolkit definition: 包括在音乐或戏剧呈现中指挥并领导一个器乐表演团体的一个行为者的贡献的一种内容表达 @zh-hans
toolkit label: Akteur als Orchesterleiterin/Orchesterleiter von @de
toolkit label: agent chef d’orchestre de @fr
toolkit label: agent director instrumental de @ca
toolkit label: agent, som er instrumentaldirigent af @da
toolkit label: conduttore strumentale agente di @it
toolkit label: enstrüman şefi temsilcisidir @tr
toolkit label: instrumentaal dirigent-actor van @nl
toolkit label: instrumental conductor agent of @en
toolkit label: instrumentaldirigent for (agent) @no
toolkit label: ir orķestra diriģents (aģents) @lv
toolkit label: kapellimestari (toimija) ekspressiossa
toolkit label: orkestrijuht (tegija) väljenduses @et
toolkit label: zenekari karmester ágense: @hu
toolkit label: διευθυντής ορχήστρας φορέας του @el
toolkit label: وكيل قائد فرقة عزف @ar
toolkit label: ……的器乐指挥行为者 @zh-hans
has subproperty: kapellimestari (henkilö) ekspressiossa
has subproperty: kapellimestari (yhteistoimija) ekspressiossa
has subproperty: P50269
lexical alias: instrumentalConductorAgentOf.en
status: Published
type: Property
domain: C10002
label: enstrüman şefi temsilcisidir @tr
label: er agent, som er instrumentaldirigent af @da
label: er instrumentaldirigent for (agent) @no
label: est un agent chef d’orchestre de @fr
label: ir orķestra diriģents (aģents) @lv
label: is instrumentaal dirigent-actor van @nl
label: is instrumental conductor agent of @en
label: ist Akteur als Orchesterleiterin/Orchesterleiter von @de
label: orkestrijuht (tegija) väljenduses @et
label: zenekari karmester ágense a következőnek: @hu
label: è strumentale conduttore agente di @it
label: és agent director instrumental de @ca
label: είναι διευθυντής ορχήστρας φορέας του @el
label: هو وكيل قائد فرقة عزف لـ @ar
label: 是……的器乐指挥行为者 @zh-hans
sub property of: johtaja (toimija) ekspressiossa
alternative label: Orchesterleiterin/Orchesterleiter von @de
alternative label: chef d’orchestre de @fr
alternative label: conduttore strumentale di @it
alternative label: director instrumental de @ca
alternative label: instrumental conductor of @en
alternative label: instrumentaldirigent af @da
alternative label: instrumentaldirigent for @no
alternative label: kapellimestarina ekspressiossa
alternative label: orkestrijuht väljenduses @et
alternative label: zenekari karmestere: @hu
alternative label: διευθυντής ορχήστρας του @el
alternative label: قائد فرقة آلات عزف @ar
alternative label: ……的器乐指挥 @zh-hans
definition: Bir temsilciyi, bir müzikal veya dramatik sunumda enstrümantal performans gösteren bir grubu yürütme ve yönetme konusunda bir temsilcinin katkısını içeren bir anlatımla ilişkilendirir. @tr
definition: Correla un agente a un'espressione che comprende il contributo da parte di un agente nel condurre o guidare un gruppo musicale che si esibisce in una rappresentazione musicale o teatrale. @it
definition: Hozzákapcsol egy ágenst egy kifejezési formához, amely magában foglalja egy zenei vagy drámai bemutatóban hangszeres előadói csoportot vezénylő és vezető ágens közreműködését. @hu
definition: Liittää toimijan ekspressioon, jonka tekemiseen toimija osallistuu johtamalla soitinryhmää musiikki- tai näytelmäesityksessä tms.
definition: Met un agent en relation avec une expression qui intègre une contribution de la part d’un agent consistant à diriger un groupe d’instrumentistes dans une présentation musicale ou dramatique. @fr
definition: Relaciona un agent amb una expressió que inclou una contribució d’un agent dirigint un grup instrumental en una representació musical o dramàtica. @ca
definition: Relateert een actor aan een expressie die omvat een bijdrage door een actor van dirigeren en leiden van een instrumentaal optredende groep in een muziek- of dramapresentatie. @nl
definition: Relaterer en agent til et udtryk, som omfatter en agents bidrag ved at lede en optrædende instrumentalgruppe i en musikalsk eller dramatisk præsentation. @da
definition: Relaterer en agent til et uttrykk som inkluderer et bidrag fra en agent i form av å lede en instrumentalgruppe i en musikalsk eller dramatisk forestilling. @no

järjestäjä (toimija) teoksessa
has element type: 2
instruction number: 18.5
toolkit definition: A work that involves a responsibility of an agent for organizing a conference, exhibition, or other event that gives rise to a work. @en
toolkit definition: Bir konferansı, sergiyi ya da bir çalışmaya yol açan başka bir etkinliği düzenlemek için bir temsilcinin sorumluluğunu içeren bir eser. @tr
toolkit definition: Darbs, kas ietver aģenta atbildību par konferences, izstādes vai pasākuma organizēšanu. @lv
toolkit definition: Een werk dat met zich meebrengt een verantwoordelijkheid van een actor voor het organiseren van een conferentie, tentoonstelling of andere gebeurtenis die aanleiding geeft tot een werk. @nl
toolkit definition: Egy mű, amelyhez hozzátartozik egy ágens felelőssége egy mű létrejöttét eredményező konferencia, kiállítás vagy más esemény szervezéséért. @hu
toolkit definition: Ein Werk, bei dem ein Akteur für die Organisation beziehungsweise Veranstaltung einer Konferenz, einer Ausstellung oder eines anderen Ereignisses verantwortlich ist, aus der/dem ein Werk hervorgeht. @de
toolkit definition: Et verk som involverer ansvar fra en agent for å organisere en konferanse, en utstilling eller et annet arrangement som gir opphav til et verk. @no
toolkit definition: Obra que implica una responsabilitat d’un agent organitzant un congrés, una exposició o qualsevol esdeveniment que dona lloc a una obra. @ca
toolkit definition: Opera che implica la responsabilità di un agente nell'organizzare una conferenza, mostra o altro evento che ha dà origine a un'opera. @it
toolkit definition: Teos, jossa toimija on vastuussa konferenssin, näyttelyn tai muun tapahtuman järjestämisestä ja jonka seurauksena syntyy teos.
toolkit definition: Teos, mis sisaldab tegija vastutust teosele aluse pannud konverentsi, näituse vm ürituse korraldamise eest. @et
toolkit definition: Værk, som involverer en agents ansvar for at organisere en konference, udstilling eller anden begivenhed, som giver anledning til et værk. @da
toolkit definition: Œuvre qui comporte une responsabilité de la part d’un agent consistant à organiser un congrès, une exposition ou un autre événement qui donne lieu à la création d’une œuvre. @fr
toolkit definition: Ένα έργο που περιλαμβάνει την ευθύνη της οργάνωσης μιας έκθεσης, ενός συμβάντος, συνεδρίου κ.λπ., εκ των οποίων προέκυψε η ανάγκη για ένα έργο. @el
toolkit definition: عمل يترتب عليه مسئولية وكيل عن تنظيم مؤتمر أو معرض أو فعالية أخرى ينشأ عنها عمل. @ar
toolkit definition: 涉及组织会议、展览或其他事件产生一种作品的一个行为者的责任的一种作品 @zh-hans
toolkit label: Akteur als Veranstalterin/Veranstalter von @de
toolkit label: agent organisateur de @fr
toolkit label: agent organitzador de @ca
toolkit label: arrangør for (agent) @no
toolkit label: er agent, som er arrangør af @da
toolkit label: ir organizators (aģents) @lv
toolkit label: järjestäjä (toimija) teoksessa
toolkit label: korraldaja (tegija) teoses @et
toolkit label: organisator-actor van @nl
toolkit label: organizatör temsilcisi @tr
toolkit label: organizer agent of @en
toolkit label: organizzatore agente di @it
toolkit label: szervező ágense: @hu
toolkit label: οργανωτής φορέας του @el
toolkit label: وكيل منظم لـ @ar
toolkit label: ……的组织者行为者 @zh-hans
has subproperty: järjestäjä (henkilö) teoksessa
has subproperty: järjestäjä (yhteistoimija) teoksessa
has subproperty: P50270
lexical alias: organizerAgentOf.en
status: Published
type: Property
domain: C10002
label: er agent, som er arrangør af @da
label: er arrangør for (agent) @no
label: est un agent organisateur de @fr
label: ir organizators (aģents) @lv
label: is organisator-actor van @nl
label: is organizer agent of @en
label: ist Akteur als Veranstalterin/Veranstalter von @de
label: korraldaja (tegija) teoses @et
label: organizatör temsilcisidir @tr
label: szervező ágense a következőnek: @hu
label: è organizzatore agente di @it
label: és agent organitzador de @ca
label: είναι οργανωτής φορέας του @el
label: هو وكيل منظم لـ @ar
label: 是……的组织者行为者 @zh-hans
sub property of: toimijaan liittyvä teos
alternative label: Veranstalter von @de
alternative label: arrangør af @da
alternative label: arrangør for @no
alternative label: järjestäjänä tapahtumassa
alternative label: korraldaja teoses @et
alternative label: organisateur de @fr
alternative label: organitzador de @ca
alternative label: organizador de @es
alternative label: organizatör @tr
alternative label: organizer of @en
alternative label: organizzatore di @it
alternative label: szervezője: @hu
alternative label: οργανωτής του @el
alternative label: منظم @ar
alternative label: ……的组织者 @zh-hans
definition: Bir temsilciyi, bir konferans, sergi veya bir esere yol açan diğer bir etkinliği organize etmeye ilişkin bir temsilcinin sorumluluğunu içeren bir eserle ilişkilendirir. @tr
definition: Correla un agente a un'opera che implica la responsabilità di un agente nell'organizzare una conferenza, mostra o altro evento che dà origine a un'opera. @it
definition: Hozzákapcsol egy ágenst egy műhöz, amelyhez hozzátartozik egy ágens felelőssége egy mű létrejöttét eredményező konferencia, kiállítás vagy más esemény szervezéséért. @hu
definition: Liittää toimijan teokseen, jossa toimija on vastuussa konferenssin, näyttelyn tai muun tapahtuman järjestämisestä ja jonka seurauksena syntyy teos.
definition: Met un agent en relation avec une œuvre qui comporte une responsabilité de la part d’un agent consistant à organiser un congrès, une exposition ou un autre événement qui donne lieu à la création d’une œuvre. @fr
definition: Relaciona un agent amb una obra que implica una responsabilitat d’un agent organitzant un congrés, una exposició o qualsevol altre esdeveniment que dona lloc a una obra. @ca
definition: Relateert een actor aan een werk dat met zich meebrengt een verantwoordelijkheid van een actor voor het organiseren van een conferentie, tentoonstelling of andere gebeurtenis die aanleiding geeft tot een werk. @nl

sensori (toimija) ekspressiossa
has element type: 2
instruction number: 18.5
see also: kirjoittaja (toimija) teoksessa
toolkit definition: Ahlaki, politik, askeri veya diğer alanlarda sakıncalı görülen içeriğin temzilenmesi amaçlı bir başka anlatım içeriğini revize etmek, fakat yapıyı ve genel içeriği önemli ölçüde değiştirmeden bırakmakla görevli bir temsilcinin katkısını içeren bir anlatım. @tr
toolkit definition: An expression that includes a contribution by an agent of revising the content of another expression for the purpose of suppressing content that is deemed objectionable on moral, political, military, or other grounds, but leaving the nature and general content substantially unchanged. @en
toolkit definition: Een expressie die omvat een bijdrage door een actor door het herzien van content van een andere expressie met de bedoeling content die gezien wordt als bezwaarlijk op morele, politieke, militaire of andere gronden te onderdrukken, maar de aard en algemene content grotendeels intact te laten. @nl
toolkit definition: Egy kifejezési forma, amely magában foglalja egy ágens közreműködését egy másik kifejezési forma tartalmának a felülvizsgálatában, morális, politikai, katonai vagy egyéb alapon kifogásolható tartalom kiküszöbölése céljából, ugyanakkor a jellegzetességeket és általánosságban a tartalmat lényegében változatlanul hagyja. @hu
toolkit definition: Eine Expression, zu der ein Akteur beiträgt, indem er den Inhalt einer anderen Expression überarbeitet, um Teile zu unterdrücken, die aus moralischen, politischen, militärischen oder anderen Gründen unerwünscht sind, ohne den Charakter und den Inhalt des Originalwerks substantiell zu verändern. @de
toolkit definition: Ekspressio, jonka tekemiseen toimija osallistuu tarkastamalla toisen ekspression sisältöä kiistanalaisen sisällön salaamiseksi moraalisin, poliittisin, sotilaallisin tai muin perustein, mutta jättäen alkuperäisen teoksen luonteen ja yleisen sisällön olennaisilta osiltaan muuttumattomaksi..
toolkit definition: Espressione che comprende il contributo da parte di un agente nella revisione del contenuto di un'altra espressione allo scopo di eliminare contenuto ritenuto opinabile per ragioni morali, politiche, militari o di altra natura, ma lasciando sostanzialmente immutati la natura e il contenuto generale. @it
toolkit definition: Et uttrykk som inkluderer et bidrag fra en agent i form av å redigerer innholdet i et annet uttrykk i den hensikt å fjerne deler som anses som upassende av moralske, politiske, militære eller andre årsaker, men som lar originalverkets særpreg og innhold forbli hovedsakelig uendret. @no
toolkit definition: Expression qui intègre une contribution de la part d’un agent consistant à réviser le contenu d’une autre expression dans le but de supprimer le contenu jugé inadmissible pour des motifs moraux, politiques, militaires ou autres tout en conservant la nature et le contenu sensiblement inchangés. @fr
toolkit definition: Expressió que inclou una contribució d’un agent revisant el contingut d’una altra expressió amb el propòsit de suprimir el contingut considerat objectable per motius ètics, polítics, militars o altres motius, però deixant la natura i el contingut general sense canvis substancials. @ca
toolkit definition: Izteiksme, kas ietver aģenta ieguldījumu, pārskatot citas izteiksmes saturu ar mērķi, lai izslēgtu saturu, kas tiek uzskatīts par nepieņemamu morālu, politisku, militāru vai citu iemeslu dēļ, bet tā būtību un vispārējo saturu būtiski nemaina. @lv
toolkit definition: Udtryk, som omfatter en agents bidrag ved at revidere indholdet af et andet indtryk med henblik på at undertrykke indhold, som anses for at være moralsk, politisk, militært eller af anden årsag stødende, men som i alt væsentligt lader originalværkets karakter og indhold være uændret. @da
toolkit definition: Väljendus, millesse tegija on andnud panuse, revideerides teise väljenduse sisu eesmärgiga välja jätta sisu, mida peetakse moraalsetel, poliitilistel, militaarsetel või muudel põhjustel ebasoovitavaks, kuid jättes allikväljenduse olemuse ja üldise sisu põhiliselt muutmata. @et
toolkit definition: Μια έκφραση ενός έργου που περιλαμβάνει την ευθύνη της αναθεώρησης του περιεχομένου με σκοπό την απόκρυψη, η οποία θεωρείται μη αποδεκτή σε ηθικό, πολιτικό, στρατιωτικό ή άλλο επίπεδο, αφήνοντας ωστόσο τη φύση και το περιεχόμενο αμετάβλητα. @el
toolkit definition: تعبيرة تتضمن إسهام وكيل في مراجعة محتوى تعبيرة أخرى بغرض حجب محتوى قد يكون موضع اعتراض لأسباب أخلاقية أو سياسية أو عسكرية أو لاعتبارات أخرى، دون أن يُحدث تغييرا جوهريا في طابعه أو في مضمونه العام. @ar
toolkit definition: 包括修订另一种内容表达的内容以禁止视为不符合道德、政治、军事或其他背景的内容但却保持性质和总体内容不变的一个行为者的贡献的内容表达 @zh-hans
toolkit label: Akteur als Zensorin/Zensor von @de
toolkit label: agent censeur de @fr
toolkit label: agent censor de @ca
toolkit label: agent, som er censor af @da
toolkit label: censor agent of @en
toolkit label: censor-actor van @nl
toolkit label: censore agente di @it
toolkit label: cenzor ágense: @hu
toolkit label: ir cenzors (aģents) @lv
toolkit label: sansür temsilcisi @tr
toolkit label: sensor av (agent) @no
toolkit label: sensori (toimija) ekspressiossa
toolkit label: tsensor (tegija) väljenduses @et
toolkit label: λογοκριτής φορέας του @el
toolkit label: وكيل مراقب @ar
toolkit label: ……的审查者行为者 @zh-hans
has subproperty: sensori (henkilö) ekspressiossa
has subproperty: sensori (yhteistoimija) ekspressiossa
has subproperty: P50271
lexical alias: censorAgentOf.en
status: Published
type: Property
domain: C10002
label: cenzor ágense a következőnek: @hu
label: er agent, som er censor af @da
label: er sensor av (agent) @no
label: est un agent censeur de @fr
label: ir cenzors (aģents) @lv
label: is censor agent of @en
label: is censor-actor van @nl
label: ist Akteur als Zensorin/Zensor von @de
label: sansürcü temsilcisidir @tr
label: tsensor (tegija) väljenduses @et
label: è censore agente di @it
label: és agent censor de @ca
label: είναι λογοκριτής φορέας του @el
label: هو وكيل مراقب لـ @ar
label: 是……的审查者行为者 @zh-hans
sub property of: tarkastaja (toimija) ekspressiossa
alternative label: Zensor von @de
alternative label: censeur de @fr
alternative label: censor af @da
alternative label: censor de @ca
alternative label: censor of @en
alternative label: censore di @it
alternative label: cenzora: @hu
alternative label: sansür @tr
alternative label: sensor av @no
alternative label: sensorina ekspressiossa
alternative label: tsensor väljenduses @et
alternative label: λογοκριτής του @el
alternative label: مراقب @ar
alternative label: ……的审查者 @zh-hans
definition: Bir temsilciyi, ahlaki, politik, askeri veya diğer gerekçelerle sakıncalı görülen içeriği bastırmak amacıyla başka bir anlatımın içeriğini gözden geçirmeye yönelik bir temsilcinin katkısını içeren, ancak niteliğini ve genel içeriğini büyük ölçüde değiştirmeden bırakan bir anlatımla ilişkilendirir. @tr
definition: Correla un agente a un'espressione che comprende il contributo da parte di un agente nella revisione del contenuto di un'altra espressione allo scopo di eliminare contenuto ritenuto opinabile per ragioni morali, politiche, militari o di altra natura, ma lasciando sostanzialmente immutati la natura e il contenuto generale. @it
definition: Hozzákapcsol egy ágenst egy kifejezési formához, amely magában foglalja egy ágens közreműködését egy másik kifejezési forma tartalmának a felülvizsgálatában, morális, politikai, katonai vagy egyéb alapon kifogásolható tartalom kiküszöbölése céljából, ugyanakkor a jellegzetességeket és általánosságban a tartalmat lényegében változatlanul hagyja. @hu
definition: Liittää toimijan ekspressioon, jonka tekemiseen toimija osallistuu tarkastamalla toisen ekspression sisältöä kiistanalaisen sisällön salaamiseksi moraalisin, poliittisin, sotilaallisin tai muin perustein, mutta jättäen alkuperäisen teoksen luonteen ja yleisen sisällön olennaisilta osiltaan muuttumattomaksi.
definition: Met un agent en relation avec une expression qui intègre une contribution de la part d’un agent consistant à réviser le contenu d’une autre expression dans le but de supprimer le contenu jugé inadmissible pour des motifs moraux, politiques, militaires ou autres tout en conservant la nature et le contenu sensiblement inchangés. @fr
definition: Relaciona un agent amb una expressió que inclou una contribució d’un agent revisant el contingut d’una altra expressió amb el propòsit de suprimir el contingut considerat objectable per motius ètics, polítics, militars o altres motius, però deixant la natura i el contingut general sense canvis substancials. @ca
definition: Relateert een actor aan een expressie die omvat een bijdrage door een actor door het herzien van content van een andere expressie met de bedoeling content die gezien wordt als bezwaarlijk op morele, politieke, militaire of andere gronden te onderdrukken, maar de aard en algemene content grotendeels intact te laten. @nl

valokuva (ekspressio)
has element type: 2
instruction number: 18.5
see also: teoksen valokuvaaja (toimija) teoksessa
toolkit definition: An expression that includes a contribution of providing supplementary photographic content. (Deprecated) @en
toolkit definition: Egy mű kifejezési formája, amely illusztráló közreműködést testesít meg azzal, hogy egy eredeti műhöz kiegészítő fényképészeti tartalmat ad hozzá. @hu
toolkit definition: Eine Expression eines Werks, bei der ein Akteur einem Originalwerk zusätzliche fotografische Inhalte liefert. @de
toolkit definition: Et uttrykk av et verk som omfatter et illustrerende bidrag i form av å tilføre supplerende fotografisk innhold til et originalverk. @no
toolkit definition: Expression d’une œuvre qui intègre une contribution d’illustration consistant à fournir du contenu photographique supplémentaire à une œuvre originale. @fr
toolkit definition: Expressió d’una obra que incorpora una contribució il·lustrativa que proporciona un contingut fotogràfic suplementari a una obra original. @ca
toolkit definition: Teoksen ekspressio, joka sisältää alkuperäistä teosta täydentävää valokuvasisältöä.
toolkit definition: Udtryk af et værk, der inkorporerer et illustrationsbidrag ved at sørge for supplerende fotografisk indhold til det oprindelige værk. @da
toolkit definition: Μια έκφραση ενός έργου που ενσωματώνει την παροχή συμπληρωματικού φωτογραφικού περιεχομένου στο πρωτότυπο έργο. @el
toolkit label: Fotograf (Expression) von @de
toolkit label: fotograf (udtryk) til @da
toolkit label: fotograf (uttrykk) av @no
toolkit label: fotògraf (expressió) de @ca
toolkit label: fényképésze (kifejezési forma) @hu
toolkit label: photographe (expression) de @fr
toolkit label: photographer of expression of (Deprecated) @en
toolkit label: valokuva (ekspressio)
toolkit label: φωτογράφος (έκφραση) του @el
has subproperty: P50272
lexical alias: photographerOfExpressionOf.en
status: Deprecated
type: Property
domain: C10002
label: er fotograf (udtryk) til @da
label: est un photographe (expression) de @fr
label: fényképésze (kifejezési forma) @hu
label: is photographer of expression of (Deprecated) @en
label: ist Fotograf (Expression) von @de
label: és fotògraf (expressió) de @ca
label: είναι φωτογράφος (έκφραση) του @el
sub property of: is contributor to aggregated content of (Deprecated)
definition: Egy illusztrátort, aki hozzájárul egy mű kifejezési formájához azzal, hogy egy eredeti műhöz kiegészítő fotográfiai tartalmat szolgáltat, hozzákapcsol egy kifejezési formához. @hu
definition: Liittää kuvittajan teoksen ekspressioon, joka sisältää alkuperäistä teosta täydentävää valokuvasisältöä.
definition: Met un illustrateur qui contribue à une expression d’une œuvre en fournissant du contenu photographique supplémentaire à une œuvre originale en relation avec une expression. @fr
definition: Relaciona un il·lustrador, que contribueix a una expressió d’una obra proporcionant un contingut fotogràfic suplementari a una obra original, amb una expressió. @ca
definition: Relaterer en illustrator, der har bidraget til et udtryk af et værk ved at sørge for supplerende fotografisk indhold til det oprindelige værk til et udtryk. @da
definition: Relates an agent to an expression that includes a contribution of providing supplementary photographic content. (Deprecated) @en
definition: Setzt einen Illustrator, der an einer Expression eines Werks mitwirkt, indem er einem Originalwerk zusätzliche fotografische Inhalte liefert, mit einer Expression in Beziehung. @de
definition: Συνδέει έναν εικονογράφο, που συνεισφέρει σε μια έκφραση ενός έργου παρέχοντας συμπληρωματικό φωτογραφικό περιεχόμενο σε ένα πρωτότυπο έργο, με μια έκφραση. @el

ekspression entisöijä (toimija) ekspressiossa
has element type: 2
instruction number: 18.5
toolkit definition: An expression that includes a contribution by an agent of restoring or combining expressions, which may be damaged or fragmentary, to create a new expression. @en
toolkit definition: Een expressie die omvat een bijdrage door een actor door herstellen of combineren van expressies, die beschadigd of fragmentarisch kunnen zijn, met de bedoeling een nieuwe expressie te vormen. @nl
toolkit definition: Egy kifejezési forma, amely magában foglalja egy ágens közreműködését sérült vagy töredékes kifejezési formák helyreállításában vagy kombinálásában, amivel új kifejezési formát hoz létre. @hu
toolkit definition: Eine Expression, zu der ein Akteur beiträgt, indem er durch die Wiederherstellung oder Zusammenführung früherer Expressionen, die beschädigt oder unvollständig sein können, eine neue Expression erstellt. @de
toolkit definition: Ekspressio, jonka tekemiseen toimija osallistuu restauroimalla tai yhdistelemällä aikaisempia ekspressioita, jotka voivat olla vaurioituneita tai fragmentaarisia, uuden ekspression luomiseksi.
toolkit definition: Espressione che comprende il contributo da parte di un agente per restaurare o rimettere insieme espressioni che possono essere danneggiate o frammentate per creare una nuova espressione. @it
toolkit definition: Et uttrykk som inkluderer et bidrag fra en agent i form av å konservere eller kombinere uttrykk, som kan være skadede eller fragmentariske, for å skape et nytt uttrykk. @no
toolkit definition: Expression qui intègre une contribution de la part d’un agent consistant à restaurer ou à combiner des expressions, qui peuvent être endommagées ou fragmentaires, pour créer une nouvelle expression. @fr
toolkit definition: Expressió que inclou una contribució d’un agent restaurant o combinant expressions, que poden estar danyades o fragmentades, per crear una expressió nova. @ca
toolkit definition: Izteiksme, kas ietver aģenta ieguldījumu, atjaunojot vai apvienojot izteiksmes, kuras bijušas bojātas vai fragmentāras, lai izveidotu jaunu izteiksmi. @lv
toolkit definition: Udtryk, som omfatter en agents bidrag ved at restaurere eller kombinere tidligere udtryk, som kan være beskadigede eller fragmenterede, til at skabe et nyt udtryk. @da
toolkit definition: Väljendus, millesse tegija on andnud panuse, taastades või kombineerides varasemaid väljendusi, mis võivad olla kahjustatud või fragmentaarsed, uue väljenduse loomiseks. @et
toolkit definition: Yeni bir anlatım oluşturmak için, tahrip olmuş veya parçalı olabilen anlatımları restore etme veya birleştirmeyle görevli bir temsilcinin katkısını içeren bir anlatım. @tr
toolkit definition: Μια έκφραση ενός έργου που ενσωματώνει τη συνεισφορά της αποκατάστασης ή/και συνδυασμού προηγούμενων εκφράσεων, οι οποίες μπορεί να είναι κατεστραμμένες ή αποσπασματικές, για τη δημιουργία μιας νέας έκφρασης. @el
toolkit definition: تعبيرة تتضمن إسهام وكيل في ترميم، أو جمع التعبيرات التالفة أو المجزأة لإنشاء تعبيرة جديدة. @ar
toolkit definition: 包括修复或组合可能被损毁或不完整的内容表达以创建一个新的内容表达的一个行为者的贡献的一种内容表达 @zh-hans
toolkit label: Akteur als Restauratorin/Restaurator einer Expression von @de
toolkit label: agent restaurador d’una expressió de @ca
toolkit label: agent restaurateur d’une expression de @fr
toolkit label: agent, som er konservator af udtryk af @da
toolkit label: anlatımın restorasyon uzmanı temsilcisi @tr
toolkit label: ekspression entisöijä (toimija) ekspressiossa
toolkit label: ir restaurators (aģents) izteiksmei @lv
toolkit label: konservator for uttrykk for (agent) @no
toolkit label: rekonstrueerija (tegija) väljenduses @et
toolkit label: restaurator-actor van expressie van @nl
toolkit label: restauratore agente di espressione di @it
toolkit label: restaurátor ágense a következő kifejezési formának: @hu
toolkit label: restorationist agent of expression of @en
toolkit label: συντηρητής φορέας της έκφρασης του @el
toolkit label: وكيل أخصائي ترميم تعبيرة @ar
toolkit label: ……的内容表达的修复者行为者 @zh-hans
has subproperty: ekspression entisöijä (henkilö) ekspressiossa
has subproperty: ekspression entisöijä (yhteistoimija) ekspressiossa
has subproperty: P50273
lexical alias: restorationistAgentOfExpressionOf.en
status: Published
type: Property
domain: C10002
label: anlatımının restorasyon uzmanı temsilcisidir @tr
label: er agent, som er konservator af udtryk af @da
label: er konservator for uttrykk for (agent) @no
label: est un agent restaurateur d’une expression de @fr
label: ir restaurators (aģents) izteiksmei @lv
label: is restaurator-actor van expressie van @nl
label: is restorationist agent of expression of @en
label: ist Akteur als Restauratorin/Restaurator einer Expression von @de
label: rekonstrueerija (tegija) väljenduses @et
label: restaurátor ágense a következő kifejezési formának: @hu
label: è restauratore agente di un'espressione agente di @it
label: és agent restaurador d’una expressió de @ca
label: είναι συντηρητής φορέας της έκφρασης του @el
label: هو وكيل أخصائي ترميم تعبيرة @ar
label: 是……的内容表达的修复者行为者 @zh-hans
sub property of: tarkastaja (toimija) ekspressiossa
alternative label: (anlatım) restorasyon uzmanı @tr
alternative label: Restaurator (Expression) von @de
alternative label: entisöijänä ekspressiossa
alternative label: konservator (udtryk) af @da
alternative label: konservator for uttrykk for @no
alternative label: rekonstrueerija väljenduses @et
alternative label: restauracionista (expresión) de @es
alternative label: restaurador (expressió) de @ca
alternative label: restaurateur (expression) de @fr
alternative label: restauratore di espressione di @it
alternative label: restaurátora a következőnek (kifejezési forma): @hu
alternative label: restorationist (expression) of @en
alternative label: συντηρητής της έκφρασης του @el
alternative label: أخصائي ترميم تعبيرة @ar
alternative label: ……的修复者（内容表达） @zh-hans
definition: Bir temsilciyi, yeni bir anlatım oluşturmak için zarar görmüş veya parçalanmış olabilecek anlatımları restore eden veya birleştiren bir temsilcinin katkısını içeren bir anlatımla ilişkilendirir. @tr
definition: Correla un agente a un'espressione che comprende il contributo da parte di un agente per restaurare o rimettere insieme espressioni che possono essere danneggiate o frammentate per creare una nuova espressione. @it
definition: Hozzákapcsol egy ágenst egy kifejezési formához, amely magában foglalja egy személy közreműködését sérült vagy töredékes kifejezési formák helyreállításában vagy kombinálásában, amivel új kifejezési formát hoz létre. @hu
definition: Liittää toimijan ekspressioon, jonka tekemiseen toimija osallistuu restauroimalla tai yhdistelemällä aikaisempia ekspressioita, jotka voivat olla vaurioituneita tai fragmentaarisia, uuden ekspression luomiseksi.
definition: Met un agent en relation avec une expression qui intègre une contribution de la part d’un agent consistant à restaurer ou à combiner des expressions, qui peuvent être endommagées ou fragmentaires, pour créer une nouvelle expression. @fr
definition: Relaciona un agent amb una expressió que inclou una contribució d’un agent restaurant o combinant expressions, que poden estar danyades o fragmentades, per crear una expressió nova. @ca
definition: Relateert een actor aan een expressie die omvat een bijdrage door een actor door herstellen of combineren van expressies, die beschadigd of fragmentarisch kunnen zijn, met de bedoeling een nieuwe expressie te vormen. @nl

kollega
has element type: 2
instruction number: 29.5
toolkit definition: A person who is a fellow member of a profession, staff, or academic faculty. @en
toolkit definition: Bir mesleğin, kadronun veya akademik fakültenin üyesi olan bir kişi. @tr
toolkit definition: Collega di una professione, gruppo di lavoro o facoltà accademica. @it
toolkit definition: Een persoon die is een medelid van een beroep, staf of academische faculteit. @nl
toolkit definition: Egy személy, aki ugyanannak a szakmának, személyzetnek vagy felsőoktatási karnak a tagja. @hu
toolkit definition: Eine Person, die mit anderen zusammen im gleichen Beruf, im gleichen Betrieb, in der gleichen Einrichtung oder Organisation und so weiter tätig ist. @de
toolkit definition: En annen person som er medlem av samme yrkesgruppe eller har samme arbeidsgiver. @no
toolkit definition: Henkilö, joka on saman ammattikunnan, henkilöstön tai tieteenalan jäsen.
toolkit definition: Isik, kellel on sama elukutse, kes kuulub sama asutuse töötajaskonda või kes tegeleb sama teadusalaga. @et
toolkit definition: Person, som er medlem af samme profession, personale eller akademisk fakultet. @da
toolkit definition: Persona que és un company de professió, del personal o del professorat acadèmic. @ca
toolkit definition: Personne qui appartient à la même profession, au même corps d’employés ou au même corps professoral qu’une autre personne. @fr
toolkit definition: Tās pašas profesijas, darba vietas, akadēmiskās vides pārstāvis @lv
toolkit definition: Ένας συνάδελφος από τον επαγγελματικό χώρο, το προσωπικό ή το ακαδημαϊκό διδακτικό προσωπικό. . @el
toolkit definition: زميل عضو في مهنة أو في هيئة تدريس أو في كلية أكاديمية. @ar
toolkit definition: 作为从业、行政或教学的同事的一个个人 @zh-hans
toolkit label: Kollegin/Kollege @de
toolkit label: colleague @en
toolkit label: collega @it
toolkit label: collègue @fr
toolkit label: col·lega @ca
toolkit label: kolleeg @et
toolkit label: kollega @da
toolkit label: kolléga: @hu
toolkit label: kolēģis @lv
toolkit label: meslektaş @tr
toolkit label: συνάδελφος @el
toolkit label: زميل @ar
toolkit label: 同事 @zh-hans
has subproperty: assistentti
has subproperty: assistentti henkilölle
has subproperty: työtoveri
has subproperty: kumppani
has subproperty: P50274
lexical alias: colleague.en
status: Published
type: Property
domain: C10004
label: a pour collègue @fr
label: ha come collega @it
label: har kollega @da
label: has colleague @en
label: hat Kollegin/Kollegen @de
label: heeft collega @nl
label: kolleeg @et
label: kollégája a következő: @hu
label: kolēģis @lv
label: meslektaş ile ilişkilidir @tr
label: té com a col·lega @ca
label: έχει συνάδελφο @el
label: له زميل @ar
label: 有同事 @zh-hans
sub property of: henkilöön liittyvä henkilö
definition: Bir kişiyi, bir mesleğin, kadronun veya akademik fakültenin üyesi olan bir kişiyle ilişkilendirir. @tr
definition: Correla una persona a un collega di una professione, gruppo di lavoro o facoltà accademica. @it
definition: Hozzákapcsol egy személyt egy személyhez, aki ugyanannak a szakmának, személyzetnek vagy felsőoktatási karnak a tagja. @hu
definition: Liittää henkilön henkilöön, joka on saman ammattikunnan, henkilöstön tai tieteenalan jäsen.
definition: Met une personne en relation avec une personne qui appartient à la même profession, au même corps d’employés ou au même corps professoral qu’une autre personne. @fr
definition: Relaciona una persona amb una persona que és un company de professió, del personal o del professorat acadèmic. @ca
definition: Relateert een persoon aan een persoon die is een medelid van een beroep, staf of academische faculteit. @nl
definition: Relaterer en person til en annen person som er medlem av samme yrkesgruppe eller har samme arbeidsgiver. @no
definition: Relaterer en person til en person, der er medlem af samme profession, personale eller akademisk fakultet. @da
definition: Relates a person to a person who is a fellow member of a profession, staff, or academic faculty. @en
definition: Sasaista personu ar personu, kurš ir tās pašas profesijas, darba vietas, akadēmiskās vides pārstāvis. @lv
definition: Seostab isiku isikuga, kellel on sama elukutse, kes kuulub sama asutuse töötajaskonda või kes tegeleb sama teadusalaga. @et
definition: Setzt eine Person in Beziehung zu einer Person, die mit anderen zusammen im gleichen Beruf, im gleichen Betrieb, in der gleichen Einrichtung oder Organisation und so weiter tätig ist. @de
definition: Συνδέει ένα φυσικό πρόσωπο με έναν συνάδελφο από τον επαγγελματικό χώρο, το προσωπικό ή το ακαδημαϊκό διδακτικό προσωπικό. @el
definition: يربط شخصا بزميل عضو في مهنة أو في هيئة تدريس أو في كلية أكاديمية. @ar
definition: 将一个个人与作为从业、行政或教学的同事的一个个人关联起来 @zh-hans

assistentti
has element type: 2
instruction number: 29.5
toolkit definition: A person who is a colleague who helps another person. @en
toolkit definition: Başka bir kişiye yardım eden bir meslektaş olan kişi. @tr
toolkit definition: Collega che aiuta un'altar persona. @it
toolkit definition: Een persoon die is een collega die een andere persoon helpt. @nl
toolkit definition: Egy kolléga személy, aki egy másik személynek segít. @hu
toolkit definition: Eine Kollegin/Ein Kollege (Person), die/der eine andere Person unterstützt. @de
toolkit definition: En kollega som hjelper en annen person. @no
toolkit definition: Henkilö, joka on kollega, joka avustaa toista henkilöä.
toolkit definition: Kolleeg, kes abistab teist isikut. @et
toolkit definition: Kolēģis, kurš palīdz citai personai. @lv
toolkit definition: Person, der er en kollega, som hjælper en anden person. @da
toolkit definition: Persona que és un col·lega que ajuda una altra persona. @ca
toolkit definition: Personne qui est un collègue aidant une autre personne. @fr
toolkit definition: Ένας συνάδελφος που παρέχει βοήθεια σε ένα άλλο φυσικό πρόσωπο. @el
toolkit definition: زميل يساعد شخصًا آخر. @ar
toolkit definition: 作为帮助另一个个人的同事的一个个人 @zh-hans
toolkit label: Assistentin/Assistent @de
toolkit label: adjoint @fr
toolkit label: ajudant @ca
toolkit label: asistan @tr
toolkit label: asistents @lv
toolkit label: assistant @en
toolkit label: assistent @da
toolkit label: assistente @it
toolkit label: assistentti
toolkit label: asszisztens: @hu
toolkit label: βοηθός @el
toolkit label: مساعد @ar
toolkit label: 助理 @zh-hans
has subproperty: P50275
lexical alias: assistant.en
status: Published
type: Property
domain: C10004
label: a pour adjoint @fr
label: asistan ile ilişkilidir @tr
label: asistents @lv
label: assistent @et
label: asszisztense a következő: @hu
label: ha come assitente @it
label: har assistent @da
label: has assistant @en
label: hat Assistentin/Assistenten @de
label: heeft assistent @nl
label: té com a ajudant @ca
label: έχει βοηθό @el
label: له مساعد @ar
label: 有助理 @zh-hans
sub property of: kollega
definition: Bir kişiyi, başka bir kişiye yardım eden bir meslektaş olan bir kişiyle ilişkilendirir. @tr
definition: Correla una persona a un collega che aiuta un'altra persona. @it
definition: Hozzákapcsol egy személyt egy kolléga személyhez, aki egy másik személynek segít. @hu
definition: Liittää henkilön henkilöön, joka on kollega, joka avustaa toista henkilöä.
definition: Met une personne en relation avec une personne qui est un collègue aidant une autre personne. @fr
definition: Relaciona una persona amb una persona que és un col·lega que ajuda una altra persona. @ca
definition: Relateert een persoon aan een persoon die is een collega die een andere persoon helpt. @nl
definition: Relaterer en person til en kollega som hjelper en annen person. @no
definition: Relaterer en person til er person, der er en kollega, som hjælper en anden person. @da
definition: Relates a person to a person who is a colleague who helps another person. @en
definition: Sasaista personu ar personu, kurš ir kolēģis, kurš palīdz citai personai. @lv
definition: Seostab isiku kolleegiga, kes abistab teist isikut. @et
definition: Setzt eine Person in Beziehung zu einer Kollegin/einem Kollegen (Person), die/der eine andere Person unterstützt. @de
definition: Συνδέει ένα φυσικό πρόσωπο με έναν συνάδελφο, ο οποίος παρέχει βοήθεια σε ένα άλλο φυσικό πρόσωπο. @el
definition: يربط شخصا بزميل يساعد شخصًا آخر. @ar
definition: 将一个个人与作为帮助另一个个人的同事的一个个人关联起来。 @zh-hans

assistentti henkilölle
has element type: 2
instruction number: 29.5
toolkit definition: A person who is a colleague who is helped by another person. @en
toolkit definition: Başka bir kişinin yardım ettiği bir meslektaş olan kişi. @tr
toolkit definition: Collega che è aiutatato da un'altra persona. @it
toolkit definition: Een persoon die is een collega die geholpen wordt door een andere persoon. @nl
toolkit definition: Egy kolléga személy, akit egy másik személy segít. @hu
toolkit definition: Eine Kollegin/Ein Kollege (Person), die/der von einer anderen Person unterstützt wird. @de
toolkit definition: En kollega som får hjelp av en annen person. @no
toolkit definition: Henkilö, joka on kollega, jota toinen henkilö avustaa.
toolkit definition: Kolleeg, keda abistab teine isik. @et
toolkit definition: Kolēģis, kuram palīdz cita persona. @lv
toolkit definition: Person, der er en kollega, som får hjælp av en anden person. @da
toolkit definition: Persona que és un col·lega que és ajudat per una altra persona. @ca
toolkit definition: Personne qui est un collègue recevant l’aide d’une autre personne. @fr
toolkit definition: Ένας συνάδελφος που δέχεται βοήθεια από ένα άλλο φυσικό πρόσωπο. @el
toolkit definition: زميل تلقى مساعدة من شخص آخر. @ar
toolkit definition: 作为另一个个人帮助的同事的一个个人 @zh-hans
toolkit label: Assistentin/Assistent von @de
toolkit label: adjoint de @fr
toolkit label: ajudant de @ca
toolkit label: asistan @tr
toolkit label: asistējis @lv
toolkit label: assistant to @en
toolkit label: assistent for @da
toolkit label: assistent kolleegile @et
toolkit label: assistent til @no
toolkit label: assistent van @nl
toolkit label: assistente di @it
toolkit label: assistentti henkilölle
toolkit label: asszisztense: @hu
toolkit label: βοηθός σε @el
toolkit label: مساعد لـ @ar
toolkit label: ……的助理 @zh-hans
has subproperty: P50276
lexical alias: assistantTo.en
status: Published
type: Property
domain: C10004
label: asistanıdır @tr
label: assistent kolleegile @et
label: asszisztense a következőnek: @hu
label: er assistent for @da
label: er assistent til @no
label: est un adjoint de @fr
label: ir asistējis @lv
label: is assistant to @en
label: is assistent van @nl
label: ist Assistentin/Assistent von @de
label: è assistente di @it
label: és ajudant de @ca
label: είναι βοηθός σε @el
label: هو مساعد لـ @ar
label: 是……的助理 @zh-hans
sub property of: kollega
definition: Bir kişiyi, başka bir kişinin yardım ettiği bir meslektaş olan bir kişiyle ilişkilendirir. @tr
definition: Correla una persona a un collega che è aiutatato da un'altra persona. @it
definition: Hozzákapcsol egy személyt egy kolléga személyhez, akit egy másik személy segít. @hu
definition: Liittää henkilön henkilöön, joka on kollega, jota toinen henkilö avustaa.
definition: Met une personne en relation avec une personne qui est un collègue recevant l’aide d’une autre personne. @fr
definition: Relaciona una persona amb una persona que és un col·lega que és ajudat per una altra persona. @ca
definition: Relateert een persoon aan een persoon die is een collega die geholpen wordt door een andere persoon. @nl
definition: Relaterer en person til en kollega som får hjelp av en annen person. @no
definition: Relaterer en person til en person, der er en kollega, som ´får hjælp af en anden person. @da
definition: Relates a person to a person who is a colleague who is helped by another person. @en
definition: Sasaista personu ar personu, kurš ir kolēģis, kuram palīdz cita persona. @lv
definition: Seostab isiku kolleegiga, keda abistab teine isik. @et
definition: Setzt eine Person in Beziehung zu einer Kollegin/einem Kollegen (Person), die/der von einer anderen Person unterstützt wird. @de
definition: Συνδέει ένα φυσικό πρόσωπο με έναν συνάδελφο, ο οποίος δέχεται βοήθεια από ένα άλλο φυσικό πρόσωπο. @el
definition: يربط شخصا بزميل تلقى مساعدة من شخص آخر. @ar
definition: 将一个个人与作为另一个个人帮助的同事的一个个人关联起来。 @zh-hans

työtoveri
has element type: 2
instruction number: 29.5
toolkit definition: A person who is a colleague who works with or shares a task with another person. @en
toolkit definition: Başka bir kişiyle birlikte çalışan veya bir görevi paylaşan bir meslektaş olan kişi. @tr
toolkit definition: Collega che lavora con o condivide un compito con un'altra persona. @it
toolkit definition: Een persoon die is een collega die samenwerkt met of een taak deelt met een andere persoon. @nl
toolkit definition: Egy kolléga személy, aki egy másik személlyel együtt dolgozik vagy egy feladatot oszt meg vele. @hu
toolkit definition: Eine Kollegin/Ein Kollege (Person), die/der mit einer anderen Person zusammenarbeitet oder mit ihr eine Aufgabe teilt. @de
toolkit definition: En kollega som samarbeider eller deler en oppgave med en annen person. @no
toolkit definition: Henkilö, joka on kollega, joka työskentelee tai jakaa tehtävän toisen henkilön kanssa.
toolkit definition: Kolleeg, kes töötab koos teise isikuga või jagab temaga tööülesannet. @et
toolkit definition: Kolēģis, kurš strādā vai piedalās uzdevuma izpildē kopā ar citu personu. @lv
toolkit definition: Person, der er en kollega, som arbejder sammen med, eller deler en opgave med, en anden person. @da
toolkit definition: Persona que és un col·lega que treballa en una tasca o la comparteix amb una altra persona. @ca
toolkit definition: Personne qui est un collègue travaillant ou partageant une tâche avec une autre personne. @fr
toolkit definition: Ένας συνάδελφος που συνεργάζεται ή μοιράζεται μια εργασία με ένα άλλο φυσικό πρόσωπο. @el
toolkit definition: زميل يعمل مع شخص آخر أو يشاركه مهمة. @ar
toolkit definition: 作为同事与另一个个人一起工作或分担一个任务的一个个人 @zh-hans
toolkit label: Arbeitskollegin/Arbeitskollege @de
toolkit label: arbejdskollega @da
toolkit label: collaboratore @it
toolkit label: collègue de travail @fr
toolkit label: col·laborador @ca
toolkit label: coworker @en
toolkit label: iş arkadaşı @tr
toolkit label: kaastöötaja @et
toolkit label: līdzstrādnieks @lv
toolkit label: medarbeider @no
toolkit label: munkatárs: @hu
toolkit label: naaste collega @nl
toolkit label: työtoveri
toolkit label: συνεργάτης @el
toolkit label: له زميل عمل @ar
toolkit label: 共事者 @zh-hans
has subproperty: P50277
lexical alias: coworker.en
status: Published
type: Property
domain: C10004
label: a pour collègue de travail @fr
label: ha come collaboratore agente di @it
label: har arbejdskollega @da
label: har medarbeider @no
label: has coworker @en
label: hat Arbeitskollegin/Arbeitskollegen @de
label: heeft naaste collega @nl
label: iş arkadaşı ile ilişkilidir @tr
label: kaastöötaja @et
label: līdzstrādnieks @lv
label: munkatársa a következő: @hu
label: té com a col·laborador @ca
label: έχει συνεργάτη @el
label: له زميل عمل @ar
label: 有共事者 @zh-hans
sub property of: kollega
alternative label: -
alternative label: co-worker @en
alternative label: collaboratore @it
alternative label: compañero de trabajo @es
alternative label: iş arkadaşı @tr
alternative label: medarbejder @da
alternative label: munkatárs: @hu
alternative label: συνεργάτης @el
alternative label: زميل عمل @ar
alternative label: 共事者 @zh-hans
definition: Bir kişiyi, başka bir kişiyle birlikte çalışan veya bir görevi paylaşan bir meslektaş olan bir kişiyle ilişkilendirir. @tr
definition: Correla una persona a un collega che lavora con o condivide un compito con un'altra persona. @it
definition: Hozzákapcsol egy személyt egy kolléga személyhez, aki egy másik személlyel együtt dolgozik vagy egy feladatot oszt meg vele. @hu
definition: Liittää henkilön henkilöön, joka on kollega, joka työskentelee tai jakaa tehtävän toisen henkilön kanssa.
definition: Met une personne en relation avec une personne qui est un collègue travaillant ou partageant une tâche avec une autre personne. @fr
definition: Relaciona una persona amb una persona que és un col·lega que treballa en una tasca o la comparteix amb una altra persona. @ca
definition: Relateert een persoon aan een persoon die is een collega die samenwerkt met of een taak deelt met een andere persoon. @nl
definition: Relaterer en person til en kollega som samarbeider eller deler en oppgave med en annen person. @no
definition: Relaterer en person til en person, der er en kollega, som arbejder sammen med, eller deler en opgave med, en anden person. @da
definition: Relates a person to a person who is a colleague who works with or shares a task with another person. @en
definition: Sasaista personu ar personu, kurš ir kolēģis, kurš strādā vai piedalās uzdevuma izpildē kopā ar citu personu. @lv
definition: Seostab isiku kolleegiga, kes töötab koos teise isikuga või jagab temaga tööülesannet. @et
definition: Setzt eine Person in Beziehung zu einer Kollegin/einem Kollegen (Person), die/der mit einer anderen Person zusammenarbeitet oder mit ihr eine Aufgabe teilt. @de
definition: Συνδέει ένα φυσικό πρόσωπο με έναν συνάδελφο που συνεργάζεται ή μοιράζεται μια εργασία με ένα άλλο φυσικό πρόσωπο. @el

kumppani
has element type: 2
instruction number: 29.5
toolkit definition: A person who is a colleague working with another person in an activity of common interest, most often, a business partnership. @en
toolkit definition: Collega che lavora con un'altra persona in un'attività di interesse comune, molto spesso una collaborazione commerciale. @it
toolkit definition: Een persoon die is een collega die met een ander persoon werkt in een activiteit van gemeenschappelijke interesse, meestal een zakelijke samenwerking. @nl
toolkit definition: Egy kolléga személy, aki egy másik személlyel dolgozik egy közös érdekű tevékenységben, leggyakrabban üzleti partnerségben. @hu
toolkit definition: Eine Kollegin/Ein Kollege (Person), die/der mit einer anderen Person in einer Tätigkeit von gemeinsamem Interesse, meist in einer Geschäftspartnerschaft, zusammenarbeitet. @de
toolkit definition: En kollega som samarbeider med en annen person om en aktivitet av felles interesse, som oftest et forretningsfellesskap. @no
toolkit definition: Henkilö, joka on kollega, joka toimii toisen henkilön kanssa yhteiseksi hyväksi, useimmiten yrityskumppanina.
toolkit definition: Kolleeg, kes tegutseb koos teise isikuga ühistes huvides, kõige sagedamini äripartnerluses. @et
toolkit definition: Kolēģis, kurš strādā ar citu personu kopējas intereses darbībā, visbiežāk, uzņēmējdarbības partnerība. @lv
toolkit definition: Ortak ilgi alanına giren bir faaliyette başka bir kişiyle çalışan bir meslektaş olan kişi, çoğunlukla bir iş ortaklığı @tr
toolkit definition: Person, der er en kollega, som arbejder sammen med en anden person i en aktivitet af fælles interesse, i de fleste tilfølde, et forretningspartnerskab. @da
toolkit definition: Persona que és un col·lega que treballa amb una altra persona en una activitat d’interès comú, molt sovint una col·laboració empresarial. @ca
toolkit definition: Personne qui est un collègue travaillant avec une autre personne dans une activité d’intérêt commun, le plus souvent un partenariat d’affaires. @fr
toolkit definition: Ένας συνάδελφος, ο οποίος συνεργάζεται με ένα άλλο φυσικό πρόσωπο σε δράσεις κοινού ενδιαφέροντος, πιο συχνά σε μια επιχειρηματική συνεργασία. @el
toolkit definition: زميل يعمل مع شخص آخر في نشاط محل اهتمام مشترك، غالبا شراكة تجارية. @ar
toolkit definition: 作为同事与另一个个人在共同兴趣范围内一起工作（最常见的是商业合伙人）的一个个人 @zh-hans
toolkit label: Ortak @tr
toolkit label: Partnerin/Partner @de
toolkit label: bedrijfspartner @nl
toolkit label: collega @it
toolkit label: kumppani
toolkit label: partenaire @fr
toolkit label: partner @da
toolkit label: partner: @hu
toolkit label: partneris @lv
toolkit label: soci @ca
toolkit label: εταίρος @el
toolkit label: شريك @ar
toolkit label: 合伙人 @zh-hans
has subproperty: P50278
lexical alias: partner.en
status: Published
type: Property
domain: C10004
label: a pour partenaire @fr
label: ha come partner @it
label: har partner @da
label: has partner @en
label: hat Partnerin/Partner @de
label: heeft bedrijfspartner @nl
label: partner @et
label: partner ile ilişkilidir @tr
label: partnere a következő: @hu
label: partneris @lv
label: té com a soci @ca
label: έχει εταίρο @el
label: له شريك @ar
label: 有合伙人 @zh-hans
sub property of: kollega
definition: Bir kişiyi, başka bir kişiyle ortak çıkarlara yönelik bir faaliyette, çoğunlukla bir iş ortaklığında çalışan bir meslektaş olan bir kişi ile ilişkilendirir. @tr
definition: Correla una persona a un collega che lavora con un'altra persona in un'attività di interesse comune, molto spesso una collaborazione commerciale. @it
definition: Hozzákapcsol egy személyt egy kolléga személyhez, aki egy másik személlyel dolgozik egy közös érdekű tevékenységben, leggyakrabban üzleti partnerségben. @hu
definition: Liittää henkilön henkilöön, joka on kollega, joka toimii toisen henkilön kanssa yhteiseksi hyväksi, useimmiten yrityskumppanina.
definition: Met une personne en relation avec une personne qui est un collègue travaillant avec une autre personne dans une activité d’intérêt commun, le plus souvent un partenariat d’affaires. @fr
definition: Relaciona una persona amb una persona que és un col·lega que treballa amb una altra persona en una activitat d’interès comú, molt sovint una col·laboració empresarial. @ca
definition: Relateert een persoon aan een persoon die is een collega die met een ander persoon werkt in een activiteit van gemeenschappelijke interesse, meestal een zakelijke samenwerking. @nl
definition: Relaterer en person til en kollega som samarbeider med en annen person om en aktivitet av felles interesse, som oftest et forretningsfellesskap. @no
definition: Relaterer en person til en person, der er en kollega, som arbejder sammen med en anden person i en aktivitet af fælles interesse, i de fleste tilfølde, et forretningspartnerskab. @da
definition: Relates a person to a person who is a colleague working with another person in an activity of common interest, most often, a business partnership. @en
definition: Sasaista personu ar personu, kurš ir kolēģis, kurš strādā ar citu personu kopējas intereses darbībā, visbiežāk, uzņēmējdarbības partnerība. @lv
definition: Seostab isiku kolleegiga, kes tegutseb koos teise isikuga ühistes huvides, kõige sagedamini äripartnerluses. @et
definition: Setzt eine Person in Beziehung zu einer Kollegin/einem Kollege (Person), die/der mit einer anderen Person in einer Tätigkeit von gemeinsamem Interesse, meist in einer Geschäftspartnerschaft, zusammenarbeitet. @de
definition: Συνδέει ένα φυσικό πρόσωπο με έναν συνάδελφο, ο οποίος συνεργάζεται με ένα άλλο φυσικό πρόσωπο σε δράσεις κοινού ενδιαφέροντος, πιο συχνά σε μια επιχειρηματική συνεργασία. @el
definition: يربط شخصا بشخص هو زميل يعمل مع شخص آخر في نشاط محل اهتمام مشترك، غالبا شراكة تجارية. @ar
definition: 将一个个人与作为同事与另一个个人在共同兴趣范围内一起工作（最常见的是商业合伙人）的一个个人关联起来。 @zh-hans

opiskelutoveri
has element type: 2
instruction number: 29.5
toolkit definition: A person who is an associate of another student who is also formally engaged in learning. @en
toolkit definition: Collega di un altro studente che è anche formalmente impegnato nell'apprendere. @it
toolkit definition: Een persoon die is een geassocieerde van een andere student die ook formeel betrokken is bij leren. @nl
toolkit definition: Egy személy, aki egy másik, a tanulásban szintén formálisan részt vevő tanulónak a társa. @hu
toolkit definition: Eine Studienkollegin/Ein Studienkollege (Person) einer anderen Studentin/eines anderen Studenten, die/der sich ebenfalls offiziell mit Studieren befasst. @de
toolkit definition: En bekjent av en annen student som også er under formell utdanning. @no
toolkit definition: Henkilö, joka on toisen opiskelijan kollega, joka myös virallisesti opiskelee.
toolkit definition: Person, der er en anden students arbejdskammerat, som også er formelt beskæftigt med at studere. @da
toolkit definition: Persona que és un associat d’un altre estudiant que també es dedica formalment a l’aprenentatge. @ca
toolkit definition: Persona, kura vienlaicīgi ar citu studentu studēja mācību iestādē. @lv
toolkit definition: Personne qui est un associé d’un autre élève qui est aussi engagé dans un processus formel d’apprentissage. @fr
toolkit definition: Resmi olarak öğrenmeye katılan başka bir öğrencinin arkadaşı olan bir kişi @tr
toolkit definition: Teine õppur, kes samuti vormiliselt õpib. @et
toolkit definition: Ένας συμφοιτητής κάποιου άλλου φοιτητή που επίσης εμπλέκεται τυπικά στη μάθηση. @el
toolkit definition: زمالة طالب آخر يشارك أيضًا بشكل رسمي في التعلم. @ar
toolkit definition: 作为另一个也是正式参加学习的学生的伙伴的一个个人 @zh-hans
toolkit label: Kommilitonin/Kommilitone @de
toolkit label: compagno di studi @it
toolkit label: compagnon d’études @fr
toolkit label: company d’estudis @ca
toolkit label: fellow student @en
toolkit label: medestudent @nl
toolkit label: medstudent @no
toolkit label: medstuderende @da
toolkit label: okul arkadaşı @tr
toolkit label: opiskelutoveri
toolkit label: studiju biedrs @lv
toolkit label: tanulótárs: @hu
toolkit label: õpingukaaslane @et
toolkit label: συμφοιτητής @el
toolkit label: زميل دراسة @ar
toolkit label: 同学 @zh-hans
has subproperty: P50279
lexical alias: fellowStudent.en
status: Published
type: Property
domain: C10004
label: a pour compagnon d’études @fr
label: ha come studente compagno @it
label: har medstudent @no
label: har medstuderende @da
label: has fellow student @en
label: hat Kommilitonin/Kommilitonen @de
label: heeft medestudent @nl
label: okul arkadaşı ile ilişkilidir @tr
label: studiju biedrs @lv
label: tanulótársa a következő: @hu
label: té com a company d’estudis @ca
label: õpingukaaslane @et
label: έχει συμφοιτητή @el
label: له زميل دراسة @ar
label: 有同学 @zh-hans
sub property of: henkilöön liittyvä henkilö
definition: Bir kişiyi, aynı zamanda resmi olarak öğrenmeyle meşgul olan başka bir öğrencinin arkadaşı olan bir kişi ile ilişkilendirir. @tr
definition: Correla una persona a un collega di un altro studente che è anche formalmente impegnato nell'apprendere. @it
definition: Hozzákapcsol egy személyt egy személyhez, aki egy másik, a tanulásban szintén formálisan részt vevő tanulónak a társa. @hu
definition: Liittää henkilön henkilöön, joka on toisen opiskelijan kollega, joka myös virallisesti opiskelee.
definition: Met une personne en relation avec une personne qui est un associé d’un autre élève qui est aussi engagé dans un processus formel d’apprentissage. @fr
definition: Relaciona una persona amb una persona que és un associat d’un altre estudiant que també es dedica formalment a l’aprenentatge. @ca
definition: Relateert een persoon aan een persoon die is een geassocieerde van een andere student die ook formeel betrokken is bij leren. @nl
definition: Relaterer en person til en bekjent av en annen student som også er under formell utdanning. @no
definition: Relaterer en person til en person, der er en anden students arbejdskammerat, som også er formelt beskæftigt med at studere. @da
definition: Relates a person to a person who is an associate of another student who is also formally engaged in learning. @en
definition: Sasaista personu ar personu, kura vienlaicīgi ar citu studentu studēja mācību iestādē. @lv
definition: Seostab isiku teise õppuriga, kes samuti vormiliselt õpib. @et
definition: Setzt eine Person in Beziehung zu einer Studienkollegin/einem Studienkollegen (Person) einer anderen Studentin/eines anderen Studenten, die/der sich ebenfalls offiziell mit Studieren befasst. @de
definition: Συνδέει ένα φυσικό πρόσωπο με έναν συμφοιτητή κάποιου άλλου φοιτητή που επίσης εμπλέκεται τυπικά στη μάθηση @el
definition: يربط شخصا بزميل طالب آخر ينخرط أيضًا في التعلم بصورة رسمية. @ar
definition: 将一个个人与作为另一个也是正式参加学习的学生的伙伴的一个个人关联起来。 @zh-hans

ystävä
has element type: 2
instruction number: 29.5
toolkit definition: A person who shares a bond of mutual affection or regard with another person. @en
toolkit definition: Başka bir kişiyle karşılıklı sevgi veya saygı bağı paylaşan kişi @tr
toolkit definition: Een persoon die een band van wederzijdse affectie of respect deelt met een andere persoon. @nl
toolkit definition: Egy személy, aki a kölcsönös szeretet kötelékében osztozik vagy így tekint egy másik személyre. @hu
toolkit definition: Eine Person, die eine gegenseitige Zuneigung oder Achtung mit einer anderen Person teilt. @de
toolkit definition: En person som er i et gjensidig vennskapsforhold med en annen person. @no
toolkit definition: Henkilö, jolla on molemminpuolinen kiintymys- tai kunnioitussuhde toiseen henkilöön.
toolkit definition: Isik, kes jagab teise isikuga vastastikust kiindumus- või austussuhet. @et
toolkit definition: Person, som deler et bånd af gensidig hengivenhed eller respekt med en anden person. @da
toolkit definition: Persona che condivide un legame di mutuo affetto con un'altra persona. @it
toolkit definition: Persona que comparteix un vincle d’afecte mutu o de respecte amb una altra persona. @ca
toolkit definition: Persona, kurai ir savstarpējas simpātijas vai cieņa pret citu personu. @lv
toolkit definition: Personne qui partage des liens d’affection ou d’estime mutuelles avec une autre personne. @fr
toolkit definition: Ένα φυσικό πρόσωπο που μοιράζεται έναν δεσμό αμοιβαίας συμπάθειας ή εκτίμησης με ένα άλλο φυσικό πρόσωπο. @el
toolkit definition: شخص تجمعه مودة أو احترام متبادل مع شخص آخر. @ar
toolkit definition: 和另一个个人有共同感情或尊重的一个个人 @zh-hans
toolkit label: Freundin/Freund @de
toolkit label: ami @fr
toolkit label: amic @ca
toolkit label: amico @it
toolkit label: arkadaş @tr
toolkit label: barát: @hu
toolkit label: draugs @lv
toolkit label: friend @en
toolkit label: sõber @et
toolkit label: ven @da
toolkit label: venn @no
toolkit label: vriend @nl
toolkit label: ystävä
toolkit label: φίλος @el
toolkit label: صديق @ar
toolkit label: 朋友 @zh-hans
has subproperty: P50280
lexical alias: friend.en
status: Published
type: Property
domain: C10004
label: a pour ami @fr
label: arkadaş ile ilişkilidir @tr
label: barátja a következő: @hu
label: draugs @lv
label: ha come amico @it
label: har ven @da
label: har venn @no
label: has friend @en
label: hat Freundin/Freund @de
label: heeft vriend @nl
label: sõber @et
label: té com a amic @ca
label: έχει φίλο @el
label: له صديق @ar
label: 有朋友 @zh-hans
sub property of: henkilöön liittyvä henkilö
definition: Bir kişiyi, başka bir kişiyle karşılıklı sevgi ya da saygı bağı paylaşan bir kişi ile ilişkilendirir. @tr
definition: Correla una persona a una persona che condivide un legame di mutuo affetto con un'altra persona. @it
definition: Hozzákapcsol egy személyt egy személyhez, aki a kölcsönös szeretet kötelékében osztozik vagy így tekint egy másik személyre. @hu
definition: Liittää henkilön henkilöön, jolla on molemminpuolinen kiintymys- tai kunnioitussuhde toiseen henkilöön.
definition: Met une personne en relation avec une personne qui partage des liens d’affection ou d’estime mutuelles avec une autre personne. @fr
definition: Relaciona una persona amb una persona que comparteix un vincle d’afecte mutu o de respecte amb una altra persona. @ca
definition: Relateert een persoon aan een persoon die een band van wederzijdse affectie of respect deelt met een andere persoon. @nl
definition: Relaterer en person til en person som er i et gjensidig vennskapsforhold med en annen person. @no
definition: Relaterer en person til en person, som deler et bånd af gensidig hengivenhed eller respekt med en anden person. @da
definition: Relates a person to a person who shares a bond of mutual affection or regard with another person. @en
definition: Sasaista personu ar personu, kurai ir savstarpējas simpātijas vai cieņa pret citu personu. @lv
definition: Seostab isiku isikuga, kes jagab teise isikuga vastastikust kiindumus- või austussuhet. @et
definition: Setzt eine Person in Beziehung zu einer Person, die eine gegenseitige Zuneigung oder Achtung mit einer anderen Person teilt. @de
definition: Συνδέει ένα φυσικό πρόσωπο με ένα φυσικό πρόσωπο που μοιράζεται έναν δεσμό αμοιβαίας συμπάθειας ή εκτίμησης με ένα άλλο φυσικό πρόσωπο. @el
definition: يربط شخصا بشخص تجمعه مودة أو احترام متبادل مع شخص آخر. @ar
definition: 将一个个人与和另一个个人有共同感情或尊重的一个个人关联起来。 @zh-hans

oppilas
has element type: 2
instruction number: 29.5
toolkit definition: A person who receives instruction from another person. @en
toolkit definition: Başka bir kişiden eğitim alan bir kişi @tr
toolkit definition: Een persoon die instructie ontvangt van een andere persoon. @nl
toolkit definition: Egy személy, aki egy másik személytől oktatásban részesül. @hu
toolkit definition: Eine Person, die von einer anderen Person unterrichtet wird. @de
toolkit definition: En person som mottar opplæring fra en annen person. @no
toolkit definition: Henkilö, joka saa opetusta toiselta henkilöltä.
toolkit definition: Isik, kes saab teiselt isikult õpetust. @et
toolkit definition: Person, som modtager undervisning fra en anden person. @da
toolkit definition: Persona che riceve istruzione da un'altra persona. @it
toolkit definition: Persona que rep instrucció d’una altra persona. @ca
toolkit definition: Persona, kura saņem izglītojošus norādījumus no citas personas. @lv
toolkit definition: Personne qui reçoit l’enseignement d’une autre personne. @fr
toolkit definition: Ένα φυσικό πρόσωπο που λαμβάνει οδηγίες από ένα άλλο φυσικό πρόσωπο. @el
toolkit definition: شخص يتلقى تعليما من شخص آخر. @ar
toolkit definition: 从另一个个人接受教学的一个个人 @zh-hans
toolkit label: Studentin/Student @de
toolkit label: audzēknis @lv
toolkit label: estudiant @ca
toolkit label: oppilas
toolkit label: student @da
toolkit label: studente @it
toolkit label: tanuló: @hu
toolkit label: élève @fr
toolkit label: õppur @et
toolkit label: öğreci @tr
toolkit label: φοιτητής @el
toolkit label: طالب @ar
toolkit label: 学生 @zh-hans
has subproperty: P50281
lexical alias: student.en
status: Published
type: Property
domain: C10004
label: a pour élève @fr
label: audzēknis @lv
label: ha come studente @it
label: har student @da
label: has student @en
label: hat Studentin/Student @de
label: heeft student @nl
label: tanulója a következő: @hu
label: té com a estudiant @ca
label: õppur @et
label: öğrenci ile ilişkilidir @tr
label: έχει φοιτητή @el
label: له طالب @ar
label: 有学生 @zh-hans
sub property of: henkilöön liittyvä henkilö
alternative label: opiskelija
definition: Bir kişiyi başka bir kişiden talimat alan bir kişi ile ilişkilendirir. @tr
definition: Correla una persona a una persona che riceve istruzione da un'altra persona. @it
definition: Hozzákapcsol egy személyt egy személyhez, aki egy másik személytől oktatásban részesül. @hu
definition: Liittää henkilön henkilöön, joka saa opetusta toiselta henkilöltä.
definition: Met une personne en relation avec une personne qui reçoit l’enseignement d’une autre personne. @fr
definition: Relaciona una persona amb una persona que rep instrucció d’una altra persona. @ca
definition: Relateert een persoon aan een persoon die instructie ontvangt van een andere persoon. @nl
definition: Relaterer en person til en person som mottar opplæring fra en annen person. @no
definition: Relaterer en person til en person, som modtager undervisning fra en anden person. @da
definition: Relates a person to a person who receives instruction from another person. @en
definition: Sasaista personu ar personu, kura saņem izglītojošus norādījumus no citas personas. @lv
definition: Seostab isiku isikuga, kes saab teiselt isikult õpetust. @et
definition: Setzt eine Person in Beziehung zu einer Person, die von einer anderen Person unterrichtet wird. @de
definition: Συνδέει ένα φυσικό πρόσωπο με ένα φυσικό πρόσωπο που λαμβάνει οδηγίες από ένα άλλο φυσικό πρόσωπο. @el
definition: يربط شخصا بشخص يتلقى تعليمات من شخص آخر. @ar
definition: 将一个个人与从另一个个人接受教学的一个个人关联起来。 @zh-hans

opettaja
has element type: 2
instruction number: 29.5
toolkit definition: A person who instructs another person. @en
toolkit definition: Başka bir kişiye talimat veren kişi @tr
toolkit definition: Een persoon die een andere persoon instrueert. @nl
toolkit definition: Egy személy, aki egy másik személyt oktat. @hu
toolkit definition: Eine Person, die eine andere Person unterrichtet. @de
toolkit definition: En person som instruerer en annen person. @no
toolkit definition: Henkilö, joka opettaa toista henkilöä.
toolkit definition: Isik, kes õpetab teist isikut. @et
toolkit definition: Person, som underviser en anden person. @da
toolkit definition: Persona che istruisce un'altra persona. @it
toolkit definition: Persona que instrueix una altra persona. @ca
toolkit definition: Persona, kura izglīto citu personu. @lv
toolkit definition: Personne qui enseigne à une autre personne. @fr
toolkit definition: Ένα φυσικό πρόσωπο που καθοδηγεί ένα άλλο φυσικό πρόσωπο. @el
toolkit definition: شخص يعلم شخصًا آخر. @ar
toolkit definition: 给予另一个个人教学的一个个人 @zh-hans
toolkit label: Lehrerin/Lehrer @de
toolkit label: docente @it
toolkit label: leraar @nl
toolkit label: lærer @no
toolkit label: opettaja
toolkit label: professeur @fr
toolkit label: professor @ca
toolkit label: skolotājs @lv
toolkit label: tanár: @hu
toolkit label: teacher @en
toolkit label: underviser @da
toolkit label: Öğretmen @tr
toolkit label: õpetaja @et
toolkit label: δάσκαλος @el
toolkit label: مدرس @ar
toolkit label: 教师 @zh-hans
has subproperty: P50282
lexical alias: teacher.en
status: Published
type: Property
domain: C10004
label: a pour professeur @fr
label: ha come insegnante @it
label: har lærer @da
label: has teacher @en
label: hat Lehrerin/Lehrer @de
label: heeft leraar @nl
label: skolotājs @lv
label: tanára a következő: @hu
label: té com a professor @ca
label: õpetaja @et
label: öğretmen ile ilişkilidir @tr
label: έχει δάσκαλο @el
label: له مدرس @ar
label: 有教师 @zh-hans
sub property of: henkilöön liittyvä henkilö
definition: Bir kişiyi başka bir kişiye talimat veren bir kişi ile ilişkilendirir. @tr
definition: Correla una persona a una persona che istruisce un'altra persona. @it
definition: Hozzákapcsol egy személyt egy személyhez, aki egy másik személyt oktat. @hu
definition: Liittää henkilön henkilöön, joka opettaa toista henkilöä.
definition: Met une personne en relation avec une personne qui enseigne à une autre personne. @fr
definition: Relaciona una persona amb una persona que instrueix una altra persona. @ca
definition: Relateert een persoon aan een persoon die een andere persoon instrueert. @nl
definition: Relaterer en person til en person som instruerer en annen person. @no
definition: Relaterer en person til en person, som underviser en anden person. @da
definition: Relates a person to a person who instructs another person. @en
definition: Sasaista personu ar personu, kura izglīto citu personu. @lv
definition: Seostab isiku isikuga, kes õpetab teist isikut. @et
definition: Setzt eine Person in Beziehung zu einer Person, die eine andere Person unterrichtet. @de
definition: Συνδέει ένα φυσικό πρόσωπο με ένα φυσικό πρόσωπο που καθοδηγεί ένα άλλο φυσικό πρόσωπο. @el
definition: يربط شخصا بشخص يقوم بتعليم شخص آخر. @ar
definition: 将一个个人与给予另一个个人教学的一个个人关联起来。 @zh-hans

opiskelija
has element type: 2
instruction number: 29.5
toolkit definition: A person who receives instruction at an educational institution. @en
toolkit definition: Bir eğitim kurumunda eğitim alan kişi @tr
toolkit definition: Een persoon die instructie ontvangt aan een onderwijsinstelling. @nl
toolkit definition: Egy személy, aki egy oktatási intézményben oktatásban részesül. @hu
toolkit definition: Eine Person, die in einer Bildungseinrichtung unterrichtet wird. @de
toolkit definition: En person som mottar opplæring ved en utdanningsinstitusjon. @no
toolkit definition: Henkilö, joka saa opetusta oppilaitoksessa.
toolkit definition: Isik, kes saab õpetust haridusasutuses. @et
toolkit definition: Person, som modtager undervisning ved en uddannelsesinstitution. @da
toolkit definition: Persona che riceve istruzione presto un istituto scolastico. @it
toolkit definition: Persona que rep instrucció en una institució educativa. @ca
toolkit definition: Persona, kura ir reģistrēta izglītības iestādes izglītojamo sarakstā. @lv
toolkit definition: Personne qui reçoit un enseignement dans un établissement d’enseignement. @fr
toolkit definition: Ένα φυσικό πρόσωπο που λαμβάνει οδηγίες σε ένα εκπαιδευτικό ίδρυμα. @el
toolkit definition: شخص يتلقى التعليم في مؤسسة تعليمية. @ar
toolkit definition: 在一个教育机构里接受教学的一个个人 @zh-hans
toolkit label: Immatrikulierte Studentin/Immatrikulierter Student @de
toolkit label: beiratkozott tanuló: @hu
toolkit label: enrolled student @en
toolkit label: estudiant matriculat @ca
toolkit label: indskreven student @da
toolkit label: ingeschreven student @nl
toolkit label: innskrevet student @no
toolkit label: izglītojamais @lv
toolkit label: kayıtlı öğrenci @tr
toolkit label: opiskelija
toolkit label: registreeritud õppur @et
toolkit label: studente iscritto @it
toolkit label: élève inscrit @fr
toolkit label: εγγεγραμμένος φοιτητής @el
toolkit label: طالب مُسجل @ar
toolkit label: 注册学生 @zh-hans
has subproperty: P50283
lexical alias: enrolledStudent.en
status: Published
type: Property
domain: C10005
label: a pour élève inscrit @fr
label: beiratkozott tanulója a következő: @hu
label: ha come studente iscritto @it
label: har indskreven studerende @da
label: har innskrevet student @no
label: has enrolled student @en
label: hat immatrikulierte Studentin/immatrikulierten Studenten @de
label: heeft ingeschreven student @nl
label: izglītojamais @lv
label: kayıtlı öğrenci ile ilişkilidir @tr
label: registreeritud õppur @et
label: té com a estudiant matriculat @ca
label: έχει εγγεγραμμένο φοιτητή @el
label: له طالب مسجل @ar
label: 有注册学生 @zh-hans
sub property of: yhteisöön liittyvä henkilö
definition: Bir tüzel kişiyi, bir eğitim kurumunda eğitim gören bir kişi ile ilişkilendirir. @tr
definition: Collega un ente a una persona che riceve istruzione presto un istituto scolastico. @it
definition: Hozzákapcsol egy testületet egy személyhez, aki egy oktatási intézményben oktatásban részesül. @hu
definition: Liittää yhteisön henkilöön, joka saa opetusta oppilaitoksessa.
definition: Met une collectivité en relation avec une personne qui reçoit un enseignement dans un établissement d’enseignement. @fr
definition: Relaciona una entitat corporativa amb una persona que rep instrucció en una institució educativa. @ca
definition: Relateert een corporatie aan een persoon die instructie ontvangt aan een onderwijsinstelling. @nl
definition: Relaterer en korporasjon til en person som mottar opplæring ved en utdanningsinstitusjon. @no
definition: Relaterer en korporation til en person, som modtager undervisning ved en uddannelsesinstitution. @da
definition: Relates a corporate body to a person who receives instruction at an educational institution. @en
definition: Sasaista institūciju ar personu, kura ir reģistrēta izglītības iestādes izglītojamo sarakstā. @lv
definition: Seostab asutuse isikuga, kes saab õpetust haridusasutuses. @et
definition: Setzt eine Körperschaft in Beziehung zu einer Person, die in einer Bildungseinrichtung unterrichtet wird. @de
definition: Συνδέει ένα συλλογικό όργανο με ένα φυσικό πρόσωπο που λαμβάνει οδηγίες σε ένα εκπαιδευτικό ίδρυμα. @el
definition: يربط هيئة بشخص يتلقى التعليم في مؤسسة تعليمية. @ar
definition: 将一个个人与在一个教育机构里接受教学的一个个人关联起来。 @zh-hans

pääjohtaja
has element type: 2
instruction number: 29.5
toolkit definition: A person who is an officer who is the top-ranking official of a corporate body. @en
toolkit definition: Amatpersona, kura ir augstākā līmeņa vadītājs institūcijā. @lv
toolkit definition: Ametnik, kes on asutuse kõrgeim ametiisik. @et
toolkit definition: Bir tüzel kişinin en üst düzey yetkilisi olan memur olan kişi @tr
toolkit definition: Een persoon die is een functionaris die de hoogstgeplaatste bestuurder van een corporatie is. @nl
toolkit definition: Egy tisztviselő személy, aki egy testület legfelső beosztású tisztviselője. @hu
toolkit definition: Eine leitende Angestellte/Ein leitender Angestellter (Person), die/der das höchste Amt in einer Körperschaft innehat. @de
toolkit definition: En korporasjons øverste leder. @no
toolkit definition: Funzionario che è il dirigente di livello più alto in un ente. @it
toolkit definition: Henkilö, joka on toimihenkilö, joka on yhteisön ylin viranhaltija.
toolkit definition: Person, der er en embedsmand, som har den højeste stilling i en korporation. @da
toolkit definition: Persona que és un directiu que té el càrrec més alt d’una entitat corporativa. @ca
toolkit definition: Personne qui est un dirigeant occupant le rang le plus élevé au sein d’une collectivité. @fr
toolkit definition: Ένας υπάλληλος που βρίσκεται στην κορυφή της ιεραρχίας ενός συλλογικού οργάνου. @el
toolkit definition: شخص مسئول رفيع المستوى في هيئة. @ar
toolkit definition: 作为一个团体顶级官员的一个任职个人 @zh-hans
toolkit label: Geschäftsführerin/Geschäftsführer @de
toolkit label: amministratore delegato @it
toolkit label: augstākā līmeņa vadītājs @lv
toolkit label: chief executive @en
toolkit label: directeur @nl
toolkit label: directeur général @fr
toolkit label: director executiu @ca
toolkit label: felsővezető: @hu
toolkit label: genel müdür @tr
toolkit label: pääjohtaja
toolkit label: tegevjuht @et
toolkit label: toppleder @no
toolkit label: virksomhedsleder @da
toolkit label: διευθύνων σύμβουλος @el
toolkit label: رئيس تنفيذي @ar
toolkit label: 总裁 @zh-hans
has subproperty: P50284
lexical alias: chiefExecutive.en
status: Published
type: Property
domain: C10005
label: a pour directeur général @fr
label: augstākā līmeņa vadītājs @lv
label: felsővezetője a következő: @hu
label: genel müdür ile ilişkilidir @tr
label: ha come amministratore delegato @it
label: har toppleder @no
label: har virksomhedsleder @da
label: has chief executive @en
label: hat Geschäftsführerin/Geschäftsführer @de
label: heeft directeur @nl
label: tegevjuht @et
label: té com a director executiu @ca
label: έχει διευθύνοντα σύμβουλο @el
label: له رئيس تنفيذي @ar
label: 有总裁 @zh-hans
sub property of: toimihenkilö
definition: Bir tüzel kişiyi, bir tüzel kişiliğin en üst düzey yetkilisi olan memur bir kişi ile ilişkilendirir. @tr
definition: Collega un ente a un funzionario che è il dirigente di livello più alto in un ente. @it
definition: Hozzákapcsol egy testületet egy tisztviselő személyhez, aki egy testület legfelső beosztású tisztviselője. @hu
definition: Liittää yhteisön henkilöön, joka on toimihenkilö, joka on yhteisön ylin viranhaltija.
definition: Met une collectivité en relation avec une personne qui est un dirigeant occupant le rang le plus élevé au sein d’une collectivité. @fr
definition: Relaciona una entitat corporativa amb una persona que és un directiu que té el càrrec més alt d’una entitat corporativa. @ca
definition: Relateert een corporatie aan een persoon die is een functionaris die de hoogstgeplaatste bestuurder van een corporatie is. @nl
definition: Relaterer en korporasjon til en korporasjons øverste leder. @no
definition: Relaterer en korporation til en person, der er en embedsmand, som har den højeste stilling i en korporation. @da
definition: Relates a corporate body to a person who is an officer who is the top-ranking official of a corporate body. @en
definition: Sasaista institūciju ar personu, kura ir amatpersona, kura ir augstākā līmeņa vadītājs institūcijā. @lv
definition: Seostab asutuse ametnikuga, kes on asutuse kõrgeim ametiisik. @et
definition: Setzt eine Körperschaft in Beziehung zu einer leitenden Angestellten/einem leitenden Angestellten (Person), die/der das höchste Amt in einer Körperschaft innehat. @de
definition: Συνδέει ένα συλλογικό όργανο με έναν υπάλληλο που βρίσκεται στην κορυφή της ιεραρχίας ενός συλλογικού οργάνου. @el
definition: يربط هيئة بشخص هو مسئول رفيع المستوى في هيئة. @ar
definition: 将一个团体与作为一个团体顶级官员的一个任职个人关联起来。 @zh-hans

edunvalvoja
has element type: 2
instruction number: 29.5
toolkit definition: A person who is an officer granted the powers of administration in a corporate body in order to act for its benefit. @en
toolkit definition: Amatpersona, kurai institūcijas administrācija piešķīrusi pilnvaras, lai darbotos tās labā. @lv
toolkit definition: Ametnik, kellele on antud haldusvolitused tegutseda asutuse huvides. @et
toolkit definition: Een persoon die is een functionaris verleend met bevoegdheden van bestuur in een corporatie met de bedoeling te handelen in haar belang. @nl
toolkit definition: Egy tisztviselő személy, aki adminisztratív hatalmat kap egy testületben, hogy annak javára cselekedjék. @hu
toolkit definition: Eine leitende Angestellte/Ein leitender Angestellter (Person), der/dem die Verwaltungsvollmachten über eine Körperschaft übertragen wird, um zu ihrem Nutzen zu agieren. @de
toolkit definition: En leder med ansvar for å forvalte en korporasjon til korporasjonens beste. @no
toolkit definition: Funzionario a cui sono assegnati i poteri di amministrazione in un ente al fine di agire in suo favore. @it
toolkit definition: Henkilö, joka on toimihenkilö, jolla on valtuudet tehdä päätöksiä yhteisön eduksi.
toolkit definition: Person, der er en embedsmand, som har fået administrationsbeføjelse i en korporation til at agere i dens interesse. @da
toolkit definition: Persona que és un directiu amb poders assignats d’administració en una entitat corporativa per tal d’actuar per al benefici d’aquesta. @ca
toolkit definition: Personne qui est un dirigeant investi des pouvoirs d’administration au sein d’une collectivité afin d’agir dans son intérêt. @fr
toolkit definition: Tüzel bir kişilikte, onun yararına hareket etmek üzere yönetim yetkisi verilen memur olan bir kişi @tr
toolkit definition: Ένας υπάλληλος που έχει εξουσιοδοτηθεί να ενεργεί προς όφελός ενός συλλογικού οργάνου. @el
toolkit definition: شخص مسئول مُنح صلاحية الإدارة في هيئة للعمل لمصلحتها. @ar
toolkit definition: 作为一个团体的任职者被赋予为其利益行动的权力的一个个人 @zh-hans
toolkit label: Treuhänderin/Treuhänder @de
toolkit label: administrateur @fr
toolkit label: conseller @ca
toolkit label: edunvalvoja
toolkit label: fiduciario @it
toolkit label: forvalter @da
toolkit label: pilnvarotais @lv
toolkit label: trustee @en
toolkit label: vezető: @hu
toolkit label: volitatud isik @et
toolkit label: yetkili @tr
toolkit label: διαχειριστής @el
toolkit label: مشرف @ar
toolkit label: 受托人 @zh-hans
has subproperty: P50285
lexical alias: trustee.en
status: Published
type: Property
domain: C10005
label: a pour administrateur @fr
label: ha come fiduciario @it
label: har forvalter @da
label: has trustee @en
label: hat Treuhänderin/Treuhänder @de
label: heeft trustee @nl
label: pilnvarotais @lv
label: té com a conseller @ca
label: vezetője a következő: @hu
label: volitatud isik @et
label: yetkili ile ilişkilidir @tr
label: έχει διαχειριστή @el
label: له مدير عام @ar
label: 有受托人 @zh-hans
sub property of: toimihenkilö
definition: Bir tüzel kişiyi, tüzel kişiliğe, onun yararına hareket etmek üzere yönetim yetkisi verilmiş olan kişiye ilişkindir. @tr
definition: Collega un ente a un funzionario a cui sono assegnati i poteri di amministrazione in un ente al fine di agire in suo favore. @it
definition: Hozzákapcsol egy testületet egy tisztviselő személyhez, aki adminisztratív hatalmat kap egy testületben, hogy annak javára cselekedjék. @hu
definition: Liittää yhteisön henkilöön, joka on toimihenkilö, jolla on valtuudet tehdä päätöksiä yhteisön eduksi.
definition: Met une collectivité en relation avec une personne qui est un dirigeant investi des pouvoirs d’administration au sein d’une collectivité afin d’agir dans son intérêt. @fr
definition: Relaciona una entitat corporativa amb una persona que és un directiu amb poders assignats d’administració en una entitat corporativa per tal d’actuar per al benefici d’aquesta. @ca
definition: Relateert een corporatie aan een persoon die is een functionaris verleend met bevoegdheden van bestuur in een corporatie met de bedoeling te handelen in haar belang. @nl
definition: Relaterer en korporasjon til en leder med ansvar for å forvalte en korporasjon til korporasjonens beste. @no
definition: Relaterer en korporation til en person, der er en embedsmand, som har fået administrationsbeføjelse i en korporation til at agere i dens interesse. @da
definition: Relates a corporate body to a person who is an officer granted the powers of administration in a corporate body in order to act for its benefit. @en
definition: Sasaista institūciju ar personu, kura ir amatpersona, kurai institūcijas administrācija piešķīrusi pilnvaras, lai darbotos tās labā. @lv
definition: Seostab asutuse ametnikuga, kellele on antud haldusvolitused tegutseda asutuse huvides. @et
definition: Setzt eine Körperschaft in Beziehung zu einer leitenden Angestellten/einem leitenden Angestellten (Person), der/dem die Verwaltungsvollmachten über eine Körperschaft übertragen wird, um zu ihrem Nutzen zu agieren. @de
definition: Συνδέει ένα συλλογικό όργανο με έναν υπάλληλο, ο οποίος έχει εξουσιοδοτηθεί σε ένα συλλογικό όργανο να ενεργεί προς όφελός του. @el
definition: يربط هيئة بشخص هو مسئول مُنح صلاحيات الإدارة فيها للعمل لمصلحتها. @ar
definition: 将一个个人与作为一个团体的任职者被赋予为其利益行动的权力的一个个人关联起来。 @zh-hans

pääjohtajana yhteisössä
has element type: 2
instruction number: 29.5
toolkit definition: A corporate body in which an officer is the top-ranking official. @en
toolkit definition: Asutus, kus ametnik on kõrgeim ametiisik. @et
toolkit definition: Bir memurun en üst düzey yetkili olduğu bir tüzel kişilik @tr
toolkit definition: Collectivité au sein de laquelle un dirigeant occupe le rang le plus élevé. @fr
toolkit definition: Een corporatie waarin een functionaris de hoogstgeplaatste bestuurder is. @nl
toolkit definition: Egy testület, amelyben egy tisztviselő a rangidős. @hu
toolkit definition: Eine Körperschaft, in der eine leitende Angestellte/ein leitender Angestellter das höchste Amt innehat. @de
toolkit definition: En korporasjon der en person er øverste leder. @no
toolkit definition: Ente in cui un funzionario è il dirigente di livello più alto. @it
toolkit definition: Entitat corporativa en la qual un directiu té el càrrec més alt. @ca
toolkit definition: Institūcija, kur amatpersona ir augstākā līmeņa vadītājs. @lv
toolkit definition: Korporation, hvor en embedsmand har den højeste stilling. @da
toolkit definition: Yhteisö, jossa toimihenkilö on ylin viranhaltija.
toolkit definition: Ένα συλλογικό όργανο στο οποίο ένας υπάλληλος βρίσκεται στην κορυφή της ιεραρχίας. @el
toolkit definition: هيئة بها موظف هو المسئول الأعلى رتبة. @ar
toolkit definition: 一个任职个人在其中任顶级官员的一个团体 @zh-hans
toolkit label: Geschäftsführerin/Geschäftsführer von @de
toolkit label: amministratore delegato di @it
toolkit label: chief executive of @en
toolkit label: directeur général de @fr
toolkit label: directeur van @nl
toolkit label: director executiu de @ca
toolkit label: felsővezetője: @hu
toolkit label: genel müdür @tr
toolkit label: pääjohtajana yhteisössä
toolkit label: pārvaldītā institūcija @lv
toolkit label: tegevjuht asutuses @et
toolkit label: toppleder for @no
toolkit label: virksomhedsleder af @da
toolkit label: είναι ανώτατο εκτελεστικό στέλεχος του @el
toolkit label: رئيس تنفيذي @ar
toolkit label: ……的总裁 @zh-hans
has subproperty: P50286
lexical alias: chiefExecutiveOf.en
status: Published
type: Property
domain: C10004
label: er toppleder for @no
label: er virksomhedsleder af @da
label: est un directeur général de @fr
label: felsővezetője a következőnek: @hu
label: genel müdürüdür @tr
label: ir pārvaldnieks @lv
label: is chief executive of @en
label: is directeur van @nl
label: ist Geschäftsführerin/Geschäftsführer von @de
label: tegevjuht asutuses @et
label: è amministratore delegato di @it
label: és director executiu de @ca
label: είναι ανώτατο εκτελεστικό στέλεχος του @el
label: هو رئيس تنفيذي لـ @ar
label: 是……的总裁 @zh-hans
sub property of: toimihenkilönä yhteisössä
alternative label: διευθύνων σύμβουλος του @el
definition: Bir kişiyi, bir memurun en üst düzey yetkili olduğu bir tüzel kişilik ile ilişkilendirir. @tr
definition: Correla una persona a un ente in cui un funzionario è il dirigente di livello più alto. @it
definition: Hozzákapcsol egy személyt egy testülethez, amelyben egy tisztviselő a rangidős. @hu
definition: Liittää henkilön yhteisöön, jossa toimihenkilö on ylin viranhaltija.
definition: Met une personne en relation avec une collectivité au sein de laquelle un dirigeant occupe le rang le plus élevé. @fr
definition: Relaciona una persona amb una entitat corporativa en la qual un directiu té el càrrec més alt. @ca
definition: Relateert een persoon aan een corporatie waarin een functionaris de hoogstgeplaatste bestuurder is. @nl
definition: Relaterer en person til en korporasjon der en person er øverste leder. @no
definition: Relaterer en person til en korporation, hvor en embedsmand har den højeste stilling. @da
definition: Relates a person to a corporate body in which an officer is the top-ranking official. @en
definition: Sasaista personu ar institūciju, kur amatpersona ir augstākā līmeņa vadītājs. @lv
definition: Seostab isiku asutusega, kus ametnik on kõrgeim ametiisik. @et
definition: Setzt eine Person in Beziehung zu einer Körperschaft, in der eine leitende Angestellte/ein leitender Angestellter das höchste Amt innehat. @de
definition: Συνδέει ένα φυσικό πρόσωπο με ένα συλλογικό όργανο στο οποίο ένας υπάλληλος βρίσκεται στην κορυφή της ιεραρχίας. @el
definition: يربط شخصا بهيئة بها موظف هو المسئول الأعلى رتبة. @ar
definition: 将一个个人与一个任职个人在其中任顶级官员的一个团体关联起来。 @zh-hans

edunvalvojana yhteisössä
has element type: 2
instruction number: 29.5
toolkit definition: A corporate body who grants the powers of administration to an officer in order to act for its benefit. @en
toolkit definition: Asutus, kes on andnud ametnikule haldusvolitused tegutseda asutuse huvides. @et
toolkit definition: Collectivité qui confère les pouvoirs d’administration à un dirigeant afin que celui-ci agisse dans son intérêt. @fr
toolkit definition: Een corporatie die bevoegdheden van bestuur verleent aan een functionaris met de bedoeling te handelen in haar belang. @nl
toolkit definition: Egy testület, amely adminisztratív hatalommal ruház fel egy tisztviselőt, hogy a testület javára cselekedjen. @hu
toolkit definition: Eine Körperschaft, die einer leitenden Angestellten/einem leitenden Angestellten die Verwaltungsvollmachten überträgt, um zu ihrem Nutzen zu agieren. @de
toolkit definition: En korporasjon som gir en leder ansvar for å forvalte en korporasjon til korporasjonens beste. @no
toolkit definition: Ente che assegna i poteri di amministrazione a un funzionario per agire in suo favore. @it
toolkit definition: Entitat corporativa que assigna poders d’administració a un directiu per tal d’actuar per al benefici d’aquella. @ca
toolkit definition: Institūcija, kas piešķīrusi pilnvaras amatpersonai, lai darbotos tās labā. @lv
toolkit definition: Kendi yararına hareket etmesi için bir memura yönetim yetkilerini veren bir tüzel kişilik. @tr
toolkit definition: Korporation, som giver administrationsbeføjelser til en embedsmand til at agere i dens interesse. @da
toolkit definition: Yhteisö, jossa toimihenkilöllä on valtuudet tehdä päätöksiä yhteisön eduksi.
toolkit definition: Ένα συλλογικό όργανο που εξουσιοδοτεί έναν υπάλληλο να ενεργεί προς όφελός του. @el
toolkit definition: هيئة تمنح صلاحية الإدارة لمسئول للعمل لمصلحتها. @ar
toolkit definition: 赋予一个任职者为其利益行动的权力的一个团体 @zh-hans
toolkit label: Treuhänderin/Treuhänder von @de
toolkit label: administrateur de @fr
toolkit label: conseller de @ca
toolkit label: edunvalvojana yhteisössä
toolkit label: fiduciario di @it
toolkit label: forvalter af @da
toolkit label: forvalter for @no
toolkit label: pilnvarotāja institūcija @lv
toolkit label: trustee of @en
toolkit label: trustee van @nl
toolkit label: vezetője: @hu
toolkit label: volitatud isik asutuses @et
toolkit label: yetkili @tr
toolkit label: διαχειριστής του @el
toolkit label: مشرف @ar
toolkit label: ……的受托人 @zh-hans
has subproperty: P50287
lexical alias: trusteeOf.en
status: Published
type: Property
domain: C10004
label: er forvalter af @da
label: er forvalter for @no
label: est un administrateur de @fr
label: ir pilnvarotājs @lv
label: is trustee of @en
label: is trustee van @nl
label: ist Treuhänderin/Treuhänder von @de
label: vezetője a következőnek: @hu
label: volitatud isik asutuses @et
label: çevirmendir @tr
label: è fiduciario di @it
label: és conseller de @ca
label: είναι διαχειριστής του @el
label: هو مدير عام لـ @ar
label: 是……的受托人 @zh-hans
sub property of: toimihenkilönä yhteisössä
alternative label: επίτροπος του @el
definition: Bir kişiyi, kendi yararına hareket etmesi için bir memura yönetim yetkilerini veren bir tüzel kişilik ile ilişkilendirir @tr
definition: Correla una persona a un ente che assegna i poteri di amministrazione a un funzionario per agire in suo favore. @it
definition: Hozzákapcsol egy személyt egy testülethez, amely adminisztratív hatalommal ruház fel egy tisztviselőt, hogy a testület javára cselekedjen. @hu
definition: Liittää henkilön yhteisöön, jossa toimihenkilöllä on valtuudet tehdä päätöksiä yhteisön eduksi.
definition: Met une personne en relation avec une collectivité qui confère les pouvoirs d’administration à un dirigeant afin que celui-ci agisse dans son intérêt. @fr
definition: Relaciona una persona amb una entitat corporativa que assigna poders d’administració a un directiu per tal d’actuar per al benefici d’aquella. @ca
definition: Relateert een persoon aan een corporatie die bevoegdheden van bestuur verleent aan een functionaris met de bedoeling te handelen in haar belang. @nl
definition: Relaterer en person til en korporasjon som gir en leder ansvar for å forvalte en korporasjon til korporasjonens beste. @no
definition: Relaterer en person til en korporation, som giver administrationsbeføjelser til en embedsmand til at agere i dens interesse. @da
definition: Relates a person to a corporate body who grants the powers of administration to an officer in order to act for its benefit. @en
definition: Sasaista personu ar institūciju, kas piešķīrusi pilnvaras amatpersonai, lai darbotos tās labā. @lv
definition: Seostab isiku asutusega, kes on andnud ametnikule haldusvolitused tegutseda asutuse huvides. @et
definition: Setzt eine Person in Beziehung zu einer Körperschaft, die einer leitenden Angestellten/einem leitenden Angestellten die Verwaltungsvollmachten überträgt, um zu ihrem Nutzen zu agieren. @de
definition: Συνδέει ένα φυσικό πρόσωπο με ένα συλλογικό όργανο το οποίο εξουσιοδοτεί έναν υπάλληλο να ενεργεί προς όφελός του. @el
definition: يربط شخصا بهيئة تمنح صلاحيات الإدارة لمسئول للعمل لمصلحتها. @ar
definition: 将一个个人与赋予一个任职者为其利益行动的权力的一个团体关联起来。 @zh-hans

oppilaitos
has element type: 2
instruction number: 29.5
toolkit definition: A corporate body who is an educational institution that provides instruction to a person. @en
toolkit definition: Bir kişiye eğitim veren bir eğitim kurumu olan bir tüzel kişi. @tr
toolkit definition: Collectivité qui consiste en un établissement d’enseignement fournissant un enseignement à une personne. @fr
toolkit definition: Een corporatie die een onderwijsinstelling is die onderricht geeft aan een persoon. @nl
toolkit definition: Egy oktatási intézmény testület, amely oktatást nyújt egy személy számára. @hu
toolkit definition: Eine Bildungseinrichtung (Körperschaft), die einer Person Unterricht erteilt. @de
toolkit definition: En korporasjon som er en utdanningsinstitusjon som gir en person opplæring. @no
toolkit definition: Ente che è un'istituzione scolastica che fornisce istruzione a una persona. @it
toolkit definition: Entitat corporativa que és una institució educativa que proporciona instrucció a una persona. @ca
toolkit definition: Haridusasutus, kes pakub isikule õpetust. @et
toolkit definition: Institūcija, kur persona studē. @lv
toolkit definition: Korporation, som er en uddannelsesinstitution, som giver undervisning til en person. @da
toolkit definition: Oppilaitos, joka antaa opetusta henkilölle.
toolkit definition: Ένα εκπαιδευτικό ίδρυμα που παρέχει οδηγίες σε ένα φυσικό πρόσωπο. @el
toolkit definition: هيئة هي مؤسسة تعليمية توفر التعليم لشخص. @ar
toolkit definition: 作为教育机构为一个个人提供教学的一个团体 @zh-hans
toolkit label: Studentin/Student an @de
toolkit label: estudiant a @ca
toolkit label: ir izglītojies @lv
toolkit label: oppilaitos
toolkit label: student aan @nl
toolkit label: student at @en
toolkit label: student ved @no
toolkit label: studente presso @it
toolkit label: studerende på @da
toolkit label: tanulója: @hu
toolkit label: élève à @fr
toolkit label: õppur asutuses @et
toolkit label: φοιτητής σε @el
toolkit label: طالب في @ar
toolkit label: … de/da öğrenci @tr
toolkit label: ……处的学生 @zh-hans
has subproperty: P50288
lexical alias: studentAt.en
status: Published
type: Property
domain: C10004
label: er student ved @no
label: er studerende på @da
label: est un élève à @fr
label: ir izglītojies @lv
label: is student aan @nl
label: is student at @en
label: ist Studentin/Student an @de
label: tanulója a következőnek: @hu
label: è studente presso @it
label: és estudiant a @ca
label: õppur asutuses @et
label: είναι φοιτητής σε @el
label: هو طالب لـ @ar
label: … de/da öğrencidir @tr
label: 是……处的学生 @zh-hans
sub property of: henkilöön liittyvä yhteisö
definition: Bir kişiyi, bir kişiye eğitim veren bir eğitim kurumu olan bir tüzel kişi ile ilişkilendirir. @tr
definition: Correla una persona a un ente che è un'istituzione scolastica che fornisce istruzione a una persona. @it
definition: Hozzákapcsol egy személyt egy oktatási intézmény testülethez, amely oktatást nyújt egy személy számára. @hu
definition: Liittää henkilön oppilaitokseen, joka antaa opetusta henkilölle.
definition: Met une personne en relation avec une collectivité qui consiste en un établissement d’enseignement fournissant un enseignement à une personne. @fr
definition: Relaciona una persona amb una entitat corporativa que és una institució educativa que proporciona instrucció a una persona. @ca
definition: Relateert een persoon aan een corporatie die een onderwijsinstelling is die onderricht geeft aan een persoon. @nl
definition: Relaterer en person til en korporasjon som er en utdanningsinstitusjon som gir en person opplæring. @no
definition: Relaterer en person til en korporation, som er en uddannelsesinstitution, som giver undervisning til en person. @da
definition: Relates a person to a corporate body who is an educational institution that provides instruction to a person. @en
definition: Sasaista personu ar institūciju, kur persona studē. @lv
definition: Seostab isiku haridusasutusega, kes pakub isikule õpetust. @et
definition: Setzt eine Person in Beziehung zu einer Bildungseinrichtung (Körperschaft), die einer Person Unterricht erteilt. @de
definition: Συνδέει ένα φυσικό πρόσωπο με ένα εκπαιδευτικό ίδρυμα, το οποίο παρέχει οδηγίες σε ένα φυσικό πρόσωπο. @el
definition: يربط شخصا بهيئة هي مؤسسة تعليمية تقدم التعليم لشخص. @ar
definition: 将一个个人与作为教育机构为一个个人提供教学的一个团体关联起来。 @zh-hans

toimituspäällikkö (toimija) teoksessa
has element type: 2
instruction number: 18.5
see also: toimittajana aineistossa
toolkit definition: A work that involves a legal or intellectual responsibility, but not creative responsibility, of an agent for the editorial policy and content of a diachronic work. @en
toolkit definition: Artzamanlı bir eserin yayın politikası ve içeriği için bir temsilcinin yasal veya entelektüel sorumluluğunu içeren, ancak yaratıcı sorumluluğunu içermeyen bir eser. @tr
toolkit definition: Darbs, kas ietver aģenta juridisku vai intelektuālu, bet ne radošu, atbildību par diahroniskā darba izdošanas politiku un saturu. @lv
toolkit definition: Een werk dat met zich meebrengt een wettelijke of intellectuele verantwoordelijkheid, maar niet creatieve verantwoordelijkheid, van een actor voor redactioneel beleid en content van een diachronisch werk. @nl
toolkit definition: Ein Werk, bei dem ein Akteur die rechtliche oder intellektuelle, aber keine kreative, Verantwortung für die redaktionelle Vorgehensweise und den Inhalt eines diachronen Werks trägt. @de
toolkit definition: Et verk som involverer juridisk eller intellektuelt ansvar, bortsett fra kreativt ansvar, for en agent i form av de redaksjonelle retningslinjene og innholdet i et diakronisk verk. @no
toolkit definition: Obra que implica una responsabilitat legal o intel·lectual, però no una responsabilitat creativa, d’un agent en la política editorial i el contingut d’una obra diacrònica. @ca
toolkit definition: Opera che implica una responsabilità legale o intellettuale, ma non una responsabilità creativa, di un agente relativamente alla politica editoriale e al contenuto di un'opera diacronica. @it
toolkit definition: Teos, jossa toimija on juridisesti tai tiedollisesti muttei luovasti vastuussa diakronisen teoksen toimituslinjasta ja sisällöstä.
toolkit definition: Teos, mis sisaldab tegija juriidilist või intellektuaalset, kuid mitte loomingulist vastutust diakroonilise teose toimetamispõhimõtete ja sisu eest. @et
toolkit definition: Værk, som involverer en agents juridiske eller intellektuelle ansvar, men ikke skabelsesansvar, for et diakronisk værks redaktionelle linje og indhold. @da
toolkit definition: főszerkesztő ágense: @hu
toolkit definition: Œuvre qui comporte une responsabilité légale ou intellectuelle, mais non une responsabilité créative, de la part d’un agent en ce qui concerne la politique éditoriale et le contenu d’une œuvre diachronique. @fr
toolkit definition: Ένα έργο που περιλαμβάνει τη νομική ή/και πνευματική ευθύνη, άλλη από τη δημιουργία, για το περιεχόμενο ενός περιοδικού, ενσωματωμένου πόρου ή πολυμερούς μονογραφίας. @el
toolkit definition: عمل يترتب عليه تحمل وكيل المسئولية القانونية أو الفكرية، وليس إبداعية مسئول عن السياسة التحريرية ومحتوى عمل ممتد زمنيا. @ar
toolkit definition: 涉及一个行为者对一种历时作品的编辑政策和内容的法律或知识责任（但非创作责任）的一种作品 @zh-hans
toolkit label: Akteur als Chefredakteurin/Chefredakteur von @de
toolkit label: Hozzákapcsol egy ágenst egy műhöz, amely magában foglalja egy ágens jogi vagy szellemi, de nem alkotói felelősségét egy diakronikus mű szerkesztési politikájáért és tartalmáért. @hu
toolkit label: agent directeur de publication de @fr
toolkit label: agent director editorial de @ca
toolkit label: agent, som er ansvarshavende redaktør af @da
toolkit label: direttore editoriale agente di @it
toolkit label: editorial director agent of @en
toolkit label: hoofdredacteur-actor van @nl
toolkit label: ir galvenais redaktors (aģents) @lv
toolkit label: peatoimetaja (tegija) teoses @et
toolkit label: redaksjonssjef for (agent) @no
toolkit label: toimituspäällikkö (toimija) teoksessa
toolkit label: yayın yönetmeni temsilcisi @tr
toolkit label: διευθυντής σύνταξης φορέας του @el
toolkit label: وكيل مدير تحرير @ar
toolkit label: ……的主编行为者 @zh-hans
has subproperty: toimituspäällikkö (henkilö) teoksessa
has subproperty: toimituspäällikkö (yhteistoimija) teoksessa
has subproperty: P50289
lexical alias: editorialDirectorAgentOf.en
status: Published
type: Property
domain: C10002
label: er agent, som er ansvarshavende redaktør af @da
label: er redaksjonssjef for (agent) @no
label: est un agent directeur de publication de @fr
label: főszerkesztő ágense a következőnek: @hu
label: ir galvenais redaktors (aģents) @lv
label: is editorial director agent of @en
label: is hoofdredacteur-actor van @nl
label: ist Akteur als Chefredakteurin/Chefredakteur von @de
label: peatoimetaja (tegija) teoses @et
label: yayın yönetmeni temsilcisidir @tr
label: è agente direttore eagente ditoriale agente di @it
label: és agent director editorial de @ca
label: είναι διευθυντής σύνταξης φορέας του @el
label: هو وكيل مدير تحرير لـ @ar
label: 是……的主编行为者 @zh-hans
sub property of: toimijaan liittyvä teos
alternative label: Chefredakteur von @de
alternative label: ansvarshavende redaktør af @da
alternative label: directeur de publication de @fr
alternative label: director editorial de @ca
alternative label: direttore editoriale di @it
alternative label: editorial director of @en
alternative label: főszerkesztője: @hu
alternative label: peatoimetaja teoses @et
alternative label: redaksjonssjef for @no
alternative label: toimituspäällikkönä teoksessa
alternative label: yayın yönetmeni @tr
alternative label: διευθυντής σύνταξης του @el
alternative label: مدير تحرير @ar
alternative label: ……的主编 @zh-hans
definition: Bir temsilciyi, artzamanlı bir eserin yayın politikası ve içeriğine ilişkin bir temsilcinin yaratıcı sorumluluğunu değil, yasal veya fikri sorumluluğunu içeren bir eser ile ilişkilendirir. @tr
definition: Correla un agente a un'opera che implica una responsabilità legale o intellettuale, ma non una responsabilità creativa, di un agente relativamente alla politica editoriale e al contenuto di un'opera diacronica. @it
definition: Egy mű, amely magában foglalja egy ágens jogi vagy szellemi, de nem alkotói felelősségét egy diakronikus mű szerkesztési politikájáért és tartalmáért. @hu
definition: Liittää toimijan teokseen, jossa toimija on juridisesti tai tiedollisesti muttei luovasti vastuussa diakronisen teoksen toimituslinjasta ja sisällöstä.
definition: Met un agent en relation avec une œuvre qui comporte une responsabilité légale ou intellectuelle, mais non une responsabilité créative, de la part d’un agent en ce qui concerne la politique éditoriale et le contenu d’une œuvre diachronique. @fr
definition: Relaciona un agent amb una obra que implica una responsabilitat legal o intel·lectual, però no una responsabilitat creativa, d’un agent en la política editorial i el contingut d’una obra diacrònica. @ca
definition: Relateert een actor aan een werk dat met zich meebrengt een wettelijke of intellectuele verantwoordelijkheid, maar niet creatieve verantwoordelijkheid, van een actor voor redactioneel beleid en content van een diachronisch werk. @nl

teoksen perustaja (toimija) teoksessa
has element type: 2
instruction number: 18.5
toolkit definition: A work that involves a responsibility of an agent for initiating a diachronic work. @en
toolkit definition: Artzamanlı bir çalışmayı başlatmak için bir temsilcinin sorumluluğunu içeren bir eser. @tr
toolkit definition: Darbs, kas ietver aģenta atbildību par tā (seriālizdevuma, integrētā resursa vai vairākdaļu monogrāfijas) izveidošanu. @lv
toolkit definition: Een werk dat met zich meebrengt een verantwoordelijkheid van een actor voor het initiëren van een diachronisch werk. @nl
toolkit definition: Egy mű, amelyhez hozzátartozik egy ágens felelőssége egy diakronikus mű elindításáért. @hu
toolkit definition: Ein Werk, bei dem ein Akteur für das Begründen eines diachronen Werks verantwortlich ist. @de
toolkit definition: Et verk som involverer et ansvar for en agent for å etablere et diakronisk verk. @no
toolkit definition: Obra que implica una responsabilitat d’un agent d’iniciar una obra diacrònica. @ca
toolkit definition: Opera che implica una responsabilità di un agente nell'iniziare un'opera diacronica. @it
toolkit definition: Teos, jossa toimija on vastuussa diakronisen teoksen alullepanosta.
toolkit definition: Teos, mis sisaldab tegija vastutust diakroonilise teose ellukutsumise eest. @et
toolkit definition: Værk, som involverer en agents ansvar for at igangsætte et diakronisk værk. @da
toolkit definition: Œuvre qui comporte une responsabilité de la part d’un agent consistant à lancer une œuvre diachronique. @fr
toolkit definition: Ένα έργο που περιλαμβάνει την ευθύνη για την ίδρυση ενός περιοδικού, ενσωματωμένου πόρου ή πολυμερούς μονογραφίας. @el
toolkit definition: عمل يترتب عليه مسئولية وكيل عن البدء في عمل تزامني. @ar
toolkit definition: 涉及发起一种历时作品的一个行为者的责任的一种作品 @zh-hans
toolkit label: Akteur als Begründerin/Begründer eines Werks von @de
toolkit label: agent fondateur d’une œuvre de @fr
toolkit label: agent fundador d’una obra de @ca
toolkit label: agent, som er stifter af værk af @da
toolkit label: agente fondatore di opera di @it
toolkit label: alapító ágense a következő műnek: @hu
toolkit label: eserin kurucu temsilcisi @tr
toolkit label: founder agent of work of @en
toolkit label: grunnlegger av verk av (agent) @no
toolkit label: ir dibinātājs (aģents) darbam @lv
toolkit label: oprichter-actor van werk van @nl
toolkit label: teoksen perustaja (toimija) teoksessa
toolkit label: teose asutaja (tegija) teoses @et
toolkit label: ιδρυτικός φορέας του έργου του @el
toolkit label: وكيل مؤسس عمل @ar
toolkit label: ……的作品的创办者行为者 @zh-hans
has subproperty: teoksen perustaja (henkilö) teoksessa
has subproperty: teoksen perustaja (yhteistoimija) teoksessa
has subproperty: P50290
lexical alias: founderAgentOfWorkOf.en
status: Published
type: Property
domain: C10002
label: alapító ágense a következő műnek: @hu
label: er agent, som er stifter af værk af @da
label: er grunnlegger av verk av (agent) @no
label: eserinin kurucu temsilcisidir @tr
label: est un agent fondateur d’une œuvre de @fr
label: ir dibinātājs (aģents) darbam @lv
label: is founder agent of work of @en
label: is oprichter-actor van werk van @nl
label: ist Akteur als Begründerin/Begründer eines Werks von @de
label: teose asutaja (tegija) teoses @et
label: è fondatore agente di opera agente di @it
label: és agent fundador d’una obra de @ca
label: είναι ιδρυτικός φορέας του έργου του @el
label: هو وكيل مؤسس لعمل @ar
label: 是……的作品的创办者行为者 @zh-hans
sub property of: toimijaan liittyvä teos
alternative label: Begründer eines Werks von @de
alternative label: alapítója a következő műnek: @hu
alternative label: eserin kurucusu @tr
alternative label: fondateur d’œuvre de @fr
alternative label: fondatore di opera di @it
alternative label: founder of work of @en
alternative label: fundador de obra de @es
alternative label: fundador d’una obra de @ca
alternative label: grunnlegger av verk av @no
alternative label: perustajana teoksessa
alternative label: stifter af værk af @da
alternative label: teose asutaja teoses @et
alternative label: ιδρυτής του έργου του @el
alternative label: مؤسس عمل @ar
alternative label: ……的作品的创办者 @zh-hans
definition: Bir temsilciyi, artzamanlı bir eseri başlatmakla görevli bir temsilcinin sorumluluğunu içeren bir eserle ilişkilendirir. @tr
definition: Correla un agente a un'opera che implica una responsabilità di un agente nell'iniziare un'opera diacronica. @it
definition: Hozzákapcsol egy ágenst egy műhöz, amelyhez hozzátartozik egy ágens felelőssége egy diakronikus mű elindításáért. @hu
definition: Liittää toimijan teokseen, jossa toimija on vastuussa diakronisen teoksen alullepanosta.
definition: Met un agent en relation avec une œuvre qui comporte une responsabilité de la part d’un agent consistant à lancer une œuvre diachronique. @fr
definition: Relaciona un agent amb una obra que implica una responsabilitat d’un agent d’iniciar una obra diacrònica. @ca
definition: Relateert een actor aan een werk dat met zich meebrengt een verantwoordelijkheid van een actor voor het initiëren van een diachronisch werk. @nl

sukunimi
has element type: 3
instruction number: 18.5
see also: suvun nimi
toolkit definition: A nomen that is a name of person that is used as a family name. @en
toolkit definition: Az ókori rómaiak által használt családnevek nem tartoznak ide. @hu
toolkit definition: Een nomen dat is een naam van persoon die als familienaam gebruikt wordt. @nl
toolkit definition: Ein Name einer Person, der als Familienname benutzt wird. @de
toolkit definition: Et navn på person som er brukt som familienavn. @no
toolkit definition: Isiku nimi, mida kasutatakse perekonnanimena. @et
toolkit definition: Nome di persona che è usato come nome di famiglia. @it
toolkit definition: Nomen que és un nom de persona que s’usa com a nom de família. @ca
toolkit definition: Nomen qui est un nom de personne utilisé comme nom de famille. @fr
toolkit definition: Nomen, aile adı olarak kullanılan kişi ismi. @tr
toolkit definition: Nomen, joka on henkilön nimi, jota käytetään sukunimenä.
toolkit definition: Nomen, som er et navn på person, som anvendes som familienavn. @da
toolkit definition: Personas vārds, kas tiek izmantots kā uzvārds. @lv
toolkit definition: Ένα όνομα που χρησιμοποιείται ως οικογενειακό όνομα. @el
toolkit definition: اسم شخص يستخدم كاسم عائلة. @ar
toolkit definition: 作为用作家族姓氏的个人的一个名称的一个命名 @zh-hans
toolkit label: Egy személynév nomen, amelyet családnévként használnak. @hu
toolkit label: Nachname @de
toolkit label: Soyad @tr
toolkit label: achternaam @nl
toolkit label: cognom @ca
toolkit label: cognome @it
toolkit label: efternavn @da
toolkit label: etternavn @no
toolkit label: nom de famille @fr
toolkit label: perekonnanimi @et
toolkit label: sukunimi
toolkit label: surname @en
toolkit label: uzvārds @lv
toolkit label: επώνυμο @el
toolkit label: لقب @ar
toolkit label: 姓 @zh-hans
has subproperty: P50291
lexical alias: surname.en
status: Published
type: Property
domain: C10004
label: a pour nom de famille @fr
label: ha come cognome @it
label: har efternavn @da
label: har etternavn @no
label: has surname @en
label: hat Nachname @de
label: heeft achternaam @nl
label: perekonnanimi @et
label: soyadı ile ilişkilidir @tr
label: té com a cognom @ca
label: uzvārds @lv
label: vezetékneve a következő: @hu
label: έχει επώνυμο @el
label: له اسم عائلة @ar
label: 有姓 @zh-hans
sub property of: henkilön nimi
definition: Bir kişiyi, aile adı olarak kullanılan bir kişinin adı olan bir isimle ilişkilendirir. @tr
definition: Correla una persona a un nome di persona che è usato come nome di famiglia. @it
definition: Hozzákapcsol egy személyt egy személynév nomenhez, amelyet családnévként használnak. @hu
definition: Liittää henkilön nomeniin, joka on henkilön nimi, jota käytetään sukunimenä.
definition: Met une personne en relation avec un nomen qui est un nom de personne utilisé comme nom de famille. @fr
definition: Relaciona una persona amb un nomen que és un nom de persona que s’usa com a nom de família. @ca
definition: Relateert een persoon aan een nomen dat is een naam van persoon die als familienaam gebruikt wordt. @nl
definition: Relaterer en person til et navn på person som er brukt som familienavn. @no
definition: Relaterer en person til et nomen, som er et navn på person, som anvendes som familienavn. @da
definition: Relates a person to a nomen that is a name of person that is used as a family name. @en
definition: Sasaista personu ar nomenu, kas ir personas vārds, kas tiek izmantots kā uzvārds. @lv
definition: Seostab isiku isiku nimega, mida kasutatakse perekonnanimena. @et
definition: Setzt eine Person in Beziehung zu einem Namen einer Person, der als Familienname benutzt wird. @de
definition: Συνδέει ένα φυσικό πρόσωπο με ένα όνομα που χρησιμοποιείται ως οικογενειακό όνομα. @el
definition: يربط شخصا باسم يُستخدم كاسم عائلة. @ar
definition: 将一个个人与作为用作家族姓氏的个人的一个名称的一个命名关联起来。 @zh-hans
scope note: Darunter fallen keine Familiennamen, die von den Römern in der Antike benutzt wurden. Ein Nachname kann aus einem einzelnen Buchstaben oder einer Initiale bestehen. @de
scope note: Ei hõlma Antiik-Roomas kasutatud perekonnanimesid. Perekonnanimi võib koosneda ka ühest tähest või initsiaalist. @et
scope note: Klasik dönem Romalıları tarafından aile adı olarak kullanılan isimler hariçtir. Bir soyadı, tek bir harften veya baş harften oluşabilir. @tr
scope note: Les noms utilisés comme noms de famille par les Romains de l’époque classique sont exclus. Un nom de famille peut consister en une seule lettre ou initiale. @fr
scope note: Muut kuin antiikin Roomassa käytetyt sukujen nimet. Sukunimi voi koostua yksittäisestä kirjaimesta tai alkukirjaimesta.
scope note: Namen gebruikt als familienamen door Romeinen uit de klassieke oudheid zijn uitgesloten. Een achternaam kan bestaan uit een enkele letter of initiaal. @nl
scope note: Names used as family names by Romans of classical times are excluded. A surname may consist of a single letter or initial. @en

etunimi
has element type: 3
instruction number: 18.5
toolkit definition: A nomen that is a name of person given at birth or at some later point in addition to, or instead of, a surname. @en
toolkit definition: Een nomen dat is een naam van persoon gegeven bij geboorte of op een later tijdstip ter aanvulling op, of in plaats van, een achternaam. @nl
toolkit definition: Egy személynév nomen, amely a születésekor kapott utónév, vagy később felvett, vagy a vezetéknév helyett használatos. @hu
toolkit definition: Ein Name einer Person, der ihr bei der Geburt oder zu einem späteren Zeitpunkt, zusätzlich oder anstatt eines Nachnamens, gegeben wird. @de
toolkit definition: Et navn på person som er gitt ved fødsel eller senere, i tillegg til, eller istedet for et etternavn. @no
toolkit definition: Isiku nimi, mis on antud pärast sündi või hiljem perekonnanimele lisaks või selle asemel. @et
toolkit definition: Nome di persona dato alla nascita o in qualche successivo momento in aggiunta, o al posto di, un cognome. @it
toolkit definition: Nomen que és un nom de persona donat al moment del naixement o en algun moment posterior, a més de, o en lloc d’un cognom. @ca
toolkit definition: Nomen qui est un nom de personne donné à la naissance ou plus tard en plus ou au lieu d’un nom de famille. @fr
toolkit definition: Nomen, doğumda veya daha sonraki bir noktada soyadına ek olarak veya onun yerine verilen bir kişinin ismi. @tr
toolkit definition: Nomen, joka on nimi, joka on annettu henkilölle syntymässä tai myöhempänä ajankohtana sukunimen lisäksi tai sen sijaan.
toolkit definition: Nomen, som er et navn på person, som blev givet til en person ved fødslen eller på et senere tidspunkt oveni, eller i stedet for, et efternavn. @da
toolkit definition: Vārds, kas dots personai piedzimstot vai kādā vēlākā brīdī papildus uzvārdam vai tā vietā @lv
toolkit definition: Ένα όνομα που δόθηκε σε ένα φυσικό πρόσωπο κατά τη γέννησή του ή κάποια στιγμή αργότερα επιπρόσθετα ή αντί επωνύμου. @el
toolkit definition: اسم أطلق على شخص عند ولادته أو لاحقا مضافا إليه اسم عائلة أو عوضا عنه. @ar
toolkit definition: 作为个人在出生时候或之后某时候被给予、姓以外附加或替代姓的一个名称的命名 @zh-hans
toolkit label: Vorname @de
toolkit label: eesnimi @et
toolkit label: etunimi
toolkit label: fornavn @da
toolkit label: given name @en
toolkit label: nom de pila @ca
toolkit label: nome di battesimo @it
toolkit label: prénom @fr
toolkit label: utóneve: @hu
toolkit label: verilen ad @tr
toolkit label: voornaam @nl
toolkit label: vārds [ne uzvārds] @lv
toolkit label: μικρό όνομα @el
toolkit label: اسم معطى @ar
toolkit label: 名 @zh-hans
has subproperty: P50292
lexical alias: givenName.en
status: Published
type: Property
domain: C10004
label: a pour prénom @fr
label: adı ile ilişkilidir @tr
label: eesnimi @et
label: ha come nome di battesimo @it
label: har fornavn @da
label: has given name @en
label: hat Vornamen @de
label: is voornaam @nl
label: té com a nom de pila @ca
label: utóneve a következő: @hu
label: vārds [ne uzvārds] @lv
label: έχει μικρό όνομα @el
label: له اسم أول @ar
label: 有名 @zh-hans
sub property of: henkilön nimi
definition: Bir kişiyi, doğumda veya daha sonraki bir noktada soyadına ek olarak veya onun yerine verilen bir kişinin adı olan bir isimle ilişkilendirir. @tr
definition: Correla una persona a un nome di persona dato alla nascita o in qualche successivo momento in aggiunta, o al posto di, un cognome. @it
definition: Hozzákapcsol egy személyt egy személynév nomenhez, amely a születésekor kapott utónév, vagy később felvett, vagy a vezetéknév helyett használatos. @hu
definition: Liittää henkilön nomeniin, joka on nimi, joka on annettu henkilölle syntymässä tai myöhempänä ajankohtana sukunimen lisäksi tai sen sijaan.
definition: Met une personne en relation avec un nomen qui est un nom de personne donné à la naissance ou plus tard en plus ou au lieu d’un nom de famille. @fr
definition: Relaciona una persona amb un nomen que és un nom de persona donat al moment del naixement o en algun moment posterior, a més de, o en lloc d’un cognom. @ca
definition: Relateert een persoon aan een nomen dat is een naam van persoon gegeven bij geboorte of op een later tijdstip ter aanvulling op, of in plaats van, een achternaam. @nl
definition: Relaterer en person til et navn på person som er gitt ved fødsel eller senere, i tillegg til, eller istedet for et etternavn. @no
definition: Relaterer en person til et nomen, som er et navn på person, som blev givet ved fødslen eller på et senere tidspunkt oveni, eller i stedet for, et efternavn. @da
definition: Relates a person to a nomen that is a name of person given at birth or at some later point in addition to, or instead of, a surname. @en
definition: Sasaista personu ar nomenu, kas ir personas vārds, kas dots personai piedzimstot vai kādā vēlākā brīdī papildus uzvārdam vai tā vietā. @lv
definition: Seostab isiku isiku nimega, mis on antud pärast sündi või hiljem perekonnanimele lisaks või selle asemel. @et
definition: Setzt eine Person in Beziehung zu einem Namen einer Person, der ihr bei der Geburt oder zu einem späteren Zeitpunkt, zusätzlich oder anstatt eines Nachnamens, gegeben wird. @de
definition: Συνδέει ένα φυσικό πρόσωπο με ένα όνομα που δόθηκε σε ένα φυσικό πρόσωπο κατά τη γέννησή του ή κάποια στιγμή αργότερα επιπρόσθετα ή αντί επωνύμου. @el
definition: يربط شخصا باسم أطلق على شخص عند ولادته أو لاحقا، مضافا إليه اسم العائلة أو عوضا عنه. @ar
definition: 将一个个人与作为个人在出生时候或之后某时候被给予、姓以外附加或替代姓的一个名称的命名关联起来。 @zh-hans

uudelleenmiksaaja (toimija) teoksessa
has element type: 2
instruction number: 18.5
see also: DJ (toimija) ekspressiossa
toolkit definition: A work that involves a responsibility of an agent for manipulating, recombining, mixing, and reproducing previously recorded sounds. @en
toolkit definition: Darbs, kas ietver aģenta atbildību par iepriekš ierakstītas skaņas manipulāciju, pārkombinēšanu, miksēšanu un atkārtotu atskaņošanu. @lv
toolkit definition: Een werk dat met zich meebrengt een verantwoordelijkheid van een actor voor manipuleren, opnieuw combineren, mixen en reproduceren van eerder opgenomen geluiden. @nl
toolkit definition: Ein Werk, bei dem ein Akteur für das Bearbeiten, Rekombinieren, Mischen und Reproduzieren einer bestehenden Tonaufnahme verantwortlich ist. @de
toolkit definition: Et verk som involverer ansvar for en agent for manipulering, sammensetting, miksing og reproduksjon av tidligere innspilt lyd. @no
toolkit definition: Obra que implica una responsabilitat d’un agent en la manipulació, la recombinació, la mescla i la reproducció de sons enregistrats prèviament. @ca
toolkit definition: Opera che implica la responsabilità di un agente nel manipolare, ricombinare, mescolare e riprodurre suoni precedentemente registrati. @it
toolkit definition: Teos, jossa toimija on vastuussa ääniteoksen luomisesta manipuloimalla, yhdistelemällä, sekoittamalla ja uudelleen tuottamalla aiemmin äänitettyjä ääniä.
toolkit definition: Teos, mis sisaldab tegija vastutust varem salvestatud helide manipuleerimise, ümberkombineerimise, segamise ja taastekitamise eest. @et
toolkit definition: Værk, som involverer en agents ansvar for manipulering, rekombinering, mixing og gengivelse af tidligere indspillede lyde. @da
toolkit definition: remixművésze: @hu
toolkit definition: Önceden kaydedilmiş sesleri düzenleme, yeniden birleştirme, miksleme ve yeniden üretmek için bir temsilcinin sorumluluğunu içeren bir eser. @tr
toolkit definition: Œuvre qui comporte une responsabilité de la part d’un agent consistant à manipuler, recombiner, mixer et reproduire des sons préalablement enregistrés. @fr
toolkit definition: Ένα ακουστικό έργο που δημιουργήθηκε μέσω του χειρισμού, της επανασύνθεσης, της μίξης και της αναπαραγωγής προηγούμενα ηχογραφημένων ήχων. @el
toolkit definition: عمل يترتب عليه مسئولية وكيل عن معالجة المواد السمعية المسجلة مسبقًا وإعادة تجميعها ومزجها واستنساخها. @ar
toolkit definition: 涉及操纵、重新组合、混合和复制事先录制的声音的一个行为者的责任的一种作品 @zh-hans
toolkit label: Akteur als Remix Artist von @de
toolkit label: Egy mű, amelyhez hozzátartozik egy ágens felelőssége korábbi hangfelvételek manipulálásáért, újrakombinálásáért, keveréséért és reprodukálásáért. @hu
toolkit label: agent artista de remescla de @ca
toolkit label: agent remixeur de @fr
toolkit label: agent, som er remixer af @da
toolkit label: artista del remix agente di @it
toolkit label: ir remiksa mākslinieks (aģents) @lv
toolkit label: remiks sanatçısı temsilci @tr
toolkit label: remikser av (agent) @no
toolkit label: remiksija (tegija) teoses @et
toolkit label: remix artist agent of @en
toolkit label: remixartiest-actor van @nl
toolkit label: uudelleenmiksaaja (toimija) teoksessa
toolkit label: καλλιτέχνης διασκευών φορέας του @el
toolkit label: وكيل فنان ريميكس @ar
toolkit label: ……的合成艺术家行为者 @zh-hans
has subproperty: uudelleenmiksaaja (henkilö) teoksessa
has subproperty: uudelleenmiksaaja (yhteistoimija) teoksessa
has subproperty: P50293
lexical alias: remixArtistAgentOf.en
status: Published
type: Property
domain: C10002
label: er agent, som er remixer af @da
label: er remikser av (agent) @no
label: est un agent remixeur de @fr
label: ir remiksa mākslinieks (aģents) @lv
label: is remix artist agent of @en
label: is remixartiest-actor van @nl
label: ist Akteur als Remix Artist von @de
label: remiksija (tegija) teoses @et
label: remix sanatçısı temsilcisidir @tr
label: remixművész ágense a következőnek: @hu
label: è artista di remix agente di @it
label: és agent artista de remescla de @ca
label: είναι καλλιτέχνης διασκευών φορέας του @el
label: هو وكيل فنان ريميكس لـ @ar
label: 是……的合成艺术家行为者 @zh-hans
sub property of: teoksen tekijä (toimija) teoksessa
alternative label: Nem tartoznak ide sem azok a remixelési tevékenységek, amelyek nem változtatják meg lényegesen az eredeti mű jellegét és tartalmát, sem a rögzített sávok látszólag egy folyamatos sávként való összemixelése. @hu
alternative label: Remix Artist von @de
alternative label: artista de remescla de @ca
alternative label: artista de remix de @es
alternative label: artista del remix di @it
alternative label: remiks sanatçısı @tr
alternative label: remikser av @no
alternative label: remiksija teoses @et
alternative label: remix artist of @en
alternative label: remixer af @da
alternative label: remixeur de @fr
alternative label: äänitaiteilijana ääniteoksessa
alternative label: καλλιτέχνης remix του @el
alternative label: فنان ريميكس @ar
alternative label: ……的合成艺术家 @zh-hans
definition: Bir temsilciyi, önceden kaydedilmiş sesleri düzenlemek, yeniden birleştirmek, karıştırmak ve çoğaltmakla görebli bir temsilcinin sorumluluğunu içeren bir eserle ilişkilendirir. @tr
definition: Correla un agente a un'opera che implica la responsabilità di un agente nel manipolare, ricombinare, mescolare e riprodurre suoni precedentemente registrati. @it
definition: Hozzákapcsol egy ágenst egy műhöz, amelyhez hozzátartozik egy ágens felelőssége korábbi hangfelvételek manipulálásáért, újrakombinálásáért, keveréséért és reprodukálásáért. @hu
definition: Liittää toimijan teokseen, jossa toimija on vastuussa ääniteoksen luomisesta manipuloimalla, yhdistelemällä, sekoittamalla ja uudelleen tuottamalla aiemmin äänitettyjä ääniä.
definition: Met un agent en relation avec une œuvre qui comporte une responsabilité de la part d’un agent consistant à manipuler, recombiner, mixer et reproduire des sons préalablement enregistrés. @fr
definition: Relaciona un agent amb una obra que implica una responsabilitat d’un agent en la manipulació, la recombinació, la mescla i la reproducció de sons enregistrats prèviament. @ca

roolittaja (toimija) teoksessa
has element type: 2
instruction number: 18.5
toolkit definition: A work that involves a responsibility of an agent for most aspects of assigning roles and duties to performers. @en
toolkit definition: Darbs, kas ietver aģenta atbildību par lomu sadali un pienākumu piešķiršanu izpildītājiem. @lv
toolkit definition: Een werk dat met zich meebrengt een verantwoordelijkheid van een actor voor de meeste aspecten van het toewijzen van rollen en taken aan uitvoerders. @nl
toolkit definition: Egy mű, amelyhez hozzátartozik egy ágens felelőssége a szerepek és feladatok előadókra osztásának legtöbb vonatkozásáért. @hu
toolkit definition: Ein Werk, bei dem ein Akteur für die meisten Aspekte der Rollenvergabe und Aufgabenzuteilung an Ausführende verantwortlich ist. @de
toolkit definition: Et verk som involverer ansvar for en agent for de fleste aspekter ved rollefordeling og oppgaver mellom utøvere. @no
toolkit definition: Obra que implica una responsabilitat d’un agent en la majoria dels aspectes de l’assignació de papers i funcions als intèrprets. @ca
toolkit definition: Opera che implica la responsabilità di un agente per diversi aspetti nell'assegnare ruoli e compiti agli attori. @it
toolkit definition: Sanatçılara roller ve görevler atamanın çoğu yönü için bir temsilcinin sorumluluğunu içeren bir eser. @tr
toolkit definition: Teos, jossa toimija on vastuussa useimmista esiintyjien roolien ja tehtävien antamiseen kuuluvista tehtävistä.
toolkit definition: Teos, mis sisaldab tegija vastutust esitajatele rollide ja ülesannete jagamise enamiku aspektide eest. @et
toolkit definition: Værk, som involverer en agents ansvar for de fleste aspekter ved tildeling af roller og opgaver til udøvere. @da
toolkit definition: Œuvre qui comporte une responsabilité de la part d’un agent en ce qui concerne la majeure partie des aspects relatifs à la distribution des rôles et des fonctions aux interprètes. @fr
toolkit definition: Ένα έργο, το οποίο ενσωματώνει την ευθύνη της συνεισφοράς για τις περισσότερες πτυχές ανάθεσης μερών και καθηκόντων στους εκτελεστές. @el
toolkit definition: عمل يترتب عليه مسئولية وكيل عن تحديد معظم الجوانب المتعلقة بأدوار الممثلين ومهامهم. @ar
toolkit definition: 涉及给演员分配角色和任务的大多数工作的一个行为者的责任的一种作品 @zh-hans
toolkit label: Akteur als Casting Director von @de
toolkit label: agent directeur de casting de @fr
toolkit label: agent director de càsting de @ca
toolkit label: agent, som er caster af @da
toolkit label: casting director agent of @en
toolkit label: casting director for (agent) @no
toolkit label: casting'u juht (tegija) teoses @et
toolkit label: castingdirector-actor van @nl
toolkit label: direttore del casting agente di @it
toolkit label: ir aktieru atlases režisors (aģents) @lv
toolkit label: kast yönetmeni temsilcisi @tr
toolkit label: roolittaja (toimija) teoksessa
toolkit label: szereposztó rendező ágense: @hu
toolkit label: διευθυντής διανομής ρόλων φορέας του @el
toolkit label: وكيل مدير لطاقم التمثيل @ar
toolkit label: ……的角色导演行为者 @zh-hans
has subproperty: roolittaja (henkilö) teoksessa
has subproperty: roolittaja (yhteistoimija) teoksessa
has subproperty: P50294
lexical alias: castingDirectorAgentOf.en
status: Published
type: Property
domain: C10002
label: cast yönetmeni temsilcisidir @tr
label: casting'u juht (tegija) teoses @et
label: er agent, som er caster af @da
label: er casting director for (agent) @no
label: est un agent directeur de casting de @fr
label: ir aktieru atlases režisors (aģents) @lv
label: is casting director agent of @en
label: is castingdirector-actor van @nl
label: ist Akteur als Casting Director von @de
label: szereposztó rendező ágense a következőnek: @hu
label: è direttore del casting di @it
label: és agent director de càsting de @ca
label: είναι διευθυντής διανομής ρόλων φορέας του @el
label: هو وكيل مدير لطاقم التمثيل لـ @ar
label: 是……的角色导演行为者 @zh-hans
sub property of: teoksen tekijä (toimija) teoksessa
alternative label: Casting Director von @de
alternative label: casting director af @da
alternative label: casting director for @no
alternative label: casting director of @en
alternative label: casting'u juht teoses @et
alternative label: directeur de casting de @fr
alternative label: director de casting de @es
alternative label: director de càsting de @ca
alternative label: direttore del casting di @it
alternative label: kast yönetmeni @tr
alternative label: roolittajana esityksessä
alternative label: szereposztó rendezője: @hu
alternative label: διευθυντής διανομής ρόλων του @el
alternative label: مدير طاقم التمثيل @ar
alternative label: ……的角色导演 @zh-hans
definition: Bir temsilciyi, oyunculara roller ve görevler atamanın çoğu yönüyle ilişkin bir temsilcinin sorumluluğunu içeren bir eserle ilişkilendirir. @tr
definition: Correla un agente a un'opera che implica la responsabilità di un agente per diversi aspetti nell'assegnare ruoli e compiti agli attori. @it
definition: Hozzákapcsol egy ágenst egy műhöz, amelyhez hozzátartozik egy ágens felelőssége a szerepek és feladatok előadókra osztásának legtöbb vonatkozásáért. @hu
definition: Liittää toimijan teokseen, jossa toimija on vastuussa useimmista esiintyjien roolien ja tehtävien antamiseen kuuluvista tehtävistä.
definition: Met un agent en relation avec une œuvre qui comporte une responsabilité de la part d’un agent en ce qui concerne la majeure partie des aspects relatifs à la distribution des rôles et des fonctions aux interprètes. @fr
definition: Relaciona un agent amb una obra que implica una responsabilitat d’un agent en la majoria dels aspectes de l’assignació de papers i funcions als intèrprets. @ca
definition: Relateert een actor aan een werk dat met zich meebrengt een verantwoordelijkheid van een actor voor de meeste aspecten van het toewijzen van rollen en taken aan uitvoerders. @nl

äänituottaja (toimija) teoksessa
has element type: 2
instruction number: 18.5
toolkit definition: A work that involves a responsibility of an agent for managing most of the business aspects of an audio recording. @en
toolkit definition: Bir ses kaydının ticari yönlerinin çoğunu yönetmek için bir temsilcinin sorumluluğunu içeren bir eser. @tr
toolkit definition: Darbs, kas ietver aģenta atbildību par lielāko daļu skaņu ieraksta biznesa aspektiem. @lv
toolkit definition: Een werk dat met zich meebrengt een verantwoordelijkheid van een actor voor het merendeel van de zakelijke aspecten van de productie van een geluidsopname. @nl
toolkit definition: Egy mű, amelyhez hozzátartozik egy ágens felelőssége egy audiofelvétel legtöbb üzleti vonatkozásának menedzseléséért. @hu
toolkit definition: Ein Werk, bei dem ein Akteur für die meisten geschäftlichen Aspekte einer Audioaufnahme verantwortlich ist. @de
toolkit definition: Et verk som involverer ansvar for en agent for å styre de fleste forretningsmessige aspektene ved et lydopptak. @no
toolkit definition: Obra que implica una responsabilitat d’un agent en la gestió de la majoria dels aspectes comercials d’un enregistrament àudio. @ca
toolkit definition: Opera che implica la responsabilità di un agente nel gestire gli aspetti tecnici del suono durante i processi di registrazione, missaggio e riproduzione. @it
toolkit definition: Teos, jossa toimija on vastuussa useimpien äänitteen liiketoiminnallisten tehtävien hoitamisesta.
toolkit definition: Teos, mis sisaldab tegija vastutust helisalvestuse enamiku äriliste aspektide korraldamise eest. @et
toolkit definition: Værk, som involverer en agents ansvar for at håndtere de fleste forretningsmæssige aspekter af en lydoptagelse. @da
toolkit definition: Œuvre qui comporte une responsabilité de la part d’un agent consistant à gérer la majeure partie des aspects commerciaux d’un enregistrement audio. @fr
toolkit definition: Ένα έργο που περιλαμβάνει την ευθύνη για τις περισσότερες επιχειρηματικές πτυχές μιας ηχογράφησης. @el
toolkit definition: عمل يترتب عليه مسئولية وكيل لإدارة معظم جوانب الأعمال التجارية للتسجيل الصوتي. @ar
toolkit definition: 涉及音频录制工作大多数方面商业运作之管理的一个行为者的责任的一种作品 @zh-hans
toolkit label: Akteur als Produzentin/Produzent einer Tonaufnahme von @de
toolkit label: agent producteur audio de @fr
toolkit label: agent productor d’àudio de @ca
toolkit label: agent, som er lydproducer af @da
toolkit label: audio producer agent of @en
toolkit label: audio-producer ágense: @hu
toolkit label: audioprodutsent (tegija) teoses @et
toolkit label: geluidsproducent-actor van @nl
toolkit label: ir skaņu ierakstu producents (aģents) @lv
toolkit label: lydprodusent for (agent) @no
toolkit label: produttore audio agente di @it
toolkit label: ses yapımcısı temsilci @tr
toolkit label: äänituottaja (toimija) teoksessa
toolkit label: παραγωγός ήχου φορέας του @el
toolkit label: وكيل منتج مواد صوتية @ar
toolkit label: ……的音频制作者行为者 @zh-hans
has subproperty: äänituottaja (henkilö) teoksessa
has subproperty: äänituottaja (yhteistoimija) teoksessa
has subproperty: P50295
lexical alias: audioProducerAgentOf.en
status: Published
type: Property
domain: C10002
label: audio-producer ágense a következőnek: @hu
label: audioprodutsent (tegija) teoses @et
label: er agent, som er lydproducer af @da
label: er lydprodusent for (agent) @no
label: est un agent producteur audio de @fr
label: ir skaņu ierakstu producents (aģents) @lv
label: is audio producer agent of @en
label: is geluidsproducent-actor van @nl
label: ist Akteur als Produzentin/Produzent einer Tonaufnahme von @de
label: ses yapımcısı temsilcisidir @tr
label: è produttore audio agente di @it
label: és agent productor d’àudio de @ca
label: είναι παραγωγός ήχου φορέας του @el
label: هو وكيل منتج مواد صوتية لـ @ar
label: 是……的音频制作者行为者 @zh-hans
sub property of: tuottaja (toimija) teoksessa
alternative label: Produzent einer Tonaufnahme von @de
alternative label: audio producer of @en
alternative label: audio-producere: @hu
alternative label: audioprodutsent teoses @et
alternative label: lydproducer af @da
alternative label: lydprodusent for @no
alternative label: producteur audio de @fr
alternative label: productor de audio de @es
alternative label: productor d’àudio de @ca
alternative label: produttore audio di @it
alternative label: ses yapımcısı @tr
alternative label: tuottajana äänitteessä
alternative label: παραγωγός ήχου του @el
alternative label: منتج مواد صوتية @ar
alternative label: ……的音频制作者 @zh-hans
definition: Bir temsilciyi, bir ses kaydının ticari yönlerinin çoğunu yönetmekle görevli bir temsilcinin sorumluluğunu içeren bir eserle ilişkilendirir.. @tr
definition: Correla un agente a un'opera che implica la responsabilità di un agente nel gestire gli aspetti tecnici del suono durante i processi di registrazione, missaggio e riproduzione. @it
definition: Hozzákapcsol egy ágenst egy műhöz, amelyhez hozzátartozik egy ágens felelőssége egy audiofelvétel legtöbb üzleti vonatkozásának menedzseléséért. @hu
definition: Liittää toimijan teokseen, jossa toimija on vastuussa useimpien äänitteen liiketoiminnallisten tehtävien hoitamisesta.
definition: Met un agent en relation avec une œuvre qui comporte une responsabilité de la part d’un agent consistant à gérer la majeure partie des aspects commerciaux d’un enregistrement audio. @fr
definition: Relaciona un agent amb una obra que implica una responsabilitat d’un agent en la gestió de la majoria dels aspectes comercials d’un enregistrament àudio. @ca
definition: Relateert een actor aan een werk dat met zich meebrengt een verantwoordelijkheid van een actor voor het merendeel van de zakelijke aspecten van de productie van een geluidsopname. @nl

ääniteknikko (toimija) ekspressiossa
has element type: 2
instruction number: 18.5
toolkit definition: An expression that includes a contribution by an agent of managing the technical aspects of sound during the processes of recording, mixing, and reproduction. @en
toolkit definition: Een expressie die omvat een bijdrage door een actor door beheren van de technische aspecten van geluid gedurende de procedures van opname, mixen en reproductie. @nl
toolkit definition: Egy kifejezési forma, amely magában foglalja egy ágens közreműködését a hang technikai vonatkozásainak kezelésében a rögzítés, a keverés és a sokszorosítás folyamatában. @hu
toolkit definition: Eine Expression, zu der ein Akteur beiträgt, indem er die technischen Aspekte für den Ton während der Aufnahme, des Misch-Verfahrens und der Vervielfältigung handhabt. @de
toolkit definition: Ekspressio, jonka tekemiseen toimija osallistuu huolehtimalla äänen teknisistä näkökohdista äänitys-, miksaus- ja äänentoistoprosessien aikana.
toolkit definition: Espressione che implica la responsabilità di un agente nel gestire gli aspetti tecnici del suono durante i processi di registrazione, missaggio e riproduzione. @it
toolkit definition: Et uttrykk som inkluderer et bidrag fra en agent i form av å styre de tekniske aspektene ved lyd under innspilling, miksing og gjengivelse. @no
toolkit definition: Expression qui intègre une contribution de la part d’un agent consistant à gérer les aspects techniques du son durant les processus d’enregistrement, de mixage et de reproduction. @fr
toolkit definition: Expressió que inclou una contribució d’un agent gestionant els aspectes tècnics del so durant els processos d’enregistrament, mescla i reproducció. @ca
toolkit definition: Izteiksme, kas ietver aģenta ieguldījumu, pārvaldot skaņas tehnisko aspektu ierakstīšanas, miksēšanas un pavairošanas laikā. @lv
toolkit definition: Kayıt, miksaj ve reprodüksiyon süreçlerinde sesin teknik yönlerini yöneten bir temsilcinin katkısını içeren bir anlatım. @tr
toolkit definition: Udtryk, som omfatter en agents bidrag ved at håndtere de tekniske lydaspekter under indspilning, mixning og reproduktion. @da
toolkit definition: Väljendus, millesse tegija on andnud panuse, tegeldes heli tehniliste aspektidega salvestamise, miksimise ja taasesituse protsesside ajal. @et
toolkit definition: Μια έκφραση ενός έργου που ενσωματώνει τη συνεισφορά της διαχείρισης των τεχνικών πτυχών του ήχου κατά τις διαδικασίες της ηχογράφησης, της μίξης και της αναπαραγωγής στο ακουστικό περιεχόμενο. @el
toolkit definition: تعبيرة تتضمن إسهام وكيل في إدارة الجوانب الفنية للصوت أثناء عمليات التسجيل والمزج والاستنساخ. @ar
toolkit definition: 包括声音的录制、合成和复制过程技术方面管理的一个行为者的贡献的一种内容表达 @zh-hans
toolkit label: Akteur als Tontechnikerin/Tontechniker von @de
toolkit label: agent enginyer d’àudio de @ca
toolkit label: agent ingénieur du son de @fr
toolkit label: agent, som er lydtekniker af @da
toolkit label: audio engineer agent of @en
toolkit label: geluidstechnicus-actor van @nl
toolkit label: hangmester ágense: @hu
toolkit label: heliinsener (tegija) väljenduses @et
toolkit label: ingegnere dell'audio agente di @it
toolkit label: ir skaņu inženieris (aģents) @lv
toolkit label: lydtekniker for (agent) @no
toolkit label: ses mühendisi temsilcisi @tr
toolkit label: ääniteknikko (toimija) ekspressiossa
toolkit label: μηχανικός ήχου φορέας του @el
toolkit label: وكيل مهندس صوتيات @ar
toolkit label: ……的音频工程师行为者 @zh-hans
has subproperty: äänittäjä (toimija) ekspressiossa
has subproperty: miksaaja (toimija) ekspressiossa
has subproperty: ääniteknikko (henkilö) ekspressiossa
has subproperty: ääniteknikko (yhteistoimija) ekspressiossa
has subproperty: P50296
lexical alias: audioEngineerAgentOf.en
status: Published
type: Property
domain: C10002
label: er agent, som er lydtekniker af @da
label: er lydtekniker for (agent) @no
label: est un agent ingénieur du son de @fr
label: hangmester ágense a következőnek: @hu
label: heliinsener (tegija) väljenduses @et
label: ir skaņu inženieris (aģents) @lv
label: is audio engineer agent of @en
label: is geluidstechnicus-actor van @nl
label: ist Akteur als Tontechnikerin/Tontechniker von @de
label: ses mühendisi temsilcisidir @tr
label: è ingegnere audio agente di @it
label: és agent enginyer d’àudio de @ca
label: είναι μηχανικός ήχου φορέας του @el
label: هو وكيل مهندس صوت لـ @ar
label: 是……的音频工程师行为者 @zh-hans
sub property of: esitykseen osallinen toimija ekspressiossa
alternative label: Tontechniker von @de
alternative label: audio engineer of @en
alternative label: enginyer d’àudio de @ca
alternative label: hangmestere: @hu
alternative label: heliinsener väljenduses @et
alternative label: ingegnere dell'audio di @it
alternative label: ingeniero de audio de @es
alternative label: ingénieur du son de @fr
alternative label: lydtekniker af @da
alternative label: lydtekniker for @no
alternative label: ses mühendisi @tr
alternative label: ääniteknikkona ekspressiossa
alternative label: μηχανικός ήχου του @el
alternative label: مهندس صوت @ar
alternative label: ……的音频工程师 @zh-hans
definition: Bir temsilciyi, kayıt, miksaj ve yeniden üretim süreçleri sırasında sesin teknik yönlerini yöneten bir temsilcinin katkısını içeren bir anlatımla ilişkilendirir. @tr
definition: Correla un agente a un'espressione che implica la responsabilità di un agente nel gestire gli aspetti tecnici del suono durante i processi di registrazione, missaggio e riproduzione. @it
definition: Hozzákapcsol egy ágenst egy kifejezési formához, amely magában foglalja egy ágens közreműködését a hang technikai vonatkozásainak kezelésében a rögzítés, a keverés és a sokszorosítás folyamatában. @hu
definition: Liittää toimijan teoksen ekspressioon, joka sisältää äänisisällön teknisten ominaisuuksien valvomisen äänityksen, miksauksen ja toiston aikana.
definition: Met un agent en relation avec une expression qui intègre une contribution de la part d’un agent consistant à gérer les aspects techniques du son durant les processus d’enregistrement, de mixage et de reproduction. @fr

miksaaja (toimija) ekspressiossa
has element type: 2
instruction number: 18.5
see also: uudelleenmiksaaja (toimija) teoksessa
toolkit definition: An expression that includes a contribution by an agent of manipulating, mixing and assembling the multiple tracks of an audio recording. @en
toolkit definition: Bir ses kaydının birden çok parçasını manipüle eden, karıştıran ve bir araya getiren bir temsilcinin katkısını içeren bir anlatım. @tr
toolkit definition: Een expressie die omvat een bijdrage door een actor door manipuleren, mixen en samenstellen van meerdere sporen van een geluidsopname. @nl
toolkit definition: Eine Expression, zu der ein Akteur beiträgt, indem er mehrere Tonspuren einer Aufnahme bearbeitet, mischt und zusammenlegt. @de
toolkit definition: Ekspressio, jonka tekemiseen toimija osallistuu käsittelemällä, miksaamalla ja yhdistelemällä useampia äänitteen raitoja.
toolkit definition: Espressione che coinvolge un contributo da parte di un agente nel manipolare, missare e assemblare le tracce multiple di una registrazione audio. @it
toolkit definition: Et uttrykk som inkluderer et bidrag fra en agent i form av å manipulere, mikse og sette sammen de ulike lydsporene i et lydopptak. @no
toolkit definition: Expression qui intègre une contribution de la part d’un agent consistant à manipuler, à mixer et à assembler les différentes pistes d’un enregistrement audio. @fr
toolkit definition: Expressió que inclou una contribució d’un agent en la manipulació, la mescla i el muntatge de les diverses pistes d’un enregistrament àudio. @ca
toolkit definition: Izteiksme, kas ietver aģenta ieguldījumu, miksējot un montējot audio ieraksta vairākus celiņus. @lv
toolkit definition: Udtryk, som omfatter en agents bidrag ved at manipulere, mixe og samle de forskellige lydspor på en optagelse. @da
toolkit definition: Väljendus, millesse tegija on andnud panuse, töödeldes, miksides ja monteerides mitmerealise salvestise heliradasid. @et
toolkit definition: hangkeverője: @hu
toolkit definition: Μια έκφραση ενός έργου που ενσωματώνει τη συνεισφορά του χειρισμού, της μίξης και της συγκέντρωσης πολλών κομματιών μιας ηχογράφησης στο ακουστικό περιεχόμενο . @el
toolkit definition: تعبيرة تتضمن إسهام وكيل في معالجة المسارات المتعددة لتسجيل صوتي ومزجها وتجميعها. @ar
toolkit definition: 包括操纵、合成和聚集一个录音的多个音轨的一个行为者的贡献的一种内容表达 @zh-hans
toolkit label: Akteur als Mischtontechnikerin/Mischtontechniker von @de
toolkit label: Egy kifejezési forma, amely magában foglalja egy ágens közreműködését egy hangfelvétel sávjainak manipulálásában, keverésében és összeállításában. @hu
toolkit label: Ses mühendisi temsilcisi @tr
toolkit label: agent enginyer de remescla de @ca
toolkit label: agent mixeur de son de @fr
toolkit label: agent, som er mixingtekniker af @da
toolkit label: ingegnere del mixaggio agente di @it
toolkit label: ir skaņu miksētājs (aģents) @lv
toolkit label: miksaaja (toimija) ekspressiossa
toolkit label: miksetekniker for (agent) @no
toolkit label: miksimisinsener (tegija) väljenduses @et
toolkit label: mixing engineer agent of @en
toolkit label: mixtechnicus-actor van @nl
toolkit label: μηχανικός μείξης φορέας του @el
toolkit label: وكيل مهندس مكساج @ar
toolkit label: ……的合成工程师行为者 @zh-hans
has subproperty: miksaaja (henkilö) ekspressiossa
has subproperty: miksaaja (yhteistoimija) ekspressiossa
has subproperty: P50297
lexical alias: mixingEngineerAgentOf.en
status: Published
type: Property
domain: C10002
label: er agent, som er mixingtekniker af @da
label: er miksetekniker for (agent) @no
label: est un agent mixeur de son de @fr
label: hangkeverő ágense a következőnek: @hu
label: ir skaņu miksētājs (aģents) @lv
label: is mixing engineer agent of @en
label: is mixtechnicus-actor van @nl
label: ist Akteur als Mischtontechnikerin/Mischtontechniker von @de
label: miksimisinsener (tegija) väljenduses @et
label: ses miksaj mühendisi temsilcisidir @tr
label: è ingegnere del mixaggio @it
label: és agent enginyer de remescla de @ca
label: είναι μηχανικός μείξης φορέας του @el
label: هو وكيل مهندس مكساج لـ @ar
label: 是……的合成工程师行为者 @zh-hans
sub property of: ääniteknikko (toimija) ekspressiossa
alternative label: Mischtontechniker von @de
alternative label: Nem tartoznak ide azok az új forrást eredményező újrakeverési tevékenységek, amelyek jelentősen megváltoztatják az eredeti forrás jellegét és tartalmát, sem a felvétel több sávjának keverése és összeállítása. @hu
alternative label: Ses mühendisi @tr
alternative label: enginyer de remescla de @ca
alternative label: ingegnere del missaggio @it
alternative label: ingeniero de mezcla de @es
alternative label: miksaajana ekspressiossa
alternative label: miksetekniker for @no
alternative label: miksimisinsener väljenduses @et
alternative label: mixeur de son de @fr
alternative label: mixing engineer af @da
alternative label: mixing engineer of @en
alternative label: μηχανικός μείξης του @el
alternative label: مهندس للمكساج @ar
alternative label: ……的合成工程师 @zh-hans
definition: Bir temsilciyi, bir ses kaydının birden çok parçasını değiştirme, karıştırma ve birleştirme konusunda bir temsilcinin katkısını içeren bir anlatımla ilişkilendirir. @tr
definition: Correla un agente a un'espressione che coinvolge un contributo da parte di un agente nel manipolare, missare e assemblare le tracce multiple di una registrazione audio. @it
definition: Hozzákapcsol egy ágenst egy kifejezési formához, amely magában foglalja egy ágens közreműködését egy hangfelvétel sávjainak manipulálásában, keverésében és összeállításában. @hu
definition: Liittää toimijan ekspressioon, jonka tekemiseen toimija osallistuu käsittelemällä, miksaamalla ja yhdistelemällä useampia äänitteen raitoja.
definition: Met un agent en relation avec une expression qui intègre une contribution de la part d’un agent consistant à manipuler, à mixer et à assembler les différentes pistes d’un enregistrement audio. @fr
definition: Relaciona un agent amb una expressió que inclou una contribució d’un agent en la manipulació, la mescla i el muntatge de les diverses pistes d’un enregistrament àudio. @ca

DJ (toimija) ekspressiossa
has element type: 2
instruction number: 18.5
see also: miksaaja (toimija) ekspressiossa
toolkit definition: An expression that includes a contribution by an agent of mixing recorded tracks together during a live performance or in a recording studio to appear as one continuous track. @en
toolkit definition: Bir canlı performans sırasında veya bir kayıt stüdyosunda kaydedilmiş parçaları tek bir sürekli parça olarak görünecek şekilde bir araya getiren bir temsilcinin katkısını içeren bir anlatım. @tr
toolkit definition: Een expressie die omvat een bijdrage door een actor door het samenmixen van geluidssporen gedurende een live optreden of in een opnamestudio om als één doorlopend spoor te lijken. @nl
toolkit definition: Egy kifejezési forma, amely magában foglalja egy ágens közreműködését felvett hangsávok élő előadás közben vagy egy hangstúdióban történő keverésében, hogy azok egy folyamatos műsorszámként jelenjenek meg. @hu
toolkit definition: Eine Expression, zu der ein Akteur beiträgt, indem er während eines Live-Auftritts oder in einem Aufnahme-Studio aufgenommene Einzelspuren (Kanäle) zu einem scheinbar ununterbrochen durchgehenden Klangerlebnis zusammen mischt. @de
toolkit definition: Ekspressio, jonka tekemiseen toimija osallistuu miksaamalla ääniraitoja yhteen yhtäjaksoiseksi raidaksi live-esityksessä tai äänitysstudiossa.
toolkit definition: Espressione che coinvolge un contributo da parte di un agente nel missare le tracceregistrate insieme durante uno spettacolo dal vivo o in uno studio di registrazione in modo da farle apparire come una traccia continua. @it
toolkit definition: Et uttrykk som inkluderer et bidrag fra en agent i form av å mikse sammen innspilte spor under en liveopptreden eller i et lydstudio slik at de framstår som ett sammenhengende spor. @no
toolkit definition: Expression qui intègre une contribution de la part d’un agent consistant à mixer ensemble des pistes enregistrées, durant une prestation en direct ou dans un studio d’enregistrement, pour donner l’impression d’une seule piste continue. @fr
toolkit definition: Expressió que inclou una contribució d’un agent mesclant pistes enregistrades conjuntament durant una actuació en directe o en un estudi de gravació perquè sembli una pista continua. @ca
toolkit definition: Izteiksme, kas ietver aģenta ieguldījumu, miksējot ierakstītus mūzikas celiņus dzīvās uzstāšanās laikā vai ierakstu studijā, lai radītu vienu nepārtrauktu ierakstu. @lv
toolkit definition: Udtryk, som omfatter en agents bidrag ved at mixe indspillede spor sammen under en live-optræden eller i et indspilningsstudie, så de fremstår som et uafbrudt spor. @da
toolkit definition: Väljendus, millesse tegija on andnud panuse, miksides salvestatud lugusid kokku üheks jätkuvaks looks, tehes seda elavas esituses või salvestusstuudios. @et
toolkit definition: Μια έκφραση ενός έργου που ενσωματώνει τη συνεισφορά της μίξης ηχογραφημένων κομματιών κατά τη διάρκεια μιας ζωντανής παράστασης ή σε ένα studio ηχογράφησης [με τέτοιον τρόπο], ώστε να εμφανίζονται ως ένα ενιαίο κομμάτι. @el
toolkit definition: تعبيرة تتضمن إسهام وكيل في مزج ألحان مسجلة أثناء أدائها مباشرة أو أثناء تسجيلها في استوديو لتبدو كمقطوعة واحدة مستمرة. @ar
toolkit definition: 包括在现场表演中或在录音工作室中混合已录制音轨使其出现为一个连续的音轨的一个行为者的贡献的一种内容表达 @zh-hans
toolkit label: Akteur als DJane/DJ von @de
toolkit label: DJ (tegija) väljenduses @et
toolkit label: DJ (toimija) ekspressiossa
toolkit label: DJ agent of @en
toolkit label: DJ agente di @it
toolkit label: DJ for (agent) @no
toolkit label: DJ temsilci @tr
toolkit label: DJ ágense: @hu
toolkit label: DJ φορέας του @el
toolkit label: agent discjòquei de @ca
toolkit label: agent disque-jockey de @fr
toolkit label: agent, som er dj af @da
toolkit label: deejay-actor van @nl
toolkit label: ir dīdžejs (aģents) @lv
toolkit label: وكيل منسق دي جي @ar
toolkit label: ……的打碟者行为者 @zh-hans
has subproperty: DJ (henkilö) ekspressiossa
has subproperty: DJ (yhteistoimija) ekspressiossa
has subproperty: P50298
lexical alias: djAgentOf.en
status: Published
type: Property
domain: C10002
label: DJ (tegija) väljenduses @et
label: DJ temsilcisidir @tr
label: DJ ágense a következőnek: @hu
label: er DJ for (agent) @no
label: er agent, som er dj af @da
label: est un agent disque-jockey de @fr
label: ir dīdžejs (aģents) @lv
label: is DJ agent of @en
label: is deejay-actor van @nl
label: ist Akteur als DJane/DJ von @de
label: è DJ agente di @it
label: és agent discjòquei de @ca
label: είναι DJ φορέας του @el
label: هو وكيل منسق دي جي @ar
label: 是……的打碟者行为者 @zh-hans
sub property of: esitykseen osallinen toimija ekspressiossa
alternative label: DJ @tr
alternative label: DJ de @es
alternative label: DJ di @it
alternative label: DJ for @no
alternative label: DJ of @en
alternative label: DJ von @de
alternative label: DJ väljenduses @et
alternative label: DJ του @el
alternative label: DJ:nä tuotannossa
alternative label: Nem tartoznak ide azok az új művet eredményező újrakeverési tevékenységek, amelyek jelentősen megváltoztatják az eredeti mű jellegét és tartalmát, sem a felvétel több sávjának keverése és összeállítása. @hu
alternative label: agent DJ de @fr
alternative label: agent disc-jockey de @fr
alternative label: discjòquei de @ca
alternative label: disque-jockey de @fr
alternative label: dj af @da
alternative label: منسق دي جي @ar
alternative label: ……的打碟者 @zh-hans
definition: Bir temsilciyi, canlı bir performans sırasında veya bir kayıt stüdyosunda kesintisiz bir parça olarak görünmek üzere kaydedilmiş parçaları karıştıran temsilcinin katkısını içeren bir anlatımla ilişkilendirir. @tr
definition: Correla un agente a un'espressione che coinvolge un contributo da parte di un agente nel missare le tracceregistrate insieme durante uno spettacolo dal vivo o in uno studio di registrazione in modo da farle apparire come una traccia continua. @it
definition: Hozzákapcsol egy ágenst egy kifejezési formához, amely magában foglalja egy ágens közreműködését felvett hangsávok élő előadás közben vagy egy hangstúdióban történő keverésében, hogy azok egy folyamatos műsorszámként jelenjenek meg. @hu
definition: Liittää toimijan ekspressioon, jonka tekemiseen toimija osallistuu miksaamalla ääniraitoja yhteen yhtäjaksoiseksi raidaksi live-esityksessä tai äänitysstudiossa.

dubbausohjaaja (toimija) ekspressiossa
has element type: 2
instruction number: 18.5
toolkit definition: An expression that includes a contribution by an agent of responsibility for the general management and supervision of the process of adding new dialogue or other sounds to complete a soundtrack. @en
toolkit definition: Bir film müziğini tamamlamak için yeni diyalog veya diğer sesleri ekleme sürecinin genel yönetimi ve denetiminden sorumlu bir temsilcinin katkısını içeren bir anlatım. @tr
toolkit definition: Een expressie die omvat een bijdrage door een actor door algeheel beheer en toezicht van het proces van toevoegen van nieuwe dialoog of andere geluiden om een geluidsspoor te completeren. @nl
toolkit definition: Egy kifejezési forma, amely magában foglalja egy ágens közreműködését új párbeszéd vagy más hangok hozzáadási folyamatának általános irányításában és felügyeletében egy hangsáv befejezése, teljessé tétele céljából. @hu
toolkit definition: Eine Expression, zu der ein Akteur beiträgt, indem er für das allgemeine Management und die Leitung beim Hinzufügen von neuem Dialog oder anderen Geräuschen verantwortlich ist, um die Tonspur zu vervollständigen. @de
toolkit definition: Ekspressio, jossa toimija on vastuussa uuden dialogin tai muiden äänien lisäämisprosessin yleisestä johtamisesst ja valvonnasta ekspression ääniraidan täydentämiseksi.
toolkit definition: Espressione che coinvolge un contributo da parte di un agente nella responsabilità della gestione generale e la supervisione del processo di aggiunta di nuovi dialoghi o altri suoni a una colonna sonora completa. @it
toolkit definition: Et uttrykk som inkluderer et bidrag fra en agent i form av ansvar for generell ledelse og kontroll av prosessen med å legge til ny dialog eller andre lyder for å komplettere et lydspor. @no
toolkit definition: Expression qui intègre une contribution de la part d’un agent consistant à être responsable de la gestion et de la supervision générales du processus visant à ajouter de nouveaux dialogues ou d’autres sons pour compléter une piste sonore. @fr
toolkit definition: Expressió que inclou una contribució d’un agent en la responsabilitat de la gestió general i la supervisió del procés d’afegir nou diàleg o altres sons per completar una banda sonora. @ca
toolkit definition: Izteiksme, kas ietver aģenta ieguldījumu, atbildot par vispārējo vadību un uzraudzību pār jaunu dialogu vai citu skaņu pievienošanu pabeigtam izteiksmes skaņu celiņam. @lv
toolkit definition: Udtryk, som omfatter en agents bidrag ved at have ansvar for den generelle ledelse af- og tilsyn med processen at tilføje ny dialog eller andre lyde for at fuldstændiggøre et soundtrack. @da
toolkit definition: Väljendus, millesse tegija on andnud panuse, vastutades väljenduse heliriba täiendamisel uue dialoogi või muude helide lisamise üldise juhtimise ja juhendamise eest. @et
toolkit definition: Μια έκφραση ενός έργου που ενσωματώνει την ευθύνη της συνεισφοράς για τη γενική διαχείριση και εποπτεία της διαδικασίας προσθήκης νέου διαλόγου ή άλλων ήχων για τη συμπλήρωση του ηχητικού κομματιού. @el
toolkit definition: تعبيرة تتضمن إسهام وكيل مسئول عن الإدارة العامة والإشراف على عملية إضافة حوار جديد أو أصوات أخرى لإكمال مقطع صوتي. @ar
toolkit definition: 包括总体管理和监督增加对话或其他声音以完成音轨的一个责任的一个行为者的贡献的一种内容表达 @zh-hans
toolkit label: Akteur als Synchronregisseurin/Synchronregisseur von @de
toolkit label: agent directeur de doublage de @fr
toolkit label: agent director de doblatge de @ca
toolkit label: agent, som er dubbinginstruktør af @da
toolkit label: direttore del doppiaggio agente di @it
toolkit label: dubbausohjaaja (toimija) ekspressiossa
toolkit label: dubbing director agent of @en
toolkit label: dublaaži režissöör (tegija) väljenduses @et
toolkit label: dublaj yönetmeni temsilcisi @tr
toolkit label: ir dublāžas režisors (aģents) @lv
toolkit label: stemmeregissør for (agent) @no
toolkit label: stemregisseur-actor van @nl
toolkit label: szinkronrendező ágense: @hu
toolkit label: διευθυντής μεταγλώττισης φορέας του @el
toolkit label: وكيل مخرج الدبلجة @ar
toolkit label: ……的混声导演行为者 @zh-hans
has subproperty: dubbausohjaaja (henkilö) ekspressiossa
has subproperty: dubbausohjaaja (yhteistoimija) ekspressiossa
has subproperty: P50299
lexical alias: dubbingDirectorAgentOf.en
status: Published
type: Property
domain: C10002
label: dublaaži režissöör (tegija) väljenduses @et
label: dublaj yönetmeni temsilcisidir @tr
label: er agent, som er dubbinginstruktør af @da
label: er stemmeregissør for (agent) @no
label: est un agent directeur de doublage de @fr
label: ir dublāžas režisors (aģents) @lv
label: is dubbing director agent of @en
label: is stemregisseur-actor van @nl
label: ist Akteur als Synchronregisseurin/Synchronregisseur von @de
label: szinkronrendező ágense a következőnek: @hu
label: è direttore del doppiaggio agente di @it
label: és agent director de doblatge de @ca
label: είναι διευθυντής μεταγλώττισης φορέας του @el
label: هو وكيل مخرج الدبلجة لـ @ar
label: 是……的混声导演行为者 @zh-hans
sub property of: esitykseen osallinen toimija ekspressiossa
alternative label: Synchronregisseur von @de
alternative label: directeur de doublage de @fr
alternative label: director de doblaje de @es
alternative label: director de doblatge de @ca
alternative label: direttore del doppiaggio di @it
alternative label: dubbausohjaajana produktiossa
alternative label: dubbing director of @en
alternative label: dubbinginstruktør af @da
alternative label: dublaaži režissöör väljenduses @et
alternative label: dublaj yönetmeni @tr
alternative label: stemmeregissør for @no
alternative label: szinkronrendezője: @hu
alternative label: διευθυντής μεταγλώττισης του @el
alternative label: مخرج الدبلجة @ar
alternative label: ……的混声导演 @zh-hans
definition: Bir temsilciyi, bir film müziğini tamamlamak için yeni diyalog veya diğer seslerin eklenmesi sürecinin genel yönetimi ve denetiminden sorumlu olan bir temsilcinin katkısını içeren bir anlatımla ilişkilendirir. @tr
definition: Correla un agente a un'espressione che coinvolge un contributo da parte di un agente nella responsabilità per la gestione generale e la supervisione del processo di aggiunta di nuovi dialoghi o altri suoni a una colonna sonora completa. @it
definition: Hozzákapcsol egy ágenst egy kifejezési formához, amely magában foglalja egy ágens közreműködését új párbeszéd vagy más hangok hozzáadási folyamatának általános irányításában és felügyeletében egy hangsáv befejezése, teljessé tétele céljából. @hu
definition: Liittää toimijan ekspressioon, jossa toimija on vastuussa uuden dialogin tai muiden äänien lisäämisprosessin yleisestä johtamisesta ja valvonnasta ekspression ääniraidan täydentämiseksi.
definition: Met un agent en relation avec une expression qui intègre une contribution de la part d’un agent consistant à être responsable de la gestion et de la supervision générales du processus visant à ajouter de nouveaux dialogues ou d’autres sons pour compléter une piste sonore. @fr
definition: Relaciona un agent amb una expressió que inclou una contribució d’un agent en la responsabilitat de la gestió general i la supervisió del procés d’afegir nou diàleg o altres sons per completar una banda sonora. @ca
definition: Relateert een actor aan een expressie die omvat een bijdrage door een actor door algeheel beheer en toezicht van het proces van toevoegen van nieuwe dialoog of andere geluiden om een geluidsspoor te completeren. @nl

musiikkiohjelmoija (toimija) ekspressiossa
has element type: 2
instruction number: 18.5
see also: teoksen säveltäjä (toimija) musiikkiteoksessa
toolkit definition: An expression that includes a contribution by an agent of using electronic audio devices or computer software to generate sounds. @en
toolkit definition: Een expressie die omvat een bijdrage door een actor door gebruik van elektronische geluidsapparatuur of computersoftware om geluiden te genereren. @nl
toolkit definition: Egy kifejezési forma, amely magában foglalja egy ágens közreműködését hangok generálásában elektronikus audioeszközök vagy számítógépes szoftver használatával. @hu
toolkit definition: Eine Expression, zu der ein Akteur beiträgt, indem er durch das Einsetzen elektronischer Audio-Geräte oder von Computerprogrammen Klangeffekte erzeugt. @de
toolkit definition: Ekspressio, jonka tekemiseen toimija osallistuu tuottamalla ääniä sähköisillä äänilaitteilla tai tietokoneohjelmilla.
toolkit definition: Espressione che coinvolge un contributo da parte di un agente nell'usare dispositivi audio elettronici o sditware di computer per generare suoni. @it
toolkit definition: Et uttrykk som inkluderer et bidrag fra en agent i form av å bruke elektroniske lydenheter eller programvare til å lage lyder. @no
toolkit definition: Expression qui intègre une contribution de la part d’un agent consistant à utiliser des appareils audio électroniques ou un logiciel pour générer des sons. @fr
toolkit definition: Expressió que inclou una contribució d’un agent usant mecanismes electrònics àudio o programari d’ordinador per generar sons. @ca
toolkit definition: Izteiksme, kas ietver aģenta ieguldījumu, izmantojot elektroniskas audioierīces un/vai datora programmatūru, lai radītu skaņu. @lv
toolkit definition: Ses üretmek için elektronik ses cihazları veya bilgisayar yazılımları kullanan bir temsilcinin katkısını içeren bir anlatım. @tr
toolkit definition: Udtryk, som omfatter en agents bidrag ved at bruge elektronisk lydapparatur eller computersoftware til at generere lyd. @da
toolkit definition: Väljendus, millesse tegija on andnud panuse, tekitades helisid elektrooniliste audioseadmete või arvutitarkvara abil. @et
toolkit definition: Μια έκφραση ενός μουσικού έργου που ενσωματώνει τη συνεισφορά της χρήσης ηλεκτρονικών συσκευών ήχου ή/και λογισμικό υπολογιστή για την παραγωγή ήχων. @el
toolkit definition: تعبيرة تتضمن إسهام وكيل في استخدام أجهزة الصوت الإلكترونية أو برمجيات الحاسب لتوليد أصوات. @ar
toolkit definition: 包括使用电子音频设备或计算机软件产生声音的一个行为者的贡献的一种内容表达 @zh-hans
toolkit label: Akteur als Musik-Programmiererin/Musik-Programmierer von @de
toolkit label: agent programador de música de @ca
toolkit label: agent programmeur musical de @fr
toolkit label: agent, som er musikprogrammør af @da
toolkit label: ir mūzikas programmētājs (aģents) @lv
toolkit label: music programmer agent of @en
toolkit label: music programmer-actor van @nl
toolkit label: musiikkiohjelmoija (toimija) ekspressiossa
toolkit label: musikkprogrammerer for (agent) @no
toolkit label: muusikaprogrammeerija (tegija) väljenduses @et
toolkit label: müzik programcısı temsilcisi @tr
toolkit label: programmista musicale agente di @it
toolkit label: zeneprogramozó ágense: @hu
toolkit label: μουσικός προγραμματιστής φορέας του @el
toolkit label: وكيل مبرمج موسيقي @ar
toolkit label: ……的音乐编程者行为者 @zh-hans
has subproperty: musiikkiohjelmoija (henkilö) ekspressiossa
has subproperty: musiikkiohjelmoija (yhteistoimija) ekspressiossa
has subproperty: P50300
lexical alias: musicProgrammerAgentOf.en
status: Published
type: Property
domain: C10002
label: er agent, som er musikprogrammør af @da
label: er musikkprogrammerer for (agent) @no
label: est un agent programmeur musical de @fr
label: ir mūzikas programmētājs (aģents) @lv
label: is music programmer agent of @en
label: is music programmer-actor van @nl
label: ist Akteur als Musik-Programmiererin/Musik-Programmierer von @de
label: muusikaprogrammeerija (tegija) väljenduses @et
label: müzik programcısı temsilcisidir @tr
label: zeneprogramozó ágense a következőnek: @hu
label: è programmista musicale agenti di @it
label: és agent programador de música de @ca
label: είναι μουσικός προγραμματιστής φορέας του @el
label: هو وكيل مبرمج لموسيقي لـ @ar
label: 是……的音乐编程者行为者 @zh-hans
sub property of: esitykseen osallinen toimija ekspressiossa
alternative label: Egy új zenei mű létrehozása nem tartozik ide. @hu
alternative label: Musik-Programmierer von @de
alternative label: music programmer of @en
alternative label: musiikkiohjelmoijana produktiossa
alternative label: musikkprogrammerer for @no
alternative label: musikprogrammør af @da
alternative label: muusikaprogrammeerija väljenduses @et
alternative label: müzik programcısı @tr
alternative label: programador de música de @ca
alternative label: programador musical de @es
alternative label: programmeur musical de @fr
alternative label: progrmmista musicale @it
alternative label: μουσικός προγραμματιστής του @el
alternative label: مبرمج موسيقي @ar
alternative label: ……的音乐编程者 @zh-hans
definition: Bir temsilciyi, ses üretmek için elektronik ses cihazları veya bilgisayar yazılımı kullanan bir temsilcinin katkısını içeren bir anlatımla ilişkilendirir. @tr
definition: Correla un agente a un'espressione che coinvolge un contributo da parte di un agente nell'usare dispositivi audio elettronici o software di computer per generare suoni. @it
definition: Liittää toimijan ekspressioon, jonka tekemiseen toimija osallistuu tuottamalla ääniä sähköisillä äänilaitteilla tai tietokoneohjelmilla.
definition: Met un agent en relation avec une expression qui intègre une contribution de la part d’un agent consistant à utiliser des appareils audio électroniques ou un logiciel pour générer des sons. @fr
definition: Relaciona un agent amb una expressió que inclou una contribució d’un agent usant mecanismes electrònics àudio o programari d’ordinador per generar sons. @ca
definition: Relateert een actor aan een expressie die omvat een bijdrage door een actor door gebruik van elektronische geluidsapparatuur of computersoftware om geluiden te genereren. @nl

sulautunut yhteisö
has element type: 2
instruction number: 29.5
toolkit definition: A corporate body who was absorbed by another corporate body. @en
toolkit definition: Asutus, mis on sulandunud teise asutusse. @et
toolkit definition: Başka bir tüzel kişi tarafından bünyesine alınan bir tüzel kişi. @tr
toolkit definition: Collectivité qui a été absorbée par une autre collectivité. @fr
toolkit definition: Een corporatie die opgenomen werd door een andere corporatie. @nl
toolkit definition: Egy testület, amelyet egy másik testület magába olvasztott. @hu
toolkit definition: Eine Körperschaft, die von einer anderen Körperschaft übernommen wird. @de
toolkit definition: En korporasjon som er innlemmet i en annen korporasjon. @no
toolkit definition: Ente che è stato assorbito da un altro ente. @it
toolkit definition: Entitat corporativa que va ser absorbida per una altra entitat corporativa. @ca
toolkit definition: Institūcija, kas iekļauta citā institūcijā. @lv
toolkit definition: Korporation, som blev indlemmet af en anden korporation. @da
toolkit definition: Yhteisö, joka on sulautunut toiseen yhteisöön.
toolkit definition: Ένα συλλογικό όργανο το οποίο απορροφήθηκε από/συγχωνεύθηκε με κάποιο άλλο συλλογικό όργανο. @el
toolkit definition: هيئة استحوذت عليها هيئة أخرى. @ar
toolkit definition: 被另一个团体吸收的一个团体 @zh-hans
toolkit label: absorbed corporate body @en
toolkit label: collectivité absorbée @fr
toolkit label: ente assorbito @it
toolkit label: entitat corporativa absorbida @ca
toolkit label: iekļautā institūcija @lv
toolkit label: indlemmet korporation @da
toolkit label: innlemmet korporasjon @no
toolkit label: kapsanan tüzel kişi @tr
toolkit label: magába olvasztott testülete: @hu
toolkit label: opgenomen corporatie @nl
toolkit label: sulandunud asutus @et
toolkit label: sulautunut yhteisö
toolkit label: Übernommene Körperschaft @de
toolkit label: απορροφούμενο συλλογικό όργανο @el
toolkit label: هيئة مُستحوذ عليها @ar
toolkit label: 被吸收的团体 @zh-hans
has subproperty: P50301
lexical alias: absorbedCorporateBody.en
status: Published
type: Property
domain: C10005
label: a pour collectivité absorbée @fr
label: ha come ente assorbito @it
label: har indlemmet korporation @da
label: har innlemmet korporasjon @no
label: has absorbed corporate body @en
label: hat übernommene Körperschaft @de
label: heeft opgenomen corporatie @nl
label: iekļautā institūcija @lv
label: kapsanmış tüzel kişi ile ilişkilidir @tr
label: magába olvasztott testülete a következő: @hu
label: sulandunud asutus @et
label: té com a entitat corporativa absorbida @ca
label: έχει απορροφούμενο συλλογικό όργανο @el
label: لها هيئة مستحوذ عليها @ar
label: 有被吸收的团体 @zh-hans
sub property of: yhteisöön liittyvä yhteisö
definition: Bir tüzel kişiyi, başka bir tüzel kişilik tarafından bünyesine katılan bir tüzel kişilikle ilişkilendirir. @tr
definition: Correla un ente a un ente che è stato assorbito da un altro ente. @it
definition: Hozzákapcsol egy testületet egy testülethez, amelyet egy másik testület magába olvasztott. @hu
definition: Liittää yhteisön yhteisöön, joka on sulautunut toiseen yhteisöön.
definition: Met une collectivité en relation avec une collectivité qui a été absorbée par une autre collectivité. @fr
definition: Relaciona una entitat corporativa amb una entitat corporativa que va ser absorbida per una altra entitat corporativa. @ca
definition: Relateert een corporatie aan een corporatie die opgenomen werd door een andere corporatie. @nl
definition: Relaterer en korporasjon til en korporasjon som er innlemmet i en annen korporasjon. @no
definition: Relaterer en korporation til en korporation, som blev indlemmet af en anden korporation. @da
definition: Relates a corporate body to a corporate body who was absorbed by another corporate body. @en
definition: Sasaista institūciju ar institūciju, kas iekļauta citā institūcijā. @lv
definition: Seostab asutuse asutusega, mis on sulandunud teise asutusse. @et
definition: Setzt eine Körperschaft in Beziehung zu einer Körperschaft, die von einer anderen Körperschaft übernommen wird. @de
definition: Συνδέει ένα συλλογικό όργανο με ένα συλλογικό όργανο, το οποίο απορροφήθηκε από/συγχωνεύθηκε με κάποιο άλλο συλλογικό όργανο. @el
definition: يربط هيئة بهيئة استحوذت عليها هيئة أخرى. @ar
definition: 将一个团体与被另一个团体吸收的一个团体关联起来。 @zh-hans

sulautunut yhteisöön
has element type: 2
instruction number: 29.5
toolkit definition: A corporate body who absorbed another corporate body. @en
toolkit definition: Asutus, mis sulandas teise asutuse. @et
toolkit definition: Başka bir tüzel kişiliği bünyesine katan bir tüzel kişilik. @tr
toolkit definition: Collectivité qui a absorbé une autre collectivité. @fr
toolkit definition: Een corporatie die een andere corporatie opgenomen heeft. @nl
toolkit definition: Egy testület, amely egy másik testületet magába olvasztott. @hu
toolkit definition: Eine Körperschaft, die eine andere Körperschaft übernimmt. @de
toolkit definition: En korporasjon som innlemmer en annen korporasjon. @no
toolkit definition: Ente che ha assorbito un altro ente. @it
toolkit definition: Entitat corporativa que va absorbir una altra entitat corporativa. @ca
toolkit definition: Institūcija, kas iekļauj sevī citu institūciju. @lv
toolkit definition: Korporation, som indlemmede en anden korporation. @da
toolkit definition: Yhteisö, johon toinen yhteisö on sulautunut.
toolkit definition: Ένα συλλογικό όργανο το οποίο απορρόφησε κάποιο άλλο συλλογικό όργανο. @el
toolkit definition: هيئة استحوذت على هيئة أخرى. @ar
toolkit definition: 吸收另一个团体的一个团体 @zh-hans
toolkit label: absorbing corporate body @en
toolkit label: collectivité absorbante @fr
toolkit label: ente che assorbe @it
toolkit label: entitat corporativa absorbent @ca
toolkit label: iekļāvējinstitūcija @lv
toolkit label: indlemmende korporation @da
toolkit label: innlemmende korporasjon @no
toolkit label: kapsayan tüzel kişi @tr
toolkit label: magába olvasztó testület: @hu
toolkit label: opnemende corporatie @nl
toolkit label: sulandunud asutusse @et
toolkit label: sulautunut yhteisöön
toolkit label: Übernehmende Körperschaft @de
toolkit label: απορροφητικό συλλογικό όργανο @el
toolkit label: هيئة مستحوذة @ar
toolkit label: 吸收团体 @zh-hans
has subproperty: P50302
lexical alias: absorbingCorporateBody.en
status: Published
type: Property
domain: C10005
label: a pour collectivité absorbante @fr
label: ha come ente che assorbe @it
label: har indlemmende korporation @da
label: har innlemmende korporasjon @no
label: has absorbing corporate body @en
label: hat übernehmende Körperschaft @de
label: heeft opnemende corporatie @nl
label: iekļāvējinstitūcija @lv
label: kapsayan tüzel kişi ile ilişkilidir @tr
label: magába olvasztó testülete a következő: @hu
label: sulandunud asutusse @et
label: té com a entitat corporativa absorbent @ca
label: έχει απορροφητικό συλλογικό όργανο @el
label: لها هيئة مستحوِذة @ar
label: 有吸收团体 @zh-hans
sub property of: yhteisöön liittyvä yhteisö
definition: Bir tüzel kişiyi, başka bir tüzel kişiyi bünyesine katan bir tüzel kişi ile ilişkilendirir. @tr
definition: Correla un ente a un ente che ha assorbito un altro ente. @it
definition: Hozzákapcsol egy testületet egy testülethez, amely egy másik testületet magába olvasztott. @hu
definition: Liittää yhteisön yhteisöön, johon toinen yhteisö on sulautunut.
definition: Met une collectivité en relation avec une collectivité qui a absorbé une autre collectivité. @fr
definition: Relaciona una entitat corporativa amb una entitat corporativa que va absorbir una altra entitat corporativa. @ca
definition: Relateert een corporatie aan een corporatie die een andere corporatie opgenomen heeft. @nl
definition: Relaterer en korporasjon til en korporasjon som innlemmer en annen korporasjon. @no
definition: Relaterer en korporation til en korporation, som indlemmede en anden korporation. @da
definition: Relates a corporate body to a corporate body who absorbed another corporate body. @en
definition: Sasaista institūciju ar institūciju, kas iekļauj sevī citu institūciju. @lv
definition: Seostab asutuse asutusega, mis sulandas teise asutuse. @et
definition: Setzt eine Körperschaft in Beziehung zu einer Körperschaft, die eine andere Körperschaft übernimmt. @de
definition: Συνδέει ένα συλλογικό όργανο με ένα συλλογικό όργανο το οποίο απορρόφησε κάποιο άλλο συλλογικό όργανο. @el
definition: يربط هيئة بهيئة استحوذت على هيئة أخرى. @ar
definition: 将一个团体与吸收另一个团体的一个团体关联起来。 @zh-hans

yhteiskonferenssi
has element type: 2
instruction number: 29.5
toolkit definition: A corporate body who is a conference that is jointly held with another conference. @en
toolkit definition: Başka bir konferansla ortaklaşa düzenlenen bir konferans olan tüzel kişilik. @tr
toolkit definition: Collectivité qui est un congrès tenu conjointement avec un autre congrès. @fr
toolkit definition: Conferenza che viene tenuta congiuntamente con un'altra conferenza. @it
toolkit definition: Een corporatie die is een conferentie die gezamenlijk gehouden is met een andere conferentie. @nl
toolkit definition: Eine Konferenz (Körperschaft), die gemeinsam mit einer anderen Konferenz durchgeführt wird. @de
toolkit definition: En konferanse som arrangeres sammen med en annen konferanse. @no
toolkit definition: Entitat corporativa que és un congrés que se celebra conjuntament amb un altre congrés. @ca
toolkit definition: Konference, kas organizēta vienlaicīgi ar citu konferenci. @lv
toolkit definition: Konverents, mis on peetud koos teise konverentsiga. @et
toolkit definition: Korporation, der er en konference, som er afholdt i fællesskab med en anden konference. @da
toolkit definition: Yhteisö, joka on konferenssi, joka järjestetään yhdessä toisen konferenssin kanssa.
toolkit definition: közösen tartott konferencia: @hu
toolkit definition: Ένα συνέδριο που διοργανώνεται από κοινού με κάποιο άλλο συνέδριο. @el
toolkit definition: مؤتمر يُعقد بالاشتراك مع مؤتمر آخر. @ar
toolkit definition: 作为与另一个会议联合举行的一个会议的团体 @zh-hans
toolkit label: Gemeinsam durchgeführte Konferenz @de
toolkit label: Hozzákapcsol egy konferencia testületet egy konferencia testülethez, amelyet egy másik konferenciával közösen tartanak. @hu
toolkit label: conferenza tenuta congiuntamente @it
toolkit label: congrès tenu conjointement @fr
toolkit label: congrés celebrat conjuntament @ca
toolkit label: gezamenlijk gehouden conferentie @nl
toolkit label: jointly held conference @en
toolkit label: konferanse arrangert sammen med annen konferanse @no
toolkit label: konference afholdt i fællesskab @da
toolkit label: ortaklaşa düzenlenen konferans @tr
toolkit label: vienlaicīgi ar konferenci @lv
toolkit label: yhteiskonferenssi
toolkit label: ühiskonverents @et
toolkit label: από κοινού οργανωμένο συνέδριο @el
toolkit label: مؤتمر يُعقد بصورة مشتركة @ar
toolkit label: 联合举行的会议 @zh-hans
has subproperty: P50303
lexical alias: jointlyHeldConference.en
status: Published
type: Property
domain: C10005
label: Egy konferencia testület, amelyet egy másik konferenciával közösen tartanak. @hu
label: a pour congrès tenu conjointement @fr
label: ha come conferenza tenuta congiuntamente @it
label: har konferanse arrangert sammen med annen konferanse @no
label: har konference afholdt i fællesskab @da
label: has jointly held conference @en
label: hat gemeinsam durchgeführte Konferenz @de
label: heeft gezamenlijk gehouden conferentie @nl
label: ortak düzenlenen konferans ile ilişkilidir @tr
label: té com a congrés celebrat conjuntament @ca
label: vienlaicīgi ar konferenci @lv
label: ühiskonverents @et
label: έχει από κοινού οργανωμένο συνέδριο @el
label: له مؤتمر يعقد بصورة مشتركة @ar
label: 有联合举行的会议 @zh-hans
sub property of: yhteisöön liittyvä yhteisö
definition: Bir tüzel kişilik olan bir konferansı, başka bir konferansla ortaklaşa düzenlenen bir konferansla ilişkilendirir. @tr
definition: Correla una conferenza a una conferenza che viene tenuta congiuntamente con un'altra conferenza. @it
definition: Liittää yhteisön, joka on konferenssi, konferenssiin, joka järjestetään yhdessä toisen konferenssin kanssa.
definition: Met une collectivité qui est un congrès en relation avec un congrès tenu conjointement avec un autre congrès. @fr
definition: Relaciona una entitat corporativa que és un congrés amb un congrés que se celebra conjuntament amb un altre congrés. @ca
definition: Relateert een conferentie aan een corporatie die is een conferentie die gezamenlijk gehouden is met een andere conferentie. @nl
definition: Relaterer en konferanse til en konferanse som arrangeres sammen med en annen konferanse. @no
definition: Relaterer en konference til en konference, som er afholdt i fællesskab med en anden konference. @da
definition: Relates a corporate body who is a conference to a conference that is jointly held with another conference. @en
definition: Sasaista institūciju ar konferenci, kas organizēta vienlaicīgi ar citu konferenci. @lv
definition: Seostab konverentsi konverentsiga, mis on peetud koos teise konverentsiga. @et
definition: Setzt eine Konferenz (Körperschaft) in Beziehung zu einer Konferenz, die gemeinsam mit einer anderen Konferenz durchgeführt wird. @de
definition: közösen tartott konferenciája a következő: @hu
definition: Συνδέει ένα συνέδριο με ένα συνέδριο το οποίο διοργανώθηκε από κοινού με κάποιο άλλο συνέδριο. @el
definition: يربط مؤتمرا بمؤتمر يُعقد بصورة مشتركة مع مؤتمر آخر. @ar
definition: 将一个团体与作为与另一个会议联合举行的一个会议的团体关联起来。 @zh-hans

toimijaan liittyvä RDA-entiteetti
has element type: 1
toolkit definition: An RDA entity that is associated with an agent. @en
toolkit definition: Bir temsilciyle bağlantılı olan bir RDA varlığı. @tr
toolkit definition: Een RDA-entiteit die is geassocieerd met een actor. @nl
toolkit definition: Egy ágenshez kapcsolódó RDA-entitás. @hu
toolkit definition: Eine RDA-Entität, die mit einem Akteur in Verbindung steht. @de
toolkit definition: En RDA-entitet som forbindes med en agent. @no
toolkit definition: Entitat RDA que s’associa amb un agent. @ca
toolkit definition: Entità RDA associata a un agente. @it
toolkit definition: Entité RDA qui est associée à un agent. @fr
toolkit definition: RDA entīte, kas saistīta ar aģentu. @lv
toolkit definition: RDA-entiteetti, joka liittyy toimijaan.
toolkit definition: RDA-entitet, som er knyttet til en agent. @da
toolkit definition: Tegijaga seotud RDA olem. @et
toolkit definition: Μια οντότητα RDA που συνδέεται με έναν φορέα. @el
toolkit definition: كيان "وام" مرتبط بوكيل. @ar
toolkit definition: 和一个行为者有关的一个RDA实体 @zh-hans
toolkit label: Mit Akteur in Beziehung stehende RDA-Entität @de
toolkit label: RDA-entitet relateret til agent @da
toolkit label: RDA-entitet relatert til agent @no
toolkit label: ar aģentu saistītā RDA entīte @lv
toolkit label: entitat RDA relacionada amb un agent @ca
toolkit label: entità RDA correlata di agente @it
toolkit label: entité RDA en relation avec un agent @fr
toolkit label: gerelateerde RDA-entiteit van actor @nl
toolkit label: related RDA entity of agent @en
toolkit label: tegijaga seotud RDA olem @et
toolkit label: temsilcinin RDA varlığıyla ilişkisi @tr
toolkit label: toimijaan liittyvä RDA-entiteetti
toolkit label: ágenshez kapcsolódó RDA-entitás: @hu
toolkit label: σχετική RDA οντότητα του φορέα @el
toolkit label: كيان "وام" مرتبط بوكيل @ar
toolkit label: 行为者的相关RDA实体 @zh-hans
has subproperty: toimijaan liittyvä teos
has subproperty: toimijaan liittyvä ekspressio
has subproperty: toimijaan liittyvä manifestaatio
has subproperty: toimijaan liittyvä kappale
has subproperty: toimijaan liittyvä toimija
has subproperty: henkilöön liittyvä RDA-entiteetti
has subproperty: toimijaan liittyvä paikka
has subproperty: toimijaan liittyvä ajanjakso
has subproperty: toimijaan liittyvä nomen
has subproperty: yhteistoimijaan liittyvä RDA-entiteetti
has subproperty: P50304
lexical alias: relatedRDAEntityOfAgent.en
status: Published
type: Property
domain: C10002
label: a pour entité RDA en relation avec un agent @fr
label: ar aģentu saistītā RDA entīte @lv
label: ha come entità RDA correlata di agente @it
label: har RDA-entitet relateret til agent @da
label: har RDA-entitet relatert til agent @no
label: has related RDA entity of agent @en
label: hat mit Akteur in Beziehung stehende RDA-Entität @de
label: heeft gerelateerde RDA-entiteit van actor @nl
label: tegijaga seotud RDA olem @et
label: temsilcinin ilgili RDA varlığı ile ilişkilidir @tr
label: té com a entitat RDA relacionada amb un agent @ca
label: ágenshez kapcsolódó RDA-entitás a következő: @hu
label: έχει σχετική RDA οντότητα του φορέα @el
label: له كيان "وام" مرتبط بوكيل @ar
label: 有相关的行为者的RDA实体 @zh-hans
sub property of: toimijaan liittyvä entiteetti
sub property of: P00001
alternative label: toimijaan liittyvä entiteetti
definition: Bir temsilciyi, bir temsilciyle bağlantılı olan bir RDA varlığıyla ilişkilendirir. @tr
definition: Correla un agente a un'entità RDA associata a un agente. @it
definition: Hozzákapcsol egy ágenst egy ágenshez kapcsolódó RDA-entitáshoz. @hu
definition: Liittää toimijan RDA-entiteettiin, joka liittyy toimijaan.
definition: Met un agent en relation avec une entité RDA qui est associée à un agent. @fr
definition: Relaciona un agent amb una entitat RDA que s’associa amb un agent. @ca
definition: Relateert een actor aan een RDA-entiteit die is geassocieerd met een actor. @nl
definition: Relaterer en agent til en RDA-entitet som forbindes med en agent. @no
definition: Relaterer en agent til en RDA-entitet, som er knyttet til en agent. @da
definition: Relates an agent to an RDA entity associated with an agent. @en
definition: Sasaista aģentu ar RDA entīti, kas saistīta ar aģentu. @lv
definition: Seostab tegija tegijaga seotud RDA olemiga. @et
definition: Setzt einen Akteur in Beziehung zu einer RDA-Entität, die mit einem Akteur in Verbindung steht. @de

toimijaan liittyvä teos
has element type: 1
toolkit definition: A work that is associated with an agent. @en
toolkit definition: Bir temsilciyle bağlantılı olan bir eser. @tr
toolkit definition: Darbs, kas saistīts ar aģentu. @lv
toolkit definition: Een werk dat is geassocieerd met een actor. @nl
toolkit definition: Egy ágenshez kapcsolódó mű. @hu
toolkit definition: Ein Werk, das mit einem Akteur in Verbindung steht. @de
toolkit definition: Et verk som forbindes med en agent. @no
toolkit definition: Obra que s’associa amb un agent. @ca
toolkit definition: Opera associata a un agente. @it
toolkit definition: Tegijaga seotud teos. @et
toolkit definition: Teos, joka liittyy toimijaan.
toolkit definition: Værk, som er knyttet til en agent. @da
toolkit definition: Œuvre qui est associée à un agent. @fr
toolkit definition: Ένα έργο που συνδέεται με έναν φορέα. @el
toolkit definition: عمل مرتبط بوكيل. @ar
toolkit definition: 和一个行为者有关的一种作品 @zh-hans
toolkit label: Mit Akteur in Beziehung stehendes Werk @de
toolkit label: ar aģentu saistītais darbs @lv
toolkit label: gerelateerd werk van actor @nl
toolkit label: obra relacionada amb un agent @ca
toolkit label: opera correlata di agente @it
toolkit label: related work of agent @en
toolkit label: tegijaga seotud teos @et
toolkit label: temsilciyle ilişkli eser @tr
toolkit label: toimijaan liittyvä teos
toolkit label: verk relatert til agent @no
toolkit label: værk relateret til agent @da
toolkit label: ágenshez kapcsolódó mű: @hu
toolkit label: œuvre en relation avec un agent @fr
toolkit label: σχετικό έργο του φορέα @el
toolkit label: عمل مرتبط بوكيل @ar
toolkit label: 行为者的关联作品 @zh-hans
has subproperty: julkaisija (toimija) teokselle
has subproperty: muuna toimijana teoksessa
has subproperty: omistuskirjoituksen tekijä (toimija) teoksessa
has subproperty: teoksella kunnioitettu toimija teoksessa
has subproperty: teoksen tekijä (toimija) teoksessa
has subproperty: ohjaaja (toimija) teoksessa
has subproperty: kuvaaja (toimija) teoksessa
has subproperty: teoksen omistuksen kohde (toimija) teoksessa
has subproperty: vastaanottaja (toimija) teoksessa
has subproperty: asiantuntija (toimija) teoksessa
has subproperty: toimijan sponsoroima teos
has subproperty: toimeksiantaja (toimija) teoksessa
has subproperty: tutkija (toimija) teoksessa
has subproperty: järjestäjä (toimija) teoksessa
has subproperty: toimituspäällikkö (toimija) teoksessa
has subproperty: teoksen perustaja (toimija) teoksessa
has subproperty: henkilöön liittyvä teos
has subproperty: yhteistoimijaan liittyvä teos
has subproperty: toimija aiheena teoksessa
has subproperty: P50305
lexical alias: relatedWorkOfAgent.en
status: Published
type: Property
domain: C10002
label: a pour œuvre en relation avec un agent @fr
label: ar aģentu saistītais darbs @lv
label: ha come opera correlata di agente @it
label: har verk relatert til agent @no
label: har værk relateret til agent @da
label: has related work of agent @en
label: hat mit Akteur in Beziehung stehendes Werk @de
label: heeft gerelateerd werk van actor @nl
label: tegijaga seotud teos @et
label: temsilcinin ilgili eseri ile ilişkilidir @tr
label: té com a obra relacionada amb un agent @ca
label: ágenshez kapcsolódó mű a következő: @hu
label: έχει σχετικό έργο του φορέα @el
label: له عمل مرتبط بوكيل @ar
label: 有行为者的关联作品 @zh-hans
sub property of: toimijaan liittyvä RDA-entiteetti
sub property of: P00002
alternative label: Eser ile bağlantılı diğer temsilci @tr
alternative label: Sonstiger Akteur, der mit einem Werk in Verbindung steht von @de
alternative label: a következő műhöz kapcsolódó egyéb ágens: @hu
alternative label: altre agent associat amb una obra de @ca
alternative label: autre agent associé à une œuvre de @fr

toimijaan liittyvä ekspressio
has element type: 1
toolkit definition: An expression that is associated with an agent. @en
toolkit definition: Bir temsilciyle bağlantılı olan bir anlatım. @tr
toolkit definition: Een expressie die is geassocieerd met een actor. @nl
toolkit definition: Egy ágenshez kapcsolódó kifejezési forma. @hu
toolkit definition: Eine Expression, die mit einem Akteur in Verbindung steht. @de
toolkit definition: Ekspressio, joka liittyy toimijaan.
toolkit definition: Espressione associata a un agente. @it
toolkit definition: Et uttrykk som forbindes med en agent. @no
toolkit definition: Expression qui est associée à un agent. @fr
toolkit definition: Expressió que s’associa amb un agent. @ca
toolkit definition: Izteiksme, kas ir saistīta ar aģentu. @lv
toolkit definition: Tegijaga seotud väljendus. @et
toolkit definition: Udtryk, som er knyttet til en agent. @da
toolkit definition: Μια έκφραση που συνδέεται με έναν φορέα. @el
toolkit definition: تعبيرة مرتبطة بوكيل. @ar
toolkit definition: 和一个行为者有关的一种内容表达 @zh-hans
toolkit label: Mit Akteur in Beziehung stehende Expression @de
toolkit label: ar aģentu saistītā izteiksme @lv
toolkit label: espressione correlata di agente @it
toolkit label: expression en relation avec un agent @fr
toolkit label: expressió relacionada amb un agent @ca
toolkit label: gerelateerde expressie van actor @nl
toolkit label: related expression of agent @en
toolkit label: tegijaga seotud väljendus @et
toolkit label: temsilcinin ilişkili anlatımı @tr
toolkit label: toimijaan liittyvä ekspressio
toolkit label: udtryk relateret til agent @da
toolkit label: uttrykk relatert til agent @no
toolkit label: ágenshez kapcsolódó kifejezési forma: @hu
toolkit label: σχετική έκφραση του φορέα @el
toolkit label: تعبيرة مرتبطة بوكيل @ar
toolkit label: 行为者的关联内容表达 @zh-hans
has subproperty: ekspression tekijä (toimija) ekspressiossa
has subproperty: henkilöön liittyvä ekspressio
has subproperty: yhteistoimijaan liittyvä ekspressio
has subproperty: P50306
lexical alias: relatedExpressionOfAgent.en
status: Published
type: Property
domain: C10002
label: a pour expression en relation avec un agent @fr
label: ar aģentu saistītā izteiksme @lv
label: ha come espressione correlata di agente @it
label: har udtryk relateret til agent @da
label: har uttrykk relatert til agent @no
label: has related expression of agent @en
label: hat mit Akteur in Beziehung stehende Expression @de
label: heeft gerelateerde expressie van actor @nl
label: tegijaga seotud väljendus @et
label: temsilcinin ilgili anlatımı ile ilişkilidir @tr
label: té com a expressió relacionada amb un agent @ca
label: ágenshez kapcsolódó kifejezési forma a következő: @hu
label: έχει σχετική έκφραση του φορέα @el
label: له تعبيرة مرتبطة بوكيل @ar
label: 有行为者的关联内容表达 @zh-hans
sub property of: toimijaan liittyvä RDA-entiteetti
sub property of: P00003
definition: Bir temsilciyi, bir temsilciyle bağlantılı olan bir anlatımla ilişkilendirir. @tr
definition: Correla un agente a un'espressione associata a un agente. @it
definition: Hozzákapcsol egy ágenst egy ágenshez kapcsolódó kifejezési formához. @hu
definition: Liittää toimijan ekspressioon, joka liittyy toimijaan.
definition: Met un agent en relation avec une expression qui est associée à un agent. @fr
definition: Relaciona un agent amb una expressió que s’associa amb un agent. @ca
definition: Relateert een actor aan een expressie die is geassocieerd met een actor. @nl
definition: Relaterer en agent til et udtryk, som er knyttet til en agent. @da
definition: Relaterer en agent til et uttrykk som forbindes med en agent. @no
definition: Relates an agent to an expression that is associated with an agent. @en
definition: Sasaista aģentu ar izteiksmi, kas ir saistīta ar aģentu. @lv
definition: Seostab tegija tegijaga seotud väljendusega. @et
definition: Setzt einen Akteur in Beziehung zu einer Expression, die mit einem Akteur in Verbindung steht. @de
definition: Συνδέει έναν φορέα με μια έκφραση η οποία συνδέεται με έναν περιγραφόμενο φορέα. @el
definition: يربط وكيلا بتعبيرة مرتبطة بوكيل. @ar
definition: 将一个行为者与和一个行为者有关的一种内容表达关联起来。 @zh-hans

toimijaan liittyvä manifestaatio
has element type: 1
toolkit definition: A manifestation that is associated with an agent. @en
toolkit definition: Bir temsilciyle bağlantılı olan bir gösterim. @tr
toolkit definition: Een manifestatie die is geassocieerd met een actor. @nl
toolkit definition: Egy ágenshez kapcsolódó megjelenési forma. @hu
toolkit definition: Eine Manifestation, die mit einem Akteur in Verbindung steht. @de
toolkit definition: En manifestasjon som forbindes med en agent. @no
toolkit definition: Manifestaatio, joka liittyy toimijaan.
toolkit definition: Manifestació que s’associa amb un agent. @ca
toolkit definition: Manifestation qui est associée à un agent. @fr
toolkit definition: Manifestation, som er knyttet til en agent. @da
toolkit definition: Manifestazione associata a un agente. @it
toolkit definition: Manifestācija, kas ir saistīta ar aģentu. @lv
toolkit definition: Tegijaga seotud kehastus. @et
toolkit definition: Μια εκδήλωση που συνδέεται με έναν φορέα. @el
toolkit definition: تجسيدة مرتبطة بوكيل. @ar
toolkit definition: 和一个行为者有关的一种载体表现 @zh-hans
toolkit label: Mit Akteur in Beziehung stehende Manifestation @de
toolkit label: Temsilcinin ilişkili gösterimi @tr
toolkit label: ar aģentu saistītā manifestācija @lv
toolkit label: gerelateerde manifestatie van actor @nl
toolkit label: manifestació relacionada amb un agent @ca
toolkit label: manifestasjon relatert til agent @no
toolkit label: manifestation en relation avec un agent @fr
toolkit label: manifestation relateret til agent @da
toolkit label: manifestazione correlata di agente @it
toolkit label: related manifestation of agent @en
toolkit label: tegijaga seotud kehastus @et
toolkit label: toimijaan liittyvä manifestaatio
toolkit label: ágenshez kapcsolódó megjelenési forma: @hu
toolkit label: σχετική εκδήλωση του φορέα @el
toolkit label: تجسيدة مرتبطة بوكيل @ar
toolkit label: 行为者的关联载体表现 @zh-hans
has subproperty: muuna toimijana manifestaatiossa
has subproperty: jakelija (toimija) manifestaatiossa
has subproperty: valmistaja (toimija) manifestaatiossa
has subproperty: paperinvalmistaja (toimija) manifestaatiossa
has subproperty: henkilöön liittyvä manifestaatio
has subproperty: yhteistoimijaan liittyvä manifestaatio
has subproperty: aggregaattiin osallinen toimija manifestaatiossa
has subproperty: manifestaation tekijä (toimija) manifestaatiossa
has subproperty: P50307
lexical alias: relatedManifestationOfAgent.en
status: Published
type: Property
domain: C10002
label: a pour manifestation en relation avec un agent @fr
label: ar aģentu saistītā manifestācija @lv
label: ha come manifestazione correlata di agente @it
label: har manifestasjon relatert til agent @no
label: har manifestation relateret til agent @da
label: has related manifestation of agent @en
label: hat mit Akteur in Beziehung stehende Manifestation @de
label: heeft gerelateerde manifestatie van actor @nl
label: tegijaga seotud kehastus @et
label: temsilcinin ilgili gösterimi ile ilişkilidir @tr
label: té com a manifestació relacionada amb un agent @ca
label: ágenshez kapcsolódó megjelenési forma a következő: @hu
label: έχει σχετική εκδήλωση του φορέα @el
label: له تجسيدة مرتبطة بوكيل @ar
label: 有行为者的关联载体表现 @zh-hans
sub property of: toimijaan liittyvä RDA-entiteetti
sub property of: P00004
alternative label: Gösterim ile bağlantılı diğer temsilcisi @tr
alternative label: Sonstiger Akteur, der mit einer Manifestation in Verbindung steht von @de
alternative label: a következő megjelenési formához kapcsolódó egyéb ágens: @hu
alternative label: altre agent associat amb una manifestació de @ca
alternative label: anden agent knyttet til manifestation af @da
alternative label: autre agent associé à une manifestation de @fr
alternative label: manifestaatioon liittyvä muu toimija manifestaatiossa
alternative label: other agent associated with manifestation of @en
alternative label: otro agente asociado con manifestación de @es
alternative label: وكيل آخر مرتبط بتجسيدة @ar
alternative label: 其他与……的载体表现有关的行为者 @zh-hans
definition: Bir temsilciyi, bir temsilciyle bağlantılı olan bir gösterimle ilişkilendirir. @tr
definition: Correla un agente a una manifestazione associata a un agente. @it
definition: Hozzákapcsol egy ágenst egy ágenshez kapcsolódó megjelenési formához. @hu
definition: Liittää toimijan manifestaatioon, joka liittyy toimijaan.
definition: Met un agent en relation avec une manifestation qui est associée à un agent. @fr

toimijaan liittyvä kappale
has element type: 1
toolkit definition: An item that is associated with an agent. @en
toolkit definition: Bir temsilciyle bağlantılı olan bir kopya. @tr
toolkit definition: Een item dat is geassocieerd met een actor. @nl
toolkit definition: Egy ágenshez kapcsolódó példány. @hu
toolkit definition: Ein Exemplar, das mit einem Akteur in Verbindung steht. @de
toolkit definition: Eksemplar, som er knyttet til en agent. @da
toolkit definition: Et eksemplar som forbindes med en agent. @no
toolkit definition: Item associato a un agente. @it
toolkit definition: Item qui est associé à un agent. @fr
toolkit definition: Kappale, joka liittyy toimijaan.
toolkit definition: Tegijaga seotud eksemplar. @et
toolkit definition: Vienība, kas ir saistīta ar aģentu. @lv
toolkit definition: Ítem que s’associa amb un agent. @ca
toolkit definition: Ένα αντίτυπο που συνδέεται με έναν φορέα. @el
toolkit definition: مفردة مرتبطة بوكيل. @ar
toolkit definition: 和一个行为者有关的一个单件 @zh-hans
toolkit label: Mit Akteur in Beziehung stehendes Exemplar @de
toolkit label: ar aģentu saistītā vienība @lv
toolkit label: eksemplar relateret til agent @da
toolkit label: eksemplar relatert til agent @no
toolkit label: gerelateerd item van actor @nl
toolkit label: item correlato a un agente @it
toolkit label: item en relation avec un agent @fr
toolkit label: related item of agent @en
toolkit label: tegijaga seotud eksemplar @et
toolkit label: temsilciyle ilişkili kopya @tr
toolkit label: toimijaan liittyvä kappale
toolkit label: ágenshez kapcsolódó példány: @hu
toolkit label: ítem relacionat amb un agent @ca
toolkit label: σχετικό αντίτυπο του φορέα @el
toolkit label: مفردة مرتبطة بوكيل @ar
toolkit label: 行为者的关联单件 @zh-hans
has subproperty: illuminoinnin tekijä (toimija) kappaleessa
has subproperty: sitoja (toimija) kappaleessa
has subproperty: kuraattori (toimija) kappaleelle
has subproperty: säilyttäjä (toimija) kappaleessa
has subproperty: omistaja (toimija) kappaleessa
has subproperty: kappaleella kunnioitettu toimija kappaleessa
has subproperty: muuna toimijana kappaleessa
has subproperty: kappaleen entisöijä (toimija) kappaleessa
has subproperty: kappaleen omistuksen kohde (toimija) kappaleessa
has subproperty: henkilöön liittyvä kappale
has subproperty: yhteistoimijaan liittyvä kappale
has subproperty: muokkaaja (toimija) kappaleessa
has subproperty: P50308
lexical alias: relatedItemOfAgent.en
status: Published
type: Property
domain: C10002
label: a pour item en relation avec un agent @fr
label: ar aģentu saistītā vienība @lv
label: ha come item correlato di agente @it
label: har eksemplar relateret til agent @da
label: har eksemplar relatert til agent @no
label: has related item of agent @en
label: hat mit Akteur in Beziehung stehendes Exemplar @de
label: heeft gerelateerd item van actor @nl
label: tegijaga seotud eksemplar @et
label: temsilcinin ilgili kopyası ile ilişkilidir @tr
label: té com a ítem relacionat amb un agent @ca
label: ágenshez kapcsolódó példány a következő: @hu
label: έχει σχετικό αντίτυπο του φορέα @el
label: لها مفردة مرتبطة بوكيل @ar
label: 有行为者的关联单件 @zh-hans
sub property of: toimijaan liittyvä RDA-entiteetti
sub property of: P00005
alternative label: Sonstiger Akteur, der mit einem Exemplar in Verbindung steht von @de
alternative label: a következő példányhoz kapcsolódó egyéb ágens: @hu
alternative label: altre agent associat amb un ítem de @ca
alternative label: autre agent associé à un item de @fr
alternative label: kappaleeseen liittyvä muu toimija kappaleessa
alternative label: other agent associated with item of @en
alternative label: otro agente asociado con ítem de @es
alternative label: öğeyle bağlantılı diğer temsilcisi @tr
alternative label: وكيل آخر مرتبط مفردة @ar
alternative label: 其他和……的单件有关的行为者 @zh-hans
definition: Bir temsilciyi, temsilciyle bağlantılı olan bir kopyayla ilişkilendirir. @tr
definition: Correla un agente a un item associato a un agente. @it

toimijaan liittyvä toimija
has element type: 1
toolkit definition: Agent que s’associa amb un agent. @ca
toolkit definition: Agent qui est associé à un agent. @fr
toolkit definition: Agent, som er knyttet til en agent. @da
toolkit definition: Agente associato a un agente. @it
toolkit definition: An agent who is associated with an agent. @en
toolkit definition: Aģents, kas saistīts ar aģentu. @lv
toolkit definition: Bir temsilciyle bağlantılı olan bir temsilci. @tr
toolkit definition: Een actor die geassocieerd is met een actor. @nl
toolkit definition: Egy ágenshez kapcsolódó ágens. @hu
toolkit definition: Ein Akteur, der mit einem Akteur in Verbindung steht. @de
toolkit definition: En agent som forbindes med en agent. @no
toolkit definition: Tegijaga seotud tegija. @et
toolkit definition: Toimija, joka liittyy toimijaan.
toolkit definition: Ένας φορέας που συνδέεται με έναν φορέα. @el
toolkit definition: وكيل مرتبط بوكيل. @ar
toolkit definition: 和一个行为者有关的一个行为者 @zh-hans
toolkit label: Mit Akteur in Beziehung stehender Akteur @de
toolkit label: agent en relation avec un agent @fr
toolkit label: agent relacionat amb un agent @ca
toolkit label: agent relateret til agent @da
toolkit label: agent relatert til agent @no
toolkit label: agente correlato di agente @it
toolkit label: ar aģentu saistītais aģents @lv
toolkit label: gerelateerde actor van actor @nl
toolkit label: related agent of agent @en
toolkit label: tegijaga seotud tegija @et
toolkit label: temsilcinin İlişkili temsilcisi @tr
toolkit label: toimijaan liittyvä toimija
toolkit label: ágenshez kapcsolódó ágens: @hu
toolkit label: σχετικός φορέας του φορέα @el
toolkit label: وكيل مرتبط بوكيل @ar
toolkit label: 行为者的关联行为者 @zh-hans
has subproperty: toimijaan liittyvä henkilö
has subproperty: henkilöön liittyvä toimija
has subproperty: toimijaan liittyvä yhteistoimija
has subproperty: yhteistoimijaan liittyvä toimija
has subproperty: P50309
lexical alias: relatedAgentOfAgent.en
status: Published
type: Property
domain: C10002
label: a pour agent en relation avec un agent @fr
label: ar aģentu saistītais aģents @lv
label: ha come agente correlato di agente @it
label: har agent relateret til agent @da
label: har agent relatert til agent @no
label: has related agent of agent @en
label: hat mit Akteur in Beziehung stehenden Akteur @de
label: heeft gerelateerde actor van actor @nl
label: tegijaga seotud tegija @et
label: temsilicinin ilgili temsilcisi ile ilişkilidir @tr
label: té com a agent relacionat amb un agent @ca
label: ágenshez kapcsolódó ágens a következő: @hu
label: έχει σχετικό φορέα του φορέα @el
label: له وكيل مرتبط بوكيل @ar
label: 有行为者的关联行为者 @zh-hans
sub property of: toimijaan liittyvä RDA-entiteetti
sub property of: P00006
definition: Bir temsilciyi, bir temsilciyle bağlantılı olan bir temsilciyle ilişkilendirir. @tr
definition: Correla un agente a un agente associato a un agente. @it
definition: Hozzákapcsol egy ágenst egy ágenshez kapcsolódó ágenshez. @hu
definition: Liittää toimijan toimijaan, joka liittyy toimijaan.
definition: Met un agent en relation avec un agent qui est associé à un agent. @fr
definition: Relaciona un agent amb un agent que s’associa amb un agent. @ca
definition: Relateert een actor aan een actor die geassocieerd is met een actor. @nl
definition: Relaterer en agent til en agent som forbindes med en agent. @no
definition: Relaterer en agent til en agent, som er knyttet til en agent. @da
definition: Relates an agent to an agent who is associated with an agent. @en
definition: Sasaista aģentu ar aģentu, kas saistīts ar aģentu. @lv
definition: Seostab tegija tegijaga seotud tegijaga. @et
definition: Setzt einen Akteur in Beziehung zu einem Akteur, der mit einem Akteur in Verbindung steht. @de
definition: Συνδέει έναν φορέα με έναν φορέα ο οποίος συνδέεται με έναν περιγραφόμενο φορέα. @el
definition: يربط وكيلا بوكيل مرتبط بوكيل. @ar
definition: 将一个行为者与和一个行为者有关的一个行为者关联起来。 @zh-hans

henkilöön liittyvä RDA-entiteetti
has element type: 1
toolkit definition: An RDA entity that is associated with a person. @en
toolkit definition: Bir kişiyle bağlantılı olan bir RDA varlığı.. @tr
toolkit definition: Een RDA-entiteit die is geassocieerd met een persoon. @nl
toolkit definition: Eine RDA-Entität, die mit einer Person in Verbindung steht. @de
toolkit definition: En RDA-entitet som forbindes med en person. @no
toolkit definition: Entitat RDA que s’associa amb una persona. @ca
toolkit definition: Entità RDA associata a una persona. @it
toolkit definition: Entité RDA qui est associée à une personne. @fr
toolkit definition: Isikuga seotud RDA olem. @et
toolkit definition: RDA entīte, kas saistīta ar personu. @lv
toolkit definition: RDA-entiteetti, joka liittyy henkilöön.
toolkit definition: RDA-entitet, som er knyttet til en person. @da
toolkit definition: Személyhez kapcsolódó RDA-entitás. @hu
toolkit definition: كيان "وام" مرتبط بشخص. @ar
toolkit definition: 和一个个人相关的一个RDA实体 @zh-hans
toolkit label: Kişinin RDA varlığıyla ilişkisi @tr
toolkit label: Mit Person in Beziehung stehende RDA-Entität @de
toolkit label: RDA-entitet relateret til person @da
toolkit label: RDA-entitet relatert til person @no
toolkit label: ar personu saistītā RDA entīte @lv
toolkit label: entitat RDA relacionada amb una persona @ca
toolkit label: entità RDA correlata di persona @it
toolkit label: entité RDA en relation avec une personne @fr
toolkit label: gerelateerde RDA-entiteit van persoon @nl
toolkit label: henkilöön liittyvä RDA-entiteetti
toolkit label: isikuga seotud RDA olem @et
toolkit label: related RDA entity of person @en
toolkit label: személyhez kapcsolódó RDA-entitás: @hu
toolkit label: σχετική RDA οντότητα του φυσικού προσώπου @el
toolkit label: كيان "وام" مرتبط بشخص @ar
toolkit label: 个人的关联RDA实体 @zh-hans
has subproperty: henkilöön liittyvä teos
has subproperty: henkilöön liittyvä ekspressio
has subproperty: henkilöön liittyvä manifestaatio
has subproperty: henkilöön liittyvä kappale
has subproperty: henkilöön liittyvä toimija
has subproperty: henkilöön liittyvä paikka
has subproperty: henkilöön liittyvä ajanjakso
has subproperty: henkilöön liittyvä nomen
has subproperty: P50310
lexical alias: relatedRDAEntityOfPerson.en
status: Published
type: Property
domain: C10004
label: a pour entité RDA en relation avec une personne @fr
label: ar personu saistītā RDA entīte @lv
label: ha come entità RDA correlata di persona @it
label: har RDA-entitet relateret til person @da
label: har RDA-entitet relatert til person @no
label: has related RDA entity of person @en
label: hat mit Person in Beziehung stehende RDA-Entität @de
label: heeft gerelateerde RDA-entiteit van persoon @nl
label: isikuga seotud RDA olem @et
label: kişinin ilgili RDA varlığı ile ilişkilidir @tr
label: személyhez kapcsolódó RDA-entitás a következő: @hu
label: té com a entitat RDA relacionada amb una persona @ca
label: έχει σχετική RDA οντότητα του φυσικού προσώπου @el
label: له كيان "وام" مرتبط بشخص @ar
label: 有个人的关联RDA实体 @zh-hans
sub property of: toimijaan liittyvä RDA-entiteetti
sub property of: henkilöön liittyvä entiteetti
alternative label: henkilöön liittyvä entiteetti
definition: Bir kişiyi, kişiyle bağlantılı olan bir RDA varlığıyla ilişkilendirir. @tr
definition: Correla un agente a un agente associato a un agente. @it
definition: Hozzákapcsol egy személyt egy személyhez kapcsolódó RDA-entitáshoz. @hu
definition: Liittää henkilön RDA-entiteettiin, joka liittyy henkilöön.
definition: Met une personne en relation avec une entité RDA qui est associée à une personne. @fr
definition: Relaciona una persona amb una entitat RDA que s’associa amb una persona. @ca
definition: Relateert een persoon aan een RDA-entiteit die is geassocieerd met een persoon. @nl
definition: Relaterer en person til en RDA-entitet som forbindes med en person. @no
definition: Relaterer en person til en RDA-entitet, som er knyttet til en person. @da
definition: Relates a person to an RDA entity associated with a person. @en
definition: Sasaista personu ar RDA entīti, kas saistīta ar personu. @lv
definition: Seostab isiku isikuga seotud RDA olemiga. @et
definition: Setzt eine Person in Beziehung zu einer RDA-Entität, die mit einer Person in Verbindung steht. @de
definition: Συνδέει ένα φυσικό πρόσωπο με μια οντότητα η οποία συνδέεται με ένα περιγραφόμενο φυσικό πρόσωπο. @el
definition: يربط شخصا بكيان "وام" مرتبط بشخص. @ar
definition: 将一个个人与和一个个人相关的一个RDA实体关联起来。 @zh-hans

henkilöön liittyvä teos
has element type: 1
toolkit definition: A work that is associated with a person. @en
toolkit definition: Bir kişi ile bağlantılı olan bir eser. @tr
toolkit definition: Darbs, kas saistīts ar personu. @lv
toolkit definition: Een werk dat geassocieerd is met een persoon. @nl
toolkit definition: Egy személyhez kapcsolódó mű. @hu
toolkit definition: Ein Werk, das mit einer Person in Verbindung steht. @de
toolkit definition: Et verk som forbindes med en person. @no
toolkit definition: Isikuga seotud teos. @et
toolkit definition: Obra que s’associa amb una persona. @ca
toolkit definition: Opera associata a una persona. @it
toolkit definition: Teos, joka liittyy henkilöön.
toolkit definition: Værk, som er knyttet til en person. @da
toolkit definition: Œuvre qui est associée à une personne. @fr
toolkit definition: عمل مرتبط بشخص. @ar
toolkit definition: 和一个个人有关的一种作品 @zh-hans
toolkit label: Kişiyle ilişkili eser @tr
toolkit label: Mit Person in Beziehung stehendes Werk @de
toolkit label: ar personu saistītais darbs @lv
toolkit label: gerelateerd werk van persoon @nl
toolkit label: henkilöön liittyvä teos
toolkit label: isikuga seotud teos @et
toolkit label: obra relacionada amb una persona @ca
toolkit label: opera correlata di persona @it
toolkit label: related work of person @en
toolkit label: személyhez kapcsolódó mű: @hu
toolkit label: verk relatert til person @no
toolkit label: værk relateret til person @da
toolkit label: œuvre en relation avec une personne @fr
toolkit label: σχετικό έργο του φυσικού προσώπου @el
toolkit label: عمل مرتبط بشخص @ar
toolkit label: 个人的关联作品 @zh-hans
has subproperty: henkilö aiheena teoksessa
has subproperty: akateeminen ohjaaja teoksessa
has subproperty: vastaanottaja (henkilö) teoksessa
has subproperty: toimituspäällikkö (henkilö) teoksessa
has subproperty: teoksen omistuksen kohde (henkilö) teoksessa
has subproperty: kuvaaja (henkilö) teoksessa
has subproperty: toimeksiantaja (henkilö) teoksessa
has subproperty: teoksen tekijä (henkilö) teoksessa
has subproperty: teoksen perustaja (henkilö) teoksessa
has subproperty: julkaisija (henkilö) teokselle
has subproperty: järjestäjä (henkilö) teoksessa
has subproperty: asiantuntija (henkilö) teoksessa
has subproperty: tutkija (henkilö) teoksessa
has subproperty: ohjaaja (henkilö) teoksessa
has subproperty: omistuskirjoituksen tekijä (henkilö) teoksessa
has subproperty: teoksella kunnioitettu henkilö teoksessa
has subproperty: henkilön sponsoroima teos
has subproperty: P50311
lexical alias: relatedWorkOfPerson.en
status: Published
type: Property
domain: C10004
label: a pour œuvre en relation avec une personne @fr
label: ar personu saistītais darbs @lv
label: ha come opera correlata di persona @it
label: har verk relatert til person @no
label: har værk relateret til person @da
label: has related work of person @en
label: hat mit Person in Beziehung stehendes Werk @de
label: heeft gerelateerd werk van persoon @nl
label: isikuga seotud teos @et
label: kişinin ilgili eseri ile ilişkilidir @tr
label: személyhez kapcsolódó mű a következő: @hu
label: té com a obra relacionada amb una persona @ca
label: έχει σχετικό έργο του φυσικού προσώπου @el
label: له عمل مرتبط بشخص @ar
label: 有个人的关联作品 @zh-hans
sub property of: toimijaan liittyvä teos
sub property of: henkilöön liittyvä RDA-entiteetti
definition: Bir kişiyi, bir kişiyle ilişkilendirilen bir eserle ilişkilendirir. @tr
definition: Correla una persona a un'opera associata a una persona. @it
definition: Hozzákapcsol egy személyt egy személyhez kapcsolódó műhöz. @hu
definition: Liittää henkilön teokseen, joka liittyy henkilöön.
definition: Met une personne en relation avec une œuvre qui est associée à une personne. @fr
definition: Relaciona una persona amb una obra que s’associa amb una persona. @ca
definition: Relateert een persoon aan een werk dat geassocieerd is met een persoon. @nl
definition: Relaterer en person til et verk som forbindes med en person. @no

henkilöön liittyvä ekspressio
has element type: 1
toolkit definition: An expression that is associated with a person. @en
toolkit definition: Bir kişiyle bağlantılı olan bir anlatım. @tr
toolkit definition: Een expressie die geassocieerd is met een persoon. @nl
toolkit definition: Eine Expression, die mit einer Person in Verbindung steht. @de
toolkit definition: Ekspressio, joka liittyy henkilöön.
toolkit definition: Espressione associata a una persona. @it
toolkit definition: Et uttrykk som forbindes med en person. @no
toolkit definition: Expression qui est associée à une personne. @fr
toolkit definition: Expressió que s’associa amb una persona. @ca
toolkit definition: Isikuga seotud väljendus. @et
toolkit definition: Izteiksme, kas ir saistīta ar personu. @lv
toolkit definition: Személyhez kapcsolódó kifejezési forma. @hu
toolkit definition: Udtryk, som er knyttet til en person. @da
toolkit definition: تعبيرة مرتبطة بشخص. @ar
toolkit definition: 和一个个人有关的一种内容表达 @zh-hans
toolkit label: Mit Person in Beziehung stehende Expression @de
toolkit label: ar personu saistītā izteiksme @lv
toolkit label: espressione correlata di persona @it
toolkit label: expression en relation avec une personne @fr
toolkit label: expressió relacionada amb una persona @ca
toolkit label: gerelateerde expressie van persoon @nl
toolkit label: henkilöön liittyvä ekspressio
toolkit label: isikuga seotud väljendus @et
toolkit label: kişiyle ilişkili anlatım @tr
toolkit label: related expression of person @en
toolkit label: személyhez kapcsolódó kifejezési forma: @hu
toolkit label: udtryk relateret til person @da
toolkit label: uttrykk relatert til person @no
toolkit label: σχετική έκφραση του φυσικού προσώπου @el
toolkit label: تعبيرة مرتبطة بشخص @ar
toolkit label: 个人的关联内容表达 @zh-hans
has subproperty: ekspression tekijä (henkilö) ekspressiossa
has subproperty: P50312
lexical alias: relatedExpressionOfPerson.en
status: Published
type: Property
domain: C10004
label: a pour expression en relation avec une personne @fr
label: ar personu saistītā izteiksme @lv
label: ha come espressione correlata di persona @it
label: har udtryk relateret til person @da
label: har uttrykk relatert til person @no
label: has related expression of person @en
label: hat mit Person in Beziehung stehende Expression @de
label: heeft gerelateerde expressie van persoon @nl
label: isikuga seotud väljendus @et
label: kişinin ilgili anlatımı ile ilişkilidir @tr
label: személyhez kapcsolódó kifejezési forma a következő: @hu
label: té com a expressió relacionada amb una persona @ca
label: έχει σχετική έκφραση του φυσικού προσώπου @el
label: لها تعبيرة مرتبطة بشخص @ar
label: 有个人的关联内容表达 @zh-hans
sub property of: toimijaan liittyvä ekspressio
sub property of: henkilöön liittyvä RDA-entiteetti
definition: Bir kişiyi, bir kişiyle bağlantılı olan bir anlatımla ilişkilendirir. @tr
definition: Correla una persona a un'espressione associata a una persona. @it
definition: Hozzákapcsol egy személyt egy személyhez kapcsolódó kifejezési formához. @hu
definition: Liittää henkilön ekspressioon, joka liittyy henkilöön.
definition: Met une personne en relation avec une expression qui est associée à une personne. @fr
definition: Relaciona una persona amb una expressió que s’associa amb una persona. @ca
definition: Relateert een persoon aan een expressie die geassocieerd is met een persoon. @nl
definition: Relaterer en person til et udtryk, som er knyttet til en person. @da
definition: Relaterer en person til et uttrykk som forbindes med en person. @no
definition: Relates a person to an expression that is associated with a person. @en
definition: Sasaista personu ar izteiksmi, kas ir saistīta ar personu. @lv
definition: Seostab isiku isikuga seotud väljendusega. @et
definition: Setzt eine Person in Beziehung zu einer Expression, die mit einer Person in Verbindung steht. @de
definition: Συνδέει ένα φυσικό πρόσωπο με μια έκφραση η οποία συνδέεται με ένα περιγραφόμενο φυσικό πρόσωπο. @el
definition: يربط شخصا بتعبيرة مرتبطة بشخص. @ar
definition: 将一个个人与和一个个人有关的一种内容表达关联起来。 @zh-hans

henkilöön liittyvä manifestaatio
has element type: 1
toolkit definition: A manifestation that is associated with a person. @en
toolkit definition: Bir kişiyle bağlantılı olan bir gösterim. @tr
toolkit definition: Een manifestatie die geassocieerd is met een persoon. @nl
toolkit definition: Egy személyhez kapcsolódó megjelenési forma. @hu
toolkit definition: Eine Manifestation, die mit einer Person in Verbindung steht. @de
toolkit definition: En manifestasjon som forbindes med en person. @no
toolkit definition: Isikuga seotud kehastus. @et
toolkit definition: Manifestaatio, joka liittyy henkilöön.
toolkit definition: Manifestació que s’associa amb una persona. @ca
toolkit definition: Manifestation qui est associée à une personne. @fr
toolkit definition: Manifestation, som er knyttet til en person. @da
toolkit definition: Manifestazione associata a una persona. @it
toolkit definition: Manifestācija, kas ir saistīta ar personu. @lv
toolkit definition: تجسيدة مرتبطة بشخص. @ar
toolkit definition: 和一个个人有关的一种载体表现 @zh-hans
toolkit label: Kişinin ilişkili gösterimi @tr
toolkit label: Mit Person in Beziehung stehende Manifestation @de
toolkit label: ar personu saistītā manifestācija @lv
toolkit label: gerelateerde manifestatie van persoon @nl
toolkit label: henkilöön liittyvä manifestaatio
toolkit label: isikuga seotud kehastus @et
toolkit label: manifestació relacionada amb una persona @ca
toolkit label: manifestasjon relatert til person @no
toolkit label: manifestation en relation avec une personne @fr
toolkit label: manifestation relateret til person @da
toolkit label: manifestazione correlata di persona @it
toolkit label: related manifestation of person @en
toolkit label: személyhez kapcsolódó megjelenési forma: @hu
toolkit label: σχετική εκδήλωση του φυσικού προσώπου @el
toolkit label: تجسيدة مرتبطة بشخص @ar
toolkit label: 个人的关联单件 @zh-hans
has subproperty: manifestaation tekijä (henkilö) manifestaatiossa
has subproperty: jakelija (henkilö) manifestaatiossa
has subproperty: valmistaja (henkilö) manifestaatiossa
has subproperty: paperinvalmistaja (henkilö) manifestaatiossa
has subproperty: aggregaattiin osallinen henkilö manifestaatiossa
has subproperty: P50313
lexical alias: relatedManifestationOfPerson.en
status: Published
type: Property
domain: C10004
label: a pour manifestation en relation avec une personne @fr
label: ar personu saistītā manifestācija @lv
label: ha come manifestazione correlata di persona @it
label: har manifestasjon relatert til person @no
label: har manifestation relateret til person @da
label: has related manifestation of person @en
label: hat mit Person in Beziehung stehende Manifestation @de
label: heeft gerelateerde manifestatie van persoon @nl
label: isikuga seotud kehastus @et
label: kişinin ilgili gösterimi ile ilişkilidir @tr
label: személyhez kapcsolódó megjelenési forma a következő: @hu
label: té com a manifestació relacionada amb una persona @ca
label: έχει σχετική εκδήλωση του φυσικού προσώπου @el
label: لها تجسيدة مرتبطة بشخص @ar
label: 有个人的关联载体表现 @zh-hans
sub property of: toimijaan liittyvä manifestaatio
sub property of: henkilöön liittyvä RDA-entiteetti
definition: Bir kişiyi, bir kişiyle bağlantılı olan bir gösterimle ilişkilendirir. @tr
definition: Correla una persona a una manifestazione associata a una persona. @it
definition: Hozzákapcsol egy személyt egy személyhez kapcsolódó megjelenési formához. @hu
definition: Liittää henkilön manifestaatioon, joka liittyy henkilöön.
definition: Met une personne en relation avec une manifestation qui est associée à une personne. @fr
definition: Relaciona una persona amb una manifestació que s’associa amb una persona. @ca
definition: Relateert een persoon aan een manifestatie die geassocieerd is met een persoon. @nl
definition: Relaterer en person til en manifestasjon som forbindes med en person. @no
definition: Relaterer en person til en manifestation, som er knyttet til en person. @da
definition: Relates a person to a manifestation that is associated with a person. @en
definition: Sasaista personu ar manifestāciju, kas ir saistīta ar personu. @lv
definition: Seostab isiku isikuga seotud kehastusega. @et
definition: Setzt eine Person in Beziehung zu einer Manifestation, die mit einer Person in Verbindung steht. @de
definition: Συνδέει ένα φυσικό πρόσωπο με μια εκδήλωση η οποία συνδέεται με ένα περιγραφόμενο φυσικό πρόσωπο. @el
definition: يربط شخصا بتجسيدة مرتبطة بشخص. @ar
definition: 将一个个人与和一个个人有关的一种载体表现关联起来。 @zh-hans

henkilöön liittyvä kappale
has element type: 1
toolkit definition: An item that is associated with a person. @en
toolkit definition: Bir kişiyle bağlantılı olan bir kopya. @tr
toolkit definition: Een item dat is geassocieerd met een persoon. @nl
toolkit definition: Egy személyhez kapcsolódó példány. @hu
toolkit definition: Ein Exemplar, das mit einer Person in Verbindung steht. @de
toolkit definition: Eksemplar, som er knyttet til en person. @da
toolkit definition: Et eksemplar som forbindes med en person. @no
toolkit definition: Isikuga seotud eksemplar. @et
toolkit definition: Item associato a una persona. @it
toolkit definition: Item qui est associé à une personne. @fr
toolkit definition: Kappale, joka liittyy henkilöön.
toolkit definition: Vienība, kas ir saistīta ar personu. @lv
toolkit definition: Ítem que s’associa amb una persona. @ca
toolkit definition: مفردة مرتبطة بشخص. @ar
toolkit definition: 和一个个人有关的一个单件 @zh-hans
toolkit label: Mit Person in Beziehung stehendes Exemplar @de
toolkit label: ar personu saistītā vienība @lv
toolkit label: eksemplar relateret til person @da
toolkit label: eksemplar relatert til person @no
toolkit label: gerelateerd item van persoon @nl
toolkit label: henkilöön liittyvä kappale
toolkit label: isikuga seotud eksemplar @et
toolkit label: item correlato di persona @it
toolkit label: item en relation avec une personne @fr
toolkit label: kişiyle ilişkili kopya @tr
toolkit label: related item of person @en
toolkit label: személyhez kapcsolódó példány: @hu
toolkit label: ítem relacionat amb una persona @ca
toolkit label: σχετικό αντίτυπο του φυσικού προσώπου @el
toolkit label: مفردة مرتبطة بشخص @ar
toolkit label: 个人的关联行为者 @zh-hans
has subproperty: kappaleen omistuksen kohde (henkilö) kappaleessa
has subproperty: sitoja (henkilö) kappaleessa
has subproperty: kappaleen entisöijä (henkilö) kappaleessa
has subproperty: kuraattori (henkilö) kappaleessa
has subproperty: säilyttäjä (henkilö) kappaleessa
has subproperty: omistaja (henkilö) kappaleessa
has subproperty: muokkaaja (henkilö) kappaleessa
has subproperty: illuminoinnin tekijä (henkilö) kappaleessa
has subproperty: kappaleella kunnioitettu henkilö kappaleessa
has subproperty: P50314
lexical alias: relatedItemOfPerson.en
status: Published
type: Property
domain: C10004
label: a pour item en relation avec une personne @fr
label: ar personu saistītā vienība @lv
label: ha come item correlato di persona @it
label: har eksemplar relateret til person @da
label: har eksemplar relatert til person @no
label: has related item of person @en
label: hat mit Person in Beziehung stehendes Exemplar @de
label: heeft gerelateerd item van persoon @nl
label: isikuga seotud eksemplar @et
label: kişinin ilgili kopyası ile ilişkilidir @tr
label: személyhez kapcsolódó példány a következő: @hu
label: té com a ítem relacionat amb una persona @ca
label: έχει σχετικό αντίτυπο του φυσικού προσώπου @el
label: له مفردة مرتبطة بشخص @ar
label: 有个人的关联单件 @zh-hans
sub property of: toimijaan liittyvä kappale
sub property of: henkilöön liittyvä RDA-entiteetti
definition: Bir kişiyi, bir kişiyle bağlantılı olan bir kopyayla ilişkilendirir. @tr
definition: Correla una persona a un item associato a una persona. @it
definition: Hozzákapcsol egy személyt egy személyhez kapcsolódó példányhoz. @hu
definition: Liittää henkilön kappaleeseen, joka liittyy henkilöön.
definition: Met une personne en relation avec un item qui est associé à une personne. @fr
definition: Relaciona una persona amb un ítem que s’associa amb una persona. @ca
definition: Relateert een persoon aan een item dat is geassocieerd met een persoon. @nl
definition: Relaterer en person til et eksemplar som forbindes med en person. @no
definition: Relaterer en person til et eksemplar, som er knyttet til en person. @da
definition: Relates a person to an item that is associated with a person. @en
definition: Sasaista personu ar vienību, kas ir saistīta ar personu. @lv
definition: Seostab isiku isikuga seotud eksemplariga. @et
definition: Setzt eine Person in Beziehung zu einem Exemplar, das mit einer Person in Verbindung steht. @de
definition: Συνδέει ένα φυσικό πρόσωπο με ένα αντίτυπο το οποίο συνδέεται με ένα περιγραφόμενο φυσικό πρόσωπο. @el
definition: يربط شخصا بمفردة مرتبطة بشخص. @ar
definition: 将一个个人与和一个个人有关的一个单件关联起来。 @zh-hans

henkilöön liittyvä toimija
has element type: 1
toolkit definition: Agent que s’associa amb una persona. @ca
toolkit definition: Agent qui est associé à une personne. @fr
toolkit definition: Agent, som er knyttet til en person. @da
toolkit definition: Agente associato a una persona. @it
toolkit definition: An agent who is associated with a person. @en
toolkit definition: Aģents, kas saistīts ar personu. @lv
toolkit definition: Bir kişiyle bağlantılı olan bir temsilci. @tr
toolkit definition: Een actor die geassocieerd is met een persoon. @nl
toolkit definition: Egy személyhez kapcsolódó ágens. @hu
toolkit definition: Ein Akteur, der mit einer Person in Verbindung steht. @de
toolkit definition: En agent som forbindes med en person. @no
toolkit definition: Isikuga seotud tegija. @et
toolkit definition: Toimija,joka liittyy henkilöön.
toolkit definition: وكيل مرتبط بشخص. @ar
toolkit definition: 和一个个人有关的一个行为者 @zh-hans
toolkit label: Mit Person in Beziehung stehender Akteur @de
toolkit label: agent en relation avec une personne @fr
toolkit label: agent relacionat amb una persona @ca
toolkit label: agent relateret til person @da
toolkit label: agent relatert til person @no
toolkit label: agente correlato di persona @it
toolkit label: ar personu saistītais aģents @lv
toolkit label: gerelateerde actor van persoon @nl
toolkit label: henkilöön liittyvä toimija
toolkit label: isikuga seotud tegija @et
toolkit label: kişinin ilişkili temsilcisi @tr
toolkit label: related agent of person @en
toolkit label: személyhez kapcsolódó ágens: @hu
toolkit label: σχετικός φορέας του φυσικού προσώπου @el
toolkit label: وكيل مرتبط بشخص @ar
toolkit label: 个人的关联行为者 @zh-hans
has subproperty: henkilöön liittyvä henkilö
has subproperty: henkilöön liittyvä yhteistoimija
has subproperty: P50315
lexical alias: relatedAgentOfPerson.en
status: Published
type: Property
domain: C10004
label: a pour agent en relation avec une personne @fr
label: ar personu saistītais aģents @lv
label: ha come agente correlato di persona @it
label: har agent relateret til person @da
label: har agent relatert til person @no
label: has related agent of person @en
label: hat mit Person in Beziehung stehenden Akteur @de
label: heeft gerelateerde actor van persoon @nl
label: isikuga seotud tegija @et
label: kişinin ilgili temsilcisi ile ilişkilidir @tr
label: személyhez kapcsolódó ágens a következő: @hu
label: té com a agent relacionat amb una persona @ca
label: έχει σχετικό φορέα του φυσικού προσώπου @el
label: له وكيل مرتبط بشخص @ar
label: 有个人的关联行为者 @zh-hans
sub property of: toimijaan liittyvä toimija
sub property of: henkilöön liittyvä RDA-entiteetti
definition: Bir kişiyi, bir kişiyle bağlantılı olan bir temsilciyle ilişkilendirir. @tr
definition: Correla una persona a un agente associato a una persona. @it
definition: Hozzákapcsol egy személyt egy személyhez kapcsolódó ágenshez. @hu
definition: Liittää henkilön toimijaan,joka liittyy henkilöön.
definition: Met une personne en relation avec un agent qui est associé à une personne. @fr
definition: Relaciona una persona amb un agent que s’associa amb una persona. @ca
definition: Relateert een persoon aan een actor die geassocieerd is met een persoon. @nl
definition: Relaterer en person til en agent som forbindes med en person. @no
definition: Relaterer en person til en agent, som er knyttet til en person. @da
definition: Relates a person to an agent who is associated with a person. @en
definition: Sasaista personu ar aģentu, kas saistīts ar personu. @lv
definition: Seostab isiku isikuga seotud tegijaga. @et
definition: Setzte eine Person in Beziehung zu einem Akteur, der mit einer Person in Verbindung steht. @de
definition: Συνδέει ένα φυσικό πρόσωπο με έναν φορέα ο οποίος συνδέεται με ένα περιγραφόμενο φυσικό πρόσωπο. @el
definition: يربط شخصا بوكيل ذي صلة بشخص. @ar
definition: 将一个个人与和一个个人有关的一个行为者关联起来。 @zh-hans

henkilöön liittyvä henkilö
has element type: 1
toolkit definition: A person who is associated with a person. @en
toolkit definition: Bir kişi ile bağlantılı olan kişidir. @tr
toolkit definition: Een persoon die geassocieerd is met een persoon. @nl
toolkit definition: Egy személyhez kapcsolódó személy. @hu
toolkit definition: Eine Person, die mit einer Person in Verbindung steht. @de
toolkit definition: En person som forbindes med en person. @no
toolkit definition: Henkilö, joka liittyy henkilöön.
toolkit definition: Isikuga seotud isik. @et
toolkit definition: Person, som er knyttet til en person. @da
toolkit definition: Persona associata a una persona. @it
toolkit definition: Persona que s’associa amb una persona. @ca
toolkit definition: Persona, kura saistīta ar personu. @lv
toolkit definition: Personne qui est associée à une personne. @fr
toolkit definition: شخص مرتبط بشخص. @ar
toolkit definition: 和一个个人有关的一个个人 @zh-hans
toolkit label: Mit Person in Beziehung stehende Person @de
toolkit label: ar personu saistītā persona @lv
toolkit label: gerelateerde persoon van persoon @nl
toolkit label: henkilöön liittyvä henkilö
toolkit label: isikuga seotud isik @et
toolkit label: kişiyle ilişkili kişi @tr
toolkit label: person relateret til person @da
toolkit label: person relatert til person @no
toolkit label: persona correlata di persona @it
toolkit label: persona relacionada amb una persona @ca
toolkit label: personne en relation avec une personne @fr
toolkit label: related person of person @en
toolkit label: személyhez kapcsolódó személy: @hu
toolkit label: σχετικό φυσικό πρόσωπο του φυσικού προσώπου @el
toolkit label: شخص مرتبط بشخص @ar
toolkit label: 个人的关联个人 @zh-hans
has subproperty: kollega
has subproperty: opiskelutoveri
has subproperty: ystävä
has subproperty: oppilas
has subproperty: opettaja
has subproperty: P50316
lexical alias: relatedPersonOfPerson.en
status: Published
type: Property
domain: C10004
label: a pour personne en relation avec une personne @fr
label: ar personu saistītā persona @lv
label: ha come persona correlata di persona @it
label: har person relateret til person @da
label: har person relatert til person @no
label: has related person of person @en
label: hat mit Person in Beziehung stehende Person @de
label: heeft gerelateerde persoon van persoon @nl
label: isikuga seotud isik @et
label: kişinin ilgili kişisi ile ilişkilidir @tr
label: személyhez kapcsolódó személy a következő: @hu
label: té com a persona relacionada amb una persona @ca
label: έχει σχετικό φυσικό πρόσωπο του φυσικού προσώπου @el
label: له شخص مرتبط بشخص @ar
label: 有个人的关联个人 @zh-hans
sub property of: toimijaan liittyvä henkilö
sub property of: henkilöön liittyvä toimija
definition: Bir kişiyi, bir kişiyle bağlantılı olan bir kişiyle ilişkilendirir. @tr
definition: Correla una persona a una persona associata a una persona. @it
definition: Hozzákapcsol egy személyt egy személyhez kapcsoldódó személyhez. @hu
definition: Liittää henkilön henkilöön, joka liittyy henkilöön.
definition: Met une personne en relation avec une personne qui est associée à une personne. @fr
definition: Relaciona una persona amb una persona que s’associa amb una persona. @ca
definition: Relateert een persoon aan een persoon die geassocieerd is met een persoon. @nl
definition: Relaterer en person til en person som forbindes med en person. @no
definition: Relaterer en person til en person, som er knyttet til en person. @da
definition: Relates a person to a person who is associated with a person. @en
definition: Sasaista personu ar personu, kura saistīta ar personu. @lv
definition: Seostab isiku isikuga seotud isikuga. @et
definition: Setzt eine Person in Beziehung zu einer Person, die mit einer Person in Verbindung steht. @de
definition: Συνδέει ένα φυσικό πρόσωπο με ένα φυσικό πρόσωπο το οποίο συνδέεται με ένα περιγραφόμενο φυσικό πρόσωπο. @el
definition: يربط شخصا بشخص مرتبط بشخص. @ar
definition: 将一个个人与和一个个人有关的一个个人关联起来。 @zh-hans

henkilöön liittyvä suku
has element type: 1
toolkit definition: A family who is associated with a person. @en
toolkit definition: Bir kişiyle bağlantılı olan bir aile. @tr
toolkit definition: Dzimta/ģimene, kas saistīta ar personu. @lv
toolkit definition: Een familie die geassocieerd is met een persoon. @nl
toolkit definition: Egy személyhez kapcsolódó család. @hu
toolkit definition: Eine Familie, die mit einer Person in Verbindung steht. @de
toolkit definition: En familie som forbindes med en person. @no
toolkit definition: Famiglia associata a una persona. @it
toolkit definition: Familie, som er knyttet til en person. @da
toolkit definition: Famille qui est associée à une personne. @fr
toolkit definition: Família que s’associa amb una persona. @ca
toolkit definition: Isikuga seotud perekond. @et
toolkit definition: Suku, joka liittyy henkilöön.
toolkit definition: عائلة مرتبطة بشخص. @ar
toolkit definition: 和一个个人有关的一个家族 @zh-hans
toolkit label: Mit Person in Beziehung stehende Familie @de
toolkit label: ar personu saistītā dzimta/ģimene @lv
toolkit label: famiglia correlata di persona @it
toolkit label: familie relateret til person @da
toolkit label: familie relatert til person @no
toolkit label: famille en relation avec une personne @fr
toolkit label: família relacionada amb una persona @ca
toolkit label: gerelateerde familie van persoon @nl
toolkit label: henkilöön liittyvä suku
toolkit label: isikuga seotud perekond @et
toolkit label: kişiyle ilişkili aile @tr
toolkit label: related family of person @en
toolkit label: személyhez kapcsolódó család: @hu
toolkit label: σχετική οικογένεια του φυσικού προσώπου @el
toolkit label: عائلة مرتبطة بشخص @ar
toolkit label: 个人的关联家族 @zh-hans
has subproperty: henkilöjäsen suvussa
has subproperty: P50317
lexical alias: relatedFamilyOfPerson.en
status: Published
type: Property
domain: C10004
label: a pour famille en relation avec une personne @fr
label: ar personu saistītā dzimta/ģimene @lv
label: ha come famiglia correlata di persona @it
label: har familie relateret til person @da
label: har familie relatert til person @no
label: has related family of person @en
label: hat mit Person in Beziehung stehende Familie @de
label: heeft gerelateerde familie van persoon @nl
label: isikuga seotud perekond @et
label: kişinin ilgili ailesi ile ilişkilidir @tr
label: személyhez kapcsolódó család a következő: @hu
label: té com a família relacionada amb una persona @ca
label: έχει σχετική οικογένεια του φυσικού προσώπου @el
label: له عائلة مرتبطة بشخص @ar
label: 有个人的关联家族 @zh-hans
sub property of: toimijaan liittyvä suku
sub property of: henkilöön liittyvä yhteistoimija
definition: Bir kişiyi, bir kişi ile bağlantılı olan bir aileyle ilişkilendirir. @tr
definition: Correla una persona a una famiglia associata a una persona. @it
definition: Hozzákapcsol egy személyt egy személyhez kapcsolódó családhoz. @hu
definition: Liittää henkilön sukuun, joka liittyy henkilöön.
definition: Met une personne en relation avec une famille qui est associée à une personne. @fr
definition: Relaciona una persona amb una família que s’associa amb una persona. @ca
definition: Relateert een persoon aan een familie die geassocieerd is met een persoon. @nl
definition: Relaterer en person til en familie som forbindes med en person. @no
definition: Relaterer en person til en familie, som er knyttet til en person. @da
definition: Relates a person to a family who is associated with a person. @en
definition: Sasaista personu ar dzimtu/ģimeni, kas saistīta ar personu. @lv
definition: Seostab isiku isikuga seotud perekonnaga. @et
definition: Setzt eine Person in Beziehung zu einer Familie, die mit einer Person in Beziehung steht. @de
definition: Συνδέει ένα φυσικό πρόσωπο με μια οικογένεια η οποία συνδέεται με ένα περιγραφόμενο φυσικό πρόσωπο. @el
definition: يربط شخصا بعائلة مرتبطة بشخص. @ar
definition: 将一个个人与和一个个人有关的一个家族关联起来。 @zh-hans

henkilöön liittyvä yhteisö
has element type: 1
toolkit definition: A corporate body who is associated with a person. @en
toolkit definition: Bir kişiyle ilişkili olan tüzel kişi. @tr
toolkit definition: Collectivité qui est associée à une personne. @fr
toolkit definition: Een corporatie die geassocieerd is met een persoon. @nl
toolkit definition: Egy személyhez kapcsolódó testület. @hu
toolkit definition: Eine Körperschaft, die mit einer Person in Verbindung steht. @de
toolkit definition: En korporasjon som forbindes med en person. @no
toolkit definition: Ente associato a una persona. @it
toolkit definition: Entitat corporativa que s’associa amb una persona. @ca
toolkit definition: Institūcija, kas saistīta ar personu. @lv
toolkit definition: Isikuga seotud asutus. @et
toolkit definition: Korporation, som er knyttet til en person. @da
toolkit definition: Yhteisö, joka liittyy henkilöön.
toolkit definition: هيئة مرتبطة بشخص. @ar
toolkit definition: 和一个个人有关的一个团体 @zh-hans
toolkit label: Kişinin tüzel kişiyle ilişkisi @tr
toolkit label: Mit Person in Beziehung stehende Körperschaft @de
toolkit label: ar personu saistītā institūcija @lv
toolkit label: collectivité en relation avec une personne @fr
toolkit label: ente correlato di persona @it
toolkit label: entitat corporativa relacionada amb una persona @ca
toolkit label: gerelateerde corporatie van persoon @nl
toolkit label: henkilöön liittyvä yhteisö
toolkit label: isikuga seotud asutus @et
toolkit label: korporasjon relatert til person @no
toolkit label: korporation relateret til person @da
toolkit label: related corporate body of person @en
toolkit label: személyhez kapcsolódó testület: @hu
toolkit label: σχετικό συλλογικό όργανο του φυσικού προσώπου @el
toolkit label: هيئة مرتبطة بشخص @ar
toolkit label: 个人的关联团体 @zh-hans
has subproperty: henkilöjäsen yhteisössä
has subproperty: henkilön perustama yhteisö
has subproperty: toimihenkilönä yhteisössä
has subproperty: tutkinnon myöntänyt oppilaitos
has subproperty: oppilaitos
has subproperty: henkilön sponsoroima yhteisö
has subproperty: P50318
lexical alias: relatedCorporateBodyOfPerson.en
status: Published
type: Property
domain: C10004
label: a pour collectivité en relation avec une personne @fr
label: ar personu saistītā institūcija @lv
label: ha come ente correlato di persona @it
label: har korporasjon relatert til person @no
label: har korporation relateret til person @da
label: has related corporate body of person @en
label: hat mit Person in Beziehung stehende Körperschaft @de
label: heeft gerelateerde corporatie van persoon @nl
label: isikuga seotud asutus @et
label: kişinin ilgili tüzel kişisi ile ilişkilidir @tr
label: személyhez kapcsolódó testület a következő: @hu
label: té com a entitat corporativa relacionada amb una persona @ca
label: έχει σχετικό συλλογικό όργανο του φυσικού προσώπου @el
label: له هيئة مرتبطة بشخص @ar
label: 有个人的关联团体 @zh-hans
sub property of: toimijaan liittyvä yhteisö
sub property of: henkilöön liittyvä yhteistoimija
definition: Bir kişiyi, bir kişiyle bağlantılı olan bir tüzel kişilikle ilişkilendirir. @tr
definition: Correla una persona a un ente associato a una persona. @it
definition: Hozzákapcsol egy személyt egy személyhez kapcsolódó testülethez. @hu
definition: Liittää henkilön yhteisöön, joka liittyy henkilöön.
definition: Met une personne en relation avec une collectivité qui est associée à une personne. @fr
definition: Relaciona una persona amb una entitat corporativa que s’associa amb una persona. @ca
definition: Relateert een persoon aan een corporatie die geassocieerd is met een persoon. @nl
definition: Relaterer en person til en korporasjon som forbindes med en person. @no
definition: Relaterer en person til en korporation, som er knyttet til en person. @da
definition: Relates a person to a corporate body who is associated with a person. @en
definition: Sasaista personu ar institūciju, kas saistīta ar personu. @lv
definition: Seostab isiku isikuga seotud asutusega. @et
definition: Setzt eine Person in Beziehung zu einer Körperschaft, die mit einer Person in Verbindung steht. @de
definition: Συνδέει ένα φυσικό πρόσωπο με ένα συλλογικό όργανο το οποίο συνδέεται με ένα περιγραφόμενο φυσικό πρόσωπο. @el
definition: يربط شخصا بهيئة مرتبطة بشخص. @ar
definition: 将一个个人与和一个个人有关的一个团体关联起来。 @zh-hans

sukuun liittyvä RDA-entiteetti
has element type: 1
toolkit definition: An RDA entity that is associated with a family. @en
toolkit definition: Bir aileyle bağlantılı olan bir RDA varlığı. @tr
toolkit definition: Családhoz kapcsolódó RDA-entitás. @hu
toolkit definition: Een RDA-entiteit die is geassocieerd met een familie. @nl
toolkit definition: Eine RDA-Entität, die mit einer Familie in Verbindung steht. @de
toolkit definition: En RDA-entitet som forbindes med en familie. @no
toolkit definition: Entitat RDA que s’associa amb una família. @ca
toolkit definition: Entità RDA associata a una famiglia. @it
toolkit definition: Entité RDA qui est associée à une famille. @fr
toolkit definition: Perekonnaga seotud RDA olem. @et
toolkit definition: RDA entīte, kas saistīta ar dzimtu/ģimeni. @lv
toolkit definition: RDA-entiteetti, joka liittyy sukuun.
toolkit definition: RDA-entitet, som er knyttet til en familie. @da
toolkit definition: كيان "وام" امرتبط بعائلة. @ar
toolkit definition: 和一个家族有关的一个RDA实体 @zh-hans
toolkit label: Ailenin RDA varlığıyla ilişkisi @tr
toolkit label: Mit Familie in Beziehung stehende RDA-Entität @de
toolkit label: RDA-entitet relateret til familie @da
toolkit label: RDA-entitet relatert til familie @no
toolkit label: ar dzimtu/ģimeni saistītā RDA entīte @lv
toolkit label: családhoz kapcsolódó RDA-entitás: @hu
toolkit label: entitat RDA relacionada amb una família @ca
toolkit label: entità RDA correlata di famiglia @it
toolkit label: entité RDA en relation avec une famille @fr
toolkit label: gerelateerde RDA-entiteit van familie @nl
toolkit label: perekonnaga seotud RDA olem @et
toolkit label: related RDA entity of family @en
toolkit label: sukuun liittyvä RDA-entiteetti
toolkit label: σχετική RDA οντότητα της οικογένειας @el
toolkit label: كيان "وام" مرتبط بعائلة @ar
toolkit label: 家族的关联RDA实体 @zh-hans
has subproperty: sukuun liittyvä teos
has subproperty: sukuun liittyvä ekspressio
has subproperty: sukuun liittyvä manifestaatio
has subproperty: sukuun liittyvä kappale
has subproperty: sukuun liittyvä toimija
has subproperty: sukuun liittyvä paikka
has subproperty: sukuun liittyvä ajanjakso
has subproperty: sukuun liittyvä nomen
has subproperty: P50319
lexical alias: relatedRDAEntityOfFamily.en
status: Published
type: Property
domain: C10008
label: a pour entité RDA en relation avec une famille @fr
label: ailenin ilgili RDA varlığı ile ilişkilidir @tr
label: ar dzimtu/ģimeni saistītā RDA entīte @lv
label: családhoz kapcsolódó RDA-entitás a következő: @hu
label: ha come entità RDA correlata di famiglia @it
label: har RDA-entitet relateret til familie @da
label: har RDA-entitet relatert til familie @no
label: has related RDA entity of family @en
label: hat mit Familie in Beziehung stehende RDA-Entität @de
label: heeft gerelateerde RDA-entiteit van familie @nl
label: perekonnaga seotud RDA olem @et
label: té com a entitat RDA relacionada amb una família @ca
label: έχει σχετική RDA οντότητα της οικογένειας @el
label: له كيان "وام" مرتبط بعائلة @ar
label: 有家族的R关联DA实体 @zh-hans
sub property of: yhteistoimijaan liittyvä RDA-entiteetti
sub property of: sukuun liittyvä entiteetti
alternative label: sukuun liittyvä entiteetti
definition: Bir aileyi, aileyle ilişkili bir RDA varlığıyla ilişkilendirir. @tr
definition: Correla una famiglia a un'entità rda associata a una famiglia. @it
definition: Hozzákapcsol egy családot egy családhoz kapcsolódó RDA-entitáshoz. @hu
definition: Liittää suvun RDA-entiteettiin, joka liittyy sukuun.
definition: Met une famille en relation avec une entité RDA qui est associée à une famille. @fr
definition: Relaciona una família amb una entitat RDA que s’associa amb una família. @ca
definition: Relateert een familie aan een RDA-entiteit die is geassocieerd met een familie. @nl
definition: Relaterer en familie til en RDA-entitet som forbindes med en familie. @no
definition: Relaterer en familie til en RDA-entitet, som er knyttet til en familie. @da
definition: Relates a family to an RDA entity associated with a family. @en
definition: Sasaista dzimtu/ģimeni ar RDA entīti, kas saistīta ar dzimtu/ģimeni. @lv
definition: Seostab perekonna perekonnaga seotud RDA olemiga. @et
definition: Setzt eine Familie in Beziehung zu einer RDA-Entität, die mit einer Familie in Verbindung steht. @de
definition: Συνδέει μια οικογένεια με μια οντότητα η οποία συνδέεται με μια περιγραφόμενη οικογένεια. @el
definition: يربط عائلة بكيان "وام" المرتبط بعائلة. @ar
definition: 将一个家族与和一个家族有关的一个RDA实体关联起来。 @zh-hans

sukuun liittyvä teos
has element type: 1
toolkit definition: A work that is associated with a family. @en
toolkit definition: Bir aileyle bağlantılı olan bir eser. @tr
toolkit definition: Darbs, kas saistīts ar dzimtu/ģimeni. @lv
toolkit definition: Een werk dat geassocieerd is met een familie. @nl
toolkit definition: Egy családhoz kapcsolódó mű. @hu
toolkit definition: Ein Werk, das mit einer Familie in Verbindung steht. @de
toolkit definition: Et verk som forbindes med en familie. @no
toolkit definition: Obra que s’associa amb una família. @ca
toolkit definition: Opera associata a una famiglia. @it
toolkit definition: Perekonnaga seotud teos. @et
toolkit definition: Teos, joka liittyy sukuun.
toolkit definition: Værk, som er knyttet til en familie. @da
toolkit definition: Œuvre qui est associée à une famille. @fr
toolkit definition: عمل ذو صلة بعائلة. @ar
toolkit definition: 和一个家族有关的一种作品 @zh-hans
toolkit label: Mit Familie in Beziehung stehendes Werk @de
toolkit label: aileyle ilişkili eser @tr
toolkit label: ar dzimtu/ģimeni saistītais darbs @lv
toolkit label: családhoz kapcsolódó mű: @hu
toolkit label: gerelateerd werk van familie @nl
toolkit label: obra relacionada amb una família @ca
toolkit label: opera correlata di famiglia @it
toolkit label: perekonnaga seotud teos @et
toolkit label: related work of family @en
toolkit label: sukuun liittyvä teos
toolkit label: verk relatert til familie @no
toolkit label: værk relateret til familie @da
toolkit label: œuvre en relation avec une famille @fr
toolkit label: σχετικό έργο της οικογένειας @el
toolkit label: عمل مرتبط بعائلة @ar
toolkit label: 家族的关联作品 @zh-hans
has subproperty: suku aiheena teoksessa
has subproperty: vastaanottaja (suku) teoksessa
has subproperty: toimituspäällikkö (suku) teoksessa
has subproperty: teoksen omistuksen kohde (suku) teoksessa
has subproperty: kuvaaja (suku) teoksessa
has subproperty: toimeksiantaja (suku) teoksessa
has subproperty: teoksen tekijä (suku) teoksessa
has subproperty: teoksen perustaja (suku) teoksessa
has subproperty: julkaisija (suku) teokselle
has subproperty: järjestäjä (suku) teoksessa
has subproperty: asiantuntija (suku) teoksessa
has subproperty: tutkija (suku) teoksessa
has subproperty: ohjaaja (suku) teoksessa
has subproperty: omistuskirjoituksen tekijä (suku) teoksessa
has subproperty: teoksella kunnioitettu suku teoksessa
has subproperty: suvun sponsoroima teos
has subproperty: P50320
lexical alias: relatedWorkOfFamily.en
status: Published
type: Property
domain: C10008
label: a pour œuvre en relation avec une famille @fr
label: ailenin ilgili eseri ile ilişkilidir @tr
label: ar dzimtu/ģimeni saistītais darbs @lv
label: családhoz kapcsolódó mű a következő: @hu
label: ha come opera correlata di famiglia @it
label: har verk relatert til familie @no
label: har værk relateret til familie @da
label: has related work of family @en
label: hat mit Familie in Beziehung stehendes Werk @de
label: heeft gerelateerd werk van familie @nl
label: perekonnaga seotud teos @et
label: té com a obra relacionada amb una família @ca
label: έχει σχετικό έργο της οικογένειας @el
label: له عمل مرتبط بعائلة @ar
label: 有家族的关联作品 @zh-hans
sub property of: sukuun liittyvä RDA-entiteetti
sub property of: yhteistoimijaan liittyvä teos
definition: Bir aileyi, aileyle bağlantılı bir eserle ilişkilendirir. @tr
definition: Correla una famiglia a un'opera associata a una famiglia. @it
definition: Hozzákapcsol egy családot egy családhoz kapcsolódó műhöz. @hu
definition: Liittää suvun teokseen, joka liittyy sukuun.
definition: Met une famille en relation avec une œuvre qui est associée à une famille. @fr
definition: Relaciona una família amb una obra que s’associa amb una família. @ca
definition: Relateert een familie aan een werk dat geassocieerd is met een familie. @nl
definition: Relaterer en familie til et verk som forbindes med en familie. @no
definition: Relaterer en familie til et værk, som er knyttet til en familie. @da

sukuun liittyvä ekspressio
has element type: 1
toolkit definition: An expression that is associated with a family. @en
toolkit definition: Bir aileyle bağlantılı olan bir anlatım. @tr
toolkit definition: Een expressie die geassocieerd is met een familie. @nl
toolkit definition: Egy családhoz kapcsolódó kifejezési forma. @hu
toolkit definition: Eine Expression, die mit einer Familie in Verbindung steht. @de
toolkit definition: Ekspressio, joka liittyy sukuun.
toolkit definition: Espressione associata a una famiglia. @it
toolkit definition: Et uttrykk som forbindes med en familie. @no
toolkit definition: Expression qui est associée à une famille. @fr
toolkit definition: Expressió que s’associa amb una família. @ca
toolkit definition: Izteiksme, kas ir saistīta ar dzimtu/ģimeni. @lv
toolkit definition: Perekonnaga seotud väljendus. @et
toolkit definition: Udtryk, som er knyttet til en familie. @da
toolkit definition: تعبيرة مرتبطة بعائلة. @ar
toolkit definition: 和一个家族有关的一种内容表达 @zh-hans
toolkit label: Mit Familie in Beziehung stehende Expression @de
toolkit label: ailenin ilişkili olduğu anlatım @tr
toolkit label: ar dzimtu/ģimeni saistītā izteiksme @lv
toolkit label: családhoz kapcsolódó kifejezési forma: @hu
toolkit label: espressione correlata di famiglia @it
toolkit label: expression en relation avec une famille @fr
toolkit label: expressió relacionada amb una família @ca
toolkit label: gerelateerde expressie van familie @nl
toolkit label: perekonnaga seotud väljendus @et
toolkit label: related expression of family @en
toolkit label: sukuun liittyvä ekspressio
toolkit label: udtryk relateret til familie @da
toolkit label: uttrykk relatert til familie @no
toolkit label: σχετική έκφραση της οικογένειας @el
toolkit label: تعبيرة مرتبطة بعائلة @ar
toolkit label: 家族的关联内容表达 @zh-hans
has subproperty: ekspression tekijä (suku) ekspressiossa
has subproperty: P50321
lexical alias: relatedExpressionOfFamily.en
status: Published
type: Property
domain: C10008
label: a pour expression en relation avec une famille @fr
label: ailenin ilgili anlatımı ile ilişkilidir @tr
label: ar dzimtu/ģimeni saistītā izteiksme @lv
label: családhoz kapcsolódó kifejezési forma a következő: @hu
label: ha come espressione correlata di famiglia @it
label: har udtryk relateret til familie @da
label: har uttrykk relatert til familie @no
label: has related expression of family @en
label: hat mit Familie in Beziehung stehende Expression @de
label: heeft gerelateerde expressie van familie @nl
label: perekonnaga seotud väljendus @et
label: té com a expressió relacionada amb una família @ca
label: έχει σχετική έκφραση της οικογένειας @el
label: له تعبيرة مرتبطة بعائلة @ar
label: 有家族的关联内容表达 @zh-hans
sub property of: sukuun liittyvä RDA-entiteetti
sub property of: yhteistoimijaan liittyvä ekspressio
definition: Bir aileyi, aileyle bağlantılı bir anlatımla ilişkilendirir. @tr
definition: Correla una famiglia a un'espressione associata a una famiglia. @it
definition: Hozzákapcsol egy családot egy családhoz kapcsolódó kifejezési formához. @hu
definition: Liittää suvun ekspressioon, joka liittyy sukuun.
definition: Met une famille en relation avec une expression qui est associée à une famille. @fr
definition: Relaciona una família amb una expressió que s’associa amb una família. @ca
definition: Relateert een familie aan een expressie die geassocieerd is met een familie. @nl
definition: Relaterer en familie til et udtryk, som er knyttet til en familie. @da
definition: Relaterer en familie til et uttrykk som forbindes med en familie. @no
definition: Relates a family to an expression that is associated with a family. @en
definition: Sasaista dzimtu/ģimeni ar izteiksmi, kas ir saistīta ar dzimtu/ģimeni. @lv
definition: Seostab perekonna perekonnaga seotud väljendusega. @et
definition: Setzt eine Familie in Beziehung zu einer Expression, die mit einer Familie in Verbindung steht. @de
definition: Συνδέει μια οικογένεια με μια έκφραση η οποία συνδέεται με μια περιγραφόμενη οικογένεια. @el
definition: يربط عائلة بتعبيرة مرتبطة بعائلة. @ar
definition: 将一个家族与和一个家族有关的一种内容表达关联起来。 @zh-hans

sukuun liittyvä manifestaatio
has element type: 1
toolkit definition: A manifestation that is associated with a family. @en
toolkit definition: Bir aile ile bağlantılı olan bir gösterim. @tr
toolkit definition: Een manifestatie die geassocieerd is met een familie. @nl
toolkit definition: Egy családhoz kapcsolódó megjelenési forma. @hu
toolkit definition: Eine Manifestation, die mit einer Familie in Verbindung steht. @de
toolkit definition: En manifestasjon som forbindes med en familie. @no
toolkit definition: Manifestaatio, joka liittyy sukuun.
toolkit definition: Manifestació que s’associa amb una família. @ca
toolkit definition: Manifestation qui est associée à une famille. @fr
toolkit definition: Manifestation, som er knyttet til en familie. @da
toolkit definition: Manifestazione associata a una famiglia. @it
toolkit definition: Manifestācija, kas ir saistīta ar dzimtu/ģimeni. @lv
toolkit definition: Perekonnaga seotud kehastus. @et
toolkit definition: تجسيدة ذات صلة بعائلة. @ar
toolkit definition: 和一个家族有关的一种载体表现 @zh-hans
toolkit label: Ailenin ilişkili gösterimi @tr
toolkit label: Mit Familie in Beziehung stehende Manifestation @de
toolkit label: ar dzimtu/ģimeni saistītā manifestācija @lv
toolkit label: családhoz kapcsolódó megjelenési forma: @hu
toolkit label: gerelateerde manifestatie van familie @nl
toolkit label: manifestació relacionada amb una família @ca
toolkit label: manifestasjon relatert til familie @no
toolkit label: manifestation en relation avec une famille @fr
toolkit label: manifestation relateret til familie @da
toolkit label: manifestazione correlata di famiglia @it
toolkit label: perekonnaga seotud kehastus @et
toolkit label: related manifestation of family @en
toolkit label: sukuun liittyvä manifestaatio
toolkit label: σχετική εκδήλωση της οικογένειας @el
toolkit label: تجسيدة مرتبطة بعائلة @ar
toolkit label: 家族的关联载体表现 @zh-hans
has subproperty: manifestaation tekijä (suku) manifestaatiossa
has subproperty: jakelija (suku) manifestaatiossa
has subproperty: valmistaja (suku) manifestaatiossa
has subproperty: paperinvalmistaja (suku) manifestaatiossa
has subproperty: aggregaattiin osallinen suku manifestaatiossa
has subproperty: P50322
lexical alias: relatedManifestationOfFamily.en
status: Published
type: Property
domain: C10008
label: a pour manifestation en relation avec une famille @fr
label: ailenin ilgili gösterimi ile ilişkilidir @tr
label: ar dzimtu/ģimeni saistītā manifestācija @lv
label: családhoz kapcsolódó megjelenési forma a következő: @hu
label: ha come manifestazione correlata di famiglia @it
label: har manifestasjon relatert til familie @no
label: har manifestation relateret til familie @da
label: has related manifestation of family @en
label: hat mit Familie in Beziehung stehende Manifestation @de
label: heeft gerelateerde manifestatie van familie @nl
label: perekonnaga seotud kehastus @et
label: té com a manifestació relacionada amb una família @ca
label: έχει σχετική εκδήλωση της οικογένειας @el
label: له تجسيدة مرتبطة بعائلة @ar
label: 有家族的关联载体表现 @zh-hans
sub property of: sukuun liittyvä RDA-entiteetti
sub property of: yhteistoimijaan liittyvä manifestaatio
definition: Bir aileyi, aileyle bağlantılı bir gösterimle ilişkilendirir. @tr
definition: Correla una famiglia a una manifestazione associata a una famiglia. @it
definition: Hozzákapcsol egy családot egy családhoz kapcsolódó megjelenési formához. @hu
definition: Liittää suvun manifestaatioon, joka liittyy sukuun.
definition: Met une famille en relation avec une manifestation qui est associée à une famille. @fr
definition: Relaciona una família amb una manifestació que s’associa amb una família. @ca
definition: Relateert een familie aan een manifestatie die geassocieerd is met een familie. @nl
definition: Relaterer en familie til en manifestasjon som forbindes med en familie. @no
definition: Relaterer en familie til en manifestation, som er knyttet til en familie. @da
definition: Relates a family to a manifestation that is associated with a family. @en
definition: Sasaista dzimtu/ģimeni ar manifestāciju, kas ir saistīta ar dzimtu/ģimeni. @lv
definition: Seostab perekonna perekonnaga seotud kehastusega. @et
definition: Setzt eine Familie in Beziehung zu einer Manifestation, die mit einer Familie in Verbindung steht. @de
definition: Συνδέει μια οικογένεια με μια εκδήλωση η οποία συνδέεται με μια περιγραφόμενη οικογένεια. @el
definition: يربط عائلة بتجسيدة مرتبطة بشخص. @ar
definition: 将一个家族与和一个家族有关的一种载体表现关联起来。 @zh-hans

sukuun liittyvä kappale
has element type: 1
toolkit definition: An item that is associated with a family. @en
toolkit definition: Bir aileyle bağlantılı olan bir kopya. @tr
toolkit definition: Een item dat is geassocieerd met een familie. @nl
toolkit definition: Egy családhoz kapcsolódó példány. @hu
toolkit definition: Ein Exemplar, das mit einer Familie in Verbindung steht. @de
toolkit definition: Eksemplar, som er knyttet til en familie. @da
toolkit definition: Et eksemplar som forbindes med en familie. @no
toolkit definition: Item associata a una famiglia. @it
toolkit definition: Item qui est associé à une famille. @fr
toolkit definition: Kappale, joka liittyy sukuun.
toolkit definition: Perekonnaga seotud eksemplar. @et
toolkit definition: Vienība, kas ir saistīta ar dzimtu/ģimeni. @lv
toolkit definition: Ítem que s’associa amb una família. @ca
toolkit definition: مفردة ذات صلة بعائلة. @ar
toolkit definition: 和一个家族有关的一个单件 @zh-hans
toolkit label: Mit Familie in Beziehung stehendes Exemplar @de
toolkit label: aileyle ilişkili kopya @tr
toolkit label: ar dzimtu/ģimeni saistītā vienība @lv
toolkit label: családhoz kapcsolódó példány: @hu
toolkit label: eksemplar relateret til familie @da
toolkit label: eksemplar relatert til familie @no
toolkit label: gerelateerd item van familie @nl
toolkit label: item correlato di famiglia @it
toolkit label: item en relation avec une famille @fr
toolkit label: perekonnaga seotud eksemplar @et
toolkit label: related item of family @en
toolkit label: sukuun liittyvä kappale
toolkit label: ítem relacionat amb una família @ca
toolkit label: σχετικό αντίτυπο της οικογένειας @el
toolkit label: مفردة مرتبطة بعائلة @ar
toolkit label: 家族的关联单件 @zh-hans
has subproperty: kappaleen omistuksen kohde (suku) kappaleessa
has subproperty: sitoja (suku) kappaleessa
has subproperty: kappaleen entisöijä (suku) kappaleessa
has subproperty: kuraattori (suku) kappaleessa
has subproperty: säilyttäjä (suku) kappaleessa
has subproperty: omistaja (suku) kappaleessa
has subproperty: muokkaaja (suku) kappaleessa
has subproperty: illuminoinnin tekijä (suku) kappaleessa
has subproperty: kappaleella kunnioitettu suku kappaleessa
has subproperty: P50323
lexical alias: relatedItemOfFamily.en
status: Published
type: Property
domain: C10008
label: a pour item en relation avec une famille @fr
label: ailenin ilgili kopyası ile ilişkilidir @tr
label: ar dzimtu/ģimeni saistītā vienība @lv
label: családhoz kapcsolódó példány a következő: @hu
label: ha come item correlato di famiglia @it
label: har eksemplar relateret til familie @da
label: har eksemplar relatert til familie @no
label: has related item of family @en
label: hat mit Familie in Beziehung stehendes Exemplar @de
label: heeft gerelateerd item van familie @nl
label: perekonnaga seotud eksemplar @et
label: té com a ítem relacionat amb una família @ca
label: έχει σχετικό αντίτυπο της οικογένειας @el
label: له مفردة مرتبطة بعائلة @ar
label: 有家族的关联单件 @zh-hans
sub property of: sukuun liittyvä RDA-entiteetti
sub property of: yhteistoimijaan liittyvä kappale
definition: Bir aileyi, aileyle bağlantılı bir kopyayla ilişkilendirir. @tr
definition: Correla una famiglia a un item associata a una famiglia. @it
definition: Hozzákapcsol egy családot egy családhoz kapcsolódó példányhoz. @hu
definition: Liittää suvun kappaleeseen, joka liittyy sukuun.
definition: Met une famille en relation avec un item qui est associé à une famille. @fr
definition: Relaciona una família amb un ítem que s’associa amb una família. @ca
definition: Relateert een familie aan een item dat is geassocieerd met een familie. @nl
definition: Relaterer en familie til et eksemplar som forbindes med en familie. @no
definition: Relaterer en familie til et eksemplar, som er knyttet til en familie. @da
definition: Relates a family to an item that is associated with a family. @en
definition: Sasaista dzimtu/ģimeni ar vienību, kas ir saistīta ar dzimtu/ģimeni. @lv
definition: Seostab perekonna perekonnaga seotud eksemplariga. @et
definition: Setzt eine Familie in Beziehung zu einem Exemplar, das mit einer Familie in Verbindung steht. @de
definition: Συνδέει μια οικογένεια με ένα αντίτυπο το οποίο συνδέεται με μια περιγραφόμενη οικογένεια. @el
definition: يربط عائلة بمفردة ذات صلة بعائلة. @ar
definition: 将一个家族与和一个家族有关的一个单件关联起来。 @zh-hans

sukuun liittyvä toimija
has element type: 1
toolkit definition: Agent que s’associa amb una família. @ca
toolkit definition: Agent qui est associé à une famille. @fr
toolkit definition: Agent, som er knyttet til en familie. @da
toolkit definition: Agente associato a una famiglia. @it
toolkit definition: An agent who is associated with a family. @en
toolkit definition: Aģents, kas saistīts ar dzimtu/ģimenei. @lv
toolkit definition: Bir aile ile bağlantılı olan bir temsilci. @tr
toolkit definition: Een actor die geassocieerd is met een familie. @nl
toolkit definition: Egy családhoz kapcsolódó ágens. @hu
toolkit definition: Ein Akteur, der mit einer Familie in Verbindung steht. @de
toolkit definition: En agent som forbindes med en familie. @no
toolkit definition: Perekonnaga seotud tegija. @et
toolkit definition: Toimija, joka liittyy sukuun.
toolkit definition: وكيل ذو صلة بعائلة. @ar
toolkit definition: 和一个家族有关的一个行为者 @zh-hans
toolkit label: Mit Familie in Beziehung stehender Akteur @de
toolkit label: agent en relation avec une famille @fr
toolkit label: agent relacionat amb una família @ca
toolkit label: agent relateret til familie @da
toolkit label: agent relatert til familie @no
toolkit label: agente correlato di famiglia @it
toolkit label: aileyle ilişkili temsilci @tr
toolkit label: ar dzimtu/ģimeni saistītais aģents @lv
toolkit label: családhoz kapcsolódó ágens: @hu
toolkit label: gerelateerde actor van familie @nl
toolkit label: perekonnaga seotud tegija @et
toolkit label: related agent of family @en
toolkit label: sukuun liittyvä toimija
toolkit label: σχετικός φορέας της οικογένειας @el
toolkit label: وكيل مرتبط بعائلة @ar
toolkit label: 家族的关联行为者 @zh-hans
has subproperty: sukuun liittyvä henkilö
has subproperty: sukuun liittyvä yhteistoimija
has subproperty: P50324
lexical alias: relatedAgentOfFamily.en
status: Published
type: Property
domain: C10008
label: a pour agent en relation avec une famille @fr
label: ailenin ilgili temsilcisi ile ilişkilidir @tr
label: ar dzimtu/ģimeni saistītais aģents @lv
label: családhoz kapcsolódó ágens a következő: @hu
label: ha come agente correlato di famiglia @it
label: har agent relateret til familie @da
label: har agent relatert til familie @no
label: has related agent of family @en
label: hat mit Familie in Beziehung stehenden Akteur @de
label: heeft gerelateerde actor van familie @nl
label: perekonnaga seotud tegija @et
label: té com a agent relacionat amb una família @ca
label: έχει σχετικό φορέα της οικογένειας @el
label: له وكيل مرتبط بعائلة @ar
label: 有家族的关联行为者 @zh-hans
sub property of: sukuun liittyvä RDA-entiteetti
sub property of: yhteistoimijaan liittyvä toimija
definition: Bir aileyi, aileyle bağlantılı bir temsilciyle ilişkilendirir. @tr
definition: Correla una famiglia a un agente associato a una famiglia. @it
definition: Hozzákapcsol egy családot egy családhoz kapcsolódó ágenshez. @hu
definition: Liittää suvun toimijaan, joka liittyy sukuun.
definition: Met une famille en relation avec un agent qui est associé à une famille. @fr
definition: Relaciona una família amb un agent que s’associa amb una família. @ca
definition: Relateert een familie aan een actor die geassocieerd is met een familie. @nl
definition: Relaterer en familie til en agent som forbindes med en familie. @no
definition: Relaterer en familie til en agent, som er knyttet til en familie. @da
definition: Relates a family to an agent who is associated with a family. @en
definition: Sasaista dzimtu/ģimeni ar aģentu, kas saistīts ar dzimtu/ģimenei. @lv
definition: Seostab perekonna perekonnaga seotud tegijaga. @et
definition: Setzt eine Familie in Beziehung zu einem Akteur, der mit einer Familie in Verbindung steht. @de
definition: Συνδέει μια οικογένεια με έναν φορέα ο οποίος συνδέεται με μια περιγραφόμενη οικογένεια. @el
definition: يربط عائلة بوكيل مرتبط بعائلة. @ar
definition: 将一个家族与和一个家族有关的一个行为者关联起来。 @zh-hans

sukuun liittyvä henkilö
has element type: 1
toolkit definition: A person who is associated with a family. @en
toolkit definition: Bir aileyle bağlantılı olan bir kişi. @tr
toolkit definition: Een persoon die geassocieerd is met een familie. @nl
toolkit definition: Egy családhoz kapcsolódó személy. @hu
toolkit definition: Ein Person, die mit einer Familie in Verbindung steht. @de
toolkit definition: En person som forbindes med en familie. @no
toolkit definition: Henkilö, joka liittyy sukuun.
toolkit definition: Perekonnaga seotud isik. @et
toolkit definition: Person, som er knyttet til en familie. @da
toolkit definition: Persona associata a una famiglia. @it
toolkit definition: Persona que s’associa amb una família. @ca
toolkit definition: Persona, kura saistīta ar dzimtu/ģimeni. @lv
toolkit definition: Personne qui est associée à une famille. @fr
toolkit definition: شخص ذو صلة بعائلة. @ar
toolkit definition: 和一个家族有关的一个个人 @zh-hans
toolkit label: Mit Familie in Beziehung stehende Person @de
toolkit label: aileyle ilişkili kişi @tr
toolkit label: ar dzimtu/ģimeni saistītā persona @lv
toolkit label: családhoz kapcsolódó személy: @hu
toolkit label: gerelateerde persoon van familie @nl
toolkit label: perekonnaga seotud isik @et
toolkit label: person relateret til familie @da
toolkit label: person relatert til familie @no
toolkit label: persona correlata di famiglia @it
toolkit label: persona relacionada amb una família @ca
toolkit label: personne en relation avec une famille @fr
toolkit label: related person of family @en
toolkit label: sukuun liittyvä henkilö
toolkit label: σχετικό φυσικό πρόσωπο της οικογένειας @el
toolkit label: شخص مرتبط بعائلة @ar
toolkit label: 家族的关联个人 @zh-hans
has subproperty: suvun henkilöjäsen
has subproperty: P50325
lexical alias: relatedPersonOfFamily.en
status: Published
type: Property
domain: C10008
label: a pour personne en relation avec une famille @fr
label: ailenin ilgili kişisi ile ilişkilidir @tr
label: ar dzimtu/ģimeni saistītā persona @lv
label: családhoz kapcsolódó személy a következő: @hu
label: ha come personacorrelata di famiglia @it
label: har person relateret til familie @da
label: har person relatert til familie @no
label: has related person of family @en
label: hat mit Familie in Beziehung stehende Person @de
label: heeft gerelateerde persoon van familie @nl
label: perekonnaga seotud isik @et
label: té com a persona relacionada amb una família @ca
label: έχει σχετικό φυσικό πρόσωπο της οικογένειας @el
label: له شخص مرتبط بعائلة @ar
label: 有家族的关联个人 @zh-hans
sub property of: sukuun liittyvä toimija
sub property of: yhteistoimijaan liittyvä henkilö
definition: Bir aileyi, aileyle bağlantılı bir kişiyle ilişkilendirir. @tr
definition: Correla una famiglia a una persona associata a una famiglia. @it
definition: Hozzákapcsol egy családot egy családhoz kapcsolódó személyhez. @hu
definition: Liittää suvun henkilöön, joka liittyy sukuun.
definition: Met une famille en relation avec une personne qui est associée à une famille. @fr
definition: Relaciona una família amb una persona que s’associa amb una família. @ca
definition: Relateert een familie aan een persoon die geassocieerd is met een familie. @nl
definition: Relaterer en familie til en person som forbindes med en familie. @no
definition: Relaterer en familie til en person, som er knyttet til en familie. @da
definition: Relates a family to a person who is associated with a family. @en
definition: Sasaista dzimtu/ģimeni ar personu, kura saistīta ar dzimtu/ģimeni. @lv
definition: Seostab perekonna perekonnaga seotud isikuga. @et
definition: Setzt eine Familie in Beziehung zu einer Person, die mit einer Familie in Verbindung steht. @de
definition: Συνδέει μια οικογένεια με ένα φυσικό πρόσωπο το οποίο συνδέεται με μια περιγραφόμενη οικογένεια. @el
definition: يربط عائلة بشخص مرتبط بعائلة. @ar
definition: 将一个家族与和一个家族有关的一个个人关联起来。 @zh-hans

sukuun liittyvä suku
has element type: 1
toolkit definition: A family who is associated with a family. @en
toolkit definition: Bir aile ile bağlantılı olan bir aile. @tr
toolkit definition: Dzimta/ģimene, kas saistīta ar dzimtu/ģimeni. @lv
toolkit definition: Een familie die geassocieerd is met een familie. @nl
toolkit definition: Egy családhoz kapcsolódó család. @hu
toolkit definition: Eine Familie, die mit einer Familie in Verbindung steht. @de
toolkit definition: En familie som forbindes med en familie. @no
toolkit definition: Famiglia associata a una famiglia. @it
toolkit definition: Familie, som er knyttet til en familie. @da
toolkit definition: Famille qui est associée à une famille. @fr
toolkit definition: Família que s’associa amb una família. @ca
toolkit definition: Perekonnaga seotud perekond. @et
toolkit definition: Suku, joka liittyy sukuun.
toolkit definition: عائلة ذات صلة بعائلة. @ar
toolkit definition: 和一个家族有关的一个家族 @zh-hans
toolkit label: Aileyle ilişkili aile @tr
toolkit label: Mit Familie in Beziehung stehende Familie @de
toolkit label: ar dzimtu/ģimeni saistītā dzimta/ģimene @lv
toolkit label: családhoz kapcsolódó család: @hu
toolkit label: famiglia correlata di famiglia @it
toolkit label: familie relateret til familie @da
toolkit label: familie relatert til familie @no
toolkit label: famille en relation avec une famille @fr
toolkit label: família relacionada amb una família @ca
toolkit label: gerelateerde familie van familie @nl
toolkit label: perekonnaga seotud perekond @et
toolkit label: related family of family @en
toolkit label: sukuun liittyvä suku
toolkit label: σχετική οικογένεια της οικογένειας @el
toolkit label: عائلة مرتبطة بعائلة @ar
toolkit label: 家族的关联家族 @zh-hans
has subproperty: suvun edeltäjä
has subproperty: suvun seuraaja
has subproperty: suvun sukuhaara
has subproperty: sukuhaara suvussa
has subproperty: P50326
lexical alias: relatedFamilyOfFamily.en
status: Published
type: Property
domain: C10008
label: a pour famille en relation avec une famille @fr
label: ailenin ilgili ailesi ile ilişkilidir @tr
label: ar dzimtu/ģimeni saistītā dzimta/ģimene @lv
label: családhoz kapcsolódó család a következő: @hu
label: ha come famiglia correlata di famiglia @it
label: har familie relateret til familie @da
label: har familie relatert til familie @no
label: has related family of family @en
label: hat mit Familie in Beziehung stehende Familie @de
label: heeft gerelateerde familie van familie @nl
label: perekonnaga seotud perekond @et
label: té com a família relacionada amb una família @ca
label: έχει σχετική οικογένεια της οικογένειας @el
label: له عائلة مرتبطة بعائلة @ar
label: 有家族的关联家族 @zh-hans
sub property of: sukuun liittyvä yhteistoimija
sub property of: yhteistoimijaan liittyvä suku
definition: Bir aileyi, aileyle ilişkisi olan bir aile ile ilişkilendirir. @tr
definition: Correla una famiglia a una famiglia associata a una famiglia. @it
definition: Hozzákapcsol egy családot egy családhoz kapcsolódó családhoz. @hu
definition: Liittää suvun sukuun, joka liittyy sukuun.
definition: Met une famille en relation avec une famille qui est associée à une famille. @fr
definition: Relaciona una família amb una família que s’associa amb una família. @ca
definition: Relateert een familie aan een familie die geassocieerd is met een familie. @nl
definition: Relaterer en familie til en familie som forbindes med en familie. @no
definition: Relaterer en familie til en familie, som er knyttet til en familie. @da
definition: Relates a family to a family who is associated with a family. @en
definition: Sasaista dzimtu/ģimeni ar dzimtu/ģimeni, kas saistīta ar dzimtu/ģimeni. @lv
definition: Seostab perekonna perekonnaga seotud perekonnaga. @et
definition: Setzt eine Familie in Beziehung zu einer Familie, die mit einer Familie in Verbindung steht. @de
definition: Συνδέει μια οικογένεια με μια οικογένεια η οποία συνδέεται με μια περιγραφόμενη οικογένεια. @el
definition: يربط عائلة بعائلة ذات صلة بعائلة. @ar
definition: 将一个家族与和一个家族有关的一个家族关联起来。 @zh-hans

sukuun liittyvä yhteisö
has element type: 1
toolkit definition: A corporate body who is associated with a family. @en
toolkit definition: Bir aileyle bağlantılı tüzel kişi @tr
toolkit definition: Collectivité qui est associée à une famille. @fr
toolkit definition: Een corporatie die geassocieerd is met een familie. @nl
toolkit definition: Egy családhoz kapcsolódó testület. @hu
toolkit definition: Eine Körperschaft, die mit einer Familie in Verbindung steht. @de
toolkit definition: En korporasjon som forbindes med en familie. @no
toolkit definition: Ente associato a una famiglia. @it
toolkit definition: Entitat corporativa que s’associa amb una família. @ca
toolkit definition: Institūcija, kas saistīta ar dzimtu/ģimeni. @lv
toolkit definition: Korporation, som er knyttet til en familie. @da
toolkit definition: Perekonnaga seotud asutus. @et
toolkit definition: Yhteisö, joka liittyy sukuun.
toolkit definition: هيئة ذات صلة بعائلة. @ar
toolkit definition: 和一个家族有关的一个团体 @zh-hans
toolkit label: Mit Familie in Beziehung stehende Körperschaft @de
toolkit label: ailenin tüzel kişiyle ilişkisi @tr
toolkit label: ar dzimtu/ģimeni saistītā institūcija @lv
toolkit label: collectivité en relation avec une famille @fr
toolkit label: családhoz kapcsolódó testület: @hu
toolkit label: ente correlato di famiglia @it
toolkit label: entitat corporativa relacionada amb una família @ca
toolkit label: gerelateerde corporatie van familie @nl
toolkit label: korporasjon som forbindes med familie @no
toolkit label: korporation relateret til familie @da
toolkit label: perekonnaga seotud asutus @et
toolkit label: related corporate body of family @en
toolkit label: sukuun liittyvä yhteisö
toolkit label: σχετικό συλλογικό όργανο της οικογένειας @el
toolkit label: هيئة مرتبطة بعائلة @ar
toolkit label: 家族的关联团体 @zh-hans
has subproperty: suvun perustama yhteisö
has subproperty: suvun sponsoroima yhteisö
has subproperty: suvun yhteisöjäsen
has subproperty: sukujäsen yhteisössä
has subproperty: P50327
lexical alias: relatedCorporateBodyOfFamily.en
status: Published
type: Property
domain: C10008
label: a pour collectivité en relation avec une famille @fr
label: ailenin ilgili tüzel kişisi ile ilişkilidir @tr
label: ar dzimtu/ģimeni saistītā institūcija @lv
label: családhoz kapcsolódó testület a következő: @hu
label: ha come ente correlato di famiglia @it
label: har korporasjon som forbindes med familie @no
label: har korporation relateret til familie @da
label: has related corporate body of family @en
label: hat mit Familie in Beziehung stehende Körperschaft @de
label: heeft gerelateerde corporatie van familie @nl
label: perekonnaga seotud asutus @et
label: té com a entitat corporativa relacionada amb una família @ca
label: έχει σχετικό συλλογικό όργανο της οικογένειας @el
label: له هيئة مرتبطة بعائلة @ar
label: 有家族的关联团体 @zh-hans
sub property of: sukuun liittyvä yhteistoimija
sub property of: yhteistoimijaan liittyvä yhteisö
definition: Bir aileyi, aileyle bağlantılı bir tüzel kişilikle ilişkilendirir. @tr
definition: Correla una famiglia a un ente associato a una famiglia. @it
definition: Hozzákapcsol egy családot egy családhoz kapcsolódó testülethez. @hu
definition: Liittää suvun yhteisöön, joka liittyy sukuun.
definition: Met une famille en relation avec une collectivité qui est associée à une famille. @fr
definition: Relaciona una família amb una entitat corporativa que s’associa amb una família. @ca
definition: Relateert een familie aan een corporatie die geassocieerd is met een familie. @nl
definition: Relaterer en familie til en korporasjon som forbindes med en familie. @no
definition: Relaterer en familie til en korporation, som er knyttet til en familie. @da
definition: Relates a family to a corporate body who is associated with a family. @en
definition: Sasaista dzimtu/ģimeni ar institūciju, kas saistīta ar dzimtu/ģimeni. @lv
definition: Seostab perekonna perekonnaga seotud asutusega. @et
definition: Setzt eine Familie in Beziehung zu einer Körperschaft, die mit einer Familie in Verbindung steht. @de
definition: Συνδέει μια οικογένεια με ένα συλλογικό όργανο το οποίο συνδέεται με μια περιγραφόμενη οικογένεια. @el
definition: يربط عائلة بهيئة ذات صلة بعائلة. @ar
definition: 将一个家族与和一个家族有关的一个团体关联起来。 @zh-hans

yhteisöön liittyvä RDA-entiteetti
has element type: 1
toolkit definition: An RDA entity that is associated with a corporate body. @en
toolkit definition: Asutusega seotud RDA olem. @et
toolkit definition: Bir tüzel kişiyle bağlantılı olan bir RDA varlığı. @tr
toolkit definition: Een RDA-entiteit die is geassocieerd met een corporatie. @nl
toolkit definition: Eine RDA-Entität, die mit einer Körperschaft in Verbindung steht. @de
toolkit definition: En RDA-entitet som forbindes med en korporasjon. @no
toolkit definition: Entitat RDA que s’associa amb una entitat corporativa. @ca
toolkit definition: Entità RDA associata a un ente. @it
toolkit definition: Entité RDA qui est associée à une collectivité. @fr
toolkit definition: RDA entīte, kas saistīta ar institūciju. @lv
toolkit definition: RDA-entiteetti, joka liittyy yhteisöön.
toolkit definition: RDA-entitet, som er knyttet til en korporation. @da
toolkit definition: Testülethez kapcsolódó RDA-entitás. @hu
toolkit definition: كيان "وام" ذو صلة بهيئة. @ar
toolkit definition: 和一个团体有关的一个RDA实体 @zh-hans
toolkit label: Mit Körperschaft in Beziehung stehende RDA-Entität @de
toolkit label: RDA-entitet relateret til korporation @da
toolkit label: RDA-entitet relatert til korporasjon @no
toolkit label: ar institūciju saistītā RDA entīte @lv
toolkit label: asutusega seotud RDA olem @et
toolkit label: entitat RDA relacionada amb una entitat corporativa @ca
toolkit label: entità RDA correlata di ente @it
toolkit label: entité RDA en relation avec une collectivité @fr
toolkit label: gerelateerde RDA-entiteit van corporatie @nl
toolkit label: related RDA entity of corporate body @en
toolkit label: testülethez kapcsolódó RDA-entitás: @hu
toolkit label: tüzel kişiliğin RDA varlığıyla ilişkisi @tr
toolkit label: yhteisöön liittyvä RDA-entiteetti
toolkit label: σχετική RDA οντότητα του συλλογικού οργάνου @el
toolkit label: كيان "وام" مرتبط بهيئة @ar
toolkit label: 团体的关联RDA实体 @zh-hans
has subproperty: yhteisöön liittyvä teos
has subproperty: yhteisöön liittyvä ekspressio
has subproperty: yhteisöön liittyvä manifestaatio
has subproperty: yhteisöön liittyvä kappale
has subproperty: yhteisöön liittyvä toimija
has subproperty: yhteisöön liittyvä paikka
has subproperty: yhteisöön liittyvä ajanjakso
has subproperty: yhteisöön liittyvä nomen
has subproperty: P50328
lexical alias: relatedRDAEntityOfCorporateBody.en
status: Published
type: Property
domain: C10005
label: a pour entité RDA en relation avec une collectivité @fr
label: ar institūciju saistītā RDA entīte @lv
label: asutusega seotud RDA olem @et
label: ha come entità RDA correlata di ente @it
label: har RDA-entitet relateret til korporation @da
label: har RDA-entitet relatert til korporasjon @no
label: has related RDA entity of corporate body @en
label: hat mit Körperschaft in Beziehung stehende RDA-Entität @de
label: heeft gerelateerde RDA-entiteit van corporatie @nl
label: testülethez kapcsolódó RDA-entitás a következő: @hu
label: té com a entitat RDA relacionada amb una entitat corporativa @ca
label: tüzel kişinin ilgili RDA varlığı ile ilişkilidir @tr
label: έχει σχετική RDA οντότητα του συλλογικού οργάνου @el
label: له كيان "وام" مرتبط بهيئة @ar
label: 有团体的关联RDA实体 @zh-hans
sub property of: yhteistoimijaan liittyvä RDA-entiteetti
sub property of: yhteisöön liittyvä entiteetti
alternative label: yhteisöön liittyvä entiteetti
definition: Bir tüzel kişiyi, tüzel kişilikle bağlantılı bir RDA varlığıyla ilişkilendirir. @tr
definition: Correla un ente a un'entità RDA associata a un ente. @it
definition: Hozzákapcsol egy testületet egy testülethez kapcsolódó RDA-entitáshoz. @hu
definition: Liittää yhteisön RDA-entiteettiin, joka liittyy yhteisöön.
definition: Met une collectivité en relation avec une entité RDA qui est associée à une collectivité. @fr
definition: Relaciona una entitat corporativa amb una entitat RDA que s’associa amb una entitat corporativa. @ca
definition: Relateert een corporatie aan een RDA-entiteit die is geassocieerd met een corporatie. @nl
definition: Relaterer en korporasjon til en RDA-entitet som forbindes med en korporasjon. @no
definition: Relaterer en korporation til en RDA-entitet, som er knyttet til en korporation. @da
definition: Relates a corporate body to an RDA entity associated with a corporate body. @en
definition: Sasaista institūciju ar RDA entīti, kas saistīta ar institūciju. @lv
definition: Seostab asutuse asutusega seotud RDA olemiga. @et
definition: Setzt eine Körperschaft in Beziehung zu einer RDA-Entität, die mit einer Körperschaft in Verbindung steht. @de
definition: Συνδέει ένα συλλογικό όργανο με μια οντότητα η οποία συνδέεται με ένα περιγραφόμενο συλλογικό όργανο. @el
definition: يربط هيئة بكيان "وام" ذي صلة بهيئة. @ar
definition: 将一个团体与和一个团体有关的一个RDA实体关联起来。 @zh-hans

yhteisöön liittyvä teos
has element type: 1
toolkit definition: A work that is associated with a corporate body. @en
toolkit definition: Asutusega seotud teos. @et
toolkit definition: Bir tüzel kişi ile bağlantılı olan bir eser. @tr
toolkit definition: Darbs, kas saistīts ar institūciju. @lv
toolkit definition: Een werk dat geassocieerd is met een corporatie. @nl
toolkit definition: Egy testülethez kapcsolódó mű. @hu
toolkit definition: Ein Werk, das mit einer Körperschaft in Verbindung steht. @de
toolkit definition: Et verk som forbindes med en korporasjon. @no
toolkit definition: Obra que s’associa amb una entitat corporativa. @ca
toolkit definition: Opera associata a un ente. @it
toolkit definition: Teos, joka liittyy yhteisöön.
toolkit definition: Værk, som er knyttet til en korporation. @da
toolkit definition: Œuvre qui est associée à une collectivité. @fr
toolkit definition: عمل ذو صلة بهيئة. @ar
toolkit definition: 和一个团体有关的一种作品 @zh-hans
toolkit label: Mit Körperschaft in Beziehung stehendes Werk @de
toolkit label: ar institūciju saistītais darbs @lv
toolkit label: asutusega seotud teos @et
toolkit label: gerelateerd werk van corporatie @nl
toolkit label: obra relacionada amb una entitat corporativa @ca
toolkit label: opera correlata di ente @it
toolkit label: related work of corporate body @en
toolkit label: testülethez kapcsolódó mű: @hu
toolkit label: tüzel kişilikle ilişkili eser @tr
toolkit label: verk relatert til korporasjon @no
toolkit label: værk relateret til korporation @da
toolkit label: yhteisöön liittyvä teos
toolkit label: œuvre en relation avec une collectivité @fr
toolkit label: σχετικό έργο του συλλογικού οργάνου @el
toolkit label: عمل مرتبط بهيئة @ar
toolkit label: 团体的关联作品 @zh-hans
has subproperty: isäntäorganisaatio teoksessa
has subproperty: yhteisö aiheena teoksessa
has subproperty: vastaanottaja (yhteisö) teoksessa
has subproperty: teoksen omistuksen kohde (yhteisö) teoksessa
has subproperty: kuvaaja (yhteisö) teoksessa
has subproperty: toimeksiantaja (yhteisö) teoksessa
has subproperty: er korporation, som er ophav til værk af
has subproperty: julkaisija (yhteisö) teokselle
has subproperty: teoksella kunnioitettu yhteisö teoksessa
has subproperty: yhteisön sponsoroima teos
has subproperty: P50329
lexical alias: relatedWorkOfCorporateBody.en
status: Published
type: Property
domain: C10005
label: a pour œuvre en relation avec une collectivité @fr
label: ar institūciju saistītais darbs @lv
label: asutusega seotud teos @et
label: ha come opera correlata di ente @it
label: har verk relatert til korporasjon @no
label: har værk relateret til korporation @da
label: has related work of corporate body @en
label: hat mit Körperschaft in Beziehung stehendes Werk @de
label: heeft gerelateerd werk van corporatie @nl
label: testülethez kapcsolódó mű a következő: @hu
label: té com a obra relacionada amb una entitat corporativa @ca
label: tüzel kişinin ilgili eseri ile ilişkilidir @tr
label: έχει σχετικό έργο του συλλογικού οργάνου @el
label: له عمل مرتبط بهيئة @ar
label: 有团体的关联作品 @zh-hans
sub property of: yhteisöön liittyvä RDA-entiteetti
sub property of: yhteistoimijaan liittyvä teos
definition: Bir tüzel kişiyi, tüzel kişilikle bağlantılı bir eserle ilişkilendirir. @tr
definition: Correla un ente a un'opera associata a un ente. @it
definition: Hozzákapcsol egy testületet egy testülethez kapcsolódó műhöz. @hu
definition: Liittää yhteisön teokseen, joka liittyy yhteisöön.
definition: Met une collectivité en relation avec une œuvre qui est associée à une collectivité. @fr
definition: Relaciona una entitat corporativa amb una obra que s’associa amb una entitat corporativa. @ca
definition: Relateert een corporatie aan een werk dat geassocieerd is met een corporatie. @nl
definition: Relaterer en korporasjon til et verk som forbindes med en korporasjon. @no
definition: Relaterer en korporation til et værk, som er knyttet til en korporation. @da
definition: Relates a corporate body to a work that is associated with a corporate body. @en
definition: Sasaista institūciju ar darbu, kas saistīts ar institūciju. @lv
definition: Seostab asutuse asutusega seotud teosega. @et
definition: Setzt eine Körperschaft in Beziehung zu einem Werk, das mit einer Körperschaft in Verbindung steht. @de
definition: Συνδέει ένα συλλογικό όργανο με ένα έργο το οποίο συνδέεται με ένα περιγραφόμενο συλλογικό όργανο. @el
definition: يربط هيئة بعمل ذي صلة بهيئة. @ar

yhteisöön liittyvä ekspressio
has element type: 1
toolkit definition: An expression that is associated with a corporate body. @en
toolkit definition: Asutusega seotud väljendus. @et
toolkit definition: Bir tüzel kişilikle bağlantılı olan bir anlatım. @tr
toolkit definition: Een expressie die geassocieerd is met een corporatie. @nl
toolkit definition: Egy testülethez kapcsolódó kifejezési forma. @hu
toolkit definition: Eine Expression, die mit einer Körperschaft in Verbindung steht. @de
toolkit definition: Ekspressio, joka liittyy yhteisöön.
toolkit definition: Espressione associata a un ente. @it
toolkit definition: Et uttrykk som forbindes med en korporasjon. @no
toolkit definition: Expression qui est associée à une collectivité. @fr
toolkit definition: Expressió que s’associa amb una entitat corporativa. @ca
toolkit definition: Izteiksme, kas ir saistīta ar institūciju. @lv
toolkit definition: Udtryk, som er knyttet til en korporation. @da
toolkit definition: تعبيرة ذات صلة بهيئة. @ar
toolkit definition: 和一个团体有关的一种内容表达 @zh-hans
toolkit label: Mit Körperschaft in Beziehung stehende Expression @de
toolkit label: ar institūciju saistītā izteiksme @lv
toolkit label: asutusega seotud väljendus @et
toolkit label: espressione correlata di ente @it
toolkit label: expression en relation avec une collectivité @fr
toolkit label: expressió relacionada amb una entitat corporativa @ca
toolkit label: gerelateerde expressie van corporatie @nl
toolkit label: related expression of corporate body @en
toolkit label: testülethez kapcsolódó kifejezési forma: @hu
toolkit label: tüzel kişiliğin ilişkili olduğu anlatım @tr
toolkit label: udtryk relateret til korporation @da
toolkit label: uttrykk relatert til korporasjon @no
toolkit label: yhteisöön liittyvä ekspressio
toolkit label: σχετική έκφραση του συλλογικού οργάνου @el
toolkit label: تعبيرة مرتبطة بهيئة @ar
toolkit label: 团体的关联内容表达 @zh-hans
has subproperty: ekspression tekijä (yhteisö) ekspressiossa
has subproperty: P50330
lexical alias: relatedExpressionOfCorporateBody.en
status: Published
type: Property
domain: C10005
label: a pour expression en relation avec une collectivité @fr
label: ar institūciju saistītā izteiksme @lv
label: asutusega seotud väljendus @et
label: ha come espressione correlata di ente @it
label: har udtryk relateret til korporation @da
label: har uttrykk relatert til korporasjon @no
label: has related expression of corporate body @en
label: hat mit Körperschaft in Beziehung stehende Expression @de
label: heeft gerelateerde expressie van corporatie @nl
label: testülethez kapcsolódó kifejezési forma a következő: @hu
label: té com a expressió relacionada amb una entitat corporativa @ca
label: tüzel kişinin ilgili anlatımı ile ilişkilidir @tr
label: έχει σχετική έκφραση του συλλογικού οργάνου @el
label: له تعبيرة مرتبطة بهيئة @ar
label: 有团体的关联内容表达 @zh-hans
sub property of: yhteisöön liittyvä RDA-entiteetti
sub property of: yhteistoimijaan liittyvä ekspressio
definition: Bir tüzel kişiyi, tüzel kişilikle alakalı bir anlatımla ilişkilendirir. @tr
definition: Correla un ente a un'espressione associata a un ente. @it
definition: Hozzákapcsol egy testületet egy testülethez kapcsolódó kifejezési formához. @hu
definition: Liittää yhteisön ekspressioon, joka liittyy yhteisöön.
definition: Met une collectivité en relation avec une expression qui est associée à une collectivité. @fr
definition: Relaciona una entitat corporativa amb una expressió que s’associa amb una entitat corporativa. @ca
definition: Relateert een corporatie aan een expressie die geassocieerd is met een corporatie. @nl
definition: Relaterer en korporasjon til et uttrykk som forbindes med en korporasjon. @no
definition: Relaterer en korporation til et udtryk, som er knyttet til en korporation. @da
definition: Relates a corporate body to an expression that is associated with a corporate body. @en
definition: Sasaista institūciju ar izteiksmi, kas ir saistīta ar institūciju. @lv
definition: Seostab asutuse asutusega seotud väljendusega. @et
definition: Setzt eine Körperschaft in Beziehung zu einer Expression, die mit einer Körperschaft in Verbindung steht. @de
definition: Συνδέει ένα συλλογικό όργανο με μια έκφραση η οποία συνδέεται με ένα περιγραφόμενο συλλογικό όργανο. @el
definition: يربط هيئة بتعبيرة ذات صلة بهيئة. @ar
definition: 将一个团体与和一个团体有关的一种内容表达关联起来。 @zh-hans

yhteisöön liittyvä manifestaatio
has element type: 1
toolkit definition: A manifestation that is associated with a corporate body. @en
toolkit definition: Asutusega seotud kehastus. @et
toolkit definition: Een manifestatie die geassocieerd is met een corporatie. @nl
toolkit definition: Egy testülethez kapcsolódó megjelenési forma. @hu
toolkit definition: Eine Manifestation, die mit einer Körperschaft in Verbindung steht. @de
toolkit definition: En manifestasjon som forbindes med en korporasjon. @no
toolkit definition: Manifestaatio, joka liittyy yhteisöön.
toolkit definition: Manifestació que s’associa amb una entitat corporativa. @ca
toolkit definition: Manifestation qui est associée à une collectivité. @fr
toolkit definition: Manifestation, som er knyttet til en korporation. @da
toolkit definition: Manifestazione associata a un ente. @it
toolkit definition: Manifestācija, kas ir saistīta ar institūciju. @lv
toolkit definition: Tüzel bir kişiyle bağlantılı olan bir gösterim. @tr
toolkit definition: تجسيدة ذات صلة بهيئة. @ar
toolkit definition: 和一个团体有关的一种载体表现 @zh-hans
toolkit label: Mit Körperschaft in Beziehung stehende Manifestation @de
toolkit label: ar institūciju saistītā manifestācija @lv
toolkit label: asutusega seotud kehastus @et
toolkit label: gerelateerde manifestatie van corporatie @nl
toolkit label: manifestació relacionada amb una entitat corporativa @ca
toolkit label: manifestasjon relatert til korporasjon @no
toolkit label: manifestation en relation avec une collectivité @fr
toolkit label: manifestation relateret til korporation @da
toolkit label: manifestazione correlata di ente @it
toolkit label: related manifestation of corporate body @en
toolkit label: testülethez kapcsolódó megjelenési forma: @hu
toolkit label: tüzel kişiliğinilişkili gösterimi @tr
toolkit label: yhteisöön liittyvä manifestaatio
toolkit label: σχετική εκδήλωση του συλλογικού οργάνου @el
toolkit label: تجسيدة مرتبطة بهيئة @ar
toolkit label: 团体的关联载体表现 @zh-hans
has subproperty: manifestaation tekijä (yhteisö) manifestaatiossa
has subproperty: jakelija (yhteisö) manifestaatiossa
has subproperty: valmistaja (yhteisö) manifestaatiossa
has subproperty: paperinvalmistaja (yhteisö) manifestaatiossa
has subproperty: aggregaattiin osallinen yhteisö manifestaatiossa
has subproperty: P50331
lexical alias: relatedManifestationOfCorporateBody.en
status: Published
type: Property
domain: C10005
label: a pour manifestation en relation avec une collectivité @fr
label: ar institūciju saistītā manifestācija @lv
label: asutusega seotud kehastus @et
label: ha come manifestazione correlata di ente @it
label: har manifestasjon relatert til korporasjon @no
label: har manifestation relateret til korporation @da
label: has related manifestation of corporate body @en
label: hat mit Körperschaft in Beziehung stehende Manifestation @de
label: heeft gerelateerde manifestatie van corporatie @nl
label: testülethez kapcsolódó megjelenési forma a következő: @hu
label: té com a manifestació relacionada amb una entitat corporativa @ca
label: tüzel kişinin ilgili gösterimi ile ilişkilidir @tr
label: έχει σχετική εκδήλωση του συλλογικού οργάνου @el
label: له تجسيدة مرتبطة بهيئة @ar
label: 有团体的关联载体表现 @zh-hans
sub property of: yhteisöön liittyvä RDA-entiteetti
sub property of: yhteistoimijaan liittyvä manifestaatio
definition: Bir tüzel kişiyi, tüzel kişilikle alakalı bir gösterimle ilişkilendirir. @tr
definition: Correla un ente a una manifestazione associata a un ente. @it
definition: Hozzákapcsol egy testületet egy testülethez kapcsolódó megjelenési formához. @hu
definition: Liittää yhteisön manifestaatioon, joka liittyy yhteisöön.
definition: Met une collectivité en relation avec une manifestation qui est associée à une collectivité. @fr
definition: Relaciona una entitat corporativa amb una manifestació que s’associa amb una entitat corporativa. @ca
definition: Relateert een corporatie aan een manifestatie die geassocieerd is met een corporatie. @nl
definition: Relaterer en korporasjon til en manifestasjon som forbindes med en korporasjon. @no
definition: Relaterer en korporation til en manifestation, som er knyttet til en korporation. @da
definition: Relates a corporate body to a manifestation that is associated with a corporate body. @en
definition: Sasaista institūciju ar manifestāciju, kas ir saistīta ar institūciju. @lv
definition: Seostab asutuse asutusega seotud kehastusega. @et
definition: Setzt eine Körperschaft in Beziehung zu einer Manifestation, die mit einer Körperschaft in Verbindung steht. @de
definition: Συνδέει ένα συλλογικό όργανο με μια εκδήλωση η οποία συνδέεται με ένα περιγραφόμενο συλλογικό όργανο. @el
definition: يربط هيئة بتجسيدة ذات صلة بهيئة. @ar
definition: 将一个团体与和一个团体有关的一种载体表现关联起来。 @zh-hans

yhteisöön liittyvä kappale
has element type: 1
toolkit definition: An item that is associated with a corporate body. @en
toolkit definition: Asutusega seotud eksemplar. @et
toolkit definition: Bir tüzel kişiyle bağlantılı olan bir kopya. @tr
toolkit definition: Een item dat is geassocieerd met een corporatie. @nl
toolkit definition: Egy testülethez kapcsolódó példány. @hu
toolkit definition: Ein Exemplar, das mit einer Körperschaft in Verbindung steht. @de
toolkit definition: Eksemplar, som er knyttet til en korporation. @da
toolkit definition: Et eksemplar som forbindes med en korporasjon. @no
toolkit definition: Item associato a un ente. @it
toolkit definition: Item qui est associé à une collectivité. @fr
toolkit definition: Kappale, joka liittyy yhteisöön.
toolkit definition: Vienība, kas ir saistīta ar institūciju. @lv
toolkit definition: Ítem que s’associa amb una entitat corporativa. @ca
toolkit definition: مفردة ذات صلة بهيئة. @ar
toolkit definition: 和一个团体有关的一个单件 @zh-hans
toolkit label: Mit Körperschaft in Beziehung stehendes Exemplar @de
toolkit label: ar institūciju saistītā vienība @lv
toolkit label: asutusega seotud eksemplar @et
toolkit label: eksemplar relateret til korporation @da
toolkit label: eksemplar relatert til korporasjon @no
toolkit label: gerelateerd item van corporatie @nl
toolkit label: item correlata di ente @it
toolkit label: item en relation avec une collectivité @fr
toolkit label: related item of corporate body @en
toolkit label: testülethez kapcsolódó példány: @hu
toolkit label: tüzel kişilikle ilişkili kopya @tr
toolkit label: yhteisöön liittyvä kappale
toolkit label: ítem relacionat amb una entitat corporativa @ca
toolkit label: σχετικό αντίτυπο του συλλογικού οργάνου @el
toolkit label: مفردة مرتبطة بهيئة @ar
toolkit label: 团体的关联单件 @zh-hans
has subproperty: kappaleen omistuksen kohde (yhteisö) kappaleessa
has subproperty: sitoja (yhteisö) kappaleessa
has subproperty: kappaleen entisöijä (yhteisö) kappaleessa
has subproperty: kuraattori (yhteisö) kappaleessa
has subproperty: säilyttäjä (yhteisö) kappaleessa
has subproperty: omistaja (yhteisö) kappaleessa
has subproperty: muokkaaja (yhteisö) kappaleessa
has subproperty: illuminoinnin tekijä (yhteisö) kappaleessa
has subproperty: kappaleella kunnioitettu yhteisö kappaleessa
has subproperty: P50332
lexical alias: relatedItemOfCorporateBody.en
status: Published
type: Property
domain: C10005
label: a pour item en relation avec une collectivité @fr
label: ar institūciju saistītā vienība @lv
label: asutusega seotud eksemplar @et
label: ha come item correlata di ente @it
label: har eksemplar relateret til korporation @da
label: har eksemplar relatert til korporasjon @no
label: has related item of corporate body @en
label: hat mit Körperschaft in Beziehung stehendes Exemplar @de
label: heeft gerelateerd item van corporatie @nl
label: testülethez kapcsolódó példány a következő: @hu
label: té com a ítem relacionat amb una entitat corporativa @ca
label: tüzel kişinin ilgili kopyası ile ilişkilidir @tr
label: έχει σχετικό αντίτυπο του συλλογικού οργάνου @el
label: له مفردة مرتبطة بهيئة @ar
label: 有团体的关联单件 @zh-hans
sub property of: yhteisöön liittyvä RDA-entiteetti
sub property of: yhteistoimijaan liittyvä kappale
definition: Bir tüzel kişiyi, tüzel kişilikle alakalı bir kopyayla ilişkilendirir. @tr
definition: Correla un ente a un item associato a un ente. @it
definition: Hozzákapcsol egy testületet egy testülethez kapcsolódó példányhoz. @hu
definition: Liittää yhteisön kappaleeseen, joka liittyy yhteisöön.
definition: Met une collectivité en relation avec un item qui est associé à une collectivité. @fr
definition: Relaciona una entitat corporativa amb un ítem que s’associa amb una entitat corporativa. @ca
definition: Relateert een corporatie aan een item dat is geassocieerd met een corporatie. @nl
definition: Relaterer en korporasjon til et eksemplar som forbindes med en korporasjon. @no
definition: Relaterer en korporation til et eksemplar, som er knyttet til en korporation. @da
definition: Relates a corporate body to an item that is associated with a corporate body. @en
definition: Sasaista institūciju ar vienību, kas ir saistīta ar institūciju. @lv
definition: Seostab asutuse asutusega seotud eksemplariga. @et
definition: Setzt eine Körperschaft in Beziehung zu einem Exemplar, das mit einer Körperschaft in Verbindung steht. @de
definition: Συνδέει ένα συλλογικό όργανο με ένα αντίτυπο το οποίο συνδέεται με ένα περιγραφόμενο συλλογικό όργανο. @el
definition: يربط هيئة بمفردة ذات صلة بهيئة. @ar
definition: 将一个团体与和一个团体有关的一个单件关联起来。 @zh-hans

yhteisöön liittyvä toimija
has element type: 1
toolkit definition: Agent que s’associa amb una entitat corporativa. @ca
toolkit definition: Agent qui est associé à une collectivité. @fr
toolkit definition: Agent, som er knyttet til en korporation. @da
toolkit definition: Agente associato a un ente. @it
toolkit definition: An agent who is associated with a corporate body. @en
toolkit definition: Asutusega seotud tegija. @et
toolkit definition: Aģents, kas saistīts ar institūciju. @lv
toolkit definition: Bir tüzel kişilikle bağlantılı olan bir temsilci. @tr
toolkit definition: Een actor die geassocieerd is met een corporatie. @nl
toolkit definition: Egy testülethez kapcsolódó ágens. @hu
toolkit definition: Ein Akteur, der mit einer Körperschaft in Verbindung steht. @de
toolkit definition: En agent som forbindes med en korporasjon. @no
toolkit definition: Toimija, joka liittyy yhteisöön.
toolkit definition: وكيل ذو صلة بهيئة. @ar
toolkit definition: 和一个团体有关的一个行为者 @zh-hans
toolkit label: Mit Körperschaft in Beziehung stehender Akteur @de
toolkit label: agent en relation avec une collectivité @fr
toolkit label: agent relacionat amb una entitat corporativa @ca
toolkit label: agent relateret til korporation @da
toolkit label: agent relatert til korporasjon @no
toolkit label: agente correlato di ente @it
toolkit label: ar institūciju saistītais aģents @lv
toolkit label: asutusega seotud tegija @et
toolkit label: gerelateerde actor van corporatie @nl
toolkit label: related agent of corporate body @en
toolkit label: testülethez kapcsolódó ágens: @hu
toolkit label: tüzel kişilikle ilişkili temsilci @tr
toolkit label: yhteisöön liittyvä toimija
toolkit label: σχετικός φορέας του συλλογικού οργάνου @el
toolkit label: وكيل مرتبط بهيئة @ar
toolkit label: 团体的关联行为者 @zh-hans
has subproperty: yhteisöön liittyvä henkilö
has subproperty: yhteisöön liittyvä yhteistoimija
has subproperty: yhteisöä sponsoroiva toimija
has subproperty: yhteisön perustanut toimija
has subproperty: P50333
lexical alias: relatedAgentOfCorporateBody.en
status: Published
type: Property
domain: C10005
label: a pour agent en relation avec une collectivité @fr
label: ar institūciju saistītais aģents @lv
label: asutusega seotud tegija @et
label: ha come agente correlato di ente @it
label: har agent relateret til korporation @da
label: har agent relatert til korporasjon @no
label: has related agent of corporate body @en
label: hat mit Körperschaft in Beziehung stehenden Akteur @de
label: heeft gerelateerde actor van corporatie @nl
label: testülethez kapcsolódó ágens a következő: @hu
label: té com a agent relacionat amb una entitat corporativa @ca
label: tüzel kişinin ilgili temsilcisi ile ilişkilidir @tr
label: έχει σχετικό φορέα του συλλογικού οργάνου @el
label: له وكيل مرتبط بهيئة @ar
label: 有团体的关联行为者 @zh-hans
sub property of: yhteisöön liittyvä RDA-entiteetti
sub property of: yhteistoimijaan liittyvä toimija
definition: Bir tüzel kişiyi, tüzel kişiliğe ilişkili bir temsilciyle ilişkilendirir. @tr
definition: Correla un ente a un agente associato a un ente. @it
definition: Hozzákapcsol egy testületet egy testülethez kapcsolódó ágenshez. @hu
definition: Liittää yhteisön toimijaan, joka liittyy yhteisöön.
definition: Met une collectivité en relation avec un agent qui est associé à une collectivité. @fr
definition: Relaciona una entitat corporativa amb un agent que s’associa amb una entitat corporativa. @ca
definition: Relateert een corporatie aan een actor die geassocieerd is met een corporatie. @nl
definition: Relaterer en korporasjon til en agent som forbindes med en korporasjon. @no
definition: Relaterer en korporation til en agent, som er knyttet til en korporation. @da
definition: Relates a corporate body to an agent who is associated with a corporate body. @en
definition: Sasaista institūciju ar arģentu, kurš saistīts ar institūciju. @lv
definition: Seostab asutuse asutusega seotud tegijaga. @et
definition: Setzt eine Körperschaft in Beziehung zu einem Akteur, der mit einer Körperschaft in Verbindung steht. @de
definition: Συνδέει ένα συλλογικό όργανο με έναν φορέα ο οποίος συνδέεται με ένα περιγραφόμενο συλλογικό όργανο. @el
definition: يربط هيئة بوكيل ذي صلة بهيئة. @ar
definition: 将一个团体与和一个团体有关的一个行为者关联起来。 @zh-hans

yhteisöön liittyvä henkilö
has element type: 1
toolkit definition: A person who is associated with a corporate body. @en
toolkit definition: Asutusega seotud isik. @et
toolkit definition: Bir tüzel kişilikle bağlantılı olan kişi. @tr
toolkit definition: Een persoon die geassocieerd is met een corporatie. @nl
toolkit definition: Egy testülethez kapcsolódó személy. @hu
toolkit definition: Eine Person, die mit einer Körperschaft in Verbindung steht. @de
toolkit definition: En person som forbindes med en korporasjon. @no
toolkit definition: Henkilö, joka liittyy yhteisöön.
toolkit definition: Person, som er knyttet til en korporation. @da
toolkit definition: Persona associata a un ente. @it
toolkit definition: Persona que s’associa amb una entitat corporativa. @ca
toolkit definition: Persona, kura saistīta ar institūciju. @lv
toolkit definition: Personne qui est associée à une collectivité. @fr
toolkit definition: شخص ذو صلة بهيئة. @ar
toolkit definition: 和一个团体有关的一个个人 @zh-hans
toolkit label: Mit Körperschaft in Beziehung stehende Person @de
toolkit label: ar institūciju saistītā persona @lv
toolkit label: asutusega seotud isik @et
toolkit label: gerelateerde persoon van corporatie @nl
toolkit label: person relateret til korporation @da
toolkit label: person relatert til korporasjon @no
toolkit label: persona correlata di ente @it
toolkit label: persona relacionada amb una entitat corporativa @ca
toolkit label: personne en relation avec une collectivité @fr
toolkit label: related person of corporate body @en
toolkit label: testülethez kapcsolódó személy: @hu
toolkit label: tüzel kişilikle ilişkili kişi @tr
toolkit label: yhteisöön liittyvä henkilö
toolkit label: σχετικό φυσικό πρόσωπο του συλλογικού οργάνου @el
toolkit label: شخص مرتبط بهيئة @ar
toolkit label: 团体的关联个人 @zh-hans
has subproperty: toimihenkilö
has subproperty: yhteisöä sponsoroiva henkilö
has subproperty: yhteisön perustanut henkilö
has subproperty: yhteisön henkilöjäsen
has subproperty: loppututkinnon suorittanut
has subproperty: opiskelija
has subproperty: P50334
lexical alias: relatedPersonOfCorporateBody.en
status: Published
type: Property
domain: C10005
label: a pour personne en relation avec une collectivité @fr
label: ar institūciju saistītā persona @lv
label: asutusega seotud isik @et
label: ha come persona correlata di ente @it
label: har person relateret til korporation @da
label: har person relatert til korporasjon @no
label: has related person of corporate body @en
label: hat mit Körperschaft in Beziehung stehende Person @de
label: heeft gerelateerde persoon van corporatie @nl
label: testülethez kapcsolódó személy a következő: @hu
label: té com a persona relacionada amb una entitat corporativa @ca
label: tüzel kişinin ilgili kişisi ile ilişkilidir @tr
label: έχει σχετικό φυσικό πρόσωπο του συλλογικού οργάνου @el
label: له شخص مرتبط بهيئة @ar
label: 有团体的关联个人 @zh-hans
sub property of: yhteisöön liittyvä toimija
sub property of: yhteistoimijaan liittyvä henkilö
definition: Bir tüzel kişiyi, tüzel kişilikle bağlantılı bir kişiyle ilişkilendirir. @tr
definition: Correla un ente a una persona associata a un ente. @it
definition: Hozzákapcsol egy testületet egy testülethez kapcsolódó személyhez. @hu
definition: Liittää yhteisön henkilöön, joka liittyy yhteisöön.
definition: Met une collectivité en relation avec une personne qui est associée à une collectivité. @fr
definition: Relaciona una entitat corporativa amb una persona que s’associa amb una entitat corporativa. @ca
definition: Relateert een corporatie aan een persoon die geassocieerd is met een corporatie. @nl
definition: Relaterer en korporasjon til en person som forbindes med en korporasjon. @no
definition: Relaterer en korporation til en person, som er knyttet til en korporation. @da
definition: Relates a corporate body to a person who is associated with a corporate body. @en
definition: Sasaista institūciju ar personu, kura saistīta ar institūciju. @lv
definition: Seostab asutuse asutusega seotud isikuga. @et
definition: Setzt eine Körperschaft in Beziehung zu einer Person, die mit einer Körperschaft in Verbindung steht. @de
definition: Συνδέει ένα συλλογικό όργανο με ένα φυσικό πρόσωπο το οποίο συνδέεται με ένα περιγραφόμενο συλλογικό όργανο. @el
definition: يربط هيئة بشخص ذي صلة بهيئة. @ar
definition: 将一个团体与和一个团体有关的一个个人关联起来。 @zh-hans

yhteisöön liittyvä suku
has element type: 1
toolkit definition: A family who is associated with a corporate body. @en
toolkit definition: Asutusega seotud perekond. @et
toolkit definition: Bir tüzel kişilikle bağlantısı olan bir aile. @tr
toolkit definition: Dzimta/ģimene, kas saistīta ar institūciju. @lv
toolkit definition: Een familie die geassocieerd is met een corporatie. @nl
toolkit definition: Egy testülethez kapcsolódó család. @hu
toolkit definition: Eine Familie, die mit einer Körperschaft in Verbindung steht. @de
toolkit definition: En familie som forbindes med en korporasjon. @no
toolkit definition: Famiglia associata a un ente. @it
toolkit definition: Familie, som er knyttet til en korporation. @da
toolkit definition: Famille qui est associée à une collectivité. @fr
toolkit definition: Família que s’associa amb una entitat corporativa. @ca
toolkit definition: Suku, joka liittyy yhteisöön.
toolkit definition: عائلة ذات صلة بهيئة. @ar
toolkit definition: 和一个团体有关的一个家族 @zh-hans
toolkit label: ar institūciju saistītā dzimta/ģimene @lv
toolkit label: asutusega seotud perekond @et
toolkit label: famiglia correlata di ente @it
toolkit label: familie relateret til korporation @da
toolkit label: familie relatert til korporasjon @no
toolkit label: famille en relation avec une collectivité @fr
toolkit label: família relacionada amb una entitat corporativa @ca
toolkit label: gerelateerde familie van corporatie @nl
toolkit label: mit Körperschaft in Beziehung stehende Familie @de
toolkit label: related family of corporate body @en
toolkit label: testülethez kapcsolódó család: @hu
toolkit label: tüzel kişilikle ilişkili aile @tr
toolkit label: yhteisöön liittyvä suku
toolkit label: σχετική οικογένεια του συλλογικού οργάνου @el
toolkit label: عائلة مرتبطة بهيئة @ar
toolkit label: 团体的关联家族 @zh-hans
has subproperty: yhteisön perustanut suku
has subproperty: yhteisöä sponsoroiva suku
has subproperty: yhteisön sukujäsen
has subproperty: yhteisöjäsen suvussa
has subproperty: P50335
lexical alias: relatedFamilyOfCorporateBody.en
status: Published
type: Property
domain: C10005
label: a pour famille en relation avec une collectivité @fr
label: ar institūciju saistītā dzimta/ģimene @lv
label: asutusega seotud perekond @et
label: ha come famiglia correlata a un ente @it
label: har familie relateret til korporation @da
label: har familie relatert til korporasjon @no
label: has related family of corporate body @en
label: hat mit Körperschaft in Beziehung stehende Familie @de
label: heeft gerelateerde familie van corporatie @nl
label: testülethez kapcsolódó család a következő: @hu
label: té com a família relacionada amb una entitat corporativa @ca
label: tüzel kişinin ilgili ailesi ile ilişkilidir @tr
label: έχει σχετική οικογένεια του συλλογικού οργάνου @el
label: له عائلة مرتبطة بهيئة @ar
label: 有团体的关联家族 @zh-hans
sub property of: yhteisöön liittyvä yhteistoimija
sub property of: yhteistoimijaan liittyvä suku
definition: Bir tüzel kişiyi, tüzel kişiliğe bağlı bir aileyle ilişkilendirir. @tr
definition: Correla un ente a una famiglia associata a un ente. @it
definition: Hozzákapcsol egy testületet egy testülethez kapcsolódó családhoz. @hu
definition: Liittää yhteisön sukuun, joka liittyy yhteisöön.
definition: Met une collectivité en relation avec une famille qui est associée à une collectivité. @fr
definition: Relaciona una entitat corporativa amb una família que s’associa amb una entitat corporativa. @ca
definition: Relateert een corporatie aan een familie die geassocieerd is met een corporatie. @nl
definition: Relaterer en korporasjon til en familie som forbindes med en korporasjon. @no
definition: Relaterer en korporation til en familie, som er knyttet til en korporation. @da
definition: Relates a corporate body to a family who is associated with a corporate body. @en
definition: Sasaista institūciju ar dzimtu/ģimeni, kas saistīta ar institūciju. @lv
definition: Seostab asutuse asutusega seotud perekonnaga. @et
definition: Setzt eine Körperschaft in Beziehung zu einer Familie, die mit einer Körperschaft in Verbindung steht. @de
definition: Συνδέει ένα συλλογικό όργανο με μια οικογένεια, η οποία συνδέεται με ένα περιγραφόμενο συλλογικό όργανο. @el
definition: يربط هيئة بعائلة ذات صلة بهيئة. @ar
definition: 将一个团体与和一个团体有关的一个家族关联起来。 @zh-hans

yhteisöön liittyvä yhteisö
has element type: 1
toolkit definition: A corporate body who is associated with a corporate body. @en
toolkit definition: Asutusega seotud asutus. @et
toolkit definition: Bir tüzel kişiyle bağlantısı olan bir tüzel kişi. @tr
toolkit definition: Collectivité qui est associée à une collectivité. @fr
toolkit definition: Een corporatie die geassocieerd is met een corporatie. @nl
toolkit definition: Egy testülethez kapcsolódó testület. @hu
toolkit definition: Eine Körperschaft, die mit einer Körperschaft in Verbindung steht. @de
toolkit definition: En korporasjon som forbindes med en korporasjon. @no
toolkit definition: Ente associato a un ente. @it
toolkit definition: Entitat corporativa que s’associa amb una entitat corporativa. @ca
toolkit definition: Institūcija, kas saistīta ar institūciju. @lv
toolkit definition: Korporation, som er knyttet til en korporation. @da
toolkit definition: Yhteisö, joka liittyy yhteisöön.
toolkit definition: هيئة ذات صلة بهيئة. @ar
toolkit definition: 和一个团体有关的一个团体 @zh-hans
toolkit label: Mit Körperschaft in Beziehung stehende Körperschaft @de
toolkit label: ar institūciju saistītā institūcija @lv
toolkit label: asutusega seotud asutus @et
toolkit label: collectivité en relation avec une collectivité @fr
toolkit label: ente correlato di ente @it
toolkit label: entitat corporativa relacionada amb una entitat corporativa @ca
toolkit label: gerelateerde corporatie van corporatie @nl
toolkit label: korporasjon relatert til korporasjon @no
toolkit label: korporation relateret til korporation @da
toolkit label: related corporate body of corporate body @en
toolkit label: testülethez kapcsolódó testület: @hu
toolkit label: tüzel kişinin tüzel kişiyle ilişkisi @tr
toolkit label: yhteisöön liittyvä yhteisö
toolkit label: σχετικό συλλογικό όργανο του συλλογικού οργάνου @el
toolkit label: هيئة مرتبطة بهيئة @ar
toolkit label: 团体的关联团体 @zh-hans
has subproperty: yhteisön perustanut yhteisö
has subproperty: kattoyhteisö
has subproperty: yhteisön sponsoroima yhteisö
has subproperty: alayhteisö
has subproperty: kanssayhdistyjä
has subproperty: yhteisön edeltäjä
has subproperty: yhteisöä sponsoroiva yhteisö
has subproperty: yhteisön seuraaja
has subproperty: yhteisön perustama yhteisö
has subproperty: yhteisöön liittyvä laitos
has subproperty: yhteisöjäsen yhteisössä
has subproperty: yhteisön yhteisöjäsen
has subproperty: laajempi emoyhtiö
has subproperty: paikallinen tytäryhtiö
has subproperty: sulautunut yhteisö
has subproperty: sulautunut yhteisöön
has subproperty: yhteiskonferenssi
has subproperty: P50336
lexical alias: relatedCorporateBodyOfCorporateBody.en
status: Published
type: Property
domain: C10005
label: a pour collectivité en relation avec une collectivité @fr
label: ar institūciju saistītā institūcija @lv
label: asutusega seotud asutus @et
label: ha come ente correlato di ente @it
label: har korporasjon relatert til korporasjon @no
label: har korporation relateret til korporation @da
label: has related corporate body of corporate body @en
label: hat mit Körperschaft in Beziehung stehende Körperschaft @de
label: heeft gerelateerde corporatie van corporatie @nl
label: testülethez kapcsolódó testület a következő: @hu
label: té com a entitat corporativa relacionada amb una entitat corporativa @ca
label: tüzel kişinin ilgili tüzel kişisi ile ilişkilidir @tr
label: έχει σχετικό συλλογικό όργανο του συλλογικού οργάνου @el
label: له هيئة مرتبطة بهيئة @ar
label: 有团体的关联团体 @zh-hans
sub property of: yhteisöön liittyvä yhteistoimija
sub property of: yhteistoimijaan liittyvä yhteisö
alternative label: In Verbindung stehende Institution @de
alternative label: associated institution @en
alternative label: bağlantılı kurum @tr
alternative label: institució associada @ca
alternative label: institución asociada @es
alternative label: institution associée @fr
alternative label: istituzione associata @it
alternative label: kapcsolódó intézmény @hu

toimijaan liittyvä yhteistoimija
has element type: 1
toolkit definition: A collective agent who is associated with an agent. @en
toolkit definition: Agent collectif qui est associé à un agent. @fr
toolkit definition: Agent col·lectiu que s’associa amb un agent. @ca
toolkit definition: Agente collettivo associato a un agente. @it
toolkit definition: Bir temsilci ile ilişkilendirilen kolektif bir temsilci. @tr
toolkit definition: Een collectieve actor die geassocieerd is met een actor. @nl
toolkit definition: Egy ágenshez kapcsolódó kollektív ágens. @hu
toolkit definition: Ein gemeinschaftlicher Akteur, der mit einem Akteur in Verbindung steht. @de
toolkit definition: En kollektiv agent som forbindes med en agent. @no
toolkit definition: Grupa, kas saistīta ar aģentu. @lv
toolkit definition: Kollektiv agent, som er knyttet til en agent. @da
toolkit definition: Tegijaga seotud kollektiiv. @et
toolkit definition: Yhteistoimija, joka liittyy toimijaan.
toolkit definition: وكيل جماعي ذو صلة بوكيل. @ar
toolkit definition: 和一个行为者有关的一个集体行为者 @zh-hans
toolkit label: Mit Akteur in Beziehung stehender gemeinschaftlicher Akteur @de
toolkit label: Temsilcinin kolektif temsilciyle ilişkisi @tr
toolkit label: agent collectif en relation avec un agent @fr
toolkit label: agent col·lectiu relacionat amb un agent @ca
toolkit label: agente collettivo correlato di agente @it
toolkit label: ar aģentu saistītā grupa @lv
toolkit label: gerelateerde collectieve actor van actor @nl
toolkit label: kollektiv agent relateret til agent @da
toolkit label: kollektiv agent relatert til agent @no
toolkit label: related collective agent of agent @en
toolkit label: tegijaga seotud kollektiiv @et
toolkit label: toimijaan liittyvä yhteistoimija
toolkit label: ágenshez kapcsolódó kollektív ágens: @hu
toolkit label: σχετικός συλλογικός φορέας του φορέα @el
toolkit label: وكيل جماعي مرتبط بوكيل @ar
toolkit label: 行为者的关联集体行为者 @zh-hans
has subproperty: toimijaan liittyvä yhteisö
has subproperty: toimijaan liittyvä suku
has subproperty: yhteistoimijaan liittyvä yhteistoimija
has subproperty: henkilöön liittyvä yhteistoimija
has subproperty: P50337
lexical alias: relatedCollectiveAgentOfAgent.en
status: Published
type: Property
domain: C10002
label: a pour agent collectif en relation avec un agent @fr
label: ar aģentu saistītā grupa @lv
label: ha come agente collettivo correlato di agente @it
label: har kollektiv agent relateret til agent @da
label: har kollektiv agent relatert til agent @no
label: has related collective agent of agent @en
label: hat mit Akteur in Beziehung stehenden gemeinschaftlichen Akteur @de
label: heeft gerelateerde collectieve actor van actor @nl
label: tegijaga seotud kollektiiv @et
label: temsilcinin ilgili kolektif temsilcisi ile ilişkilidir @tr
label: té com a agent col·lectiu relacionat amb un agent @ca
label: ágenshez kapcsolódó kollektív ágens a következő: @hu
label: έχει σχετικό συλλογικό φορέα του φορέα @el
label: له وكيل جماعي مرتبط بوكيل @ar
label: 有行为者的关联集体行为者 @zh-hans
sub property of: toimijaan liittyvä toimija
sub property of: P00012
definition: Bir temsilciyi, bir temsilciyle bağlantılı olan kolektif bir temsilciyle ilişkilendirir. @tr
definition: Correla un agente a un agente collettivo associato a un agente. @it
definition: Hozzákapcsol egy ágenst egy ágenshez kapcsolódó kollektív ágenshez. @hu
definition: Liittää toimijan yhteistoimijaan, joka liittyy toimijaan.
definition: Met un agent en relation avec un agent collectif qui est associé à un agent. @fr
definition: Relaciona un agent amb un agent col·lectiu que s’associa amb un agent. @ca
definition: Relateert een actor aan een collectieve actor die geassocieerd is met een actor. @nl
definition: Relaterer en agent til en kollektiv agent som forbindes med en agent. @no
definition: Relaterer en agent til en kollektiv agent, som er knyttet til en agent. @da
definition: Relates an agent to a collective agent who is associated with an agent. @en
definition: Sasaista aģentu ar grupu, kas saistīta ar aģentu. @lv
definition: Seostab tegija tegijaga seotud kollektiiviga. @et
definition: Setzt einen Akteur in Beziehung zu einem gemeinschaftlichen Akteur, der mit einem Akteur in Verbindung steht. @de
definition: Συνδέει έναν φορέα με έναν συλλογικό φορέα που συνδέεται με έναν φορέα. @el
definition: يربط وكيلا بوكيل جماعي ذي صلة بوكيل. @ar
definition: 将一个行为者与和一个行为者有关的一个集体行为者关联起来。 @zh-hans

toimijaan liittyvä paikka
has element type: 1
toolkit definition: A place that is associated with an agent. @en
toolkit definition: Bir temsilciyle bağlantılı olan bir yer. @tr
toolkit definition: Een plaats die geassocieerd is met een actor. @nl
toolkit definition: Egy ágenshez kapcsolódó hely. @hu
toolkit definition: Ein Geografikum, das mit einem Akteur in Verbindung steht. @de
toolkit definition: Et sted som forbindes med en agent. @no
toolkit definition: Lieu qui est associé à un agent. @fr
toolkit definition: Lloc que s’associa amb un agent. @ca
toolkit definition: Luogo associato a un agente. @it
toolkit definition: Paikka, joka liittyy toimijaan.
toolkit definition: Sted, som er knyttet til en agent. @da
toolkit definition: Tegijaga seotud koht. @et
toolkit definition: Vieta, kas saistīta ar aģentu. @lv
toolkit definition: مكان مرتبط بوكيل. @ar
toolkit definition: 和一个行为者有关的一个地点 @zh-hans
toolkit label: Mit Akteur in Beziehung stehendes Geografikum @de
toolkit label: ar aģentu saistītā vieta @lv
toolkit label: gerelateerde plaats van actor @nl
toolkit label: lieu en relation avec un agent @fr
toolkit label: lloc relacionat amb un agent @ca
toolkit label: luogo correlato di agente @it
toolkit label: related place of agent @en
toolkit label: sted relateret til agent @da
toolkit label: sted relatert til agent @no
toolkit label: tegijaga seotud koht @et
toolkit label: temsilciyle ilişkili yer @tr
toolkit label: toimijaan liittyvä paikka
toolkit label: ágenshez kapcsolódó hely: @hu
toolkit label: σχετικός τόπος του φορέα @el
toolkit label: مكان مرتبط بوكيل @ar
toolkit label: 行为者的关联地点 @zh-hans
has subproperty: yhteistoimijaan liittyvä paikka
has subproperty: henkilöön liittyvä paikka
has subproperty: P50338
lexical alias: relatedPlaceOfAgent.en
status: Published
type: Property
domain: C10002
label: a pour lieu en relation avec un agent @fr
label: ar aģentu saistītā vieta @lv
label: ha come luogo correlato di agente @it
label: har sted relateret til agent @da
label: har sted relatert til agent @no
label: has related place of agent @en
label: hat mit Akteur in Beziehung stehendes Geografikum @de
label: heeft gerelateerde plaats van actor @nl
label: tegijaga seotud koht @et
label: temsilcinin ilgili yeri ile ilişkilidir @tr
label: té com a lloc relacionat amb un agent @ca
label: ágenshez kapcsolódó hely a következő: @hu
label: έχει σχετικό τόπο του φορέα @el
label: له مكان مرتبط بوكيل @ar
label: 有行为者的关联地点 @zh-hans
sub property of: toimijaan liittyvä RDA-entiteetti
sub property of: P00010
definition: Bir temsilciyi, temsilciyle bağlantılı olan bir yerle ilişkilendirir. @tr
definition: Correla un agente a un luogo associato a un agente. @it
definition: Hozzákapcsol egy ágenst egy ágenshez kapcsolódó helyhez. @hu
definition: Liittää toimijan paikkaan, joka liittyy toimijaan.
definition: Met un agent en relation avec un lieu qui est associé à un agent. @fr
definition: Relaciona un agent amb un lloc que s’associa amb un agent. @ca
definition: Relateert een actor aan een plaats die geassocieerd is met een actor. @nl
definition: Relaterer en agent til et sted som forbindes med en agent. @no
definition: Relaterer en agent til et sted, som er knyttet til en agent. @da
definition: Relates an agent to a place that is associated with an agent. @en
definition: Sasaista aģentu ar vietu, kas saistīta ar aģentu. @lv
definition: Seostab tegija tegijaga seotud kohaga. @et
definition: Setzt einen Akteur in Beziehung zu einem Geografikum, das mit einem Akteur in Verbindung steht. @de
definition: Συνδέει έναν φορέα με έναν τόπο που συνδέεται με έναν φορέα. @el
definition: يربط وكيلا بمكان ذي صلة بوكيل. @ar
definition: 将一个行为者与和一个行为者有关的一个地点关联起来。 @zh-hans

toimijaan liittyvä ajanjakso
has element type: 1
toolkit definition: A timespan that is associated with an agent. @en
toolkit definition: Ajanjakso, joka liittyy toimijaan.
toolkit definition: Arco di tempo associato a un agente. @it
toolkit definition: Bir temsilciyle bağlantılı olan bir zaman aralığı. @tr
toolkit definition: Een tijdspanne die geassocieerd is met een actor. @nl
toolkit definition: Egy ágenshez kapcsolódó időtartam. @hu
toolkit definition: Ein Zeitraum, der mit einem Akteur in Verbindung steht. @de
toolkit definition: Et tidsrom som forbindes med en agent. @no
toolkit definition: Interval de temps que s’associa amb un agent. @ca
toolkit definition: Laikposms, kas saistīts ar aģentu. @lv
toolkit definition: Laps de temps qui est associé à un agent. @fr
toolkit definition: Tegijaga seotud ajavahemik. @et
toolkit definition: Tidsperiode, som er knyttet til en agent. @da
toolkit definition: فترة زمنية مرتبطة بوكيل. @ar
toolkit definition: 和一个行为者有关的一个时间段 @zh-hans
toolkit label: Mit Akteur in Beziehung stehender Zeitraum @de
toolkit label: Temsilcinin zaman aralığıyla ilişkisi @tr
toolkit label: ar aģentu saistītais laikposms @lv
toolkit label: arco di tempo correlato di agente @it
toolkit label: gerelateerde tijdspanne van actor @nl
toolkit label: interval de temps relacionat amb un agent @ca
toolkit label: laps de temps en relation avec un agent @fr
toolkit label: related timespan of agent @en
toolkit label: tegijaga seotud ajavahemik @et
toolkit label: tidsperiode relateret til agent @da
toolkit label: tidsrom relatert til agent @no
toolkit label: toimijaan liittyvä ajanjakso
toolkit label: ágenshez kapcsolódó időtartam: @hu
toolkit label: σχετικό χρονικό διάστημα του φορέα @el
toolkit label: فترة زمنية مرتبطة بوكيل @ar
toolkit label: 行为者的关联时间段 @zh-hans
has subproperty: yhteistoimijaan liittyvä ajanjakso
has subproperty: henkilöön liittyvä ajanjakso
has subproperty: toimijan toiminta-aika
has subproperty: P50339
lexical alias: relatedTimespanOfAgent.en
status: Published
type: Property
domain: C10002
label: a pour laps de temps en relation avec un agent @fr
label: ar aģentu saistītais laikposms @lv
label: ha come arco di tempo correlato di agente @it
label: har tidsperiode relateret til agent @da
label: har tidsrom relatert til agent @no
label: has related timespan of agent @en
label: hat mit Akteur in Beziehung stehenden Zeitraum @de
label: heeft gerelateerde tijdspanne van actor @nl
label: tegijaga seotud ajavahemik @et
label: temsilcinin ilgili zaman aralığı ile ilişkilidir @tr
label: té com a interval de temps relacionat amb un agent @ca
label: ágenshez kapcsolódó időtartam a következő: @hu
label: έχει σχετικό χρονικό διάστημα του φορέα @el
label: له فترة زمنية مرتبطة بوكيل @ar
label: 有行为者的关联时间段 @zh-hans
sub property of: toimijaan liittyvä RDA-entiteetti
sub property of: P00011
definition: Bir temsilciyi, temsilciyle bağlantılı olan bir zaman aralığıyla ilişkilendirir. @tr
definition: Correla un agente collettivo a un arco di tempo associato a un agente. @it
definition: Hozzákapcsol egy ágenst egy ágenshez kapcsolódó időtartamhoz. @hu
definition: Liittää toimijan ajanjaksoon, joka liittyy toimijaan.
definition: Met un agent en relation avec un laps de temps qui est associé à un agent. @fr
definition: Relaciona un agent amb un interval de temps que s’associa amb un agent. @ca
definition: Relateert een actor aan een tijdspanne die geassocieerd is met een actor. @nl
definition: Relaterer en agent til en tidsperiode, som er knyttet til en agent. @da
definition: Relaterer en agent til et tidsrom som forbindes med en agent. @no
definition: Relates an agent to a timespan that is associated with an agent. @en
definition: Sasaista aģentu ar laikposmu, kas saistīts ar aģentu. @lv
definition: Seostab tegija tegijaga seotud ajavahemikuga. @et
definition: Setzt einen Akteur in Beziehung zu einem Zeitraum, der mit einem Akteur in Verbindung steht. @de
definition: Συνδέει έναν φορέα με ένα χρονικό διάστημα που συνδέεται με έναν φορέα. @el
definition: يربط وكيلا بفترة زمنية مرتبطة بوكيل. @ar
definition: 将一个行为者与和一个行为者有关的一个时间段关联起来。 @zh-hans

toimijaan liittyvä nomen
has element type: 1
toolkit definition: A nomen that is associated with an agent. @en
toolkit definition: Bir temsilciyle bağlantılı olan bir isim. @tr
toolkit definition: Een nomen dat geassocieerd is met een actor. @nl
toolkit definition: Egy ágenshez kapcsolódó nomen. @hu
toolkit definition: Ein Nomen, das mit einem Akteur in Verbindung steht. @de
toolkit definition: Et nomen som forbindes med en agent. @no
toolkit definition: Nomen associato a un agente. @it
toolkit definition: Nomen que s’associa amb un agent. @ca
toolkit definition: Nomen qui est associé à un agent. @fr
toolkit definition: Nomen, joka liittyy toimijaan.
toolkit definition: Nomen, som er knyttet til en agent. @da
toolkit definition: Nomens, kas saistīts ar aģentu. @lv
toolkit definition: Tegijaga seotud nomen. @et
toolkit definition: تسمية مرتبط بوكيل. @ar
toolkit definition: 和一个行为者有关的一个命名 @zh-hans
toolkit label: Mit Akteur in Beziehung stehendes Nomen @de
toolkit label: Temsilcinin ilişkili ismi @tr
toolkit label: ar aģentu saistītais nomens @lv
toolkit label: gerelateerde nomen van actor @nl
toolkit label: nome correlato di agente @it
toolkit label: nomen en relation avec un agent @fr
toolkit label: nomen relacionat amb un agent @ca
toolkit label: nomen relateret til agent @da
toolkit label: nomen relatert til agent @no
toolkit label: related nomen of agent @en
toolkit label: tegijaga seotud nomen @et
toolkit label: toimijaan liittyvä nomen
toolkit label: ágenshez kapcsolódó nomen: @hu
toolkit label: σχετικό όνομα του φορέα @el
toolkit label: تسمية مرتبطة بوكيل @ar
toolkit label: 行为者的关联命名 @zh-hans
has subproperty: yhteistoimijaan liittyvä nomen
has subproperty: henkilöön liittyvä nomen
has subproperty: toimijan nimitys
has subproperty: toimijan antama nomen
has subproperty: P50340
lexical alias: relatedNomenOfAgent.en
status: Published
type: Property
domain: C10002
label: a pour nomen en relation avec un agent @fr
label: ar aģentu saistītais nomens @lv
label: ha come nomen correlato di agente @it
label: har nomen relateret til agent @da
label: har nomen relatert til agent @no
label: has related nomen of agent @en
label: hat mit Akteur in Beziehung stehendes Nomen @de
label: heeft gerelateerde nomen van actor @nl
label: tegijaga seotud nomen @et
label: temsilcinin ilgili ismi ile ile ilişkilidir @tr
label: té com a nomen relacionat amb un agent @ca
label: ágenshez kapcsolódó nomen a következő: @hu
label: έχει σχετικό όνομα του φορέα @el
label: له تسمية مرتبطة بوكيل @ar
label: 有行为者的关联命名 @zh-hans
sub property of: toimijaan liittyvä RDA-entiteetti
sub property of: P00013
definition: Bir temsilciyi, temsilciyle bağlantılı olan bir isimle ilişkilendirir. @tr
definition: Correla un agente a un nomen associato a un agente. @it
definition: Hozzákapcsol egy ágenst egy ágenshez kapcsolódó nomenhez. @hu
definition: Liittää toimijan nomeniin, joka liittyy toimijaan.
definition: Met un agent en relation avec un nomen qui est associé à un agent. @fr
definition: Relaciona un agent amb un nomen que s’associa amb un agent. @ca
definition: Relateert een actor aan een nomen dat geassocieerd is met een actor. @nl
definition: Relaterer en agent til et nomen som forbindes med en agent. @no
definition: Relaterer en agent til et nomen, som er knyttet til en agent. @da
definition: Relates an agent to a nomen that is associated with an agent. @en
definition: Sasaista aģentu ar nomenu, kas saistīts ar aģentu. @lv
definition: Seostab tegija tegijaga seotud nomen'iga. @et
definition: Setzt einen Akteur in Beziehung zu einem Nomen, das mit einem Akteur in Verbindung steht. @de
definition: Συνδέει έναν φορέα με ένα όνομα που συνδέεται με έναν φορέα. @el
definition: يربط وكيلا بتسمية مرتبطة بوكيل. @ar
definition: 将一个行为者与和一个行为者有关的一个命名关联起来。 @zh-hans

yhteistoimijaan liittyvä yhteistoimija
has element type: 1
toolkit definition: A collective agent who is associated with a collective agent. @en
toolkit definition: Agent collectif qui est associé à un agent collectif. @fr
toolkit definition: Agent col·lectiu que s’associa amb un agent col·lectiu. @ca
toolkit definition: Agente collettivo associato a un agente collettivo. @it
toolkit definition: Bir kolektif temsilciyle ilişkilendirilmiş bir kolektif temsilci. @tr
toolkit definition: Een collectieve actor die geassocieerd is met een collectieve actor. @nl
toolkit definition: Egy kollektív ágenshez kapcsolódó kollektív ágens. @hu
toolkit definition: Ein gemeinschaftlicher Akteur, der mit einem gemeinschaftlichen Akteur in Verbindung steht. @de
toolkit definition: En kollektiv agent som forbindes med en kollektiv agent. @no
toolkit definition: Grupa, kas saistīta ar grupu. @lv
toolkit definition: Kollektiiviga seotud kollektiiv. @et
toolkit definition: Kollektiv agent, som er knyttet til en kollektiv agent. @da
toolkit definition: Yhteistoimija, joka liittyy yhteistoimijaan.
toolkit definition: وكيل جماعي مرتبط بوكيل جماعي. @ar
toolkit definition: 和一个集体行为者有关的一个集体行为者 @zh-hans
toolkit label: Mit gemeinschaftlichem Akteur in Beziehung stehender gemeinschaftlicher Akteur @de
toolkit label: agent collectif en relation avec un agent collectif @fr
toolkit label: agent col·lectiu relacionat amb un agent col·lectiu @ca
toolkit label: agente collettivo correlato di agente collettivo @it
toolkit label: ar grupu saistītā grupa @lv
toolkit label: gerelateerde collectieve actor van collectieve actor @nl
toolkit label: kolektif temsilcinin kolektif temsilciyle ilişkisi @tr
toolkit label: kollektiiviga seotud kollektiiv @et
toolkit label: kollektiv agent relateret til kollektiv agent @da
toolkit label: kollektiv agent relatert til kollektiv agent @no
toolkit label: kollektív ágenshez kapcsolódó kollektív ágens: @hu
toolkit label: related collective agent of collective agent @en
toolkit label: yhteistoimijaan liittyvä yhteistoimija
toolkit label: σχετικός συλλογικός φορέας του συλλογικού φορέα @el
toolkit label: وكيل جماعي مرتبط بوكيل جماعي @ar
toolkit label: 集体行为者的关联集体行为者 @zh-hans
has subproperty: yhteisöön liittyvä yhteistoimija
has subproperty: sukuun liittyvä yhteistoimija
has subproperty: yhteistoimijaan liittyvä yhteisö
has subproperty: yhteistoimijaan liittyvä suku
has subproperty: yhteistoimijan edeltäjä
has subproperty: yhteistoimijan seuraaja
has subproperty: P50341
lexical alias: relatedCollectiveAgentOfCollectiveAgent.en
status: Published
type: Property
domain: C10011
label: a pour agent collectif en relation avec un agent collectif @fr
label: ar grupu saistītā grupa @lv
label: ha come agente collettivo correlato di agente collettivo @it
label: har kollektiv agent relateret til kollektiv agent @da
label: har kollektiv agent relatert til kollektiv agent @no
label: has related collective agent of collective agent @en
label: hat mit gemeinschaftlichem Akteur in Beziehung stehenden gemeinschaftlichen Akteur @de
label: heeft gerelateerde collectieve actor van collectieve actor @nl
label: kolektif temsilcinin ilgili kolektif temsilcisi ile ilişkilidir @tr
label: kollektiiviga seotud kollektiiv @et
label: kollektív ágenshez kapcsolódó kollektív ágens a következő: @hu
label: té com a agent col·lectiu relacionat amb un agent col·lectiu @ca
label: έχει σχετικό συλλογικό φορέα του συλλογικού φορέα @el
label: له وكيل جماعي مرتبط بوكيل جماعي @ar
label: 有集体行为者的关联集体行为者 @zh-hans
sub property of: toimijaan liittyvä yhteistoimija
sub property of: yhteistoimijaan liittyvä toimija
definition: Correla un agente collettivo a un agente collettivo associato a un agente collettivo. @it
definition: Hozzákapcsol egy kollektív ágenst egy kollektív ágenshez kapcsolódó kollektív ágenshez. @hu
definition: Kolektif bir temsilciyi, kolektif bir temsilciyle bağlantılı olan bir kolektif temsilciyle ilişkilendirir. @tr
definition: Liittää yhteistoimijan yhteistoimijaan, joka liittyy yhteistoimijaan.
definition: Met un agent collectif en relation avec un agent collectif qui est associé à un agent collectif. @fr
definition: Relaciona un agent col·lectiu amb un agent col·lectiu que s’associa amb un agent col·lectiu. @ca
definition: Relateert een collectieve actor aan een collectieve actor die geassocieerd is met een collectieve actor. @nl
definition: Relaterer en kollektiv agent til en kollektiv agent som forbindes med en kollektiv agent. @no
definition: Relaterer en kollektiv agent til kollektiv agent, som er knyttet til en kollektiv agent. @da
definition: Relates a collective agent to a collective agent who is associated with a collective agent. @en
definition: Sasaista grupu ar grupu, kas saistīta ar grupu. @lv
definition: Seostab kollektiivi kollektiiviga seotud kollektiiviga. @et
definition: Setzt einen gemeinschaftlichen Akteur in Beziehung zu einem gemeinschaftlichen Akteur, der mit einem gemeinschaftlichen Akteur in Verbindung steht. @de
definition: Συνδέει έναν συλλογικό φορέα με έναν συλλογικό φορέα που συνδέεται με έναν συλλογικό φορέα. @el
definition: يربط وكيلا جماعيا بوكيل جماعي مرتبط بوكيل جماعي. @ar
definition: 将一个集体行为者与和一个集体行为者有关的一个集体行为者关联起来。 @zh-hans

yhteistoimijaan liittyvä paikka
has element type: 1
toolkit definition: A place that is associated with a collective agent. @en
toolkit definition: Bir kolektif temsilci ile bağlantılı olan bir yer. @tr
toolkit definition: Een plaats die geassocieerd is met een collectieve actor. @nl
toolkit definition: Egy kollektív ágenshez kapcsolódó hely. @hu
toolkit definition: Ein Geografikum, das mit einem gemeinschaftlichen Akteur in Verbindung steht. @de
toolkit definition: Et sted som forbindes med en kollektiv agent. @no
toolkit definition: Kollektiiviga seotud koht. @et
toolkit definition: Lieu qui est associé à un agent collectif. @fr
toolkit definition: Lloc que s’associa amb un agent col·lectiu. @ca
toolkit definition: Luogo associato a una agente collettivo. @it
toolkit definition: Paikka, joka liittyy yhteistoimijaan.
toolkit definition: Sted, som er knyttet til en kollektiv agent. @da
toolkit definition: Vieta, kas saistīta ar grupu. @lv
toolkit definition: مكان مرتبط بوكيل جماعي. @ar
toolkit definition: 和一个集体行为者有关的一个地点 @zh-hans
toolkit label: Mit gemeinschaftlichem Akteur in Beziehung stehendes Geografikum @de
toolkit label: ar grupu saistītā vieta @lv
toolkit label: gerelateerde plaats van collectieve actor @nl
toolkit label: kolektif temsilciyle ilişkili yer @tr
toolkit label: kollektiiviga seotud koht @et
toolkit label: kollektív ágenshez kapcsolódó hely: @hu
toolkit label: lieu en relation avec un agent collectif @fr
toolkit label: lloc relacionat amb un agent col·lectiu @ca
toolkit label: luogo correlato di agente collettivo @it
toolkit label: related place of collective agent @en
toolkit label: sted relateret til kollektiv agent @da
toolkit label: sted relatert til kollektiv agent @no
toolkit label: yhteistoimijaan liittyvä paikka
toolkit label: σχετικός τόπος του συλλογικού φορέα @el
toolkit label: مكان مرتبط بوكيل جماعي @ar
toolkit label: 集体行为者的关联地点 @zh-hans
has subproperty: yhteisöön liittyvä paikka
has subproperty: sukuun liittyvä paikka
has subproperty: P50342
lexical alias: relatedPlaceOfCollectiveAgent.en
status: Published
type: Property
domain: C10011
label: a pour lieu en relation avec un agent collectif @fr
label: ar grupu saistītā vieta @lv
label: ha come luogo correlato di agente collettivo @it
label: har sted relateret til kollektiv agent @da
label: har sted relatert til kollektiv agent @no
label: has related place of collective agent @en
label: hat mit gemeinschaftlichem Akteur in Beziehung stehendes Geografikum @de
label: heeft gerelateerde plaats van collectieve actor @nl
label: kolektif temsilcinin ilgili yeri ile ilişkilidir @tr
label: kollektiiviga seotud koht @et
label: kollektív ágenshez kapcsolódó hely a következő: @hu
label: té com a lloc relacionat amb un agent col·lectiu @ca
label: έχει σχετικό τόπο του συλλογικού φορέα @el
label: له مكان مرتبط بوكيل جماعي @ar
label: 有集体行为者的关联地点 @zh-hans
sub property of: toimijaan liittyvä paikka
sub property of: yhteistoimijaan liittyvä RDA-entiteetti
definition: Correla un agente collettivo a un luogo associato a una agente collettivo. @it
definition: Hozzákapcsol egy kollektív ágenst egy kollektív ágenshez kapcsolódó helyhez. @hu
definition: Kolektif bir temsilciyi, kolektif temsilciyle bağlantılı bir yerle ilişkilendirir. @tr
definition: Liittää yhteistoimijan paikkaan, joka liittyy yhteistoimijaan.
definition: Met un agent collectif en relation avec un lieu qui est associé à un agent collectif. @fr
definition: Relaciona un agent col·lectiu amb un lloc que s’associa amb un agent col·lectiu. @ca
definition: Relateert een collectieve actor aan een plaats die geassocieerd is met een collectieve actor. @nl
definition: Relaterer en kollektiv agent til et sted som forbindes med en kollektiv agent. @no
definition: Relaterer en kollektiv agent til et sted, som er knyttet til en kollektiv agent. @da
definition: Relates a collective agent to a place that is associated with a collective agent. @en
definition: Sasaista grupu ar vietu, kas saistīta ar grupu. @lv
definition: Seostab kollektiivi kollektiiviga seotud kohaga. @et
definition: Setzt einen gemeinschaftlichen Akteur in Beziehung zu einem Geografikum, das mit einem gemeinschaftlichen Akteur in Verbindung steht. @de
definition: Συνδέει έναν συλλογικό φορέα με έναν τόπο που συνδέεται με έναν συλλογικό φορέα. @el
definition: يربط وكيلا جماعيا بمكان مرتبط بوكيل جماعي. @ar
definition: 将一个集体行为者与和一个集体行为者有关的一个地点关联起来。 @zh-hans

yhteistoimijaan liittyvä ajanjakso
has element type: 1
toolkit definition: A timespan that is associated with a collective agent. @en
toolkit definition: Ajanjakso, joka liittyy yhteistoimijaan.
toolkit definition: Arco di tempo associato a un agente collettivo. @it
toolkit definition: Bir kolektif temsilciyle bağlantılı olan bir zaman aralığı. @tr
toolkit definition: Een tijdspanne die geassocieerd is met een collectieve actor. @nl
toolkit definition: Egy kollektív ágenshez kapcsolódó időtartam. @hu
toolkit definition: Ein Zeitraum, der mit einem gemeinschaftlichen Akteur in Verbindung steht. @de
toolkit definition: Et tidsrom som forbindes med en kollektiv agent. @no
toolkit definition: Interval de temps que s’associa amb un agent col·lectiu. @ca
toolkit definition: Kollektiiviga seotud ajavahemik. @et
toolkit definition: Laikposms, kas saistīts ar grupu. @lv
toolkit definition: Laps de temps qui est associé à un agent collectif. @fr
toolkit definition: Tidsperiode, som er knyttet til en kollektiv agent. @da
toolkit definition: فترة زمنية مرتبطة بوكيل جماعي. @ar
toolkit definition: 和一个集体行为者有关的一个时间段 @zh-hans
toolkit label: Mit gemeinschaftlichem Akteur in Beziehung stehender Zeitraum @de
toolkit label: ar grupu saistītais laikposms @lv
toolkit label: arco di tempo correlato di agente collettivo @it
toolkit label: gerelateerde tijdspanne van collectieve actor @nl
toolkit label: interval de temps relacionat amb un agent col·lectiu @ca
toolkit label: kolektif temsilcinin zaman aralığıyla ilişkisi @tr
toolkit label: kollektiiviga seotud ajavahemik @et
toolkit label: kollektív ágenshez kapcsolódó időtartam: @hu
toolkit label: laps de temps en relation avec un agent collectif @fr
toolkit label: related timespan of collective agent @en
toolkit label: tidsperiode relateret til kollektiv agent @da
toolkit label: tidsrom relatert til kollektiv agent @no
toolkit label: yhteistoimijaan liittyvä ajanjakso
toolkit label: σχετικό χρονικό διάστημα του συλλογικού φορέα @el
toolkit label: فترة زمنية مرتبطة بوكيل جماعي @ar
toolkit label: 集体行为者的关联时间段 @zh-hans
has subproperty: yhteisöön liittyvä ajanjakso
has subproperty: sukuun liittyvä ajanjakso
has subproperty: yhteistoimijan toiminta-aika
has subproperty: P50343
lexical alias: relatedTimespanOfCollectiveAgent.en
status: Published
type: Property
domain: C10011
label: a pour laps de temps en relation avec un agent collectif @fr
label: ar grupu saistītais laikposms @lv
label: ha come arco di tempo correlato di agente collettivo @it
label: har tidsperiode relateret til kollektiv agent @da
label: har tidsrom relatert til kollektiv agent @no
label: has related timespan of collective agent @en
label: hat mit gemeinschaftlichem Akteur in Beziehung stehenden Zeitraum @de
label: heeft gerelateerde tijdspanne van collectieve actor @nl
label: kolektif temsilcinin ilgili zaman aralığı ile ilişkilidir @tr
label: kollektiiviga seotud ajavahemik @et
label: kollektív ágenshez kapcsolódó időtartam a következő: @hu
label: té com a interval de temps relacionat amb un agent col·lectiu @ca
label: έχει σχετικό χρονικό διάστημα του συλλογικού φορέα @el
label: له فترة زمنية مرتبطة بوكيل جماعي @ar
label: 有集体行为者的关联时间段 @zh-hans
sub property of: toimijaan liittyvä ajanjakso
sub property of: yhteistoimijaan liittyvä RDA-entiteetti
definition: Correla un agente collettivo a un arco di tempo associato a un agente collettivo. @it
definition: Hozzákapcsol egy kollektív ágenst egy kollektív ágenshez kapcsolódó időtartamhoz. @hu
definition: Kolektif bir temsilciyi, kolektif temsilciyle bağlantılı bir zaman aralığıyla ilişkilendirir. @tr
definition: Liittää yhteistoimijan ajanjaksoon, joka liittyy yhteistoimijaan.
definition: Met un agent collectif en relation avec un laps de temps qui est associé à un agent collectif. @fr
definition: Relaciona un agent col·lectiu amb un interval de temps que s’associa amb un agent col·lectiu. @ca
definition: Relateert een collectieve actor aan een tijdspanne die geassocieerd is met een collectieve actor. @nl
definition: Relaterer en kollektiv agent til en tidsperiode, som er knyttet til en kollektiv agent. @da
definition: Relaterer en kollektiv agent til et tidsrom som forbindes med en kollektiv agent. @no
definition: Relates a collective agent to a timespan that is associated with a collective agent. @en
definition: Sasaista grupu ar laikposmu, kas saistīts ar grupu. @lv
definition: Seostab kollektiivi kollektiiviga seotud ajavahemikuga. @et
definition: Setzt einen gemeinschaftlichen Akteur in Beziehung zu einem Zeitraum, der mit einem gemeinschaftlichen Akteur in Verbindung steht. @de
definition: Συνδέει έναν συλλογικό φορέα με ένα χρονικό διάστημα που συνδέεται με έναν συλλογικό φορέα. @el
definition: يربط وكيلا جماعيا بفترة زمنية مرتبطة بوكيل جماعي. @ar
definition: 将一个集体行为者与和一个集体行为者有关的一个时间段关联起来。 @zh-hans

yhteistoimijaan liittyvä nomen
has element type: 1
toolkit definition: A nomen that is associated with a collective agent. @en
toolkit definition: Een nomen dat geassocieerd is met een collectieve actor. @nl
toolkit definition: Egy kollektív ágenshez kapcsolódó nomen. @hu
toolkit definition: Ein Nomen, das mit einem gemeinschaftlichen Akteur in Verbindung steht. @de
toolkit definition: Et nomen som forbindes med en kollektiv agent. @no
toolkit definition: Kolektif bir temsilciyle bağlantılı olan bir isim. @tr
toolkit definition: Kollektiiviga seotud nomen. @et
toolkit definition: Nomen associato a un agente collettivo. @it
toolkit definition: Nomen que s’associa amb un agent col·lectiu. @ca
toolkit definition: Nomen qui est associé à un agent collectif. @fr
toolkit definition: Nomen, joka liittyy yhteistoimijaan.
toolkit definition: Nomen, som er knyttet til en kollektiv agent. @da
toolkit definition: Nomens, kas saistīts ar grupu. @lv
toolkit definition: تسمية مرتبطة بوكيل جماعي. @ar
toolkit definition: 和一个集体行为者有关的一个命名 @zh-hans
toolkit label: Mit gemeinschaftlichem Akteur in Beziehung stehendes Nomen @de
toolkit label: ar grupu saistītais nomens @lv
toolkit label: gerelateerde nomen van collectieve actor @nl
toolkit label: kolektif temsilcinin ilişkili ismi @tr
toolkit label: kollektiiviga seotud nomen @et
toolkit label: kollektív ágenshez kapcsolódó nomen: @hu
toolkit label: nomen correlato di agente collettivo @it
toolkit label: nomen en relation avec un agent collectif @fr
toolkit label: nomen relacionat amb un agent col·lectiu @ca
toolkit label: nomen relateret til kollektiv agent @da
toolkit label: nomen relatert til kollektiv agent @no
toolkit label: related nomen of collective agent @en
toolkit label: yhteistoimijaan liittyvä nomen
toolkit label: σχετικό όνομα του συλλογικού φορέα @el
toolkit label: تسمية مرتبطة بوكيل جماعي @ar
toolkit label: 集体行为者的关联命名 @zh-hans
has subproperty: yhteisöön liittyvä nomen
has subproperty: sukuun liittyvä nomen
has subproperty: yhteistoimijan nimitys
has subproperty: yhteistoimijan antama nomen
has subproperty: P50344
lexical alias: relatedNomenOfCollectiveAgent.en
status: Published
type: Property
domain: C10011
label: a pour nomen en relation avec un agent collectif @fr
label: ar grupu saistītais nomens @lv
label: ha come nomen correlato di agente collettivo @it
label: har nomen relateret til kollektiv agent @da
label: har nomen relatert til kollektiv agent @no
label: has related nomen of collective agent @en
label: hat mit gemeinschaftlichem Akteur in Beziehung stehendes Nomen @de
label: heeft gerelateerde nomen van collectieve actor @nl
label: kolektif temsilcinin ilgili ismi ile ilişkilidir @tr
label: kollektiiviga seotud nomen @et
label: kollektív ágenshez kapcsolódó nomen a következő: @hu
label: té com a nomen relacionat amb un agent col·lectiu @ca
label: έχει σχετικό όνομα του συλλογικού φορέα @el
label: له تسمية مرتبطة بوكيل جماعي @ar
label: 有集体行为者的关联命名 @zh-hans
sub property of: toimijaan liittyvä nomen
sub property of: yhteistoimijaan liittyvä RDA-entiteetti
definition: Correla un agente collettivo a un nomen associato a un agente collettivo. @it
definition: Hozzákapcsol egy kollektív ágenst egy kollektív ágenshez kapcsolódó nomenhez. @hu
definition: Kolektif bir temsilciyi, kolektif bir temsilciyle bağlantılı bir isimle ilişkilendirir. @tr
definition: Liittää yhteistoimijan nomeniin, joka liittyy yhteistoimijaan.
definition: Met un agent collectif en relation avec un nomen qui est associé à un agent collectif. @fr
definition: Relaciona un agent col·lectiu amb un nomen que s’associa amb un agent col·lectiu. @ca
definition: Relateert een collectieve actor aan een nomen dat geassocieerd is met een collectieve actor. @nl
definition: Relaterer en kollektiv agent til et nomen som forbindes med en kollektiv agent. @no
definition: Relaterer en kollektiv agent til et nomen, som er knyttet til en kollektiv agent. @da
definition: Relates a collective agent to a nomen that is associated with a collective agent. @en
definition: Sasaista grupu ar nomenu, kas saistīts ar grupu. @lv
definition: Seostab kollektiivi kollektiiviga seotud nomen'iga. @et
definition: Setzt einen gemeinschaftlichen Akteur in Beziehung zu einem Nomen, das mit einem gemeinschaftlichen Akteur in Verbindung steht. @de
definition: Συνδέει έναν συλλογικό φορέα με ένα όνομα που συνδέεται με έναν συλλογικό φορέα. @el
definition: يربط وكيلا جماعيا بتسمية مرتبطة بوكيل جماعي. @ar
definition: 将一个集体行为者与和一个集体行为者有关的一个命名关联起来。 @zh-hans

henkilöön liittyvä yhteistoimija
has element type: 1
toolkit definition: A collective agent who is associated with a person. @en
toolkit definition: Agent collectif qui est associé à une personne. @fr
toolkit definition: Agent col·lectiu que s’associa amb una persona. @ca
toolkit definition: Agente collettivo associato a una persona. @it
toolkit definition: Bir kişiyle ilişkilendirilen kolektif bir temsilci. @tr
toolkit definition: Een collectieve actor die geassocieerd is met een persoon. @nl
toolkit definition: Egy személyhez kapcsolódó kollektív ágens. @hu
toolkit definition: Ein gemeinschaftlicher Akteur, der mit einer Person in Verbindung steht. @de
toolkit definition: En kollektiv agent som forbindes med en person. @no
toolkit definition: Grupa, kas saistīta ar personu. @lv
toolkit definition: Isikuga seotud kollektiiv. @et
toolkit definition: Kollektiv agent, som er knyttet til en person. @da
toolkit definition: Yhteistoimija, joka liittyy henkilöön.
toolkit definition: وكيل جماعي مرتبط بشخص. @ar
toolkit definition: 和一个个人有关的一个集体行为者 @zh-hans
toolkit label: Kişinin kolektif temsilciyle ilişkisi @tr
toolkit label: Mit Person in Beziehung stehender gemeinschaftlicher Akteur @de
toolkit label: agent collectif en relation avec une personne @fr
toolkit label: agent col·lectiu relacionat amb una persona @ca
toolkit label: agente collettivo correlato di persona @it
toolkit label: ar personu saistītā grupa @lv
toolkit label: gerelateerde collectieve actor van persoon @nl
toolkit label: henkilöön liittyvä yhteistoimija
toolkit label: isikuga seotud kollektiiv @et
toolkit label: kollektiv agent relateret til person @da
toolkit label: kollektiv agent relatert til person @no
toolkit label: related collective agent of person @en
toolkit label: személyhez kapcsolódó kollektív ágens: @hu
toolkit label: σχετικός συλλογικός φορέας του φυσικού προσώπου @el
toolkit label: وكيل جماعي مرتبط بشخص @ar
toolkit label: 个人的关联集体行为者 @zh-hans
has subproperty: henkilöön liittyvä suku
has subproperty: henkilöön liittyvä yhteisö
has subproperty: henkilöjäsen yhteistoimijassa
has subproperty: P50345
lexical alias: relatedCollectiveAgentOfPerson.en
status: Published
type: Property
domain: C10004
label: a pour agent collectif en relation avec une personne @fr
label: ar personu saistītā grupa @lv
label: ha come agente collettivo correlato di persona @it
label: har kollektiv agent relateret til person @da
label: har kollektiv agent relatert til person @no
label: has related collective agent of person @en
label: hat mit Person in Beziehung stehenden gemeinschaftlichen Akteur @de
label: heeft gerelateerde collectieve actor van persoon @nl
label: isikuga seotud kollektiiv @et
label: kişinin ilgili kolektif temsilcisi ile ilişkilidir @tr
label: személyhez kapcsolódó kollektív ágens a következő: @hu
label: té com a agent col·lectiu relacionat amb una persona @ca
label: έχει σχετικό συλλογικό φορέα του φυσικού προσώπου @el
label: له وكيل جماعي مرتبط بشخص @ar
label: 有个人的关联集体行为者 @zh-hans
sub property of: henkilöön liittyvä toimija
sub property of: toimijaan liittyvä yhteistoimija
definition: Bir kişiyi, kişiyle bağlantılı olan bir kolektif temsilciyle ilişkilendirir. @tr
definition: Correla una persona a un agente collettivo associato a una persona. @it
definition: Hozzákapcsol egy személyt egy személyhez kapcsolódó kollektív ágenshez. @hu
definition: Liittää henkilön yhteistoimijaan, joka liittyy henkilöön.
definition: Met une personne en relation avec un agent collectif qui est associé à une personne. @fr
definition: Relaciona una persona amb un agent col·lectiu que s’associa amb una persona. @ca
definition: Relateert een persoon aan een collectieve actor die geassocieerd is met een persoon. @nl
definition: Relaterer en person til en kollektiv agent som forbindes med en person. @no
definition: Relaterer en person til en kollektiv agent, som er knyttet til en person. @da
definition: Relates a person to a collective agent who is associated with a person. @en
definition: Sasaista personu ar grupu, kas saistīta ar personu. @lv
definition: Seostab isiku isikuga seotud kollektiiviga. @et
definition: Setzt eine Person in Beziehung zu einem gemeinschaftlichen Akteur, der mit einer Person in Verbindung steht. @de
definition: Συνδέει ένα φυσικό πρόσωπο με έναν συλλογικό φορέα που συνδέεται με ένα φυσικό πρόσωπο. @el
definition: يربط شخصا بوكيل جماعي مرتبط بشخص. @ar
definition: 将一个个人与和一个个人有关的一个集体行为者关联起来。 @zh-hans

henkilöön liittyvä paikka
has element type: 1
toolkit definition: A place that is associated with a person. @en
toolkit definition: Bir kişiyle bağlantılı olan bir yer. @tr
toolkit definition: Een plaats die geassocieerd is met een persoon. @nl
toolkit definition: Egy személyhez kapcsolódó hely. @hu
toolkit definition: Ein Geografikum, das mit einer Person in Verbindung steht. @de
toolkit definition: Et sted som forbindes med en person. @no
toolkit definition: Isikuga seotud koht. @et
toolkit definition: Lieu qui est associé à une personne. @fr
toolkit definition: Lloc que s’associa amb una persona. @ca
toolkit definition: Luogo associato a una persona. @it
toolkit definition: Paikka, joka liittyy henkilöön.
toolkit definition: Sted, som er knyttet til en person. @da
toolkit definition: Vieta, kas saistīta ar personu. @lv
toolkit definition: مكان مرتبط بشخص. @ar
toolkit definition: 和一个个人有关的一个地点 @zh-hans
toolkit label: Mit Person in Beziehung stehendes Geografikum @de
toolkit label: ar personu saistītā vieta @lv
toolkit label: gerelateerde plaats van persoon @nl
toolkit label: henkilöön liittyvä paikka
toolkit label: isikuga seotud koht @et
toolkit label: kişiyle ilişkili yer @tr
toolkit label: lieu en relation avec une personne @fr
toolkit label: lloc relacionat amb una persona @ca
toolkit label: luogo correlato di persona @it
toolkit label: related place of person @en
toolkit label: sted relateret til person @da
toolkit label: sted relatert til person @no
toolkit label: személyhez kapcsolódó hely: @hu
toolkit label: σχετικός τόπος του φυσικού προσώπου @el
toolkit label: مكان مرتبط بشخص @ar
toolkit label: 个人的关联地点 @zh-hans
has subproperty: henkilöön liittyvä maa
has subproperty: asuinpaikka
has subproperty: kuolinpaikka
has subproperty: syntymäpaikka
has subproperty: P50346
lexical alias: relatedPlaceOfPerson.en
status: Published
type: Property
domain: C10004
label: a pour lieu en relation avec une personne @fr
label: ar personu saistītā vieta @lv
label: ha come luogo correlato di persona @it
label: har sted relateret til person @da
label: har sted relatert til person @no
label: has related place of person @en
label: hat mit Person in Beziehung stehendes Geografikum @de
label: heeft gerelateerde plaats van persoon @nl
label: isikuga seotud koht @et
label: kişinin ilgili yeri ile ilişkilidir @tr
label: személyhez kapcsolódó hely a következő: @hu
label: té com a lloc relacionat amb una persona @ca
label: έχει σχετικό τόπο του φυσικού προσώπου @el
label: له مكان مرتبط بشخص @ar
label: 有个人的关联地点 @zh-hans
sub property of: henkilöön liittyvä RDA-entiteetti
sub property of: toimijaan liittyvä paikka
definition: Bir kişiyi, kişiyle bağlantılı olan bir yerle ilişkilendirir. @tr
definition: Correla una persona a un luogo associato a una persona. @it
definition: Hozzákapcsol egy személyt egy személyhez kapcsolódó helyhez. @hu
definition: Liittää henkilön paikkaan, joka liittyy henkilöön.
definition: Met une personne en relation avec un lieu qui est associé à une personne. @fr
definition: Relaciona una persona amb un lloc que s’associa amb una persona. @ca
definition: Relateert een persoon aan een plaats die geassocieerd is met een persoon. @nl
definition: Relaterer en person til et sted som forbindes med en person. @no
definition: Relaterer en person til et sted, som er knyttet til en person. @da
definition: Relates a person to a place that is associated with a person. @en
definition: Sasaista personu ar vietu, kas saistīta ar personu. @lv
definition: Seostab isiku isikuga seotud kohaga. @et
definition: Setzt eine Person in Beziehung zu einem Geografikum, das mit einer Person in Verbindung steht. @de
definition: Συνδέει ένα φυσικό πρόσωπο με έναν τόπο που συνδέεται με ένα φυσικό πρόσωπο. @el
definition: يربط شخصا بمكان مرتبط بشخص. @ar
definition: 将一个个人与和一个个人有关的一个地点关联起来。 @zh-hans

henkilöön liittyvä ajanjakso
has element type: 1
toolkit definition: A timespan that is associated with a person. @en
toolkit definition: Ajanjakso, joka liittyy henkilöön.
toolkit definition: Arco di tempo associato a una persona. @it
toolkit definition: Bir kişiyle bağlantılı olan bir zaman aralığı. @tr
toolkit definition: Een tijdspanne die geassocieerd is met een persoon. @nl
toolkit definition: Egy személyhez kapcsolódó időtartam. @hu
toolkit definition: Ein Zeitraum, der mit einer Person in Verbindung steht. @de
toolkit definition: Et tidsrom som forbindes med en person. @no
toolkit definition: Interval de temps que s’associa amb una persona. @ca
toolkit definition: Isikuga seotud ajavahemik. @et
toolkit definition: Laikposms, kas saistīts ar personu. @lv
toolkit definition: Laps de temps qui est associé à une personne. @fr
toolkit definition: Tidsperiode, som er knyttet til en person. @da
toolkit definition: فترة زمنية مرتبطة بشخص. @ar
toolkit definition: 和一个个人有关的一个时间段 @zh-hans
toolkit label: Kişinin zaman aralığıyla ilişkisi @tr
toolkit label: Mit Person in Beziehung stehender Zeitraum @de
toolkit label: ar personu saistītais laikposms @lv
toolkit label: arco di tempo correlato di persona @it
toolkit label: gerelateerde tijdspanne van persoon @nl
toolkit label: henkilöön liittyvä ajanjakso
toolkit label: interval de temps relacionat amb una persona @ca
toolkit label: isikuga seotud ajavahemik @et
toolkit label: laps de temps en relation avec une personne @fr
toolkit label: related timespan of person @en
toolkit label: személyhez kapcsolódó időtartam: @hu
toolkit label: tidsperiode relateret til person @da
toolkit label: tidsrom relatert til person @no
toolkit label: σχετικό χρονικό διάστημα του φυσικού προσώπου @el
toolkit label: فترة زمنية مرتبطة بشخص @ar
toolkit label: 个人的关联时间段 @zh-hans
has subproperty: henkilön toiminta-aika
has subproperty: henkilöön liittyvä ajankohta
has subproperty: kuolinaika
has subproperty: syntymäaika
has subproperty: P50347
lexical alias: relatedTimespanOfPerson.en
status: Published
type: Property
domain: C10004
label: a pour laps de temps en relation avec une personne @fr
label: ar personu saistītais laikposms @lv
label: ha come arco di tempo correlato di persona @it
label: har tidsperiode relateret til person @da
label: har tidsrom relatert til person @no
label: has related timespan of person @en
label: hat mit Person in Beziehung stehenden Zeitraum @de
label: heeft gerelateerde tijdspanne van persoon @nl
label: isikuga seotud ajavahemik @et
label: kişinin ilgili zaman aralığı ile ilişkilidir @tr
label: személyhez kapcsolódó időtartam a következő: @hu
label: té com a interval de temps relacionat amb una persona @ca
label: έχει σχετικό χρονικό διάστημα του φυσικού προσώπου @el
label: له فترة زمنية مرتبطة بشخص @ar
label: 有个人的关联时间段 @zh-hans
sub property of: henkilöön liittyvä RDA-entiteetti
sub property of: toimijaan liittyvä ajanjakso
alternative label: Datum, das mit einer Person in Verbindung steht @de
alternative label: data associada amb una persona @ca
alternative label: data associata a persona @it
alternative label: date associated with person @en
alternative label: date associée à une personne @fr
alternative label: dato forbundet med person @no
alternative label: dato, som er knyttet til person @da
alternative label: fecha asociada con persona @es
alternative label: henkilöön liittyvä ajankohta
alternative label: isikuga seotud daatum @et
alternative label: kişiyle bağlantılı olan tarih @tr
alternative label: személyhez kapcsolódó időpont: @hu
alternative label: χρονολογία σχετικό με το φυσικό πρόσωπο @el
alternative label: تاريخ مرتبط بشخص @ar
alternative label: 和个人有关的日期 @zh-hans
definition: Bir kişiyi, kişiyle bağlantılı bir zaman aralığıyla ilişkilendirir. @tr
definition: Correla una persona a un arco di tempo associato a una persona. @it
definition: Hozzákapcsol egy személyt egy személyhez kapcsolódó időtartamhoz. @hu
definition: Liittää henkilön ajanjaksoon, joka liittyy henkilöön.
definition: Met une personne en relation avec un laps de temps qui est associé à une personne. @fr
definition: Relaciona una persona amb un interval de temps que s’associa amb una persona. @ca

henkilöön liittyvä nomen
has element type: 1
toolkit definition: A nomen that is associated with a person. @en
toolkit definition: Bir kişiyle bağlantılı olan bir isim. @tr
toolkit definition: Een nomen dat geassocieerd is met een persoon. @nl
toolkit definition: Egy személyhez kapcsolódó nomen. @hu
toolkit definition: Ein Nomen, das mit einer Person in Verbindung steht. @de
toolkit definition: Et nomen som forbindes med en person. @no
toolkit definition: Isikuga seotud nomen. @et
toolkit definition: Nomen associato a una persona. @it
toolkit definition: Nomen que s’associa amb una persona. @ca
toolkit definition: Nomen qui est associé à une personne. @fr
toolkit definition: Nomen, joka liittyy henkilöön.
toolkit definition: Nomen, som er knyttet til en person. @da
toolkit definition: Nomens, kas saistīts ar personu. @lv
toolkit definition: تسمية مرتبطة بشخص. @ar
toolkit definition: 和一个个人有关的一个命名 @zh-hans
toolkit label: Mit Person in Beziehung stehendes Nomen @de
toolkit label: ar personu saistītais nomens @lv
toolkit label: gerelateerde nomen van persoon @nl
toolkit label: henkilöön liittyvä nomen
toolkit label: isikuga seotud nomen @et
toolkit label: kişinin ilişkili ismi @tr
toolkit label: nomen correlato di persona @it
toolkit label: nomen en relation avec une personne @fr
toolkit label: nomen relacionat amb una persona @ca
toolkit label: nomen relateret til person @da
toolkit label: nomen relatert til person @no
toolkit label: related nomen of person @en
toolkit label: személyhez kapcsolódó nomen: @hu
toolkit label: σχετικό όνομα του φυσικού προσώπου @el
toolkit label: تسمية مرتبطة بشخص @ar
toolkit label: 个人的关联命名 @zh-hans
has subproperty: henkilön nimitys
has subproperty: henkilön antama nomen
has subproperty: henkilön toinen identiteetti
has subproperty: henkilön todellinen identiteetti
has subproperty: P50348
lexical alias: relatedNomenOfPerson.en
status: Published
type: Property
domain: C10004
label: a pour nomen en relation avec une personne @fr
label: ar personu saistītais nomens @lv
label: ha come nomen correlato di persona @it
label: har nomen relateret til person @da
label: har nomen relatert til person @no
label: has related nomen of person @en
label: hat mit Person in Beziehung stehendes Nomen @de
label: heeft gerelateerde nomen van persoon @nl
label: isikuga seotud nomen @et
label: kişinin ilgili ismi ile ilişkilidir @tr
label: személyhez kapcsolódó nomen a következő: @hu
label: té com a nomen relacionat amb una persona @ca
label: έχει σχετικό όνομα του φυσικού προσώπου @el
label: له تسمية مرتبطة بشخص @ar
label: 有个人的关联命名 @zh-hans
sub property of: henkilöön liittyvä RDA-entiteetti
sub property of: toimijaan liittyvä nomen
definition: Bir kişiyi, kişiyle bağlantılı olan bir isimle ilişkilendirir. @tr
definition: Correla una persona a un nomen associato a una persona. @it
definition: Hozzákapcsol egy személyt egy személyhez kapcsolódó nomenhez. @hu
definition: Liittää henkilön nomeniin, joka liittyy henkilöön.
definition: Met une personne en relation avec un nomen qui est associé à une personne. @fr
definition: Relaciona una persona amb un nomen que s’associa amb una persona. @ca
definition: Relateert een persoon aan een nomen dat geassocieerd is met een persoon. @nl
definition: Relaterer en person til et nomen som forbindes med en person. @no
definition: Relaterer en person til et nomen, som er knyttet til en person. @da
definition: Relates a person to a nomen that is associated with a person. @en
definition: Sasaista personu ar nomenu, kas saistīts ar personu. @lv
definition: Seostab isiku isikuga seotud nomen'iga. @et
definition: Setzt eine Person in Beziehung zu einem Nomen, das mit einer Person in Verbindung steht. @de
definition: Συνδέει ένα φυσικό πρόσωπο με ένα όνομα που συνδέεται με ένα φυσικό πρόσωπο. @el
definition: يربط شخصا بتسمية مرتبطة بشخص. @ar
definition: 将一个个人与和一个个人有关的一个命名关联起来。 @zh-hans

yhteisöön liittyvä yhteistoimija
has element type: 1
toolkit definition: A collective agent who is associated with a corporate body. @en
toolkit definition: Agent collectif qui est associé à une collectivité. @fr
toolkit definition: Agent col·lectiu que s’associa amb una entitat corporativa. @ca
toolkit definition: Agente collettivo associato a un ente. @it
toolkit definition: Asutusega seotud kollektiiv. @et
toolkit definition: Bir tüzel kişilikle ilişkilendirilen kolektif bir temsilci. @tr
toolkit definition: Een collectieve actor die geassocieerd is met een corporatie. @nl
toolkit definition: Egy testülethez kapcsolódó kollektív ágens. @hu
toolkit definition: Ein gemeinschaftlicher Akteur, der mit einer Körperschaft in Verbindung steht. @de
toolkit definition: En kollektiv agent som forbindes med en korporasjon. @no
toolkit definition: Grupa, kas saistīta ar institūciju. @lv
toolkit definition: Yhteistoimija, joka liittyy yhteisöön.
toolkit definition: kollektiv agent, som er knyttet til en korporation. @da
toolkit definition: وكيل جماعي ذو صلة بهيئة. @ar
toolkit definition: 和一个团体有关的一个集体行为者 @zh-hans
toolkit label: Mit Körperschaft in Beziehung stehender gemeinschaftlicher Akteur @de
toolkit label: agent collectif en relation avec une collectivité @fr
toolkit label: agent col·lectiu relacionat amb una entitat corporativa @ca
toolkit label: agente collettivo correlato di ente @it
toolkit label: ar institūciju saistītā grupa @lv
toolkit label: asutusega seotud kollektiiv @et
toolkit label: gerelateerde collectieve actor van corporatie @nl
toolkit label: kollektiv agent relateret til korporation @da
toolkit label: kollektiv agent relatert til korporasjon @no
toolkit label: related collective agent of corporate body @en
toolkit label: testülethez kapcsolódó kollektív ágens: @hu
toolkit label: tüzel kişiliğin kolektif temsilciyle ilişkisi @tr
toolkit label: yhteisöön liittyvä yhteistoimija
toolkit label: σχετικός συλλογικός φορέας του συλλογικού οργάνου @el
toolkit label: وكيل جماعي مرتبط بهيئة @ar
toolkit label: 团体的关联集体行为者 @zh-hans
has subproperty: yhteisöön liittyvä suku
has subproperty: yhteisöön liittyvä yhteisö
has subproperty: yhteisöjäsen yhteistoimijassa
has subproperty: yhteisöä sponsoroiva yhteistoimija
has subproperty: yhteisön perustanut yhteistoimija
has subproperty: P50349
lexical alias: relatedCollectiveAgentOfCorporateBody.en
status: Published
type: Property
domain: C10005
label: a pour agent collectif en relation avec une collectivité @fr
label: ar institūciju saistītā grupa @lv
label: asutusega seotud kollektiiv @et
label: ha come agente collettivo correlato di ente @it
label: har kollektiv agent relateret til korporation @da
label: har kollektiv agent relatert til korporasjon @no
label: has related collective agent of corporate body @en
label: hat mit Körperschaft in Beziehung stehenden gemeinschaftlichen Akteur @de
label: heeft gerelateerde collectieve actor van corporatie @nl
label: testülethez kapcsolódó kollektív ágens a következő: @hu
label: té com a agent col·lectiu relacionat amb una entitat corporativa @ca
label: tüzel kişinin ilgili kolektif temsilcisi ile ilişkilidir @tr
label: έχει σχετικό συλλογικό φορέα του συλλογικού οργάνου @el
label: لها وكيل جماعي مرتبط بهيئة @ar
label: 有团体的关联集体行为者 @zh-hans
sub property of: yhteisöön liittyvä toimija
sub property of: yhteistoimijaan liittyvä yhteistoimija
definition: Bir tüzel kişiyi, tüzel kişilikle bağlantılı bir kolektif temsilci ile ilişkilendirir. @tr
definition: Correla un ente a un agente collettivo associato a un ente. @it
definition: Hozzákapcsol egy testületet egy testülethez kapcsolódó kollektív ágenshez. @hu
definition: Liittää yhteisön yhteistoimijaan, joka liittyy yhteisöön.
definition: Met une collectivité en relation avec un agent collectif qui est associé à une collectivité. @fr
definition: Relaciona una entitat corporativa amb un agent col·lectiu que s’associa amb una entitat corporativa. @ca
definition: Relateert een corporatie aan een collectieve actor die geassocieerd is met een corporatie. @nl
definition: Relaterer en korporasjon til en kollektiv agent som forbindes med en korporasjon. @no
definition: Relaterer en korporation til en kollektiv agent, som er knyttet til en korporation. @da
definition: Relates a corporate body to a collective agent who is associated with a corporate body. @en
definition: Sasaista institūciju ar grupu, kas saistīta ar institūciju. @lv
definition: Seostab asutuse asutusega seotud kollektiiviga. @et
definition: Setzt eine Körperschaft in Beziehung zu einem gemeinschaftlichen Akteur, der mit einer Körperschaft in Verbindung steht. @de
definition: Συνδέει ένα συλλογικό όργανο με έναν συλλογικό φορέα που συνδέεται με ένα συλλογικό όργανο. @el
definition: يربط هيئة بوكيل جماعي ذي صلة بهيئة. @ar
definition: 将一个团体与和一个团体有关的一个集体行为者关联起来。 @zh-hans

yhteisöön liittyvä paikka
has element type: 1
toolkit definition: A place that is associated with a corporate body. @en
toolkit definition: Asutusega seotud koht. @et
toolkit definition: Een plaats die geassocieerd is met een corporatie. @nl
toolkit definition: Egy testülethez kapcsolódó hely. @hu
toolkit definition: Ein Geografikum, das mit einer Körperschaft in Verbindung steht. @de
toolkit definition: Et sted som forbindes med en korporasjon. @no
toolkit definition: Lieu qui est associé à une collectivité. @fr
toolkit definition: Lloc que s’associa amb una entitat corporativa. @ca
toolkit definition: Luogo associato a un ente. @it
toolkit definition: Paikka, joka liittyy yhteisöön.
toolkit definition: Sted, som er knyttet til en korporation. @da
toolkit definition: Tüzel bir kişilikle bağlantılı olan bir yer. @tr
toolkit definition: Vieta, kas saistīta ar institūciju. @lv
toolkit definition: مكان ذو صلة بهيئة. @ar
toolkit definition: 和一个团体有关的一个地点 @zh-hans
toolkit label: Mit Körperschaft in Beziehung stehendes Geografikum @de
toolkit label: ar institūciju saistītā vieta @lv
toolkit label: asutusega seotud koht @et
toolkit label: gerelateerde plaats van corporatie @nl
toolkit label: lieu en relation avec une collectivité @fr
toolkit label: lloc relacionat amb una entitat corporativa @ca
toolkit label: luogo correlato di ente @it
toolkit label: related place of corporate body @en
toolkit label: sted relateret til korporation @da
toolkit label: sted relatert til korporasjon @no
toolkit label: testülethez kapcsolódó hely: @hu
toolkit label: tüzel kişilikle ilişkili yer @tr
toolkit label: yhteisöön liittyvä paikka
toolkit label: σχετικό τόπο του συλλογικού οργάνου @el
toolkit label: مكان مرتبط بهيئة @ar
toolkit label: 团体的关联地点 @zh-hans
has subproperty: konferenssin paikka
has subproperty: yhteisöön liittyvä paikka
has subproperty: julkishallinnollisen yhteisön hallintoalue
has subproperty: P50350
lexical alias: relatedPlaceOfCorporateBody.en
status: Published
type: Property
domain: C10005
label: a pour lieu en relation avec une collectivité @fr
label: ar institūciju saistītā vieta @lv
label: asutusega seotud koht @et
label: ha come luogo correlato di ente @it
label: har sted relateret til korporation @da
label: har sted relatert til korporasjon @no
label: has related place of corporate body @en
label: hat mit Körperschaft in Beziehung stehendes Geografikum @de
label: heeft gerelateerde plaats van corporatie @nl
label: testülethez kapcsolódó hely a következő: @hu
label: té com a lloc relacionat amb una entitat corporativa @ca
label: tüzel kişinin ilgili yeri ile ilişkilidir @tr
label: έχει σχετικό τόπο του συλλογικού οργάνου @el
label: لها مكان مرتبط بهيئة @ar
label: 有团体的关联地点 @zh-hans
sub property of: yhteisöön liittyvä RDA-entiteetti
sub property of: yhteistoimijaan liittyvä paikka
alternative label: Sonstiger Ort, der mit einer Körperschaft in Verbindung steht @de
alternative label: altro luogo associato a ente @it
alternative label: andet sted knyttet til korporation @da
alternative label: annet sted forbundet med korporasjon @no
alternative label: autre lieu associé à une collectivité @fr
alternative label: egy testülethez társított hely @hu
alternative label: lieu associé à une collectivité @fr
alternative label: lugar asociado con organismo corporativo @es
alternative label: other place associated with corporate body @en
alternative label: otro lugar asociado con organismo corporativo @es
alternative label: place associated with corporate body @en
alternative label: sted forbundet med korporasjon @no
alternative label: teine asutusega seotud koht @et
alternative label: testülethez kapcsolódó egyéb hely @hu
alternative label: tüzel kişilik ile ilişkili yer @tr
alternative label: tüzel kişilikle bağlantılı diğer yerler @tr
alternative label: άλλος τόπος σχετικός με το συλλογικό όργανο @el
alternative label: τόπος σχετικός με το συλλογικό όργανο @el
alternative label: مكان آخر مرتبط باسم هيئة @ar
alternative label: 和团体有关的其他地点 @zh-hans
alternative label: 和团体有关的地点 @zh-hans
definition: Bir tüzel kişiyi, tüzel kişilikle bağlantılı bir yerle ilişkilendirir. @tr

yhteisöön liittyvä ajanjakso
has element type: 1
toolkit definition: A timespan that is associated with a corporate body. @en
toolkit definition: Ajanjakso, joka liittyy yhteisöön.
toolkit definition: Arco di tempo associato a un ente. @it
toolkit definition: Asutusega seotud ajavahemik. @et
toolkit definition: Bir tüzel kişiyle bağlantılı olan bir zaman aralığı. @tr
toolkit definition: Een tijdspanne die geassocieerd is met een corporatie. @nl
toolkit definition: Egy testülethez kapcsolódó időtartam. @hu
toolkit definition: Ein Zeitraum, der mit einer Körperschaft in Verbindung steht. @de
toolkit definition: Et tidsrom som forbindes med en korporasjon. @no
toolkit definition: Interval de temps que s’associa amb una entitat corporativa. @ca
toolkit definition: Laikposms, kas saistīts ar institūciju. @lv
toolkit definition: Laps de temps qui est associé à une collectivité. @fr
toolkit definition: Tidsperiode, som er knyttet til en korporation. @da
toolkit definition: فترة زمنية ذات صلة بهيئة. @ar
toolkit definition: 和一个团体有关的一个时间段 @zh-hans
toolkit label: Mit Körperschaft in Beziehung stehender Zeitraum @de
toolkit label: ar institūciju saistītais laikposms @lv
toolkit label: arco di tempo correlato di ente @it
toolkit label: asutusega seotud ajavahemik @et
toolkit label: gerelateerde tijdspanne van corporatie @nl
toolkit label: interval de temps relacionat amb una entitat corporativa @ca
toolkit label: laps de temps en relation avec une collectivité @fr
toolkit label: related timespan of corporate body @en
toolkit label: testülethez kapcsolódó időtartam: @hu
toolkit label: tidsperiode relateret til korporation @da
toolkit label: tidsrom relatert til korporasjon @no
toolkit label: tüzel kişiliğin zaman aralığıyla ilişkisi @tr
toolkit label: yhteisöön liittyvä ajanjakso
toolkit label: σχετικό χρονικό διάστημα του συλλογικού οργάνου @el
toolkit label: فترة زمنية مرتبطة بهيئة @ar
toolkit label: 团体的关联时间段 @zh-hans
has subproperty: perustamisajankohta
has subproperty: lakkauttamisajankohta
has subproperty: konferenssin ajankohta
has subproperty: yhteisöön liittyvä ajankohta
has subproperty: yhteisön toiminta-aika
has subproperty: P50351
lexical alias: relatedTimespanOfCorporateBody.en
status: Published
type: Property
domain: C10005
label: a pour laps de temps en relation avec une collectivité @fr
label: ar institūciju saistītais laikposms @lv
label: asutusega seotud ajavahemik @et
label: ha come arco di tempo correlato di ente @it
label: har tidsperiode relateret til korporation @da
label: har tidsrom relatert til korporasjon @no
label: has related timespan of corporate body @en
label: hat mit Körperschaft in Beziehung stehenden Zeitraum @de
label: heeft gerelateerde tijdspanne van corporatie @nl
label: testülethez kapcsolódó időtartam a következő: @hu
label: té com a interval de temps relacionat amb una entitat corporativa @ca
label: tüzel kişinin ilgili zaman aralığı ile ilişkilidir @tr
label: έχει σχετικό χρονικό διάστημα του συλλογικού οργάνου @el
label: لها فترة زمنية مرتبطة بهيئة @ar
label: 有团体的关联时间段 @zh-hans
sub property of: yhteisöön liittyvä RDA-entiteetti
sub property of: yhteistoimijaan liittyvä ajanjakso
alternative label: Datum, das mit einer Körperschaft in Verbindung steht @de
alternative label: asutusega seotud daatum @et
alternative label: data assocada amb una entitat corporativa @ca
alternative label: data associata a ente @it
alternative label: date associated with corporate body @en
alternative label: date associée à une collectivité @fr
alternative label: dato forbundet med korporasjon @no
alternative label: dato, som er knyttet til korporation @da
alternative label: fecha asociada con organismo corporativo @es
alternative label: testülethez társított időpont: @hu
alternative label: tüzel kişilikle bağlantılı olan tarih @tr
alternative label: yhteisöön liittyvä ajankohta
alternative label: χρονολογία σχετική με το συλλογικό όργανο @el
alternative label: تاريخ مرتبط بهيئة @ar
alternative label: 和团体有关的一个日期 @zh-hans
definition: Bir tüzel kişiyi, tüzel kişilikle bağlantılı bir zaman aralığıyla ilişkilendirir. @tr
definition: Correla un ente a un arco di tempo associato a un ente. @it
definition: Hozzákapcsol egy testületet egy testülethez kapcsolódó időtartamhoz. @hu
definition: Liittää yhteisön ajanjaksoon, joka liittyy yhteisöön.
definition: Met une collectivité en relation avec un laps de temps qui est associé à une collectivité. @fr

yhteisöön liittyvä nomen
has element type: 1
toolkit definition: A nomen that is associated with a corporate body. @en
toolkit definition: Asutusega seotud nomen. @et
toolkit definition: Bir tüzel kişilikle bağlantılı olan bir isim. @tr
toolkit definition: Een nomen dat geassocieerd is met een corporatie. @nl
toolkit definition: Egy testülethez kapcsolódó nomen. @hu
toolkit definition: Ein Nomen, das einer Körperschaft in Verbindung steht. @de
toolkit definition: Et nomen som forbindes med en korporasjon. @no
toolkit definition: Nomen associato a un ente. @it
toolkit definition: Nomen que s’associa amb una entitat corporativa. @ca
toolkit definition: Nomen qui est associé à une collectivité. @fr
toolkit definition: Nomen, joka liittyy yhteisöön.
toolkit definition: Nomen, som er knyttet til en korporation. @da
toolkit definition: Nomens, kas saistīts ar institūciju. @lv
toolkit definition: تسمية ذات صلة بهيئة. @ar
toolkit definition: 和一个团体有关的一个命名 @zh-hans
toolkit label: Mit Körperschaft in Beziehung stehendes Nomen @de
toolkit label: ar institūciju saistītais nomens @lv
toolkit label: asutusega seotud nomen @et
toolkit label: gerelateerde nomen van corporatie @nl
toolkit label: nome correlato di ente @it
toolkit label: nomen en relation avec une collectivité @fr
toolkit label: nomen relacionat amb una entitat corporativa @ca
toolkit label: nomen relateret til korporation @da
toolkit label: nomen relatert til korporasjon @no
toolkit label: related nomen of corporate body @en
toolkit label: testülethez kapcsolódó nomen: @hu
toolkit label: tüzel kişiliğin ilişkili ismi @tr
toolkit label: yhteisöön liittyvä nomen
toolkit label: σχετικό όνομα του συλλογικού οργάνου @el
toolkit label: تسمية مرتبطة بهيئة @ar
toolkit label: 团体的关联命名 @zh-hans
has subproperty: yhteisön nimitys
has subproperty: yhteisön antama nomen
has subproperty: P50352
lexical alias: relatedNomenOfCorporateBody.en
status: Published
type: Property
domain: C10005
label: a pour nomen en relation avec une collectivité @fr
label: ar institūciju saistītais nomens @lv
label: asutusega seotud nomen @et
label: ha come nomen correlato di ente @it
label: har nomen relateret til korporation @da
label: har nomen relatert til korporasjon @no
label: has related nomen of corporate body @en
label: hat mit Körperschaft in Beziehung stehendes Nomen @de
label: heeft gerelateerde nomen van corporatie @nl
label: testülethez kapcsolódó nomen a következő: @hu
label: té com a nomen relacionat amb una entitat corporativa @ca
label: tüzel kişinin ilgili ismi ile ilişkilidir @tr
label: έχει σχετικό όνομα του συλλογικού οργάνου @el
label: له تسمية ذات صلة بهيئة @ar
label: 有团体的关联命名 @zh-hans
sub property of: yhteisöön liittyvä RDA-entiteetti
sub property of: yhteistoimijaan liittyvä nomen
definition: Bir tüzel kişiliği, tüzel kişilikle bağlantılı bir isimle ilişkilendirir. @tr
definition: Correla un ente a un nomen associato a un ente. @it
definition: Hozzákapcsol egy testületet egy testülethez kapcsolódó nomenhez. @hu
definition: Liittää yhteisön nomeniin, joka liittyy yhteisöön.
definition: Met une collectivité en relation avec un nomen qui est associé à une collectivité. @fr
definition: Relaciona una entitat corporativa amb un nomen que s’associa amb una entitat corporativa. @ca
definition: Relateert een corporatie aan een nomen dat geassocieerd is met een corporatie. @nl
definition: Relaterer en korporasjon til et nomen som forbindes med en korporasjon. @no
definition: Relaterer en korporation til et nomen, som er knyttet til en korporation. @da
definition: Relates a corporate body to a nomen that is associated with a corporate body. @en
definition: Sasaista institūciju ar nomenu, kas saistīts ar institūciju. @lv
definition: Seostab asutuse asutusega seotud nomen'iga. @et
definition: Setzt eine Körperschaft in Beziehung zu einem Nomen, das mit einer Körperschaft in Verbindung steht. @de
definition: Συνδέει ένα συλλογικό όργανο με ένα όνομα που συνδέεται με ένα συλλογικό όργανο. @el
definition: يربط هيئة بتسمية ذات صلة بهيئة. @ar
definition: 将一个团体与和一个团体有关的一个命名关联起来。 @zh-hans

sukuun liittyvä yhteistoimija
has element type: 1
toolkit definition: A collective agent who is associated with a family. @en
toolkit definition: Agent collectif qui est associé à une famille. @fr
toolkit definition: Agent col·lectiu que s’associa amb una família. @ca
toolkit definition: Agente collettivo associato a una famiglia. @it
toolkit definition: Bir aileyle ilişkilendirilen kolektif bir temsilci. @tr
toolkit definition: Een collectieve actor die geassocieerd is met een familie. @nl
toolkit definition: Egy családhoz kapcsolódó kollektív ágens. @hu
toolkit definition: Ein gemeinschaftlicher Akteur, der mit einer Familie in Verbindung steht. @de
toolkit definition: En kollektiv agent som forbindes med en familie. @no
toolkit definition: Grupa, kas saistīta ar dzimtu/ģimeni. @lv
toolkit definition: Kollektiv agent, som er knyttet til en familie. @da
toolkit definition: Perekonnaga seotud kollektiiv. @et
toolkit definition: Yhteistoimija, joka liittyy sukuun.
toolkit definition: وكيل جماعي ذو صلة بعائلة. @ar
toolkit definition: 和一个家族有关的集体行为者 @zh-hans
toolkit label: Ailenin kolektif temsilciyle ilişkisi @tr
toolkit label: Mit Familie in Beziehung stehender gemeinschaftlicher Akteur @de
toolkit label: agent collectif en relation avec une famille @fr
toolkit label: agent col·lectiu relacionat amb una família @ca
toolkit label: agente collettivo correlato di famiglia @it
toolkit label: ar dzimtu/ģimeni saistītā grupa @lv
toolkit label: családhoz kapcsolódó kollektív ágens: @hu
toolkit label: gerelateerde collectieve actor van familie @nl
toolkit label: kollektiv agent relateret til familie @da
toolkit label: kollektiv agent relatert til familie @no
toolkit label: perekonnaga seotud kollektiiv @et
toolkit label: related collective agent of family @en
toolkit label: sukuun liittyvä yhteistoimija
toolkit label: σχετικός συλλογικός φορέας της οικογένειας @el
toolkit label: وكيل جماعي مرتبط بعائلة @ar
toolkit label: 家族的关联集体行为者 @zh-hans
has subproperty: sukuun liittyvä suku
has subproperty: sukuun liittyvä yhteisö
has subproperty: sukujäsen yhteistoimijassa
has subproperty: P50353
lexical alias: relatedCollectiveAgentOfFamily.en
status: Published
type: Property
domain: C10008
label: a pour agent collectif en relation avec une famille @fr
label: ailenin ilgili kolektif temsilcisi ile ilişkilidir @tr
label: ar dzimtu/ģimeni saistītā grupa @lv
label: családhoz kapcsolódó kollektív ágens a következő: @hu
label: ha come agente collettivo correlato di famiglia @it
label: har kollektiv agent relateret til familie @da
label: har kollektiv agent relatert til familie @no
label: has related collective agent of family @en
label: hat mit Familie in Beziehung stehenden gemeinschaftlichen Akteur @de
label: heeft gerelateerde collectieve actor van familie @nl
label: perekonnaga seotud kollektiiv @et
label: té com a agent col·lectiu relacionat amb una família @ca
label: έχει σχετικό συλλογικό φορέα της οικογένειας @el
label: لها وكيل جماعي مرتبط بعائلة @ar
label: 有家族的关联集体行为者 @zh-hans
sub property of: sukuun liittyvä toimija
sub property of: yhteistoimijaan liittyvä yhteistoimija
definition: Bir aileyi, aileyle bağlantılı bir kolektif temsilciyle ilişkilendirir. @tr
definition: Correla una famiglia a un agente collettivo associato a una famiglia. @it
definition: Hozzákapcsol egy családot egy családhoz kapcsolódó ágenshez. @hu
definition: Liittää suvun yhteistoimijaan, joka liittyy sukuun.
definition: Met une famille en relation avec un agent collectif qui est associé à une famille. @fr
definition: Relaciona una família amb un agent col·lectiu que s’associa amb una família. @ca
definition: Relateert een familie aan een collectieve actor die geassocieerd is met een familie. @nl
definition: Relaterer en familie til en kollektiv agent som forbindes med en familie. @no
definition: Relaterer en familie til en kollektiv agent, som er knyttet til en familie. @da
definition: Relates a family to a collective agent who is associated with a family. @en
definition: Sasaista dzimtu/ģimeni ar grupu, kas saistīta ar dzimtu/ģimeni. @lv
definition: Seostab perekonna perekonnaga seotud kollektiiviga. @et
definition: Setzt eine Familie in Beziehung zu einem gemeinschaftlichen Akteur, der mit einer Familie in Verbindung steht. @de
definition: Συνδέει μια οικογένεια με έναν συλλογικό φορέα που συνδέεται με μια οικογένεια. @el
definition: يربط عائلة بوكيل جماعي ذي صلة بعائلة. @ar
definition: 将一个家族与和一个家族有关的集体行为者关联起来。 @zh-hans

sukuun liittyvä paikka
has element type: 1
toolkit definition: A place that is associated with a family. @en
toolkit definition: Bir aileyle bağlantılı olan bir yer. @tr
toolkit definition: Een plaats die geassocieerd is met een familie. @nl
toolkit definition: Egy családhoz kapcsolódó hely. @hu
toolkit definition: Ein Geografikum, das mit einer Familie in Verbindung steht. @de
toolkit definition: Et sted som forbindes med en familie. @no
toolkit definition: Lieu qui est associé à une famille. @fr
toolkit definition: Lloc que s’associa amb una família. @ca
toolkit definition: Luogo associato a una famiglia. @it
toolkit definition: Paikka, joka liittyy sukuun.
toolkit definition: Perekonnaga seotud koht. @et
toolkit definition: Sted, som er knyttet til en familie. @da
toolkit definition: Vieta, kas saistīta ar dzimtu/ģimeni. @lv
toolkit definition: مكان ذو صلة بعائلة. @ar
toolkit definition: 和一个家族有关的一个地点 @zh-hans
toolkit label: Mit Familie in Beziehung stehendes Geografikum @de
toolkit label: aileyle ilişkili yer @tr
toolkit label: ar dzimtu/ģimeni saistītā vieta @lv
toolkit label: családhoz kapcsolódó hely: @hu
toolkit label: gerelateerde plaats van familie @nl
toolkit label: lieu en relation avec une famille @fr
toolkit label: lloc relacionat amb una família @ca
toolkit label: luogo correlato di famiglia @it
toolkit label: perekonnaga seotud koht @et
toolkit label: related place of family @en
toolkit label: sted relateret til familie @da
toolkit label: sted relatert til familie @no
toolkit label: sukuun liittyvä paikka
toolkit label: σχετικός τόπος της οικογένειας @el
toolkit label: مكان مرتبط بعائلة @ar
toolkit label: 家族的关联地点 @zh-hans
has subproperty: sukuun liittyvä paikka
has subproperty: P50354
lexical alias: relatedPlaceOfFamily.en
status: Published
type: Property
domain: C10008
label: a pour lieu en relation avec une famille @fr
label: ailenin ilgili yeri ile ilişkilidir @tr
label: ar dzimtu/ģimeni saistītā vieta @lv
label: családhoz kapcsolódó hely a következő: @hu
label: ha come luogo correlato di famiglia @it
label: har sted relateret til familie @da
label: har sted relatert til familie @no
label: has related place of family @en
label: hat mit Familie in Beziehung stehendes Geografikum @de
label: heeft gerelateerde plaats van familie @nl
label: perekonnaga seotud koht @et
label: té com a lloc relacionat amb una família @ca
label: έχει σχετικό τόπο της οικογένειας @el
label: لها مكان مرتبط بعائلة @ar
label: 有家族的关联地点 @zh-hans
sub property of: sukuun liittyvä RDA-entiteetti
sub property of: yhteistoimijaan liittyvä paikka
alternative label: Ort, der mit einer Familie in Verbindung steht @de
alternative label: aile ile ilişkili yer @tr
alternative label: családhoz társított hely: @hu
alternative label: lieu associé à une famille @fr
alternative label: lloc associat amb una família @ca
alternative label: lugar asociado con familia @es
alternative label: luogo associato a famiglia @it
alternative label: paikka, joka liittyy sukuun
alternative label: place associated with family @en
alternative label: sted forbundet med familie @no
alternative label: sted, som er knyttet til familie @da
alternative label: τόπος σχετικός με την οικογένεια @el
alternative label: مكان مرتبط بعائلة @ar
alternative label: 和家族有关的地点 @zh-hans
definition: Bir aileyi, aileyle bağlantılı bir yerle ilişkilendirir. @tr
definition: Correla una famiglia a un luogo associato a una famiglia. @it
definition: Hozzákapcsol egy családot egy családhoz kapcsolódó helyhez. @hu
definition: Liittää suvun paikkaan, joka liittyy sukuun.
definition: Met une famille en relation avec un lieu qui est associé à une famille. @fr
definition: Relaciona una família amb un lloc que s’associa amb una família. @ca
definition: Relateert een familie aan een plaats die geassocieerd is met een familie. @nl
definition: Relaterer en familie til et sted som forbindes med en familie. @no
definition: Relaterer en familie til et sted, som er knyttet til en familie. @da
definition: Relates a family to a place that is associated with a family. @en

sukuun liittyvä ajanjakso
has element type: 1
toolkit definition: A timespan that is associated with a family. @en
toolkit definition: Ajanjakso, joka liittyy sukuun.
toolkit definition: Arco di tempo associato a una famiglia. @it
toolkit definition: Bir aile ile bağlantılı olan bir zaman aralığı. @tr
toolkit definition: Een tijdspanne die geassocieerd is met een familie. @nl
toolkit definition: Egy családhoz kapcsolódó időtartam. @hu
toolkit definition: Ein Zeitraum, der mit einer Familie in Verbindung steht. @de
toolkit definition: Et tidsrom som forbindes med en familie. @no
toolkit definition: Interval de temps que s’associa amb una família. @ca
toolkit definition: Laikposms, kas saistīts ar dzimtu/ģimeni. @lv
toolkit definition: Laps de temps qui est associé à une famille. @fr
toolkit definition: Perekonnaga seotud ajavahemik. @et
toolkit definition: Tidsperiode, som er knyttet til en familie. @da
toolkit definition: فترة زمنية ذات صلة بعائلة. @ar
toolkit definition: 和一个家族有关的一个时间段 @zh-hans
toolkit label: Ailenin zaman aralığıyla ilişkisi @tr
toolkit label: Mit Familie in Beziehung stehender Zeitraum @de
toolkit label: ar dzimtu/ģimeni saistītais laikposms @lv
toolkit label: arco di tempo correlato di famiglia @it
toolkit label: családhoz kapcsolódó időtartam: @hu
toolkit label: gerelateerde tijdspanne van familie @nl
toolkit label: interval de temps relacionat amb una família @ca
toolkit label: laps de temps en relation avec une famille @fr
toolkit label: perekonnaga seotud ajavahemik @et
toolkit label: related timespan of family @en
toolkit label: sukuun liittyvä ajanjakso
toolkit label: tidsperiode relateret til familie @da
toolkit label: tidsrom relatert til familie @no
toolkit label: σχετικό χρονικό διάστημα της οικογένειας @el
toolkit label: فترة زمنية مرتبطة بعائلة @ar
toolkit label: 家族的关联时间段 @zh-hans
has subproperty: sukuun liittyvä ajankohta
has subproperty: suvun toiminta-aika
has subproperty: P50355
lexical alias: relatedTimespanOfFamily.en
status: Published
type: Property
domain: C10008
label: a pour laps de temps en relation avec une famille @fr
label: ailenin ilgili zaman aralığı ile ilişkilidir @tr
label: ar dzimtu/ģimeni saistītais laikposms @lv
label: családhoz kapcsolódó időtartam a következő: @hu
label: ha come arco di tempo correlato di famiglia @it
label: har tidsperiode relateret til familie @da
label: har tidsrom relatert til familie @no
label: has related timespan of family @en
label: hat mit Familie in Beziehung stehenden Zeitraum @de
label: heeft gerelateerde tijdspanne van familie @nl
label: perekonnaga seotud ajavahemik @et
label: té com a interval de temps relacionat amb una família @ca
label: έχει σχετικό χρονικό διάστημα της οικογένειας @el
label: لها فترة زمنية مرتبطة بعائلة @ar
label: 有家族的关联时间段 @zh-hans
sub property of: sukuun liittyvä RDA-entiteetti
sub property of: yhteistoimijaan liittyvä ajanjakso
alternative label: Datum, das mit einer Familie in Verbindung steht @de
alternative label: aileyle bağlantılı olan tarih @tr
alternative label: családhoz társított időpont: @hu
alternative label: data associada amb una família @ca
alternative label: data associata a famiglia @it
alternative label: date associated with family @en
alternative label: date associée à une famille @fr
alternative label: dato forbundet med familie @no
alternative label: dato, som er knyttet til familie @da
alternative label: fecha asociada con familia @es
alternative label: perekonnaga seotud daatum @et
alternative label: sukuun liittyvä ajankohta
alternative label: χρονολογία σχετική με την οικογένεια @el
alternative label: تاريخ مرتبط بعائلة @ar
alternative label: 和一个家族有关的日期 @zh-hans
definition: Bir aileyi, aileyle bağlantılı bir zaman aralığıyla ilişkilendirir. @tr
definition: Correla una famiglia a un arco di tempo associato a una famiglia. @it
definition: Hozzákapcsol egy családot egy családhoz kapcsolódó időtartamhoz. @hu
definition: Liittää suvun ajanjaksoon, joka liittyy sukuun.
definition: Met une famille en relation avec un laps de temps qui est associé à une famille. @fr
definition: Relaciona una família amb un interval de temps que s’associa amb una família. @ca
definition: Relateert een familie aan een tijdspanne die geassocieerd is met een familie. @nl
definition: Relaterer en familie til en tidsperiode, som er knyttet til en familie. @da

sukuun liittyvä nomen
has element type: 1
toolkit definition: A nomen that is associated with a family. @en
toolkit definition: Bir aileyle bağlantılı olan bir isim. @tr
toolkit definition: Een nomen dat geassocieerd is met een familie. @nl
toolkit definition: Egy családhoz kapcsolódó nomen. @hu
toolkit definition: Ein Nomen, das mit einer Familie in Verbindung steht. @de
toolkit definition: Et nomen som forbindes med en familie. @no
toolkit definition: Nomen associato a una famiglia. @it
toolkit definition: Nomen que s’associa amb una família. @ca
toolkit definition: Nomen qui est associé à une famille. @fr
toolkit definition: Nomen, joka liittyy sukuun.
toolkit definition: Nomen, som er knyttet til en familie. @da
toolkit definition: Nomens, kas saistīts ar dzimtu/ģimeni. @lv
toolkit definition: Perekonnaga seotud nomen. @et
toolkit definition: تسمية ذات صلة بعائلة. @ar
toolkit definition: 和一个家族有关的一个命名 @zh-hans
toolkit label: Mit Familie in Beziehung stehendes Nomen @de
toolkit label: ailenin ilişkili ismi @tr
toolkit label: ar dzimtu/ģimeni saistītais nomens @lv
toolkit label: családhoz kapcsolódó nomen: @hu
toolkit label: gerelateerde nomen van familie @nl
toolkit label: nomen correlato di famiglia @it
toolkit label: nomen en relation avec une famille @fr
toolkit label: nomen relacionat amb una família @ca
toolkit label: nomen relateret til familie @da
toolkit label: nomen relatert til familie @no
toolkit label: perekonnaga seotud nomen @et
toolkit label: related nomen of family @en
toolkit label: sukuun liittyvä nomen
toolkit label: σχετικό όνομα της οικογένειας @el
toolkit label: تسمية مرتبطة بعائلة @ar
toolkit label: 关联命名 @zh-hans
has subproperty: suvun nimitys
has subproperty: suvun antama nomen
has subproperty: P50356
lexical alias: relatedNomenOfFamily.en
status: Published
type: Property
domain: C10008
label: a pour nomen en relation avec une famille @fr
label: ailenin ilgili ismi ile ilişkilidir @tr
label: ar dzimtu/ģimeni saistītais nomens @lv
label: családhoz kapcsolódó nomen a következő: @hu
label: ha come nomen correlato di famiglia @it
label: har nomen relateret til familie @da
label: har nomen relatert til familie @no
label: has related nomen of family @en
label: hat mit Familie in Beziehung stehendes Nomen @de
label: heeft gerelateerde nomen van familie @nl
label: perekonnaga seotud nomen @et
label: té com a nomen relacionat amb una família @ca
label: έχει σχετικό όνομα της οικογένειας @el
label: لها تسمية مرتبطة بعائلة @ar
label: 有家族的关联命名 @zh-hans
sub property of: sukuun liittyvä RDA-entiteetti
sub property of: yhteistoimijaan liittyvä nomen
definition: Bir aileyi, aileyle bağlantılı bir isimle ilişkilendirir. @tr
definition: Correla una famiglia a un nomen associato a una famiglia. @it
definition: Hozzákapcsol egy családot egy családhoz kapcsolódó nomenhez. @hu
definition: Liittää suvun nomeniin, joka liittyy sukuun.
definition: Met une famille en relation avec un nomen qui est associé à une famille. @fr
definition: Relaciona una família amb un nomen que s’associa amb una família. @ca
definition: Relateert een familie aan een nomen dat geassocieerd is met een familie. @nl
definition: Relaterer en familie til et nomen som forbindes med en familie. @no
definition: Relaterer en familie til et nomen, som er knyttet til en familie. @da
definition: Relates a family to a nomen that is associated with a family. @en
definition: Sasaista dzimtu/ģimeni ar nomenu, kas saistīts ar dzimtu/ģimeni. @lv
definition: Seostab perekonna perekonnaga seotud nomen'iga. @et
definition: Setzt eine Familie in Beziehung zu einem Nomen, das mit einer Familie in Verbindung steht. @de
definition: Συνδέει μια οικογένεια με ένα όνομα που συνδέεται με μια οικογένεια. @el
definition: يربط عائلة بتسمية ذات صلة بعائلة. @ar
definition: 将一个家族与和一个家族有关的一个命名关联起来。 @zh-hans

yhteistoimijaan liittyvä teos
has element type: 1
toolkit definition: A work that is associated with a collective agent. @en
toolkit definition: Bir kolektif temsilci ile bağlantılı olan bir eser. @tr
toolkit definition: Darbs, kas saistīts ar grupu. @lv
toolkit definition: Een werk dat geassocieerd is met een collectieve actor. @nl
toolkit definition: Egy kollektív ágenshez kapcsolódó mű. @hu
toolkit definition: Ein Werk, das mit einem gemeinschaftlichen Akteur in Verbindung steht. @de
toolkit definition: Et verk som forbindes med en kollektiv agent. @no
toolkit definition: Kollektiiviga seotud teos. @et
toolkit definition: Obra que s’associa amb un agent col·lectiu. @ca
toolkit definition: Opera associata a un agente collettivo. @it
toolkit definition: Teos, joka liittyy yhteistoimijaan.
toolkit definition: Værk, som er knyttet til en kollektiv agent. @da
toolkit definition: Œuvre qui est associée à un agent collectif. @fr
toolkit definition: عمل ذو صلة بوكيل جماعي. @ar
toolkit definition: 和一个集体行为者有关的一种作品 @zh-hans
toolkit label: Mit gemeinschaftlichem Akteur in Beziehung stehendes Werk @de
toolkit label: ar grupu saistītais darbs @lv
toolkit label: gerelateerd werk van collectieve actor @nl
toolkit label: kolektif temsilciyle ilişkili eser @tr
toolkit label: kollektiiviga seotud teos @et
toolkit label: kollektív ágenshez kapcsolódó mű: @hu
toolkit label: obra relacionada amb un agent col·lectiu @ca
toolkit label: opera correlata di agente collettivo @it
toolkit label: related work of collective agent @en
toolkit label: verk relatert til kollektiv agent @no
toolkit label: værk relateret til kollektiv agent @da
toolkit label: yhteistoimijaan liittyvä teos
toolkit label: œuvre en relation avec un agent collectif @fr
toolkit label: σχετικό έργο του συλλογικού φορέα @el
toolkit label: عمل مرتبط بوكيل جماعي @ar
toolkit label: 集体行为者的关联作品 @zh-hans
has subproperty: sukuun liittyvä teos
has subproperty: yhteisöön liittyvä teos
has subproperty: yhteistoimija aiheena teoksessa
has subproperty: vastaanottaja (yhteistoimija) teoksessa
has subproperty: toimituspäällikkö (yhteistoimija) teoksessa
has subproperty: teoksen omistuksen kohde (yhteistoimija) teoksessa
has subproperty: kuvaaja (yhteistoimija) teoksessa
has subproperty: toimeksiantaja (yhteistoimija) teoksessa
has subproperty: teoksen tekijä (yhteistoimija) teoksessa
has subproperty: teoksen perustaja (yhteistoimija) teoksessa
has subproperty: julkaisija (yhteistoimija) teokselle
has subproperty: järjestäjä (yhteistoimija) teoksessa
has subproperty: asiantuntija (yhteistoimija) teoksessa
has subproperty: tutkija (yhteistoimija) teoksessa
has subproperty: ohjaaja (yhteistoimija) teoksessa
has subproperty: omistuskirjoituksen tekijä (yhteistoimija) teoksessa
has subproperty: teoksella kunnioitettu yhteistoimija teoksessa
has subproperty: yhteistoimijan sponsoroima teos
has subproperty: P50357
lexical alias: relatedWorkOfCollectiveAgent.en
status: Published
type: Property
domain: C10011
label: a pour œuvre en relation avec un agent collectif @fr
label: ar grupu saistītais darbs @lv
label: ha come opera correlata di agente collettivo @it
label: har verk relatert til kollektiv agent @no
label: har værk relateret til kollektiv agent @da
label: has related work of collective agent @en
label: hat mit gemeinschaftlichem Akteur in Beziehung stehendes Werk @de
label: heeft gerelateerd werk van collectieve actor @nl
label: kolektif temsilcinin ilgili eseri ile ilişkilidir @tr
label: kollektiiviga seotud teos @et
label: kollektív ágenshez kapcsolódó mű a következő: @hu
label: té com a obra relacionada amb un agent col·lectiu @ca
label: έχει σχετικό έργο του συλλογικού φορέα @el
label: له عمل مرتبط بوكيل جماعي @ar
label: 有集体行为者的关联作品 @zh-hans
sub property of: toimijaan liittyvä teos
sub property of: yhteistoimijaan liittyvä RDA-entiteetti
definition: Correla un agente collettivo a un'opera associata a un agente collettivo. @it
definition: Hozzákapcsol egy kollektív ágenst egy kollektív ágenshez kapcsolódó műhöz. @hu
definition: Kolektif bir temsilciyi, kolektif temsilciyle bağlantılı bir çalışmayla ilişkilendirir. @tr
definition: Liittää yhteistoimijan teokseen, joka liittyy yhteistoimijaan.
definition: Met un agent collectif en relation avec une œuvre qui est associée à un agent collectif. @fr
definition: Relaciona un agent col·lectiu amb una obra que s’associa amb un agent col·lectiu. @ca
definition: Relateert een collectieve actor aan een werk dat geassocieerd is met een collectieve actor. @nl

yhteistoimijaan liittyvä toimija
has element type: 1
toolkit definition: Agent que s’associa amb un agent col·lectiu. @ca
toolkit definition: Agent qui est associé à un agent collectif. @fr
toolkit definition: Agent, som er knyttet til en kollektiv agent. @da
toolkit definition: An agent who is associated with a collective agent. @en
toolkit definition: Aģents, kas saistīts ar grupu. @lv
toolkit definition: Een actor die geassocieerd is met een collectieve actor. @nl
toolkit definition: Egy kollektív ágenshez kapcsolódó ágens. @hu
toolkit definition: Ein Akteur, der mit einem gemeinschaftlichen Akteur in Verbindung steht. @de
toolkit definition: En agent som forbindes med en kollektiv agent. @no
toolkit definition: Kolektif bir temsilciyle bağlantılı olan bir temsilci. @tr
toolkit definition: Kollektiiviga seotud tegija. @et
toolkit definition: Opera associata a un agente collettivo. @it
toolkit definition: Toimija, joka liittyy yhteistoimijaan.
toolkit definition: وكيل ذو صلة بوكيل جماعي. @ar
toolkit definition: 和一个集体行为者有关的一个行为者 @zh-hans
toolkit label: Mit gemeinschaftlichem Akteur in Beziehung stehender Akteur @de
toolkit label: agent en relation avec un agent collectif @fr
toolkit label: agent relacionat amb un agent col·lectiu @ca
toolkit label: agent relateret til kollektiv agent @da
toolkit label: agent relatert til kollektiv agent @no
toolkit label: ar grupu saistītais aģents @lv
toolkit label: gerelateerde actor van collectieve actor @nl
toolkit label: kolektif temsilcinin ilişkili temsilcisi @tr
toolkit label: kollektiiviga seotud tegija @et
toolkit label: kollektív ágenshez kapcsolódó ágens: @hu
toolkit label: opera correlata a un agente collettivo @it
toolkit label: related agent of collective agent @en
toolkit label: yhteistoimijaan liittyvä toimija
toolkit label: σχετικός φορέας του συλλογικού φορέα @el
toolkit label: وكيل مرتبط بوكيل جماعي @ar
toolkit label: 集体行为者的关联行为者 @zh-hans
has subproperty: sukuun liittyvä toimija
has subproperty: yhteisöön liittyvä toimija
has subproperty: yhteistoimijaan liittyvä yhteistoimija
has subproperty: yhteistoimijaan liittyvä henkilö
has subproperty: P50358
lexical alias: relatedAgentOfCollectiveAgent.en
status: Published
type: Property
domain: C10011
label: a pour agent en relation avec un agent collectif @fr
label: ar grupu saistītais aģents @lv
label: ha come opera correlata di un agente collettivo @it
label: har agent relateret til kollektiv agent @da
label: har agent relatert til kollektiv agent @no
label: has related agent of collective agent @en
label: hat mit gemeinschaftlichem Akteur in Beziehung stehenden Akteur @de
label: heeft gerelateerde actor van collectieve actor @nl
label: kolektif temsilcinin ilgili temsilcisi ile ilişkilidir @tr
label: kollektiiviga seotud tegija @et
label: kollektív ágenshez kapcsolódó ágens a következő: @hu
label: té com a agent relacionat amb un agent col·lectiu @ca
label: έχει σχετικό φορέα του συλλογικού φορέα @el
label: له وكيل مرتبط بوكيل جماعي @ar
label: 有集体行为者的关联行为者 @zh-hans
sub property of: toimijaan liittyvä toimija
sub property of: yhteistoimijaan liittyvä RDA-entiteetti
definition: Correla un agente collettivo a un'opera associata a un agente collettivo. @it
definition: Hozzákapcsol egy kollektív ágenst egy kollektív ágenshez kapcsolódó ágenshez. @hu
definition: Kolektif bir temsilciyi, kolektif temsilciyle bağlantılı bir temsilciyle ilişkilendirir. @tr
definition: Liittää yhteistoimijan toimijaan, joka liittyy yhteistoimijaan.
definition: Met un agent collectif en relation avec un agent qui est associé à un agent collectif. @fr
definition: Relaciona un agent col·lectiu amb un agent que s’associa amb un agent col·lectiu. @ca
definition: Relateert een collectieve actor aan een actor die geassocieerd is met een collectieve actor. @nl
definition: Relaterer en kollektiv agent til en agent som forbindes med en kollektiv agent. @no
definition: Relaterer en kollektiv agent til en agent, som er knyttet til en kollektiv agent. @da
definition: Relates a collective agent to an agent who is associated with a collective agent. @en
definition: Sasaista grupu ar aģentu, kas saistīts ar grupu. @lv
definition: Seostab kollektiivi kollektiiviga seotud tegijaga. @et
definition: Setzt einen gemeinschaftlichen Akteur in Beziehung zu einem Akteur, der mit einem gemeinschaftlichen Akteur in Verbindung steht. @de
definition: Συνδέει έναν συλλογικό φορέα με έναν φορέα ο οποίος συνδέεται με έναν συλλογικό φορέα. @el
definition: يربط وكيلا جماعيا بوكيل ذي صلة بوكيل جماعي. @ar
definition: 将一个集体行为者与和一个集体行为者有关的一个行为者关联起来。 @zh-hans

yhteistoimijaan liittyvä yhteisö
has element type: 1
toolkit definition: A corporate body who is associated with a collective agent. @en
toolkit definition: Bir kolektif temsilciyle bağlantılı olan bir tüzel kişi. @tr
toolkit definition: Collectivité qui est associée à un agent collectif. @fr
toolkit definition: Een corporatie die geassocieerd is met een collectieve actor. @nl
toolkit definition: Egy kollektív ágenshez kapcsolódó testület. @hu
toolkit definition: Eine Körperschaft, die mit einem gemeinschaftlichen Akteur in Verbindung steht. @de
toolkit definition: En korporasjon som forbindes med en kollektiv agent. @no
toolkit definition: Ente associato a un agente collettivo. @it
toolkit definition: Entitat corporativa que s’associa amb un agent col·lectiu. @ca
toolkit definition: Institūcija, kas saistīta ar grupu. @lv
toolkit definition: Kollektiiviga seotud asutus. @et
toolkit definition: Korporation, som er knyttet til en kollektiv agent. @da
toolkit definition: Yhteisö, joka liittyy yhteistoimijaan.
toolkit definition: هيئة ذات صلة بوكيل جماعي. @ar
toolkit definition: 和一个集体行为者有关的一个团体 @zh-hans
toolkit label: Mit gemeinschaftlichem Akteur in Beziehung stehende Körperschaft @de
toolkit label: ar grupu saistītā institūcija @lv
toolkit label: collectivité en relation avec un agent collectif @fr
toolkit label: ente correlato di agente collettivo @it
toolkit label: entitat corporativa relacionada amb un agent col·lectiu @ca
toolkit label: gerelateerde corporatie van collectieve actor @nl
toolkit label: kolektif temsilcinin tüzel kişiyle ilişkisi @tr
toolkit label: kollektiiviga seotud asutus @et
toolkit label: kollektív ágenshez kapcsolódó testület: @hu
toolkit label: korporasjon relatert til kollektiv agent @no
toolkit label: korporation relateret til kollektiv agent @da
toolkit label: related corporate body of collective agent @en
toolkit label: yhteistoimijaan liittyvä yhteisö
toolkit label: σχετικό συλλογικό όργανο του συλλογικού φορέα @el
toolkit label: هيئة مرتبطة بوكيل جماعي @ar
toolkit label: 集体行为者的关联团体 @zh-hans
has subproperty: sukuun liittyvä yhteisö
has subproperty: yhteisöön liittyvä yhteisö
has subproperty: yhteistoimijan yhteisöjäsen
has subproperty: yhteistoimijan sponsoroima yhteisö
has subproperty: yhteistoimijan perustama yhteisö
has subproperty: P50359
lexical alias: relatedCorporateBodyOfCollectiveAgent.en
status: Published
type: Property
domain: C10011
label: a pour collectivité en relation avec un agent collectif @fr
label: ar grupu saistītā institūcija @lv
label: ha come ente correlato di agente collettivo @it
label: har korporasjon relatert til kollektiv agent @no
label: har korporation relateret til kollektiv agent @da
label: has related corporate body of collective agent @en
label: hat mit gemeinschaftlichem Akteur in Beziehung stehende Körperschaft @de
label: heeft gerelateerde corporatie van collectieve actor @nl
label: kolektif temsilcinin ilgili tüzel kişisi ile ilişkilidir @tr
label: kollektiiviga seotud asutus @et
label: kollektív ágenshez kapcsolódó testület a következő: @hu
label: té com a entitat corporativa relacionada amb un agent col·lectiu @ca
label: έχει σχετικό συλλογικό όργανο του συλλογικού φορέα @el
label: له هيئة مرتبطة بوكيل جماعي @ar
label: 有集体行为者的关联团体 @zh-hans
sub property of: toimijaan liittyvä yhteisö
sub property of: yhteistoimijaan liittyvä yhteistoimija
definition: Correla un agente collettivo a un ente associato a un agente collettivo. @it
definition: Hozzákapcsol egy kollektív ágenst egy kollektív ágenshez kapcsolódó testülethez. @hu
definition: Kolektif bir temsilciyi, kolektif bir temsilciyle bağlantılı olan bir tüzel kişilikle ilişkilendirir. @tr
definition: Liittää yhteistoimijan yhteisöön, joka liittyy yhteistoimijaan.
definition: Met un agent collectif en relation avec une collectivité qui est associée à un agent collectif. @fr
definition: Relaciona un agent col·lectiu amb una entitat corporativa que s’associa amb un agent col·lectiu. @ca
definition: Relateert een collectieve actor aan een corporatie die geassocieerd is met een collectieve actor. @nl
definition: Relaterer en kollektiv agent til en korporasjon som forbindes med en kollektiv agent. @no
definition: Relaterer en kollektiv agent til en korporation, som er knyttet til en kollektiv agent. @da
definition: Relates a collective agent to a corporate body who is associated with a collective agent. @en
definition: Sasaista grupu ar institūciju, kas saistīta ar grupu. @lv
definition: Seostab kollektiivi kollektiiviga seotud asutusega. @et
definition: Setzt einen gemeinschaftlichen Akteur in Beziehung zu einer Körperschaft, die mit einem gemeinschaftlichen Akteur in Verbindung steht. @de
definition: Συνδέει έναν συλλογικό φορέα με ένα συλλογικό όργανο το οποίο συνδέεται με έναν συλλογικό φορέα. @el
definition: يربط وكيلا جماعيا بهيئة ذات صلة بوكيل جماعي. @ar
definition: 将一个集体行为者与和一个集体行为者有关的一个团体关联起来。 @zh-hans

yhteistoimijaan liittyvä RDA-entiteetti
has element type: 1
toolkit definition: An RDA entity that is associated with a collective agent. @en
toolkit definition: Bir kolektif temsilciyle bağlantılı olan bir RDA varlığı. @tr
toolkit definition: Een RDA-entiteit die is geassocieerd met een collectieve actor. @nl
toolkit definition: Egy kollektív ágenshez kapcsolódó RDA-entitás. @hu
toolkit definition: Eine RDA-Entität, die mit einem gemeinschaftlichen Akteur in Verbindung steht. @de
toolkit definition: En RDA-entitet som forbindes med en kollektiv agent. @no
toolkit definition: Entitat RDA que s’associa amb un agent col·lectiu. @ca
toolkit definition: Entità RDA associata a un agente collettivo. @it
toolkit definition: Entité RDA qui est associée à un agent collectif. @fr
toolkit definition: Kollektiiviga seotud RDA olem. @et
toolkit definition: RDA entīte, kas saistīta ar grupu. @lv
toolkit definition: RDA-entiteetti, joka liittyy yhteistoimijaan.
toolkit definition: RDA-entitet, som er knyttet til en kollektiv agent. @da
toolkit definition: كيان "وام" ذو صلة بوكيل جماعي. @ar
toolkit definition: 和一个集体行为者有关的一个RDA实体 @zh-hans
toolkit label: Mit gemeinschaftlichem Akteur in Beziehung stehende RDA-Entität @de
toolkit label: RDA-entitet relateret til kollektiv agent @da
toolkit label: RDA-entitet relatert til kollektiv agent @no
toolkit label: ar grupu saistītā RDA entīte @lv
toolkit label: entitat RDA relacionada amb un agent col·lectiu @ca
toolkit label: entità RDA correlata di agente collettivo @it
toolkit label: entité RDA en relation avec un agent collectif @fr
toolkit label: gerelateerde RDA-entiteit van collectieve actor @nl
toolkit label: kolektif temsilcinin RDA varlığıyla ilişkisi @tr
toolkit label: kollektiiviga seotud RDA olem @et
toolkit label: kollektív ágenshez kapcsolódó RDA-entitás: @hu
toolkit label: related RDA entity of collective agent @en
toolkit label: yhteistoimijaan liittyvä RDA-entiteetti
toolkit label: σχετική RDA οντότητα του συλλογικού φορέα @el
toolkit label: كيان "وام" مرتبط بوكيل جماعي @ar
toolkit label: 集体行为者的关联RDA实体 @zh-hans
has subproperty: sukuun liittyvä RDA-entiteetti
has subproperty: yhteisöön liittyvä RDA-entiteetti
has subproperty: yhteistoimijaan liittyvä paikka
has subproperty: yhteistoimijaan liittyvä ajanjakso
has subproperty: yhteistoimijaan liittyvä nomen
has subproperty: yhteistoimijaan liittyvä teos
has subproperty: yhteistoimijaan liittyvä toimija
has subproperty: yhteistoimijaan liittyvä ekspressio
has subproperty: yhteistoimijaan liittyvä kappale
has subproperty: yhteistoimijaan liittyvä manifestaatio
has subproperty: P50360
lexical alias: relatedRDAEntityOfCollectiveAgent.en
status: Published
type: Property
domain: C10011
label: a pour entité RDA en relation avec un agent collectif @fr
label: ar grupu saistītā RDA entīte @lv
label: ha come entità RDA correlata di agente collettivo @it
label: har RDA-entitet relateret til kollektiv agent @da
label: har RDA-entitet relatert til kollektiv agent @no
label: has related RDA entity of collective agent @en
label: hat mit gemeinschaftlichem Akteur in Beziehung stehende RDA-Entität @de
label: heeft gerelateerde RDA-entiteit van collectieve actor @nl
label: kolektif temsilcinin ilgili RDA varlığı ile ilişkilidir @tr
label: kollektiiviga seotud RDA olem @et
label: kollektív ágenshez kapcsolódó RDA-entitás a következő: @hu
label: té com a entitat RDA relacionada amb un agent col·lectiu @ca
label: έχει σχετική RDA οντότητα του συλλογικού φορέα @el
label: له كيان "وام" مرتبط بوكيل جماعي @ar
label: 有集体行为者的关联RDA实体 @zh-hans
sub property of: toimijaan liittyvä RDA-entiteetti
sub property of: yhteistoimijaan liittyvä entiteetti
alternative label: yhteistoimijaan liittyvä entiteetti
definition: Correla un agente collettivo a un'entità rda associata a un agente collettivo. @it
definition: Hozzákapcsol egy kollektív ágenst egy kollektív ágenshez kapcsolódó RDA-entitáshoz. @hu
definition: Kolektif bir temsilciyi, kolektif temsilciyle bağlantılı bir RDA varlığıyla ilişkilendirir. @tr
definition: Liittää yhteistoimijan RDA-entiteettiin, joka liittyy yhteistoimijaan.
definition: Met un agent collectif en relation avec une entité RDA qui est associée à un agent collectif. @fr
definition: Relaciona un agent col·lectiu amb una entitat RDA que s’associa amb un agent col·lectiu. @ca
definition: Relateert een collectieve actor aan eelateert een collectieve actor aan een RDA-entiteit die is geassocieerd met een collectieve actor. @nl
definition: Relaterer en kollektiv agent til en RDA-entitet som forbindes med en kollektiv agent. @no
definition: Relaterer en kollektiv agent til en RDA-entitet, som er knyttet til en kollektiv agent. @da
definition: Relates a collective agent to an RDA entity associated with a collective agent. @en
definition: Sasaista grupu ar RDA entīti, kas saistīta ar grupu. @lv
definition: Seostab kollektiivi kollektiiviga seotud RDA olemiga. @et
definition: Setzt einen gemeinschaftlichen Akteur in Beziehung zu einer RDA-Entität, die mit einem gemeinschaftlichen Akteur in Verbindung steht. @de
definition: Συνδέει έναν συλλογικό φορέα με μια οντότητα η οποία συνδέεται με έναν συλλογικό φορέα. @el

yhteistoimijaan liittyvä ekspressio
has element type: 1
toolkit definition: An expression that is associated with a collective agent. @en
toolkit definition: Bir kolektif temsilciyle bağlantılı olan bir anlatım. @tr
toolkit definition: Een expressie die geassocieerd is met een collectieve actor. @nl
toolkit definition: Egy kollektív ágenshez kapcsolódó kifejezési forma. @hu
toolkit definition: Eine Expression, die mit einem gemeinschaftlichen Akteur in Verbindung steht. @de
toolkit definition: Ekspressio, joka liittyy yhteistoimijaan.
toolkit definition: Espressione associata a un agente collettivo. @it
toolkit definition: Et uttrykk som forbindes med en kollektiv agent. @no
toolkit definition: Expression qui est associée à un agent collectif. @fr
toolkit definition: Expressió que s’associa amb un agent col·lectiu. @ca
toolkit definition: Izteiksme, kas ir saistīta ar grupu. @lv
toolkit definition: Kollektiiviga seotud väljendus. @et
toolkit definition: Udtryk, som er knyttet til en kollektiv agent. @da
toolkit definition: تعبيرة ذات صلة بوكيل جماعي. @ar
toolkit definition: 和一个集体行为者有关的一种内容表达 @zh-hans
toolkit label: Mit gemeinschaftlichem Akteur in Beziehung stehende Expression @de
toolkit label: ar grupu saistītā izteiksme @lv
toolkit label: espressione correlata di agente collettivo @it
toolkit label: expression en relation avec un agent collectif @fr
toolkit label: expressió relacionada amb un agent col·lectiu @ca
toolkit label: gerelateerde expressie van collectieve actor @nl
toolkit label: kolektif temsilcinin ilişkili anlatımı @tr
toolkit label: kollektiiviga seotud väljendus @et
toolkit label: kollektív ágenshez kapcsolódó kifejezési forma: @hu
toolkit label: related expression of collective agent @en
toolkit label: udtryk relateret til kollektiv agent @da
toolkit label: uttrykk relatert til kollektiv agent @no
toolkit label: yhteistoimijaan liittyvä ekspressio
toolkit label: σχετική έκφραση του συλλογικού φορέα @el
toolkit label: تعبيرة مرتبطة بوكيل جماعي @ar
toolkit label: 集体行为者的关联内容表达 @zh-hans
has subproperty: sukuun liittyvä ekspressio
has subproperty: yhteisöön liittyvä ekspressio
has subproperty: ekspression tekijä (yhteistoimija) ekspressiossa
has subproperty: P50361
lexical alias: relatedExpressionOfCollectiveAgent.en
status: Published
type: Property
domain: C10011
label: a pour expression en relation avec un agent collectif @fr
label: ar grupu saistītā izteiksme @lv
label: ha come espressione correlata di agente collettivo @it
label: har udtryk relateret til kollektiv agent @da
label: har uttrykk relatert til kollektiv agent @no
label: has related expression of collective agent @en
label: hat mit gemeinschaftlichem Akteur in Beziehung stehende Expression @de
label: heeft gerelateerde expressie van collectieve actor @nl
label: kolektif temsilicinin ilgili anlatımı ile ilişkilidir @tr
label: kollektiiviga seotud väljendus @et
label: kollektív ágenshez kapcsolódó kifejezési forma a következő: @hu
label: té com a expressió relacionada amb un agent col·lectiu @ca
label: έχει σχετική έκφραση του συλλογικού φορέα @el
label: له تعبيرة مرتبطة بوكيل جماعي @ar
label: 有集体行为者的关联内容表达 @zh-hans
sub property of: toimijaan liittyvä ekspressio
sub property of: yhteistoimijaan liittyvä RDA-entiteetti
definition: Correla un agente collettivo a un'espressione associata a un agente collettivo. @it
definition: Hozzákapcsol egy kollektív ágenst egy kollektív ágenshez kapcsolódó kifejezési formához. @hu
definition: Kolektif temsilciyi, kolektif temsilciyle bağlantılı bir anlatımla ilişkilendirir. @tr
definition: Liittää yhteistoimijan ekspressioon, joka liittyy yhteistoimijaan.
definition: Met un agent collectif en relation avec une expression qui est associée à un agent collectif. @fr
definition: Relaciona un agent col·lectiu amb una expressió que s’associa amb un agent col·lectiu. @ca
definition: Relateert een collectieve actor aan een expressie die geassocieerd is met een collectieve actor. @nl
definition: Relaterer en kollektiv agent til et udtryk, som er knyttet til en kollektiv agent. @da
definition: Relaterer en kollektiv agent til et uttrykk som forbindes med en kollektiv agent. @no
definition: Relates a collective agent to an expression that is associated with a collective agent. @en
definition: Sasaista grupu ar izteiksmi, kas ir saistīta ar grupu. @lv
definition: Seostab kollektiivi kollektiiviga seotud väljendusega. @et
definition: Setzt einen gemeinschaftlichen Akteur in Beziehung zu einer Expression, die mit einem gemeinschaftlichen Akteur in Verbindung steht. @de
definition: Συνδέει έναν συλλογικό φορέα με μια έκφραση η οποία συνδέεται με έναν συλλογικό φορέα. @el
definition: يربط وكيلا جماعيا بتعبيرة ذات صلة بوكيل جماعي. @ar
definition: 将一个集体行为者与和一个集体行为者有关的一种内容表达关联起来。 @zh-hans

yhteistoimijaan liittyvä suku
has element type: 1
toolkit definition: A family who is associated with a collective agent. @en
toolkit definition: Bir kolektif temsilci ile bağlantılı olan bir aile. @tr
toolkit definition: Dzimta/ģimene, kas saistīta ar grupu. @lv
toolkit definition: Een familie die geassocieerd is met een collectieve actor. @nl
toolkit definition: Egy kollektív ágenshez kapcsolódó család. @hu
toolkit definition: Eine Familie, die mit einem gemeinschaftlichen Akteur in Verbindung steht. @de
toolkit definition: En familie som forbindes med en kollektiv agent. @no
toolkit definition: Famiglia associata a un agente collettivo. @it
toolkit definition: Familie, som er knyttet til en kollektiv agent. @da
toolkit definition: Famille qui est associée à un agent collectif. @fr
toolkit definition: Família que s’associa amb un agent col·lectiu. @ca
toolkit definition: Kollektiiviga seotud perekond. @et
toolkit definition: Suku, joka liittyy yhteistoimijaan.
toolkit definition: عائلة ذات صلة بوكيل جماعي. @ar
toolkit definition: 和一个集体行为者有关的一个家族 @zh-hans
toolkit label: Mit gemeinschaftlichem Akteur in Beziehung stehende Familie @de
toolkit label: ar grupu saistītā dzimta/ģimene @lv
toolkit label: famiglia correlata di agente collettivo @it
toolkit label: familie relateret til kollektiv agent @da
toolkit label: familie relatert til kollektiv agent @no
toolkit label: famille en relation avec un agent collectif @fr
toolkit label: família relacionada amb un agent col·lectiu @ca
toolkit label: gerelateerde familie van collectieve actor @nl
toolkit label: kolektif temsilciyle ilişkili aile @tr
toolkit label: kollektiiviga seotud perekond @et
toolkit label: kollektív ágenshez kapcsolódó család: @hu
toolkit label: related family of collective agent @en
toolkit label: yhteistoimijaan liittyvä suku
toolkit label: σχετική οικογένεια του συλλογικού φορέα @el
toolkit label: عائلة مرتبطة بوكيل جماعي @ar
toolkit label: 集体行为者的关联家族 @zh-hans
has subproperty: sukuun liittyvä suku
has subproperty: yhteisöön liittyvä suku
has subproperty: yhteistoimijan sukujäsen
has subproperty: P50362
lexical alias: relatedFamilyOfCollectiveAgent.en
status: Published
type: Property
domain: C10011
label: a pour famille en relation avec un agent collectif @fr
label: ar grupu saistītā dzimta/ģimene @lv
label: ha come famiglia correlata di agente collettivo @it
label: har familie relateret til kollektiv agent @da
label: har familie relatert til kollektiv agent @no
label: has related family of collective agent @en
label: hat mit gemeinschaftlichem Akteur in Beziehung stehende Familie @de
label: heeft gerelateerde familie van collectieve actor @nl
label: kolektif temsilcinin ilgili ailesi ile ilişkilidir @tr
label: kollektiiviga seotud perekond @et
label: kollektív ágenshez kapcsolódó család a következő: @hu
label: té com a família relacionada amb un agent col·lectiu @ca
label: έχει σχετική οικογένεια του συλλογικού φορέα @el
label: له عائلة مرتبطة بوكيل جماعي @ar
label: 有集体行为者的关联家族 @zh-hans
sub property of: toimijaan liittyvä suku
sub property of: yhteistoimijaan liittyvä yhteistoimija
definition: Correla un agente collettivo a una famiglia associata a un agente collettivo. @it
definition: Hozzákapcsol egy kollektív ágenst egy kollektív ágenshez kapcsolódó családhoz. @hu
definition: Kolektif bir temsilciyi, bir kolektif temsilci ile bağlantılı olan bir aile ile ilişkilendirir. @tr
definition: Liittää yhteistoimijan sukuun, joka liittyy yhteistoimijaan.
definition: Met un agent collectif en relation avec une famille qui est associée à un agent collectif. @fr
definition: Relaciona un agent col·lectiu amb una família que s’associa amb un agent col·lectiu. @ca
definition: Relateert een collectieve actor aan een familie die geassocieerd is met een collectieve actor. @nl
definition: Relaterer en kollektiv agent til en familie som forbindes med en kollektiv agent. @no
definition: Relaterer en kollektiv agent til en familie, som er knyttet til en kollektiv agent. @da
definition: Relates a collective agent to a family who is associated with a collective agent. @en
definition: Sasaista grupu ar dzimtu/ģimeni, kas saistīta ar grupu. @lv
definition: Seostab kollektiivi kollektiiviga seotud perekonnaga. @et
definition: Setzt einen gemeinschaftlichen Akteur in Beziehung zu einer Familie, die mit einem gemeinschaftlichen Akteur in Verbindung steht. @de
definition: Συνδέει έναν συλλογικό φορέα με μια οικογένεια η οποία συνδέεται με έναν συλλογικό φορέα. @el
definition: يربط وكيلا جماعيا بعائلة ذات صلة بوكيل جماعي. @ar
definition: 将一个集体行为者与和一个集体行为者有关的一个家族关联起来。 @zh-hans

yhteistoimijaan liittyvä kappale
has element type: 1
toolkit definition: An item that is associated with a collective agent. @en
toolkit definition: Bir kolektif temsilciyle bağlantılı olan bir kopya. @tr
toolkit definition: Een item dat is geassocieerd met een collectieve actor. @nl
toolkit definition: Egy kollektív ágenshez kapcsolódó példány. @hu
toolkit definition: Ein Exemplar, das mit einem gemeinschaftlichen Akteur in Verbindung steht. @de
toolkit definition: Eksemplar, som er knyttet til en kollektiv agent. @da
toolkit definition: Et eksemplar som forbindes med en kollektiv agent. @no
toolkit definition: Item associato a un agente collettivo. @it
toolkit definition: Item qui est associé à un agent collectif. @fr
toolkit definition: Kappale, joka liittyy yhteistoimijaan.
toolkit definition: Kollektiiviga seotud eksemplar. @et
toolkit definition: Vienība, kas ir saistīta ar grupu. @lv
toolkit definition: Ítem que s’associa amb un agent col·lectiu. @ca
toolkit definition: مفردة مرتبطة بوكيل جماعي. @ar
toolkit definition: 和一个集体行为者有关的一个单件 @zh-hans
toolkit label: Mit gemeinschaftlichem Akteur in Beziehung stehendes Exemplar @de
toolkit label: ar grupu saistītā vienība @lv
toolkit label: eksemplar relateret til kollektiv agent @da
toolkit label: eksemplar relatert til kollektiv agent @no
toolkit label: gerelateerd item van collectieve actor @nl
toolkit label: item correlato di agente collettivo @it
toolkit label: item en relation avec un agent collectif @fr
toolkit label: kolektif temsilciyle ilişkili kopya @tr
toolkit label: kollektiiviga seotud eksemplar @et
toolkit label: kollektív ágenshez kapcsolódó példány: @hu
toolkit label: related item of collective agent @en
toolkit label: yhteistoimijaan liittyvä kappale
toolkit label: ítem relacionat amb un agent col·lectiu @ca
toolkit label: σχετικό αντίτυπο του συλλογικού φορέα @el
toolkit label: مفردة مرتبطة بوكيل جماعي @ar
toolkit label: 集体行为者的关联单件 @zh-hans
has subproperty: sukuun liittyvä kappale
has subproperty: yhteisöön liittyvä kappale
has subproperty: kappaleen omistuksen kohde (yhteistoimija) kappaleessa
has subproperty: sitoja (yhteistoimija) kappaleessa
has subproperty: kappaleen entisöijä (yhteistoimija) kappaleessa
has subproperty: kuraattori (yhteistoimija) kappaleessa
has subproperty: säilyttäjä (yhteistoimija) kappaleessa
has subproperty: omistaja (yhteistoimija) kappaleessa
has subproperty: muokkaaja (yhteistoimija) kappaleessa
has subproperty: illuminoinnin tekijä (yhteistoimija) kappaleessa
has subproperty: kappaleella kunnioitettu yhteistoimija kappaleessa
has subproperty: P50363
lexical alias: relatedItemOfCollectiveAgent.en
status: Published
type: Property
domain: C10011
label: a pour item en relation avec un agent collectif @fr
label: ar grupu saistītā vienība @lv
label: ha come item correlato di agente collettivo @it
label: har eksemplar relateret til kollektiv agent @da
label: har eksemplar relatert til kollektiv agent @no
label: has related item of collective agent @en
label: hat mit gemeinschaftlichem Akteur in Beziehung stehendes Exemplar @de
label: heeft gerelateerd item van collectieve actor @nl
label: kolektif temsilcinin ilgili kopyası ile ilişkilidir @tr
label: kollektiiviga seotud eksemplar @et
label: kollektív ágenshez kapcsolódó példány a következő: @hu
label: té com a ítem relacionat amb un agent col·lectiu @ca
label: έχει σχετικό αντίτυπο του συλλογικού φορέα @el
label: له مفردة مرتبطة بوكيل جماعي @ar
label: 有集体行为者的关联单件 @zh-hans
sub property of: toimijaan liittyvä kappale
sub property of: yhteistoimijaan liittyvä RDA-entiteetti
definition: Correla un agente collettivo a un item associato a un agente collettivo. @it
definition: Hozzákapcsol egy kollektív ágenst egy kollektív ágenshez kapcsolódó példányhoz. @hu
definition: Kolektif bir temsilciyi, kolektif temsilciyle bağlantılı bir kopyayla ilişkilendirir @tr
definition: Liittää yhteistoimijan kappaleeseen, joka liittyy yhteistoimijaan.
definition: Met un agent collectif en relation avec un item qui est associé à un agent collectif. @fr
definition: Relaciona un agent col·lectiu amb un ítem que s’associa amb un agent col·lectiu. @ca
definition: Relateert een collectieve actor aan een item dat is geassocieerd met een collectieve actor. @nl
definition: Relaterer en kollektiv agent til et eksemplar som forbindes med en kollektiv agent. @no
definition: Relaterer en kollektiv agent til et eksemplar, som er knyttet til en kollektiv agent. @da
definition: Relates a collective agent to an item that is associated with a collective agent. @en
definition: Sasaista grupu ar vienību, kas ir saistīta ar grupu. @lv
definition: Seostab kollektiivi kollektiiviga seotud eksemplariga. @et
definition: Setzt einen gemeinschaftlichen Akteur in Beziehung zu einem Exemplar, das mit einem gemeinschaftlichen Akteur in Verbindung steht. @de
definition: Συνδέει έναν συλλογικό φορέα με ένα αντίτυπο το οποίο συνδέεται με έναν συλλογικό φορέα. @el

yhteistoimijaan liittyvä manifestaatio
has element type: 1
toolkit definition: A manifestation that is associated with a collective agent. @en
toolkit definition: Een manifestatie die is geassocieerd met een collectieve actor. @nl
toolkit definition: Egy kollektív ágenshez kapcsolódó megjelenési forma. @hu
toolkit definition: Eine Manifestation, die mit einem gemeinschaftlichen Akteur in Verbindung steht. @de
toolkit definition: En manifestasjon som forbindes med en kollektiv agent. @no
toolkit definition: Kolektif bir temsilciyle bağlantılı olan bir gösterim. @tr
toolkit definition: Kollektiiviga seotud kehastus. @et
toolkit definition: Manifestaatio, joka liittyy yhteistoimijaan.
toolkit definition: Manifestació que s’associa amb un agent col·lectiu. @ca
toolkit definition: Manifestation qui est associée à un agent collectif. @fr
toolkit definition: Manifestation, som er knyttet til en kollektiv agent. @da
toolkit definition: Manifestazione associata a un agente collettivo. @it
toolkit definition: Manifestācija, kas ir saistīta ar grupu. @lv
toolkit definition: تجسيدة ذات صلة بوكيل جماعي. @ar
toolkit definition: 和一个集体行为者有关的一种载体表现 @zh-hans
toolkit label: Mit gemeinschaftlichem Akteur in Beziehung stehende Manifestation @de
toolkit label: ar grupu saistītā manifestācija @lv
toolkit label: gerelateerde manifestatie van collectieve actor @nl
toolkit label: kolektif temsilcinin ilişkili gösterimi @tr
toolkit label: kollektiiviga seotud kehastus @et
toolkit label: kollektív ágenshez kapcsolódó megjelenési forma: @hu
toolkit label: manifestació relacionada amb un agent col·lectiu @ca
toolkit label: manifestasjon relatert til kollektiv agent @no
toolkit label: manifestation en relation avec un agent collectif @fr
toolkit label: manifestation relateret til kollektiv agent @da
toolkit label: manifestazione correlata di agente collettivo @it
toolkit label: related manifestation of collective agent @en
toolkit label: yhteistoimijaan liittyvä manifestaatio
toolkit label: σχετική εκδήλωση του συλλογικού φορέα @el
toolkit label: تجسيدة مرتبطة بوكيل جماعي @ar
toolkit label: 集体行为者的关联载体表现 @zh-hans
has subproperty: sukuun liittyvä manifestaatio
has subproperty: yhteisöön liittyvä manifestaatio
has subproperty: manifestaation tekijä (yhteistoimija) manifestaatiossa
has subproperty: jakelija (yhteistoimija) manifestaatiossa
has subproperty: valmistaja (yhteistoimija) manifestaatiossa
has subproperty: paperinvalmistaja (yhteistoimija) manifestaatiossa
has subproperty: aggregaattiin osallinen yhteistoimija manifestaatiossa
has subproperty: P50364
lexical alias: relatedManifestationOfCollectiveAgent.en
status: Published
type: Property
domain: C10011
label: a pour manifestation en relation avec un agent collectif @fr
label: ar grupu saistītā manifestācija @lv
label: ha come manifestazione correlata di agente collettivo @it
label: har manifestasjon relatert til kollektiv agent @no
label: har manifestation relateret til kollektiv agent @da
label: has related manifestation of collective agent @en
label: hat mit gemeinschaftlichem Akteur in Beziehung stehende Manifestation @de
label: heeft gerelateerde manifestatie van collectieve actor @nl
label: kolektif temsilcinin ilgili gösterimi ile ilişkilidir @tr
label: kollektiiviga seotud kehastus @et
label: kollektív ágenshez kapcsolódó megjelenési forma a következő: @hu
label: té com a manifestació relacionada amb un agent col·lectiu @ca
label: έχει σχετική εκδήλωση του συλλογικού φορέα @el
label: له تجسيدة مرتبطة بوكيل جماعي @ar
label: 有集体行为者的关联载体表现 @zh-hans
sub property of: toimijaan liittyvä manifestaatio
sub property of: yhteistoimijaan liittyvä RDA-entiteetti
definition: Correla un agente collettivo a una manifestazione associata a un agente collettivo. @it
definition: Hozzákapcsol egy kollektív ágenst egy kollektív ágenshez kapcsolódó megjelenési formához. @hu
definition: Kolektif bir temsilciyi, kolektif temsilciyle bağlantılı bir gösterimle ilişkilendirir. @tr
definition: Liittää yhteistoimijan manifestaatioon, joka liittyy yhteistoimijaan.
definition: Met un agent collectif en relation avec une manifestation qui est associée à un agent collectif. @fr
definition: Relaciona un agent col·lectiu amb una manifestació que s’associa amb un agent col·lectiu. @ca
definition: Relateert een collectieve actor aan een manifestatie die is geassocieerd met een collectieve actor. @nl
definition: Relaterer en kollektiv agent til en manifestasjon som forbindes med en kollektiv agent. @no
definition: Relaterer en kollektiv agent til en manifestation, som er knyttet til en kollektiv agent. @da
definition: Relates a collective agent to a manifestation that is associated with a collective agent. @en
definition: Sasaista grupu ar manifestāciju, kas ir saistīta ar grupu. @lv
definition: Seostab kollektiivi kollektiiviga seotud kehastusega. @et
definition: Setzt einen gemeinschaftlichen Akteur in Beziehung zu einer Manifestation, die mit einem gemeinschaftlichen Akteur in Verbindung steht. @de
definition: Συνδέει έναν συλλογικό φορέα με μια εκδήλωση η οποία συνδέεται με έναν συλλογικό φορέα. @el
definition: يربط وكيلا جماعيا بتجسيدة مرتبطة بوكيل جماعي. @ar
definition: 将一个集体行为者与和一个集体行为者有关的一种载体表现关联起来。 @zh-hans

yhteistoimijaan liittyvä henkilö
has element type: 1
toolkit definition: A person who is associated with a collective agent. @en
toolkit definition: Bir kolektif temsilciyle bağlantılı olan bir kişi. @tr
toolkit definition: Een persoon die geassocieerd is met een collectieve actor. @nl
toolkit definition: Egy kollektív ágenshez kapcsolódó személy. @hu
toolkit definition: Eine Person, die mit einem gemeinschaftlichen Akteur in Verbindung steht. @de
toolkit definition: En person som forbindes med en kollektiv agent. @no
toolkit definition: Henkilö, joka liittyy yhteistoimijaan.
toolkit definition: Kollektiiviga seotud isik. @et
toolkit definition: Person, som er knyttet til en kollektiv agent. @da
toolkit definition: Persona associata a un agente collettivo. @it
toolkit definition: Persona que s’associa amb un agent col·lectiu. @ca
toolkit definition: Persona, kura saistīta ar grupu. @lv
toolkit definition: Personne qui est associée à un agent collectif. @fr
toolkit definition: شخص مرتبط بوكيل جماعي. @ar
toolkit definition: 和一个集体行为者有关的一个个人 @zh-hans
toolkit label: Mit gemeinschaftlichem Akteur in Beziehung stehende Person @de
toolkit label: ar grupu saistītā persona @lv
toolkit label: gerelateerde persoon van collectieve actor @nl
toolkit label: kolektif temsilciyle ilişkili kişi @tr
toolkit label: kollektiiviga seotud isik @et
toolkit label: kollektív ágenshez kapcsolódó személy: @hu
toolkit label: person relateret til kollektiv agent @da
toolkit label: person relatert til kollektiv agent @no
toolkit label: persona correlata di agente collettivo @it
toolkit label: persona relacionada amb un agent col·lectiu @ca
toolkit label: personne en relation avec un agent collectif @fr
toolkit label: related person of collective agent @en
toolkit label: yhteistoimijaan liittyvä henkilö
toolkit label: σχετικό φυσικό πρόσωπο του συλλογικού φορέα @el
toolkit label: شخص مرتبط بوكيل جماعي @ar
toolkit label: 集体行为者的关联个人 @zh-hans
has subproperty: sukuun liittyvä henkilö
has subproperty: yhteisöön liittyvä henkilö
has subproperty: yhteistoimijan henkilöjäsen
has subproperty: P50365
lexical alias: relatedPersonOfCollectiveAgent.en
status: Published
type: Property
domain: C10011
label: a pour personne en relation avec un agent collectif @fr
label: ar grupu saistītā persona @lv
label: ha come persona correlata di agente collettivo @it
label: har person relateret til kollektiv agent @da
label: har person relatert til kollektiv agent @no
label: has related person of collective agent @en
label: hat mit gemeinschaftlichem Akteur in Beziehung stehende Person @de
label: heeft gerelateerde persoon van collectieve actor @nl
label: kolektif temsilcinin ilgili kişisi ile ilişkilidir @tr
label: kollektiiviga seotud isik @et
label: kollektív ágenshez kapcsolódó személy a következő: @hu
label: té com a persona relacionada amb un agent col·lectiu @ca
label: έχει σχετικό φυσικό πρόσωπο του συλλογικού φορέα @el
label: له شخص مرتبط بوكيل جماعي @ar
label: 有集体行为者的关联个人 @zh-hans
sub property of: toimijaan liittyvä henkilö
sub property of: yhteistoimijaan liittyvä toimija
definition: Correla un agente collettivo a una persona associata a un agente collettivo. @it
definition: Hozzákapcsol egy kollektív ágenst egy kollektív ágenshez kapcsolódó személyhez. @hu
definition: Kolektif bir temsilciyi, kolektif temsilciyle bağlantılı bir kişiyle ilişkilendirir. @tr
definition: Liittää yhteistoimijan henkilöön, joka liittyy yhteistoimijaan.
definition: Met un agent collectif en relation avec une personne qui est associée à un agent collectif. @fr
definition: Relaciona un agent col·lectiu amb una persona que s’associa amb un agent col·lectiu. @ca
definition: Relateert een collectieve actor aan een persoon die geassocieerd is met een collectieve actor. @nl
definition: Relaterer en kollektiv agent til en person som forbindes med en kollektiv agent. @no
definition: Relaterer en kollektiv agent til en person, som er knyttet til en kollektiv agent. @da
definition: Relates a collective agent to a person who is associated with a collective agent. @en
definition: Sasaista grupu ar personu, kura saistīta ar grupu. @lv
definition: Seostab kollektiivi kollektiiviga seotud isikuga. @et
definition: Setzt einen gemeinschaftlichen Akteur in Beziehung zu einer Person, die mit einem gemeinschaftlichen Akteur in Verbindung steht. @de
definition: Συνδέει έναν συλλογικό φορέα με ένα φυσικό πρόσωπο το οποίο συνδέεται με έναν συλλογικό φορέα. @el
definition: يربط وكيلا جماعيا بشخص ذي صلة بوكيل جماعي. @ar
definition: 将一个集体行为者与和一个集体行为者有关的一个个人关联起来。 @zh-hans

toimija aiheena teoksessa
has element type: 2
toolkit definition: A work that is about an agent. @en
toolkit definition: Bir temsilci hakkındaki bir eser. @tr
toolkit definition: Darbs, kura temats ir aģents. @lv
toolkit definition: Een werk dat gaat over een actor. @nl
toolkit definition: Egy mű, amely egy ágensről szól. @hu
toolkit definition: Ein Werk, das von einem Akteur handelt. @de
toolkit definition: Et verk som handler om en agent. @no
toolkit definition: Obra que tracta d’un agent. @ca
toolkit definition: Opera che tratta di un agente. @it
toolkit definition: Teos, joka käsittelee toimijaa.
toolkit definition: Teos, mis on tegija kohta. @et
toolkit definition: Værk, som handler om en agent. @da
toolkit definition: Œuvre qui traite d’un agent. @fr
toolkit definition: عمل عن وكيل. @ar
toolkit definition: 关于一个行为者的一种作品 @zh-hans
toolkit label: Akteur als Thema von @de
toolkit label: actor als onderwerp van @nl
toolkit label: agent de matèria de @ca
toolkit label: agent som emne for @no
toolkit label: agent sujet de @fr
toolkit label: agent, som er subjekt af @da
toolkit label: agente soggetto di @it
toolkit label: ir temats (aģents) @lv
toolkit label: konu alınan temsilci @tr
toolkit label: subject agent of @en
toolkit label: teema (tegija) teoses @et
toolkit label: toimija aiheena teoksessa
toolkit label: ágens tárgya: @hu
toolkit label: θέμα φορέας του @el
toolkit label: موضوع وكيل @ar
toolkit label: ……的主题行为者 @zh-hans
has subproperty: henkilö aiheena teoksessa
has subproperty: yhteistoimija aiheena teoksessa
has subproperty: toimijan kuvaus
has subproperty: P50366
lexical alias: subjectAgentOf.en
status: Published
type: Property
domain: C10002
label: Konu temsilcisi @tr
label: er agent som emne for @no
label: er agent, som er subjekt af @da
label: est un agent sujet de @fr
label: ir temats (aģents) @lv
label: is actor als onderwerp van @nl
label: is subject agent of @en
label: ist Akteur als Thema von @de
label: teema (tegija) teoses @et
label: ágens tárgya a következőnek: @hu
label: è soggetto agente di @it
label: és agent de matèria de @ca
label: είναι θέμα φορέας του @el
label: هو وكيل موضوع لـ @ar
label: 是……的主题行为者 @zh-hans
sub property of: toimijaan liittyvä teos
sub property of: P00014
definition: Bir temsilciyi, bir temsilciyi konu alan bir eserle ilişkilendirir. @tr
definition: Correla un agente a un'opera che tratta di un agente. @it
definition: Hozzákapcsol egy ágenst egy műhöz, amely egy ágensről szól. @hu
definition: Liittää toimijan teokseen, joka käsittelee toimijaa.
definition: Met un agent en relation avec une œuvre qui traite d’un agent. @fr
definition: Relaciona un agent amb una obra que tracta d’un agent. @ca
definition: Relateert een actor aan een werk dat gaat over een actor. @nl
definition: Relaterer en agent til et verk som handler om en agent. @no
definition: Relaterer en agent til et værk, som handler om en agent. @da
definition: Relates an agent to a work that is about an agent. @en
definition: Sasaista aģentu ar darbu, kura temats ir aģents. @lv
definition: Seostab tegija teosega, mis on tegija kohta. @et
definition: Setzt einen Akteur in Beziehung zu einem Werk, das von einem Akteur handelt. @de
definition: Συνδέει έναν φορέα με ένα έργο το οποίο αναφέρεται σε έναν φορέα. @el
definition: يربط وكيلا بعمل عن وكيل. @ar
definition: 将一个行为者与关于一个行为者的一种作品关联起来。 @zh-hans

yhteistoimija aiheena teoksessa
has element type: 2
toolkit definition: A work that is about a collective agent. @en
toolkit definition: Bir kolektif temsilci hakkındaki bir eser. @tr
toolkit definition: Darbs, kura temats ir grupa. @lv
toolkit definition: Een werk dat gaat over een collectieve actor. @nl
toolkit definition: Egy mű, amely egy kollektív ágensről szól. @hu
toolkit definition: Ein Werk, das von einem gemeinschaftlichen Akteur handelt. @de
toolkit definition: Et verk som handler om en kollektiv agent. @no
toolkit definition: Obra que tracta d’un agent col·lectiu. @ca
toolkit definition: Opera che tratta di un agente collettivo. @it
toolkit definition: Teos, joka käsittelee yhteistoimijaa.
toolkit definition: Teos, mis on kollektiivi kohta. @et
toolkit definition: Værk, som handler om en kollektiv agent. @da
toolkit definition: Œuvre qui traite d’un agent collectif. @fr
toolkit definition: عمل عن وكيل جماعي. @ar
toolkit definition: 关于一个集体行为者的一种作品 @zh-hans
toolkit label: Gemeinschaftlicher Akteur als Thema von @de
toolkit label: agent collectif sujet de @fr
toolkit label: agent col·lectiu de matèria de @ca
toolkit label: agente collettivo soggetto di @it
toolkit label: collectieve actor als onderwerp van @nl
toolkit label: ir temats (grupa) @lv
toolkit label: kollektiv agent som emne for @no
toolkit label: kollektiv agent, som er subjekt af @da
toolkit label: kollektív ágens tárgya: @hu
toolkit label: konu alınan kolektif temsilci @tr
toolkit label: subject collective agent of @en
toolkit label: teema (kollektiiv) teoses @et
toolkit label: yhteistoimija aiheena teoksessa
toolkit label: θέμα συλλογικός φορέας του @el
toolkit label: موضوع وكيل جماعي @ar
toolkit label: ……的主题集体行为者 @zh-hans
has subproperty: suku aiheena teoksessa
has subproperty: yhteisö aiheena teoksessa
has subproperty: yhteistoimijan kuvaus
has subproperty: P50367
lexical alias: subjectCollectiveAgentOf.en
status: Published
type: Property
domain: C10011
label: Konunun kolektif temsilcisi @tr
label: er kollektiv agent som emne for @no
label: er kollektiv agent, som er subjekt af @da
label: est un agent collectif sujet de @fr
label: ir temats (grupa) @lv
label: is collectieve actor als onderwerp van @nl
label: is subject collective agent of @en
label: ist gemeinschaftlicher Akteur als Thema von @de
label: kollektív ágens tárgya a következőnek: @hu
label: teema (kollektiiv) teoses @et
label: è soggetto collettivo agente di @it
label: és agent col·lectiu de matèria de @ca
label: είναι θέμα συλλογικός φορέας του @el
label: هو وكيل جماعي موضوع لـ @ar
label: 是……的主题集体行为者 @zh-hans
sub property of: yhteistoimijaan liittyvä teos
sub property of: toimija aiheena teoksessa
definition: Correla un agente collettivo a un'opera che tratta di un agente collettivo. @it
definition: Hozzákapcsol egy kollektív ágenst egy műhöz, amely egy kollektív ágensről szól. @hu
definition: Kolektif bir temsilciyi, bir kolektif temsilciyi konu alan çalışma ile ilişkilendirir. @tr
definition: Liittää yhteistoimijan teokseen, joka käsittelee yhteistoimijaa.
definition: Met un agent collectif en relation avec une œuvre qui traite d’un agent collectif. @fr
definition: Relaciona un agent col·lectiu amb una obra que tracta d’un agent col·lectiu. @ca
definition: Relateert een collectieve actor aan een werk dat gaat over een collectieve actor. @nl
definition: Relaterer en kollektiv agent til et verk som handler om en kollektiv agent. @no
definition: Relaterer en kollektiv agent til et værk, som handler om en kollektiv agent. @da
definition: Relates a collective agent to a work that is about a collective agent. @en
definition: Sasaista grupu ar darbu, kura temats ir grupa. @lv
definition: Seostab kollektiivi teosega, mis on kollektiivi kohta. @et
definition: Setzt einen gemeinschaftlichen Akteur in Beziehung zu einem Werk, das von einem gemeinschaftlichen Akteur handelt. @de
definition: Συνδέει έναν συλλογικό φορέα με ένα έργο το οποίο αναφέρεται σε έναν συλλογικό φορέα. @el
definition: يربط وكيلا جماعيا بعمل عن وكيل جماعي. @ar
definition: 将一个集体行为者与关于一个集体行为者的一种作品关联起来。 @zh-hans

henkilöä kuvaava teos
has element type: 2
toolkit definition: A work that is a description of a person. @en
toolkit definition: Bir kişinin tanımı olan bir eser @tr
toolkit definition: Darbs, kurā aprakstīta konkrētā persona. @lv
toolkit definition: Een werk dat een persoon beschrijft. @nl
toolkit definition: Egy mű, amely leír egy személyt. @hu
toolkit definition: Ein Werk, das eine Person beschreibt. @de
toolkit definition: Et verk som beskriver en person. @no
toolkit definition: Obra que és una descripció d’una persona. @ca
toolkit definition: Opera che descrive una persona. @it
toolkit definition: Teos, joka on henkilön kuvaus.
toolkit definition: Teos, milles isikut kirjeldatakse. @et
toolkit definition: Værk, som beskriver en person. @da
toolkit definition: Œuvre qui consiste en une description d’une personne. @fr
toolkit definition: Ένα έργο που περιγράφει ένα περιγραφόμενο φυσικό πρόσωπο. @el
toolkit definition: عمل يصف شخصا. @ar
toolkit definition: 作为一个个人之描述的一种作品 @zh-hans
toolkit label: Person beschrieben in @de
toolkit label: Tarafından tanımlanan kişi @tr
toolkit label: henkilöä kuvaava teos
toolkit label: isiku kirjeldus @et
toolkit label: person beskrevet i @da
toolkit label: person beskrevet i @no
toolkit label: person described by @en
toolkit label: persona descrita per @ca
toolkit label: persona descritta in @it
toolkit label: personas apraksts @lv
toolkit label: personne décrite par @fr
toolkit label: persoon beschreven in @nl
toolkit label: személy leírva a következőben: @hu
toolkit label: φυσικό πρόσωπο περιγραφόμενο σε @el
toolkit label: شخص موصوف في @ar
toolkit label: 被……描述的个人 @zh-hans
has subproperty: henkilöä metatiedoilla kuvaileva teos
has subproperty: P50368
lexical alias: personDescribedBy.en
status: Published
type: Property
domain: C10004
label: er person beskrevet i @da
label: est une personne décrite par @fr
label: is person described by @en
label: is persoon beschreven in @nl
label: isiku kirjeldus @et
label: ist Person beschrieben in @de
label: personas apraksts @lv
label: személy leírva a következőben: @hu
label: tarafından tanımlanmış kişidir @tr
label: è persona descritta in @it
label: és persona descrita per @ca
label: είναι φυσικό πρόσωπο περιγραφόμενο σε @el
label: هو شخص موصوف في @ar
label: 是被……描述的个人 @zh-hans
sub property of: henkilö aiheena teoksessa
sub property of: toimijan kuvaus
alternative label: Beschrieben in (Person) @de
alternative label: açıklanan (kişi) @tr
alternative label: beskrevet i (person) @da
alternative label: described in (person) @en
alternative label: descrit en (persona) @ca
alternative label: descrito en (persona) @es
alternative label: descritto in (persona) @it
alternative label: décrit dans (personne) @fr
alternative label: kuvattu teoksessa (henkilö)
alternative label: leírva a következőben (személy): @hu
alternative label: personne décrite dans @fr
alternative label: περιγράφεται σε (φυσικό πρόσωπο) @el
alternative label: موصوف في (شخص) @ar
alternative label: 被描述于（个人） @zh-hans
definition: Bir kişiyi, bir kişiyi anlatan eserle ilişkilendirir. @tr
definition: Correla una persona a un'opera che descrive una persona. @it
definition: Hozzákapcsol egy személyt egy műhöz, amely egy személyt ír le. @hu
definition: Liittää henkilön teokseen, joka on henkilön kuvaus.
definition: Met une personne en relation avec une œuvre qui consiste en une description d’une personne. @fr
definition: Relaciona una persona amb una obra que és una descripció d’una persona. @ca
definition: Relateert een persoon aan een werk dat een persoon beschrijft. @nl
definition: Relaterer en person til et verk som beskriver en person. @no
definition: Relaterer en person til et værk, som beskriver en person. @da
definition: Relates a person to a work that is a description of a person. @en

yhteisöä kuvaava teos
has element type: 2
toolkit definition: A work that is a description of a corporate body. @en
toolkit definition: Bir tüzel kişinin tanımı olan bir eser @tr
toolkit definition: Darbs, kurā aprakstīta konkrētā institūcija. @lv
toolkit definition: Een werk dat een corporatie beschrijft. @nl
toolkit definition: Egy mű, amely egy testületet ír le. @hu
toolkit definition: Ein Werk, das eine Körperschaft beschreibt. @de
toolkit definition: Et verk som beskriver en korporasjon. @no
toolkit definition: Obra que és una descripció d’una entitat corporativa. @ca
toolkit definition: Opera che descrive un ente. @it
toolkit definition: Teos, joka on yhteisön kuvaus.
toolkit definition: Teos, milles asutust kirjeldatakse. @et
toolkit definition: Værk, som beskriver en korporation. @da
toolkit definition: Œuvre qui consiste en une description d’une collectivité. @fr
toolkit definition: Ένα έργο που περιγράφει ένα περιγραφόμενο συλλογικό όργανο. @el
toolkit definition: عمل يصف هيئة. @ar
toolkit definition: 作为一个团体之描述的一种作品 @zh-hans
toolkit label: Körperschaft beschrieben in @de
toolkit label: asutuse kirjeldus @et
toolkit label: collectivité décrite par @fr
toolkit label: corporate body described by @en
toolkit label: corporatie beschreven in @nl
toolkit label: ente descritto in @it
toolkit label: entitat corporativa descrita per @ca
toolkit label: institūcijas apraksts @lv
toolkit label: korporasjon beskrevet i @no
toolkit label: korporation beskrevet i @da
toolkit label: tarafından tanımlanan tüzel kişi @tr
toolkit label: testület leírva a következőben: @hu
toolkit label: yhteisöä kuvaava teos
toolkit label: συλλογικό όργανο περιγραφόμενο σε @el
toolkit label: هيئة موصوفة في @ar
toolkit label: 被……描述的团体 @zh-hans
has subproperty: yhteisöä metatiedoilla kuvaileva teos
has subproperty: P50369
lexical alias: corporateBodyDescribedBy.en
status: Published
type: Property
domain: C10005
label: asutuse kirjeldus @et
label: er korporasjon beskrevet i @no
label: er korporation beskrevet i @da
label: est une collectivité décrite par @fr
label: institūcijas apraksts @lv
label: is corporate body described by @en
label: is corporatie beschreven in @nl
label: ist Körperschaft beschrieben in @de
label: tarafından tanımlanmış tüzel kişidir @tr
label: testület leírva a következőben: @hu
label: è ente descritto in @it
label: és entitat corporativa descrita per @ca
label: είναι συλλογικό όργανο περιγραφόμενο σε @el
label: هي هيئة موصوفة في @ar
label: 是被……描述的团体 @zh-hans
sub property of: yhteisö aiheena teoksessa
sub property of: yhteistoimijan kuvaus
alternative label: Beschrieben in (Körperschaft) @de
alternative label: açıklanan (tüzel kişi) @tr
alternative label: beskrevet i (korporasjon) @no
alternative label: beskrevet i (korporation) @da
alternative label: collectivité décrite dans @fr
alternative label: described in (corporate body) @en
alternative label: descrit en (entitat corporativa) @ca
alternative label: descrito en (cuerpo corporativo) @es
alternative label: descritto in (ente) @it
alternative label: décrit dans (collectivité) @fr
alternative label: kuvattu teoksessa (yhteisö)
alternative label: leírva a következőben (testület): @hu
alternative label: περιγράφεται σε (συλλογικό όργανο) @el
alternative label: موصوف في (هيئة) @ar
alternative label: 被描述于（团体） @zh-hans
definition: Bir tüzek kişiyi, bir tüzel kişiyi anlatan eserle ilişkilendirir. @tr
definition: Correla un ente a un'opera che descrive un ente. @it
definition: Hozzákapcsol egy testületet egy műhöz, amely egy testületet ír le. @hu
definition: Liittää yhteisön teokseen, joka on yhteisön kuvaus.
definition: Met une collectivité en relation avec une œuvre qui consiste en une description d’une collectivité. @fr
definition: Relaciona una entitat corporativa amb una obra que és una descripció d’una entitat corporativa. @ca
definition: Relateert een corporatie aan een werk dat een corporatie beschrijft. @nl
definition: Relaterer en korporasjon til et verk som beskriver en korporasjon. @no

sukua kuvaava teos
has element type: 2
toolkit definition: A work that is a description of a family. @en
toolkit definition: Bir ailenin tanımı olan bir eser @tr
toolkit definition: Darbs, kurā aprakstīta konkrētā dzimta/ģimene. @lv
toolkit definition: Een werk dat een familie beschrijft. @nl
toolkit definition: Egy, amely egy családot ír le. @hu
toolkit definition: Ein Werk, das eine Familie beschreibt. @de
toolkit definition: Et verk som beskriver en familie. @no
toolkit definition: Obra que és una descripció d’una família. @ca
toolkit definition: Opera che descrive una famiglia. @it
toolkit definition: Teos, joka on suvun kuvaus.
toolkit definition: Teos, milles perekonda kirjeldatakse. @et
toolkit definition: Værk, som beskriver en familie. @da
toolkit definition: Œuvre qui consiste en une description d’une famille. @fr
toolkit definition: Ένα έργο που περιγράφει μια περιγραφόμενη οικογένεια. @el
toolkit definition: عمل يصف عائلة. @ar
toolkit definition: 作为一个家族之描述的一种作品 @zh-hans
toolkit label: Familie beschrieben in @de
toolkit label: család leírva a következőben: @hu
toolkit label: dzimtas/ģimenes apraksts @lv
toolkit label: famiglia descritta in @it
toolkit label: familie beschreven in @nl
toolkit label: familie beskrevet i @da
toolkit label: famille décrite par @fr
toolkit label: family described by @en
toolkit label: família descrita per @ca
toolkit label: perekonna kirjeldus @et
toolkit label: sukua kuvaava teos
toolkit label: tarafından açıklanan aile @tr
toolkit label: οικογένεια περιγραφόμενη σε @el
toolkit label: عائلة موصوفة في @ar
toolkit label: 被……描述的家族 @zh-hans
has subproperty: sukua metatiedoilla kuvaileva teos
has subproperty: P50370
lexical alias: familyDescribedBy.en
status: Published
type: Property
domain: C10008
label: család leírva a következőben: @hu
label: dzimtas/ģimenes apraksts @lv
label: er familie beskrevet i @da
label: est une famille décrite par @fr
label: is familie beschreven in @nl
label: is family described by @en
label: ist Familie beschrieben in @de
label: perekonna kirjeldus @et
label: tarafından tanımlanan ailedir @tr
label: è famiglia descritta in @it
label: és família descrita per @ca
label: είναι οικογένεια περιγραφόμενη σε @el
label: هي عائلة موصوفة في @ar
label: 是被……描述的家族 @zh-hans
sub property of: suku aiheena teoksessa
sub property of: yhteistoimijan kuvaus
alternative label: Beschrieben in (Familie) @de
alternative label: açıklanan (aile) @tr
alternative label: beskrevet i (familie) @da
alternative label: described in (family) @en
alternative label: descrit en (família) @ca
alternative label: descrito en (familia) @es
alternative label: descritto in (famiglia) @it
alternative label: décrit dans (famille) @fr
alternative label: famille décrite dans @fr
alternative label: kuvattu teoksessa (suku)
alternative label: leírva a következőben (család): @hu
alternative label: περιγράφεται σε (οικογένεια) @el
alternative label: موصوف في (عائلة) @ar
alternative label: 被描述于（家族） @zh-hans
definition: Bir aileyi, bir aleyi anlatan eserle ilişkilendirir. @tr
definition: Correla una famiglia a un'opera che descrive una famiglia. @it
definition: Hozzákapcsol egy családot egy műhöz, amely egy családot ír le. @hu
definition: Liittää suvun teokseen, joka on suvun kuvaus.
definition: Met une famille en relation avec une œuvre qui consiste en une description d’une famille. @fr
definition: Relaciona una família amb una obra que és una descripció d’una família. @ca
definition: Relateert een familie aan een werk dat een familie beschrijft. @nl
definition: Relaterer en familie til et verk som beskriver en familie. @no
definition: Relaterer en familie til et værk, som beskriver en familie. @da
definition: Relates a family to a work that is a description of a family. @en
definition: Sasaista dzimtu/ģimeni ar darbu, kurā aprakstīta konkrētā dzimta/ģimene. @lv

henkilön sponsoroima yhteisö
has element type: 2
instruction number: 29.5
toolkit definition: A corporate body who is sponsored by a person. @en
toolkit definition: Asutus, keda isik majanduslikult toetab. @et
toolkit definition: Bir kişi tarafından desteklenen tüzel kişi. @tr
toolkit definition: Collectivité qui est parrainée par une personne. @fr
toolkit definition: Een corporatie die is gesponsord door een persoon. @nl
toolkit definition: Egy testület, amelyet egy személy szponzorál. @hu
toolkit definition: Eine Körperschaft, die von einer Person gefördert wird. @de
toolkit definition: En korporasjon som er sponset av en person. @no
toolkit definition: Ente sponsorizzato da una persona. @it
toolkit definition: Entitat corporativa que és patrocinada per una persona. @ca
toolkit definition: Henkilön sponsoroima yhteisö.
toolkit definition: Institūcija, ko sponsorē persona. @lv
toolkit definition: Korporation, som er sponsoreret af en person. @da
toolkit definition: Ένα συλλογικό όργανο το οποίο υποστηρίζεται μέσω χορηγίας, χρηματοδότησης κ.λπ. από ένα φυσικό πρόσωπο. @el
toolkit definition: هيئة ترعى شخصا. @ar
toolkit definition: 被一个个人赞助的一个团体 @zh-hans
toolkit label: Person als Sponsorin/Sponsor einer Körperschaft von @de
toolkit label: collectivité parrainée d’une personne @fr
toolkit label: ente sostenitore di persona @it
toolkit label: entitat corporativa patrocinada per una persona @ca
toolkit label: gesponsorde corporatie van persoon @nl
toolkit label: henkilön sponsoroima yhteisö
toolkit label: isiku toetatud asutus @et
toolkit label: kişinin sponsor olduğu tüzel kişi @tr
toolkit label: korporasjon sponset av person @no
toolkit label: korporation sponsoreret af person @da
toolkit label: personas sponsorētā institūcija @lv
toolkit label: sponsored corporate body of person @en
toolkit label: személy által szponzorált testület: @hu
toolkit label: χορηγούμενο συλλογικό όργανο του φυσικού προσώπου @el
toolkit label: هيئة راعية لشخص @ar
toolkit label: 个人的被赞助团体 @zh-hans
has subproperty: P50371
lexical alias: sponsoredCorporateBodyOfPerson.en
status: Published
type: Property
domain: C10004
label: a pour collectivité parrainée d’une personne @fr
label: ha come ente sponsorizzato di persona @it
label: har korporasjon sponset av person @no
label: har korporation sponsoreret af person @da
label: has sponsored corporate body of person @en
label: hat Person als Sponsorin/Sponsor einer Körperschaft von @de
label: heeft gesponsorde corporatie van persoon @nl
label: isiku toetatud asutus @et
label: kişinin sponsor olduğu tüzel kişi ile ilişkilidir @tr
label: personas sponsorētā institūcija @lv
label: személy szponzorált testülete a következő: @hu
label: té com a entitat corporativa patrocinada per una persona @ca
label: έχει χορηγήσει συλλογικό όργανο του φυσικού προσώπου @el
label: له هيئة ترعى شخصا @ar
label: 有个人的被赞助团体 @zh-hans
sub property of: henkilöön liittyvä yhteisö
sub property of: toimijan sponsoroima yhteisö
alternative label: Person als Sponsor von @de
alternative label: collectivité commanditée d’une personne @fr
alternative label: patrocinador de @ca
alternative label: sostenitore di @it
alternative label: sponsor @tr
alternative label: sponsor af @da
alternative label: sponsor av @no
alternative label: sponsor of @en
alternative label: sponsorina yhteisölle
alternative label: szponzora: @hu
alternative label: χορηγός του @el
alternative label: راعٍ لـ @ar
alternative label: ……的赞助者 @zh-hans
definition: Bir kişiyi, bir kişi tarafından desteklenen tüzel kişilikle ilişkilendirir. @tr
definition: Correla una persona a un ente sponsorizzato da una persona. @it
definition: Hozzákapcsol egy személyt egy testülethez, amelyet egy személy szponzorál. @hu
definition: Liittää henkilön yhteisöön, jota henkilö sponsoroi.
definition: Met une personne en relation avec une collectivité qui est parrainée par une personne. @fr
definition: Relaciona una persona amb una entitat corporativa que és patrocinada per una persona. @ca
definition: Relateert een persoon aan een corporatie die is gesponsord door een persoon. @nl
definition: Relaterer en person til en korporasjon som er sponset av en person. @no
definition: Relaterer en person til en korporation, som er sponsoreret af en person. @da
definition: Relates a person to a corporate body who is sponsored by a person. @en

suvun kantasuku
has element type: 2
instruction number: 29.5
toolkit definition: A family from whom another family descends. @en
toolkit definition: Aynı aile soyundan gelen bir başka aile @tr
toolkit definition: Dzimta/ģimene, no kuras cēlusies cita dzimta/ģimene. @lv
toolkit definition: Een familie waar een andere familie van afstamt. @nl
toolkit definition: Egy család, amelytől egy másik család származik. @hu
toolkit definition: Eine Familie, von der eine andere Familie abstammt. @de
toolkit definition: En familie som en annen familie nedstammer fra. @no
toolkit definition: Famiglia dalla quale discende un'altra famiglia.. @it
toolkit definition: Familie, som en anden familie nedstammer fra. @da
toolkit definition: Famille de qui une autre famille descend. @fr
toolkit definition: Família de la qual una altra família descendeix. @ca
toolkit definition: Perekond, kellest teine perekond põlvneb. @et
toolkit definition: Suku, josta toinen suku polveutuu.
toolkit definition: Μια οικογένεια από την οποία κατάγεται μια άλλη οικογένεια. @el
toolkit definition: عائلة تنحدر منها عائلة أخرى. @ar
toolkit definition: 另一个家族作为其后裔的一个家族 @zh-hans
toolkit label: Abstammende Familie von @de
toolkit label: afstammeling-familie van familie @nl
toolkit label: alt soy ailesi @tr
toolkit label: descendant family of family of @en
toolkit label: etterkommende familie av familie for @no
toolkit label: famiglia discendente di famiglia di @it
toolkit label: familie nedstammende af familie af @da
toolkit label: famille descendante d’une famille de @fr
toolkit label: família descendent d’una família de @ca
toolkit label: ir dzimtas/ģimenes pirmsācējs (dzimta/ģimene) @lv
toolkit label: leszármazott családja a következő családnak: @hu
toolkit label: perekonna esivanemad (perekond) @et
toolkit label: suvun kantasuku
toolkit label: απόγονος οικογένεια της οικογένειας του @el
toolkit label: عائلة منحدرة من عائلة لـ @ar
toolkit label: ……的家族的后裔家族 @zh-hans
has subproperty: P50372
lexical alias: descendantFamilyOfFamilyOf.en
status: Published
type: Property
domain: C10008
label: ailesinin alt soy ailesidir @tr
label: er etterkommende familie av familie for @no
label: er familie nedstammende af familie af @da
label: est une famille descendante d’une famille de @fr
label: ir dzimtas/ģimenes pirmsācējs (dzimta/ģimene) @lv
label: is afstammeling-familie van familie @nl
label: is descendant family of family of @en
label: ist abstammende Familie von @de
label: leszármazott családja a következő családnak: @hu
label: perekonna esivanemad (perekond) @et
label: è famiglia discendente di famiglia di @it
label: és família descendent d’una família de @ca
label: είναι απόγονος οικογένεια της οικογένειας του @el
label: هي عائلة منحدرة من عائلة لـ @ar
label: 是……的家族的后裔家族 @zh-hans
sub property of: sukuhaara suvussa
alternative label: Nachkommen @de
alternative label: descendant family of @en
alternative label: familia descendiente de la familia de @es
alternative label: famille descendante de @fr
alternative label: família descendent de @ca
alternative label: kantasuku
alternative label: leszármazott családja: @hu
alternative label: soyundan gelen aile @tr
alternative label: عائلة منحدرة من @ar
alternative label: ……的后裔家族 @zh-hans
definition: Bir aileyi, aynı aile soyundan gelen bir başka aile ile ilişkilendirir. @tr
definition: Correla una famiglia a una famiglia dalla quale discende un'altra famiglia.. @it
definition: Hozzákapcsol egy családot egy családhoz, amelyből egy másik család származik. @hu
definition: Liittää suvun sukuun, josta toinen suku polveutuu.
definition: Met une famille en relation avec une famille de qui une autre famille descend. @fr
definition: Relaciona una família amb una família de la qual una altra família descendeix. @ca
definition: Relateert een familie aan een familie waar een andere familie van afstamt. @nl
definition: Relaterer en familie til en familie som en annen familie nedstammer fra. @no
definition: Relaterer en familie til en familie, som en anden familie nedstammer fra. @da
definition: Relates a family to a family from whom another family descends. @en
definition: Sasaista dzimtu/ģimeni ar dzimtu/ģimeni, no kuras cēlusies cita dzimta/ģimene. @lv
definition: Seostab perekonna perekonnaga, kellest teine perekond põlvneb. @et
definition: Setzt eine Familie in Beziehung zu einer Familie, von der eine andere Familie abstammt. @de
definition: Συνδέει μια οικογένεια με μια οικογένεια από την οποία κατάγεται μια άλλη οικογένεια. @el

toimijan hakutieto
has element type: 3
toolkit definition: A nomen that is an appellation of agent in natural language that is taken from a vocabulary encoding scheme or is constructed using a string encoding scheme. @en
toolkit definition: Aģenta vārds/nosaukums dabiskā valodā, kas ņemts no shēmas kontrolētu vārdnīcu kodēšanai vai tiek konstruēts, izmantojot virknes kodēšanas shēmu @lv
toolkit definition: Bir kelime kodlama şemasından alınan veya bir dizi kodlama şeması kullanılarak oluşturulan, doğal dilde bir temsilcinin unvanı olan bir isim. @tr
toolkit definition: Denominazione di un agente in linguaggio naturale che è presa dallo schema di codifica di un vocabolario controllato o è costruita usando uno schema di codifica di una stringa. @it
toolkit definition: Een nomen dat is een benaming van actor in natuurlijke taal die ontleend is aan een vocabulair coderingsschema of gevormd is volgens een string coderingsschema. @nl
toolkit definition: Egy nomen, egy ágens természetes nyelvű megnevezése, amely egy szótárkódolási sémából származik, vagy egy karakterlánc-kódolási séma használatával szerkesztett. @hu
toolkit definition: Eine Bezeichnung für einen Akteur in natürlicher Sprache, die einem Vocabulary Encoding Scheme entnommen oder mit einem String Encoding Scheme konstruiert wird. @de
toolkit definition: En betegnelse for agent på et naturlig språk som er hentet fra et kodeskjema for vokabular eller er laget ved hjelp av et kodeskjema for syntaks. @no
toolkit definition: Nomen que és una apel·lació d’agent en llenguatge natural que s’obté d’un esquema de codificació de vocabulari o s’elabora usant un esquema de codificació de cadenes. @ca
toolkit definition: Nomen qui est une appellation d’agent en langage naturel provenant d’un schéma d’encodage de vocabulaire ou construite à l’aide d’un schéma d’encodage de chaînes. @fr
toolkit definition: Nomen, joka on toimijan luonnollisella kielellä oleva nimitys, joka on otettu sanaston merkintäjärjestelmästä tai muodostettu käyttämällä merkkijonon merkintäjärjestelmää.
toolkit definition: Nomen, som er en benævnelse på agent på normalsprog, som er taget fra et vokabularkodningsskema eller er konstrueret ved hjælp af et strengkodningsskema. @da
toolkit definition: Tegija nimetus loomulikus keeles, mis on võetud leksikaalsest märkimissüsteemist või moodustatud stringilise märkimissüsteemi alusel. @et
toolkit definition: تسمية عبارة عن اسم لوكيل في لغة طبيعية مأخوذ من مخطط ترميز مفردات، أو أنشئ باستخدام خطة ترميز سلسلة تمثيلات. @ar
toolkit definition: 作为一个行为者的称谓、取自一个词表编码体系或者用一个串编码体系构建、用自然语言的一个命名 @zh-hans
toolkit label: Sucheinstieg für einen Akteur @de
toolkit label: Temsilci için erişim noktası @tr
toolkit label: access point for agent @en
toolkit label: aģenta pamatforma @lv
toolkit label: hozzáférési pont ágenshez: @hu
toolkit label: ingang voor actor @nl
toolkit label: point d’accès d’un agent @fr
toolkit label: punt d’accés d’agent @ca
toolkit label: punto d'accesso per agente @it
toolkit label: søgeindgang for agent @da
toolkit label: søkeinngang for agent @no
toolkit label: tegija otsielement @et
toolkit label: toimijan hakutieto
toolkit label: σημείο πρόσβασης για φορέα @el
toolkit label: نقطة وصول لوكيل @ar
toolkit label: 行为者的检索点 @zh-hans
has subproperty: yhteistoimijan hakutieto
has subproperty: henkilön hakutieto
has subproperty: toimijan auktorisoitu hakutieto
has subproperty: toimijan varianttihakutieto
has subproperty: P50373
lexical alias: accessPointForAgent.en
status: Published
type: Property
domain: C10002
label: a pour point d’accès d’un agent @fr
label: aģenta pamatforma @lv
label: ha come punto d'accesso per agente @it
label: har søgeindgang for agent @da
label: har søkeinngang for agent @no
label: has access point for agent @en
label: hat Sucheinstieg für einen Akteur @de
label: heeft ingang voor actor @nl
label: hozzáférési pontja ágenshez a következő: @hu
label: tegija otsielement @et
label: temsilci için erişim noktası ile ilişkilidir @tr
label: té com a punt d’accés d’agent @ca
label: έχει σημείο πρόσβασης για φορέα @el
label: له نقطة وصول لوكيل @ar
label: 有行为者的检索点 @zh-hans
sub property of: toimijan nimitys
sub property of: P00016
definition: Bir temsilciyi, bir kelime kodlama şemasından alınan veya bir dizi kodlama şeması kullanılarak oluşturulan, doğal dilde bir temsilcinin unvanı olan bir isime ilişkilendirir. @tr
definition: Correla un agente con la denominazione di un agente in linguaggio naturale che è presa dallo schema di codifica di un vocabolario controllato o è costruita usando uno schema di codifica di una stringa. @it
definition: Hozzákapcsol egy ágenst egy nomenhez, egy ágens természetes nyelvű megnevezéséhez, amely egy szótárkódolási sémából származik, vagy egy karakterlánc-kódolási séma használatával szerkesztett. @hu
definition: Liittää toimijan nomeniin, joka on luonnollisella kielellä oleva toimijan nimitys, joka on otettu sanaston merkintäjärjestelmästä tai muodostettu käyttämällä merkkijonon merkintäjärjestelmää.
definition: Met un agent en relation avec un nomen qui est une appellation d’agent en langage naturel provenant d’un schéma d’encodage de vocabulaire ou construite à l’aide d’un schéma d’encodage de chaînes. @fr
definition: Relaciona un agent amb un nomen que és una apel·lació d’agent en llenguatge natural que s’obté d’un esquema de codificació de vocabulari o s’elabora usant un esquema de codificació de cadenes. @ca
definition: Relateert een actor aan een nomen dat is een benaming van actor in natuurlijke taal die ontleend is aan een vocabulair coderingsschema of gevormd is volgens een string coderingsschema. @nl
definition: Relaterer en agent til en betegnelse for agent på et naturlig språk som er hentet fra et kodeskjema for vokabular eller er laget ved hjelp av et kodeskjema for syntaks. @no
definition: Relaterer en agent til et nomen, som er en benævnelse på agent på normalsprog, som er taget fra et vokabularkodningsskema eller er konstrueret ved hjælp af et strengkodningsskema. @da
definition: Relates an agent to a nomen that is an appellation of agent in natural language that is taken from a vocabulary encoding scheme or is constructed using a string encoding scheme. @en
definition: Sasaista aģentu ar nomenu, kas ir aģenta vārds/nosaukums dabiskā valodā, kas ņemts no shēmas kontrolētu vārdnīcu kodēšanai vai tiek konstruēts, izmantojot virknes kodēšanas shēmu. @lv
definition: Seostab tegija tegija nimetusega loomulikus keeles, mis on võetud leksikaalsest märkimissüsteemist või moodustatud stringilise märkimissüsteemi alusel. @et
definition: Setzt einen Akteur in Beziehung zu einer Bezeichnung für einen Akteur in natürlicher Sprache, die einem Vocabulary Encoding Scheme entnommen oder mit einem String Encoding Scheme konstruiert wird. @de
definition: يربط وكيلا بتسمية عبارة عن اسم لوكيل بلغة طبيعية مأخوذ من مخطط ترميز مفردات، أو أنشئ باستخدام خطة ترميز سلسلة تمثيلات. @ar
definition: 将一个行为者与作为一个行为者的称谓、取自一个词表编码体系或者用一个串编码体系构建、用自然语言的一个命名关联起来。 @zh-hans

yhteistoimijan hakutieto
has element type: 3
toolkit definition: A nomen that is an appellation of collective agent in natural language that is taken from a vocabulary encoding scheme or is constructed using a string encoding scheme. @en
toolkit definition: Bir kelime kodlama şemasından alınan veya bir dizi kodlama şeması kullanılarak oluşturulan, doğal dilde bir kolektif temsilcinin unvanı olan bir isim. @tr
toolkit definition: Denominazione di un agente collettivo in linguaggio naturale che è presa dallo schema di codifica di un vocabolario controllato o è costruita usando uno schema di codifica di una stringa. @it
toolkit definition: Een nomen dat is een benaming van collectieve actor in natuurlijke taal die ontleend is aan een vocabulair coderingsschema of gevormd is volgens een string coderingsschema. @nl
toolkit definition: Egy nomen, egy kollektív ágens természetes nyelvű megnevezése, amely egy szótárkódolási sémából származik, vagy egy karakterlánc-kódolási séma használatával szerkesztett. @hu
toolkit definition: Eine Bezeichnung für einen gemeinschaftlichen Akteur in natürlicher Sprache, die einem Vocabulary Encoding Scheme entnommen oder mit einem String Encoding Scheme konstruiert wird. @de
toolkit definition: En betegnelse for kollektiv agent på et naturlig språk som er hentet fra et kodeskjema for vokabular eller er laget ved hjelp av et kodeskjema for syntaks. @no
toolkit definition: Grupas vārds/nosaukums dabiskā valodā, kas ņemts no shēmas kontrolētu vārdnīcu kodēšanai vai tiek konstruēts, izmantojot virknes kodēšanas shēmu. @lv
toolkit definition: Kollektiivi nimetus loomulikus keeles, mis on võetud leksikaalsest märkimissüsteemist või moodustatud stringilise märkimissüsteemi alusel. @et
toolkit definition: Nomen que és una apel·lació d’agent col·lectiu en llenguatge natural que s’obté d’un esquema de codificació de vocabulari o s’elabora usant un esquema de codificació de cadenes. @ca
toolkit definition: Nomen qui est une appellation d’agent collectif en langage naturel provenant d’un schéma d’encodage de vocabulaire ou construite à l’aide d’un schéma d’encodage de chaînes. @fr
toolkit definition: Nomen, joka on yhteistoimijan luonnollisella kielellä oleva nimitys, joka on otettu sanaston merkintäjärjestelmästä tai muodostettu käyttämällä merkkijonon merkintäjärjestelmää.
toolkit definition: Nomen, som er en benævnelse på kollektiv agent på normalsprog, som er taget fra et vokabularkodningsskema eller er konstrueret ved hjælp af et strengkodningsskema. @da
toolkit definition: تسمية عبارة عن اسم لوكيل جماعي بلغة طبيعية مأخوذ من مخطط ترميز مفردات، أو أنشئ باستخدام خطة ترميز سلسلة تمثيلات. @ar
toolkit definition: 作为一个集体行为者的称谓、取自一个词表编码体系或者用一个串编码体系构建、用自然语言的一个命名 @zh-hans
toolkit label: Kolektif temsilci için erişim noktası @tr
toolkit label: Sucheinstieg für einen gemeinschaftlichen Akteur @de
toolkit label: access point for collective agent @en
toolkit label: grupas pamatforma @lv
toolkit label: hozzáférési pont kollektív ágenshez: @hu
toolkit label: ingang voor collectieve actor @nl
toolkit label: kollektiivi otsielement @et
toolkit label: point d’accès d’un agent collectif @fr
toolkit label: punt d’accés d’agent col·lectiu @ca
toolkit label: punto d'accesso per agente collettivo @it
toolkit label: søgeindgang for kollektiv agent @da
toolkit label: søkeinngang for kollektiv agent @no
toolkit label: yhteistoimijan hakutieto
toolkit label: σημείο πρόσβασης για συλλογικό φορέα @el
toolkit label: نقطة وصول لوكيل جماعي @ar
toolkit label: 集体行为者的检索点 @zh-hans
has subproperty: yhteisön hakutieto
has subproperty: suvun hakutieto
has subproperty: yhteistoimijan auktorisoitu hakutieto
has subproperty: yhteistoimijan varianttihakutieto
has subproperty: P50374
lexical alias: accessPointForCollectiveAgent.en
status: Published
type: Property
domain: C10011
label: a pour point d’accès d’un agent collectif @fr
label: grupas pamatforma @lv
label: ha come punto d'accesso per agente collettivo @it
label: har søgeindgang for kollektiv agent @da
label: har søkeinngang for kollektiv agent @no
label: has access point for collective agent @en
label: hat Sucheinstieg für einen gemeinschaftlichen Akteur @de
label: heeft ingang voor collectieve actor @nl
label: hozzáférési pontja kollektív ágenshez a következő: @hu
label: kolektif temsilci için erişim noktası ile ilişkilidir @tr
label: kollektiivi otsielement @et
label: té com a punt d’accés d’agent col·lectiu @ca
label: έχει σημείο πρόσβασης για συλλογικό φορέα @el
label: له نقطة وصول لوكيل جماعي @ar
label: 有集体行为者的检索点 @zh-hans
sub property of: toimijan hakutieto
sub property of: yhteistoimijan nimitys
definition: Correla un agente collettivo alla denominazione di un agente collettivo in linguaggio naturale che è presa dallo schema di codifica di un vocabolario controllato o è costruita usando uno schema di codifica di una stringa. @it
definition: Hozzákapcsol egy kollektív ágenst egy nomenhez, egy kollektív ágens természetes nyelvű megnevezéséhez, amely egy szótárkódolási sémából származik, vagy egy karakterlánc-kódolási séma használatával szerkesztett. @hu
definition: Kolektif bir temsilciyi, bir kelime dağarcığı kodlama şemasından alınan veya bir dize kodlama şeması kullanılarak oluşturulan doğal dilde kolektif temsilcinin adı olan bir isimlendirmeyle ilişkilendirirlir. @tr
definition: Liittää yhteistoimijan nomeniin, joka on luonnollisella kielellä oleva yhteistoimijan nimitys, joka on otettu sanaston merkintäjärjestelmästä tai muodostettu käyttämällä merkkijonon merkintäjärjestelmää.
definition: Met un agent collectif en relation avec un nomen qui est une appellation d’agent collectif en langage naturel provenant d’un schéma d’encodage de vocabulaire ou construite à l’aide d’un schéma d’encodage de chaînes. @fr
definition: Relaciona un agent col·lectiu amb un nomen que és una apel·lació d’agent col·lectiu en llenguatge natural que s’obté d’un esquema de codificació de vocabulari o s’elabora usant un esquema de codificació de cadenes. @ca
definition: Relateert een collectieve actor aan een nomen dat is een benaming van collectieve actor in natuurlijke taal die ontleend is aan een vocabulair coderingsschema of gevormd is volgens een string coderingsschema. @nl
definition: Relaterer en kollektiv agent til en betegnelse for kollektiv agent på et naturlig språk som er hentet fra et kodeskjema for vokabular eller er laget ved hjelp av et kodeskjema for syntaks. @no
definition: Relaterer en kollektiv agent til et nomen, som er en benævnelse på kollektiv agent på normalsprog, som er taget fra et vokabularkodningsskema eller er konstrueret ved hjælp af et strengkodningsskema. @da
definition: Relates a collective agent to a nomen that is an appellation of collective agent in natural language that is taken from a vocabulary encoding scheme or is constructed using a string encoding scheme. @en
definition: Sasaista grupu ar nomenu, kas ir grupas vārds/nosaukums dabiskā valodā, kas ņemts no shēmas kontrolētu vārdnīcu kodēšanai vai tiek konstruēts, izmantojot virknes kodēšanas shēmu. @lv
definition: Seostab kollektiivi kollektiivi nimetusega loomulikus keeles, mis on võetud leksikaalsest märkimissüsteemist või moodustatud stringilise märkimissüsteemi alusel. @et
definition: Setzt einen gemeinschaftlichen Akteur in Beziehung zu einer Bezeichnung für einen gemeinschaftlichen Akteur in natürlicher Sprache, die einem Vocabulary Encoding Scheme entnommen oder mit einem String Encoding Scheme konstruiert wird. @de
definition: يربط وكيلا جماعيا بتسمية عبارة عن اسم لوكيل جماعي في اللغة الطبيعية مأخوذ من خطة ترميز مفردات، أو أنشئ باستخدام خطة ترميز سلسلة تمثيلات. @ar
definition: 将一个集体行为者与作为一个集体行为者的称谓、取自一个词表编码体系或者用一个串编码体系构建、用自然语言的一个命名关联起来。 @zh-hans

yhteisön hakutieto
has element type: 3
toolkit definition: A nomen that is an appellation of corporate body in natural language that is taken from a vocabulary encoding scheme or is constructed using a string encoding scheme. @en
toolkit definition: Asutuse nimetus loomulikus keeles, mis on võetud leksikaalsest märkimissüsteemist või moodustatud stringilise märkimissüsteemi alusel. @et
toolkit definition: Bir kelime kodlama şemasından alınan veya bir dizi kodlama şeması kullanılarak oluşturulan, doğal dilde bir tüzel kişinin unvanı olan bir isim. @tr
toolkit definition: Denominazione di un ente collettivo in linguaggio naturale che è presa dallo schema di codifica di un vocabolario controllato o è costruita usando uno schema di codifica di una stringa. @it
toolkit definition: Een nomen dat is een benaming van corporatie in natuurlijke taal die ontleend is aan een vocabulair coderingsschema of gevormd is volgens een string coderingsschema. @nl
toolkit definition: Egy nomen, egy testület természetes nyelvű megnevezése, amely egy szótárkódolási sémából származik, vagy egy karakterlánc-kódolási séma használatával szerkesztett. @hu
toolkit definition: Eine Bezeichnung für eine Körperschaft in natürlicher Sprache, die einem Vocabulary Encoding Scheme entnommen oder mit einem String Encoding Scheme konstruiert wird. @de
toolkit definition: En betegnelse for korporasjon på et naturlig språk som er hentet fra et kodeskjema for vokabular eller er laget ved hjelp av et kodeskjema for syntaks. @no
toolkit definition: Institūcijas vārds/nosaukums dabiskā valodā, kas ņemts no shēmas kontrolētu vārdnīcu kodēšanai vai tiek konstruēts, izmantojot virknes kodēšanas shēmu. @lv
toolkit definition: Nomen que és una apel·lació d’entitat corporativa en llenguatge natural que s’obté d’un esquema de codificació de vocabulari o s’elabora usant un esquema de codificació de cadenes. @ca
toolkit definition: Nomen qui est une appellation de collectivité en langage naturel provenant d’un schéma d’encodage de vocabulaire ou construite à l’aide d’un schéma d’encodage de chaînes. @fr
toolkit definition: Nomen, joka on yhteisön luonnollisella kielellä oleva nimitys, joka on otettu sanaston merkintäjärjestelmästä tai muodostettu käyttämällä merkkijonon merkintäjärjestelmää.
toolkit definition: Nomen, som er en benævnelse på korporation på normalsprog, som er taget fra et vokabularkodningsskema eller er konstrueret ved hjælp af et strengkodningsskema. @da
toolkit definition: تسمية لهيئة عبارة عن اسم بلغة طبيعية مأخوذ من مخطط ترميز مفردات، أو أنشئ باستخدام خطة ترميز سلسلة تمثيلات. @ar
toolkit definition: 作为一个团体的称谓、取自一个词表编码体系或者用一个串编码体系构建、用自然语言的一个命名 @zh-hans
toolkit label: Sucheinstieg für eine Körperschaft @de
toolkit label: Tüzel kişi için erişim noktası @tr
toolkit label: access point for corporate body @en
toolkit label: asutuse otsielement @et
toolkit label: hozzáférési pont testülethez: @hu
toolkit label: ingang voor corporatie @nl
toolkit label: institūcijas pamatforma @lv
toolkit label: point d’accès d’une collectivité @fr
toolkit label: punt d’accés d’entitat corporativa @ca
toolkit label: punto d'accesso per ente @it
toolkit label: søgeindgang for korporation @da
toolkit label: søkeinngang for korporasjon @no
toolkit label: yhteisön hakutieto
toolkit label: σημείο πρόσβασης για συλλογικό όργανο @el
toolkit label: نقطة وصول لهيئة @ar
toolkit label: 团体的检索点 @zh-hans
has subproperty: yhteisön auktorisoitu hakutieto
has subproperty: yhteisön varianttihakutieto
has subproperty: P50375
lexical alias: accessPointForCorporateBody.en
status: Published
type: Property
domain: C10005
label: a pour point d’accès d’une collectivité @fr
label: asutuse otsielement @et
label: ha come punto d'accesso per ente @it
label: har søgeindgang for korporation @da
label: har søkeinngang for korporasjon @no
label: has access point for corporate body @en
label: hat Sucheinstieg für eine Körperschaft @de
label: heeft ingang voor corporatie @nl
label: hozzáférési pontja testülethez a következő: @hu
label: institūcijas pamatforma @lv
label: té com a punt d’accés d’entitat corporativa @ca
label: tüzel kişi için erişim noktası ile ilişkilidir @tr
label: έχει σημείο πρόσβασης για συλλογικό όργανο @el
label: له نقطة وصول لهيئة @ar
label: 有团体的检索点 @zh-hans
sub property of: yhteistoimijan hakutieto
sub property of: yhteisön nimitys
definition: Bir tüzel kişiyi, bir kelime kodlama şemasından alınan veya bir dizi kodlama şeması kullanılarak oluşturulan, doğal dilde bir tüzel kişinin tanımlayıcı adı olan bir isim ile ilişkilendirir. @tr
definition: Correla un ente alla denominazione di un ente collettivo in linguaggio naturale che è presa dallo schema di codifica di un vocabolario (vocabolario controllato) o è costruita usando uno schema di codifica di una stringa. @it
definition: Hozzákapcsol egy testületet egy nomenhez, egy testület természetes nyelvű megnevezéséhez, amely egy szótárkódolási sémából származik, vagy egy karakterlánc-kódolási séma használatával szerkesztett. @hu
definition: Liittää yhteisön nomeniin, joka on luonnollisella kielellä oleva yhteisön nimitys, joka on otettu sanaston merkintäjärjestelmästä tai muodostettu käyttämällä merkkijonon merkintäjärjestelmää.
definition: Met une collectivité en relation avec un nomen qui est une appellation de collectivité en langage naturel provenant d’un schéma d’encodage de vocabulaire ou construite à l’aide d’un schéma d’encodage de chaînes. @fr
definition: Relaciona una entitat corporativa amb un nomen que és una apel·lació d’entitat corporativa en llenguatge natural que s’obté d’un esquema de codificació de vocabulari o s’elabora usant un esquema de codificació de cadenes. @ca
definition: Relateert een corporatie aan een nomen dat is een benaming van corporatie in natuurlijke taal die ontleend is aan een vocabulair coderingsschema of gevormd is volgens een string coderingsschema. @nl
definition: Relaterer en korporasjon til en betegnelse for korporasjon på et naturlig språk som er hentet fra et kodeskjema for vokabular eller er laget ved hjelp av et kodeskjema for syntaks. @no
definition: Relaterer en korporation til et nomen, som er en benævnelse på korporation på normalsprog, som er taget fra et vokabularkodningsskema eller er konstrueret ved hjælp af et strengkodningsskema. @da
definition: Relates a corporate body to a nomen that is an appellation of corporate body in natural language that is taken from a vocabulary encoding scheme or is constructed using a string encoding scheme. @en
definition: Sasaista institūciju ar nomenu, kas ir institūcijas vārds/nosaukums dabiskā valodā, kas ņemts no shēmas kontrolētu vārdnīcu kodēšanai vai tiek konstruēts, izmantojot virknes kodēšanas shēmu. @lv
definition: Seostab asutuse asutuse nimetusega loomulikus keeles, mis on võetud leksikaalsest märkimissüsteemist või moodustatud stringilise märkimissüsteemi alusel. @et
definition: Setzt eine Körperschaft in Beziehung zu einer Bezeichnung für eine Körperschaft in natürlicher Sprache, die einem Vocabulary Encoding Scheme entnommen oder mit einem String Encoding Scheme konstruiert wird. @de
definition: يربط هيئة بتسمية عبارة عن اسم هيئة بلغة طبيعية مأخوذ من مخطط ترميز مفردات، أو أنشئ باستخدام خطة ترميز سلسلة تمثيلات. @ar
definition: 将一个团体与作为一个团体的称谓、取自一个词表编码体系或者用一个串编码体系构建、用自然语言的一个命名关联起来。 @zh-hans

suvun hakutieto
has element type: 3
toolkit definition: A nomen that is an appellation of family in natural language that is taken from a vocabulary encoding scheme or is constructed using a string encoding scheme. @en
toolkit definition: Bir kelime kodlama şemasından alınan veya bir dizi kodlama şeması kullanılarak oluşturulan, doğal dilde bir ailenin unvanı olan bir isim. @tr
toolkit definition: Denominazione di una famiglia in linguaggio naturale che è presa dallo schema di codifica di un vocabolario controllato o è costruita usando uno schema di codifica di una stringa. @it
toolkit definition: Dzimtas/ģimenes vārds/nosaukums dabiskā valodā, kas ņemts no shēmas kontrolētu vārdnīcu kodēšanai vai tiek konstruēts, izmantojot virknes kodēšanas shēmu. @lv
toolkit definition: Een nomen dat is een benaming van familie in natuurlijke taal die ontleend is aan een vocabulair coderingsschema of gevormd is volgens een string coderingsschema. @nl
toolkit definition: Egy nomen, egy család természetes nyelvű megnevezése, amely egy szótárkódolási sémából származik, vagy egy karakterlánc-kódolási séma használatával szerkesztett. @hu
toolkit definition: Eine Bezeichnung für eine Familie in natürlicher Sprache, die einem Vocabulary Encoding Scheme entnommen oder mit einem String Encoding Scheme konstruiert wird. @de
toolkit definition: En betegnelse for familie på et naturlig språk som er hentet fra et kodeskjema for vokabular eller er laget ved hjelp av et kodeskjema for syntaks. @no
toolkit definition: Nomen que és una apel·lació de família en llenguatge natural que s’obté d’un esquema de codificació de vocabulari o s’elabora usant un esquema de codificació de cadenes. @ca
toolkit definition: Nomen qui est une appellation de famille en langage naturel provenant d’un schéma d’encodage de vocabulaire ou construite à l’aide d’un schéma d’encodage de chaînes. @fr
toolkit definition: Nomen, joka on suvun luonnollisella kielellä oleva nimitys, joka on otettu sanaston merkintäjärjestelmästä tai muodostettu käyttämällä merkkijonon merkintäjärjestelmää.
toolkit definition: Nomen, som er en benævnelse på familie på normalsprog, som er taget fra et vokabularkodningsskema eller er konstrueret ved hjælp af et strengkodningsskema. @da
toolkit definition: Perekonna nimetus loomulikus keeles, mis on võetud leksikaalsest märkimissüsteemist või moodustatud stringilise märkimissüsteemi alusel. @et
toolkit definition: تسمية عبارة عن اسم عائلة بلغة طبيعية مأخوذ من مخطط ترميز مفردات، أو أنشئ باستخدام خطة ترميز سلسلة تمثيلات. @ar
toolkit definition: 作为一个家族的称谓、取自一个词表编码体系或者用一个串编码体系构建、用自然语言的一个命名 @zh-hans
toolkit label: Aile için erişim noktası @tr
toolkit label: Sucheinstieg für eine Familie @de
toolkit label: access point for family @en
toolkit label: dzimtas/ģimenes pamatforma @lv
toolkit label: hozzáférési pont családhoz: @hu
toolkit label: ingang voor familie @nl
toolkit label: perekonna otsielement @et
toolkit label: point d’accès d’une famille @fr
toolkit label: punt d’accés de família @ca
toolkit label: punto d'accesso per famiglia @it
toolkit label: suvun hakutieto
toolkit label: søgeindgang for familie @da
toolkit label: søkeinngang for familie @no
toolkit label: σημείο πρόσβασης για οικογένεια @el
toolkit label: نقطة وصول لعائلة @ar
toolkit label: 家族的检索点 @zh-hans
has subproperty: suvun auktorisoitu hakutieto
has subproperty: suvun varianttihakutieto
has subproperty: P50376
lexical alias: accessPointForFamily.en
status: Published
type: Property
domain: C10008
label: a pour point d’accès d’une famille @fr
label: aile için erişim noktası ile ilişkilidir @tr
label: dzimtas/ģimenes pamatforma @lv
label: ha come punto d'accesso per famiglia @it
label: har søgeindgang for familie @da
label: har søkeinngang for familie @no
label: has access point for family @en
label: hat Sucheinstieg für eine Familie @de
label: heeft ingang voor familie @nl
label: hozzáférési pontja családhoz a következő: @hu
label: perekonna otsielement @et
label: té com a punt d’accés de família @ca
label: έχει σημείο πρόσβασης για οικογένεια @el
label: له نقطة وصول لعائلة @ar
label: 有家族的检索点 @zh-hans
sub property of: yhteistoimijan hakutieto
sub property of: suvun nimitys
definition: Bir aileyi, bir kelime kodlama şemasından alınan veya bir dizi kodlama şeması kullanılarak oluşturulan, doğal dilde bir ailenin tanımlayıcı adı olan bir isimle ilişkilendirir. @tr
definition: Hozzákapcsol egy családot egy nomenhez, egy család természetes nyelvű megnevezéséhez, amely egy szótárkódolási sémából származik, vagy egy karakterlánc-kódolási séma használatával szerkesztett. @hu
definition: Liittää suvun nomeniin, joka on luonnollisella kielellä oleva suvun nimitys, joka on otettu sanaston merkintäjärjestelmästä tai muodostettu käyttämällä merkkijonon merkintäjärjestelmää.
definition: Met une famille en relation avec un nomen qui est une appellation de famille en langage naturel provenant d’un schéma d’encodage de vocabulaire ou construite à l’aide d’un schéma d’encodage de chaînes. @fr
definition: Relaciona una família amb un nomen que és una apel·lació de família en llenguatge natural que s’obté d’un esquema de codificació de vocabulari o s’elabora usant un esquema de codificació de cadenes. @ca
definition: Relateert een familie aan een nomen dat is een benaming van familie in natuurlijke taal die ontleend is aan een vocabulair coderingsschema of gevormd is volgens een string coderingsschema. @nl
definition: Relaterer en familie til en betegnelse for familie på et naturlig språk som er hentet fra et kodeskjema for vokabular eller er laget ved hjelp av et kodeskjema for syntaks. @no
definition: Relaterer en familie til et nomen, som er en benævnelse på familie på normalsprog, som er taget fra et vokabularkodningsskema eller er konstrueret ved hjælp af et strengkodningsskema. @da
definition: Relates a family to a nomen that is an appellation of family in natural language that is taken from a vocabulary encoding scheme or is constructed using a string encoding scheme. @en
definition: Sasaista dzimtu/ģimeni ar nomenu, kas ir dzimtas/ģimenes vārds/nosaukums dabiskā valodā, kas ņemts no shēmas kontrolētu vārdnīcu kodēšanai vai tiek konstruēts, izmantojot virknes kodēšanas shēmu. @lv
definition: Seostab perekonna perekonna nimetusega loomulikus keeles, mis on võetud leksikaalsest märkimissüsteemist või moodustatud stringilise märkimissüsteemi alusel. @et
definition: Setzt eine Familie in Beziehung zu einer Bezeichnung für eine Familie in natürlicher Sprache, die einem Vocabulary Encoding Scheme entnommen oder mit einem String Encoding Scheme konstruiert wird. @de
definition: correla una famiglia alla denominazione di una famiglia in linguaggio naturale che è presa dallo schema di codifica di un vocabolario (vocabolario controllato) o è costruita usando uno schema di codifica di una stringa. @it
definition: يربط عائلة بتسمية عبارة عن اسم عائلة بلغة طبيعية مأخوذ من مخطط ترميز مفردات، أو أنشئ باستخدام خطة ترميز سلسلة تمثيلات. @ar
definition: 将一个家族与作为一个家族的称谓、取自一个词表编码体系或者用一个串编码体系构建、用自然语言的一个命名关联起来。 @zh-hans

henkilön hakutieto
has element type: 3
toolkit definition: A nomen that is an appellation of person in natural language that is taken from a vocabulary encoding scheme or is constructed using a string encoding scheme. @en
toolkit definition: Bir kelime kodlama şemasından alınan veya bir dizi kodlama şeması kullanılarak oluşturulan, doğal dilde bir kişinin unvanı olan bir isim. @tr
toolkit definition: Denominazione di una persona in linguaggio naturale che è presa dallo schema di codifica di un vocabolario controllato o è costruita usando uno schema di codifica di una stringa. @it
toolkit definition: Een nomen dat is een benaming van persoon in natuurlijke taal die ontleend is aan een vocabulair coderingsschema of gevormd is volgens een string coderingsschema. @nl
toolkit definition: Egy nomen, egy személy természetes nyelvű megnevezése, amely egy szótárkódolási sémából származik, vagy egy karakterlánc-kódolási séma használatával szerkesztett. @hu
toolkit definition: Eine Bezeichnung für eine Person in natürlicher Sprache, die einem Vocabulary Encoding Scheme entnommen oder mit einem String Encoding Scheme konstruiert wird. @de
toolkit definition: En betegnelse for person på et naturlig språk som er hentet fra et kodeskjema for vokabular eller er laget ved hjelp av et kodeskjema for syntaks. @no
toolkit definition: Isiku nimetus loomulikus keeles, mis on võetud leksikaalsest märkimissüsteemist või moodustatud stringilise märkimissüsteemi alusel. @et
toolkit definition: Nomen que és una apel·lació de persona en llenguatge natural que s’obté d’un esquema de codificació de vocabulari o s’elabora usant un esquema de codificació de cadenes. @ca
toolkit definition: Nomen qui est une appellation de personne en langage naturel provenant d’un schéma d’encodage de vocabulaire ou construite à l’aide d’un schéma d’encodage de chaînes. @fr
toolkit definition: Nomen, joka on henkilön luonnollisella kielellä oleva nimitys, joka on otettu sanaston merkintäjärjestelmästä tai muodostettu käyttämällä merkkijonon merkintäjärjestelmää.
toolkit definition: Nomen, som er en benævnelse på person på normalsprog, som er taget fra et vokabularkodningsskema eller er konstrueret ved hjælp af et strengkodningsskema. @da
toolkit definition: Personas vārds/nosaukums dabiskā valodā, kas ņemts no shēmas kontrolētu vārdnīcu kodēšanai vai tiek konstruēts, izmantojot virknes kodēšanas shēmu. @lv
toolkit definition: تسمية عبارة عن اسم شخص بلغة طبيعية مأخوذ من مخطط ترميز مفردات أو أنشئ باستخدام خطة ترميز سلسلة تمثيلات. @ar
toolkit definition: 作为一个个人的称谓、取自一个词表编码体系或者用一个串编码体系构建、用自然语言的一个命名 @zh-hans
toolkit label: Kişi için erişim noktası @tr
toolkit label: Sucheinstieg für eine Person @de
toolkit label: access point for person @en
toolkit label: henkilön hakutieto
toolkit label: hozzáférési pont személyhez: @hu
toolkit label: ingang voor persoon @nl
toolkit label: isiku otsielement @et
toolkit label: personas pamatforma @lv
toolkit label: point d’accès d’une personne @fr
toolkit label: punt d’accés de persona @ca
toolkit label: punto d'accesso per persona @it
toolkit label: søgeindgang for person @da
toolkit label: søkeinngang for person @no
toolkit label: σημείο πρόσβασης για φυσικό πρόσωπο @el
toolkit label: نقطة وصول لشخص @ar
toolkit label: 个人的检索点 @zh-hans
has subproperty: henkilön auktorisoitu hakutieto
has subproperty: henkilön varianttihakutieto
has subproperty: P50377
lexical alias: accessPointForPerson.en
status: Published
type: Property
domain: C10004
label: a pour point d’accès d’une personne @fr
label: ha come punto d'accesso per persona @it
label: har søgeindgang for person @da
label: har søkeinngang for person @no
label: has access point for person @en
label: hat Sucheinstieg für eine Person @de
label: heeft ingang voor persoon @nl
label: hozzáférési pont személyhez a következő: @hu
label: isiku otsielement @et
label: kişi için erişim noktası ile ilişkilidir @tr
label: personas pamatforma @lv
label: té com a punt d’accés de persona @ca
label: έχει σημείο πρόσβασης για φυσικό πρόσωπο @el
label: له نقطة وصول لشخص @ar
label: 有个人的检索点 @zh-hans
sub property of: toimijan hakutieto
sub property of: henkilön nimitys
definition: Bir kişiyi, bir kelime kodlama şemasından alınan veya bir dizi kodlama şeması kullanılarak oluşturulan, doğal dilde bir kişinin tanımlayıcı adı olan bir isimle ilişkilendirir. @tr
definition: Correla una persona con la denominazione di una persona in linguaggio naturale che è presa dallo schema di codifica di un vocabolario (vocabolario controllato) o è costruita usando uno schema di codifica di una stringa. @it
definition: Hozzákapcsol egy személy egy nomenhez, egy személy természetes nyelvű megnevezéséhez, amely egy szótárkódolási sémából származik, vagy egy karakterlánc-kódolási séma használatával szerkesztett. @hu
definition: Liittää henkilön nomeniin, joka on luonnollisella kielellä oleva henkilön nimitys, joka on otettu sanaston merkintäjärjestelmästä tai muodostettu käyttämällä merkkijonon merkintäjärjestelmää.
definition: Met une personne en relation avec un nomen qui est une appellation de personne en langage naturel provenant d’un schéma d’encodage de vocabulaire ou construite à l’aide d’un schéma d’encodage de chaînes. @fr
definition: Relaciona una persona amb un nomen que és una apel·lació de persona en llenguatge natural que s’obté d’un esquema de codificació de vocabulari o s’elabora usant un esquema de codificació de cadenes. @ca
definition: Relateert een persoon aan een nomen dat is een benaming van persoon in natuurlijke taal die ontleend is aan een vocabulair coderingsschema of gevormd is volgens een string coderingsschema. @nl
definition: Relaterer en person til en benævnelse på person på normalsprog, som er taget fra et vokabularkodningsskema eller er konstrueret ved hjælp af et strengkodningsskema. @da
definition: Relaterer en person til en betegnelse for person på et naturlig språk som er hentet fra et kodeskjema for vokabular eller er laget ved hjelp av et kodeskjema for syntaks. @no
definition: Relates a person to a nomen that is an appellation of person in natural language that is taken from a vocabulary encoding scheme or is constructed using a string encoding scheme. @en
definition: Sasaista personu ar nomenu, kas ir personas vārds/nosaukums dabiskā valodā, kas ņemts no shēmas kontrolētu vārdnīcu kodēšanai vai tiek konstruēts, izmantojot virknes kodēšanas shēmu. @lv
definition: Seostab isiku isiku nimetusega loomulikus keeles, mis on võetud leksikaalsest märkimissüsteemist või moodustatud stringilise märkimissüsteemi alusel. @et
definition: Setzt eine Person in Beziehung zu einer Bezeichnung für eine Person in natürlicher Sprache, die einem Vocabulary Encoding Scheme entnommen oder mit einem String Encoding Scheme konstruiert wird. @de
definition: يربط شخصا بتسمية عبارة عن اسم شخص بلغة طبيعية مأخوذ من مخطط ترميز مفردات، أو أنشئ باستخدام خطة ترميز سلسلة تمثيلات. @ar
definition: 将一个个人与作为一个个人的称谓、取自一个词表编码体系或者用一个串编码体系构建、用自然语言的一个命名关联起来。 @zh-hans

toimijan nimitys
has element type: 2
toolkit definition: A nomen that is used within a given scheme or context to refer to an agent. @en
toolkit definition: Bir şema veya bağlam içinde bir temsilciye atıfta bulunmak için kullanılan bir nomen @tr
toolkit definition: Een nomen dat wordt gebruikt binnen een bepaald schema of context om een actor aan te duiden. @nl
toolkit definition: Egy nomen, amelyet egy adott sémán vagy kontextuson belül használnak egy ágensre való hivatkozásra. @hu
toolkit definition: Ein Nomen, das in einem bestimmten Schema oder Kontext verwendet wird, um einen Akteur zu referenzieren. @de
toolkit definition: Et nomen som er brukt i et bestemt skjema eller kontekst for å referere til en agent. @no
toolkit definition: Nomen che è usato all'interno di un dato schema o contesto per far riferimento a un agente. @it
toolkit definition: Nomen que s’usa en un esquema o un context determinat per referir-se a un agent. @ca
toolkit definition: Nomen qui est utilisé à l’intérieur d’un schéma ou d’un contexte donnés pour désigner un agent. @fr
toolkit definition: Nomen, jota on käytetty tietyssä järjestelmässä tai kontekstissa viittaamaan toimijaan.
toolkit definition: Nomen, mida antud süsteemis või kontekstis kasutatakse tegijale viitamiseks. @et
toolkit definition: Nomen, som anvendes inden for et givet skema eller kontekst for at henvise til en agent. @da
toolkit definition: Nomens, ko lieto konkrētajā sistēmā vai kontekstā, lai norādītu uz aģentu. @lv
toolkit definition: تسمية مستخدمة في خطة أو في سياق محدد للإشارة إلى وكيل. @ar
toolkit definition: 在一个给定的体系或语境中指称一个行为者所用的一个命名 @zh-hans
toolkit label: Bezeichnung für einen Akteur @de
toolkit label: apel·lació d’agent @ca
toolkit label: appellation d’agent @fr
toolkit label: appellation of agent @en
toolkit label: aģenta apzīmējums @lv
toolkit label: benaming van actor @nl
toolkit label: benævnelse på agent @da
toolkit label: betegnelse for agent @no
toolkit label: denominazione di agente collettivo @it
toolkit label: tegija nimetus @et
toolkit label: temsilcinin unvanı @tr
toolkit label: toimijan nimitys
toolkit label: ágens megnevezése: @hu
toolkit label: ονομασία του φορέα @el
toolkit label: اسم تعريفي لوكيل @ar
toolkit label: 行为者的称谓 @zh-hans
has subproperty: toimijan hakutieto
has subproperty: yhteistoimijan nimitys
has subproperty: henkilön nimitys
has subproperty: toimijan tunniste
has subproperty: toimijan nimi
has subproperty: P50378
lexical alias: appellationOfAgent.en
status: Published
type: Property
domain: C10002
label: a pour appellation d’agent @fr
label: aģenta apzīmējums @lv
label: ha come denominazione di agente @it
label: har benævnelse på agent @da
label: har betegnelse for agent @no
label: has appellation of agent @en
label: hat Bezeichnung für einen Akteur @de
label: heeft benaming van actor @nl
label: tegija nimetus @et
label: temsilcinin unvanı ile ilişkilidir @tr
label: té com a apel·lació d’agent @ca
label: ágens megnevezése a következő: @hu
label: έχει ονομασία του φορέα @el
label: له اسم تعريفي لوكيل @ar
label: 有行为者的称谓 @zh-hans
sub property of: toimijaan liittyvä nomen
sub property of: P00017
definition: Bir temsilciyi, bir şema veya bağlam içinde bir temsilciye atıfta bulunmak için kullanılan bir isimle ilişkilendirir. @tr
definition: Correla un agente a un nomen che è usato all'interno di un dato schema o contesto per far riferimento a un agente. @it
definition: Hozzákapcsol egy ágenst egy nomenhez, amelyet egy adott sémán vagy kontextuson belül használnak egy ágensre való hivatkozásra. @hu
definition: Liittää toimijan nomeniin, jota on käytetty tietyssä järjestelmässä tai kontekstissa viittaamaan toimijaan.
definition: Met un agent en relation avec un nomen qui est utilisé à l’intérieur d’un schéma ou d’un contexte donnés pour désigner un agent. @fr
definition: Relaciona un agent amb un nomen que s’usa en un esquema o un context determinat per referir-se a un agent. @ca
definition: Relateert een actor aan een nomen dat wordt gebruikt binnen een bepaald schema of context om een actor aan te duiden. @nl
definition: Relaterer en agent til et nomen som er brukt i et bestemt skjema eller kontekst for å referere til en agent. @no
definition: Relaterer en agent til et nomen, som anvendes inden for et givet skema eller kontekst for at henvise til en agent. @da
definition: Relates an agent to a nomen that is used within a given scheme or context to refer to an agent. @en
definition: Sasaista aģentu ar nomenu, ko lieto konkrētajā sistēmā vai kontekstā, lai norādītu uz aģentu. @lv
definition: Seostab tegija nomen'iga, mida antud süsteemis või kontekstis kasutatakse tegijale viitamiseks. @et
definition: Setzt einen Akteur in Beziehung zu einem Nomen, das in einem bestimmten Schema oder Kontext verwendet wird, um einen Akteur zu referenzieren. @de
definition: يربط وكيلا بتسمية مستخدمة في خطة أو في سياق محدد للإشارة إلى وكيل. @ar
definition: 将一个行为者与在一个给定的体系或语境中指称一个行为者所用的一个命名关联起来。 @zh-hans

yhteistoimijan nimitys
has element type: 2
toolkit definition: A nomen that is used within a given scheme or context to refer to a collective agent. @en
toolkit definition: Bir şema veya bağlam içinde bir kolektif temsilciye atıfta bulunmak için kullanılan bir isim @tr
toolkit definition: Een nomen dat wordt gebruikt binnen een bepaald schema of context om een collectieve actor aan te duiden. @nl
toolkit definition: Egy nomen, amelyet egy adott sémán vagy kontextuson belül használnak egy kollektív ágensre való hivatkozásra. @hu
toolkit definition: Ein Nomen, das in einem bestimmten Schema oder Kontext verwendet wird, um einen gemeinschaftlichen Akteur zu referenzieren. @de
toolkit definition: Et nomen som er brukt i et bestemt skjema eller kontekst for å referere til en kollektiv agent. @no
toolkit definition: Nomen che è usato all'interno di un dato schema o contesto per far riferimento a un agente collettivo. @it
toolkit definition: Nomen que s’usa en un esquema o un context determinat per referir-se a un agent col·lectiu. @ca
toolkit definition: Nomen qui est utilisé à l’intérieur d’un schéma ou d’un contexte donnés pour désigner un agent collectif. @fr
toolkit definition: Nomen, jota on käytetty tietyssä järjestelmässä tai kontekstissa viittaamaan yhteistoimijaan.
toolkit definition: Nomen, mida antud süsteemis või kontekstis kasutatakse kollektiivile viitamiseks. @et
toolkit definition: Nomen, som anvendes inden for et givet skema eller kontekst for at henvise til en kollektiv agent. @da
toolkit definition: Nomens, ko lieto konkrētajā sistēmā vai kontekstā, lai norādītu uz aģenta grupu. @lv
toolkit definition: تسمية مستخدمة في خطة أو في سياق محدد للإشارة إلى وكيل جماعي. @ar
toolkit definition: 在一个给定的体系或语境中指称一个集体行为者所用的一个命名 @zh-hans
toolkit label: Bezeichnung für einen gemeinschaftlichen Akteur @de
toolkit label: apel·lació d’agent col·lectiu @ca
toolkit label: appellation d’agent collectif @fr
toolkit label: appellation of collective agent @en
toolkit label: benaming van collectieve actor @nl
toolkit label: benævnelse på kollektiv agent @da
toolkit label: betegnelse for kollektiv agent @no
toolkit label: denominazione di agente @it
toolkit label: grupas apzīmējums @lv
toolkit label: kolektif temsilcinin unvanı @tr
toolkit label: kollektiivi nimetus @et
toolkit label: kollektív ágens megnevezése: @hu
toolkit label: yhteistoimijan nimitys
toolkit label: ονομασία του συλλογικού φορέα @el
toolkit label: اسم تعريفي لوكيل جماعي @ar
toolkit label: 集体行为者的称谓 @zh-hans
has subproperty: yhteistoimijan hakutieto
has subproperty: yhteisön nimitys
has subproperty: suvun nimitys
has subproperty: yhteistoimijan tunniste
has subproperty: yhteistoimijan nimi
has subproperty: P50379
lexical alias: appellationOfCollectiveAgent.en
status: Published
type: Property
domain: C10011
label: a pour appellation d’agent collectif @fr
label: grupas apzīmējums @lv
label: ha come denominazione di agente collettivo @it
label: har benævnelse på kollektiv agent @da
label: har betegnelse for kollektiv agent @no
label: has appellation of collective agent @en
label: hat Bezeichnung für einen gemeinschaftlichen Akteur @de
label: heeft benaming van collectieve actor @nl
label: kolektif temsilcinin unvanı ile ilişkilidir @tr
label: kollektiivi nimetus @et
label: kollektív ágens megnevezése a következő: @hu
label: té com a apel·lació d’agent col·lectiu @ca
label: έχει ονομασία του συλλογικού φορέα @el
label: له اسم تعريفي لوكيل جماعي @ar
label: 有集体行为者的称谓 @zh-hans
sub property of: yhteistoimijaan liittyvä nomen
sub property of: toimijan nimitys
definition: Correla un agente collettivo a un nomen che è usato all'interno di un dato schema o contesto per far riferimento a un agente collettivo. @it
definition: Hozzákapcsol egy kollektív ágenst egy nomenhez, amelyet egy adott sémán vagy kontextuson belül használnak egy kollektív ágensre való hivatkozásra. @hu
definition: Kolektif bir temsilciyi, bir şema veya bağlam içinde bir kolektif temsilciye atıfta bulunmak için kullanılan bir isim ile ilişkilendirir. @tr
definition: Liittää yhteistoimijan nomeniin, jota on käytetty tietyssä järjestelmässä tai kontekstissa viittaamaan yhteistoimijaan.
definition: Met un agent collectif en relation avec un nomen qui est utilisé à l’intérieur d’un schéma ou d’un contexte donnés pour désigner un agent collectif. @fr
definition: Relaciona un agent col·lectiu amb un nomen que s’usa en un esquema o un context determinat per referir-se a un agent col·lectiu. @ca
definition: Relateert een collectieve actor aan een nomen dat wordt gebruikt binnen een bepaald schema of context om een collectieve actor aan te duiden. @nl
definition: Relaterer en kollektiv agent til et nomen som er brukt i et bestemt skjema eller kontekst for å referere til en kollektiv agent. @no
definition: Relaterer en kollektiv agent til et nomen, som anvendes inden for et givet skema eller kontekst for at henvise til en kollektiv agent. @da
definition: Relates a collective agent to a nomen that is used within a given scheme or context to refer to a collective agent. @en
definition: Sasaista grupu ar nomenu, ko lieto konkrētajā sistēmā vai kontekstā, lai norādītu uz aģenta grupu. @lv
definition: Seostab kollektiivi nomen'iga, mida antud süsteemis või kontekstis kasutatakse kollektiivile viitamiseks. @et
definition: Setzt einen gemeinschaftlichen Akteur in Beziehung zu einem Nomen, das in einem bestimmten Schema oder Kontext verwendet wird, um einen gemeinschaftlichen Akteur zu referenzieren. @de
definition: يربط وكيلا جماعيا بتسمية مستخدمة في خطة أو في سياق محدد للإشارة إلى وكيل جماعي . @ar
definition: 将一个集体行为者与在一个给定的体系或语境中指称一个集体行为者所用的一个命名关联起来。 @zh-hans

yhteisön nimitys
has element type: 2
toolkit definition: A nomen that is used within a given scheme or context to refer to a corporate body. @en
toolkit definition: Bir şema veya bağlam içinde bir tüzel kişiye atıfta bulunmak için kullanılan bir isim @tr
toolkit definition: Een nomen dat wordt gebruikt binnen een bepaald schema of context om een corporatie aan te duiden. @nl
toolkit definition: Egy nomen, amelyet egy adott sémán vagy kontextuson belül használnak egy testületre való hivatkozásra. @hu
toolkit definition: Ein Nomen, das in einem bestimmten Schema oder Kontext verwendet wird, um eine Körperschaft zu referenzieren. @de
toolkit definition: Et nomen som er brukt i et bestemt skjema eller kontekst for å referere til en korporasjon. @no
toolkit definition: Nomen che è usato all'interno di un dato schema o contestoper far riferimento a un ente. @it
toolkit definition: Nomen que s’usa en un esquema o un context determinat per referir-se a una entitat corporativa. @ca
toolkit definition: Nomen qui est utilisé à l’intérieur d’un schéma ou d’un contexte donnés pour désigner une collectivité. @fr
toolkit definition: Nomen, jota on käytetty tietyssä järjestelmässä tai kontekstissa viittaamaan yhteisöön.
toolkit definition: Nomen, mida antud süsteemis või kontekstis kasutatakse asutusele viitamiseks. @et
toolkit definition: Nomen, som anvendes inden for et givet skema eller kontekst for at henvise til en korporation. @da
toolkit definition: Nomens, ko lieto konkrētajā sistēmā vai kontekstā, lai norādītu uz institūciju @lv
toolkit definition: تسمية مستخدمة في خطة أو في سياق محدد للإشارة إلى هيئة. @ar
toolkit definition: 在一个给定的体系或语境中指称一个团体的一个命名 @zh-hans
toolkit label: Bezeichnung für eine Körperschaft @de
toolkit label: apel·lació d’entitat corporativa @ca
toolkit label: appellation de collectivité @fr
toolkit label: appellation of corporate body @en
toolkit label: asutuse nimetus @et
toolkit label: benaming van corporatie @nl
toolkit label: benævnelse på korporation @da
toolkit label: betegnelse for korporasjon @no
toolkit label: denominazione di ente @it
toolkit label: institūcijas apzīmējums @lv
toolkit label: testület megnevezése: @hu
toolkit label: tüzel kişinin unvanı @tr
toolkit label: yhteisön nimitys
toolkit label: ονομασία του συλλογικού οργάνου @el
toolkit label: تسمية لهيئة @ar
toolkit label: 团体的称谓 @zh-hans
has subproperty: yhteisön tunniste
has subproperty: yhteisön nimi
has subproperty: yhteisön hakutieto
has subproperty: P50380
lexical alias: appellationOfCorporateBody.en
status: Published
type: Property
domain: C10005
label: a pour appellation de collectivité @fr
label: asutuse nimetus @et
label: ha come denominazione di ente @it
label: har benævnelse på korporation @da
label: har betegnelse for korporasjon @no
label: has appellation of corporate body @en
label: hat Bezeichnung für eine Körperschaft @de
label: heeft benaming van corporatie @nl
label: institūcijas apzīmējums @lv
label: testület megnevezése a következő: @hu
label: té com a apel·lació d’entitat corporativa @ca
label: tüzel kişinin unvanı ile ilişkilidir @tr
label: έχει ονομασία του συλλογικού οργάνου @el
label: له تسمية هيئة @ar
label: 有团体的称谓 @zh-hans
sub property of: yhteisöön liittyvä nomen
sub property of: yhteistoimijan nimitys
definition: Bir tüzel kişiyi, bir şema veya bağlam içinde bir tüzel kişiye atıfta bulunmak için kullanılan bir isim ile ilişkilendirir. @tr
definition: Correla un ente a un nomen che è usato all'interno di un dato schema o contestoper far riferimento a un ente. @it
definition: Hozzákapcsol egy testületet egy nomenhez, amelyet egy adott sémán vagy kontextuson belül használnak egy testületre való hivatkozásra. @hu
definition: Liittää yhteisön nomeniin, jota on käytetty tietyssä järjestelmässä tai kontekstissa viittaamaan yhteisöön.
definition: Met une collectivité en relation avec un nomen qui est utilisé à l’intérieur d’un schéma ou d’un contexte donnés pour désigner une collectivité. @fr
definition: Relaciona una entitat corporativa amb un nomen que s’usa en un esquema o un context determinat per referir-se a una entitat corporativa. @ca
definition: Relateert een corporatie aan een nomen dat wordt gebruikt binnen een bepaald schema of context om een corporatie aan te duiden. @nl
definition: Relaterer en korporasjon til et nomen som er brukt i et bestemt skjema eller kontekst for å referere til en korporasjon. @no
definition: Relaterer en korporation til et nomen, som anvendes inden for et givet skema eller kontekst for at henvise til en korporation. @da
definition: Relates a corporate body to a nomen that is used within a given scheme or context to refer to a corporate body. @en
definition: Sasaista institūciju ar nomenu, ko lieto konkrētajā sistēmā vai kontekstā, lai norādītu uz institūciju. @lv
definition: Seostab asutuse nomen'iga, mida antud süsteemis või kontekstis kasutatakse asutusele viitamiseks. @et
definition: Setzt eine Körperschaft in Beziehung zu einem Nomen, das in einem bestimmten Schema oder Kontext verwendet wird, um eine Körperschaft zu referenzieren. @de
definition: يربط هيئة بتسمية مستخدمة في خطة أو في سياق محدد للإشارة إلى هيئة. @ar
definition: 将一个团体与在一个给定的体系或语境中指称一个团体的一个命名关联起来。 @zh-hans

suvun nimitys
has element type: 2
toolkit definition: A nomen that is used within a given scheme or context to refer to a family. @en
toolkit definition: Bir şema veya bağlam içinde bir aileye atıfta bulunmak için kullanılan bir isim. @tr
toolkit definition: Een nomen dat wordt gebruikt binnen een bepaald schema of context om een familie aan te duiden. @nl
toolkit definition: Egy nomen, amelyet egy adott sémán vagy kontextuson belül használnak egy családra való hivatkozásra. @hu
toolkit definition: Ein Nomen, das in einem bestimmten Schema oder Kontext verwendet wird, um eine Familie zu referenzieren. @de
toolkit definition: Et nomen som er brukt i et bestemt skjema eller kontekst for å referere til en familie. @no
toolkit definition: Nomen che è usato all'interno di un dato schema o contesto per far riferimento a una famiglia. @it
toolkit definition: Nomen que s’usa en un esquema o un context determinat per referir-se a una família. @ca
toolkit definition: Nomen qui est utilisé à l’intérieur d’un schéma ou d’un contexte donnés pour désigner une famille. @fr
toolkit definition: Nomen, jota on käytetty tietyssä järjestelmässä tai kontekstissa viittaamaan sukuun.
toolkit definition: Nomen, mida antud süsteemis või kontekstis kasutatakse perekonnale viitamiseks. @et
toolkit definition: Nomen, som anvendes inden for et givet skema eller kontekst for at henvise til en familie. @da
toolkit definition: Nomens, ko lieto konkrētajā sistēmā vai kontekstā, lai norādītu uz dzimtu/ģimenei @lv
toolkit definition: تسمية مستخدمة في خطة أو في سياق محدد للإشارة إلى عائلة. @ar
toolkit definition: 在一个给定的体系或语境中指称一个家族的一个命名 @zh-hans
toolkit label: Bezeichnung für eine Familie @de
toolkit label: ailenin unvanı @tr
toolkit label: apel·lació de família @ca
toolkit label: appellation de famille @fr
toolkit label: appellation of family @en
toolkit label: benaming van familie @nl
toolkit label: benævnelse på familie @da
toolkit label: betegnelse for familie @no
toolkit label: család megnevezése: @hu
toolkit label: denominazione di famiglia @it
toolkit label: dzimtas/ģimenes apzīmējums @lv
toolkit label: perekonna nimetus @et
toolkit label: suvun nimitys
toolkit label: ονομασία της οικογένειας @el
toolkit label: اسم تعريفي لعائلة @ar
toolkit label: 家族的称谓 @zh-hans
has subproperty: suvun tunniste
has subproperty: suvun nimi
has subproperty: suvun hakutieto
has subproperty: P50381
lexical alias: appellationOfFamily.en
status: Published
type: Property
domain: C10008
label: a pour appellation de famille @fr
label: ailenin unvanı ile ilişkilidir @tr
label: család megnevezése a következő: @hu
label: dzimtas/ģimenes apzīmējums @lv
label: ha come denominazione di famiglia @it
label: har benævnelse på familie @da
label: har betegnelse for familie @no
label: has appellation of family @en
label: hat Bezeichnung für eine Familie @de
label: heeft benaming van familie @nl
label: perekonna nimetus @et
label: té com a apel·lació de família @ca
label: έχει ονομασία της οικογένειας @el
label: له اسم تعريفي لعائلة @ar
label: 有家族的称谓 @zh-hans
sub property of: sukuun liittyvä nomen
sub property of: yhteistoimijan nimitys
definition: Bir aileyi, bir şema veya bağlam içinde bir aileye atıfta bulunmak için kullanılan bir isim ile ilişkilendirir. @tr
definition: Correla una famiglia a un nomen che è usato all'interno di un dato schema o contestoper far riferimento a una famiglia. @it
definition: Hozzákapcsol egy családot egy nomenhez, amelyet egy adott sémán vagy kontextuson belül használnak egy családra való hivatkozásra. @hu
definition: Liittää suvun nomeniin, jota on käytetty tietyssä järjestelmässä tai kontekstissa viittaamaan sukuun.
definition: Met une famille en relation avec un nomen qui est utilisé à l’intérieur d’un schéma ou d’un contexte donnés pour désigner une famille. @fr
definition: Relaciona una família amb un nomen que s’usa en un esquema o un context determinat per referir-se a una família. @ca
definition: Relateert een familie aan een nomen dat wordt gebruikt binnen een bepaald schema of context om een familie aan te duiden. @nl
definition: Relaterer en familie til et nomen som er brukt i et bestemt skjema eller kontekst for å referere til en familie. @no
definition: Relaterer en familie til et nomen, som anvendes inden for et givet skema eller kontekst for at henvise til en familie. @da
definition: Relates a family to a nomen that is used within a given scheme or context to refer to a family. @en
definition: Sasaista dzimtu/ģimeni ar nomenu, ko lieto konkrētajā sistēmā vai kontekstā, lai norādītu uz dzimtu/ģimenei. @lv
definition: Seostab perekonna nomen'iga, mida antud süsteemis või kontekstis kasutatakse perekonnale viitamiseks. @et
definition: Setzt eine Familie in Beziehung zu einem Nomen, das in einem bestimmten Schema oder Kontext verwendet wird, um eine Familie zu referenzieren. @de
definition: يربط عائلة بتسمية مستخدمة في خطة أو في سياق محدد للإشارة إلى عائلة. @ar
definition: 将一个家族与在一个给定的体系或语境中指称一个家族的一个命名关联起来。 @zh-hans

henkilön nimitys
has element type: 2
toolkit definition: A nomen that is used within a given scheme or context to refer to a person. @en
toolkit definition: Bir şema veya bağlam içinde bir kişiye atıfta bulunmak için kullanılan bir isim. @tr
toolkit definition: Een nomen dat wordt gebruikt binnen een bepaald schema of context om een persoon aan te duiden. @nl
toolkit definition: Egy nomen, amelyet egy adott sémán vagy kontextuson belül használnak egy személyre való hivatkozásra. @hu
toolkit definition: Ein Nomen, das in einem bestimmten Schema oder Kontext verwendet wird, um eine Person zu referenzieren. @de
toolkit definition: Et nomen som er brukt i et bestemt skjema eller kontekst for å referere til en person. @no
toolkit definition: Nomen che è usato all'interno di un dato schema o contesto per far riferimento a una persona.. @it
toolkit definition: Nomen que s’usa en un esquema o un context determinat per referir-se a una persona. @ca
toolkit definition: Nomen qui est utilisé à l’intérieur d’un schéma ou d’un contexte donnés pour désigner une personne. @fr
toolkit definition: Nomen, jota on käytetty tietyssä järjestelmässä tai kontekstissa viittaamaan henkilöön.
toolkit definition: Nomen, mida antud süsteemis või kontekstis kasutatakse isikule viitamiseks. @et
toolkit definition: Nomen, som anvendes inden for et givet skema eller kontekst for at henvise til en person. @da
toolkit definition: Nomens, ko lieto konkrētajā sistēmā vai kontekstā, lai norādītu uz personu @lv
toolkit definition: تسمية مستخدمة في خطة أو في سياق محدد للإشارة إلى شخص. @ar
toolkit definition: 在一个给定的体系或语境中指称一个个人的一个命名 @zh-hans
toolkit label: Bezeichnung für eine Person @de
toolkit label: apel·lació de persona @ca
toolkit label: appellation de personne @fr
toolkit label: appellation of person @en
toolkit label: benaming van persoon @nl
toolkit label: benævnelse på person @da
toolkit label: betegnelse for person @no
toolkit label: denominazione di persona @it
toolkit label: henkilön nimitys
toolkit label: isiku nimetus @et
toolkit label: kişinin unvanı @tr
toolkit label: personas apzīmējums @lv
toolkit label: személy megnevezése: @hu
toolkit label: ονομασία του φυσικού προσώπου @el
toolkit label: اسم تعريفي لشخص @ar
toolkit label: 个人的称谓 @zh-hans
has subproperty: henkilön tunniste
has subproperty: henkilön nimi
has subproperty: henkilön hakutieto
has subproperty: P50382
lexical alias: appellationOfPerson.en
status: Published
type: Property
domain: C10004
label: a pour appellation de personne @fr
label: ha come denominazione di persona @it
label: har benævnelse på person @da
label: har betegnelse for person @no
label: has appellation of person @en
label: hat Bezeichnung für eine Person @de
label: heeft benaming van persoon @nl
label: isiku nimetus @et
label: kişinin unvanı ile ilişkilidir @tr
label: personas apzīmējums @lv
label: személy megnevezése a következő: @hu
label: té com a apel·lació de persona @ca
label: έχει ονομασία του φυσικού προσώπου @el
label: له تسمية شخص @ar
label: 有个人的称谓 @zh-hans
sub property of: henkilöön liittyvä nomen
sub property of: toimijan nimitys
definition: Bir kişiyi, bir şema veya bağlam içinde bir kişiye atıfta bulunmak için kullanılan bir isimle ilişkilendirir. @tr
definition: Correla una persona a un nomen che è usato all'interno di un dato schema o contestoper far riferimento a una persona.. @it
definition: Hozzákapcsol egy személyt egy nomenhez, amelyet egy adott sémán vagy kontextuson belül használnak egy személyre való hivatkozásra. @hu
definition: Liittää henkilön nomeniin, jota on käytetty tietyssä järjestelmässä tai kontekstissa viittaamaan henkilöön.
definition: Met une personne en relation avec un nomen qui est utilisé à l’intérieur d’un schéma ou d’un contexte donnés pour désigner une personne. @fr
definition: Relaciona una persona amb un nomen que s’usa en un esquema o un context determinat per referir-se a una persona. @ca
definition: Relateert een persoon aan een nomen dat wordt gebruikt binnen een bepaald schema of context om een persoon aan te duiden. @nl
definition: Relaterer en familie til et nomen som er brukt i et bestemt skjema eller kontekst for å referere til en person. @no
definition: Relaterer en person til et nomen, som anvendes inden for et givet skema eller kontekst for at henvise til en person. @da
definition: Relates a person to a nomen that is used within a given scheme or context to refer to a person. @en
definition: Sasaista personu ar nomenu, ko lieto konkrētajā sistēmā vai kontekstā, lai norādītu uz personu. @lv
definition: Seostab isiku nomen'iga, mida antud süsteemis või kontekstis kasutatakse isikule viitamiseks. @et
definition: Setzt eine Person in Beziehung zu einen Nomen, das in einem bestimmten Schema oder Kontext verwendet wird, um eine Person zu referenzieren. @de
definition: يربط شخصا بتسمية مستخدمة في خطة أو في سياق محدد للإشارة إلى شخص. @ar
definition: 将一个个人与在一个给定的体系或语境中指称一个个人的一个命名关联起来。 @zh-hans

toimijan tunniste
has element type: 3
toolkit definition: A nomen that is an appellation of agent that consists of a code, number, or other string, usually independent of natural language and social naming conventions, used to identify an agent. @en
toolkit definition: Aģenta apzīmējums, kas sastāv no koda, skaitļa vai citas virknes, kas parasti ir neatkarīgs no dabiskas valodas vai sabiedrībā pieņemtām nosaukšanas tradīcijām, ko izmanto, lai identificētu aģentu. @lv
toolkit definition: Bir temsilciyi tanımlamak için kullanılan, genellikle doğal dilden ve sosyal adlandırma kurallarından bağımsız olan bir kod, sayı veya başka bir dizeden oluşan bir temsilcinin unvanı olan bir isim. @tr
toolkit definition: Denominazione di un agente in linguaggio naturale che consiste di un codice, numero, o stringa, solitamente indipendente dal linguaggio naturale e dalle convenzioni sociali di denominazione, usati per identificare un agente. @it
toolkit definition: Een nomen dat is een benaming van actor die bestaat uit een code, nummer of andere tekenreeks, meestal onafhankelijk van natuurlijke taal en gewoonlijke naamgevingsconventies, gebruikt om een actor te identificeren. @nl
toolkit definition: Egy nomen, egy ágens megnevezése, amely egy kód, szám, vagy más típusú karakterláncból állból áll, amely általában független a természetes nyelvektől és a társadalmi névkonvencióktól, és egyetlen ágens azonosítására használják. @hu
toolkit definition: Eine Bezeichnung für einen Akteur, die aus einem Code, einer Nummer oder einer anderen Zeichenkette besteht, der/die normalerweise nicht in natürlicher Sprache und unabhängig von den sozialen Benennungskonventionen ist und zur Identifizierung eines Akteurs verwendet wird. @de
toolkit definition: En betegnelse for agent som består av en kode, et nummer eller annen streng, vanligvis uavhengig av naturlig språk og sosiale navnekonvensjoner, brukt for å identifisere en agent. @no
toolkit definition: Nomen que és una apel·lació d’agent que consisteix en un codi, un número o una altra cadena, normalment independent del llenguatge natural i de les convencions lingüístiques socials, usada per identificar un agent. @ca
toolkit definition: Nomen qui est une appellation d’agent consistant en un code, un nombre ou une autre chaîne, généralement indépendante du langage naturel et des conventions sociales de dénomination, utilisée pour identifier un agent. @fr
toolkit definition: Nomen, joka on toimijan nimitys, joka koostuu koodista, luvusta tai muusta tavallisesti luonnollisesta kielestä ja yleisistä nimeämiskäytännöistä riippumattomasta merkkijonosta, jota käytetään yhteistoimijan identifiointiin.
toolkit definition: Nomen, som er en benævnelse på agent, som består af en kode, nummer eller anden streng, ofte uafhængig af normalsprog og navngivningskonventioner, brugt til at identificere en agent. @da
toolkit definition: Tegija nimetus, mis koosneb tegijat identifitseerivast koodist, numbrist või muust loomulikust keelest ja üldtuntud nimetamistavadest sõltumatust stringist. @et
toolkit definition: تسمية عبارة عن اسم وكيل يتكون من رمز، أو رقم، أو سلسلة تمثيلات أخرى، عادة ما تكون مختلفة عن اللغة الطبيعية وعن التسميات المتعارف عليها اجتماعيا، المستخدمة في تعريف وكيل. @ar
toolkit definition: 作为一个由代码、数字、或其他字符串构成、通常独立于自然语言和社会命名惯例、用以标识一个行为者的行为者的称谓的命名 @zh-hans
toolkit label: Identifikator für einen Akteur @de
toolkit label: aģenta identifikators @lv
toolkit label: identifiant d’agent @fr
toolkit label: identificador d’agent @ca
toolkit label: identificatie voor actor @nl
toolkit label: identificatore di agente @it
toolkit label: identifier for agent @en
toolkit label: identifikator for agent @da
toolkit label: tegija identifikaator @et
toolkit label: temsilcinin tanımlayıcısı ile ilişkilidir @tr
toolkit label: toimijan tunniste
toolkit label: ágensazonosító: @hu
toolkit label: αναγνωριστικό για φορέα @el
toolkit label: معرِّف لوكيل @ar
toolkit label: 行为者的标识符 @zh-hans
has subproperty: henkilön tunniste
has subproperty: yhteistoimijan tunniste
has subproperty: P50383
lexical alias: identifierForAgent.en
status: Published
type: Property
domain: C10002
label: a pour identifiant d’agent @fr
label: aģenta identifikators @lv
label: ha come identificatore di agente @it
label: har identifikator for agent @da
label: has identifier for agent @en
label: hat Identifikator für einen Akteur @de
label: heeft identificatie voor actor @nl
label: tegija identifikaator @et
label: temsilcinin tanımlayıcısı ile ilişkilidir @tr
label: té com a identificador d’agent @ca
label: ágens azonosítója a következő: @hu
label: έχει αναγνωριστικό για φορέα @el
label: له معرِّف لوكيل @ar
label: 有行为者的标识符 @zh-hans
sub property of: toimijan nimitys
sub property of: P00018
definition: Bir temsilciyi, bir temsilciyi tanımlamak için kullanılan, genellikle doğal dilden ve sosyal adlandırma kurallarından bağımsız olan bir kod, sayı veya başka bir diziyi içeren bir temsilcinin unvanı olan bir isimle ilişkilendirir. @tr
definition: Correla un agente con la denominazione di un agente in linguaggio naturale che consiste di un codice, numero, o stringa, solitamente indipendente dal linguaggio naturale e dalle convenzioni sociali di denominazione, usati per identificare un agente. @it
definition: Hozzákapcsol egy ágenst egy nomenhez, egy ágens megnevezéséhez, amely egy kód, szám, vagy más típusú karakterláncból áll, amely általában független a természetes nyelvektől és a társadalmi névkonvencióktól, és egyetlen ágens azonosítására használják. @hu
definition: Liittää toimijan nomeniin, joka on toimijan nimitys, joka koostuu koodista, luvusta tai muusta tavallisesti luonnollisesta kielestä ja yleisistä nimeämiskäytännöistä riippumattomasta merkkijonosta, jota käytetään toimijan identifiointiin.
definition: Met un agent en relation avec un nomen qui est une appellation d’agent consistant en un code, un nombre ou une autre chaîne, généralement indépendante du langage naturel et des conventions sociales de dénomination, utilisée pour identifier un agent. @fr
definition: Relaciona un agent amb un nomen que és una apel·lació d’agent que consisteix en un codi, un número o una altra cadena, normalment independent del llenguatge natural i de les convencions lingüístiques socials, usada per identificar un agent. @ca
definition: Relateert een actor aan een nomen dat is een benaming van actor die bestaat uit een code, nummer of andere tekenreeks, meestal onafhankelijk van natuurlijke taal en gewoonlijke naamgevingsconventies, gebruikt om een actor te identificeren. @nl
definition: Relaterer en agent til en betegnelse for agent som består av en kode, et nummer eller annen streng, vanligvis uavhengig av naturlig språk og sosiale navnekonvensjoner, brukt for å identifisere en agent. @no
definition: Relaterer en agent til et nomen, som er en benævnelse på agent, som består af en kode, nummer eller anden streng, ofte uafhængig af normalsprog og navngivningskonventioner, brugt til at identificere en agent. @da
definition: Relates an agent to a nomen that is an appellation of agent that consists of a code, number, or other string, usually independent of natural language and social naming conventions, used to identify an agent. @en
definition: Sasaista aģentu ar nomenu, kas ir aģenta apzīmējums, kas sastāv no koda, skaitļa vai citas virknes, kas parasti ir neatkarīgs no dabiskas valodas vai sabiedrībā pieņemtām nosaukšanas tradīcijām, ko izmanto, lai identificētu aģentu. @lv
definition: Seostab tegija tegija nimetusega, mis koosneb tegijat identifitseerivast koodist, numbrist või muust loomulikust keelest ja üldtuntud nimetamistavadest sõltumatust stringist. @et
definition: Setzt einen Akteur in Beziehung zu einer Bezeichnung für einen Akteur, die aus einem Code, einer Nummer oder einer anderen Zeichenkette besteht, der/die normalerweise nicht in natürlicher Sprache und unabhängig von den sozialen Benennungskonventionen ist und zur Identifizierung eines Akteurs verwendet wird. @de
definition: يربط وكيلا بتسمية عبارة عن اسم وكيل يتكون من رمز، أو رقم، أو سلسلة تمثيلات أخرى، عادة ما تكون مختلفة عن اللغة الطبيعية وعن التسميات المتعارف عليها اجتماعيا المستخدمة في تعريف وكيل. @ar
definition: 将一个行为者与作为一个由代码、数字、或其他字符串构成、通常独立于自然语言和社会命名惯例、用以标识一个行为者的行为者的称谓的命名关联起来。 @zh-hans

yhteistoimijan tunniste
has element type: 3
toolkit definition: A nomen that is an appellation of collective agent that consists of a code, number, or other string, usually independent of natural language and social naming conventions, used to identify a collective agent. @en
toolkit definition: Bir kolektif temsilciyi tanımlamak için kullanılan, genellikle doğal dilden ve sosyal adlandırma kurallarından bağımsız olan bir kod, sayı veya başka bir dizeden oluşan bir kolektif temsilcinin unvanı olan bir isim. @tr
toolkit definition: Denominazione di un agente in linguaggio naturale che consiste di un codice, numero, o stringa, solitamente indipendente dal linguaggio naturale e dalle convenzioni sociali di denominazione, usati per identificare un agente collettivo. @it
toolkit definition: Een nomen dat is een benaming van collectieve actor die bestaat uit een code, nummer of andere tekenreeks, meestal onafhankelijk van natuurlijke taal en gewoonlijke naamgevingsconventies, gebruikt om een collectieve actor te identificeren. @nl
toolkit definition: Egy nomen, egy kollektív ágens megnevezése, amely egy kód, szám, vagy más típusú karakterláncból állból áll, amely általában független a természetes nyelvektől és a társadalmi névkonvencióktól, és egy kollektív ágens azonosítására használják. @hu
toolkit definition: Eine Bezeichnung für eine Akteur, die aus einem Code, einer Nummer oder einer anderen Zeichenkette besteht, der/die normalerweise nicht in natürlicher Sprache und unabhängig von den sozialen Benennungskonventionen ist und zur Identifizierung eines gemeinschaftlichen Akteurs verwendet wird. @de
toolkit definition: En betegnelse for kollektiv agent som består av en kode, et nummer eller annen streng, vanligvis uavhengig av naturlig språk og sosiale navnekonvensjoner, brukt for å identifisere en kollektiv agent. @no
toolkit definition: Grupas apzīmējums, kas sastāv no koda, skaitļa vai citas virknes, kas parasti ir neatkarīgs no dabiskas valodas vai sabiedrībā pieņemtām nosaukšanas tradīcijām, ko izmanto, lai identificētu grupu. @lv
toolkit definition: Kollektiivi nimetus, mis koosneb kollektiivi identifitseerivast koodist, numbrist või muust loomulikust keelest ja üldtuntud nimetamistavadest sõltumatust stringist. @et
toolkit definition: Nomen que és una apel·lació d’agent col·lectiu que consisteix en un codi, un número o una altra cadena, normalment independent del llenguatge natural i de les convencions lingüístiques socials, usada per identificar un agent col·lectiu. @ca
toolkit definition: Nomen qui est une appellation d’agent collectif consistant en un code, un nombre ou une autre chaîne, généralement indépendante du langage naturel et des conventions sociales de dénomination, utilisée pour identifier un agent collectif. @fr
toolkit definition: Nomen, joka on yhteistoimijan nimitys, joka koostuu koodista, luvusta tai muusta tavallisesti luonnollisesta kielestä ja yleisistä nimeämiskäytännöistä riippumattomasta merkkijonosta, jota käytetään yhteistoimijan identifiointiin.
toolkit definition: Nomen, som er en benævnelse på kollektiv agent, som består af en kode, nummer eller anden streng, ofte uafhængig af normalsprog og navngivningskonventioner, brugt til at identificere en kollektiv agent. @da
toolkit definition: تسمية هي اسم وكيل جماعي يتكون من رمز، أو رقم، أو سلسلة تمثيلات أخرى، عادة ما تكون مختلفة عن اللغة الطبيعية وعن التسميات المتعارف عليها اجتماعيا، المستخدمة في تعريف وكيل جماعي. @ar
toolkit definition: 作为一个由代码、数字、或其他字符串构成、通常独立于自然语言和社会命名惯例、用以标识一个集体行为者的集体行为者的称谓的命名 @zh-hans
toolkit label: Identifikator für einen gemeinschaftlichen Akteur @de
toolkit label: grupas identifikators @lv
toolkit label: identifiant d’agent collectif @fr
toolkit label: identificador d’agent col·lectiu @ca
toolkit label: identificatie voor collectieve actor @nl
toolkit label: identificatore di agente collettivo @it
toolkit label: identifier for collective agent @en
toolkit label: identifikator for kollektiv agent @da
toolkit label: kolektif temsilcinin tanımlayıcısı ile ilişkilidir @tr
toolkit label: kollektiivi identifikaator @et
toolkit label: kollektívágens-azonosító: @hu
toolkit label: yhteistoimijan tunniste
toolkit label: αναγνωριστικό για συλλογικό φορέα @el
toolkit label: معرِّف لوكيل جماعي @ar
toolkit label: 集体行为者的标识符 @zh-hans
has subproperty: yhteisön tunniste
has subproperty: suvun tunniste
has subproperty: P50384
lexical alias: identifierForCollectiveAgent.en
status: Published
type: Property
domain: C10011
label: a pour identifiant d’agent collectif @fr
label: grupas identifikators @lv
label: ha come identificatore di agente collettivo @it
label: har identifikator for kollektiv agent @da
label: has identifier for collective agent @en
label: hat Identifikator für einen gemeinschaftlichen Akteur @de
label: heeft identificatie voor collectieve actor @nl
label: kolektif temsilcinin tanımlayıcısı ile ilişkilidir @tr
label: kollektiivi identifikaator @et
label: kollektív ágens azonosítója a következő: @hu
label: té com a identificador d’agent col·lectiu @ca
label: έχει αναγνωριστικό για συλλογικό φορέα @el
label: له معرِّف لوكيل جماعي @ar
label: 有集体行为者的标识符 @zh-hans
sub property of: yhteistoimijan nimitys
sub property of: toimijan tunniste
definition: Correla un agente collettivo alla denominazione di un agente in linguaggio naturale che consiste di un codice, numero, o stringa, solitamente indipendente dal linguaggio naturale e dalle convenzioni sociali di denominazione, usati per identificare un agente collettivo. @it
definition: Hozzákapcsol egy kollektív ágenst egy nomenhez, egy kollektív ágens megnevezéséhez, amely egy kód, szám, vagy más típusú karakterláncból állból áll, amely általában független a természetes nyelvektől és a társadalmi névkonvencióktól, és egy kollektív ágens azonosítására használják. @hu
definition: Kolektif bir temsilciyi, bir kolektif temsilciyi tanımlamak için kullanılan, genellikle doğal dilden ve sosyal adlandırma kurallarından bağımsız olan bir kod, sayı veya başka bir dizeden oluşan bir kolektif temsilcinin tanımlayıcı adı olan bir isim ile ilişkilendirir. @tr
definition: Liittää yhteistoimijan nomeniin, joka on yhteistoimijan nimitys, joka koostuu koodista, luvusta tai muusta tavallisesti luonnollisesta kielestä ja yleisistä nimeämiskäytännöistä riippumattomasta merkkijonosta, jota käytetään yhteistoimijan identifiointiin.
definition: Met un agent collectif en relation avec un nomen qui est une appellation d’agent collectif consistant en un code, un nombre ou une autre chaîne, généralement indépendante du langage naturel et des conventions sociales de dénomination, utilisée pour identifier un agent collectif. @fr
definition: Relaciona un agent col·lectiu amb un nomen que és una apel·lació d’agent col·lectiu que consisteix en un codi, un número o una altra cadena, normalment independent del llenguatge natural i de les convencions lingüístiques socials, usada per identificar un agent col·lectiu. @ca
definition: Relateert een collectieve actor aan een nomen dat is een benaming van collectieve actor die bestaat uit een code, nummer of andere tekenreeks, meestal onafhankelijk van natuurlijke taal en gewoonlijke naamgevingsconventies, gebruikt om een collectieve actor te identificeren. @nl
definition: Relaterer en kollektiv agent til en betegnelse for kollektiv agent som består av en kode, et nummer eller annen streng, vanligvis uavhengig av naturlig språk og sosiale navnekonvensjoner, brukt for å identifisere en kollektiv agent. @no
definition: Relaterer en kollektiv agent til et nomen, som er en benævnelse på kollektiv agent, som består af en kode, nummer eller anden streng, ofte uafhængig af normalsprog og navngivningskonventioner, brugt til at identificere en kollektiv agent. @da
definition: Relates a collective agent to a nomen that is an appellation of collective agent that consists of a code, number, or other string, usually independent of natural language and social naming conventions, used to identify a collective agent. @en
definition: Sasaista grupu ar nomenu, kas ir grupas apzīmējums, kas sastāv no koda, skaitļa vai citas virknes, kas parasti ir neatkarīgs no dabiskas valodas vai sabiedrībā pieņemtām nosaukšanas tradīcijām, ko izmanto, lai identificētu grupu. @lv
definition: Seostab kollektiivi kollektiivi nimetusega, mis koosneb kollektiivi identifitseerivast koodist, numbrist või muust loomulikust keelest ja üldtuntud nimetamistavadest sõltumatust stringist. @et
definition: Setzt einen gemeinschaftlichen Akteur in Beziehung zu einer Bezeichnung für einen Akteur, die aus einem Code, einer Nummer oder einer anderen Zeichenkette besteht, der/die normalerweise nicht in natürlicher Sprache und unabhängig von den sozialen Benennungskonventionen ist und zur Identifizierung eines gemeinschaftlichen Akteurs verwendet wird. @de
definition: يربط وكيلا جماعيا بتسمية عبارة عن اسم وكيل جماعي يتكون من رمز، أو رقم، أو سلسلة تمثيلات أخرى، عادة ما تكون مختلفة عن اللغة الطبيعية وعن التسميات المتعارف عليها اجتماعيا، المستخدمة في تعريف وكيل جماعي. @ar
definition: 将一个集体行为者与作为一个由代码、数字、或其他字符串构成、通常独立于自然语言和社会命名惯例、用以标识一个集体行为者的集体行为者的称谓的命名关联起来。 @zh-hans

toimijan nimi
has element type: 3
toolkit definition: A nomen that is an appellation of agent in natural language and phrasing used in common discourse. @en
toolkit definition: Aģenta apzīmējums dabiskajā valodā, ko izmanto savstarpējā saziņā. @lv
toolkit definition: Doğal dilde ve ortak söylemde kullanılan ifadelerde temsilcin unvanı olan bir isim. @tr
toolkit definition: Een nomen dat is een benaming van actor in natuurlijke taal en formulering gebruikt in alledaags taalgebruik. @nl
toolkit definition: Egy nomen, amely egy ágens megnevezése természetes nyelven és közbeszédben használt kifejezéssel. @hu
toolkit definition: Eine Bezeichnung für einen Akteur in natürlicher Sprache und Ausdrucksweise, die beim normalen Sprechen und Schreiben verwendet wird. @de
toolkit definition: En betegnelse for agent på et naturlig språk og med frasering brukt i alminnelig diskurs. @no
toolkit definition: Nomen que és una apel·lació d’agent en llenguatge i frases naturals usada en el discurs comú. @ca
toolkit definition: Nomen qui est une appellation d’agent exprimée dans un langage et une formulation naturels et utilisée dans le langage courant. @fr
toolkit definition: Nomen, joka on toimijasta yleisessä diskurssissa käytetty nimitys, joka on luonnollisella kielellä ja luonnollisessa sanamuodossa.
toolkit definition: Nomen, som er en benævnelse på agent på normalsprog og med formuleringer, som bruges alment. @da
toolkit definition: Tegija nimetus loomulikus keeles ja sõnastuses, mida kasutatakse ühises diskursuses. @et
toolkit definition: تسمية الوكيل في اللغة الطبيعية وفي العبارات المستخدمة في الخطاب العام. @ar
toolkit definition: 作为用自然语言和普通话语措词表达的行为者的称谓的一个命名 @zh-hans
toolkit label: Name eines Akteurs @de
toolkit label: Temsilcinin adı @tr
toolkit label: aģenta vārds/nosaukums @lv
toolkit label: naam van actor @nl
toolkit label: name of agent @en
toolkit label: navn på agent @da
toolkit label: navn på agent @no
toolkit label: nom d’agent @ca
toolkit label: tegija nimi @et
toolkit label: toimijan nimi
toolkit label: ágensnév: @hu
toolkit label: όνομα του φορέα @el
toolkit label: اسم وكيل @ar
toolkit label: 行为者的名称 @zh-hans
has subproperty: henkilön nimi
has subproperty: yhteistoimijan nimi
has subproperty: toimijan ensisijainen nimi
has subproperty: toimijan varianttinimi
has subproperty: P50385
lexical alias: nameOfAgent.en
status: Published
type: Property
domain: C10002
label: a pour nom d’agent @fr
label: aģenta vārds/nosaukums @lv
label: har navn på agent @da
label: has name of agent @en
label: hat Namen eines Akteurs @de
label: heeft naam van actor @nl
label: tegija nimi @et
label: temsilcinin adı ile ilişkilidir @tr
label: té com a nom d’agent @ca
label: ágens neve a következő: @hu
label: έχει όνομα του φορέα @el
label: له اسم لوكيل @ar
label: 有行为者的名称 @zh-hans
sub property of: toimijan nimitys
sub property of: P00019
definition: Bir temsilciyi, doğal dilde ve ortak söylemde kullanılan ifadelerde temsilcinin unvanı olan bir isimle ilişkilendirir. @tr
definition: Hozzákapcsol egy ágenst egy nomenhez, amely egy kollektív ágens megnevezése természetes nyelven és közbeszédben használt kifejezéssel. @hu
definition: Liittää toimijan nomeniin, joka on luonnollisella kielellä ja sanamuodolla oleva, yleisessä diskurssissa käytetty nimitys toimijasta.
definition: Met un agent en relation avec un nomen qui est une appellation d’agent exprimée dans un langage et une formulation naturels et utilisée dans le langage courant. @fr
definition: Relaciona un agent amb un nomen que és una apel·lació d’agent en llenguatge i frases naturals usada en el discurs comú. @ca
definition: Relateert een actor aan een nomen dat is een benaming van actor in natuurlijke taal en formulering gebruikt in alledaags taalgebruik. @nl
definition: Relaterer en agent til en betegnelse for agent på et naturlig språk og med frasering brukt i alminnelig diskurs. @no
definition: Relaterer en agent til et nomen, som er en benævnelse på agent på normalsprog og med formuleringer, som bruges alment. @da
definition: Relates an agent to a nomen that is an appellation of agent in natural language and phrasing used in common discourse. @en
definition: Sasaista aģentu ar nomenu, kas ir aģenta apzīmējums dabiskajā valodā, ko izmanto savstarpējā saziņā. @lv
definition: Seostab tegija tegija nimetusega loomulikus keeles ja sõnastuses, mida kasutatakse ühises diskursuses. @et
definition: Setzt einen Akteur in Beziehung zu einer Bezeichnung für einen Akteur in natürlicher Sprache und Ausdrucksweise, die beim normalen Sprechen und Schreiben verwendet wird. @de
definition: يربط وكيلا بتسمية لوكيل في اللغة الطبيعية وفي العبارات المستخدمة في الخطاب العام. @ar
definition: 将一个行为者与作为用自然语言和普通话语措词表达的行为者的称谓的一个命名关联起来。 @zh-hans

yhteistoimijan nimi
has element type: 3
toolkit definition: A nomen that is an appellation of collective agent in natural language and phrasing used in common discourse. @en
toolkit definition: Doğal dilde ve ortak söylemde kullanılan ifadelerde kolektif temsilcinin unvanı olan bir isim. @tr
toolkit definition: Een nomen dat is een benaming van collectieve actor in natuurlijke taal en formulering gebruikt in alledaags taalgebruik. @nl
toolkit definition: Egy nomen, amely egy kollektív ágens megnevezése természetes nyelven és közbeszédben használt kifejezéssel. @hu
toolkit definition: Eine Bezeichnung für einen gemeinschaftlichen Akteur in natürlicher Sprache und Ausdrucksweise, die beim normalen Sprechen und Schreiben verwendet wird. @de
toolkit definition: En betegnelse for kollektiv agent på et naturlig språk og med frasering brukt i alminnelig diskurs. @no
toolkit definition: Grupas apzīmējums dabiskajā valodā, ko izmanto savstarpējā saziņā. @lv
toolkit definition: Kollektiivi nimetus loomulikus keeles ja sõnastuses, mida kasutatakse ühises diskursuses. @et
toolkit definition: Nomen que és una apel·lació d’agent col·lectiu en llenguatge i frases naturals usada en el discurs comú. @ca
toolkit definition: Nomen qui est une appellation d’agent collectif exprimée dans un langage et une formulation naturels et utilisée dans le langage courant. @fr
toolkit definition: Nomen, joka on yhteistoimijasta yleisessä diskurssissa käytetty nimitys, joka on luonnollisella kielellä ja luonnollisessa sanamuodossa.
toolkit definition: Nomen, som er en benævnelse på kollektiv agent på normalsprog og med formuleringer, som bruges alment. @da
toolkit definition: تسمية الوكيل الجماعي في اللغة الطبيعية وفي العبارات المستخدمة في الخطاب العام. @ar
toolkit definition: 作为用自然语言和普通话语措词表达的集体行为者的称谓的一个命名 @zh-hans
toolkit label: Kolektif temsilcinin adı @tr
toolkit label: Name eines gemeinschaftlichen Akteurs @de
toolkit label: grupas vārds/nosaukums @lv
toolkit label: kollektiivi nimi @et
toolkit label: kollektívágens-név: @hu
toolkit label: naam van collectieve actor @nl
toolkit label: name of collective agent @en
toolkit label: navn på kollektiv agent @da
toolkit label: nom d’agent collectif @fr
toolkit label: nom d’agent col·lectiu @ca
toolkit label: yhteistoimijan nimi
toolkit label: όνομα του συλλογικού φορέα @el
toolkit label: اسم وكيل جماعي @ar
toolkit label: 集体行为者的名称 @zh-hans
has subproperty: yhteisön nimi
has subproperty: suvun nimi
has subproperty: yhteistoimijan ensisijainen nimi
has subproperty: yhteistoimijan varianttinimi
has subproperty: P50386
lexical alias: nameOfCollectiveAgent.en
status: Published
type: Property
domain: C10011
label: a pour nom d’agent collectif @fr
label: grupas vārds/nosaukums @lv
label: har navn på kollektiv agent @da
label: has name of collective agent @en
label: hat Namen eines gemeinschaftlichen Akteurs @de
label: heeft naam van collectieve actor @nl
label: kolektif temsilcinin adı ile ilişkilidir @tr
label: kollektiivi nimi @et
label: kollektív ágens neve a következő: @hu
label: té com a nom d’agent col·lectiu @ca
label: έχει όνομα του συλλογικό φορέα @el
label: له اسم لوكيل جماعي @ar
label: 有集体行为者的名称 @zh-hans
sub property of: yhteistoimijan nimitys
sub property of: toimijan nimi
definition: Hozzákapcsol egy kollektív ágenst egy nomenhez, amely egy kollektív ágens megnevezése természetes nyelven és közbeszédben használt kifejezéssel. @hu
definition: Kolektif bir temsilciyi, bir kelime dağarcığı kodlama şemasından alınan veya bir dizi kodlama şeması kullanılarak oluşturulan, doğal dilde bir kolektif temsilcinin tanımlayıcı adı bir isim ile ilişkilendirir. @tr
definition: Liittää yhteistoimijan nomeniin, joka on luonnollisella kielellä ja sanamuodolla oleva, yleisessä diskurssissa käytetty nimitys yhteistoimijasta.
definition: Met un agent collectif en relation avec un nomen qui est une appellation d’agent collectif exprimée dans un langage et une formulation naturels et utilisée dans le langage courant. @fr
definition: Relaciona un agent col·lectiu amb un nomen que és una apel·lació d’agent col·lectiu en llenguatge i frases naturals usada en el discurs comú. @ca
definition: Relateert een collectieve actor aan een nomen dat is een benaming van collectieve actor in natuurlijke taal en formulering gebruikt in alledaags taalgebruik. @nl
definition: Relaterer en kollektiv agent til en betegnelse for kollektiv agent på et naturlig språk og med frasering brukt i alminnelig diskurs. @no
definition: Relaterer en kollektiv agent til et nomen, som er en benævnelse på kollektiv agent på normalsprog og med formuleringer, som bruges alment. @da
definition: Relates a collective agent to a nomen that is an appellation of collective agent in natural language and phrasing used in common discourse. @en
definition: Sasaista grupu ar nomenu, kas ir grupas apzīmējums dabiskajā valodā, ko izmanto savstarpējā saziņā. @lv
definition: Seostab kollektiivi kollektiivi nimetusega loomulikus keeles ja sõnastuses, mida kasutatakse ühises diskursuses. @et
definition: Setzt einen gemeinschaftlichen Akteur in Beziehung zu einer Bezeichnung für einen gemeinschaftlichen Akteur in natürlicher Sprache und Ausdrucksweise, die beim normalen Sprechen und Schreiben verwendet wird. @de
definition: يربط وكيلا جماعيا بتسمية وكيل جماعي في اللغة الطبيعية وفي العبارات المستخدمة في الخطاب العام. @ar
definition: 将一个集体行为者与作为用自然语言和普通话语措词表达的集体行为者的称谓的一个命名关联起来。 @zh-hans

toimijan toiminta-ala
has element type: 5
toolkit definition: A field of endeavor, area of expertise, etc., in which an agent is engaged. @en
toolkit definition: Ala, jolla toimija toimii tai on toiminut, tai jonka asiantuntija tms. hän on.
toolkit definition: Aģenta darbības joma, kurā tas iesaistīts. @lv
toolkit definition: Bir temsilcinin dahil olduğu bir uğraş, uzmanlık alanı vb. @tr
toolkit definition: Camp d’acció, àrea d’experiència, etc., al qual es dedica un agent. @ca
toolkit definition: Campo di impegno, area di competenza, etc. in cui un agente è impegnato. @it
toolkit definition: Champ d’activité, domaine d’expertise, etc. dans lequel un agent évolue. @fr
toolkit definition: Een veld van inspanning, vakgebied etc. waarbij een actor betrokken is. @nl
toolkit definition: Egy tevékenység, szakterület, illetékességi, stb. terület, amely iránt az ágens elkötelezett. @hu
toolkit definition: Ein Tätigkeitsfeld, ein Wissensgebiet und so weiter, in dem ein Akteur aktiv ist. @de
toolkit definition: Et arbeidsfelt, et ekspertiseområde, etc., som en agent er involvert i. @no
toolkit definition: Indsatsområde, ekspertiseområde osv., inden for hvilket en agent er engageret. @da
toolkit definition: Tegevus- või eriala, millega tegija tegeleb või on tegelnud. @et
toolkit definition: مجال العمل والخبرة، الخ، الذي يمارسه الوكيل. @ar
toolkit definition: 一个行为者所从事的努力领域、专业范围等 @zh-hans
toolkit label: Betätigungsfeld eines Akteurs @de
toolkit label: aģenta darbības joma @lv
toolkit label: camp d’activitat d’un agent @ca
toolkit label: campo di attività di agente @it
toolkit label: domaine d’activité d’un agent @fr
toolkit label: field of activity of agent @en
toolkit label: tegija tegevusala @et
toolkit label: temsilcinin faaliyet alanı @tr
toolkit label: toimijan toiminta-ala
toolkit label: veld van activiteit van actor @nl
toolkit label: virkefelt for agent @da
toolkit label: virksomhetsområde for agent @no
toolkit label: ágens tevékenységi köre: @hu
toolkit label: πεδίο δραστηριοποίησης του φορέα @el
toolkit label: له مجال نشاط وكيل @ar
toolkit label: 行为者的活跃领域 @zh-hans
has subproperty: henkilön toiminta-ala
has subproperty: yhteistoimijan toiminta-ala
has subproperty: P50387
lexical alias: fieldOfActivityOfAgent.en
status: Published
type: Property
domain: C10002
label: a pour domaine d’activité d’un agent @fr
label: aģenta darbības joma @lv
label: ha come campo di attività di agente @it
label: har virkefelt for agent @da
label: har virksomhetsområde for agent @no
label: has field of activity of agent @en
label: hat Betätigungsfeld eines Akteurs @de
label: heeft veld van activiteit van actor @nl
label: tegija tegevusala @et
label: temsilcinin faaliyet alanı ile ilişkilidir @tr
label: té com a camp d’activitat d’un agent @ca
label: ágens tevékenységi köre a következő: @hu
label: έχει πεδίο δραστηριοποίησης του φορέα @el
label: له مجال نشاط وكيل @ar
label: 有行为者的活跃领域 @zh-hans
definition: Bir temsilciyi, bir temsilcinin dahil olduğu bir uğraş, çalışma alanı vb. ile ilişkilendirir. @tr
definition: Correla un agente a un campo di impegno, area di competenza, etc. in cui un agente è impegnato. @it
definition: Hozzákapcsol egy ágenst egy tevékenységhez, szakterülethez, illetékességi, stb. területhez, amely iránt az ágens elkötelezett. @hu
definition: Liittää toimijan alaan, jolla toimija toimii tai on toiminut, tai jonka asiantuntija tms. hän on.
definition: Met un agent en relation avec un champ d’activité, domaine d’expertise, etc. dans lequel un agent évolue. @fr
definition: Relaciona un agent amb un camp d’acció, àrea d’experiència, etc., al qual es dedica un agent. @ca
definition: Relateert een actor aan een veld van inspanning, vakgebied etc. waarbij een actor betrokken is. @nl
definition: Relaterer en agent til et arbeidsfelt, et ekspertiseområde, etc., som en agent er involvert i. @no
definition: Relaterer en agent til et indsatsområde, ekspertiseområde osv., inden for hvilket en agent er engageret. @da
definition: Relates an agent to a field of endeavor, area of expertise, etc., in which an agent is engaged. @en
definition: Sasaista aģentu ar aģenta darbības jomu, kurā tas iesaistīts. @lv
definition: Seostab tegija tegevus- või erialaga, millega tegija tegeleb või on tegelnud. @et
definition: Setzt einen Akteur in Beziehung zu einem Tätigkeitsfeld, einem Wissensgebiet und so weiter, in dem ein Akteur aktiv ist. @de
definition: يربط وكيلا بمجال العمل والخبرة، الخ، الذي يمارسه الوكيل @ar
definition: 将一个行为者与一个行为者所从事的努力领域、专业范围等关联起来。 @zh-hans

yhteistoimijan toiminta-ala
has element type: 5
toolkit definition: A field of endeavor, area of expertise, etc., in which a collective agent is engaged. @en
toolkit definition: Ala, jolla yhteishenkilö toimii tai on toiminut, tai jonka asiantuntija tms. se on.
toolkit definition: Bir kolektif temsilcinin dahil olduğu bir uğraş, uzmanlık alanı vb. @tr
toolkit definition: Camp d’acció, àrea d’experiència, etc., al qual es dedica un agent col·lectiu. @ca
toolkit definition: Campo di impegno, area di competenza, etc. in cui un agente collettivo è impegnato. @it
toolkit definition: Champ d’activité, domaine d’expertise, etc. dans lequel un agent collectif évolue. @fr
toolkit definition: Een veld van inspanning, vakgebied etc. waarbij een collectieve actor betrokken is. @nl
toolkit definition: Egy tevékenység, szakterület, illetékességi, stb. terület, amely iránt a kollektív ágens elkötelezett. @hu
toolkit definition: Ein Tätigkeitsfeld, ein Wissensgebiet und so weiter, in dem ein gemeinschaftlicher Akteur aktiv ist. @de
toolkit definition: Et arbeidsfelt, et ekspertiseområde, etc., som en kollektiv agent er involvert i. @no
toolkit definition: Grupas darbības joma, kurā tā iesaistīta. @lv
toolkit definition: Indsatsområde, ekspertiseområde osv., inden for hvilket en kollektiv agent er engageret. @da
toolkit definition: Tegevus- või eriala, millega kollektiiv tegeleb või on tegelnud. @et
toolkit definition: مجال العمل والخبرة، الخ، الذي يمارسه الوكيل الجماعي. @ar
toolkit definition: 一个集体行为者所从事的努力领域、专业范围等 @zh-hans
toolkit label: Betätigungsfeld eines gemeinschaftlichen Akteurs @de
toolkit label: camp d’activitat d’un agent col·lectiu @ca
toolkit label: campo di attività di agente collettivo @it
toolkit label: domaine d’activité d’un agent collectif @fr
toolkit label: field of activity of collective agent @en
toolkit label: grupas darbības joma @lv
toolkit label: kolektif temsilcinin faaliyet alanı @tr
toolkit label: kollektiivi tegevusala @et
toolkit label: kollektív ágens tevékenységi köre: @hu
toolkit label: veld van activiteit van collectieve actor @nl
toolkit label: virkefelt for kollektiv agent @da
toolkit label: virksomhetsområde for kollektiv agent @no
toolkit label: yhteistoimijan toiminta-ala
toolkit label: πεδίο δραστηριοποίησης του συλλογικού φορέα @el
toolkit label: مجال نشاط وكيل جماعي @ar
toolkit label: 集体行为者的活跃领域 @zh-hans
has subproperty: yhteisön toiminta-ala
has subproperty: suvun toiminta-ala
has subproperty: P50388
lexical alias: fieldOfActivityOfCollectiveAgent.en
status: Published
type: Property
domain: C10011
label: a pour domaine d’activité d’un agent collectif @fr
label: grupas darbības joma @lv
label: ha come campo di attività di agente collettivo @it
label: har virkefelt for kollektiv agent @da
label: har virksomhetsområde for kollektiv agent @no
label: has field of activity of collective agent @en
label: hat Betätigungsfeld eines gemeinschaftlichen Akteurs @de
label: heeft veld van activiteit van collectieve actor @nl
label: kolektif temsilcinin faaliyet alanı ile ilişkilidir @tr
label: kollektiivi tegevusala @et
label: kollektív ágens tevékenységi köre a következő: @hu
label: té com a camp d’activitat d’un agent col·lectiu @ca
label: έχει πεδίο δραστηριοποίησης του συλλογικού φορέα @el
label: له مجال نشاط وكيل جماعي @ar
label: 有集体行为者的活跃领域 @zh-hans
sub property of: toimijan toiminta-ala
definition: Correla un agente collettivo a un campo di impegno, area di competenza, etc. in cui un agente collettivo è impegnato. @it
definition: Hozzákapcsol egy kollektív ágenst egy tevékenységhez, szakterülethez, illetékességi, stb. területhez, amely iránt a kollektív ágens elkötelezett. @hu
definition: Kolektif bir temsilciyi, bir kolektif temsilcinin dahil olduğu bir çalışma alanı, uzmanlık alanı vb. ile ilişkilendirir. @tr
definition: Liittää yheistoimijan alaan, jolla yhteishenkilö toimii tai on toiminut, tai jonka asiantuntija tms. se on.
definition: Met un agent collectif en relation avec un champ d’activité, domaine d’expertise, etc. dans lequel un agent collectif évolue. @fr
definition: Relaciona un agent col·lectiu amb un camp d’acció, àrea d’experiència, etc., al qual es dedica un agent col·lectiu. @ca
definition: Relateert een collectieve actor aan een veld van inspanning, vakgebied etc. waarbij een collectieve actor betrokken is. @nl
definition: Relaterer en kollektiv agent til et arbeidsfelt, et ekspertiseområde, etc., som en kollektiv agent er involvert i. @no
definition: Relaterer en kollektiv agent til et indsatsområde, ekspertiseområde osv., inden for hvilket en kollektiv agent er engageret. @da
definition: Relates a collective agent to a field of endeavor, area of expertise, etc., in which a collective agent is engaged. @en
definition: Sasaista grupu ar grupas darbības jomu, kurā tā iesaistīta. @lv
definition: Seostab kollektiivi tegevus- või erialaga, millega kollektiiv tegeleb või on tegelnud. @et
definition: Setzt einen gemeinschaftlichen Akteur in Beziehung zu einem Tätigkeitsfeld, einem Wissensgebiet und so weiter, in dem ein gemeinschaftlicher Akteur aktiv ist. @de
definition: يربط وكيلا جماعيا بمجال العمل والخبرة، الخ، الذي يمارسه الوكيل الجماعي. @ar
definition: 将一个集体行为者与一个集体行为者所从事的努力领域、专业范围等关联起来。 @zh-hans

suvun toiminta-ala
has element type: 5
toolkit definition: A field of endeavor, area of expertise, etc., in which a family is engaged. @en
toolkit definition: Ala, jolla suku toimii tai on toiminut, tai jonka asiantuntija tms. se on.
toolkit definition: Bir ailenin dahil olduğu bir uğraş, uzmanlık alanı vb. @tr
toolkit definition: Camp d’acció, àrea d’experiència, etc., al qual es dedica una família. @ca
toolkit definition: Campo di impegno, area di competenza, etc. in cui una famiglia è impegnata. @it
toolkit definition: Champ d’activité, domaine d’expertise, etc. dans lequel une famille évolue. @fr
toolkit definition: Dzimtas/ģimenes darbības joma, kurā tā iesaistīta. @lv
toolkit definition: Een veld van inspanning, vakgebied etc. waarbij een familie betrokken is. @nl
toolkit definition: Egy tevékenység, szakterület, illetékességi, stb. terület, amely iránt a család elkötelezett. @hu
toolkit definition: Ein Tätigkeitsfeld, ein Wissensgebiet und so weiter, in dem eine Familie aktiv ist. @de
toolkit definition: Et arbeidsfelt, et ekspertiseområde, etc., som en familie er involvert i. @no
toolkit definition: Indsatsområde, ekspertiseområde osv., inden for hvilket en familie er engageret. @da
toolkit definition: Tegevus- või eriala, millega perekond tegeleb või on tegelnud. @et
toolkit definition: مجال العمل والخبرة، الخ، الذي تمارسه العائلة. @ar
toolkit definition: 一个家族所从事的努力领域、专业范围等 @zh-hans
toolkit label: Betätigungsfeld einer Familie @de
toolkit label: ailenin faaliyet alanı @tr
toolkit label: camp d’activitat d’una família @ca
toolkit label: campo di attività di famiglia @it
toolkit label: család tevékenységi köre: @hu
toolkit label: domaine d’activité d’une famille @fr
toolkit label: dzimtas/ģimenes darbības joma @lv
toolkit label: field of activity of family @en
toolkit label: perekonna tegevusala @et
toolkit label: suvun toiminta-ala
toolkit label: veld van activiteit van familie @nl
toolkit label: virkefelt for familie @da
toolkit label: virksomhetsområde for familie @no
toolkit label: πεδίο δραστηριοποίησης της οικογένειας @el
toolkit label: مجال نشاط عائلة @ar
toolkit label: 家族的活动领域 @zh-hans
has subproperty: P50389
lexical alias: fieldOfActivityOfFamily.en
status: Published
type: Property
domain: C10008
label: a pour domaine d’activité d’une famille @fr
label: ailenin faaliyet alanı ile ilişkilidir @tr
label: család tevékenységi köre a következő: @hu
label: dzimtas/ģimenes darbības joma @lv
label: ha come campo di impegno di famiglia @it
label: har virkefelt for familie @da
label: har virksomhetsområde for familie @no
label: has field of activity of family @en
label: hat Betätigungsfeld einer Familie @de
label: heeft veld van activiteit van familie @nl
label: perekonna tegevusala @et
label: té com a camp d’activitat d’una família @ca
label: έχει πεδίο δραστηριοποίησης της οικογένειας @el
label: له مجال نشاط عائلة @ar
label: 有家族的活动领域 @zh-hans
sub property of: yhteistoimijan toiminta-ala
definition: Bir aileyi, bir ailenin dahil olduğu bir uğraş, uzmanlık alanı vb. ile ilişkilendirir. @tr
definition: Correla una famiglia a un campo di impegno, area di competenza, etc. in cui una famiglia è impegnata. @it
definition: Hozzákapcsol egy családot egy tevékenységhez, szakterülethez, illetékességi, felelősségi, joghatósági, stb. területhez, amely iránt a család elkötelezett. @hu
definition: Liittää suvun alaan, jolla suku toimii tai on toiminut, tai jonka asiantuntija tms. se on.
definition: Met une famille en relation avec un champ d’activité, domaine d’expertise, etc. dans lequel une famille évolue. @fr
definition: Relaciona una família amb un camp d’acció, àrea d’experiència, etc., al qual es dedica una família. @ca
definition: Relateert een familie aan een veld van inspanning, vakgebied etc. waarbij een familie betrokken is. @nl
definition: Relaterer en familie til et arbeidsfelt, et ekspertiseområde, etc., som en familie er involvert i. @no
definition: Relaterer en familie til et indsatsområde, ekspertiseområde osv., inden for hvilket en familie er engageret. @da
definition: Relates a family to a field of endeavor, area of expertise, etc., in which a family is engaged. @en
definition: Sasaista dzimtu/ģimeni ar dzimtas/ģimenes darbības jomu, kurā tā iesaistīta. @lv
definition: Seostab perekonna tegevus- või erialaga, millega perekond tegeleb või on tegelnud. @et
definition: Setzt eine Familie in Beziehung zu einem Tätigkeitsfeld, einem Wissensgebiet und so weiter, in dem eine Familie aktiv ist. @de
definition: يربط عائلة بمجال العمل والخبرة، الخ، الذي تمارسه العائلة. @ar
definition: 将一个家族与一个家族所从事的努力领域、专业范围等关联起来。 @zh-hans

huomautus toimijasta
has element type: 6
toolkit definition: A broad unstructured description of one or more attributes of an agent. @en
toolkit definition: Ampia descrizione non strutturata di uno o più attributi di un agente collettivo. @it
toolkit definition: Bir temsilcinin bir veya daha fazla niteliğinin yapılandırılmamış geniş tanımı. @tr
toolkit definition: Bred ustruktureret beskrivelse af en eller flere af en agents attributter. @da
toolkit definition: Descripció no estructurada àmplia d’un o més atributs d’un agent. @ca
toolkit definition: Description non structurée générale d’un ou plusieurs attributs d’un agent. @fr
toolkit definition: Een algemene ongestructureerde beschrijving van één of meer attributen van een actor. @nl
toolkit definition: Egy ágens egy vagy több ismérvének átfogó strukturálatlan leírása. @hu
toolkit definition: Eine umfassende, unstrukturierte Beschreibung eines Merkmals oder mehrerer Merkmale eines Akteurs. @de
toolkit definition: En bred ustrukturert beskrivelse av ett eller flere attributter for en agent. @no
toolkit definition: Plašs nestrukturēts aģenta viena vai vairāku atribūtu apraksts. @lv
toolkit definition: Yhden tai useamman attribuutin laaja rakenteistamaton toimijaa koskeva kuvailu.
toolkit definition: Üldine struktureerimata kirjeldus, mis iseloomustab üht või mitut tegija omadust. @et
toolkit definition: وصف عام غير محدد لسمة أو أكثر من سمات الوكيل. @ar
toolkit definition: 一个行为者的一个或多个属性的宽泛的、非结构化的描述 @zh-hans
toolkit label: Anmerkung zum Akteur @de
toolkit label: Temsilci notu @tr
toolkit label: huomautus toimijasta
toolkit label: märkus tegija kohta @et
toolkit label: noot bij actor @nl
toolkit label: nota sobre un agent @ca
toolkit label: nota su agente @it
toolkit label: note for agent @no
toolkit label: note om agent @da
toolkit label: note on agent @en
toolkit label: note sur un agent @fr
toolkit label: piezīme par aģentu @lv
toolkit label: ágensre vonatkozó megjegyzése: @hu
toolkit label: σημείωση στον φορέα @el
toolkit label: تبصرة عن وكيل @ar
toolkit label: 关于行为者的附注 @zh-hans
has subproperty: huomautus yhteistoimijasta
has subproperty: huomautus henkilöstä
has subproperty: P50391
lexical alias: noteOnAgent.en
status: Published
type: Property
domain: C10002
label: a pour note sur un agent @fr
label: ha come nota su agente @it
label: har note for agent @no
label: har note om agent @da
label: has note on agent @en
label: hat Anmerkung zum Akteur @de
label: heeft noot bij actor @nl
label: märkus tegija kohta @et
label: piezīme par aģentu @lv
label: temsilci hakkında not ile ilişkilidir @tr
label: té com a nota sobre un agent @ca
label: ágensre vonatkozó megjegyzés a következő: @hu
label: έχει σημείωση στον φορέα @el
label: له تبصرة عن وكيل @ar
label: 有关于行为者的附注 @zh-hans
sub property of: P00015
definition: Bir temsilciyi, bir temsilcinin bir veya daha fazla özelliğinin yapılandırılmamış geniş bir tanımıyla ilişkilendirir. @tr
definition: Correla un agente a un'ampia descrizione non strutturata di uno o più attributi di un agente. @it
definition: Hozzákapcsol egy ágenst az ágens egy vagy több ismérvének átfogó strukturálatlan leírásához. @hu
definition: Liittää toimijan yhden tai useamman attribuutin laajaan rakenteistamattomaan toimijaa koskevaan kuvailuun.
definition: Met un agent en relation avec une description non structurée générale d’un ou plusieurs attributs d’un agent. @fr
definition: Relaciona un agent amb una descripció no estructurada àmplia d’un o més atributs d’un agent. @ca
definition: Relateert een actor aan een ruime ongestructureerde beschrijving van één of meer attributen van een actor. @nl
definition: Relaterer en agent til en bred ustruktureret beskrivelse af en eller flere af en agents attributter. @da
definition: Relaterer en agent til en bred ustrukturert beskrivelse av ett eller flere attributter for en agent. @no
definition: Relates an agent to a broad unstructured description of one or more attributes of an agent. @en
definition: Sasaista aģentu ar plašu nestrukturētu aģenta viena vai vairāku atribūtu aprakstu. @lv
definition: Seostab tegija üldise struktureerimata kirjeldusega, mis iseloomustab üht või mitut tegija omadust. @et
definition: Setzt einen Akteur in Beziehung zu einer umfassenden, unstrukturierten Beschreibung eines Merkmals oder mehrerer Merkmale eines Akteurs. @de
definition: يربط وكيلا بوصف عام غير محدد لسمة أو أكثر من سمات وكيل. @ar
definition: 将一个行为者与一个行为者的一个或多个属性的宽泛的、非结构化的描述关联起来。 @zh-hans

huomautus yhteistoimijasta
has element type: 6
toolkit definition: A broad unstructured description of one or more attributes of a collective agent. @en
toolkit definition: Ampia descrizione non strutturata di uno o più attributi di un agente collettivo. @it
toolkit definition: Bir kolektif temsilcinin bir veya daha fazla niteliğinin yapılandırılmamış geniş tanımı. @tr
toolkit definition: Bred ustruktureret beskrivelse af en eller flere af en kollektiv agents attributter. @da
toolkit definition: Descripció no estructurada àmplia d’un o més atributs d’un agent col·lectiu. @ca
toolkit definition: Description non structurée générale d’un ou plusieurs attributs d’un agent collectif. @fr
toolkit definition: Een algemene ongestructureerde beschrijving van één of meer attributen van een collectieve actor. @nl
toolkit definition: Egy kollektív ágens egy vagy több ismérvének átfogó strukturálatlan leírása. @hu
toolkit definition: Eine umfassende, unstrukturierte Beschreibung eines Merkmals oder mehrerer Merkmale eines gemeinschaftlichen Akteurs. @de
toolkit definition: En bred ustrukturert beskrivelse av ett eller flere attributter for en kollektiv agent. @no
toolkit definition: Plašs nestrukturēts grupas viena vai vairāku atribūtu apraksts. @lv
toolkit definition: Yhden tai useamman attribuutin laaja rakenteistamaton yhteistoimijaa koskeva kuvailu.
toolkit definition: Üldine struktureerimata kirjeldus, mis iseloomustab üht või mitut kollektiivi omadust. @et
toolkit definition: وصف عام غير محدد لسمة أو أكثر من سمات الوكيل الجماعي. @ar
toolkit definition: 一个集体行为者的一个或多个属性的宽泛的、非结构化的描述 @zh-hans
toolkit label: Anmerkung zum gemeinschaftlichen Akteur @de
toolkit label: Kolektif temsilci hakkında not @tr
toolkit label: huomautus yhteistoimijasta
toolkit label: kollektív ágensre vonatkozó megjegyzése: @hu
toolkit label: märkus kollektiivi kohta @et
toolkit label: noot bij collectieve actor @nl
toolkit label: nota sobre un agent col·lectiu @ca
toolkit label: nota su agente collettivo @it
toolkit label: note for kollektiv agent @no
toolkit label: note om kollektiv agent @da
toolkit label: note on collective agent @en
toolkit label: note sur un agent collectif @fr
toolkit label: piezīme par grupu @lv
toolkit label: σημείωση στον συλλογικό φορέα @el
toolkit label: تبصرة عن وكيل جماعي @ar
toolkit label: 关于集体行为者的附注 @zh-hans
has subproperty: huomautus yhteisöstä
has subproperty: huomautus suvusta
has subproperty: P50392
lexical alias: noteOnCollectiveAgent.en
status: Published
type: Property
domain: C10011
label: a pour note sur un agent collectif @fr
label: ha come nota su agente collettivo @it
label: har note for kollektiv agent @no
label: har note om kollektiv agent @da
label: has note on collective agent @en
label: hat Anmerkung zum gemeinschaftlichen Akteur @de
label: heeft noot bij collectieve actor @nl
label: kolektif temsilci hakkında not ile ilişkilidir @tr
label: kollektív ágensre vonatkozó megjegyzése a következő: @hu
label: märkus kollektiivi kohta @et
label: piezīme par grupu @lv
label: té com a nota sobre un agent col·lectiu @ca
label: έχει σημείωση στον συλλογικό φορέα @el
label: له تبصرة عن وكيل جماعي @ar
label: 有关于集体行为者的附注 @zh-hans
sub property of: huomautus toimijasta
definition: Correla un agente collettivo a un'ampia descrizione non strutturata di uno o più attributi di un agente collettivo. @it
definition: Hozzákapcsol egy kollektív ágenst a kollektív ágens egy vagy több ismérvének átfogó strukturálatlan leírásához. @hu
definition: Kolektif bir temsilciyi, kolektif temsilcinin bir veya daha fazla özelliğinin geniş yapılandırılmamış tanımlamasıyla ilişkilendirir. @tr
definition: Liittää yhteistoimijan yhden tai useamman attribuutin laajaan rakenteistamattomaan yhteistoimijaa koskevaan kuvailuun.
definition: Met un agent collectif en relation avec une description non structurée générale d’un ou plusieurs attributs d’un agent collectif. @fr
definition: Relaciona un agent col·lectiu amb una descripció no estructurada àmplia d’un o més atributs d’un agent col·lectiu. @ca
definition: Relateert een collectieve actor aan een ruime ongestructureerde beschrijving van één of meer attributen van een collectieve actor. @nl
definition: Relaterer en kollektiv agent til en bred ustruktureret beskrivelse af en eller flere af en kollektiv agents attributter. @da
definition: Relaterer en kollektiv agent til en bred ustrukturert beskrivelse av ett eller flere attributter for en kollektiv agent. @no
definition: Relates a collective agent to a broad unstructured description of one or more attributes of a collective agent. @en
definition: Sasaista grupu ar plašu nestrukturētu grupas viena vai vairāku atribūtu aprakstu. @lv
definition: Seostab kollektiivi üldise struktureerimata kirjeldusega, mis iseloomustab üht või mitut kollektiivi omadust. @et
definition: Setzt einen gemeinschaftlichen Akteur in Beziehung zu einer umfassenden, unstrukturierten Beschreibung eines Merkmals oder mehrerer Merkmale eines gemeinschaftlichen Akteurs. @de
definition: يربط وكيلا جماعيا بوصف عام غير محدد لسمة أو أكثر من سمات وكيل جماعي. @ar
definition: 将一个集体行为者与一个集体行为者的一个或多个属性的宽泛的、非结构化的描述关联起来。 @zh-hans

huomautus yhteisöstä
has element type: 6
toolkit definition: A broad unstructured description of one or more attributes of a corporate body. @en
toolkit definition: Ampia descrizione non strutturata di uno o più attributi di un ente. @it
toolkit definition: Bir tüzel kişinin bir veya daha fazla niteliğinin yapılandırılmamış geniş tanımı. @tr
toolkit definition: Bred ustruktureret beskrivelse af en eller flere af en korporations attributter. @da
toolkit definition: Descripció no estructurada àmplia d’un o més atributs d’una entitat corporativa. @ca
toolkit definition: Description non structurée générale d’un ou plusieurs attributs d’une collectivité. @fr
toolkit definition: Een algemene ongestructureerde beschrijving van één of meer attributen van een corporatie. @nl
toolkit definition: Egy testület egy vagy több ismérvének átfogó strukturálatlan leírása. @hu
toolkit definition: Eine umfassende, unstrukturierte Beschreibung eines Merkmals oder mehrerer Merkmale einer Körperschaft. @de
toolkit definition: En bred ustrukturert beskrivelse av ett eller flere attributter for en korporasjon. @no
toolkit definition: Plašs nestrukturēts institūcijas viena vai vairāku atribūtu apraksts. @lv
toolkit definition: Yhden tai useamman attribuutin laaja rakenteistamaton yhteisöä koskeva kuvailu.
toolkit definition: Üldine struktureerimata kirjeldus, mis iseloomustab üht või mitut asutuse omadust. @et
toolkit definition: وصف عام غير محدد لسمة أو أكثر من سمات الهيئة. @ar
toolkit definition: 一个团体的一个或多个属性的宽泛的、非结构化的描述 @zh-hans
toolkit label: Anmerkung zur Körperschaft @de
toolkit label: Tüzel kişi hakkında not @tr
toolkit label: huomautus yhteisöstä
toolkit label: märkus asutuse kohta @et
toolkit label: noot bij corporatie @nl
toolkit label: nota sobre una entitat corporativa @ca
toolkit label: nota su ente @it
toolkit label: note for korporasjon @no
toolkit label: note om korporation @da
toolkit label: note on corporate body @en
toolkit label: note sur une collectivité @fr
toolkit label: piezīme par institūciju @lv
toolkit label: testületre vonatkozó megjegyzése: @hu
toolkit label: σημείωση στο συλλογικό όργανο @el
toolkit label: تبصرة عن هيئة @ar
toolkit label: 关于团体的附注 @zh-hans
has subproperty: P50393
lexical alias: noteOnCorporateBody.en
status: Published
type: Property
domain: C10005
label: a pour note sur une collectivité @fr
label: ha come nota su ente @it
label: har note for korporasjon @no
label: har note om korporation @da
label: has note on corporate body @en
label: hat Anmerkung zur Körperschaft @de
label: heeft noot bij corporatie @nl
label: märkus asutuse kohta @et
label: piezīme par institūciju @lv
label: testületre vonatkozó megjegyzése a következő: @hu
label: té com a nota sobre una entitat corporativa @ca
label: tüzel kişi hakkında not ile ilişkilidir @tr
label: έχει σημείωση στο συλλογικό όργανο @el
label: له تبصرة عن هيئة @ar
label: 有关于团体的附注 @zh-hans
sub property of: huomautus yhteistoimijasta
definition: Bir tüzel kişiyi, bir tüzel kişinin bir veya daha fazla özelliğinin geniş yapılandırılmamış bir açıklamasıyla ilişkilendirir. @tr
definition: Correla un ente a un'ampia descrizione non strutturata di uno o più attributi di un ente. @it
definition: Hozzákapcsol testületet a testület egy vagy több ismérvének átfogó strukturálatlan leírásához. @hu
definition: Liittää yhteisön yhden tai useamman attribuutin laajaan rakenteistamattomaan yhteisöä koskevaan kuvailuun.
definition: Met une collectivité en relation avec une description non structurée générale d’un ou plusieurs attributs d’une collectivité. @fr
definition: Relaciona una entitat corporativa amb una descripció no estructurada àmplia d’un o més atributs d’una entitat corporativa. @ca
definition: Relateert een corporatie aan een ruime ongestructureerde beschrijving van één of meer attributen van een corporatie. @nl
definition: Relaterer en korporasjon til en bred ustrukturert beskrivelse av ett eller flere attributter for en korporasjon. @no
definition: Relaterer en korporation til en bred ustruktureret beskrivelse af en eller flere af en korporations attributter. @da
definition: Relates a corporate body to a broad unstructured description of one or more attributes of a corporate body. @en
definition: Sasaista institūciju ar plašu nestrukturētu institūcijas viena vai vairāku atribūtu aprakstu. @lv
definition: Seostab asutuse üldise struktureerimata kirjeldusega, mis iseloomustab üht või mitut asutuse omadust. @et
definition: Setzt eine Körperschaft in Beziehung zu einer umfassenden, unstrukturierten Beschreibung eines Merkmals oder mehrerer Merkmale einer Körperschaft. @de
definition: يربط هيئة بوصف عام غير محدد لسمة أو أكثر من سمات هيئة. @ar
definition: 将一个团体与一个团体的一个或多个属性的宽泛的、非结构化的描述关联起来。 @zh-hans

huomautus suvusta
has element type: 6
toolkit definition: A broad unstructured description of one or more attributes of a family. @en
toolkit definition: Ampia descrizione non strutturata di uno o più attributi di una famiglia. @it
toolkit definition: Bir grubun veya koleksiyonun bir veya daha fazla niteliğinin yapılandırılmamış geniş tanımı. @tr
toolkit definition: Bred ustruktureret beskrivelse af en eller flere af en families attributter. @da
toolkit definition: Descripció no estructurada àmplia d’un o més atributs d’una família. @ca
toolkit definition: Description non structurée générale d’un ou plusieurs attributs d’une famille. @fr
toolkit definition: Een algemene ongestructureerde beschrijving van één of meer attributen van een familie. @nl
toolkit definition: Egy család egy vagy több ismérvének átfogó strukturálatlan leírása. @hu
toolkit definition: Eine umfassende, unstrukturierte Beschreibung eines Merkmals oder mehrerer Merkmale einer Familie. @de
toolkit definition: En bred ustrukturert beskrivelse av ett eller flere attributter for en familie. @no
toolkit definition: Plašs nestrukturēts dzimtas/ģimenes viena vai vairāku atribūtu apraksts. @lv
toolkit definition: Yhden tai useamman attribuutin laaja rakenteistamaton sukua koskeva kuvailu.
toolkit definition: Üldine struktureerimata kirjeldus, mis iseloomustab üht või mitut perekonna omadust. @et
toolkit definition: وصف عام غير محدد لسمة أو أكثر من سمات عائلة. @ar
toolkit definition: 一个家族的一个或多个属性的宽泛的、非结构化的描述 @zh-hans
toolkit label: Aile hakında not @tr
toolkit label: Anmerkung zur Familie @de
toolkit label: családra vonatkozó megjegyzése: @hu
toolkit label: huomautus suvusta
toolkit label: märkus perekonna kohta @et
toolkit label: noot bij familie @nl
toolkit label: nota sobre una família @ca
toolkit label: nota su famiglia @it
toolkit label: note for familie @no
toolkit label: note om familie @da
toolkit label: note on family @en
toolkit label: note sur une famille @fr
toolkit label: piezīme par dzimtu/ģimeni @lv
toolkit label: σημείωση στην οικογένεια @el
toolkit label: تبصرة عن العائلة @ar
toolkit label: 关于家族的附注 @zh-hans
has subproperty: P50394
lexical alias: noteOnFamily.en
status: Published
type: Property
domain: C10008
label: a pour note sur une famille @fr
label: aile hakkında not ile ilişkilidir @tr
label: családra vonatkozó megjegyzés a következő: @hu
label: ha come nota su famiglia @it
label: har note for familie @no
label: har note om familie @da
label: has note on family @en
label: hat Anmerkung zur Familie @de
label: heeft noot bij familie @nl
label: märkus perekonna kohta @et
label: piezīme par dzimtu/ģimeni @lv
label: té com a nota sobre una família @ca
label: έχει σημείωση στην οικογένεια @el
label: لها تبصرة عن عائلة @ar
label: 有关于家族的附注 @zh-hans
sub property of: huomautus yhteistoimijasta
definition: Bir aileyi, bir ailenin bir veya daha fazla özelliğinin geniş yapılandırılmamış bir açıklamasıyla ilişkilendirir. @tr
definition: Correla una famiglia a un'ampia descrizione non strutturata di uno o più attributi di una famiglia. @it
definition: Hozzákapcsol egy családot egy család egy vagy több ismérvének átfogó strukturálatlan leírásához. @hu
definition: Liittää suvun yhden tai useamman attribuutin laajaan rakenteistamattomaan sukua koskevaan kuvailuun.
definition: Met une famille en relation avec une description non structurée générale d’un ou plusieurs attributs d’une famille. @fr
definition: Relaciona una família amb una descripció no estructurada àmplia d’un o més atributs d’una família. @ca
definition: Relateert een familie aan een ruime ongestructureerde beschrijving van één of meer attributen van een familie. @nl
definition: Relaterer en familie til en bred ustruktureret beskrivelse af en eller flere af en families attributter. @da
definition: Relaterer en familie til en bred ustrukturert beskrivelse av ett eller flere attributter for en familie. @no
definition: Relates a family to a broad unstructured description of one or more attributes of a family. @en
definition: Sasaista dzimtu/ģimeni ar plašu nestrukturētu dzimtas/ģimenes viena vai vairāku atribūtu aprakstu. @lv
definition: Seostab perekonna üldise struktureerimata kirjeldusega, mis iseloomustab üht või mitut perekonna omadust. @et
definition: Setzt eine Familie in Beziehung zu einer umfassenden, unstrukturierten Beschreibung eines Merkmals oder mehrerer Merkmale einer Familie. @de
definition: يربط عائلة بوصف عام غير محدد لسمة أو أكثر من سمات عائلة. @ar
definition: 将一个家族与一个家族的一个或多个属性的宽泛的、非结构化的描述关联起来。 @zh-hans

huomautus henkilöstä
has element type: 6
toolkit definition: A broad unstructured description of one or more attributes of a person. @en
toolkit definition: Ampia descrizione non strutturata di uno o più attributi di una persona. @it
toolkit definition: Bir kişinin bir veya daha fazla niteliğinin yapılandırılmamış geniş tanımı. @tr
toolkit definition: Bred ustruktureret beskrivelse af en eller flere af en persons attributter. @da
toolkit definition: Descripció no estructurada àmplia d’un o més atributs d’una persona. @ca
toolkit definition: Description non structurée générale d’un ou plusieurs attributs d’une personne. @fr
toolkit definition: Een algemene ongestructureerde beschrijving van één of meer attributen van een persoon. @nl
toolkit definition: Egy személy egy vagy több ismérvének átfogó strukturálatlan leírása. @hu
toolkit definition: Eine umfassende, unstrukturierte Beschreibung eines Merkmals oder mehrerer Merkmale einer Person. @de
toolkit definition: En bred ustrukturert beskrivelse av ett eller flere attributter for en person. @no
toolkit definition: Plašs nestrukturēts personas viena vai vairāku atribūtu apraksts. @lv
toolkit definition: Yhden tai useamman attribuutin laaja rakenteistamaton henkilöä koskeva kuvailu.
toolkit definition: Üldine struktureerimata kirjeldus, mis iseloomustab üht või mitut isiku omadust. @et
toolkit definition: وصف عام غير محدد لسمة أو أكثر من سمات شخص. @ar
toolkit definition: 一个个人的一个或多个属性的宽泛的、非结构化的描述 @zh-hans
toolkit label: Anmerkung zur Person @de
toolkit label: Kişi hakkında not @tr
toolkit label: huomautus henkilöstä
toolkit label: märkus isiku kohta @et
toolkit label: noot bij persoon @nl
toolkit label: nota sobre una persona @ca
toolkit label: nota su persona @it
toolkit label: note for person @no
toolkit label: note om person @da
toolkit label: note on person @en
toolkit label: note sur une personne @fr
toolkit label: piezīme par personu @lv
toolkit label: személyre vonatkozó megjegyzés: @hu
toolkit label: σημείωση στο φυσικό πρόσωπο @el
toolkit label: تبصرة عن شخص @ar
toolkit label: 关于个人的附注 @zh-hans
has subproperty: P50395
lexical alias: noteOnPerson.en
status: Published
type: Property
domain: C10004
label: a pour note sur une personne @fr
label: ha come nota su persona @it
label: har note for person @no
label: har note om person @da
label: has note on person @en
label: hat Anmerkung zur Person @de
label: heeft noot bij persoon @nl
label: kişi hakkında not ile ilişkilidir @tr
label: märkus isiku kohta @et
label: piezīme par personu @lv
label: személyre vonatkozó megjegyzés a következő: @hu
label: té com a nota sobre una persona @ca
label: έχει σημείωση στο φυσικό πρόσωπο @el
label: له تبصرة عن شخص @ar
label: 有关于个人的附注 @zh-hans
sub property of: huomautus toimijasta
definition: Bir kişiyi, bir kişinin bir veya daha fazla özelliğinin geniş yapılandırılmamış bir açıklamasıyla ilişkilendirir. @tr
definition: Correla una persona a un'ampia descrizione non strutturata di uno o più attributi di una persona. @it
definition: Hozzákapcsol egy személyt egy személy egy vagy több ismérvének átfogó strukturálatlan leírásához. @hu
definition: Liittää henkilön yhden tai useamman attribuutin laajaan rakenteistamattomaan henkilöä koskevaan kuvailuun.
definition: Met une personne en relation avec une description non structurée générale d’un ou plusieurs attributs d’une personne. @fr
definition: Relaciona una persona amb una descripció no estructurada àmplia d’un o més atributs d’una persona. @ca
definition: Relateert een persoon aan een ruime ongestructureerde beschrijving van één of meer attributen van een persoon. @nl
definition: Relaterer en person til en bred ustruktureret beskrivelse af en eller flere af en persons attributter. @da
definition: Relaterer en person til en bred ustrukturert beskrivelse av ett eller flere attributter for en person. @no
definition: Relates a person to a broad unstructured description of one or more attributes of a person. @en
definition: Sasaista personu ar plašu nestrukturētu personas viena vai vairāku atribūtu aprakstu. @lv
definition: Seostab isiku üldise struktureerimata kirjeldusega, mis iseloomustab üht või mitut isiku omadust. @et
definition: Setzt eine Person in Beziehung zu einer umfassenden, unstrukturierten Beschreibung eines Merkmals oder mehrerer Merkmale einer Person. @de
definition: يربط شخصا بوصف عام غير محدد لسمة أو أكثر من سمات شخص. @ar
definition: 将一个个人与一个个人的一个或多个属性的宽泛的、非结构化的描述关联起来。 @zh-hans

toimijan antama nomen
has element type: 2
toolkit definition: A nomen that is assigned to an entity by an agent. @en
toolkit definition: Bir temsilci tarafından bir varlığa atanan bir isim @tr
toolkit definition: Een nomen dat toegekend is aan een entiteit door een actor. @nl
toolkit definition: Egy nomen, amelyet egy ágens rendel hozzá egy entitáshoz. @hu
toolkit definition: Ein Nomen, das von einem Akteur einer Entität zugewiesen ist. @de
toolkit definition: Et nomen som er angitt til en entitet av en agent. @no
toolkit definition: Nomen assegnato a un'entità da un agente. @it
toolkit definition: Nomen que és assignat a una entitat per un agent. @ca
toolkit definition: Nomen qui est attribué à une entité par un agent. @fr
toolkit definition: Nomen, jonka toimija on antanut entiteetille.
toolkit definition: Nomen, mille tegija on määranud olemile. @et
toolkit definition: Nomen, som er angivet til en entitet af en agent. @da
toolkit definition: Nomens, kuru entītei piešķīris aģents @lv
toolkit definition: تسمية خصصها وكيل لكيان. @ar
toolkit definition: 被一个行为者分配给一个实体的一个命名 @zh-hans
toolkit label: Akteur als Zuweisende/Zuweisender von @de
toolkit label: Hozzákapcsol egy ágenst egy nomenhez, amelyet egy ágens rendel hozzá egy entitáshoz. @hu
toolkit label: agent assignador de @ca
toolkit label: agent attributeur de @fr
toolkit label: agent, som er angiver af @da
toolkit label: angivende agent for @no
toolkit label: assegnatore agente di @it
toolkit label: assigner agent of @en
toolkit label: atayan temsilci @tr
toolkit label: ir nomena piešķīrējs (aģents) @lv
toolkit label: tegija määratud nomen @et
toolkit label: toekenner-actor van @nl
toolkit label: toimijan antama nomen
toolkit label: εκχωρητής φορέας του @el
toolkit label: وكيل مُخصِّص @ar
toolkit label: ……的分配者行为者 @zh-hans
has subproperty: yhteistoimijan antama nomen
has subproperty: henkilön antama nomen
has subproperty: P50396
lexical alias: assignerAgentOf.en
status: Published
type: Property
domain: C10002
label: atayan temsilcisidir @tr
label: er agent, som er angiver af @da
label: er angivende agent for @no
label: est un agent attributeur de @fr
label: hozzárendelő ágense a következőnek: @hu
label: ir nomena piešķīrējs (aģents) @lv
label: is assigner agent of @en
label: is toekenner-actor van @nl
label: ist Akteur als Zuweisende/Zuweisender von @de
label: tegija määratud nomen @et
label: è assegnatore agente di @it
label: és agent assignador de @ca
label: είναι εκχωρητής φορέας του @el
label: هو وكيل مُخصِّص لـ @ar
label: 是……的分配者行为者 @zh-hans
sub property of: toimijaan liittyvä nomen
definition: Bir temsilciyi, temsilci tarafından varlığa atanan isimle ilişkilendirir. @tr
definition: Correla un agente a un nomen assegnato a un'entità da un agente. @it
definition: Liittää toimijan nomeniin, jonka toimija on antanut entiteetille.
definition: Met un agent en relation avec un nomen qui est attribué à une entité par un agent. @fr
definition: Relaciona un agent amb un nomen que és assignat a una entitat per un agent. @ca
definition: Relateert een actor aan een nomen dat toegekend is aan een entiteit door een actor. @nl
definition: Relaterer en agent til et nomen som er angitt til en entitet av en agent. @no
definition: Relaterer en agent til et nomen, som er angivet til en entitet af en agent. @da
definition: Relates an agent to a nomen that is assigned to an entity by an agent. @en
definition: Sasaista aģentu ar nomenu, kuru entītei piešķīris aģents. @lv
definition: Seostab tegija nomen'iga, mille tegija on määranud olemile. @et
definition: Setzt einen Akteur in Beziehung zu einem Nomen, das von einem Akteur einer Entität zugewiesen ist. @de
definition: hozzárendelő ágense: @hu
definition: يربط وكيلا بتسمية خصصها وكيل لكيان. @ar
definition: 将一个行为者与被一个行为者分配给一个实体的一个命名关联起来。 @zh-hans

yhteistoimijan antama nomen
has element type: 2
toolkit definition: A nomen that is assigned to an entity by a collective agent. @en
toolkit definition: Bir kolektif temsilci tarafından bir varlığa atanan bir isim @tr
toolkit definition: Een nomen dat toegekend is aan een entiteit door een collectieve actor. @nl
toolkit definition: Egy nomen, amelyet egy kollektív ágens rendel hozzá egy entitáshoz. @hu
toolkit definition: Ein Nomen, das von einem gemeinschaftlichen Akteur einer Entität zugewiesen ist. @de
toolkit definition: Et nomen som er angitt til en entitet av en kollektiv agent. @no
toolkit definition: Nomen assegnato a un'entità da un agente collettivo. @it
toolkit definition: Nomen que és assignat a una entitat per un agent col·lectiu. @ca
toolkit definition: Nomen qui est attribué à une entité par un agent collectif. @fr
toolkit definition: Nomen, jonka yhteistoimija on antanut entiteetille.
toolkit definition: Nomen, mille kollektiiv on määranud olemile. @et
toolkit definition: Nomen, som er angivet til en entitet af en kollektiv agent. @da
toolkit definition: Nomens, kuru entītei piešķir grupa @lv
toolkit definition: تسمية خصصها وكيل جماعي لكيان . @ar
toolkit definition: 被一个集体行为者分配给一个实体的一个命名 @zh-hans
toolkit label: Gemeinschaftlicher Akteur als Zuweisende/Zuweisender von @de
toolkit label: Hozzákapcsol egy kollektív ágenst egy nomenhez, amelyet egy kollektív ágens rendel hozzá egy entitáshoz. @hu
toolkit label: agent collectif attributeur de @fr
toolkit label: agent col·lectiu assignador de @ca
toolkit label: angivende kollektiv agent for @no
toolkit label: assegnatore agente collettivo di @it
toolkit label: assigner collective agent of @en
toolkit label: atayan kolektif temsilci @tr
toolkit label: ir nomena piešķīrējs (grupa) @lv
toolkit label: kollektiivi määratud nomen @et
toolkit label: kollektiv agent, som er angiver af @da
toolkit label: toekenner-collectieve actor van @nl
toolkit label: yhteistoimijan antama nomen
toolkit label: εκχωρητής συλλογικός φορέας του @el
toolkit label: وكيل جماعي مُخصِّص @ar
toolkit label: ……的分配者集体行为者 @zh-hans
has subproperty: yhteisön antama nomen
has subproperty: suvun antama nomen
has subproperty: P50397
lexical alias: assignerCollectiveAgentOf.en
status: Published
type: Property
domain: C10011
label: atayan kolektif temsilcisidir @tr
label: er angivende kollektiv agent for @no
label: er kollektiv agent, som er angiver af @da
label: est un agent collectif attributeur de @fr
label: hozzárendelő kollektív ágense a következőnek: @hu
label: ir nomena piešķīrējs (grupa) @lv
label: is assigner collective agent of @en
label: is toekenner-collectieve actor van @nl
label: ist gemeinschaftlicher Akteur als Zuweisende/Zuweisender von @de
label: kollektiivi määratud nomen @et
label: è assegnatore agente collettivo di @it
label: és agent col·lectiu assignador de @ca
label: είναι εκχωρητής συλλογικός φορέας του @el
label: هو وكيل جماعي مخصص لـ @ar
label: 是……的分配者集体行为者 @zh-hans
sub property of: yhteistoimijaan liittyvä nomen
sub property of: toimijan antama nomen
definition: Correla un agente collettivo a un nomen assegnato a un'entità da un agente collettivo. @it
definition: Kolektif bir temsilciyi, bir varlığa bir kolektif temsilci tarafından atanan bir isimle ilişkilendirir. @tr
definition: Liittää yhteistoimijan nomeniin, jonka yhteistoimija on antanut entiteetille.
definition: Met un agent collectif en relation avec un nomen qui est attribué à une entité par un agent collectif. @fr
definition: Relaciona un agent col·lectiu amb un nomen que és assignat a una entitat per un agent col·lectiu. @ca
definition: Relateert een collectieve actor aan een nomen dat toegekend is aan een entiteit door een collectieve actor. @nl
definition: Relaterer en kollektiv agent til et nomen som er angitt til en entitet av en kollektiv agent. @no
definition: Relaterer en kollektiv agent til et nomen, som er angivet til en entitet af en kollektiv agent. @da
definition: Relates a collective agent to a nomen that is assigned to an entity by a collective agent. @en
definition: Sasaista grupu ar nomenu, kuru entītei piešķir grupa. @lv
definition: Seostab kollektiivi nomen'iga, mille kollektiiv on määranud olemile. @et
definition: Setzt einen gemeinschaftlichen Akteur in Beziehung zu einem Nomen, das von einem gemeinschaftlichen Akteur einer Entität zugewiesen ist. @de
definition: hozzárendelő kollektív ágense: @hu
definition: يربط وكيلا جماعيا بتسمية خصصها وكيل جماعي لكيان. @ar
definition: 将一个集体行为者与被一个集体行为者分配给一个实体的一个命名关联起来。 @zh-hans

yhteisön antama nomen
has element type: 2
toolkit definition: A nomen that is assigned to an entity by a corporate body. @en
toolkit definition: Bir tüzel kişi tarafından bir varlığa atanan bir isim @tr
toolkit definition: Een nomen dat toegekend is aan een entiteit door een corporatie. @nl
toolkit definition: Egy nomen, amelyet egy testület rendel hozzá egy entitáshoz. @hu
toolkit definition: Ein Nomen, das von einer Körperschaft einer Entität zugewiesen ist. @de
toolkit definition: Et nomen som er angitt til en entitet av en korporasjon. @no
toolkit definition: Nomen assegnato a un'entità da un ente. @it
toolkit definition: Nomen que és assignat a una entitat per una entitat corporativa. @ca
toolkit definition: Nomen qui est attribué à une entité par une collectivité. @fr
toolkit definition: Nomen, jonka yhteisö on antanut entiteetille.
toolkit definition: Nomen, mille asutus on määranud olemile. @et
toolkit definition: Nomen, som er angivet til en entitet af en korporation. @da
toolkit definition: Nomens, kuru entītei piešķir institūcija. @lv
toolkit definition: تسمية خصصتها هيئة لكيان. @ar
toolkit definition: 被一个团体分配给一个实体的一个命名 @zh-hans
toolkit label: Hozzákapcsol egy testületet egy nomenhez, amelyet egy testület rendel hozzá egy entitáshoz. @hu
toolkit label: Körperschaft als Zuweisende/Zuweisender von @de
toolkit label: angivende korporasjon for @no
toolkit label: assegnatore ente di @it
toolkit label: assigner corporate body of @en
toolkit label: asutuse määratud nomen @et
toolkit label: atayan tüzel kişi @tr
toolkit label: collectivité attributrice de @fr
toolkit label: entitat corporativa assignadora de @ca
toolkit label: ir nomena piešķīrējs (institūcija) @lv
toolkit label: korporation, som er angiver af @da
toolkit label: toekenner-corporatie van @nl
toolkit label: yhteisön antama nomen
toolkit label: εκχωρητής συλλογικό όργανο του @el
toolkit label: هيئة مُخصِّصة @ar
toolkit label: ……的分配者团体 @zh-hans
has subproperty: P50398
lexical alias: assignerCorporateBodyOf.en
status: Published
type: Property
domain: C10005
label: asutuse määratud nomen @et
label: atayan tüzel kişisidir @tr
label: er angivende korporasjon for @no
label: er korporation, som er angiver af @da
label: est une collectivité attributrice de @fr
label: hozzárendelő testülete a következőnek: @hu
label: ir nomena piešķīrējs (institūcija) @lv
label: is assigner corporate body of @en
label: is toekenner-corporatie van @nl
label: ist Körperschaft als Zuweisende/Zuweisender von @de
label: è assegnatore ente di @it
label: és entitat corporativa assignadora de @ca
label: είναι εκχωρητής συλλογικό όργανο του @el
label: هي هيئة مُخصِّصة لـ @ar
label: 是……的分配者团体 @zh-hans
sub property of: yhteisöön liittyvä nomen
sub property of: yhteistoimijan antama nomen
definition: Bir tüzel kişiyi, bir varlığa bir tüzel kişi tarafından atanan bir isimle ilişkilendirir. @tr
definition: Correla un ente a un nomen assegnato a un'entità da un ente. @it
definition: Liittää yhteisön nomeniin, jonka yhteisö on antanut entiteetille.
definition: Met une collectivité en relation avec un nomen qui est attribué à une entité par une collectivité. @fr
definition: Relaciona una entitat corporativa amb un nomen que és assignat a una entitat per una entitat corporativa. @ca
definition: Relateert een corporatie aan een nomen dat toegekend is aan een entiteit door een corporatie. @nl
definition: Relaterer en korporasjon til et nomen som er angitt til en entitet av en korporasjon. @no
definition: Relaterer en korporation til et nomen, som er angivet til en entitet af en korporation. @da
definition: Relates a corporate body to a nomen that is assigned to an entity by a corporate body. @en
definition: Sasaista institūciju ar nomenu, kuru entītei piešķir institūcija. @lv
definition: Seostab asutuse nomen'iga, mille asutus on määranud olemile. @et
definition: Setzt eine Körperschaft in Beziehung zu einem Nomen, das von einer Körperschaft einer Entität zugewiesen ist. @de
definition: hozzárendelő testülete: @hu
definition: يربط هيئة بتسمية خصصتها هيئة لكيان. @ar
definition: 将一个团体与被一个团体分配给一个实体的一个命名关联起来。 @zh-hans

suvun antama nomen
has element type: 2
toolkit definition: A nomen that is assigned to an entity by a family. @en
toolkit definition: Bir aile tarafından bir varlığa atanan bir isim @tr
toolkit definition: Een nomen dat toegekend is aan een entiteit door een familie. @nl
toolkit definition: Egy nomen, amelyet egy család rendel hozzá egy entitáshoz. @hu
toolkit definition: Ein Nomen, das von einer Familie einer Entität zugewiesen ist. @de
toolkit definition: Et nomen som er angitt til en entitet av en familie. @no
toolkit definition: Nomen assegnato a un'entità da una famiglia. @it
toolkit definition: Nomen que és assignat a una entitat per una família. @ca
toolkit definition: Nomen qui est attribué à une entité par une famille. @fr
toolkit definition: Nomen, jonka suku on antanut entiteetille.
toolkit definition: Nomen, mille perekond on määranud olemile. @et
toolkit definition: Nomen, som er angivet til en entitet af en familie. @da
toolkit definition: Nomens, kuru entītei piešķir dzimta/ģimene. @lv
toolkit definition: تسمية خصصتها عائلة لكيان. @ar
toolkit definition: 被一个家族分配给一个实体的一个命名 @zh-hans
toolkit label: Familie als Zuweisende/Zuweisender von @de
toolkit label: Hozzákapcsol egy családot egy nomenhez, amelyet egy család rendel hozzá egy entitáshoz. @hu
toolkit label: angivende familie for @no
toolkit label: assegnatore famiglia di @it
toolkit label: assigner family of @en
toolkit label: atayan aile @tr
toolkit label: familie, som er angiver af @da
toolkit label: famille attributrice de @fr
toolkit label: família assignadora de @ca
toolkit label: ir nomena piešķīrējs (dzimta/ģimene) @lv
toolkit label: perekonna määratud nomen @et
toolkit label: suvun antama nomen
toolkit label: toekenner-familie van @nl
toolkit label: εκχωρητής οικογένεια του @el
toolkit label: عائلة مُخصِّصة @ar
toolkit label: ……的分配者家族 @zh-hans
has subproperty: P50399
lexical alias: assignerFamilyOf.en
status: Published
type: Property
domain: C10008
label: atayan ailesidir @tr
label: er angivende familie for @no
label: er familie, som er angiver af @da
label: est une famille attributrice de @fr
label: hozzárendelő családja a következőnek: @hu
label: ir nomena piešķīrējs (dzimta/ģimene) @lv
label: is assigner family of @en
label: is toekenner-familie van @nl
label: ist Familie als Zuweisende/Zuweisender von @de
label: perekonna määratud nomen @et
label: è assegnatore famiglia di @it
label: és família assignadora de @ca
label: είναι εκχωρητής οικογένεια του @el
label: هي عائلة مُخصِّصة لـ @ar
label: 是……的分配者家族 @zh-hans
sub property of: sukuun liittyvä nomen
sub property of: yhteistoimijan antama nomen
definition: Bir aileyi, bir varlığa bir aile tarafından atanan bir isimle ilişkilendirir. @tr
definition: Correla una famiglia a un nomen assegnato a un'entità da una famiglia. @it
definition: Liittää suvun nomeniin, jonka suku on antanut entiteetille.
definition: Met une famille en relation avec un nomen qui est attribué à une entité par une famille. @fr
definition: Relaciona una família amb un nomen que és assignat a una entitat per una família. @ca
definition: Relateert een familie aan een nomen dat toegekend is aan een entiteit door een familie. @nl
definition: Relaterer en familie til et nomen som er angitt til en entitet av en familie. @no
definition: Relaterer en familie til et nomen, som er angivet til en entitet af en familie. @da
definition: Relates a family to a nomen that is assigned to an entity by a family. @en
definition: Sasaista dzimtu/ģimeni ar nomenu, kuru entītei piešķir dzimta/ģimene. @lv
definition: Seostab perekonna nomen'iga, mille perekond on määranud olemile. @et
definition: Setzt eine Familie in Beziehung zu einem Nomen, das von einer Familie einer Entität zugewiesen ist. @de
definition: hozzárendelő családja a következőnek @hu
definition: يربط عائلة بتسمية خصصتها عائلة لكيان. @ar
definition: 将一个行为者与被一个家族分配给一个实体的一个命名关联起来。 @zh-hans

henkilön antama nomen
has element type: 2
toolkit definition: A nomen that is assigned to an entity by a person. @en
toolkit definition: Bir kişi tarafından bir varlığa atanan bir isim @tr
toolkit definition: Een nomen dat toegekend is aan een entiteit door een persoon. @nl
toolkit definition: Egy nomen, amelyet egy személy rendel hozzá egy entitáshoz. @hu
toolkit definition: Ein Nomen, das von einer Person einer Entität zugewiesen ist. @de
toolkit definition: Et nomen som er angitt til en entitet av en person. @no
toolkit definition: Nomen assegnato a un'entità da una persona. @it
toolkit definition: Nomen que és assignat a una entitat per una persona. @ca
toolkit definition: Nomen qui est attribué à une entité par une personne. @fr
toolkit definition: Nomen, jonka henkilö on antanut entiteetille.
toolkit definition: Nomen, mille isik on määranud olemile. @et
toolkit definition: Nomen, som er angivet til en entitet af en person. @da
toolkit definition: Nomens, kuru entītei piešķir persona. @lv
toolkit definition: تسمية خصصها شخص لكيان. @ar
toolkit definition: 被一个个人分配给一个实体的一个命名 @zh-hans
toolkit label: Hozzákapcsol egy személyt egy nomenhez, amelyet egy személy rendel hozzá egy entitáshoz. @hu
toolkit label: Person als Zuweisende/Zuweisender von @de
toolkit label: angivende person for @no
toolkit label: assegnatore persona di @it
toolkit label: assigner person of @en
toolkit label: atayan kişi @tr
toolkit label: henkilön antama nomen
toolkit label: ir nomena piešķīrējs (persona) @lv
toolkit label: isiku määratud nomen @et
toolkit label: person, som er angiver af @da
toolkit label: persona assignadora de @ca
toolkit label: personne attributrice de @fr
toolkit label: toekenner-persoon van @nl
toolkit label: εκχωρητής φυσικό πρόσωπο του @el
toolkit label: شخص مُخصِّص @ar
toolkit label: ……的分配者个人 @zh-hans
has subproperty: P50400
lexical alias: assignerPersonOf.en
status: Published
type: Property
domain: C10004
label: atayan akişisidir @tr
label: er angivende person for @no
label: er person, som er angiver af @da
label: est une personne attributrice de @fr
label: hozzárendelő személye a következőnek: @hu
label: ir nomena piešķīrējs (persona) @lv
label: is assigner person of @en
label: is toekenner-persoon van @nl
label: isiku määratud nomen @et
label: ist Person als Zuweisende/Zuweisender von @de
label: è assegnatore persona di @it
label: és persona assignadora de @ca
label: είναι εκχωρητής φυσικό πρόσωπο του @el
label: هو شخص مُخصِّص لـ @ar
label: 是……的分配者个人 @zh-hans
sub property of: henkilöön liittyvä nomen
sub property of: toimijan antama nomen
definition: Bir kişiyi, bir varlığa bir kişi tarafından atanan bir isimle ilişkilendirir. @tr
definition: Correla una persona a un nomen assegnato a un'entità da una persona. @it
definition: Liittää henkilön nomeniin, jonka henkilö on antanut entiteetille.
definition: Met une personne en relation avec un nomen qui est attribué à une entité par une personne. @fr
definition: Relaciona una persona amb un nomen que és assignat a una entitat per una persona. @ca
definition: Relateert een persoon aan een nomen dat toegekend is aan een entiteit door een persoon. @nl
definition: Relaterer en person til et nomen som er angitt til en entitet av en person. @no
definition: Relaterer en person til et nomen, som er angivet til en entitet af en person. @da
definition: Relates a person to a nomen that is assigned to an entity by a person. @en
definition: Sasaista personu ar nomenu, kuru entītei piešķir persona. @lv
definition: Seostab isiku nomen'iga, mille isik on määranud olemile. @et
definition: Setzt eine Person in Beziehung zu einem Nomen, das von einer Person einer Entität zugewiesen ist. @de
definition: hozzárendelő személye a következőnek @hu
definition: يربط شخصا بتسمية خصصها شخص لكيان. @ar
definition: 有将一个个人与被一个个人分配给一个实体的一个命名关联起来。 @zh-hans

toimijan käyttämä kieli
has element type: 5
toolkit definition: A language that is used by an agent in its communications. @en
toolkit definition: Bir temsilninin iletişiminde kullandığı dil @tr
toolkit definition: Een taal die gebruikt is door een actor in zijn communicatie. @nl
toolkit definition: Egy nyelv, amelyet egy ágens saját kommunikációjában használ. @hu
toolkit definition: Eine Sprache, die ein Akteur bei seiner Kommunikation verwendet. @de
toolkit definition: Et språk som brukes av en agent i sin kommunikasjon. @no
toolkit definition: Keel, mida tegija suhtluses kasutab. @et
toolkit definition: Kieli, jota toimija käyttää viestinnässään.
toolkit definition: Langue qu’un agent utilise pour sa communication. @fr
toolkit definition: Llengua que és usada per un agent en les seves comunicacions. @ca
toolkit definition: Sprog, som en agent anvender i sin kommunikation. @da
toolkit definition: Valoda, ko aģents lieto saziņā. @lv
toolkit definition: lingua utilizzata da un agente nelle sue comunicazioni. @it
toolkit definition: لغة يستخدمها وكيل في اتصالاته. @ar
toolkit definition: 一个行为者在其交流中所用的语言 @zh-hans
toolkit label: Sprache eines Akteurs @de
toolkit label: Temsilcinin dili @tr
toolkit label: aģenta valoda @lv
toolkit label: language of agent @en
toolkit label: langue d’un agent @fr
toolkit label: lingua di agente @it
toolkit label: llengua d’un agent @ca
toolkit label: sprog for agent @da
toolkit label: språk for agent @no
toolkit label: taal van actor @nl
toolkit label: tegija keel @et
toolkit label: toimijan käyttämä kieli
toolkit label: ágens nyelve: @hu
toolkit label: γλώσσα του φορέα @el
toolkit label: لغة وكيل @ar
toolkit label: 行为者的语言 @zh-hans
has subproperty: henkilön käyttämä kieli
has subproperty: yhteistoimijan käyttämä kieli
has subproperty: P50401
lexical alias: languageOfAgent.en
status: Published
type: Property
domain: C10002
label: a pour langue d’un agent @fr
label: aģenta valoda @lv
label: ha come lingua di agente @it
label: har sprog for agent @da
label: har språk for agent @no
label: has language of agent @en
label: hat Sprache eines Akteurs @de
label: heeft taal van actor @nl
label: tegija keel @et
label: temsilcinin dili ile ilişkilidir @tr
label: té com a llengua d’un agent @ca
label: ágens nyelve a következő: @hu
label: έχει γλώσσα του φορέα @el
label: له لغة لوكيل @ar
label: 有行为者的语言 @zh-hans
definition: Bir temsilciyi, bir temsilcinin iletişiminde kullandığı bir dille ilişkilendirir. @tr
definition: Correla un agente a una lingua utilizzata da un agente nelle sue comunicazioni. @it
definition: Hozzákapcsol egy ágenst egy nyelvhez, amelyet egy ágens saját kommunikációjában használ. @hu
definition: Liittää toimijan kieleen, jota toimija käyttää viestinnässään.
definition: Met un agent en relation avec une langue qu’un agent utilise pour sa communication. @fr
definition: Relaciona un agent amb una llengua que és usada per un agent en les seves comunicacions. @ca
definition: Relateert een actor aan een taal die gebruikt is door een actor in zijn communicatie. @nl
definition: Relaterer en agent til et sprog, som en agent anvender i sin kommunikation. @da
definition: Relaterer en agent til et språk som brukes av en agent i sin kommunikasjon. @no
definition: Relates an agent to a language that is used by an agent in its communications. @en
definition: Sasaista aģentu ar valodu, ko aģents lieto saziņā. @lv
definition: Seostab tegija keelega, mida tegija suhtluses kasutab. @et
definition: Setzt einen Akteur in Beziehung zu einer Sprache, die ein Akteur bei seiner Kommunikation verwendet. @de
definition: يربط وكيلا بلغة يستخدمها وكيل في اتصالاته. @ar
definition: 有将一个行为者与一个行为者在其交流中所用的语言关联起来。 @zh-hans

yhteistoimijan käyttämä kieli
has element type: 5
toolkit definition: A language that is used by a collective agent in its communications. @en
toolkit definition: Bir kolektif temsilninin iletişiminde kullandığı dil @tr
toolkit definition: Een taal die gebruikt is door een collectieve actor in zijn communicatie. @nl
toolkit definition: Egy nyelv, amelyet egy kollektív ágens saját kommunikációjában használ. @hu
toolkit definition: Eine Sprache, die ein gemeinschaftlicher Akteur bei seiner Kommunikation verwendet. @de
toolkit definition: Et språk som brukes av en kollektiv agent i sin kommunikasjon. @no
toolkit definition: Keel, mida kollektiiv suhtluses kasutab. @et
toolkit definition: Kieli, jota yhteistoimija käyttää viestinnässään.
toolkit definition: Langue qu’un agent collectif utilise pour sa communication. @fr
toolkit definition: Llengua que és usada per un agent col·lectiu en les seves comunicacions. @ca
toolkit definition: Sprog, som en kollektiv agent anvender i sin kommunikation. @da
toolkit definition: Valoda, ko grupa lieto saziņā. @lv
toolkit definition: lingua utilizzata da un agente collettivo nelle sue comunicazioni. @it
toolkit definition: لغة يستخدمها وكيل جماعي في اتصالاته. @ar
toolkit definition: 一个集体行为者在其交流中所用的语言 @zh-hans
toolkit label: Kolektif temsilcinin dili @tr
toolkit label: Sprache eines gemeinschaftlichen Akteurs @de
toolkit label: grupas valoda @lv
toolkit label: kollektiivi keel @et
toolkit label: kollektív ágens nyelve: @hu
toolkit label: language of collective agent @en
toolkit label: langue d’un agent collectif @fr
toolkit label: lingua di agente collettivo @it
toolkit label: llengua d’un agent col·lectiu @ca
toolkit label: sprog for kollektiv agent @da
toolkit label: språk for kollektiv agent @no
toolkit label: taal van collectieve actor @nl
toolkit label: yhteistoimijan käyttämä kieli
toolkit label: γλώσσα του συλλογικού φορέα @el
toolkit label: لغة وكيل جماعي @ar
toolkit label: 集体行为者的语言 @zh-hans
has subproperty: yhteisön käyttämä kieli
has subproperty: suvun käyttämä kieli
has subproperty: P50402
lexical alias: languageOfCollectiveAgent.en
status: Published
type: Property
domain: C10011
label: a pour langue d’un agent collectif @fr
label: grupas valoda @lv
label: ha come lingua di agente collettivo @it
label: har sprog for kollektiv agent @da
label: har språk for kollektiv agent @no
label: has language of collective agent @en
label: hat Sprache eines gemeinschaftlichen Akteurs @de
label: heeft taal van collectieve actor @nl
label: kolektif temsilcinin dili ile ilişkilidir @tr
label: kollektiivi keel @et
label: kollektív ágens nyelve a következő: @hu
label: té com a llengua d’un agent col·lectiu @ca
label: έχει γλώσσα του συλλογικού φορέα @el
label: له لغة لوكيل جماعي لـ @ar
label: 有集体行为者的语言 @zh-hans
sub property of: toimijan käyttämä kieli
definition: Correla un agente collettivo a una lingua utilizzata da un agente collettivo nelle sue comunicazioni. @it
definition: Hozzákapcsol egy kollektív ágenst egy nyelvhez, amelyet a kollektív ágens saját kommunikációjában használ. @hu
definition: Kolektif bir temsilciyi, iletişimlerinde kolektif temsilcinin kullandığı bir dille ilişkilendirir. @tr
definition: Liittää yhteistoimijan kieleen, jota yhteistoimija käyttää viestinnässään.
definition: Met un agent collectif en relation avec une langue qu’un agent collectif utilise pour sa communication. @fr
definition: Relaciona un agent col·lectiu amb una llengua que és usada per un agent col·lectiu en les seves comunicacions. @ca
definition: Relateert een collectieve actor aan een taal die gebruikt is door een collectieve actor in zijn communicatie. @nl
definition: Relaterer en kollektiv agent til et sprog, som en kollektiv agent anvender i sin kommunikation. @da
definition: Relaterer en kollektiv agent til et språk som brukes av en kollektiv agent i sin kommunikasjon. @no
definition: Relates a collective agent to a language that is used by a collective agent in its communications. @en
definition: Sasaista grupu ar valodu, ko grupa lieto saziņā. @lv
definition: Seostab kollektiivi keelega, mida kollektiiv suhtluses kasutab. @et
definition: Setzt einen gemeinschaftlichen Akteur in Beziehung zu einer Sprache, die ein gemeinschaftlicher Akteur bei seiner Kommunikation verwendet. @de
definition: يربط وكيلا جماعيا بلغة يستخدمها وكيل جماعي في اتصالاته. @ar
definition: 将一个集体行为者与一个集体行为者在其交流中所用的语言关联起来。 @zh-hans

toimijan auktorisoitu hakutieto
has element type: 3
toolkit definition: A nomen that is an access point for agent that is selected for preference in a specific vocabulary encoding scheme. @en
toolkit definition: Aģenta pamatforma, kas ir izvēle no konkrētas vārdnīcas. @lv
toolkit definition: Belirli bir kelime kodlama şeması içinde tercih için seçilen bir temsilcinin erişim noktası olan bir isim. @tr
toolkit definition: Een nomen dat is een ingang voor actor die bij voorkeur geselecteerd is in een specifiek vocabulair coderingssysteem. @nl
toolkit definition: Egy nomen, egy ágens hozzáférési pontja, amelyet egy adott szótárkódolási sémából választanak ki előnyben részesítettként. @hu
toolkit definition: Ein Sucheinstieg für einen Akteur, der in einem bestimmten Vocabulary Encoding Scheme als Vorzugsform bestimmt wird. @de
toolkit definition: En søkeinngang for agent som er valgt som preferanse i et bestemt kodeskjema for vokabular. @no
toolkit definition: Et nomen, som er en søgeindgang for agent, som er valgt som præference i et specifikt vokabularkodningsskema. @da
toolkit definition: Nomen que és un punt d’accés d’agent que se selecciona com a preferent en un esquema de codificació de vocabulari específic. @ca
toolkit definition: Nomen qui est un point d’accès d’un agent faisant l’objet d’un choix privilégié dans un schéma d’encodage de vocabulaire spécifique. @fr
toolkit definition: Nomen, joka on toimijan hakutieto, joka on valittu ensisijaiseksi tietyssä sanaston merkintäjärjestelmässä.
toolkit definition: Punto d'accesso per agente selezionato come preferenza in uno specifico schema di codifica di vocabolario controllato. @it
toolkit definition: Tegija otsielement, mis on valitud eelistatuks vastavas leksikaalses märkimissüsteemis. @et
toolkit definition: يربط الوكيل بنقطة وصول لوكيل تم اختيارها للتفضيل في خطة ترميز مفردات محددة. @ar
toolkit definition: 作为一个行为者的检索点、并在一个特定的词表编码体系中被首选的一个命名 @zh-hans
toolkit label: Normierter Sucheinstieg für einen Akteur @de
toolkit label: authorized access point for agent @en
toolkit label: autoriseret søgeindgang for agent @da
toolkit label: autorisert søkeinngang for agent @no
toolkit label: autorizált hozzáférési pont ágenshez: @hu
toolkit label: aģenta autoritatīvā pamatforma @lv
toolkit label: geautoriseerde ingang voor actor @nl
toolkit label: point d’accès autorisé d’un agent @fr
toolkit label: punt d’accés autoritzat d’agent @ca
toolkit label: punto d'accesso autorizzato per agente @it
toolkit label: tegija normitud otsielement @et
toolkit label: temsilci için yetkili erişim noktası @tr
toolkit label: toimijan auktorisoitu hakutieto
toolkit label: καθιερωμένο σημείο πρόσβασης για τον φορέα @el
toolkit label: نقطة وصول مقننة لوكيل @ar
toolkit label: 行为者的规范检索点 @zh-hans
has subproperty: yhteistoimijan auktorisoitu hakutieto
has subproperty: henkilön auktorisoitu hakutieto
has subproperty: P50403
lexical alias: authorizedAccessPointForAgent.en
status: Published
type: Property
domain: C10002
label: a pour point d’accès autorisé d’un agent @fr
label: autorizált hozzáférési pont ágenshez a következő: @hu
label: aģenta autoritatīvā pamatforma @lv
label: ha come punto d'accesso autorizzato per agente @it
label: har autoriseret søgeindgang for agent @da
label: har autorisert søkeinngang for agent @no
label: has authorized access point for agent @en
label: hat normierten Sucheinstieg für einen Akteur @de
label: heeft geautoriseerde ingang voor actor @nl
label: tegija normitud otsielement @et
label: temsilci için yetkili erişim noktası ile ilişkilidir @tr
label: té com a punt d’accés autoritzat d’agent @ca
label: έχει καθιερωμένο σημείο πρόσβασης για τον φορέα @el
label: له نقطة وصول مقننة لوكيل @ar
label: 有行为者的规范检索点 @zh-hans
sub property of: toimijan hakutieto
sub property of: P00020
definition: Bir temsilciyi, belirli bir kelime kodlama şemasında tercih için seçilen temsilci için bir erişim noktası olan bir isimle ilişkilendirir. @tr
definition: Correla un agente a un punto d'accesso per agente selezionato come preferenza in uno specifico schema di codifica di vocabolario controllato. @it
definition: Hozzákapcsol egy ágenst egy nomenhez, egy ágens hozzáférési pontjához, amelyet egy adott szótárkódolási sémából választanak ki előnyben részesítettként. @hu
definition: Liittää toimijan nomeniin, joka on toimijan hakutieto, joka on valittu ensisijaiseksi tietyssä sanaston merkintäjärjestelmässä.
definition: Met un agent en relation avec un nomen qui est un point d’accès d’un agent faisant l’objet d’un choix privilégié dans un schéma d’encodage de vocabulaire spécifique. @fr
definition: Relaciona un agent amb un nomen que és un punt d’accés d’agent que se selecciona com a preferent en un esquema de codificació de vocabulari específic. @ca
definition: Relateert een actor aan een nomen dat is een ingang voor actor die bij voorkeur geselecteerd is in een specifiek vocabulair coderingssysteem. @nl
definition: Relaterer en agent til en søkeinngang for agent som er valgt som preferanse i et bestemt kodeskjema for vokabular. @no
definition: Relaterer en agent til et nomen, som er en søgeindgang for agent, som er valgt som præference i et specifikt vokabularkodningsskema. @da
definition: Relates an agent to a nomen that is an access point for agent that is selected for preference in a specific vocabulary encoding scheme. @en
definition: Sasaista aģentu ar nomenu, kas ir aģenta pamatforma, kas ir izvēle no konkrētas vārdnīcas. @lv
definition: Seostab tegija tegija otsielemendiga, mis on valitud eelistatuks vastavas leksikaalses märkimissüsteemis. @et
definition: Setzt einen Akteur in Beziehung zu einem Sucheinstieg für einen Akteur, der in einem bestimmten Vocabulary Encoding Scheme als Vorzugsform bestimmt wird. @de
definition: يربط وكيلا بنقطة وصول للوكيل اختيرت للتفضيل في خطة ترميز مفردات محددة. @ar
definition: 将一个行为者与作为一个行为者的检索点、并在一个特定的词表编码体系中被首选的一个命名关联起来。 @zh-hans

toimijan varianttihakutieto
has element type: 3
toolkit definition: A nomen that is an access point for agent that is not selected for preference in a specific vocabulary encoding scheme. @en
toolkit definition: Belirli bir kelime kodlama şeması içinde tercih için seçilmemiş bir temsilcinin erişim noktası olan bir isim. @tr
toolkit definition: Een nomen dat is een ingang voor actor die niet bij voorkeur geselecteerd is in een specifiek vocabulair coderingssysteem. @nl
toolkit definition: Egy nomen, egy ágens hozzáférési pontja, amely egy bizonyos szótárkódolási sémában nem részesül előnyben. @hu
toolkit definition: Ein Sucheinstieg für einen Akteur, der in einem bestimmten Vocabulary Encoding Scheme nicht als Vorzugsform bestimmt wird. @de
toolkit definition: En søkeinngang for agent som ikke er valgt som preferanse i et bestemt kodeskjema for vokabular. @no
toolkit definition: Nomen que és un punt d’accés d’agent que no se selecciona com a preferent en un esquema de codificació de vocabulari específic. @ca
toolkit definition: Nomen qui est un point d’accès d’un agent ne faisant pas l’objet d’un choix privilégié dans un schéma d’encodage de vocabulaire spécifique. @fr
toolkit definition: Nomen, joka on toimijan hakutieto, jota ei ole valittu ensisijaiseksi tietyn sanaston merkintäjärjestelmässä.
toolkit definition: Nomen, som er søgeindgang for agent, som ikke er valgt som præference i et specifikt vokabularkodningsskema. @da
toolkit definition: Piekļuves punkts aģentam, kas nav izvēlēts kā prioritārs noteiktai kontrolētas vārdnīcas shēmai. @lv
toolkit definition: Punto d'accesso per agente non selezionato come preferenza in uno specifico schema di codifica di vocabolario controllato. @it
toolkit definition: Tegija otsielement, mis ei ole valitud eelistatuks vastavas leksikaalses märkimissüsteemis. @et
toolkit definition: نقطة وصول لوكيل لم تُختر للتفضيل في خطة ترميز مفردات محددة. @ar
toolkit definition: 作为一个行为者的检索点、并没有在一个特定的词表编码体系中被首选的一个命名 @zh-hans
toolkit label: Zusätzlicher Sucheinstieg für einen Akteur @de
toolkit label: alternativ søkeinngang for agent @no
toolkit label: aģenta papildforma @lv
toolkit label: hozzáférésipont-változat ágenshez: @hu
toolkit label: punto d'accesso variante per agente @it
toolkit label: tegija otsielemendi variant @et
toolkit label: temsilci için alternatif erişim noktası @tr
toolkit label: toimijan varianttihakutieto
toolkit label: variant access point for agent @en
toolkit label: variant af søgeindgang for agent @da
toolkit label: variant de punt d’accés d’agent @ca
toolkit label: variant ingang voor actor @nl
toolkit label: variante de point d’accès d’un agent @fr
toolkit label: εναλλακτικό σημείο πρόσβασης για τον φορέα @el
toolkit label: نقطة وصول مختلفة لوكيل @ar
toolkit label: 行为者的变异检索点 @zh-hans
has subproperty: yhteistoimijan varianttihakutieto
has subproperty: henkilön varianttihakutieto
has subproperty: P50404
lexical alias: variantAccessPointForAgent.en
status: Published
type: Property
domain: C10002
label: Hozzáférésipont-változat ágenshez a következő: @hu
label: a pour variante de point d’accès d’un agent @fr
label: aģenta papildforma @lv
label: ha come punto d'accesso variante per agente @it
label: har alternativ søkeinngang for agent @no
label: har variant af søgeindgang for agent @da
label: has variant access point for agent @en
label: hat zusätzlichen Sucheinstieg für einen Akteur @de
label: heeft variant ingang voor actor @nl
label: tegija otsielemendi variant @et
label: temsilci için alternatif erişim noktası ile ilişkilidir @tr
label: té com a variant de punt d’accés d’agent @ca
label: έχει εναλλακτικό σημείο πρόσβασης για τον φορέα @el
label: له نقطة وصول مختلفة لوكيل @ar
label: 有行为者的变异检索点 @zh-hans
sub property of: toimijan hakutieto
sub property of: P00022
definition: Bir temsilciyi, belirli bir kelime kodlama şemasında tercih için seçilmeyen temsilci için bir erişim noktası olan bir isimle ilişkilendirir. @tr
definition: Correla un agente a un punto d'accesso per agente non selezionato come preferenza in uno specifico schema di codifica di vocabolario controllato. @it
definition: Hozzákapcsol egy ágenst egy nomenhez, egy ágens hozzáférési pontjához, amely egy bizonyos szótárkódolási sémában nem részesül előnyben. @hu
definition: Liittää toimijan nomeniin, joka on toimijan hakutieto, jota ei ole valittu ensisijaiseksi tietyn sanaston merkintäjärjestelmässä.
definition: Met un agent en relation avec un nomen qui est un point d’accès d’un agent ne faisant pas l’objet d’un choix privilégié dans un schéma d’encodage de vocabulaire spécifique. @fr
definition: Relaciona un agent amb un nomen que és un punt d’accés d’agent que no se selecciona com a preferent en un esquema de codificació de vocabulari específic. @ca
definition: Relateert een actor aan een nomen dat is een ingang voor actor die niet bij voorkeur geselecteerd is in een specifiek vocabulair coderingssysteem. @nl
definition: Relaterer en agent til en søkeinngang for agent som ikke er valgt som preferanse i et bestemt kodeskjema for vokabular. @no
definition: Relaterer en agent til et nomen, som er en søgeindgang for agent, som ikke er valgt som præference i et specifikt vokabularkodningsskema. @da
definition: Relates an agent to a nomen that is an access point for agent that is not selected for preference in a specific vocabulary encoding scheme. @en
definition: Sasaista aģentu ar nomenu, kas ir piekļuves punkts aģentam, kas nav izvēlēts kā prioritārs noteiktai kontrolētas vārdnīcas shēmai. @lv
definition: Seostab tegija tegija otsielemendiga, mis ei ole valitud eelistatuks vastavas leksikaalses märkimissüsteemis. @et
definition: Setzt einen Akteur in Beziehung zu einem Sucheinstieg für einen Akteur, der in einem bestimmten Vocabulary Encoding Scheme nicht als Vorzugsform bestimmt wird. @de
definition: يربط وكيلا بنقطة وصول لوكيل لم تُختر للتفضيل في خطة ترميز مفردات محددة. @ar
definition: 将一个行为者与作为一个行为者的检索点、并没有在一个特定的词表编码体系中被首选的一个命名关联起来。 @zh-hans

yhteistoimijan auktorisoitu hakutieto
has element type: 3
toolkit definition: A nomen that is an access point for collective agent that is selected for preference in a specific vocabulary encoding scheme. @en
toolkit definition: Belirli bir kelime kodlama şemasında tercih için seçilen kolektif temsilcinin bir erişim noktası olan bir isim. @tr
toolkit definition: Een nomen dat is een ingang voor collectieve actor die bij voorkeur geselecteerd is in een specifiek vocabulair coderingssysteem. @nl
toolkit definition: Egy nomen, egy kollektív ágens hozzáférési pontja, amelyet egy adott szótárkódolási sémából választanak ki előnyben részesítettként. @hu
toolkit definition: Ein Sucheinstieg für einen gemeinschaftlichen Akteur, der in einem bestimmten Vocabulary Encoding Scheme als Vorzugsform bestimmt wird. @de
toolkit definition: En søkeinngang for kollektiv agent som er valgt som preferanse i et bestemt kodeskjema for vokabular. @no
toolkit definition: Grupas pamatforma, kas ir izvēle no konkrētas vārdnīcas. @lv
toolkit definition: Kollektiivi otsielement, mis on valitud eelistatuks vastavas leksikaalses märkimissüsteemis. @et
toolkit definition: Nomen que és punt d’accés d’agent col·lectiu que se selecciona com a preferent en un esquema de codificació de vocabulari específic. @ca
toolkit definition: Nomen qui est un point d’accès d’un agent collectif faisant l’objet d’un choix privilégié dans un schéma d’encodage de vocabulaire spécifique. @fr
toolkit definition: Nomen, joka on yhteistoimijan hakutieto, joka on valittu ensisijaiseksi tietyssä sanaston merkintäjärjestelmässä.
toolkit definition: Nomen, som er en søgeindgang for kollektiv agent, som er valgt som præference i et specifikt vokabularkodningsskema. @da
toolkit definition: Punto d'accesso per agente collettivo selezionato come preferenza in uno specifico schema di codifica di vocabolario controllato. @it
toolkit definition: نقطة وصول لوكيل جماعي تم تحديدها للتفضيل في خطة ترميز مفردات محددة. @ar
toolkit definition: 作为一个集体行为者的检索点、并没有在一个特定的词表编码体系中被首选的一个命名 @zh-hans
toolkit label: Normierter Sucheinstieg für einen gemeinschaftlichen Akteur @de
toolkit label: authorized access point for collective agent @en
toolkit label: autoriseret søgeindgang for kollektiv agent @da
toolkit label: autorisert søkeinngang for kollektiv agent @no
toolkit label: autorizált hozzáférési pont kollektív ágenshez: @hu
toolkit label: geautoriseerde ingang voor collectieve actor @nl
toolkit label: grupas autoritatīvā pamatforma @lv
toolkit label: kolektif temsilci için yetkili erişim noktası @tr
toolkit label: kollektiivi normitud otsielement @et
toolkit label: point d’accès autorisé d’un agent collectif @fr
toolkit label: punt d’accés autoritzat d’agent col·lectiu @ca
toolkit label: punto d'accesso autorizzato per agente collettivo @it
toolkit label: yhteistoimijan auktorisoitu hakutieto
toolkit label: καθιερωμένο σημείο πρόσβασης για τον συλλογικό φορέα @el
toolkit label: نقطة وصول مقننة لوكيل جماعي @ar
toolkit label: 集体行为者的规范检索点 @zh-hans
has subproperty: yhteisön auktorisoitu hakutieto
has subproperty: suvun auktorisoitu hakutieto
has subproperty: P50405
lexical alias: authorizedAccessPointForCollectiveAgent.en
status: Published
type: Property
domain: C10011
label: a pour point d’accès autorisé d’un agent collectif @fr
label: autorizált hozzáférési pont kollektív ágenshez a következő: @hu
label: grupas autoritatīvā pamatforma @lv
label: ha come punto d'accesso autorizzato per agente collettivo @it
label: har autoriseret søgeindgang for kollektiv agent @da
label: har autorisert søkeinngang for kollektiv agent @no
label: has authorized access point for collective agent @en
label: hat normierten Sucheinstieg für einen gemeinschaftlichen Akteur @de
label: heeft geautoriseerde ingang voor collectieve actor @nl
label: kolektif temsilci için yetkili erişim noktası ile ilişkilidir @tr
label: kollektiivi normitud otsielement @et
label: té com a punt d’accés autoritzat d’agent col·lectiu @ca
label: έχει καθιερωμένο σημείο πρόσβασης για τον συλλογικό φορέα @el
label: له نقطة وصول مقننة لوكيل جماعي @ar
label: 有集体行为者的规范检索点 @zh-hans
sub property of: yhteistoimijan hakutieto
sub property of: toimijan auktorisoitu hakutieto
definition: Correla un agente collettivo a un punto d'accesso per agente collettivo selezionato come preferenza in uno specifico schema di codifica di vocabolario controllato. @it
definition: Hozzákapcsol egy kollektív ágenst egy nomenhez, egy kollektív ágens hozzáférési pontjához, amelyet egy adott szótárkódolási sémából választanak ki előnyben részesítettként. @hu
definition: Kolektif bir temsilciyi, belirli bir kelime dağarcığı kodlama şemasında tercih edilen kolektif temsilci için bir erişim noktası olan bir isimle ilişkilendirir. @tr
definition: Liittää yhteistoimijan nomeniin, joka on yhteistoimijan hakutieto, joka on valittu ensisijaiseksi tietyssä sanaston merkintäjärjestelmässä.
definition: Met un agent collectif en relation avec un nomen qui est un point d’accès d’un agent collectif faisant l’objet d’un choix privilégié dans un schéma d’encodage de vocabulaire spécifique. @fr
definition: Relaciona un agent col·lectiu amb un nomen que és punt d’accés d’agent col·lectiu que se selecciona com a preferent en un esquema de codificació de vocabulari específic. @ca
definition: Relateert een collectieve actor aan een nomen dat is een ingang voor collectieve actor die bij voorkeur geselecteerd is in een specifiek vocabulair coderingssysteem. @nl
definition: Relaterer en kollektiv agent til en søkeinngang for kollektiv agent som er valgt som preferanse i et bestemt kodeskjema for vokabular. @no
definition: Relaterer en kollektiv agent til et nomen for en søgeindgang for kollektiv agent, som er valgt som præference i et specifikt vokabularkodningsskema. @da
definition: Relates a collective agent to a nomen that is an access point for collective agent that is selected for preference in a specific vocabulary encoding scheme. @en
definition: Sasaista grupu ar nomenu, kas ir grupas pamatforma, kas ir izvēle no konkrētas vārdnīcas. @lv
definition: Seostab kollektiivi kollektiivi otsielemendiga, mis on valitud eelistatuks vastavas leksikaalses märkimissüsteemis. @et
definition: Setzt einen gemeinschaftlichen Akteur in Beziehung zu einem Sucheinstieg für einen gemeinschaftlichen Akteur, der in einem bestimmten Vocabulary Encoding Scheme als Vorzugsform bestimmt wird. @de
definition: يربط وكيلا بنقطة وصول لوكيل جماعي اختيرت للتفضيل في خطة ترميز مفردات محددة. @ar
definition: 将一个集体行为者与作为一个集体行为者的检索点、并没有在一个特定的词表编码体系中被首选的一个命名关联起来。 @zh-hans

yhteistoimijan varianttihakutieto
has element type: 3
toolkit definition: A nomen that is an access point for collective agent that is not selected for preference in a specific vocabulary encoding scheme. @en
toolkit definition: Belirli bir kelime kodlama şemasında tercih için seçilmeyen kolektif temsilcinin bir erişim noktası olan bir isim. @tr
toolkit definition: Een nomen dat is een ingang voor collectieve actor die niet bij voorkeur geselecteerd is in een specifiek vocabulair coderingssysteem. @nl
toolkit definition: Egy nomen, egy ágens hozzáférési pontja, amelyet egy adott szótárkódolási sémában nem részesítenek előnyben. @hu
toolkit definition: Ein Sucheinstieg für einen gemeinschaftlichen Akteur, der in einem bestimmten Vocabulary Encoding Scheme nicht als Vorzugsform bestimmt wird. @de
toolkit definition: En søkeinngang for kollektiv agent som ikke er valgt som preferanse i et bestemt kodeskjema for vokabular. @no
toolkit definition: Kollektiivi otsielement, mis ei ole valitud eelistatuks vastavas leksikaalses märkimissüsteemis. @et
toolkit definition: Nomen que és un punt d’accés d’agent col·lectiu que no se selecciona com a preferent en un esquema de codificació de vocabulari específic. @ca
toolkit definition: Nomen qui est un point d’accès d’un agent collectif ne faisant pas l’objet d’un choix privilégié dans un schéma d’encodage de vocabulaire spécifique. @fr
toolkit definition: Nomen, joka on yhteistoimijan hakutieto, jota ei ole valittu ensisijaiseksi tietyssä sanaston merkintäjärjestelmässä.
toolkit definition: Nomen, som er en søgeindgang for kollektiv agent, som ikke er valgt som præference i et specifikt vokabularkodningsskema. @da
toolkit definition: Piekļuves punkts grupai, kas nav izvēlēts kā prioritārs noteiktai kontrolētas vārdnīcas shēmai. @lv
toolkit definition: Punto d'accesso per agente collettivo non selezionato come preferenza in uno specifico schema di codifica di vocabolario controllato. @it
toolkit definition: نقطة وصول لوكيل جماعي لم تُختر للتفضيل في خطة ترميز مفردات محددة. @ar
toolkit definition: 作为一个集体行为者的检索点、并没有在一个特定的词表编码体系中被首选的一个命名 @zh-hans
toolkit label: Zusätzlicher Sucheinstieg für einen gemeinschaftlichen Akteur @de
toolkit label: alternativ søkeinngang for kollektiv agent @no
toolkit label: grupas papildforma @lv
toolkit label: hozzáférésipont-változat kollektív ágenshez: @hu
toolkit label: kolektif temsilci için alternatif erişim noktası @tr
toolkit label: kollektiivi otsielemendi variant @et
toolkit label: punto d'accesso variante per agente collettivo @it
toolkit label: variant access point for collective agent @en
toolkit label: variant af søgeindgang for kollektiv agent @da
toolkit label: variant de punt d’accés d’agent col·lectiu @ca
toolkit label: variant ingang voor collectieve actor @nl
toolkit label: variante de point d’accès d’un agent collectif @fr
toolkit label: yhteistoimijan varianttihakutieto
toolkit label: εναλλακτικό σημείο πρόσβασης για τον συλλογικό φορέα @el
toolkit label: نقطة وصول مختلفة لوكيل جماعي @ar
toolkit label: 集体行为者的变异检索点 @zh-hans
has subproperty: yhteisön varianttihakutieto
has subproperty: suvun varianttihakutieto
has subproperty: P50406
lexical alias: variantAccessPointForCollectiveAgent.en
status: Published
type: Property
domain: C10011
label: a pour variante de point d’accès d’un agent collectif @fr
label: grupas papildforma @lv
label: ha come punto d'accesso variante per agente collettivo @it
label: har alternativ søkeinngang for kollektiv agent @no
label: har variant af søgeindgang for kollektiv agent @da
label: has variant access point for collective agent @en
label: hat zusätzlichen Sucheinstieg für einen gemeinschaftlichen Akteur @de
label: heeft variant ingang voor collectieve actor @nl
label: hozzáférésipont-változat kollektív ágenshez a következő: @hu
label: kolektif temsilci için alternatif erişim noktası ile ilişkilidir @tr
label: kollektiivi otsielemendi variant @et
label: té com a variant de punt d’accés d’agent col·lectiu @ca
label: έχει εναλλακτικό σημείο πρόσβασης για τον συλλογικό φορέα @el
label: له نقطة وصول مختلفة لوكيل جماعي @ar
label: 有集体行为者的变异检索点 @zh-hans
sub property of: yhteistoimijan hakutieto
sub property of: toimijan varianttihakutieto
definition: Correla un agente collettivo a un punto d'accesso per agente collettivo non selezionato come preferenza in uno specifico schema di codifica di vocabolario controllato. @it
definition: Hozzákapcsol egy kollektív ágenst egy nomenhez, egy ágens hozzáférési pontjához, amelyet egy adott szótárkódolási sémában nem részesítenek előnyben. @hu
definition: Kolektif bir temsilciyi, belirli bir kelime dağarcığı kodlama şemasında tercih edilmeyen kolektif temsilci için bir erişim noktası olan bir isimle ilişkilendirir. @tr
definition: Liittää yhteistoimijan nomeniin, joka on yhteistoimijan hakutieto, jota ei ole valittu ensisijaiseksi tietyssä sanaston merkintäjärjestelmässä.
definition: Met un agent collectif en relation avec un nomen qui est un point d’accès d’un agent collectif ne faisant pas l’objet d’un choix privilégié dans un schéma d’encodage de vocabulaire spécifique. @fr
definition: Relaciona un agent col·lectiu amb un nomen que és un punt d’accés d’agent col·lectiu que no se selecciona com a preferent en un esquema de codificació de vocabulari específic. @ca
definition: Relateert een collectieve actor aan een nomen dat is een ingang voor collectieve actor die niet bij voorkeur geselecteerd is in een specifiek vocabulair coderingssysteem. @nl
definition: Relaterer en kollektiv agent til en søkeinngang for kollektiv agent som ikke er valgt som preferanse i et bestemt kodeskjema for vokabular. @no
definition: Relaterer en kollektiv agent til et nomen, som er en søgeindgang for kollektiv agent, som ikke er valgt som præference i et specifikt vokabularkodningsskema. @da
definition: Relates a collective agent to a nomen that is an access point for collective agent that is not selected for preference in a specific vocabulary encoding scheme. @en
definition: Sasaista grupu ar nomenu, kas ir piekļuves punkts grupai, kas nav izvēlēts kā prioritārs noteiktai kontrolētas vārdnīcas shēmai. @lv
definition: Seostab kollektiivi kollektiivi otsielemendiga, mis ei ole valitud eelistatuks vastavas leksikaalses märkimissüsteemis. @et
definition: Setzt einen gemeinschaftlichen Akteur in Beziehung zu einem Sucheinstieg für einen gemeinschaftlichen Akteur, der in einem bestimmten Vocabulary Encoding Scheme nicht als Vorzugsform bestimmt wird. @de
definition: يربط وكيلا جماعيا بنقطة وصول لوكيل جماعي لم تُختر للتفضيل في خطة ترميز مفردات محددة. @ar
definition: 将一个集体行为者与作为一个集体行为者的检索点、并没有在一个特定的词表编码体系中被首选的一个命名关联起来。 @zh-hans

yhteisön auktorisoitu hakutieto
has element type: 3
toolkit definition: A nomen that is an access point for corporate body that is selected for preference in a specific vocabulary encoding scheme. @en
toolkit definition: Asutuse otsielement, mis on valitud eelistatuks vastavas leksikaalses märkimissüsteemis. @et
toolkit definition: Belirli bir kelime kodlama şemasında tercih için seçilen bir tüzel kişinin bir erişim noktası olan bir isim. @tr
toolkit definition: Een nomen dat is een ingang voor corporatie die bij voorkeur geselecteerd is in een specifiek vocabulair coderingssysteem. @nl
toolkit definition: Egy nomen, egy testület hozzáférési pontja, amelyet egy adott szótárkódolási sémából választanak ki előnyben részesítettként. @hu
toolkit definition: Ein Sucheinstieg für eine Körperschaft, der in einem bestimmten Vocabulary Encoding Scheme als Vorzugsform bestimmt wird. @de
toolkit definition: En søkeinngang for korporasjon som er valgt som preferanse i et bestemt kodeskjema for vokabular. @no
toolkit definition: Institūcijas pamatforma, kas ir izvēle no konkrētas vārdnīcas. @lv
toolkit definition: Nomen que és un punt d’accés d’entitat corporativa que se selecciona com a preferent en un esquema de codificació de vocabulari específic. @ca
toolkit definition: Nomen qui est un point d’accès d’une collectivité faisant l’objet d’un choix privilégié dans un schéma d’encodage de vocabulaire spécifique. @fr
toolkit definition: Nomen, joka on yhteisön hakutieto, joka on valittu ensisijaiseksi tietyssä sanaston merkintäjärjestelmässä.
toolkit definition: Nomen, som er en søgeindgang for korporation, som er valgt som præference i et specifikt vokabularkodningsskema. @da
toolkit definition: Punto d'accesso per ente selezionato come preferenza in uno specifico schema di codifica di vocabolario controllato. @it
toolkit definition: نقطة وصول لهيئة يتم تحديدها للتفضيل في خطة ترميز مفردات محددة. @ar
toolkit definition: 作为一个团体的检索点、并在一个特定的词表编码体系中被首选的一个命名 @zh-hans
toolkit label: Normierter Sucheinstieg für eine Körperschaft @de
toolkit label: asutuse normitud otsielement @et
toolkit label: authorized access point for corporate body @en
toolkit label: autoriseret søgeindgang for korporation @da
toolkit label: autorisert søkeinngang for korporasjon @no
toolkit label: autorizált hozzáférési pont testülethez: @hu
toolkit label: geautoriseerde ingang voor corporatie @nl
toolkit label: institūcijas autoritatīvā pamatforma @lv
toolkit label: point d’accès autorisé d’une collectivité @fr
toolkit label: punt d’accés autoritzat d’entitat corporativa @ca
toolkit label: punto d'accesso autorizzato per ente @it
toolkit label: tüzel kişi için yetkili erişim noktası @tr
toolkit label: yhteisön auktorisoitu hakutieto
toolkit label: καθιερωμένο σημείο πρόσβασης για το συλλογικό όργανο @el
toolkit label: نقطة وصول مقننة لهيئة @ar
toolkit label: 团体的规范检索点 @zh-hans
has subproperty: P50407
lexical alias: authorizedAccessPointForCorporateBody.en
status: Published
type: Property
domain: C10005
label: a pour point d’accès autorisé d’une collectivité @fr
label: asutuse normitud otsielement @et
label: autorizált hozzáférési pont testülethez a következő: @hu
label: ha come punto d'accesso autorizzato per ente @it
label: har autoriseret søgeindgang for korporation @da
label: har autorisert søkeinngang for korporasjon @no
label: has authorized access point for corporate body @en
label: hat normierten Sucheinstieg für eine Körperschaft @de
label: heeft geautoriseerde ingang voor corporatie @nl
label: institūcijas autoritatīvā pamatforma @lv
label: té com a punt d’accés autoritzat d’entitat corporativa @ca
label: tüzel kişi için yetkili erişim noktası ile ilişkilidir @tr
label: έχει καθιερωμένο σημείο πρόσβασης για το συλλογικό όργανο @el
label: لها نقطة وصول مقننة لهيئة @ar
label: 有团体的规范检索点 @zh-hans
sub property of: yhteisön hakutieto
sub property of: yhteistoimijan auktorisoitu hakutieto
definition: Bir tüzel kişiyi, belirli bir kelime kodlama şemasında tercih edilen tüzel kişi için bir erişim noktası olan bir isimle ilişkilendirir. @tr
definition: Correla un ente a un punto d'accesso per ente selezionato come preferenza in uno specifico schema di codifica di vocabolario controllato. @it
definition: Hozzákapcsol egy testületet egy nomenhez, egy testület hozzáférési pontjához, amelyet egy adott szótárkódolási sémából választanak ki előnyben részesítettként. @hu
definition: Liittää yhteisön nomeniin, joka on yhteisön hakutieto, joka on valittu ensisijaiseksi tietyssä sanaston merkintäjärjestelmässä.
definition: Met une collectivité en relation avec un nomen qui est un point d’accès d’une collectivité faisant l’objet d’un choix privilégié dans un schéma d’encodage de vocabulaire spécifique. @fr
definition: Relaciona una entitat corporativa amb un nomen que és un punt d’accés d’entitat corporativa que se selecciona com a preferent en un esquema de codificació de vocabulari específic. @ca
definition: Relateert een corporatie aan een nomen dat is een ingang voor corporatie die bij voorkeur geselecteerd is in een specifiek vocabulair coderingssysteem. @nl
definition: Relaterer en korporasjon til en søkeinngang for korporasjon som er valgt som preferanse i et bestemt kodeskjema for vokabular. @no
definition: Relaterer en korporation til et nomen, som er en søgeindgang for korporation, som er valgt som præference i et specifikt vokabularkodningsskema. @da
definition: Relates a corporate body to a nomen that is an access point for corporate body that is selected for preference in a specific vocabulary encoding scheme. @en
definition: Sasaista institūciju ar nomenu, kas ir institūcijas pamatforma, kas ir izvēle no konkrētas vārdnīcas. @lv
definition: Seostab asutuse asutuse otsielemendiga, mis on valitud eelistatuks vastavas leksikaalses märkimissüsteemis. @et
definition: Setzt eine Körperschaft in Beziehung zu einem Sucheinstieg für eine Körperschaft, der in einem bestimmten Vocabulary Encoding Scheme als Vorzugsform bestimmt wird. @de
definition: يربط هيئة بنقطة وصول لهيئة التي يتم اختيارها للتفضيل في خطة ترميز مفردات محددة. @ar
definition: 将一个团体与作为一个团体的检索点、并在一个特定的词表编码体系中被首选的一个命名关联起来。 @zh-hans

yhteisön varianttihakutieto
has element type: 3
toolkit definition: A nomen that is an access point for corporate body that is not selected for preference in a specific vocabulary encoding scheme. @en
toolkit definition: Asutuse otsielement, mis ei ole valitud eelistatuks vastavas leksikaalses märkimissüsteemis. @et
toolkit definition: Belirli bir kelime kodlama şemasında tercih için seçilmemiş bir tüzel kişinin erişim noktası olan bir isim. @tr
toolkit definition: Een nomen dat is een ingang voor corporatie die niet bij voorkeur geselecteerd is in een specifiek vocabulair coderingssysteem. @nl
toolkit definition: Egy nomen, egy testület hozzáférési pontja, amelyet egy adott szótárkódolási sémában nem részesítenek előnyben. @hu
toolkit definition: Ein Sucheinstieg für eine Körperschaft, der in einem bestimmten Vocabulary Encoding Scheme nicht als Vorzugsform bestimmt wird. @de
toolkit definition: En søkeinngang for korporasjon som ikke er valgt som preferanse i et bestemt kodeskjema for vokabular. @no
toolkit definition: Nomen que és un punt d’accés d’entitat corporativa que no se selecciona com a preferent en un esquema de codificació de vocabulari específic. @ca
toolkit definition: Nomen qui est un point d’accès d’une collectivité ne faisant pas l’objet d’un choix privilégié dans un schéma d’encodage de vocabulaire spécifique. @fr
toolkit definition: Nomen, joka on yhteisön hakutieto, jota ei ole valittu ensisijaiseksi tietyssä sanaston merkintäjärjestelmässä.
toolkit definition: Nomen, som er en søgeindgang for korporation, som ikke er valgt som præference i et specifikt vokabularkodningsskema. @da
toolkit definition: Piekļuves punkts institūcijai, kas nav izvēlēta kā prioritāra noteiktai kontrolētas vārdnīcas shēmai. @lv
toolkit definition: Punto d'accesso per ente non selezionato come preferenza in uno specifico schema di codifica di vocabolario controllato. @it
toolkit definition: نقطة وصول لهيئة لم تُختر للتفضيل في خطة ترميز مفردات محددة. @ar
toolkit definition: 作为一个团体的检索点、并没有在一个特定的词表编码体系中被首选的一个命名 @zh-hans
toolkit label: Zusätzlicher Sucheinstieg für eine Körperschaft @de
toolkit label: alternativ søkeinngang for korporasjon @no
toolkit label: asutuse otsielemendi variant @et
toolkit label: hozzáférésipont-változat testülethez: @hu
toolkit label: institūcijas papildforma @lv
toolkit label: punto d'accesso variante per ente @it
toolkit label: tüzel kişi için alternatif erişim noktası @tr
toolkit label: variant access point for corporate body @en
toolkit label: variant af søgeindgang for korporation @da
toolkit label: variant de punt d’accés d’entitat corporativa @ca
toolkit label: variant ingang voor corporatie @nl
toolkit label: variante de point d’accès d’une collectivité @fr
toolkit label: yhteisön varianttihakutieto
toolkit label: εναλλακτικό σημείο πρόσβασης για το συλλογικό όργανο @el
toolkit label: نقطة وصول مختلفة لهيئة @ar
toolkit label: 团体的变异检索点 @zh-hans
has subproperty: P50408
lexical alias: variantAccessPointForCorporateBody.en
status: Published
type: Property
domain: C10005
label: a pour variante de point d’accès d’une collectivité @fr
label: asutuse otsielemendi variant @et
label: ha come punto d'accesso variante per ente @it
label: har alternativ søkeinngang for korporasjon @no
label: har variant af søgeindgang for korporation @da
label: has variant access point for corporate body @en
label: hat zusätzlichen Sucheinstieg für eine Körperschaft @de
label: heeft variant ingang voor corporatie @nl
label: hozzáférésipont-változat testülethez a következő: @hu
label: institūcijas papildforma @lv
label: té com a variant de punt d’accés d’entitat corporativa @ca
label: tüzel kişi için alternatif erişim noktası ile ilişkilidir @tr
label: έχει εναλλακτικό σημείο πρόσβασης για το συλλογικό όργανο @el
label: لها نقطة وصول مختلفة لهيئة @ar
label: 有团体的变异检索点 @zh-hans
sub property of: yhteisön hakutieto
sub property of: yhteistoimijan varianttihakutieto
definition: Bir tüzel kişiyi, belirli bir kelime kodlama şemasında tercih edilmeyen tüzel kişi için bir erişim noktası olan bir isimle ilişkilendirir. @tr
definition: Correla un ente a un punto d'accesso per ente non selezionato come preferenza in uno specifico schema di codifica di vocabolario controllato. @it
definition: Hozzákapcsol egy testületet egy nomenhez, egy testület hozzáférési pontjához, amelyet egy adott szótárkódolási sémában nem részesítenek előnyben. @hu
definition: Liittää yhteisön nomeniin, joka on yhteisön hakutietoon, jota ei ole valittu ensisijaiseksi tietyssä sanaston merkintäjärjestelmässä.
definition: Met une collectivité en relation avec un nomen qui est un point d’accès d’une collectivité ne faisant pas l’objet d’un choix privilégié dans un schéma d’encodage de vocabulaire spécifique. @fr
definition: Relaciona una entitat corporativa amb un nomen que és un punt d’accés d’entitat corporativa que no se selecciona com a preferent en un esquema de codificació de vocabulari específic. @ca
definition: Relateert een corporatie aan een nomen dat is een ingang voor corporatie die niet bij voorkeur geselecteerd is in een specifiek vocabulair coderingssysteem. @nl
definition: Relaterer en korporasjon til en søkeinngang for korporasjon som ikke er valgt som preferanse i et bestemt kodeskjema for vokabular. @no
definition: Relaterer en korporation til et nomen, som er en søgeindgang for korporation, som ikke er valgt som præference i et specifikt vokabularkodningsskema. @da
definition: Relates a corporate body to a nomen that is an access point for corporate body that is not selected for preference in a specific vocabulary encoding scheme. @en
definition: Sasaista institūciju ar nomenu, kas ir piekļuves punkts institūcijai, kas nav izvēlēta kā prioritāra noteiktai kontrolētas vārdnīcas shēmai. @lv
definition: Seostab asutuse asutuse otsielemendiga, mis ei ole valitud eelistatuks vastavas leksikaalses märkimissüsteemis. @et
definition: Setzt eine Körperschaft in Beziehung zu einem Sucheinstieg für eine Körperschaft, der in einem bestimmten Vocabulary Encoding Scheme nicht als Vorzugsform bestimmt wird. @de
definition: يربط هيئة بنقطة وصول لهيئة لم تُختر للتفضيل في خطة ترميز مفردات محددة. @ar
definition: 将一个团体与作为一个团体的检索点、并没有在一个特定的词表编码体系中被首选的一个命名关联起来。 @zh-hans

suvun auktorisoitu hakutieto
has element type: 3
toolkit definition: A nomen that is an access point for family that is selected for preference in a specific vocabulary encoding scheme. @en
toolkit definition: Belirli bir kelime kodlama şemasında tercih için seçilen bir ailenin erişim noktası olan bir isim. @tr
toolkit definition: Dzimtas/ģimenes pamatforma, kas ir izvēle no konkrētas vārdnīcas. @lv
toolkit definition: Een nomen dat is een ingang voor familie die bij voorkeur geselecteerd is in een specifiek vocabulair coderingssysteem. @nl
toolkit definition: Egy nomen, egy család hozzáférési pontja, amelyet egy adott szótárkódolási sémából választanak ki előnyben részesítettként. @hu
toolkit definition: Ein Sucheinstieg für eine Familie, der in einem bestimmten Vocabulary Encoding Scheme als Vorzugsform bestimmt wird. @de
toolkit definition: En søkeinngang for familie som er valgt som preferanse i et bestemt kodeskjema for vokabular. @no
toolkit definition: Nomen que és un punt d’accés de família que se selecciona com a preferent en un esquema de codificació de vocabulari específic. @ca
toolkit definition: Nomen qui est un point d’accès d’une famille faisant l’objet d’un choix privilégié dans un schéma d’encodage de vocabulaire spécifique. @fr
toolkit definition: Nomen, joka on suvun hakutieto, joka on valittu ensisijaiseksi tietyssä sanaston merkintäjärjestelmässä.
toolkit definition: Nomen, som er en søgeindgang for familie, som er valgt som præference i et specifikt vokabularkodningsskema. @da
toolkit definition: Perekonna otsielement, mis on valitud eelistatuks vastavas leksikaalses märkimissüsteemis. @et
toolkit definition: Punto d'accesso per famiglia selezionato come preferenza in uno specifico schema di codifica di vocabolario controllato. @it
toolkit definition: نقطة وصول لعائلة يتم تحديدها للتفضيل في خطة ترميز مفردات محددة. @ar
toolkit definition: 作为一个家族的检索点、并在一个特定的词表编码体系中被首选的一个命名 @zh-hans
toolkit label: Normierter Sucheinstieg für eine Familie @de
toolkit label: aile için yetkili erişim noktası @tr
toolkit label: authorized access point for family @en
toolkit label: autoriseret søgeindgang for familie @da
toolkit label: autorisert søkeinngang for familie @no
toolkit label: autorizált hozzáférési pont időtartamhoz: @hu
toolkit label: dzimtas/ģimenes autoritatīvā pamatforma @lv
toolkit label: geautoriseerde ingang voor familie @nl
toolkit label: perekonna normitud otsielement @et
toolkit label: point d’accès autorisé d’une famille @fr
toolkit label: punt d’accés autoritzat de família @ca
toolkit label: punto d'accesso autorizzato per famiglia @it
toolkit label: suvun auktorisoitu hakutieto
toolkit label: καθιερωμένο σημείο πρόσβασης για την οικογένεια @el
toolkit label: نقطة وصول مقننة لعائلة @ar
toolkit label: 家族的规范检索点 @zh-hans
has subproperty: P50409
lexical alias: authorizedAccessPointForFamily.en
status: Published
type: Property
domain: C10008
label: a pour point d’accès autorisé d’une famille @fr
label: aile için yetkili erişim noktası ile ilişkilidir @tr
label: autorizált hozzáférési pont családhoz a következő: @hu
label: dzimtas/ģimenes autoritatīvā pamatforma @lv
label: ha come punto d'accesso autorizzato per famiglia @it
label: har autoriseret søgeindgang for familie @da
label: har autorisert søkeinngang for familie @no
label: has authorized access point for family @en
label: hat normierten Sucheinstieg für eine Familie @de
label: heeft geautoriseerde ingang voor familie @nl
label: perekonna normitud otsielement @et
label: té com a punt d’accés autoritzat de família @ca
label: έχει καθιερωμένο σημείο πρόσβασης για την οικογένεια @el
label: له نقطة وصول مقننة لعائلة @ar
label: 有家族的规范检索点 @zh-hans
sub property of: suvun hakutieto
sub property of: yhteistoimijan auktorisoitu hakutieto
definition: Bir aileyi, belirli bir kelime kodlama şemasında tercih edilen aile için bir erişim noktası olan bir isimle ilişkilendirir. @tr
definition: Correla una famiglia a un punto d'accesso per famiglia selezionato come preferenza in uno specifico schema di codifica di vocabolario controllato. @it
definition: Hozzákapcsol egy családot egy nomenhez, egy család hozzáférési pontjához, amelyet egy adott szótárkódolási sémából választanak ki előnyben részesítettként. @hu
definition: Liittää suvun nomeniin, joka on suvun hakutieto, joka on valittu ensisijaiseksi tietyssä sanaston merkintäjärjestelmässä.
definition: Met une famille en relation avec un nomen qui est un point d’accès d’une famille faisant l’objet d’un choix privilégié dans un schéma d’encodage de vocabulaire spécifique. @fr
definition: Relaciona una família amb un nomen que és un punt d’accés de família que se selecciona com a preferent en un esquema de codificació de vocabulari específic. @ca
definition: Relateert een familie aan een nomen dat is een ingang voor familie die bij voorkeur geselecteerd is in een specifiek vocabulair coderingssysteem. @nl
definition: Relaterer en familie til en søkeinngang for familie som er valgt som preferanse i et bestemt kodeskjema for vokabular. @no
definition: Relaterer en familie til et nomen, som er en søgeindgang for familie, som er valgt som præference i et specifikt vokabularkodningsskema. @da
definition: Relates a family to a nomen that is an access point for family that is selected for preference in a specific vocabulary encoding scheme. @en
definition: Sasaista dzimtu/ģimeni ar nomenu, kas ir dzimtas/ģimenes pamatforma, kas ir izvēle no konkrētas vārdnīcas. @lv
definition: Seostab perekonna perekonna otsielemendiga, mis on valitud eelistatuks vastavas leksikaalses märkimissüsteemis. @et
definition: Setzt eine Familie in Beziehung zu einem Sucheinstieg für eine Familie, der in einem bestimmten Vocabulary Encoding Scheme als Vorzugsform bestimmt wird. @de
definition: يربط عائلة بنقطة وصول لعائلة اختيرت للتفضيل في خطة ترميز مفردات محددة. @ar
definition: 将一个家族与作为一个家族的检索点、并在一个特定的词表编码体系中被首选的一个命名关联起来。 @zh-hans

suvun varianttihakutieto
has element type: 3
toolkit definition: A nomen that is an access point for family that is not selected for preference in a specific vocabulary encoding scheme. @en
toolkit definition: Belirli bir kelime kodlama şemasında tercih için seçilmemiş bir ailenin erişim noktası olan bir isim. @tr
toolkit definition: Een nomen dat is een ingang voor familie die niet bij voorkeur geselecteerd is in een specifiek vocabulair coderingssysteem. @nl
toolkit definition: Egy nomen, egy család hozzáférési pontja, amelyet egy adott szótárkódolási sémában nem részesítenek előnyben. @hu
toolkit definition: Ein Sucheinstieg für eine Familie, der in einem bestimmten Vocabulary Encoding Scheme nicht als Vorzugsform bestimmt wird. @de
toolkit definition: En søkeinngang for familie som ikke er valgt som preferanse i et bestemt kodeskjema for vokabular. @no
toolkit definition: Nomen que és un punt d’accés de família que no se selecciona com a preferent en un esquema de codificació de vocabulari específic. @ca
toolkit definition: Nomen qui est un point d’accès d’une famille ne faisant pas l’objet d’un choix privilégié dans un schéma d’encodage de vocabulaire spécifique. @fr
toolkit definition: Nomen som er en søgeindgang for familie, som ikke er valgt som præference i et specifikt vokabularkodningsskema. @da
toolkit definition: Nomen, joka on suvun hakutieto, jota ei ole valittu ensisijaiseksi tietyssä sanaston merkintäjärjestelmässä.
toolkit definition: Perekonna otsielement, mis ei ole valitud eelistatuks vastavas leksikaalses märkimissüsteemis. @et
toolkit definition: Piekļuves punkts dzimtai/ģimenei, kas nav izvēlēta kā prioritāra noteiktai kontrolētas vārdnīcas shēmai. @lv
toolkit definition: Punto d'accesso per famiglia non selezionato come preferenza in uno specifico schema di codifica di vocabolario controllato. @it
toolkit definition: نقطة وصول لعائلة تم اختيارها للتفضيل في خطة ترميز مفردات محددة. @ar
toolkit definition: 作为一个家族的检索点、并没有在一个特定的词表编码体系中被首选的一个命名 @zh-hans
toolkit label: Zusätzlicher Sucheinstieg für eine Familie @de
toolkit label: aile için alternatif erişim noktası @tr
toolkit label: alternativ søkeinngang for familie @no
toolkit label: dzimtas/ģimenes papildforma @lv
toolkit label: hozzáférésipont-változat családhoz: @hu
toolkit label: perekonna otsielemendi variant @et
toolkit label: punto d'accesso variante per famiglia @it
toolkit label: suvun varianttihakutieto
toolkit label: variant access point for family @en
toolkit label: variant af søgeindgang for familie @da
toolkit label: variant de punt d’accés de família @ca
toolkit label: variant ingang voor familie @nl
toolkit label: variante de point d’accès d’une famille @fr
toolkit label: εναλλακτικό σημείο πρόσβασης για την οικογένεια @el
toolkit label: نقطة وصول مختلفة لعائلة @ar
toolkit label: 家族的变异检索点 @zh-hans
has subproperty: P50410
lexical alias: variantAccessPointForFamily.en
status: Published
type: Property
domain: C10008
label: a pour variante de point d’accès d’une famille @fr
label: aile için alternatif erişim noktası ile ilişkilidir @tr
label: dzimtas/ģimenes papildforma @lv
label: ha come punto d'accesso variante per famiglia @it
label: har alternativ søkeinngang for familie @no
label: har variant af søgeindgang for familie @da
label: has variant access point for family @en
label: hat zusätzlichen Sucheinstieg für eine Familie @de
label: heeft variant ingang voor familie @nl
label: hozzáférésipont-változat családhoz a következő: @hu
label: perekonna otsielemendi variant @et
label: té com a variant de punt d’accés de família @ca
label: έχει εναλλακτικό σημείο πρόσβασης για την οικογένεια @el
label: له نقطة وصول مختلفة لعائلة @ar
label: 有家族的变异检索点 @zh-hans
sub property of: suvun hakutieto
sub property of: yhteistoimijan varianttihakutieto
definition: Bir aileyi, belirli bir kelime kodlama şemasında tercih edilmeyen aile için bir erişim noktası olan bir isimle ilişkilendirir. @tr
definition: Correla una famiglia a un punto d'accesso per famiglia non selezionato come preferenza in uno specifico schema di codifica di vocabolario controllato. @it
definition: Hozzákapcsol egy családot egy nomenhez, egy család hozzáférési pontjához, amelyet egy adott szótárkódolási sémában nem részesítenek előnyben. @hu
definition: Liittää suvun nomeniin, joka on suvun hakutieto, jota ei ole valittu ensisijaiseksi tietyssä sanaston merkintäjärjestelmässä.
definition: Met une famille en relation avec un nomen qui est un point d’accès d’une famille ne faisant pas l’objet d’un choix privilégié dans un schéma d’encodage de vocabulaire spécifique. @fr
definition: Relaciona una família amb un nomen que és un punt d’accés de família que no se selecciona com a preferent en un esquema de codificació de vocabulari específic. @ca
definition: Relateert een familie aan een nomen dat is een ingang voor familie die niet bij voorkeur geselecteerd is in een specifiek vocabulair coderingssysteem. @nl
definition: Relaterer en familie til en søkeinngang for familie som ikke er valgt som preferanse i et bestemt kodeskjema for vokabular. @no
definition: Relaterer en familie til et nomen, som er en søgeindgang for familie, som ikke er valgt som præference i et specifikt vokabularkodningsskema. @da
definition: Relates a family to a nomen that is an access point for family that is not selected for preference in a specific vocabulary encoding scheme. @en
definition: Sasaista dzimtu/ģimeni ar nomenu, kas ir piekļuves punkts dzimtai/ģimenei, kas nav izvēlēta kā prioritāra noteiktai kontrolētas vārdnīcas shēmai. @lv
definition: Seostab perekonna perekonna otsielemendiga, mis ei ole valitud eelistatuks vastavas leksikaalses märkimissüsteemis. @et
definition: Setzt eine Familie in Beziehung zu einem Sucheinstieg für eine Familie, der in einem bestimmten Vocabulary Encoding Scheme nicht als Vorzugsform bestimmt wird. @de
definition: يربط عائلة بنقطة وصول لعائلة لم تُختر للتفضيل في خطة ترميز مفردات محددة. @ar
definition: 将一个家族与作为一个家族的检索点、并没有在一个特定的词表编码体系中被首选的一个命名关联起来。 @zh-hans

henkilön auktorisoitu hakutieto
has element type: 3
toolkit definition: A nomen that is an access point for person that is selected for preference in a specific vocabulary encoding scheme. @en
toolkit definition: Belirli bir kelime kodlama şemasında tercih için seçilen kişinin erişim noktası olan bir isim. @tr
toolkit definition: Een nomen dat is een ingang voor persoon die bij voorkeur geselecteerd is in een specifiek vocabulair coderingssysteem. @nl
toolkit definition: Egy nomen, egy személy hozzáférési pontja, amelyet egy adott szótárkódolási sémából választanak ki előnyben részesítettként. @hu
toolkit definition: Ein Sucheinstieg für eine Person, der in einem bestimmten Vocabulary Encoding Scheme als Vorzugsform bestimmt wird. @de
toolkit definition: En søkeinngang for person som er valgt som preferanse i et bestemt kodeskjema for vokabular. @no
toolkit definition: Isiku otsielement, mis on valitud eelistatuks vastavas leksikaalses märkimissüsteemis. @et
toolkit definition: Nomen que és un punt d’accés de persona que se selecciona com a preferent en un esquema de codificació de vocabulari específic. @ca
toolkit definition: Nomen qui est un point d’accès d’une personne faisant l’objet d’un choix privilégié dans un schéma d’encodage de vocabulaire spécifique. @fr
toolkit definition: Nomen, joka on henkilön hakutieto, joka on valittu ensisijaiseksi tietyssä sanaston merkintäjärjestelmässä.
toolkit definition: Nomen, som er en søgeindgang for person, som er valgt som præference i et specifikt vokabularkodningsskema. @da
toolkit definition: Personas pamatforma, kas ir izvēle no konkrētas vārdnīcas. @lv
toolkit definition: Punto d'accesso per persona selezionato come preferenza in uno specifico schema di codifica di vocabolario controllato. @it
toolkit definition: نقطة وصول لشخص تم تحديدها للتفضيل في خطة ترميز مفردات محددة. @ar
toolkit definition: 作为一个个人的检索点、并在一个特定的词表编码体系中被首选的一个命名 @zh-hans
toolkit label: Normierter Sucheinstieg für eine Person @de
toolkit label: authorized access point for person @en
toolkit label: autoriseret søgeindgang for person @da
toolkit label: autorisert søkeinngang for person @no
toolkit label: autorizált hozzáférési pont személyhez: @hu
toolkit label: geautoriseerde ingang voor persoon @nl
toolkit label: henkilön auktorisoitu hakutieto
toolkit label: isiku normitud otsielement @et
toolkit label: kişi için yetkili erişim noktası @tr
toolkit label: personas autoritatīvā pamatforma @lv
toolkit label: point d’accès autorisé d’une personne @fr
toolkit label: punt d’accés autoritzat de persona @ca
toolkit label: punto d'accesso autorizzato per persona @it
toolkit label: καθιερωμένο σημείο πρόσβασης για το φυσικό πρόσωπο @el
toolkit label: نقطة وصول مقننة لشخص @ar
toolkit label: 个人的规范检索点 @zh-hans
has subproperty: P50411
lexical alias: authorizedAccessPointForPerson.en
status: Published
type: Property
domain: C10004
label: a pour point d’accès autorisé d’une personne @fr
label: autorizált hozzáférési pont személyhez a következő: @hu
label: ha come punto d'accesso autorizzato per persona @it
label: har autoriseret søgeindgang for person @da
label: har autorisert søkeinngang for person @no
label: has authorized access point for person @en
label: hat normierten Sucheinstieg für eine Person @de
label: heeft geautoriseerde ingang voor persoon @nl
label: isiku normitud otsielement @et
label: kişi için yetkili erişim noktası ile ilişkilidir @tr
label: personas autoritatīvā pamatforma @lv
label: té com a punt d’accés autoritzat de persona @ca
label: έχει καθιερωμένο σημείο πρόσβασης για το φυσικό πρόσωπο @el
label: له نقطة وصول مقننة لشخص @ar
label: 有个人的规范检索点 @zh-hans
sub property of: henkilön hakutieto
sub property of: toimijan auktorisoitu hakutieto
definition: Bir kişiyi, belirli bir kelime kodlama şemasında tercih edilen kişi için bir erişim noktası olan bir isimle ilişkilendirir. @tr
definition: Correla una persona a un punto d'accesso per persona selezionato come preferenza in uno specifico schema di codifica di vocabolario controllato. @it
definition: Hozzákapcsol egy személyt egy nomenhez, egy személy hozzáférési pontjához, amelyet egy adott szótárkódolási sémából választanak ki előnyben részesítettként. @hu
definition: Liittää henkilön nomeniin, joka on henkilön hakutieto, joka on valittu ensisijaiseksi tietyssä sanaston merkintäjärjestelmässä.
definition: Met une personne en relation avec un nomen qui est un point d’accès d’une personne faisant l’objet d’un choix privilégié dans un schéma d’encodage de vocabulaire spécifique. @fr
definition: Relaciona una persona amb un nomen que és un punt d’accés de persona que se selecciona com a preferent en un esquema de codificació de vocabulari específic. @ca
definition: Relateert een persoon aan een nomen dat is een ingang voor persoon die bij voorkeur geselecteerd is in een specifiek vocabulair coderingssysteem. @nl
definition: Relaterer en person til en søkeinngang for person som er valgt som preferanse i et bestemt kodeskjema for vokabular. @no
definition: Relaterer en person til et nomen, som er en søgeindgang for person, som er valgt som præference i et specifikt vokabularkodningsskema. @da
definition: Relates a person to a nomen that is an access point for person that is selected for preference in a specific vocabulary encoding scheme. @en
definition: Sasaista personu ar nomenu, kas ir personas pamatforma, kas ir izvēle no konkrētas vārdnīcas. @lv
definition: Seostab isiku isiku otsielemendiga, mis on valitud eelistatuks vastavas leksikaalses märkimissüsteemis. @et
definition: Setzt eine Person in Beziehung zu einem Sucheinstieg für eine Person, der in einem bestimmten Vocabulary Encoding Scheme als Vorzugsform bestimmt wird. @de
definition: يربط شخصا بنقطة وصول لشخص تم اختيارها للتفضيل في خطة ترميز مفردات محددة. @ar
definition: 将一个个人与作为一个个人的检索点、并在一个特定的词表编码体系中被首选的一个命名关联起来。 @zh-hans

henkilön varianttihakutieto
has element type: 3
toolkit definition: A nomen that is an access point for person that is not selected for preference in a specific vocabulary encoding scheme. @en
toolkit definition: Belirli bir kelime kodlama şemasında tercih için seçilmemiş kişinin erişim noktası olan bir isim. @tr
toolkit definition: Een nomen dat is een ingang voor persoon die niet bij voorkeur geselecteerd is in een specifiek vocabulair coderingssysteem. @nl
toolkit definition: Egy nomen, egy személy hozzáférési pontja, amelyet egy adott szótárkódolási sémában nem részesítenek előnyben. @hu
toolkit definition: Ein Sucheinstieg für eine Person, der in einem bestimmten Vocabulary Encoding Scheme nicht als Vorzugsform bestimmt wird. @de
toolkit definition: En søkeinngang for person som ikke er valgt som preferanse i et bestemt kodeskjema for vokabular. @no
toolkit definition: Isiku otsielement, mis ei ole valitud eelistatuks vastavas leksikaalses märkimissüsteemis. @et
toolkit definition: Nomen que és un punt d’accés de persona que no se selecciona com a preferent en un esquema de codificació de vocabulari específic. @ca
toolkit definition: Nomen qui est un point d’accès d’une personne ne faisant pas l’objet d’un choix privilégié dans un schéma d’encodage de vocabulaire spécifique. @fr
toolkit definition: Nomen, joka on henkilön hakutieto, jota ei ole valittu ensisijaiseksi tietyssä sanaston merkintäjärjestelmässä.
toolkit definition: Nomen, som er en søgeindgang for person, som ikke er valgt som præference i et specifikt vokabularkodningsskema. @da
toolkit definition: Piekļuves punkts personai, kas nav izvēlēta kā prioritāra noteiktai kontrolētas vārdnīcas shēmai. @lv
toolkit definition: Punto d'accesso per persona non selezionato come preferenza in uno specifico schema di codifica di vocabolario controllato. @it
toolkit definition: نقطة وصول لشخص لم تُختر للتفضيل في خطة ترميز مفردات محددة. @ar
toolkit definition: 作为一个个人的检索点、并没有在一个特定的词表编码体系中被首选的一个命名 @zh-hans
toolkit label: Zusätzlicher Sucheinstieg für eine Person @de
toolkit label: alternativ søkeinngang for person @no
toolkit label: henkilön varianttihakutieto
toolkit label: hozzáférésipont-változat személyhez: @hu
toolkit label: isiku otsielemendi variant @et
toolkit label: kişi için alternatif erişim noktası @tr
toolkit label: personas papildforma @lv
toolkit label: punto d'accesso variante per persona @it
toolkit label: variant access point for person @en
toolkit label: variant af søgeindgang for person @da
toolkit label: variant de punt d’accés de persona @ca
toolkit label: variant ingang voor persoon @nl
toolkit label: variante de point d’accès d’une personne @fr
toolkit label: εναλλακτικό σημείο πρόσβασης για το φυσικό πρόσωπο @el
toolkit label: نقطة وصول مختلفة لشخص @ar
toolkit label: 个人的变异检索点 @zh-hans
has subproperty: P50412
lexical alias: variantAccessPointForPerson.en
status: Published
type: Property
domain: C10004
label: a pour variante de point d’accès d’une personne @fr
label: ha come punto d'accesso variante per persona @it
label: har alternativ søkeinngang for person @no
label: har variant af søgeindgang for person @da
label: has variant access point for person @en
label: hat zusätzlichen Sucheinstieg für eine Person @de
label: heeft variant ingang voor persoon @nl
label: hozzáférésipont-változat személyhez a következő: @hu
label: isiku otsielemendi variant @et
label: kişi için alternatif erişim noktası ile ilişkilidir @tr
label: personas papildforma @lv
label: té com a variant de punt d’accés de persona @ca
label: έχει εναλλακτικό σημείο πρόσβασης για το φυσικό πρόσωπο @el
label: له نقطة وصول مختلفة لشخص @ar
label: 有个人的变异检索点 @zh-hans
sub property of: henkilön hakutieto
sub property of: toimijan varianttihakutieto
definition: Bir kişiyi, belirli bir kelime kodlama şemasında tercih edilmeyen kişi için bir erişim noktası olan bir isimle ilişkilendirir. @tr
definition: Correla una persona a un punto d'accesso per persona non selezionato come preferenza in uno specifico schema di codifica di vocabolario controllato. @it
definition: Hozzákapcsol egy személyt egy nomenhez, egy személy hozzáférési pontjához, amelyet egy adott szótárkódolási sémában nem részesítenek előnyben. @hu
definition: Liittää henkilön nomeniin, joka on henkilön hakutieto, jota ei ole valittu ensisijaiseksi tietyssä sanaston merkintäjärjestelmässä.
definition: Met une personne en relation avec un nomen qui est un point d’accès d’une personne ne faisant pas l’objet d’un choix privilégié dans un schéma d’encodage de vocabulaire spécifique. @fr
definition: Relaciona una persona amb un nomen que és un punt d’accés de persona que no se selecciona com a preferent en un esquema de codificació de vocabulari específic. @ca
definition: Relateert een persoon aan een nomen dat is een ingang voor persoon die niet bij voorkeur geselecteerd is in een specifiek vocabulair coderingssysteem. @nl
definition: Relaterer en person til en søkeinngang for person som ikke er valgt som preferanse i et bestemt kodeskjema for vokabular. @no
definition: Relaterer en person til et nomen, som er en søgeindgang for person, som ikke er valgt som præference i et specifikt vokabularkodningsskema. @da
definition: Relates a person to a nomen that is an access point for person that is not selected for preference in a specific vocabulary encoding scheme. @en
definition: Sasaista personu ar nomenu, kas ir piekļuves punkts personai, kas nav izvēlēta kā prioritāra noteiktai kontrolētas vārdnīcas shēmai. @lv
definition: Seostab isiku isiku otsielemendiga, mis ei ole valitud eelistatuks vastavas leksikaalses märkimissüsteemis. @et
definition: Setzt eine Person in Beziehung zu einem Sucheinstieg für eine Person, der in einem bestimmten Vocabulary Encoding Scheme nicht als Vorzugsform bestimmt wird. @de
definition: يربط شخصا بنقطة وصول لشخص التي لم تُختر للتفضيل في خطة ترميز مفردات محددة. @ar
definition: 将一个个人与作为一个个人的检索点、并没有在一个特定的词表编码体系中被首选的一个命名关联起来。 @zh-hans

toimijan ensisijainen nimi
has element type: 3
toolkit definition: A nomen that is a name of agent that is selected for preference in a specific application or context. @en
toolkit definition: Aģenta vārds/nosaukums, kurš ir izvēlēts noteiktam lietojumam vai noteiktā kontekstā. @lv
toolkit definition: Belirli bir uygulamada veya bağlamda tercih için seçilen temsilcinin adı olan bir isim. @tr
toolkit definition: Een nomen dat is een naam van actor die de voorkeur heeft gekregen in een specifieke applicatie of context. @nl
toolkit definition: Egy nomen, egy ágens neve, amelyet egy bizonyos alkalmazásban vagy kontextusban választanak ki előnyben részesítettként. @hu
toolkit definition: Ein Name eines Akteur, der in einer bestimmten Anwendung oder in einem bestimmten Kontext als Vorzugsform bestimmt wird. @de
toolkit definition: Et navn for agent som er valgt som preferanse i en bestemt applikasjon eller kontekst. @no
toolkit definition: Nome di agente scelto come preferito in una specifica applicazione o contesto. @it
toolkit definition: Nomen que és un nom d’agent que se selecciona com a preferent en una aplicació o context específic. @ca
toolkit definition: Nomen qui est un nom d’agent faisant l’objet d’un choix privilégié dans une application ou un contexte spécifiques. @fr
toolkit definition: Nomen, joka on toimijan nimi, joka on valittu ensisijaiseksi tietyssä sovelluksessa tai kontekstissa.
toolkit definition: Nomen, som er et navn på agent, som er valgt som præference i en specifik anvendelse eller kontekst. @da
toolkit definition: Tegija nimi, mis kindlas rakenduses või kontekstis on valitud eelistatuks. @et
toolkit definition: اسم وكيل اختير كاسم مفضل في تطبيق أو في سياق محدد. @ar
toolkit definition: 作为一个行为者的名称并在一个特定的应用或语境中被首选的一个命名 @zh-hans
toolkit label: Bevorzugter Name eines Akteurs @de
toolkit label: Temsilcinin tercih edilen ismi @tr
toolkit label: aģenta prioritārais vārds/nosaukums @lv
toolkit label: foretrukket navn på agent @da
toolkit label: geprefereerde naam van actor @nl
toolkit label: nom preferit d’agent @ca
toolkit label: nom privilégié d’un agent @fr
toolkit label: nome preferito di agente @it
toolkit label: preferred name of agent @en
toolkit label: tegija eelisnimi @et
toolkit label: toimijan ensisijainen nimi
toolkit label: ágens előnyben részesített neve: @hu
toolkit label: προτιμώμενο όνομα του φορέα @el
toolkit label: اسم مفضل لوكيل @ar
toolkit label: 行为者的首选名称 @zh-hans
has subproperty: henkilön ensisijainen nimi
has subproperty: yhteistoimijan ensisijainen nimi
has subproperty: P50413
lexical alias: preferredNameOfAgent.en
status: Published
type: Property
domain: C10002
label: a pour nom privilégié d’un agent @fr
label: aģenta prioritārais vārds/nosaukums @lv
label: ha come nome preferito di agente @it
label: har foretrukket navn på agent @da
label: has preferred name of agent @en
label: hat bevorzugten Namen eines Akteurs @de
label: heeft geprefereerde naam van actor @nl
label: tegija eelisnimi @et
label: tercih edilen temsilci adı ile ilişkilidir @tr
label: té com a nom preferit d’agent @ca
label: ágens előnyben részesített neve a következő: @hu
label: έχει προτιμώμενο όνομα του φορέα @el
label: له اسم مفضل لوكيل @ar
label: 有行为者的首选名称 @zh-hans
sub property of: toimijan nimi
sub property of: P00021
definition: Bir temsilciyi, özel uygulama veya içerikte kullanılması tercih için seçilen diğer temsilcinin ismi olan bir isimle ilişkilendirir. @tr
definition: Correla un agente a un nome di agente scelto come preferito in una specifica applicazione o contesto. @it
definition: Hozzákapcsol egy ágenst egy nomenhez, egy ágens nevéhez, amelyet egy adott szótárkódolási sémából választanak ki előnyben részesítettként. @hu
definition: Liittää toimijan nomeniin, joka on toimijan nimi, joka on valittu ensisijaiseksi tietyssä sovelluksessa tai kontekstissa.
definition: Met un agent en relation avec un nomen qui est un nom d’agent faisant l’objet d’un choix privilégié dans une application ou un contexte spécifiques. @fr
definition: Relaciona un agent amb un nomen que és un nom d’agent que se selecciona com a preferent en una aplicació o context específic. @ca
definition: Relateert een actor aan een nomen dat is een naam van actor die de voorkeur heeft gekregen in een specifieke applicatie of context. @nl
definition: Relaterer en agent til et navn for agent som er valgt som preferanse i en bestemt applikasjon eller kontekst. @no
definition: Relaterer en agent til et nomen, som er et navn på agent, som er valgt som præference i en specifik anvendelse eller kontekst. @da
definition: Relates an agent to a nomen that is a name of agent that is selected for preference in a specific application or context. @en
definition: Sasaista aģentu ar nomenu, kas ir aģenta vārds/nosaukums, kurš ir izvēlēts noteiktam lietojumam vai noteiktā kontekstā. @lv
definition: Seostab tegija tegija nimega, mis kindlas rakenduses või kontekstis on valitud eelistatuks. @et
definition: Setzt einen Akteur in Beziehung zu einem Namen eines Akteurs, der in einer bestimmten Anwendung oder in einem bestimmten Kontext als Vorzugsform bestimmt wird. @de
definition: يربط وكيلا باسم وكيل اختير كاسم مفضل في تطبيق أو في سياق محدد. @ar
definition: 将一个行为者与作为一个行为者的名称并在一个特定的应用或语境中被首选的一个命名关联起来。 @zh-hans

yhteistoimijan ensisijainen nimi
has element type: 3
toolkit definition: A nomen that is a name of collective agent that is selected for preference in a specific application or context. @en
toolkit definition: Belirli bir uygulamada veya bağlamda tercih için seçilen kolektif temsilcinin adı olan bir isim. @tr
toolkit definition: Een nomen dat is een naam van collectieve actor die de voorkeur heeft gekregen in een specifieke applicatie of context. @nl
toolkit definition: Egy nomen, egy kollektív ágens neve, amelyet egy bizonyos alkalmazásban vagy kontextusban előnyben részesítenek. @hu
toolkit definition: Ein Name eines gemeinschaftlichen Akteurs, der in einer bestimmten Anwendung oder in einem bestimmten Kontext als Vorzugsform bestimmt wird. @de
toolkit definition: Et navn for kollektiv agent som er valgt som preferanse i en bestemt applikasjon eller kontekst. @no
toolkit definition: Grupas nosaukums, kurš ir izvēlēts noteiktam lietojumam vai noteiktā kontekstā. @lv
toolkit definition: Kollektiivi nimi, mis kindlas rakenduses või kontekstis on valitud eelistatuks. @et
toolkit definition: Nome di agente collettivo scelto come preferito in una specifica applicazione o contesto. @it
toolkit definition: Nomen que és un nom d’agent col·lectiu que se selecciona com a preferent en una aplicació o context específic. @ca
toolkit definition: Nomen qui est un nom d’agent collectif faisant l’objet d’un choix privilégié dans une application ou un contexte spécifiques. @fr
toolkit definition: Nomen, joka on yhteistoimijan nimi, joka on valittu ensisijaiseksi tietyssä sovelluksessa tai kontekstissa.
toolkit definition: Nomen, som er et navn på kollektiv agent, som er valgt som præference i en specifik anvendelse eller kontekst. @da
toolkit definition: اسم وكيل جماعي اختير اسما مفضلا في تطبيق أو سياق محدد . @ar
toolkit definition: 作为一个集体行为者的名称并在一个特定的应用或语境中被首选的一个命名 @zh-hans
toolkit label: Bevorzugter Name eines gemeinschaftlichen Akteurs @de
toolkit label: Kolektif temsilcinin tercih edilen ismi @tr
toolkit label: foretrukket navn på kollektiv agent @da
toolkit label: grupas prioritārais nosaukums @lv
toolkit label: kollektiivi eelisnimi @et
toolkit label: kollektív ágens előnyben részesített neve: @hu
toolkit label: nom preferit d’agent col·lectiu @ca
toolkit label: nom privilégié d’un agent collectif @fr
toolkit label: nome preferito di agente collettivo @it
toolkit label: preferred name of collective agent @en
toolkit label: variant naam van actor @nl
toolkit label: yhteistoimijan ensisijainen nimi
toolkit label: προτιμώμενο όνομα του συλλογικού φορέα @el
toolkit label: اسم مفضل لوكيل جماعي @ar
toolkit label: 集体行为者的首选名称 @zh-hans
has subproperty: yhteisön ensisijainen nimi
has subproperty: suvun ensisijainen nimi
has subproperty: P50414
lexical alias: preferredNameOfCollectiveAgent.en
status: Published
type: Property
domain: C10011
label: a pour nom privilégié d’un agent collectif @fr
label: grupas prioritārais nosaukums @lv
label: ha come nome preferito di agente collettivo @it
label: har foretrukket navn på kollektiv agent @da
label: has preferred name of collective agent @en
label: hat bevorzugten Namen eines gemeinschaftlichen Akteurs @de
label: heeft variant naam van actor @nl
label: kollektiivi eelisnimi @et
label: kollektív ágens előnyben részesített neve a következő: @hu
label: tercih edilen kolektif temsilci adı ile ilişkilidir @tr
label: té com a nom preferit d’agent col·lectiu @ca
label: έχει προτιμώμενο όνομα του συλλογικού φορέα @el
label: له اسم مفضل لوكيل جماعي @ar
label: 有集体行为者的首选名称 @zh-hans
sub property of: yhteistoimijan nimi
sub property of: toimijan ensisijainen nimi
definition: Correla un agente collettivo a un nome di agente collettivo scelto come preferito in una specifica applicazione o contesto. @it
definition: Hozzákapcsol egy kollektív ágenst egy nomenhez, egy kollektív ágens nevéhez, amelyet egy bizonyos alkalmazásban vagy kontextusban előnyben részesítenek. @hu
definition: Kolektif bir temsilciyi, belirli bir uygulama veya bağlamda kullanılması tercih edilen diğer ismiyle ilişkilendirir. @tr
definition: Liittää yhteistoimijan nomeniin, joka on yhteistoimijan nimi, joka on valittu ensisijaiseksi tietyssä sovelluksessa tai kontekstissa.
definition: Met un agent collectif en relation avec un nomen qui est un nom d’agent collectif faisant l’objet d’un choix privilégié dans une application ou un contexte spécifiques. @fr
definition: Relaciona un agent col·lectiu amb un nomen que és un nom d’agent col·lectiu que se selecciona com a preferent en una aplicació o context específic. @ca
definition: Relateert een collectieve actor aan een nomen dat is een naam van collectieve actor die de voorkeur heeft gekregen in een specifieke applicatie of context. @nl
definition: Relaterer en kollektiv agent til et navn for kollektiv agent som er valgt som preferanse i en bestemt applikasjon eller kontekst. @no
definition: Relaterer en kollektiv agent til et nomen, som er et navn på kollektiv agent, som er valgt som præference i en specifik anvendelse eller kontekst. @da
definition: Relates a collective agent to a nomen that is a name of collective agent that is selected for preference in a specific application or context. @en
definition: Sasaista grupu ar nomenu, kas ir grupas nosaukums, kurš ir izvēlēts noteiktam lietojumam vai noteiktā kontekstā. @lv
definition: Seostab kollektiivi kollektiivi nimega, mis kindlas rakenduses või kontekstis on valitud eelistatuks. @et
definition: Setzt einen gemeinschaftlichen Akteur in Beziehung zu einem Namen eines gemeinschaftlichen Akteurs, der in einer bestimmten Anwendung oder in einem bestimmten Kontext als Vorzugsform bestimmt wird. @de
definition: يربط وكيلا جماعيا باسم وكيل جماعي اختير اسما مفضلا في تطبيق أوفي سياق محدد. @ar
definition: 将一个集体行为者与作为一个集体行为者的名称并在一个特定的应用或语境中被首选的一个命名关联起来。 @zh-hans

toimijan varianttinimi
has element type: 3
toolkit definition: A nomen that is a name of agent that is not selected for preference in a specific application or context. @en
toolkit definition: Aģenta vārds/nosaukums, kurš nav izvēlēts kā prioritārs noteiktā lietojumprogrammā vai kontekstā. @lv
toolkit definition: Belirli bir uygulamada veya bağlamda tercih için seçilmeyen temsilcinin adı olan bir isim. @tr
toolkit definition: Een nomen dat is een naam van actor die niet de voorkeur heeft gekregen in een specifieke applicatie of context. @nl
toolkit definition: Egy nomen, egy ágens neve, amelyet egy bizonyos alkalmazásban vagy kontextusban nem részesítenek előnyben. @hu
toolkit definition: Ein Name eines Akteurs, der in einer bestimmten Anwendung oder in einem bestimmten Kontext nicht als Vorzugsform bestimmt wird. @de
toolkit definition: Et navn for agent som ikke er valgt som preferanse i en bestemt applikasjon eller kontekst. @no
toolkit definition: Nome di agente non scelto come preferito in una specifica applicazione o contesto. @it
toolkit definition: Nomen que és un nom d’agent que no se selecciona com a preferent en una aplicació o un context específic. @ca
toolkit definition: Nomen qui est un nom d’agent ne faisant pas l’objet d’un choix privilégié dans une application ou un contexte spécifiques. @fr
toolkit definition: Nomen, joka on nimi, jota ei ole valittu toimijan ensisijaiseksi nimeksi tietyssä sovelluksessa tai kontekstissa.
toolkit definition: Nomen, som er et navn på agent, som ikke er valgt som præference i en specifik anvendelse eller kontekst. @da
toolkit definition: Tegija nimi, mis kindlas rakenduses või kontekstis ei ole valitud eelistatuks. @et
toolkit definition: اسم الوكيل لم يُختر كاسم مفضل في خطة ترميز مفردات محددة. @ar
toolkit definition: 作为一个行为者的名称并没有在一个特定的应用或语境中被首选的一个命名 @zh-hans
toolkit label: Abweichender Name eines Akteurs @de
toolkit label: aģenta cits vārds/nosaukums @lv
toolkit label: nome variante di agente @it
toolkit label: tegija variantnimi @et
toolkit label: temsilcinin alternatif ismi @tr
toolkit label: toimijan varianttinimi
toolkit label: variant af navn på agent @da
toolkit label: variant de nom d’agent @ca
toolkit label: variant name of agent @en
toolkit label: variante de nom d’agent @fr
toolkit label: variantform av navn for agent @no
toolkit label: variantnaam van actor @nl
toolkit label: ágens névváltozata: @hu
toolkit label: εναλλακτικό όνομα του φορέα @el
toolkit label: اسم مختلف لوكيل @ar
toolkit label: 行为者的变异名称 @zh-hans
has subproperty: henkilön varianttinimi
has subproperty: yhteistoimijan varianttinimi
has subproperty: P50415
lexical alias: variantNameOfAgent.en
status: Published
type: Property
domain: C10002
label: a pour variante de nom d’agent @fr
label: aģenta cits vārds/nosaukums @lv
label: ha come nome variante di agente @it
label: har variant af navn på agent @da
label: har variantform av navn for agent @no
label: has variant name of agent @en
label: hat abweichenden Namen eines Akteurs @de
label: heeft variantnaam van actor @nl
label: tegija variantnimi @et
label: temsilcinin alternatif ismi ile ilişkilidir @tr
label: té com a variant de nom d’agent @ca
label: ágens névváltozata a következő: @hu
label: έχει εναλλακτικό όνομα του φορέα @el
label: له اسم مختلف لوكيل @ar
label: 有行为者的变异名称 @zh-hans
sub property of: toimijan nimi
sub property of: P00023
definition: Bir temsilciyi, belirli bir uygulamada veya içerikte kullanılması tercih için için seçilmemiş bir isimle ilişkilendirir. @tr
definition: Correla un agente a un nome di agente non scelto come preferito in una specifica applicazione o contesto. @it
definition: Hozzákapcsol egy ágenst egy nomenhez, egy ágens nevéhez, amelyet egy bizonyos alkalmazásban vagy kontextusban nem részesítenek előnyben. @hu
definition: Liittää toimijan nomeniin, joka on nimi, jota ei ole valittu toimijan ensisijaiseksi nimeksi tietyssä sovelluksessa tai kontekstissa.
definition: Met un agent en relation avec un nomen qui est un nom d’agent ne faisant pas l’objet d’un choix privilégié dans une application ou un contexte spécifiques. @fr
definition: Relaciona un agent amb un nomen que és un nom d’agent que no se selecciona com a preferent en una aplicació o un context específic. @ca
definition: Relateert een actor aan een nomen dat is een naam van actor die niet de voorkeur heeft gekregen in een specifieke applicatie of context. @nl
definition: Relaterer en agent til et navn for agent som ikke er valgt som preferanse i en bestemt applikasjon eller kontekst. @no
definition: Relaterer en agent til et nomen, som er et navn på agent, som ikke er valgt som præference i en specifik anvendelse eller kontekst. @da
definition: Relates an agent to a nomen that is a name of agent that is not selected for preference in a specific application or context. @en
definition: Sasaista aģentu ar nomenu, kas ir aģenta vārds/nosaukums, kurš nav izvēlēts kā prioritārs noteiktā lietojumprogrammā vai kontekstā. @lv
definition: Seostab tegija tegija nimega, mis kindlas rakenduses või kontekstis ei ole valitud eelistatuks. @et
definition: Setzt einen Akteur in Beziehung zu einem Namen eines Akteurs, der in einer bestimmten Anwendung oder in einem bestimmten Kontext nicht als Vorzugsform bestimmt wird. @de
definition: يربط وكيلا باسم وكيل لم يُختر كاسم مفضل في خطة ترميز مفردات محددة. @ar
definition: 将一个行为者与作为一个行为者的名称并没有在一个特定的应用或语境中被首选的一个命名关联起来。 @zh-hans

yhteistoimijan varianttinimi
has element type: 3
toolkit definition: A nomen that is a name of collective agent that is not selected for preference in a specific application or context. @en
toolkit definition: Belirli bir uygulamada veya bağlamda tercih için seçilmeyen kolektif temsilcinin adı olan bir isim. @tr
toolkit definition: Een nomen dat is een naam van collectieve actor die niet de voorkeur heeft gekregen in een specifieke applicatie of context. @nl
toolkit definition: Egy nomen, egy kollektív ágens neve, amelyet egy bizonyos alkalmazásban vagy kontextusban nem részesítenek előnyben. @hu
toolkit definition: Ein Name eines gemeinschaftlichen Akteurs, der in einer bestimmten Anwendung oder in einem bestimmten Kontext nicht als Vorzugsform bestimmt wird. @de
toolkit definition: Et navn for kollektiv agent som ikke er valgt som preferanse i en bestemt applikasjon eller kontekst. @no
toolkit definition: Grupas vārds/nosaukums, kurš nav izvēlēts kā prioritārs noteiktā lietojumprogrammā vai kontekstā. @lv
toolkit definition: Kollektiivi nimi, mis kindlas rakenduses või kontekstis ei ole valitud eelistatuks. @et
toolkit definition: Nome di agente collettivo non scelto come preferito in una specifica applicazione o contesto. @it
toolkit definition: Nomen que és un nom d’agent col·lectiu que no se selecciona com a preferent en una aplicació o un context específic. @ca
toolkit definition: Nomen qui est un nom d’agent collectif ne faisant pas l’objet d’un choix privilégié dans une application ou un contexte spécifiques. @fr
toolkit definition: Nomen, joka on nimi, jota ei ole valittu yhteistoimijan ensisijaiseksi nimeksi tietyssä sovelluksessa tai kontekstissa.
toolkit definition: Nomen, som er et navn på kollektiv agent, som ikke er valgt som præference i en specifik anvendelse eller kontekst. @da
toolkit definition: اسم وكيل جماعي لم يُختر للتفضيل في خطة ترميز مفردات محددة. @ar
toolkit definition: 作为一个集体行为者的名称并没有在一个特定的应用或语境中被首选的一个命名 @zh-hans
toolkit label: Abweichender Name eines gemeinschaftlichen Akteurs @de
toolkit label: grupas cits vārds/nosaukums @lv
toolkit label: kolektif temsilcinin alternatif ismi @tr
toolkit label: kollektiivi variantnimi @et
toolkit label: kollektív ágens névváltozata: @hu
toolkit label: nome variante di agente collettivo @it
toolkit label: variant af navn på kollektiv agent @da
toolkit label: variant de nom d’agent col·lectiu @ca
toolkit label: variant naam van collectieve actor @nl
toolkit label: variant name of collective agent @en
toolkit label: variante de nom d’agent collectif @fr
toolkit label: variantform av navn for kollektiv agent @no
toolkit label: yhteistoimijan varianttinimi
toolkit label: εναλλακτικό όνομα του συλλογικού φορέα @el
toolkit label: اسم مختلف لوكيل جماعي @ar
toolkit label: 集体行为者的变异名称 @zh-hans
has subproperty: yhteisön varianttinimi
has subproperty: suvun varianttinimi
has subproperty: P50416
lexical alias: variantNameOfCollectiveAgent.en
status: Published
type: Property
domain: C10011
label: a pour variante de nom d’agent collectif @fr
label: grupas cits vārds/nosaukums @lv
label: ha come nome variante di agente @it
label: har variant af navn på kollektiv agent @da
label: har variantform av navn for kollektiv agent @no
label: has variant name of collective agent @en
label: hat abweichenden Namen eines gemeinschaftlichen Akteurs @de
label: heeft variant naam van collectieve actor @nl
label: kolektif temsilcinin alternatif ismi ile ilişkilidir @tr
label: kollektiivi variantnimi @et
label: kollektív ágens névváltozata a következő: @hu
label: té com a variant de nom d’agent col·lectiu @ca
label: έχει εναλλακτικό όνομα του συλλογικού φορέα @el
label: له اسم مختلف لوكيل الجماعي @ar
label: 有集体行为者的变异名称 @zh-hans
sub property of: yhteistoimijan nimi
sub property of: toimijan varianttinimi
definition: Correla un agente collettivo a un nome di agente collettivo non scelto come preferito in una specifica applicazione o contesto. @it
definition: Hozzákapcsol egy kollektív ágenst egy nomenhez, egy kollektív ágens nevéhez, amelyet egy bizonyos alkalmazásban vagy kontextusban nem részesítenek előnyben. @hu
definition: Kolektif bir temsilciyi, belirli bir uygulama veya bağlamda kullanılması tercih edilmeyen diğer ismiyle ilişkilendirir. @tr
definition: Liittää yhteistoimijan nomeniin, joka on nimi, jota ei ole valittu yhteistoimijan ensisijaiseksi nimeksi tietyssä sovelluksessa tai kontekstissa.
definition: Met un agent collectif en relation avec un nomen qui est un nom d’agent collectif ne faisant pas l’objet d’un choix privilégié dans une application ou un contexte spécifiques. @fr
definition: Relaciona un agent col·lectiu amb un nomen que és un nom d’agent col·lectiu que no se selecciona com a preferent en una aplicació o un context específic. @ca
definition: Relateert een collectieve actor aan een nomen dat is een naam van collectieve actor die niet de voorkeur heeft gekregen in een specifieke applicatie of context. @nl
definition: Relaterer en kollektiv agent til et navn for kollektiv agent som ikke er valgt som preferanse i en bestemt applikasjon eller kontekst. @no
definition: Relaterer en kollektiv agent til et nomen, som er et navn på kollektiv agent, som ikke er valgt som præference i en specifik anvendelse eller kontekst. @da
definition: Relates a collective agent to a nomen that is a name of collective agent that is not selected for preference in a specific application or context. @en
definition: Sasaista grupu ar nomenu, kas ir grupas vārds/nosaukums, kurš nav izvēlēts kā prioritārs noteiktā lietojumprogrammā vai kontekstā. @lv
definition: Seostab kollektiivi kollektiivi nimega, mis kindlas rakenduses või kontekstis ei ole valitud eelistatuks. @et
definition: Setzt einen gemeinschaftlichen Akteur in Beziehung zu einem Namen eines gemeinschaftlichen Akteurs, der in einer bestimmten Anwendung oder in einem bestimmten Kontext nicht als Vorzugsform bestimmt wird. @de
definition: نقطة وصول لشخص اختيرت للتفضيل في خطة ترميز مفردات محددة. @ar
definition: 将一个集体行为者与作为一个集体行为者的名称并没有在一个特定的应用或语境中被首选的一个命名关联起来。 @zh-hans

tunnettu jäsen suvussa
has element type: 2
toolkit definition: A family who has a well-known individual as a member. @en
toolkit definition: Dzimta/ģimene, kā loceklis ir pazīstama/zināma persona. @lv
toolkit definition: Een familie die een welbekend individu als lid heeft. @nl
toolkit definition: Egy család, amelynek tagja egy jól ismert egyén. @hu
toolkit definition: Eine Familie, die ein bekanntes Individuum als Mitglied hat. @de
toolkit definition: En familie som har et godt kjent individ som et medlem. @no
toolkit definition: Famiglia che ha un individuo molto conosciuto come membro. @it
toolkit definition: Familie, som har et velkendt individ som medlem. @da
toolkit definition: Famille dont est membre une personne jouissant d’une certaine notoriété. @fr
toolkit definition: Família que té un individu ben conegut com a membre. @ca
toolkit definition: Perekond, kelle liige on üldtuntud üksikisik. @et
toolkit definition: Suku, jonka tunnettu jäsen henkilö on.
toolkit definition: Tanınmış bir kişinin üyesi olduğu bir aile @tr
toolkit definition: عائلة لها فرد معروف كعضو. @ar
toolkit definition: 有一个著名个体作为其成员的一个家族 @zh-hans
toolkit label: Ailenin seçkin üyesi @tr
toolkit label: Bedeutendes Familienmitglied von @de
toolkit label: Hozzákapcsol egy személyt egy családhoz, amelynek tagja egy jól ismert egyén. @hu
toolkit label: framstående medlem av familie for @no
toolkit label: fremtrædende medlem af familie af @da
toolkit label: ir ievērojams piederīgais dzimtai/ģimenei @lv
toolkit label: membre destacat d’una família de @ca
toolkit label: membre illustre d’une famille de @fr
toolkit label: membro illustre di famiglia di @it
toolkit label: prominent lid van familie van @nl
toolkit label: prominent member of family of @en
toolkit label: silmapaistev liige perekonnas @et
toolkit label: tunnettu jäsen suvussa
toolkit label: διακεκριμένο μέλος της οικογένειας του @el
toolkit label: عضو بارز في العائلة @ar
toolkit label: ……的家族的著名成员 @zh-hans
has subproperty: P50417
lexical alias: prominentMemberOfFamilyOf.en
status: Published
type: Property
domain: C10004
label: ailesinin seçkin üyesidir @tr
label: er fremtrædende medlem af familie af @da
label: est un membre illustre d’une famille de @fr
label: har framstående medlem av familie for @no
label: ir ievērojams piederīgais dzimtai/ģimenei @lv
label: is prominent lid van familie van @nl
label: is prominent member of family of @en
label: ist bedeutendes Familienmitglied von @de
label: prominens tagja a következő családnak: @hu
label: silmapaistev liige perekonnas @et
label: è membro illustre di famiglia di @it
label: és membre destacat d’una família de @ca
label: είναι διακεκριμένο μέλος της οικογένειας του @el
label: هو عضو بارز لعائلة لـ @ar
label: 是……的家族的著名成员 @zh-hans
sub property of: henkilöjäsen suvussa
definition: Bir kişiyi, tanınmış bir kişinin üyesi olduğu bir aileyle ilişkilendirir @tr
definition: Correla una persona a una famiglia che ha un individuo molto conosciuto come membro. @it
definition: Liittää henkilön sukuun, jonka tunnettu jäsen henkilö on.
definition: Met une personne en relation avec une famille dont est membre une personne jouissant d’une certaine notoriété. @fr
definition: Relaciona una persona amb una família que té un individu ben conegut com a membre. @ca
definition: Relateert een persoon aan een familie die een welbekend individu als lid heeft. @nl
definition: Relaterer en person til en familie som har et godt kjent individ som et medlem. @no
definition: Relaterer en person til en familie, som har et velkendt individ som medlem. @da
definition: Relates a person to a family who has a well-known individual as a member. @en
definition: Sasaista personu ar dzimtu/ģimeni, kā loceklis ir pazīstama/zināma persona. @lv
definition: Seostab isiku perekonnaga, kelle liige on üldtuntud üksikisik. @et
definition: Setzt eine Person in Beziehung zu einer Familie, die ein bekanntes Individuum als Mitglied hat. @de
definition: prominens tagja a következő családnak: @hu
definition: يربط شخصا بعائلة لها عضو مشهور. @ar
definition: 将一个个人与有一个著名个体作为其成员的一个家族关联起来。 @zh-hans

toimijan osoite
has element type: 6
toolkit definition: Adresse d’un agent. @fr
toolkit definition: Adresse på en agent. @da
toolkit definition: Adreça d’un agent. @ca
toolkit definition: An address of an agent. @en
toolkit definition: Aģenta adrese. @lv
toolkit definition: Bir temsilcinin adresi @tr
toolkit definition: Een adres van een actor. @nl
toolkit definition: Egy ágens címe. @hu
toolkit definition: Eine Adresse eines Akteurs. @de
toolkit definition: En adresse for en agent. @no
toolkit definition: Indirizzo di un agente. @it
toolkit definition: Tegija aadress. @et
toolkit definition: Toimijan osoite.
toolkit definition: عنوان مراسلة وكيل معين. @ar
toolkit definition: 一个行为者的一个地址 @zh-hans
toolkit label: Adresse eines Akteurs @de
toolkit label: Temsilcinin adresi @tr
toolkit label: address of agent @en
toolkit label: adres van actor @nl
toolkit label: adresse d’un agent @fr
toolkit label: adresse for agent @no
toolkit label: adresse på agent @da
toolkit label: adreça d’un agent @ca
toolkit label: aģenta adrese @lv
toolkit label: indirizzo di agente @it
toolkit label: tegija aadress @et
toolkit label: toimijan osoite
toolkit label: ágens címe: @hu
toolkit label: διεύθυνση του φορέα @el
toolkit label: عنوان وكيل @ar
toolkit label: 行为者的地址 @zh-hans
has subproperty: henkilön osoite
has subproperty: yhteistoimijan osoite
has subproperty: P50418
lexical alias: addressOfAgent.en
status: Published
type: Property
domain: C10002
label: a pour adresse d’un agent @fr
label: aģenta adrese @lv
label: ha come indirizzo di agente @it
label: har adresse for agent @no
label: har adresse på agent @da
label: has address of agent @en
label: hat Adresse eines Akteurs @de
label: heeft adres van actor @nl
label: tegija aadress @et
label: temsilcinin adresi ile ilişkilidir @tr
label: té com a adreça d’un agent @ca
label: ágens címe a következő: @hu
label: έχει διεύθυνση του φορέα @el
label: لديه عنوان لوكيل @ar
label: 有行为者的地址 @zh-hans
definition: Bir temsilciyi, bir temsilcinin adresiyle ilişkilendirir. @tr
definition: Correla un agente a un indirizzo di un agente. @it
definition: Hozzákapcsol egy ágenst egy ágens címéhez. @hu
definition: Liittää toimijan sen osoitteeseen.
definition: Met un agent en relation avec une adresse d’un agent. @fr
definition: Relaciona un agent amb una adreça d’un agent. @ca
definition: Relateert een actor aan een adres van een actor. @nl
definition: Relaterer en agent til en adresse for en agent. @no
definition: Relaterer en agent til en adresse på en agent. @da
definition: Relates an agent to an address of an agent. @en
definition: Sasaista aģentu ar aģenta adresi. @lv
definition: Seostab tegija tegija aadressiga. @et
definition: Setzt einen Akteur in Beziehung zu einer Adresse eines Akteurs. @de
definition: يربط وكيلا بعنوان مراسلة لوكيل. @ar
definition: 将一个行为者与一个行为者的一个地址关联起来。 @zh-hans
scope note: Comprend une adresse de courrier électronique ou une autre adresse en ligne. @fr
scope note: Comprende un indirizzo di posta elettronica o altro indirizzo online. @it
scope note: Darunter fallen E-Mail-Adressen oder andere Online-Adressen. @de
scope note: Email vagy más online cím is idetartozik. @hu
scope note: Hõlmab ka e-posti vm võrguaadressi. @et
scope note: Ietver e-pastu vai citu tiešsaistes adresi. @lv
scope note: Inclou un correu electrònic o qualsevol altra adreça en línia. @ca
scope note: Includes an email or other online address. @en
scope note: Inkluderer en epost eller annen online adresse. @no
scope note: Omfatter en e-mail eller anden online-adresse. @da

yhteistoimijan osoite
has element type: 6
toolkit definition: Adresse d’un agent collectif. @fr
toolkit definition: Adresse på en kollektiv agent. @da
toolkit definition: Adreça d’un agent col·lectiu. @ca
toolkit definition: An address of a collective agent. @en
toolkit definition: Bir kolektif temsilcinin adresi @tr
toolkit definition: Een adres van een collectieve actor. @nl
toolkit definition: Egy kollektív ágens címe. @hu
toolkit definition: Eine Adresse eines gemeinschaftlichen Akteurs. @de
toolkit definition: En adresse for en kollektiv agent. @no
toolkit definition: Grupas adrese. @lv
toolkit definition: Indirizzo di un agente collettivo. @it
toolkit definition: Kollektiivi aadress. @et
toolkit definition: Yhteistoimijan osoite.
toolkit definition: عنوان مراسلة وكيل جماعي. @ar
toolkit definition: 一个集体行为者的一个地址 @zh-hans
toolkit label: Adresse eines gemeinschaftlichen Akteurs @de
toolkit label: Kolektif temsilcinin adresi @tr
toolkit label: address of collective agent @en
toolkit label: adres van collectieve actor @nl
toolkit label: adresse d’un agent collectif @fr
toolkit label: adresse for kollektiv agent @no
toolkit label: adresse på kollektiv agent @da
toolkit label: adreça d’un agent col·lectiu @ca
toolkit label: grupas adrese @lv
toolkit label: indirizzo di agente collettivo @it
toolkit label: kollektiivi aadress @et
toolkit label: kollektív ágens címe: @hu
toolkit label: yhteistoimijan osoite
toolkit label: διεύθυνση του συλλογικού φορέα @el
toolkit label: عنوان وكيل جماعي @ar
toolkit label: 集体行为者的地址 @zh-hans
has subproperty: yhteisön osoite
has subproperty: suvun osoite
has subproperty: P50419
lexical alias: addressOfCollectiveAgent.en
status: Published
type: Property
domain: C10011
label: a pour adresse d’un agent collectif @fr
label: grupas adrese @lv
label: ha come indirizzo di agente collettivo @it
label: har adresse for kollektiv agent @no
label: har adresse på kollektiv agent @da
label: has address of collective agent @en
label: hat Adresse eines gemeinschaftlichen Akteurs @de
label: heeft adres van collectieve actor @nl
label: kolektif temsilcinin adresi ile ilişkilidir @tr
label: kollektiivi aadress @et
label: kollektív ágens címe a következő: @hu
label: té com a adreça d’un agent col·lectiu @ca
label: έχει διεύθυνση του συλλογικού φορέα @el
label: له عنوان مراسلة لوكيل جماعي @ar
label: 有集体行为者的地址 @zh-hans
sub property of: toimijan osoite
definition: Correla un agente collettivo a un indirizzo di un agente collettivo. @it
definition: Hozzákapcsol egy kollektív ágenst egy kollektív ágens címéhez. @hu
definition: Kolektif bir temsilciyi, bir kollektif temsilcinin adresiyle ilişkilendirir. @tr
definition: Liittää yhteistoimijan sen osoitteeseen.
definition: Met un agent collectif en relation avec une adresse d’un agent collectif. @fr
definition: Relaciona un agent col·lectiu amb una adreça d’un agent col·lectiu. @ca
definition: Relateert een collectieve actor aan een adres van een collectieve actor. @nl
definition: Relaterer en kollektiv agent til en adresse for en kollektiv agent. @no
definition: Relaterer en kollektiv agent til en adresse på en kollektiv agent. @da
definition: Relates a collective agent to an address of a collective agent. @en
definition: Sasaista grupu ar grupas adresi. @lv
definition: Seostab kollektiivi kollektiivi aadressiga. @et
definition: Setzt einen gemeinschaftlichen Akteur in Beziehung zu einer Adresse eines gemeinschaftlichen Akteurs. @de
definition: يربط وكيلا جماعيا بعنوان مراسلة لوكيل جماعي. @ar
definition: 将一个集体行为者与一个集体行为者的一个地址关联起来。 @zh-hans
scope note: Comprend une adresse de courrier électronique ou une autre adresse en ligne. @fr
scope note: Comprende un indirizzo di posta elettronica o altro indirizzo online. @it
scope note: Darunter fallen E-Mail-Adressen oder andere Online-Adressen. @de
scope note: Email vagy más online cím is idetartozik. @hu
scope note: Hõlmab ka e-posti vm võrguaadressi. @et
scope note: Ietver e-pastu vai citu tiešsaistes adresi. @lv
scope note: Inclou un correu electrònic o qualsevol altra adreça en línia. @ca
scope note: Includes an email or other online address. @en
scope note: Inkluderer en epost eller annen online adresse. @no

suvun osoite
has element type: 6
toolkit definition: Adresse d’une famille. @fr
toolkit definition: Adresse på en familie. @da
toolkit definition: Adreça d’una família. @ca
toolkit definition: An address of a family. @en
toolkit definition: Bir ailenin adresi @tr
toolkit definition: Dzimtas/ģimenes adrese. @lv
toolkit definition: Een adres van een familie. @nl
toolkit definition: Egy család címe. @hu
toolkit definition: Eine Adresse einer Familie. @de
toolkit definition: En adresse for en familie. @no
toolkit definition: Indirizzo di una famiglia. @it
toolkit definition: Perekonna aadress. @et
toolkit definition: Suvun osoite.
toolkit definition: عنوان مراسلة لعائلة. @ar
toolkit definition: 一个家族的一个地址 @zh-hans
toolkit label: Adresse einer Familie @de
toolkit label: Ailenin adresi @tr
toolkit label: address of family @en
toolkit label: adres van familie @nl
toolkit label: adresse d’une famille @fr
toolkit label: adresse for familie @no
toolkit label: adresse på agent @da
toolkit label: adreça d’una família @ca
toolkit label: család címe: @hu
toolkit label: dzimtas/ģimenes adrese @lv
toolkit label: indirizzo di famiglia @it
toolkit label: perekonna aadress @et
toolkit label: suvun osoite
toolkit label: διεύθυνση της οικογένειας @el
toolkit label: عنوان عائلة @ar
toolkit label: 家族的地址 @zh-hans
has subproperty: P50420
lexical alias: addressOfFamily.en
status: Published
type: Property
domain: C10008
label: a pour adresse d’une famille @fr
label: ailenin adresi ile ilişkilidir @tr
label: család címe a következő: @hu
label: dzimtas/ģimenes adrese @lv
label: ha come indirizzo di famiglia @it
label: har adresse for familie @no
label: har adresse på familie @da
label: has address of family @en
label: hat Adresse einer Familie @de
label: heeft adres van familie @nl
label: perekonna aadress @et
label: té com a adreça d’una família @ca
label: έχει διεύθυνση της οικογένειας @el
label: لها عنوان مراسلة لعائلة @ar
label: 有家族的地址 @zh-hans
sub property of: yhteistoimijan osoite
definition: Bir aileyi, bir ailenin adresi ile ilişkilendirir. @tr
definition: Correla una famiglia a un indirizzo di una famiglia. @it
definition: Hozzákapcsol egy családot egy család címéhez. @hu
definition: Liittää suvun sen osoitteeseen.
definition: Met une famille en relation avec une adresse d’une famille. @fr
definition: Relaciona una família amb una adreça d’una família. @ca
definition: Relateert een familie aan een adres van een familie. @nl
definition: Relaterer en familie til en adresse for en familie. @no
definition: Relaterer en familie til en adresse på en familie. @da
definition: Relates a family to an address of a family. @en
definition: Sasaista dzimtu/ģimeni ar dzimtas/ģimenes adresi. @lv
definition: Seostab perekonna perekonna aadressiga. @et
definition: Setzt eine Familie in Beziehung zu einer Adresse einer Familie. @de
definition: يربط عائلة بعنوان مراسلة لعائلة. @ar
definition: 将一个家族与一个家族的一个地址关联起来。 @zh-hans
scope note: Comprend une adresse de courrier électronique ou une autre adresse en ligne. @fr
scope note: Comprende un indirizzo di posta elettronica o altro indirizzo online. @it
scope note: Darunter fallen E-Mail-Adressen oder andere Online-Adressen. @de
scope note: Email vagy más online cím is idetartozik. @hu
scope note: Hõlmab ka e-posti vm võrguaadressi. @et
scope note: Ietver e-pastu vai citu tiešsaistes adresi. @lv
scope note: Inclou un correu electrònic o qualsevol altra adreça en línia. @ca
scope note: Includes an email or other online address. @en
scope note: Inkluderer en epost eller annen online adresse. @no
scope note: Omfatter en e-mail eller anden online-adresse. @da
scope note: Omvat tevens een e-mail of ander online adres. @nl

yhteistoimijan edeltäjä
has element type: 2
toolkit definition: A collective agent who precedes another collective agent. @en
toolkit definition: Agent collectif qui précède un autre agent collectif. @fr
toolkit definition: Agent col·lectiu que precedeix un altre agent col·lectiu. @ca
toolkit definition: Agente collettivo che precede un altro agente collettivo. @it
toolkit definition: Başka bir kolektif temsilciden önce gelen kolektif bir temsilci @tr
toolkit definition: Een collectieve actor die aan een andere collectieve actor voorafgaat. @nl
toolkit definition: Egy kollektív ágens, amely elődje egy másik kollektív ágensnek. @hu
toolkit definition: Ein gemeinschaftlicher Akteur, der einem anderem gemeinschaftlichen Akteur vorausgeht. @de
toolkit definition: En kollektiv agent som kommer før en annen kollektiv agent. @no
toolkit definition: Grupa, citas grupas priekštecis. @lv
toolkit definition: Kollektiiv, mis eelneb teisele kollektiivile. @et
toolkit definition: Kollektiv agent, som går forud for en anden kollektiv agent. @da
toolkit definition: Yhteistoimija, joka edeltää toista yhteistoimijaa.
toolkit definition: وكيل جماعي سلف لوكيل جماعي آخر. @ar
toolkit definition: 是另一个集体行为者前身的一个集体行为者 @zh-hans
toolkit label: Kolektif temsilcinin üöncüsü @tr
toolkit label: Vorgängerin/Vorgänger eines gemeinschaftlichen Akteurs @de
toolkit label: forgjenger for kollektiv agent @no
toolkit label: forgænger til kollektiv agent @da
toolkit label: grupas priekštecis (grupa) @lv
toolkit label: kollektiivi eelkäija @et
toolkit label: kollektív ágens elődje: @hu
toolkit label: predecessor d’un agent col·lectiu @ca
toolkit label: predecessor of collective agent @en
toolkit label: predecessore di agente collettivo @it
toolkit label: prédécesseur d’un agent collectif @fr
toolkit label: voorganger van collectieve actor @nl
toolkit label: yhteistoimijan edeltäjä
toolkit label: πρόγονος του συλλογικού φορέα @el
toolkit label: سلف لوكيل جماعي @ar
toolkit label: 集体行为者的前身 @zh-hans
has subproperty: yhteisön edeltäjä
has subproperty: suvun edeltäjä
has subproperty: P50421
lexical alias: predecessorOfCollectiveAgent.en
status: Published
type: Property
domain: C10011
label: a pour prédécesseur d’un agent collectif @fr
label: grupas priekštecis (grupa) @lv
label: ha come predecessore di agente collettivo @it
label: har forgjenger for kollektiv agent @no
label: har forgænger til kollektiv agent @da
label: has predecessor of collective agent @en
label: hat Vorgängerin/Vorgänger eines gemeinschaftlichen Akteurs @de
label: heeft voorganger van collectieve actor @nl
label: kollektiivi eelkäija @et
label: kollektív ágens elődje a következő: @hu
label: té com a predecessor d’un agent col·lectiu @ca
label: önceki kolektif temsilci ile ilişkilidir @tr
label: έχει πρόγονο του συλλογικού φορέα @el
label: له سلف لوكيل جماعي @ar
label: 有集体行为者的前身 @zh-hans
sub property of: yhteistoimijaan liittyvä yhteistoimija
definition: Correla un agente collettivo a un agente collettivo che precede un altro agente collettivo. @it
definition: Hozzákapcsol egy kollektív ágenst egy kollektív ágenshez, amely elődje a másik kollektív ágensnek. @hu
definition: Kolektif bir temsilciyi, başka bir kolektif temsilciden önce gelen bir kolektif temsilciyle ilişkilendirir. @tr
definition: Liittää yhteistoimijan yhteistoimijaan, joka edeltää toista yhteistoimijaa.
definition: Met un agent collectif en relation avec un agent collectif qui précède un autre agent collectif. @fr
definition: Relaciona un agent col·lectiu amb un agent col·lectiu que precedeix un altre agent col·lectiu. @ca
definition: Relateert een collectieve actor aan een collectieve actor die aan een andere collectieve actor voorafgaat. @nl
definition: Relaterer en kollektiv agent til en kollektiv agent som kommer før en annen kollektiv agent. @no
definition: Relaterer en kollektiv agent til en kollektiv agent, som går forud for en anden kollektiv agent. @da
definition: Relates a collective agent to a collective agent who precedes another collective agent. @en
definition: Sasaista grupu ar grupu, kas ir citas grupas priekštecis. @lv
definition: Seostab kollektiivi kollektiiviga, mis eelneb teisele kollektiivile. @et
definition: Setzt einen gemeinschaftlichen Akteur in Beziehung zu einem gemeinschaftlichen Akteur, der einem anderem gemeinschaftlichen Akteur vorausgeht. @de
definition: يربط وكيلا جماعيا بوكيل جماعي سلف لوكيل جماعي آخر. @ar
definition: 将一个集体行为者与是另一个集体行为者前身的一个集体行为者关联起来。 @zh-hans

suvun edeltäjä
has element type: 2
toolkit definition: A family who precedes another family. @en
toolkit definition: Başka bir aileden önce gelen bir aile. @tr
toolkit definition: Dzimta/ģimene, kas ir citas dzimtas/ģimenes priekštecis. @lv
toolkit definition: Een familie die aan een andere familie voorafgaat. @nl
toolkit definition: Egy család, amely elődje egy másik családnak. @hu
toolkit definition: Eine Familie, die einer anderen Familie vorausgeht. @de
toolkit definition: En familie som kommer før en annen familie. @no
toolkit definition: Famiglia che precede un'altra famiglia. @it
toolkit definition: Familie, som går forud for en anden familie. @da
toolkit definition: Famille qui précède une autre famille. @fr
toolkit definition: Família que precedeix una altra família. @ca
toolkit definition: Perekond, mis eelneb teisele perekonnale. @et
toolkit definition: Suku, joka edeltää toista sukua.
toolkit definition: عائلة هي سلف لعائلة أخرى. @ar
toolkit definition: 是另一个家族前身的一个家族 @zh-hans
toolkit label: Ailenin öncüsü @tr
toolkit label: Vorgängerin/Vorgänger einer Familie @de
toolkit label: család elődje: @hu
toolkit label: dzimtas/ģimenes priekštecis (dzimta/ģimene) @lv
toolkit label: forgjenger for familie @no
toolkit label: forgænger til familie @da
toolkit label: perekonna eelkäija @et
toolkit label: predecessor d’una família @ca
toolkit label: predecessor of family @en
toolkit label: predecessore di famiglia @it
toolkit label: prédécesseur d’une famille @fr
toolkit label: suvun edeltäjä
toolkit label: voorganger van familie @nl
toolkit label: πρόγονος της οικογένειας @el
toolkit label: سلف لعائلة @ar
toolkit label: 家族的前身 @zh-hans
has subproperty: P50422
lexical alias: predecessorOfFamily.en
status: Published
type: Property
domain: C10008
label: a pour prédécesseur d’une famille @fr
label: család elődje a következő: @hu
label: dzimtas/ģimenes priekštecis (dzimta/ģimene) @lv
label: ha come predecessore di famiglia @it
label: har forgjenger for familie @no
label: har forgænger til familie @da
label: has predecessor of family @en
label: hat Vorgängerin/Vorgänger einer Familie @de
label: heeft voorganger van familie @nl
label: perekonna eelkäija @et
label: té com a predecessor d’una família @ca
label: önceki aile ile ilişkilidir @tr
label: έχει πρόγονο της οικογένειας @el
label: له سلف لعائلة @ar
label: 有家族的前身 @zh-hans
sub property of: sukuun liittyvä suku
sub property of: yhteistoimijan edeltäjä
definition: Bir aileyi başka bir aileden önce gelen bir aileyle ilişkilendirir. @tr
definition: Correla una famiglia a una famiglia che precede un'altra famiglia. @it
definition: Hozzákapcsol egy családot egy családhoz, amely elődje egy másik családnak. @hu
definition: Liittää suvun sukuun, joka edeltää toista sukua.
definition: Met une famille en relation avec une famille qui précède une autre famille. @fr
definition: Relaciona una família amb una família que precedeix una altra família. @ca
definition: Relateert een familie aan een familie die aan een andere familie voorafgaat. @nl
definition: Relaterer en familie til en familie som kommer før en annen familie. @no
definition: Relaterer en familie til en familie, som går forud for en anden familie. @da
definition: Relates a family to a family who precedes another family. @en
definition: Sasaista dzimtu/ģimeni ar dzimtu/ģimeni, kas ir citas dzimtas/ģimenes priekštecis. @lv
definition: Seostab perekonna perekonnaga, mis eelneb teisele perekonnale. @et
definition: Setzt eine Familie in Beziehung zu einer Familie, die einer anderen Familie vorausgeht. @de
definition: يربط عائلة بعائلة سلف لعائلة أخرى. @ar
definition: 将一个家族与是另一个家族前身的一个家族关联起来。 @zh-hans

yhteistoimijan seuraaja
has element type: 2
toolkit definition: A collective agent who succeeds or follows another collective agent. @en
toolkit definition: Agent collectif qui succède ou fait suite à un autre agent collectif. @fr
toolkit definition: Agent col·lectiu que succeeix a o segueix un altre agent col·lectiu. @ca
toolkit definition: Agente collettivo che succede o sussegue a un altro agente collettivo. @it
toolkit definition: Başka bir kolektif temsilcinin yerini alan veya onu takip eden kolektif bir temsilci @tr
toolkit definition: Een collectieve actor die een andere collectieve actor opvolgt of volgt. @nl
toolkit definition: Egy kollektív ágens, amely egy másik kollektív ágens örökébe lép vagy folytatja azt. @hu
toolkit definition: Ein gemeinschaftlicher Akteur, der einem anderen gemeinschaftlichem Akteur nachfolgt oder aus ihm hervorgeht. @de
toolkit definition: En kollektiv agent som etterfølger eller kommer etter en kollektiv agent. @no
toolkit definition: Grupa, citas grupas pēctecis. @lv
toolkit definition: Kollektiiv, mis järgneb teisele kollektiivile. @et
toolkit definition: Kollektiv agent, som efterfølger eller kommer efter en anden kollektiv agent. @da
toolkit definition: Yhteistoimija, joka jatkaa tai seuraa toista yhteistoimijaa.
toolkit definition: وكيل جماعي يخلف أو يلي وكيل جماعي آخر. @ar
toolkit definition: 另一个集体行为者后继或随后的一个集体行为者 @zh-hans
toolkit label: Nachfolgerin/Nachfolger eines gemeinschaftlichen Akteurs @de
toolkit label: efterfølger til kollektiv agent @da
toolkit label: etterfølger av kollektiv agent @no
toolkit label: grupas pēctecis (grupa) @lv
toolkit label: kollektiivi järglane @et
toolkit label: kollektív ágens utódja: @hu
toolkit label: opvolger van collectieve actor @nl
toolkit label: successeur d’un agent collectif @fr
toolkit label: successor d’un agent col·lectiu @ca
toolkit label: successor of collective agent @en
toolkit label: successore di agente collettivo @it
toolkit label: yerine geçen kolektif temsilci @tr
toolkit label: yhteistoimijan seuraaja
toolkit label: διάδοχος του συλλογικού φορέα @el
toolkit label: خليفة وكيل جماعي @ar
toolkit label: 集体行为者的后继 @zh-hans
has subproperty: yhteisön seuraaja
has subproperty: suvun seuraaja
has subproperty: P50423
lexical alias: successorOfCollectiveAgent.en
status: Published
type: Property
domain: C10011
label: a pour successeur d’un agent collectif @fr
label: grupas pēctecis (grupa) @lv
label: ha come successore di agente collettivo @it
label: har efterfølger til kollektiv agent @da
label: har etterfølger av kollektiv agent @no
label: has successor of collective agent @en
label: hat Nachfolgerin/Nachfolger eines gemeinschaftlichen Akteurs @de
label: heeft opvolger van collectieve actor @nl
label: kolektif temsilcinin yerine geçen kolektif temsilci ile ilişkilidir @tr
label: kollektiivi järglane @et
label: kollektív ágens utódja a következő: @hu
label: té com a successor d’un agent col·lectiu @ca
label: έχει διάδοχο του συλλογικού φορέα @el
label: له خلف لوكيل جماعي @ar
label: 有集体行为者的后继 @zh-hans
sub property of: yhteistoimijaan liittyvä yhteistoimija
definition: Correla un agente collettivo a un agente collettivo che succede o segue un altro agente collettivo. @it
definition: Hozzákapcsol egy kollektív ágenst egy kollektív ágenshez, amely egy másik kollektív ágens örökébe lép vagy folytatja azt. @hu
definition: Kolektif bir temsilciyi, başka bir kolektif temsilciyi takip eden veya ondan sonra gelen bir kolektif temsilciyle ilişkilendirir. @tr
definition: Liittää yhteistoimijan yhteistoimijaan, joka jatkaa tai seuraa toista yhteistoimijaa.
definition: Met un agent collectif en relation avec un agent collectif qui succède ou fait suite à un autre agent collectif. @fr
definition: Relaciona un agent col·lectiu amb un agent col·lectiu que succeeix a o segueix un altre agent col·lectiu. @ca
definition: Relateert een collectieve actor aan een collectieve actor die een andere collectieve actor opvolgt of volgt. @nl
definition: Relaterer en kollektiv agent til en kollektiv agent som etterfølger eller kommer etter en kollektiv agent. @no
definition: Relaterer en kollektiv agent til en kollektiv agent, som efterfølger eller kommer efter en anden kollektiv agent. @da
definition: Relates a collective agent to a collective agent who succeeds or follows another collective agent. @en
definition: Sasaista grupu ar grupu, kas ir citas grupas pēctecis. @lv
definition: Seostab kollektiivi kollektiiviga, mis järgneb teisele kollektiivile. @et
definition: Setzt einen gemeinschaftlichen Akteur in Beziehung zu einem gemeinschaftlichen Akteur, der einem anderen gemeinschaftlichem Akteur nachfolgt oder aus ihm hervorgeht. @de
definition: يربط وكيلا جماعيا بوكيل جماعي يخلف أو يلي وكيل جماعي آخر. @ar
definition: 将一个集体行为者与另一个集体行为者后继或随后的一个集体行为者关联起来。 @zh-hans

suvun seuraaja
has element type: 2
toolkit definition: A family who succeeds or follows another family. @en
toolkit definition: Başka bir ailenin mirasçısı olan veya onu takip eden bir aile @tr
toolkit definition: Dzimta/ģimene, kas ir citas dzimtas/ģimenes pēctecis. @lv
toolkit definition: Een familie die een andere familie opvolgt of volgt. @nl
toolkit definition: Egy család, amely egy másik család örökébe lép vagy folytatja azt. @hu
toolkit definition: Eine Familie, die einer anderen Familie nachfolgt oder aus ihr hervorgeht. @de
toolkit definition: En familie som etterfølger eller kommer etter en familie. @no
toolkit definition: Famiglia che succede o sussegue a un'altra famiglia. @it
toolkit definition: Familie, som efterfølger eller kommer efter en anden familie. @da
toolkit definition: Famille qui succède ou fait suite à une autre famille. @fr
toolkit definition: Família que succeeix a o segueix una altra família. @ca
toolkit definition: Perekond, mis järgneb teisele perekonnale. @et
toolkit definition: Suku, joka jatkaa tai seuraa toista sukua.
toolkit definition: عائلة تخلف أو تلي عائلة أخرى. @ar
toolkit definition: 另一个家族后继或随后的一个家族 @zh-hans
toolkit label: Nachfolgerin/Nachfolger einer Familie @de
toolkit label: család utódja: @hu
toolkit label: dzimtas/ģimenes pēctecis (dzimta/ģimene) @lv
toolkit label: efterfølger til familie @da
toolkit label: etterfølger av familie @no
toolkit label: opvolger van familie @nl
toolkit label: perekonna järglane @et
toolkit label: successeur d’une famille @fr
toolkit label: successor d’una família @ca
toolkit label: successor of family @en
toolkit label: successore di famiglia @it
toolkit label: suvun seuraaja
toolkit label: yerine geçen aile @tr
toolkit label: διάδοχος της οικογένειας @el
toolkit label: خليفة لعائلة @ar
toolkit label: 家族的后继 @zh-hans
has subproperty: P50424
lexical alias: successorOfFamily.en
status: Published
type: Property
domain: C10008
label: a pour successeur d’une famille @fr
label: ailenin yerine geçen aile ile ilişkilidir @tr
label: család utódja a következő: @hu
label: dzimtas/ģimenes pēctecis (dzimta/ģimene) @lv
label: ha come successore di famiglia @it
label: har efterfølger til familie @da
label: har etterfølger av familie @no
label: has successor of family @en
label: hat Nachfolgerin/Nachfolger einer Familie @de
label: heeft opvolger van familie @nl
label: perekonna järglane @et
label: té com a successor d’una família @ca
label: έχει διάδοχο της οικογένειας @el
label: له خلف لعائلة @ar
label: 有家族的后继 @zh-hans
sub property of: sukuun liittyvä suku
sub property of: yhteistoimijan seuraaja
definition: Bir aileyi, başka bir ailenin mirasçısı olan veya onu takip eden bir aileyle ilişkilendirir. @tr
definition: Correla una famiglia a una famiglia che succede o segue un'altra famiglia. @it
definition: Hozzákapcsol egy családot egy családhoz, amely másik család örökébe lép vagy folytatja azt. @hu
definition: Liittää suvun sukuun, joka jatkaa tai seuraa toista sukua.
definition: Met une famille en relation avec une famille qui succède ou fait suite à une autre famille. @fr
definition: Relaciona una família amb una família que succeeix a o segueix una altra família. @ca
definition: Relateert een familie aan een familie die een andere familie opvolgt of volgt. @nl
definition: Relaterer en familie til en familie som etterfølger eller kommer etter en familie. @no
definition: Relaterer en familie til en familie, som efterfølger eller kommer efter en anden familie. @da
definition: Relates a family to a family who succeeds or follows another family. @en
definition: Sasaista dzimtu/ģimeni ar dzimtu/ģimeni, kas ir citas dzimtas/ģimenes pēctecis. @lv
definition: Seostab perekonna perekonnaga, mis järgneb teisele perekonnale. @et
definition: Setzt eine Familie in Beziehung zu einer Familie, die einer anderen Familie nachfolgt oder aus ihr hervorgeht. @de
definition: يربط عائلة بعائلة تخلف أو تلي عائلة أخرى. @ar
definition: 将一个家族与另一个家族后继或随后的一个家族关联起来。 @zh-hans

julkishallinnollisen yhteisön hallintoalue
has element type: 2
toolkit definition: A place that is governed by a corporate body who is a government. @en
toolkit definition: Başka bir hükümet tarafından yürürlüğe girmiş kanun, düzenleme vb. vasıtasıyla yargı alanı olan bir yer. @tr
toolkit definition: Een plaats die een jurisdictie is geregeerd door een wet, regeling etc. die vastgesteld werd door een andere regering. @nl
toolkit definition: Egy hely, amely egy másik igazgatási szerv által hozott törvény, rendelet stb. hatálya alá tartozó joghatóság. @hu
toolkit definition: Ein Geografikum, das durch ein Gesetz, eine Verordnung und so weiter geregelt wird, das/die von einer anderen Regierung erlassen wurde. @de
toolkit definition: Et sted som er en jurisdiksjon som styres ved lov, vedtekt, etc., som ble vedtatt av en annen myndighet. @no
toolkit definition: Hallintoalue, joka on julkishallinnollisen yhteisön hallinnoima.
toolkit definition: Koht, mis on teise valitsuse kehtestatud seaduste, määruste vms alusel valitsetav võimkond. @et
toolkit definition: Lieu qui est régi par une collectivité constituant un gouvernement. @fr
toolkit definition: Luogo che è una giurisdizione governata da una legge, normativa, etc., promulgata da un altro governo. @it
toolkit definition: Sted, som er en jurisdiktion, som er underlagt en lov, forordning, etc., som blev vedtaget af en anden myndighed. @da
toolkit definition: Teritorija, kuru pārvalda institūcija, balstoties likumos, noteikumos u.tml., kurus pieņēmusi cita jurisdikcija. @lv
toolkit definition: Un lloc que és regit per una entitat corporativa que és un govern. @ca
toolkit definition: مكان يخضع لسلطة قضائية يحكمها قانون أو لائحة تنظيمية، إلخ، سنتها حكومة أخرى. @ar
toolkit definition: 作为根据另一个政府所颁布的法律、法规等管理的一个辖区的一个地点 @zh-hans
toolkit label: Geregelte Gebietskörperschaft @de
toolkit label: Yargı yetkisi @tr
toolkit label: geregeerde jurisdictie @nl
toolkit label: giurisdizione governata @it
toolkit label: joghatóság: @hu
toolkit label: julkishallinnollisen yhteisön hallintoalue
toolkit label: jurisdiksjon som styres @no
toolkit label: jurisdiktion underlagt @da
toolkit label: lieu régi @fr
toolkit label: lloc regit @ca
toolkit label: place governed @en
toolkit label: pārvaldāmā jurisdikcija @lv
toolkit label: valitsetav võimkond @et
toolkit label: δικαιοδοσία κυβερνούμενη @el
toolkit label: اختصاص قضائي @ar
toolkit label: 所管理的辖区 @zh-hans
has subproperty: P50425
lexical alias: placeGoverned.en
status: Published
type: Property
domain: C10005
label: a pour lieu régi @fr
label: ha come giurisdizione governata @it
label: har jurisdiksjon som styres @no
label: har jurisdiktion underlagt @da
label: has place governed @en
label: hat geregelte Gebietskörperschaft @de
label: heeft geregeerde jurisdictie @nl
label: joghatósága a következő: @hu
label: pārvaldāmā jurisdikcija @lv
label: té com a lloc regit @ca
label: valitsetav võimkond @et
label: yönetilen yargı alanı ile ilişkilidir @tr
label: έχει δικαιοδοσία κυβερνούμενη @el
label: له اختصاص قضائي @ar
label: 有所管理的辖区 @zh-hans
sub property of: yhteisöön liittyvä paikka
alternative label: juridiction régie @fr
alternative label: jurisdicció regida @ca
alternative label: jurisdiction governed @en
definition: Bir tüzel kişiyi, başka bir hükümet tarafından yürürlüğe girmiş kanun, düzenleme vb. vasıtasıyla yargı yetkisi olan bir yer ile ilişkilendirir. @tr
definition: Correla un ente a un luogo che è una giurisdizione governata da una legge, normativa, etc., che è stata adottata da un altro governo. @it
definition: Hozzákapcsol egy testületet egy helyhez, amely egy másik igazgatási szerv által hozott törvény, rendelet stb. hatálya alá tartozó joghatóság. @hu
definition: Liittää yhteisön hallintoalueeseen, joka on julkishallinnollisen yhteisön hallinnoima.
definition: Met une collectivité en relation avec un lieu qui est régi par une collectivité constituant un gouvernement. @fr
definition: Relaciona una entitat corporativa amb un lloc que és regit per una entitat corporativa que és un govern. @ca
definition: Relateert een corporatie aan een plaats die een jurisdictie is geregeerd door een wet, regeling etc. die vastgesteld werd door een andere regering. @nl
definition: Relaterer en korporasjon til et sted som er en jurisdiksjon som styres ved lov, vedtekt, etc., som ble vedtatt av en annen myndighet. @no
definition: Relaterer en korporation til et sted, som er en jurisdiktion, som er underlagt en lov, forordning, etc., som blev vedtaget af en anden myndighed. @da
definition: Relates a corporate body to a place that is governed by a corporate body who is a government. @en
definition: Sasaista institūciju ar vietu, kuru pārvalda institūcija, balstoties likumos, noteikumos u.tml., kurus pieņēmusi cita jurisdikcija. @lv
definition: Seostab asutuse kohaga, mis on teise valitsuse kehtestatud seaduste, määruste vms alusel valitsetav võimkond. @et
definition: Setzt eine Körperschaft in Beziehung zu einem Geografikum, das durch ein Gesetz, eine Verordnung und so weiter geregelt wird, das/die von einer anderen Regierung erlassen wurde. @de
definition: يربط هيئة بمكان يخضع لسلطة قضائية يحكمها قانون أو لائحة تنظيمية، إلخ، سنتها حكومة أخرى. @ar
definition: 将一个团体与作为根据另一个政府所颁布的法律、法规等管理的一个辖区的一个地点关联起来。 @zh-hans

toimijan kuvaus
has element type: 2
toolkit definition: A work that is a description of an agent @en
toolkit definition: Bir temsilcinin tanımı olan bir eser @tr
toolkit definition: Darbs, kurā aprakstīts konkrētais aģents @lv
toolkit definition: Een werk dat een actor beschrijft. @nl
toolkit definition: Egy mű, amely egy ágenst ír le. @hu
toolkit definition: Ein Werk, das einen Akteur beschreibt. @de
toolkit definition: Et verk som beskriver en agent. @no
toolkit definition: Obra que és una descripció d’un agent. @ca
toolkit definition: Opera che descrive un agente. @it
toolkit definition: Teos, joka kuvailee toimijaa.
toolkit definition: Teos, milles tegijat kirjeldatakse. @et
toolkit definition: Værk, som beskriver en agent. @da
toolkit definition: Œuvre qui consiste en une description d’un agent. @fr
toolkit definition: عمل يصف وكيلا. @ar
toolkit definition: 作为一个行为者之描述的一种作品 @zh-hans
toolkit label: Akteur beschrieben in @de
toolkit label: Tarafından tanımlanan temsilci @tr
toolkit label: actor beschreven in @nl
toolkit label: agent beskrevet i @da
toolkit label: agent beskrevet i @no
toolkit label: agent described by @en
toolkit label: agent descrit per @ca
toolkit label: agent décrit par @fr
toolkit label: agente descritto in @it
toolkit label: aģenta apraksts @lv
toolkit label: tegija kirjeldus @et
toolkit label: toimijan kuvaus
toolkit label: ágens leírva a következőben: @hu
toolkit label: φορέας περιγραφόμενος σε @el
toolkit label: وكيل موصوف في @ar
toolkit label: 被……描述的一个行为者 @zh-hans
has subproperty: henkilöä kuvaava teos
has subproperty: yhteistoimijan kuvaus
has subproperty: toimijaa metatiedoilla kuvaileva teos
has subproperty: P50426
lexical alias: agentDescribedBy.en
status: Published
type: Property
domain: C10002
label: aģenta apraksts @lv
label: er agent beskrevet i @da
label: est un agent décrit par @fr
label: is actor beschreven in @nl
label: is agent described by @en
label: ist Akteur beschrieben in @de
label: tarafından tanımlanan temsilcidir @tr
label: tegija kirjeldus @et
label: ágens leírva a következőben: @hu
label: è agente descritto in @it
label: és agent descrit per @ca
label: είναι φορέας περιγραφόμενος σε @el
label: هو وكيل موصوف في @ar
label: 是被……描述的一个行为者 @zh-hans
sub property of: toimija aiheena teoksessa
alternative label: Beschrieben in (Akteur) @de
alternative label: agent décrit dans @fr
alternative label: açıklanan (temsilci) @tr
alternative label: beskrevet i (agent) @da
alternative label: described in (agent) @en
alternative label: descrit en (agent) @ca
alternative label: descrito en (agente) @es
alternative label: descritto in (agente) @it
alternative label: décrit dans (agent) @fr
alternative label: kuvattu teoksessa (toimija)
alternative label: leírva a következőben (ágens): @hu
alternative label: περιγράφεται σε (φορέας) @el
alternative label: موصوف في (وكيل ) @ar
alternative label: 被描述于（行为者） @zh-hans
definition: Bir temsilciyi, bir temsilcinin tanımlaması olan bir eserle ilişkilendirir. @tr
definition: Correla un agente a un'opera che descrive un agente. @it
definition: Hozzákapcsol egy ágenst egy műhöz, amely egy ágenst ír le. @hu
definition: Liittää toimijan teokseen, joka kuvailee toimijaa.
definition: Met un agent en relation avec une œuvre qui consiste en une description d’un agent. @fr
definition: Relaciona un agent amb una obra que és una descripció d’un agent. @ca
definition: Relateert een actor aan een werk dat een actor beschrijft. @nl
definition: Relaterer en agent til et verk som beskriver en agent. @no
definition: Relaterer en agent til et værk, som beskriver en agent. @da
definition: Relates an agent to a work that is a description of an agent @en

yhteistoimijan kuvaus
has element type: 2
toolkit definition: A work that is a description of a collective agent. @en
toolkit definition: Darbs, kurā aprakstīta konkrētā grupa. @lv
toolkit definition: Een werk dat een collectieve actor beschrijft. @nl
toolkit definition: Egy mű, amely egy kollektív ágenst ír le. @hu
toolkit definition: Ein Werk, das einen gemeinschaftlichen Akteur beschreibt. @de
toolkit definition: Et verk som beskriver en kollektiv agent. @no
toolkit definition: Kolektif bir temsilcinin tanımı olan bir eser @tr
toolkit definition: Obra que és una descripció d’un agent col·lectiu. @ca
toolkit definition: Opera che descrive un agente collettivo. @it
toolkit definition: Teos, joka kuvailee yhteistoimijaa.
toolkit definition: Teos, milles kollektiivi kirjeldatakse. @et
toolkit definition: Værk, som beskriver en kollektiv agent. @da
toolkit definition: Œuvre qui consiste en une description d’un agent collectif. @fr
toolkit definition: عمل يصف وكيل جماعي. @ar
toolkit definition: 作为一个集体行为者之描述的一种作品 @zh-hans
toolkit label: Gemeinschaftlicher Akteur beschrieben in @de
toolkit label: agent collectif décrit par @fr
toolkit label: agent col·lectiu descrit per @ca
toolkit label: agente collettivo descritto in @it
toolkit label: collectieve actor beschreven in @nl
toolkit label: collective agent described by @en
toolkit label: grupas apraksts @lv
toolkit label: kollektiivi kirjeldus @et
toolkit label: kollektiv agent beskrevet i @da
toolkit label: kollektiv agent beskrevet i @no
toolkit label: kollektív ágens leírva a következőben: @hu
toolkit label: tanımlanan kolektif temsilci @tr
toolkit label: yhteistoimijan kuvaus
toolkit label: συλλογικός φορέας περιγραφόμενος σε @el
toolkit label: وكيل جماعي موصوف في @ar
toolkit label: 被……描述的集体行为者 @zh-hans
has subproperty: yhteisöä kuvaava teos
has subproperty: sukua kuvaava teos
has subproperty: yhteistoimijaa metatiedoilla kuvaileva teos
has subproperty: P50427
lexical alias: collectiveAgentDescribedBy.en
status: Published
type: Property
domain: C10011
label: er kollektiv agent beskrevet i @da
label: est un agent collectif décrit par @fr
label: grupas apraksts @lv
label: is collectieve actor beschreven in @nl
label: is collective agent described by @en
label: ist gemeinschaftlicher Akteur beschrieben in @de
label: kollektiivi kirjeldus @et
label: kollektív ágens leírva a következőben: @hu
label: tarafından tanımlanmış kolektif temsilcidir @tr
label: è agente collettivo descritto in @it
label: és agent col·lectiu descrit per @ca
label: είναι συλλογικός φορέας περιγραφόμενος σε @el
label: وكيل جماعي موصوف في @ar
label: 是被……描述的集体行为者 @zh-hans
sub property of: yhteistoimija aiheena teoksessa
sub property of: toimijan kuvaus
alternative label: Beschrieben in (Gemeinschaftlicher Akteur) @de
alternative label: agent collectif décrit dans @fr
alternative label: açıklanan (kolektif temsilci) @tr
alternative label: beskrevet i (kollektiv agent) @da
alternative label: described in (collective agent) @en
alternative label: descrit en (agent col·lectiu) @ca
alternative label: descrito en (agente colectivo) @es
alternative label: descritto in (agente collettivo) @it
alternative label: décrit dans (agent collectif) @fr
alternative label: kuvattu teoksessa (yhteistoimija)
alternative label: leírva a következőben (kollektív ágens): @hu
alternative label: περιγράφεται σε (συλλογικός φορέας) @el
alternative label: موصوف في (وكيل جماعي ) @ar
alternative label: 被描述于（集体行为者） @zh-hans
definition: Correla un agente collettivo a un'opera che descrive un agente collettivo. @it
definition: Hozzákapcsol egy kollektív ágenst egy műhöz, amely egy kollektív ágenst ír le. @hu
definition: Kolektif bir temsiliciyi, bir kolektif temsilcinin tanımı olan bir eserle ilişkilendirir. @tr
definition: Liittää yhteistoimijan teokseen, joka kuvailee yhteistoimijaa.
definition: Met un agent collectif en relation avec une œuvre qui consiste en une description d’un agent collectif. @fr
definition: Relaciona un agent col·lectiu amb una obra que és una descripció d’un agent col·lectiu. @ca
definition: Relateert een collectieve actor aan een werk dat een collectieve actor beschrijft. @nl
definition: Relaterer en kollektiv agent til et verk som beskriver en kollektiv agent. @no
definition: Relaterer en kollektiv agent til et værk, som beskriver en kollektiv agent. @da

henkilön toinen identiteetti
has element type: 3
toolkit definition: A nomen that is a pseudonym or other appellation used by a person. @en
toolkit definition: Bir kişi tarafından kullanılan bir takma isim veya başka bir unvan olan bir isim. @tr
toolkit definition: Een nomen dat een pseudoniem of andere aanduiding is gebruikt door een persoon. @nl
toolkit definition: Egy nomen, amely egy álnév vagy más, egy személy által használt megnevezés. @hu
toolkit definition: Ein Pseudonym oder eine andere, von einer Person verwendete, Bezeichnung. @de
toolkit definition: Et nomen som er et pseudonym eller en annen betegnelse som brukes av en person. @no
toolkit definition: Nomen che è uno pseudonimo o altra denominazione usata da una persona. @it
toolkit definition: Nomen que és un pseudònim o una altra apel·lació usada per una persona. @ca
toolkit definition: Nomen qui consiste en un pseudonyme ou en une autre appellation utilisée par une personne. @fr
toolkit definition: Nomen, joka on pseudonyymi tai muu henkilön käyttämä nimitys.
toolkit definition: Nomen, mis on pseudonüüm või muu isiku poolt kasutatav nimi. @et
toolkit definition: Nomen, som er et pseudonym eller anden benævnelse, som bruges af en person. @da
toolkit definition: Nomens, kas ir pseidonīms vai cita identitāte, ko persona ir pieņēmusi. @lv
toolkit definition: تسمية هي اسم مستعار أو اسما آخر يستخدمه شخص. @ar
toolkit definition: 作为一个个人所使用的一个化名或其他称谓的命名 @zh-hans
toolkit label: Andere Identität einer Person @de
toolkit label: Kişinin alternatif kimliği @tr
toolkit label: alternate identity of person @en
toolkit label: alternatieve identiteit van persoon @nl
toolkit label: alternativ identitet for person @da
toolkit label: henkilön toinen identiteetti
toolkit label: identitat alternativa de persona @ca
toolkit label: identità alternativa di persona @it
toolkit label: identité alternative d’une personne @fr
toolkit label: isiku teine identiteet @et
toolkit label: personas cita identitāte @lv
toolkit label: személy alternatív identitása: @hu
toolkit label: εναλλακτική ταυτότητα του φυσικού προσώπου @el
toolkit label: هوية بديلة لشخص @ar
toolkit label: 个人的交替身份 @zh-hans
has subproperty: P50428
lexical alias: alternateIdentityOfPerson.en
status: Published
type: Property
domain: C10004
label: a pour identité alternative d’une personne @fr
label: ha come identità alternativa di persona @it
label: har alternativ identitet for person @da
label: has alternate identity of person @en
label: hat andere Identität einer Person @de
label: heeft alternatieve identiteit van persoon @nl
label: isiku teine identiteet @et
label: kişinin alternatif kimliği ile ilişkilidir @tr
label: personas cita identitāte @lv
label: személy alternatív identitása a következő: @hu
label: té com a identitat alternativa de persona @ca
label: έχει εναλλακτική ταυτότητα του φυσικού προσώπου @el
label: له هوية بديلة لشخص @ar
label: 有个人的交替身份 @zh-hans
sub property of: henkilöön liittyvä nomen
alternative label: Alternatif kimlik @tr
alternative label: Andere Identität @de
alternative label: alternate identity @en
alternative label: alternativ identitet @da
alternative label: alternatív identitása: @hu
alternative label: identidad alterna de persona @es
alternative label: identitat alternativa @ca
alternative label: identité alternative @fr
alternative label: toinen identiteetti
alternative label: هوية بديلة @ar
alternative label: 交替身份 @zh-hans
definition: Bir kişiyi, bir kişi tarafından kullanılan bir takma isim veya başka bir unvan olan biri isimle ilişkilendirir. @tr
definition: Correla una persona a un nomen che è uno pseudonimo o altra denominazione usata da una persona. @it
definition: Hozzákapcsol egy személyt egy nomenhez, amely egy álnév vagy más, egy személy által használt megnevezés. @hu
definition: Liittää henkilön nomeniin, joka on pseudonyymi tai muu henkilön käyttämä nimitys.
definition: Met une personne en relation avec un nomen qui consiste en un pseudonyme ou en une autre appellation utilisée par une personne. @fr
definition: Relaciona una persona amb un nomen que és un pseudònim o una altra apel·lació usada per una persona. @ca
definition: Relateert een persoon aan een nomen dat een pseudoniem of andere aanduiding is gebruikt door een persoon. @nl
definition: Relaterer en person til et nomen som er et pseudonym eller en annen betegnelse som brukes av en person. @no
definition: Relaterer en person til et nomen, som er et pseudonym eller anden benævnelse, som bruges af en person. @da
definition: Relates a person to a nomen that is a pseudonym or other appellation used by a person. @en
definition: Sasaista personu ar nomenu, kas ir pseidonīms vai cita identitāte, ko persona ir pieņēmusi. @lv
definition: Seostab isiku nomen'iga, mis on pseudonüüm või muu isiku poolt kasutatav nimi. @et
definition: Setzt eine Person in Beziehung zu einem Pseudonym oder einer anderen, von einer Person verwendeten, Bezeichnung. @de
definition: يربط شخصا بتسمية هي اسم مستعار أو اسم آخر يستخدمه شخص @ar
definition: 将一个个人与作为一个个人所使用的一个化名或其他称谓的命名关联起来。 @zh-hans

henkilön todellinen identiteetti
has element type: 3
toolkit definition: A nomen that is a real appellation of a person who uses another nomen. @en
toolkit definition: Başka bir isim kullanan bir kişinin gerçek unvanı olan bir isim @tr
toolkit definition: Een nomen dat een echte benaming is van een persoon die een andere nomen gebruikt. @nl
toolkit definition: Egy nomen, amely egy személy valódi megnevezése, aki más noment is használ. @hu
toolkit definition: Ein Nomen, das eine reale Bezeichnung für einer Person ist, die ein anderes Nomen verwendet. @de
toolkit definition: Et nomen som er en virkelig betegnelse for en person som bruker et annet nomen. @no
toolkit definition: Nomen che è la denominazione reale di una persona che usa un altro nome. @it
toolkit definition: Nomen que és una apel·lació real d’una persona que usa un altre nomen. @ca
toolkit definition: Nomen qui consiste en une appellation réelle d’une personne qui utilise un autre nomen. @fr
toolkit definition: Nomen, joka on toista nomenia käyttävän henkilön todellinen nimitys.
toolkit definition: Nomen, mis on teist nomen'it kasutava isiku tegelik nimi. @et
toolkit definition: Nomen, som er en reel benævnelse på en person, som benytter et andet nomen. @da
toolkit definition: Nomens, kas ir patiess/īsts apzīmējums personai, kura lieto citu nomenu. @lv
toolkit definition: تسمية هي الاسم الحقيقي لشخص يستخدم اسما آخر. @ar
toolkit definition: 作为使用另一个命名的一个个人的一个真实称谓的一个命名 @zh-hans
toolkit label: Kişinin gerçek kimliği @tr
toolkit label: Wirkliche Identität einer Person @de
toolkit label: echte identiteit van persoon @nl
toolkit label: henkilön todellinen identiteetti
toolkit label: identitat real de persona @ca
toolkit label: identità reale di persona @it
toolkit label: identité réelle d’une personne @fr
toolkit label: isiku tegelik identiteet @et
toolkit label: personas patiesā identitāte @lv
toolkit label: real identity of person @en
toolkit label: reel identitet for person @da
toolkit label: személy valódi identitása: @hu
toolkit label: virkelig identitet for person @no
toolkit label: πραγματική ταυτότητα του φυσικού προσώπου @el
toolkit label: هوية حقيقية لشخص @ar
toolkit label: 个人的真实身份 @zh-hans
has subproperty: P50429
lexical alias: realIdentityOfPerson.en
status: Published
type: Property
domain: C10004
label: a pour identité réelle d’une personne @fr
label: ha come identità reale di persona @it
label: har reel identitet for person @da
label: har virkelig identitet for person @no
label: has real identity of person @en
label: hat wirkliche Identität einer Person @de
label: heeft echte identiteit van persoon @nl
label: isiku tegelik identiteet @et
label: kişinin gerçek kimliği ile ilişkilidir @tr
label: personas patiesā identitāte @lv
label: személy valódi identitása a következő: @hu
label: té com a identitat real de persona @ca
label: έχει πραγματική ταυτότητα του φυσικού προσώπου @el
label: له هوية حقيقية لشخص @ar
label: 有个人的真实身份 @zh-hans
sub property of: henkilöön liittyvä nomen
alternative label: Gerçek kimlik @tr
alternative label: Wirkliche Identität @de
alternative label: identidad real de persona @es
alternative label: identitat real @ca
alternative label: identité réelle @fr
alternative label: real identity @en
alternative label: todellinen identiteetti
alternative label: valódi identitás @hu
alternative label: هوية حقيقية @ar
alternative label: 真实身份 @zh-hans
definition: Bir kişiyi, başka bir isim kullanan bir kişinin gerçek unvanı olan bir isimle ilişkilendirir. @tr
definition: Correla una persona a un nomen che è una denominazione reale di una persona che usa un altro nome. @it
definition: Hozzákapcsol egy személyt egy nomenhez, amely egy személy valódi megnevezése, aki más noment is használ. @hu
definition: Liittää henkilön nomeniin, joka on toista nomenia käyttävän henkilön todellinen nimitys.
definition: Met une personne en relation avec un nomen qui consiste en une appellation réelle d’une personne qui utilise un autre nomen. @fr
definition: Relaciona una persona amb un nomen que és una apel·lació real d’una persona que usa un altre nomen. @ca
definition: Relateert een persoon aan een nomen dat een echte benaming is van een persoon die een andere nomen gebruikt. @nl
definition: Relaterer en person til et nomen som er en virkelig betegnelse for en person som bruker et annet nomen. @no
definition: Relaterer en person til et nomen, som er en reel benævnelse på en person, som benytter et andet nomen. @da
definition: Relates a person to a nomen that is a real appellation of a person who uses another nomen. @en
definition: Sasaista personu ar nomenu, kas ir patiess/īsts apzīmējums personai, kura lieto citu nomenu. @lv
definition: Seostab isiku nomen'iga, mis on teist nomen'it kasutava isiku tegelik nimi. @et
definition: Setzt eine Person in Beziehung zu einem Nomen, das eine reale Bezeichnung für eine Person ist, die ein anderes Nomen verwendet. @de
definition: يربط شخصا بتسمية هي اسم حقيقي لشخص يستخدم تسمية أخرى. @ar
definition: 将一个个人与作为使用另一个命名的一个个人的一个真实称谓的一个命名关联起来。 @zh-hans

toimijan toiminta-aika
has element type: 2
toolkit definition: A timespan during which an agent is active in its primary field of endeavor. @en
toolkit definition: Ajanjakso, jonka aikana toimija on ollut aktiivinen ensisijaisella toiminta-alallaan.
toolkit definition: Ajavahemik, millal tegija on olnud oma peamisel tegevusalal aktiivne. @et
toolkit definition: Arco di tempo durante cui un agente è attivo nel suo campo di impegno principale. @it
toolkit definition: Bir kişinin, asıl faaliyet alanında aktif olduğu bir zaman aralığı. @tr
toolkit definition: Een tijdspanne gedurende welke een actor actief is in zijn primaire werkveld. @nl
toolkit definition: Egy időtartam, amely alatt egy ágens fő működési területén aktív. @hu
toolkit definition: Ein Zeitraum, in dem ein Akteur in seinem primären Tätigkeitsfeld aktiv ist. @de
toolkit definition: Et tidsrom hvor en agent er aktiv innenfor sitt hovedvirke. @no
toolkit definition: Interval de temps durant el qual un agent està en actiu en el seu camp principal d’activitat. @ca
toolkit definition: Laikposms, kurā aģents ir aktīvs savā galvenajā darbības jomā. @lv
toolkit definition: Laps de temps pendant lequel un agent est actif dans son principal champ d’activité. @fr
toolkit definition: Tidsperiode, hvori en agent er aktiv i sit primære virkefelt. @da
toolkit definition: فترة زمنية يكون خلالها وكيل نشطًا في مجال عمله الأساسي. @ar
toolkit definition: 一个行为者在主要努力领域中活跃的时间段 @zh-hans
toolkit label: Temsilcinin faaliyet süresi @tr
toolkit label: Wirkungszeitraum eines Akteurs @de
toolkit label: aktivitetsperiode for agent @da
toolkit label: aģenta darbības periods @lv
toolkit label: period of activity of agent @en
toolkit label: periode en agent var aktiv @no
toolkit label: periode van activiteit van actor @nl
toolkit label: periodo di attività di agente @it
toolkit label: període d’activitat d’un agent @ca
toolkit label: période d’activité d’un agent @fr
toolkit label: tegija tegutsemisaeg @et
toolkit label: toimijan toiminta-aika
toolkit label: ágens tevékenységének időszaka: @hu
toolkit label: περίοδος δραστηριοποίησης του φορέα @el
toolkit label: فترة نشاط وكيل @ar
toolkit label: 行为者的活跃期 @zh-hans
has subproperty: henkilön toiminta-aika
has subproperty: yhteistoimijan toiminta-aika
has subproperty: P50430
lexical alias: periodOfActivityOfAgent.en
status: Published
type: Property
domain: C10002
label: a pour période d’activité d’un agent @fr
label: aģenta darbības periods @lv
label: ha come periodo di attività di agente @it
label: har aktivitetsperiode for agent @da
label: har periode en agent var aktiv @no
label: has period of activity of agent @en
label: hat Wirkungszeitraum eines Akteurs @de
label: heeft periode van activiteit van actor @nl
label: tegija tegutsemisaeg @et
label: temsilcinin faaliyet dönemi ile ilişkilidir @tr
label: té com a període d’activitat d’un agent @ca
label: ágens tevékenységének időszaka a következő: @hu
label: έχει περίοδο δραστηριοποίησης του φορέα @el
label: له فترة نشاط وكيل @ar
label: 有行为者的活跃期 @zh-hans
sub property of: toimijaan liittyvä ajanjakso
alternative label: toimijan toimintaan liittyvä ajanjakso
definition: Bir temsilciyi, birincil çalışma alanında aktif olan temsilcinin zaman aralığıyla ilişkilendirir. @tr
definition: Correla un agente a un arco di tempo durante il quale un agente è attivo nel suo campo di impegno principale. @it
definition: Hozzákapcsol egy ágenst egy időtartamhoz, amely alatt egy ágens fő működési területén aktív. @hu
definition: Liittää toimijan ajanjaksoon, jonka aikana toimija on ollut aktiivinen ensisijaisella toiminta-alallaan.
definition: Met un agent en relation avec un laps de temps pendant lequel un agent est actif dans son principal champ d’activité. @fr
definition: Relaciona un agent amb un interval de temps durant el qual un agent està en actiu en el seu camp principal d’activitat. @ca
definition: Relateert een actor aan een tijdspanne gedurende welke een actor actief is in zijn primaire werkveld. @nl
definition: Relaterer en agent til en tidsperiode, hvori en agent er aktiv i sit primære virkefelt. @da
definition: Relaterer en agent til et tidsrom hvor en agent er aktiv innenfor sitt hovedvirke. @no
definition: Relates an agent to a timespan during which an agent is active in its primary field of endeavor. @en
definition: Sasaista aģentu ar laikposmu, kurā aģents ir aktīvs savā galvenajā darbības jomā. @lv
definition: Seostab tegija ajavahemikuga, millal tegija on olnud oma peamisel tegevusalal aktiivne. @et
definition: Setzt einen Akteur in Beziehung zu einem Zeitraum, in dem ein Akteur in seinem primären Tätigkeitsfeld aktiv ist. @de
definition: يربط وكيلا بفترة زمنية يكون خلالها الوكيل نشطًا في مجال عمله الأساسي. @ar
definition: 将一个行为者与一个行为者在主要努力领域中活跃的时间段关联起来。 @zh-hans

yhteistoimijan toiminta-aika
has element type: 2
toolkit definition: A timespan during which a collective agent is active in its primary field of endeavor. @en
toolkit definition: Ajanjakso, jonka aikana yhteistoimija on ollut aktiivinen ensisijaisella toiminta-alallaan.
toolkit definition: Ajavahemik, millal kollektiiv on olnud oma peamisel tegevusalal aktiivne. @et
toolkit definition: Arco di tempo durante cui un agente collettivo è attivo nel suo campo di impegno principale. @it
toolkit definition: Een tijdspanne gedurende welke een collectieve actor actief is in zijn primaire werkveld. @nl
toolkit definition: Egy időtartam, amely alatt egy kollektív ágens fő működési területén aktív. @hu
toolkit definition: Ein Zeitraum, in dem ein gemeinschaftlicher Akteur in seinem primären Tätigkeitsfeld aktiv ist. @de
toolkit definition: Et tidsrom hvor en kollektiv agent er aktiv innenfor sitt hovedvirke. @no
toolkit definition: Interval de temps durant el qual un agent col·lectiu està en actiu en el seu camp principal d’activitat. @ca
toolkit definition: Kolektif bir temsilcinin ana uğraş alanında aktif olduğu bir zaman aralığı. @tr
toolkit definition: Laikposms, kurā grupa ir aktīva savā galvenajā darbības jomā. @lv
toolkit definition: Laps de temps pendant lequel un agent collectif est actif dans son principal champ d’activité. @fr
toolkit definition: Tidsperiode, hvori en kollektiv agent er aktiv i sit primære virkefelt. @da
toolkit definition: فترة زمنية يكون خلالها وكيل جماعي نشطًا في مجال عمله الأساسي. @ar
toolkit definition: 一个集体行为者在主要努力领域中活跃的时间段 @zh-hans
toolkit label: Kolektif temsilcinin faaliyet süresi @tr
toolkit label: Wirkungszeitraum eines gemeinschaftlichen Akteurs @de
toolkit label: aktivitetsperiode for kollektiv agent @da
toolkit label: grupas darbības periods @lv
toolkit label: kollektiivi tegutsemisaeg @et
toolkit label: kollektív ágens tevékenységének időszaka: @hu
toolkit label: period of activity of collective agent @en
toolkit label: periode en kollektiv agent var aktiv @no
toolkit label: periode van activiteit van collectieve actor @nl
toolkit label: periodo di attività di agente collettivo @it
toolkit label: període d’activitat d’un agent col·lectiu @ca
toolkit label: période d’activité d’un agent collectif @fr
toolkit label: yhteistoimijan toiminta-aika
toolkit label: περίοδος δραστηριοποίησης του συλλογικού φορέα @el
toolkit label: فترة نشاط وكيل جماعي @ar
toolkit label: 集体行为者的活跃期 @zh-hans
has subproperty: yhteisön toiminta-aika
has subproperty: suvun toiminta-aika
has subproperty: P50431
lexical alias: periodOfActivityOfCollectiveAgent.en
status: Published
type: Property
domain: C10011
label: a pour période d’activité d’un agent collectif @fr
label: grupas darbības periods @lv
label: ha come periodo di attività di agente collettivo @it
label: har aktivitetsperiode for kollektiv agent @da
label: har periode en kollektiv agent var aktiv @no
label: has period of activity of collective agent @en
label: hat Wirkungszeitraum eines gemeinschaftlichen Akteurs @de
label: heeft periode van activiteit van collectieve actor @nl
label: kolektif temsilcinin faaliyet dönemi ile ilişkilidir @tr
label: kollektiivi tegutsemisaeg @et
label: kollektív ágens tevékenységének időszaka a következő: @hu
label: té com a període d’activitat d’un agent col·lectiu @ca
label: έχει περίοδο δραστηριοποίησης του συλλογικού φορέα @el
label: له فترة نشاط وكيل جماعي @ar
label: 有集体行为者的活跃期 @zh-hans
sub property of: yhteistoimijaan liittyvä ajanjakso
sub property of: toimijan toiminta-aika
alternative label: yhteistoimijan toimintaan liittyvä ajanjakso
definition: Correla un agente collettivo a un arco di tempo durante il quale un agente collettivo è attivo nel suo campo di impegno principale. @it
definition: Hozzákapcsol egy kollektív ágenst egy időtartamhoz, amely alatt egy kollektív ágens fő működési területén aktív. @hu
definition: Kolektif bir temsilciyi, kolektif bir temsilcinin asıl alanında aktif olduğu bir zaman aralığıyla ilişkilendirir. @tr
definition: Liittää yhteistoimijan ajanjaksoon, jonka aikana yhteistoimija on ollut aktiivinen ensisijaisella toiminta-alallaan.
definition: Met un agent collectif en relation avec un laps de temps pendant lequel un agent collectif est actif dans son principal champ d’activité. @fr
definition: Relaciona un agent col·lectiu amb un interval de temps durant el qual un agent col·lectiu està en actiu en el seu camp principal d’activitat. @ca
definition: Relateert een collectieve actor aan een tijdspanne gedurende welke een collectieve actor actief is in zijn primaire werkveld. @nl
definition: Relaterer en kollektiv agent til en tidsperiode, hvori en kollektiv agent er aktiv i sit primære virkefelt. @da
definition: Relaterer en kollektiv agent til et tidsrom hvor en kollektiv agent er aktiv innenfor sitt hovedvirke. @no
definition: Relates a collective agent to a timespan during which a collective agent is active in its primary field of endeavor. @en
definition: Sasaista grupu ar laikposmu, kurā grupa ir aktīva savā galvenajā darbības jomā. @lv
definition: Seostab kollektiivi ajavahemikuga, millal kollektiiv on olnud oma peamisel tegevusalal aktiivne. @et
definition: Setzt einen gemeinschaftlichen Akteur in Beziehung zu einem Zeitraum, in dem ein gemeinschaftlicher Akteur in seinem primären Tätigkeitsfeld aktiv ist. @de
definition: يربط وكيلا جماعيا بفترة زمنية يكون خلالها الوكيل الجماعي نشطًا في مجال عمله الأساسي. @ar
definition: 将一个集体行为者与一个集体行为者在主要努力领域中活跃的时间段关联起来。 @zh-hans

suvun toiminta-aika
has element type: 2
toolkit definition: A timespan during which a family is active in its primary field of endeavor. @en
toolkit definition: Ajanjakso, jonka aikana suku on ollut aktiivinen ensisijaisella toiminta-alallaan.
toolkit definition: Ajavahemik, millal perekond on olnud oma peamisel tegevusalal aktiivne. @et
toolkit definition: Arco di tempo durante cui una famiglia è attiva nel suo campo di impegno principale. @it
toolkit definition: Bir ailenin, asıl faaliyet alanında aktif olduğu bir zaman aralığı. @tr
toolkit definition: Een tijdspanne gedurende welke een familie actief is in haar primaire werkveld. @nl
toolkit definition: Egy időtartam, amely alatt egy család elsődleges tevékenységi területén aktív. @hu
toolkit definition: Ein Zeitraum, in dem eine Familie in ihrem primären Tätigkeitsfeld aktiv ist. @de
toolkit definition: Et tidsrom hvor en familie er aktiv innenfor sitt hovedvirke. @no
toolkit definition: Interval de temps durant el qual una família està en actiu en el seu camp principal d’activitat. @ca
toolkit definition: Laikposms, kurā dzimta/ģimene ir aktīva savā darbības jomā. @lv
toolkit definition: Laps de temps pendant lequel une famille est active dans son principal champ d’activité. @fr
toolkit definition: Tidsperiode, hvori en familie er aktiv i sit primære virkefelt. @da
toolkit definition: فترة زمنية تكون خلالها عائلة نشطة في مجال عملها الأساسي. @ar
toolkit definition: 一个家族在主要努力领域中活跃的时间段 @zh-hans
toolkit label: Ailenin faaliyet süresi @tr
toolkit label: Wirkungszeitraum einer Familie @de
toolkit label: aktivitetsperiode for familie @da
toolkit label: család tevékenyégének időszaka: @hu
toolkit label: dzimtas/ģimenes darbības periods @lv
toolkit label: perekonna tegutsemisaeg @et
toolkit label: period of activity of family @en
toolkit label: periode en familie var aktiv @no
toolkit label: periode van activiteit van familie @nl
toolkit label: periodo di attività di famiglia @it
toolkit label: període d’activitat d’una família @ca
toolkit label: période d’activité d’une famille @fr
toolkit label: suvun toiminta-aika
toolkit label: περίοδος δραστηριοποίησης της οικογένειας @el
toolkit label: فترة نشاط عائلة @ar
toolkit label: 家族的活跃期 @zh-hans
has subproperty: P50432
lexical alias: periodOfActivityOfFamily.en
status: Published
type: Property
domain: C10008
label: a pour période d’activité d’une famille @fr
label: ailenin faaliyet dönemi ile ilişkilidir @tr
label: család tevékenységének időszaka a következő: @hu
label: dzimtas/ģimenes darbības periods @lv
label: ha come periodo di attività di famiglia @it
label: har aktivitetsperiode for familie @da
label: har periode en familie var aktiv @no
label: has period of activity of family @en
label: hat Wirkungszeitraum einer Familie @de
label: heeft periode van activiteit van familie @nl
label: perekonna tegutsemisaeg @et
label: té com a període d’activitat d’una família @ca
label: έχει περίοδο δραστηριοποίησης της οικογένειας @el
label: له فترة نشاط عائلة @ar
label: 有家族的活跃期 @zh-hans
sub property of: sukuun liittyvä ajanjakso
sub property of: yhteistoimijan toiminta-aika
alternative label: suvun toimintaan liittyvä ajanjakso
definition: Bir aileyi, asıl uğraş alanında aktif olduğu zaman aralığıyla ilişkilendirir. @tr
definition: Correla una famiglia a un arco di tempo durante il quale una famiglia è attiva nel suo campo di impegno principale. @it
definition: Hozzákapcsol egy családot egy időtartamhoz, amely alatt egy család elsődleges tevékenységi területén aktív. @hu
definition: Liittää suvun ajanjaksoon, jonka aikana suku on ollut aktiivinen ensisijaisella toiminta-alallaan.
definition: Met une famille en relation avec un laps de temps pendant lequel une famille est active dans son principal champ d’activité. @fr
definition: Relaciona una família amb un interval de temps durant el qual una família està en actiu en el seu camp principal d’activitat. @ca
definition: Relateert een familie aan een tijdspanne gedurende welke een familie actief is in haar primaire werkveld. @nl
definition: Relaterer en familie til en tidsperiode, hvori en familie er aktiv i sit primære virkefelt. @da
definition: Relaterer en familie til et tidsrom hvor en familie er aktiv innenfor sitt hovedvirke. @no
definition: Relates a family to a timespan during which a family is active in its primary field of endeavor. @en
definition: Sasaista dzimtu/ģimeni ar laikposmu, kurā dzimta/ģimene ir aktīva savā darbības jomā. @lv
definition: Seostab perekonna ajavahemikuga, millal perekond on olnud oma peamisel tegevusalal aktiivne. @et
definition: Setzt eine Familie in Beziehung zu einem Zeitraum, in dem eine Familie in ihrem primären Tätigkeitsfeld aktiv ist. @de
definition: يربط عائلة بفترة زمنية تكون خلالها العائلة نشطة في مجال عملها الأساسي. @ar
definition: 将一个家族与一个家族在主要努力领域中活跃的时间段关联起来。 @zh-hans

yhteistoimijan yhteisöjäsen
has element type: 2
toolkit definition: A corporate body who is a member of a collective agent. @en
toolkit definition: Asutus, mis on kollektiivi liige. @et
toolkit definition: Collectivité qui est membre d’un agent collectif. @fr
toolkit definition: Een corporatie die een lid is van een collectieve actor. @nl
toolkit definition: Egy testület, amely egy kollektív ágens tagja. @hu
toolkit definition: Eine Körperschaft, die Mitglied eines gemeinschaftlichen Akteurs ist. @de
toolkit definition: En korporasjon som er et medlem av en kollektiv agent. @no
toolkit definition: Ente membro di un agente collettivo. @it
toolkit definition: Entitat corporativa que és un membre d’un agent col·lectiu. @ca
toolkit definition: Institūcija, kas ir grupas dalībniece. @lv
toolkit definition: Kolektif bir temsilcinin üyesi olan bir tüzel kişi @tr
toolkit definition: Korporation, som er et medlem af en kollektiv agent. @da
toolkit definition: Yhteisö, joka on yhteistoimijan jäsen.
toolkit definition: هيئة هي عضو في وكيل جماعي. @ar
toolkit definition: 是一个集体行为者的一个成员的一个团体 @zh-hans
toolkit label: Mitglied eines gemeinschaftlichen Akteurs (Körperschaft) @de
toolkit label: collectivité membre d’un agent collectif @fr
toolkit label: corporate body member of collective agent @en
toolkit label: corporatief lid van collectieve actor @nl
toolkit label: ente membro di agente collettivo @it
toolkit label: entitat corporativa membre d’un agent col·lectiu @ca
toolkit label: grupas dalībnieks (institūcija) @lv
toolkit label: kolektif temsilcinin tüzel kişi üyesi @tr
toolkit label: kollektiivi liige (asutus) @et
toolkit label: kollektív ágens testületi tagja: @hu
toolkit label: korporasjon som medlem av kollektiv agent @no
toolkit label: korporation, som er medlem af kollektiv agent @da
toolkit label: yhteistoimijan yhteisöjäsen
toolkit label: έχει συλλογικό όργανο μέλος του συλλογικού φορέα @el
toolkit label: هيئة عضو في وكيل جماعي @ar
toolkit label: 集体行为者的团体成员 @zh-hans
has subproperty: yhteisön yhteisöjäsen
has subproperty: suvun yhteisöjäsen
has subproperty: P50433
lexical alias: corporateBodyMemberOfCollectiveAgent.en
status: Published
type: Property
domain: C10011
label: a pour collectivité membre d’un agent collectif @fr
label: grupas dalībnieks (institūcija) @lv
label: ha come ente membro di agente collettivo @it
label: har korporasjon som medlem av kollektiv agent @no
label: har korporation, som er medlem af kollektiv agent @da
label: has corporate body member of collective agent @en
label: hat Mitglied eines gemeinschaftlichen Akteurs (Körperschaft) @de
label: heeft corporatief lid van collectieve actor @nl
label: kolektif temsilcinin tüzel kişi üyesi ile ilişkilidir @tr
label: kollektiivi liige (asutus) @et
label: kollektív ágens testületi tagja a következő: @hu
label: té com a entitat corporativa membre d’un agent col·lectiu @ca
label: έχει συλλογικό όργανο μέλος του συλλογικού φορέα @el
label: له هيئة عضو في وكيل جماعي @ar
label: 有集体行为者的团体成员 @zh-hans
sub property of: yhteistoimijaan liittyvä yhteisö
definition: Correla un agente collettivo a un ente che è un membro di un agente collettivo. @it
definition: Hozzákapcsol egy kollektív ágenst egy testülethez, amely egy kollektív ágens tagja. @hu
definition: Kolektif bir temsilciyi, bir kolektif temsilcinin üyesi olan bir tüzel kişiyle ilişkilendirir. @tr
definition: Liittää yhteistoimijan yhteisöön, joka on yhteistoimijan jäsen.
definition: Met un agent collectif en relation avec une collectivité qui est membre d’un agent collectif. @fr
definition: Relaciona un agent col·lectiu amb una entitat corporativa que és un membre d’un agent col·lectiu. @ca
definition: Relateert een collectieve actor aan een corporatie die een lid is van een collectieve actor. @nl
definition: Relaterer en kollektiv agent til en korporasjon som er et medlem av en kollektiv agent. @no
definition: Relaterer en kollektiv agent til en korporation, som er et medlem af en kollektiv agent. @da
definition: Relates a collective agent to a corporate body who is a member of a collective agent. @en
definition: Sasaista grupu ar institūciju, kas ir grupas dalībniece. @lv
definition: Seostab kollektiivi asutusega, mis on kollektiivi liige. @et
definition: Setzt einen gemeinschaftlichen Akteur in Beziehung zu einer Körperschaft, die Mitglied eines gemeinschaftlichen Akteurs ist. @de
definition: يربط وكيلا جماعيا بهيئة هي عضو في وكيل جماعي. @ar
definition: 将一个集体行为者与是一个集体行为者的一个成员的一个团体关联起来。 @zh-hans

suvun yhteisöjäsen
has element type: 2
toolkit definition: A corporate body who is a member of a family. @en
toolkit definition: Asutus, mis on perekonna liige. @et
toolkit definition: Bir ailenin üyesi olan bir tüzel kişi @tr
toolkit definition: Collectivité qui est membre d’une famille. @fr
toolkit definition: Een corporatie die een lid is van een familie. @nl
toolkit definition: Egy testület, amely egy család tagja. @hu
toolkit definition: Eine Körperschaft, die Mitglied einer Familie ist. @de
toolkit definition: En korporasjon som er et medlem av en familie. @no
toolkit definition: Ente membro di una famiglia. @it
toolkit definition: Entitat corporativa que és un membre d’una família. @ca
toolkit definition: Institūcija, kas ir dzimtas/ģimenes dalībniece. @lv
toolkit definition: Korporation, som er et medlem af en familie. @da
toolkit definition: Yhteisö, joka on suvun jäsen.
toolkit definition: هيئة هي عضو في عائلة. @ar
toolkit definition: 是一个家族的一个成员的一个团体 @zh-hans
toolkit label: Familienmitglied (Körperschaft) @de
toolkit label: ailenin tüzel kişi üyesi @tr
toolkit label: collectivité membre d’une famille @fr
toolkit label: corporate body member of family @en
toolkit label: corporatief lid van familie @nl
toolkit label: család testületi tagja: @hu
toolkit label: dzimtas/ģimenes dalībnieks (institūcija) @lv
toolkit label: ente membro di famiglia @it
toolkit label: entitat corporativa membre d’una família @ca
toolkit label: korporasjon som medlem av familie @no
toolkit label: korporation, som er medlem af familie @da
toolkit label: perekonna liige (asutus) @et
toolkit label: suvun yhteisöjäsen
toolkit label: συλλογικό όργανο μέλος της οικογένειας @el
toolkit label: هيئة عضو في عائلة @ar
toolkit label: 家族的团体成员 @zh-hans
has subproperty: P50435
lexical alias: corporateBodyMemberOfFamily.en
status: Published
type: Property
domain: C10008
label: a pour collectivité membre d’une famille @fr
label: ailenin tüzel kişi üyesi ile ilişkilidir @tr
label: család testületi tagja a következő: @hu
label: dzimtas/ģimenes dalībnieks (institūcija) @lv
label: ha come ente membro di famiglia @it
label: har korporasjon som medlem av familie @no
label: har korporation, som er medlem af familie @da
label: has corporate body member of family @en
label: hat Familienmitglied (Körperschaft) @de
label: heeft corporatief lid van familie @nl
label: perekonna liige (asutus) @et
label: té com a entitat corporativa membre d’una família @ca
label: έχει συλλογικό όργανο μέλος της οικογένειας @el
label: له هيئة عضو في عائلة @ar
label: 有家族的团体成员 @zh-hans
sub property of: sukuun liittyvä yhteisö
sub property of: yhteistoimijan yhteisöjäsen
definition: Bir aileyi, bir ailenin üyesi olan bir tüzel kişiyle ilişkilendirir. @tr
definition: Correla una famiglia a un ente che è un membro di una famiglia. @it
definition: Hozzákapcsol egy családot egy testülethez, amely egy család tagja. @hu
definition: Liittää suvun yhteisöön, joka on suvun jäsen.
definition: Met une famille en relation avec une collectivité qui est membre d’une famille. @fr
definition: Relaciona una família amb una entitat corporativa que és un membre d’una família. @ca
definition: Relateert een familie aan een corporatie die een lid is van een familie. @nl
definition: Relaterer en familie til en korporasjon som er et medlem av en familie. @no
definition: Relaterer en familie til en korporation, som er et medlem af en familie. @da
definition: Relates a family to a corporate body who is a member of a family. @en
definition: Sasaista dzimtu/ģimeni ar institūciju, kas ir dzimtas/ģimenes dalībniece. @lv
definition: Seostab perekonna asutusega, mis on perekonna liige. @et
definition: Setzt eine Familie in Beziehung zu einer Körperschaft, die Mitglied einer Familie ist. @de
definition: يربط عائلة بهيئة هي عضو في عائلة. @ar
definition: 将一个家族与是一个家族的一个成员的一个团体关联起来。 @zh-hans

yhteistoimijan sukujäsen
has element type: 2
toolkit definition: A family who is a member of a collective agent. @en
toolkit definition: Dzimta/ģimene, kas ir grupas piederīgā. @lv
toolkit definition: Een familie die een lid is van een collectieve actor. @nl
toolkit definition: Egy család, amely egy kollektív ágens tagja. @hu
toolkit definition: Eine Familie, die Mitglied eines gemeinschaftlichen Akteurs ist. @de
toolkit definition: En familie som er et medlem av en kollektiv agent. @no
toolkit definition: Famiglia membro di un agente collettivo. @it
toolkit definition: Familie, som er et medlem af en kollektiv agent. @da
toolkit definition: Famille qui est membre d’un agent collectif. @fr
toolkit definition: Família que és un membre d’un agent col·lectiu. @ca
toolkit definition: Kolektif bir temsilcinin üyesi olan bir aile @tr
toolkit definition: Perekond, kes on kollektiivi liige. @et
toolkit definition: Suku, joka on yhteistoimijan jäsen.
toolkit definition: عائلة عضو في وكيل جماعي. @ar
toolkit definition: 是一个集体行为者的一个成员的一个家族 @zh-hans
toolkit label: Mitglied eines gemeinschaftlichen Akteurs (Familie) @de
toolkit label: famiglia membro di agente collettivo @it
toolkit label: familie som medlem av kollektiv agent @no
toolkit label: familie, som er medlem af kollektiv agent @da
toolkit label: familielid van collectieve actor @nl
toolkit label: famille membre d’un agent collectif @fr
toolkit label: family member of collective agent @en
toolkit label: família membre d’un agent col·lectiu @ca
toolkit label: grupai piederīgā dzimta/ģimene @lv
toolkit label: kolektif temsilcinin aile üyesi @tr
toolkit label: kollektiivi liige (perekond) @et
toolkit label: kollektív ágens családtagja. @hu
toolkit label: yhteistoimijan sukujäsen
toolkit label: μέλος οικογένειας του συλλογικού φορέα @el
toolkit label: عائلة عضو في وكيل جماعي @ar
toolkit label: 集体行为者的家族成员 @zh-hans
has subproperty: yhteisön sukujäsen
has subproperty: suvun sukuhaara
has subproperty: P50436
lexical alias: familyMemberOfCollectiveAgent.en
status: Published
type: Property
domain: C10011
label: a pour famille membre d’un agent collectif @fr
label: grupai piederīgā dzimta/ģimene @lv
label: ha come famiglia membro di agente collettivo @it
label: har familie som medlem av kollektiv agent @no
label: har familie, som er medlem af kollektiv agent @da
label: has family member of collective agent @en
label: hat Mitglied eines gemeinschaftlichen Akteurs (Familie) @de
label: heeft familielid van collectieve actor @nl
label: kolektif temsilcinin aile üyesi ile ilişkilidir @tr
label: kollektiivi liige (perekond) @et
label: kollektív ágens családtagja a következő: @hu
label: té com a família membre d’un agent col·lectiu @ca
label: έχει μέλος οικογένειας του συλλογικού φορέα @el
label: له عائلة عضو في وكيل جماعي @ar
label: 有集体行为者的家族成员 @zh-hans
sub property of: yhteistoimijaan liittyvä suku
definition: Correla un agente collettivo a un famiglia che è un membro di un agente collettivo. @it
definition: Hozzákapcsol egy kollektív ágenst egy családhoz, amely egy kollektív ágens tagja. @hu
definition: Kolektif bir temsilciyi, bir kolektif temsilcinin üyesi olan bir aileyle ilişkilendirir. @tr
definition: Liittää yhteistoimijan sukuun, joka on yhteistoimijan jäsen.
definition: Met un agent collectif en relation avec une famille qui est membre d’un agent collectif. @fr
definition: Relaciona un agent col·lectiu amb una família que és un membre d’un agent col·lectiu. @ca
definition: Relateert een collectieve actor aan een familie die een lid is van een collectieve actor. @nl
definition: Relaterer en kollektiv agent til en familie som er et medlem av en kollektiv agent. @no
definition: Relaterer en kollektiv agent til en familie, som er et medlem af en kollektiv agent. @da
definition: Relates a collective agent to a family who is a member of a collective agent. @en
definition: Sasaista grupu ar dzimtu/ģimeni, kas ir grupas piederīgā. @lv
definition: Seostab kollektiivi perekonnaga, kes on kollektiivi liige. @et
definition: Setzt einen gemeinschaftlichen Akteur in Beziehung zu einer Familie, die Mitglied eines gemeinschaftlichen Akteurs ist. @de
definition: يربط وكيلا جماعيا بعائلة هي عضو في وكيل جماعي. @ar
definition: 将一个集体行为者与是一个集体行为者的一个成员的一个家族关联起来。 @zh-hans

yhteisön sukujäsen
has element type: 2
toolkit definition: A family who is a member of a corporate body. @en
toolkit definition: Dzimta/ģimene, kas ir institūcijas piederīgais. @lv
toolkit definition: Een familie die een lid is van een corporatie. @nl
toolkit definition: Egy család, amely egy testület tagja. @hu
toolkit definition: Eine Familie, die Mitglied einer Körperschaft ist. @de
toolkit definition: En familie som er et medlem av korporasjon. @no
toolkit definition: Famiglia membro di un ente. @it
toolkit definition: Familie, som er et medlem af en korporation. @da
toolkit definition: Famille qui est membre d’une collectivité. @fr
toolkit definition: Família que és un membre d’una entitat corporativa. @ca
toolkit definition: Perekond, kes on asutuse liige. @et
toolkit definition: Suku, joka kuuluu yhteisöön.
toolkit definition: Tüzel bir kişiliğin üyesi olan bir aile @tr
toolkit definition: عائلة هي عضو في هيئة. @ar
toolkit definition: 是一个团体的一个成员的一个家族 @zh-hans
toolkit label: Mitglied einer Körperschaft (Familie) @de
toolkit label: asutuse liige (perekond) @et
toolkit label: famiglia membro di ente @it
toolkit label: familie som medlem av korporasjon @no
toolkit label: familie, som er medlem af korporation @da
toolkit label: familielid van corporatie @nl
toolkit label: famille membre d’une collectivité @fr
toolkit label: family member of corporate body @en
toolkit label: família membre d’una entitat corporativa @ca
toolkit label: institūcijai piederīgā dzimta/ģimene @lv
toolkit label: testület családtagja: @hu
toolkit label: tüzel kişinin aile üyesi @tr
toolkit label: yhteisön sukujäsen
toolkit label: μέλος οικογένειας του συλλογικού οργάνου @el
toolkit label: عائلة عضو في هيئة @ar
toolkit label: 团体的家族成员 @zh-hans
has subproperty: P50437
lexical alias: familyMemberOfCorporateBody.en
status: Published
type: Property
domain: C10005
label: a pour famille membre d’une collectivité @fr
label: asutuse liige (perekond) @et
label: ha come famiglia membro di ente @it
label: har familie som medlem av korporasjon @no
label: har familie, som er medlem af korporation @da
label: has family member of corporate body @en
label: hat Mitglied einer Körperschaft (Familie) @de
label: heeft familielid van corporatie @nl
label: institūcijai piederīgā dzimta/ģimene @lv
label: testület családtagja a következő: @hu
label: té com a família membre d’una entitat corporativa @ca
label: tüzel kişinin aile üyesi ile ilişkilidir @tr
label: έχει μέλος οικογένειας του συλλογικού οργάνου @el
label: له عائلة عضو في هيئة @ar
label: 有团体的家族成员 @zh-hans
sub property of: yhteisöön liittyvä suku
sub property of: yhteistoimijan sukujäsen
alternative label: liige (perekond) @et
definition: Bir tüzel kişiyi, bir tüzel kişiliğin üyesi olan bir aileyle ilişkilendirir. @tr
definition: Correla un ente a una famiglia che è un membro di un ente. @it
definition: Hozzákapcsol egy testületet egy családhoz, amely egy testület tagja. @hu
definition: Liittää yhteisön sukuun, joka kuuluu yhteisöön.
definition: Met une collectivité en relation avec une famille qui est membre d’une collectivité. @fr
definition: Relaciona una entitat corporativa amb una família que és un membre d’una entitat corporativa. @ca
definition: Relateert een corporatie aan een familie die een lid is van een corporatie. @nl
definition: Relaterer en korporasjon til en familie som er et medlem av korporasjon. @no
definition: Relaterer en korporation til en familie, som er et medlem af en korporation. @da
definition: Relates a corporate body to a family who is a member of a corporate body. @en
definition: Sasaista institūciju ar dzimtu/ģimeni, kas ir institūcijas piederīgais. @lv
definition: Seostab asutuse perekonnaga, kes on asutuse liige. @et
definition: Setzt eine Körperschaft in Beziehung zu einer Familie, die Mitglied einer Körperschaft ist. @de
definition: يربط هيئة بعائلة هي عضو في هيئة. @ar
definition: 将一个团体与是一个团体的一个成员的一个家族关联起来。 @zh-hans

suvun sukuhaara
has element type: 2
toolkit definition: A family who is a member of a family. @en
toolkit definition: Bir ailenin üyesi olan bir aile @tr
toolkit definition: Dzimta/ģimene, kas ir dzimtas /ģimenes piederīgais. @lv
toolkit definition: Een familie die een lid is van een familie. @nl
toolkit definition: Egy család, amely egy család tagja. @hu
toolkit definition: Eine Familie, die Mitglied einer Familie ist. @de
toolkit definition: En familie som er et medlem av en familie. @no
toolkit definition: Famiglia membro di una famiglia. @it
toolkit definition: Familie, som er et medlem af en familie. @da
toolkit definition: Famille qui est membre d’une famille. @fr
toolkit definition: Família que és un membre d’una família. @ca
toolkit definition: Perekond, kes on perekonna liige. @et
toolkit definition: Suku, joka on suvun jäsen.
toolkit definition: عائلة هي عضو في عائلة. @ar
toolkit definition: 是一个家族的一个成员的一个家族 @zh-hans
toolkit label: Familienmitglied (Familie) @de
toolkit label: ailenin aile üyesi @tr
toolkit label: család családtagja: @hu
toolkit label: dzimtai/ģimenei piederīgā dzimta/ģimene @lv
toolkit label: famiglia membro di famiglia @it
toolkit label: familie som medlem av familie @no
toolkit label: familie, som er medlem af familie @da
toolkit label: familielid van familie @nl
toolkit label: famille membre d’une famille @fr
toolkit label: family member of family @en
toolkit label: família membre d’una família @ca
toolkit label: perekonna liige (perekond) @et
toolkit label: suvun sukuhaara
toolkit label: μέλος οικογένειας της οικογένειας @el
toolkit label: عائلة عضو في عائلة @ar
toolkit label: 家族的家族成员 @zh-hans
has subproperty: suvusta polveutuva suku
has subproperty: P50438
lexical alias: familyMemberOfFamily.en
status: Published
type: Property
domain: C10008
label: a pour famille membre d’une famille @fr
label: ailenin aile üyesi ile ilişkilidir @tr
label: család családtagja a következő: @hu
label: dzimtai/ģimenei piederīgā dzimta/ģimene @lv
label: ha come famiglia membro di famiglia @it
label: har familie som medlem av familie @no
label: har familie, som er medlem af familie @da
label: has family member of family @en
label: hat Familienmitglied (Familie) @de
label: heeft familielid van familie @nl
label: perekonna liige (perekond) @et
label: té com a família membre d’una família @ca
label: έχει μέλος οικογένειας της οικογένειας @el
label: له عائلة عضو في عائلة @ar
label: 有家族的家族成员 @zh-hans
sub property of: sukuun liittyvä suku
sub property of: yhteistoimijan sukujäsen
alternative label: suvun jäsen (suku)
definition: Bir aileyi, bir ailenin üyesi olan bir aileyle ilişkilendirir. @tr
definition: Correla una famiglia a una famiglia che è membro di una famiglia. @it
definition: Hozzákapcsol egy családot egy családhoz, amely egy család tagja. @hu
definition: Liittää suvun sukuun, joka on suvun jäsen.
definition: Met une famille en relation avec une famille qui est membre d’une famille. @fr
definition: Relaciona una família amb una família que és un membre d’una família. @ca
definition: Relateert een familie aan een familie die een lid is van een familie. @nl
definition: Relaterer en familie til en familie som er et medlem av en familie. @no
definition: Relaterer en familie til en familie, som er et medlem af en familie. @da
definition: Relates a family to a family who is a member of a family. @en
definition: Sasaista dzimtu/ģimeni ar dzimtu/ģimeni, kas ir dzimtas /ģimenes piederīgais. @lv
definition: Seostab perekonna perekonnaga, kes on perekonna liige. @et
definition: Setzt eine Familie in Beziehung zu einer Familie, die Mitglied einer Familie ist. @de
definition: يربط عائلة بعائلة هي عضو في عائلة. @ar
definition: 将一个家族与是一个家族的一个成员的一个家族关联起来。 @zh-hans

yhteisöjäsen yhteistoimijassa
has element type: 2
toolkit definition: A collective agent of whom a corporate body is a member. @en
toolkit definition: Agent collectif dont une collectivité est membre. @fr
toolkit definition: Agent col·lectiu del qual una entitat corporativa n’és un membre. @ca
toolkit definition: Agente collettivo di cui un ente è membro. @it
toolkit definition: Bir tüzel kişinin üyesi olduğu kolektif bir temsilci @tr
toolkit definition: Een collectieve actor waarvan een corporatie lid is. @nl
toolkit definition: Egy kollektív ágens, amelynek a tagja egy testület. @hu
toolkit definition: Ein gemeinschaftlicher Akteur, dem eine Körperschaft angehört. @de
toolkit definition: En kollektiv agent som en korporasjon er medlem av. @no
toolkit definition: Grupa, kā dalībniece ir institūcija. @lv
toolkit definition: Kollektiiv, milles asutus on liige. @et
toolkit definition: Kollektiv agent, som en korporation er medlem af. @da
toolkit definition: Yhteistoimija, jonka jäsen yhteisö on.
toolkit definition: وكيل جماعي حيث الهيئة عضو فيه. @ar
toolkit definition: 有一个团体作为其成员的一个集体行为者 @zh-hans
toolkit label: Körperschaft als Mitglied eines gemeinschaftlichen Akteurs von @de
toolkit label: collectivité membre d’un agent collectif de @fr
toolkit label: corporate body member of collective agent of @en
toolkit label: corporatief lid van collectieve actor van @nl
toolkit label: ente membro di agente collettivo di @it
toolkit label: entitat corporativa membre d’un agent col·lectiu de @ca
toolkit label: ir grupas dalībnieks (institūcija) @lv
toolkit label: kolektif temsilcinin tüzel kişi üyesi @tr
toolkit label: kollektiivi liige (asutus) kollektiivis @et
toolkit label: korporasjon som medlem av kollektiv agent for @no
toolkit label: korporation, som er medlem af kollektiv agent af @da
toolkit label: testületi tagja a következő kollektív ágensnek: @hu
toolkit label: yhteisöjäsen yhteistoimijassa
toolkit label: συλλογικό όργανο μέλος του συλλογικού φορέα του @el
toolkit label: هيئة عضو في وكيل جماعي @ar
toolkit label: ……的集体行为者的团体成员 @zh-hans
has subproperty: yhteisöjäsen yhteisössä
has subproperty: yhteisöjäsen suvussa
has subproperty: P50439
lexical alias: corporateBodyMemberOfCollectiveAgentOf.en
status: Published
type: Property
domain: C10005
label: er korporasjon som medlem av kollektiv agent for @no
label: er korporation, som er medlem af kollektiv agent af @da
label: est une collectivité membre d’un agent collectif de @fr
label: ir grupas dalībnieks (institūcija) @lv
label: is corporate body member of collective agent of @en
label: is corporatief lid van collectieve actor van @nl
label: ist Körperschaft als Mitglied eines gemeinschaftlichen Akteurs von @de
label: kolektif temsilcisinin tüzel kişi üyesidir @tr
label: kollektiivi liige (asutus) kollektiivis @et
label: kollektív ágens testületi tagja a következőnek: @hu
label: è ente membro di agente collettivo di @it
label: és entitat corporativa membre d’un agent col·lectiu de @ca
label: είναι συλλογικό όργανο μέλος του συλλογικού φορέα του @el
label: هي هيئة عضو في وكيل جماعي @ar
label: 是……的集体行为者的团体成员 @zh-hans
sub property of: yhteisöön liittyvä yhteistoimija
alternative label: yhteisöön kuuluva yhteistoimija
definition: Bir tüzel kişiyi, bir tüzel kişinin üyesi olduğu bir kolektif temsilci ile ilişkilendirir. @tr
definition: Correla un ente a un agente collettivo di cui un ente è un membro. @it
definition: Hozzákapcsol egy testületet egy kollektív ágenshez, amelynek a tagja egy testület. @hu
definition: Liittää yhteisön yhteistoimijaan, jonka jäsen yhteisö on.
definition: Met une collectivité en relation avec un agent collectif dont une collectivité est membre. @fr
definition: Relaciona una entitat corporativa amb un agent col·lectiu del qual una entitat corporativa n’és un membre. @ca
definition: Relateert een corporatie aan een collectieve actor waarvan een corporatie lid is. @nl
definition: Relaterer en korporasjon til en kollektiv agent som en korporasjon er medlem av. @no
definition: Relaterer en korporation til en kollektiv agent, som en korporation er medlem af. @da
definition: Relates a corporate body to a collective agent of whom a corporate body is a member. @en
definition: Sasaista institūciju ar grupu, kā dalībniece ir institūcija. @lv
definition: Seostab asutuse kollektiiviga, milles asutus on liige. @et
definition: Setzt eine Körperschaft in Beziehung zu einem gemeinschaftlichen Akteur, dem eine Körperschaft angehört. @de
definition: يربط هيئة بوكيل جماعي هي عضو فيه. @ar
definition: 将一个团体与有一个团体作为其成员的一个集体行为者关联起来。 @zh-hans

yhteisöjäsen suvussa
has element type: 2
toolkit definition: A family of whom a corporate body is a member. @en
toolkit definition: Bir tüzel kişinin üyesi olduğu bir aile @tr
toolkit definition: Dzimta/ģimene, kas ir institūcija. @lv
toolkit definition: Een familie waarvan een corporatie lid is. @nl
toolkit definition: Egy család, amelynek a tagja egy testület. @hu
toolkit definition: Eine Familie, der eine Körperschaft angehört. @de
toolkit definition: En familie som en korporasjon er medlem av. @no
toolkit definition: Famiglia di cui un ente è membro. @it
toolkit definition: Familie, som en korporation er medlem af. @da
toolkit definition: Famille dont une collectivité est membre. @fr
toolkit definition: Família de la qual una entitat corporativa n’és un membre. @ca
toolkit definition: Perekond, milles asutus on liige. @et
toolkit definition: Suku, jonka jäsen yhteisö on.
toolkit definition: عائلة حيث الهيئة عضو فيها. @ar
toolkit definition: 有一个团体作为其成员的一个家族 @zh-hans
toolkit label: Körperschaft als Familienmitglied von @de
toolkit label: ailenin tüzel kişi üyesi @tr
toolkit label: collectivité membre d’une famille de @fr
toolkit label: corporate body member of family of @en
toolkit label: corporatief lid van familie van @nl
toolkit label: ente membro di famiglia di @it
toolkit label: entitat corporativa membre d’una família de @ca
toolkit label: ir dzimtas/ģimenes dalībnieks (institūcija) @lv
toolkit label: korporasjon som medlem av familie for @no
toolkit label: korporation, som er medlem af familie af @da
toolkit label: perekonna liige (asutus) perekonnas @et
toolkit label: testületi tagja a következő családnak: @hu
toolkit label: yhteisöjäsen suvussa
toolkit label: συλλογικό όργανο μέλος της οικογένειας του @el
toolkit label: هيئة عضو في عائلة @ar
toolkit label: ……的家族的团体成员 @zh-hans
has subproperty: P50440
lexical alias: corporateBodyMemberOfFamilyOf.en
status: Published
type: Property
domain: C10005
label: ailesinin tüzel kişi üyesidir @tr
label: er korporasjon som medlem av familie for @no
label: er korporation, som er medlem af familie af @da
label: est une collectivité membre d’une famille de @fr
label: ir dzimtas/ģimenes dalībnieks (institūcija) @lv
label: is corporate body member of family of @en
label: is corporatief lid van familie van @nl
label: ist Körperschaft als Familienmitglied von @de
label: perekonna liige (asutus) perekonnas @et
label: testületi tagja a következő családnak: @hu
label: è ente membro di famiglia di @it
label: és entitat corporativa membre d’una família de @ca
label: είναι συλλογικό όργανο μέλος της οικογένειας του @el
label: هي هيئة عضو في عائلة @ar
label: 是……的家族的团体成员 @zh-hans
sub property of: yhteisöön liittyvä suku
sub property of: yhteisöjäsen yhteistoimijassa
alternative label: yhteisöön kuuluva suku
definition: Bir tüzel kişiyi, bir tüzel kişinin üyesi olduğu bir aileyle ilişkilendirir. @tr
definition: Correla un ente a una famiglia di cui un ente è un membro. @it
definition: Hozzákapcsol egy testületet egy családhoz, amelynek a tagja egy testület. @hu
definition: Liittää yhteisön sukuun, jonka jäsen yhteisö on.
definition: Met une collectivité en relation avec une famille dont une collectivité est membre. @fr
definition: Relaciona una entitat corporativa amb una família de la qual una entitat corporativa n’és un membre. @ca
definition: Relateert een corporatie aan een familie waarvan een corporatie lid is. @nl
definition: Relaterer en korporasjon til en familie som en korporasjon er medlem av. @no
definition: Relaterer en korporation til en familie, som en korporation er medlem af. @da
definition: Relates a corporate body to a family of whom a corporate body is a member. @en
definition: Sasaista institūciju ar dzimtu/ģimeni, kas ir institūcija. @lv
definition: Seostab asutuse perekonnaga, milles asutus on liige. @et
definition: Setzt eine Körperschaft in Beziehung zu einer Familie, der eine Körperschaft angehört. @de
definition: يربط هيئة بعائلة هي عضو فيها. @ar
definition: 将一个团体与有一个团体作为其成员的一个家族关联起来。 @zh-hans

sukujäsen yhteistoimijassa
has element type: 2
toolkit definition: A collective agent of whom a family is a member. @en
toolkit definition: Agent collectif dont une famille est membre. @fr
toolkit definition: Agent col·lectiu del qual una família n’és un membre. @ca
toolkit definition: Agente collettivo di cui una famiglia è membro. @it
toolkit definition: Bir ailenin üyesi olduğu kolektif bir temsilci @tr
toolkit definition: Een collectieve actor waarvan een familie lid is. @nl
toolkit definition: Egy kollektív ágens, amelynek egy család a tagja. @hu
toolkit definition: Ein gemeinschaftlicher Akteur, dem eine Familie angehört. @de
toolkit definition: En kollektiv agent som en familie er medlem av. @no
toolkit definition: Grupa, kam dzimta/ģimene ir piederīga. @lv
toolkit definition: Kollektiiv, milles perekond on liige. @et
toolkit definition: Kollektiv agent, som en familie er medlem af. @da
toolkit definition: Yhteistoimija, jonka jäsen suku on.
toolkit definition: وكيل جماعي عائلة عضو فيه. @ar
toolkit definition: 有一个家族作为其成员的一个集体行为者 @zh-hans
toolkit label: Familie als Mitglied eines gemeinschaftlichen Akteurs von @de
toolkit label: családtagja a következő kollektív ágensnek: @hu
toolkit label: famiglia membro di agente collettivo di @it
toolkit label: familie som medlem av kollektiv agent for @no
toolkit label: familie, som er medlem af kollektiv agent af @da
toolkit label: familielid van collectieve actor van @nl
toolkit label: famille membre d’un agent collectif de @fr
toolkit label: family member of collective agent of @en
toolkit label: família membre d’un agent col·lectiu de @ca
toolkit label: ir grupas dalībnieks (dzimta/ģimene) @lv
toolkit label: kolektif temsilcinin aile üyesi @tr
toolkit label: kollektiivi liige (perekond) kollektiivis @et
toolkit label: sukujäsen yhteistoimijassa
toolkit label: μέλος οικογένειας του συλλογικού φορέα του @el
toolkit label: عائلة عضو في وكيل جماعي @ar
toolkit label: ……的集体行为者的家族成员 @zh-hans
has subproperty: sukujäsen yhteisössä
has subproperty: sukuhaara suvussa
has subproperty: P50441
lexical alias: familyMemberOfCollectiveAgentOf.en
status: Published
type: Property
domain: C10008
label: családtagja a következő kollektív ágensnek: @hu
label: er familie som medlem av kollektiv agent for @no
label: er familie, som er medlem af kollektiv agent af @da
label: est une famille membre d’un agent collectif de @fr
label: ir grupas dalībnieks (dzimta/ģimene) @lv
label: is familielid van collectieve actor van @nl
label: is family member of collective agent of @en
label: ist Familie als Mitglied eines gemeinschaftlichen Akteurs von @de
label: kolektif temsilcisinin aile üyesidir @tr
label: kollektiivi liige (perekond) kollektiivis @et
label: è famiglia membro di agente collettivo di @it
label: és família membre d’un agent col·lectiu de @ca
label: είναι μέλος οικογένειας του συλλογικού φορέα του @el
label: هي عائلة عضو في وكيل جماعي @ar
label: 是……的集体行为者的家族成员 @zh-hans
sub property of: sukuun liittyvä yhteistoimija
definition: Bir aileyi, ailenin üyesi olduğu kolektif bir temsilciyle ilişkilendirir. @tr
definition: Correla una famiglia a un agente collettivo di cui una famiglia è un membro. @it
definition: Hozzákapcsol egy családot egy kollektív ágenshez, amelynek egy család a tagja. @hu
definition: Liittää suvun yhteistoimijaan, jonka jäsen suku on.
definition: Met une famille en relation avec un agent collectif dont une famille est membre. @fr
definition: Relaciona una família amb un agent col·lectiu del qual una família n’és un membre. @ca
definition: Relateert een familie aan een collectieve actor waarvan een familie lid is. @nl
definition: Relaterer en familie til en kollektiv agent som en familie er medlem av. @no
definition: Relaterer en familie til en kollektiv agent, som en familie er medlem af. @da
definition: Relates a family to a collective agent of whom a family is a member. @en
definition: Sasaista dzimtu/ģimeni ar grupu, kam dzimta/ģimene ir piederīga. @lv
definition: Seostab perekonna kollektiiviga, milles perekond on liige. @et
definition: Setzt eine Familie in Beziehung zu einem gemeinschaftlichen Akteur, dem eine Familie angehört. @de
definition: يربط عائلة بوكيل جماعي هي عضو فيه. @ar
definition: 将一个家族与有一个家族作为其成员的一个集体行为者关联起来。 @zh-hans

sukujäsen yhteisössä
has element type: 2
toolkit definition: A corporate body of whom a family is a member. @en
toolkit definition: Asutus, milles perekond on liige. @et
toolkit definition: Bir ailenin üyesi olduğu tüzel bir kişi @tr
toolkit definition: Collectivité dont une famille est membre. @fr
toolkit definition: Een corporatie waarvan een familie lid is. @nl
toolkit definition: Egy testület, amelynek tagja egy család. @hu
toolkit definition: Eine Körperschaft, zu der eine Familie gehört. @de
toolkit definition: En korporasjon som en familie er medlem av. @no
toolkit definition: Ente di cui una famiglia è membro. @it
toolkit definition: Entitat corporativa de la qual una família n’és un membre. @ca
toolkit definition: Institūcija, kā piederīgais ir dzimta/ģimene. @lv
toolkit definition: Korporation, som en familie er medlem af. @da
toolkit definition: Yhteisö, jonka jäsen suku on.
toolkit definition: هيئة حيث عائلة عضو فيها. @ar
toolkit definition: 有一个家族是其成员的一个团体 @zh-hans
toolkit label: Familie als Mitglied einer Körperschaft von @de
toolkit label: asutuse liige (perekond) asutuses @et
toolkit label: családtagja a következő testületnek: @hu
toolkit label: famiglia membro di ente di @it
toolkit label: familie som medlem av korporasjon for @no
toolkit label: familie, som er medlem af korporation af @da
toolkit label: familielid van corporatie van @nl
toolkit label: famille membre d’une collectivité de @fr
toolkit label: family member of corporate body of @en
toolkit label: família membre d’una entitat corporativa de @ca
toolkit label: ir institūcijas dalībnieks (dzimta/ģimene) @lv
toolkit label: sukujäsen yhteisössä
toolkit label: tüzel kişinin aile üyesi @tr
toolkit label: μέλος οικογένειας του συλλογικού οργάνου του @el
toolkit label: عائلة عضو في هيئة @ar
toolkit label: ……的团体的家族成员 @zh-hans
has subproperty: P50442
lexical alias: familyMemberOfCorporateBodyOf.en
status: Published
type: Property
domain: C10008
label: asutuse liige (perekond) asutuses @et
label: családtagja a következő testületnek: @hu
label: er familie som medlem av korporasjon for @no
label: er familie, som er medlem af korporation af @da
label: est une famille membre d’une collectivité de @fr
label: ir institūcijas dalībnieks (dzimta/ģimene) @lv
label: is familielid van corporatie van @nl
label: is family member of corporate body of @en
label: ist Familie als Mitglied einer Körperschaft von @de
label: tüzel kişisinin aile üyesidir @tr
label: è famiglia membro di ente di @it
label: és família membre d’una entitat corporativa de @ca
label: είναι μέλος οικογένειας του συλλογικού οργάνου του @el
label: هي عائلة عضو في هيئة @ar
label: 是……的团体的家族成员 @zh-hans
sub property of: sukuun liittyvä yhteisö
sub property of: sukujäsen yhteistoimijassa
definition: Bir aileyi, ailenin üyesi olduğu bir tüzel kişiyle ilişkilendirir. @tr
definition: Correla una famiglia a un ente di cui una famiglia è un membro. @it
definition: Hozzákapcsol egy családot egy testülethez, amelynek egy család a tagja. @hu
definition: Liittää suvun yhteisöön, jonka jäsen suku on.
definition: Met une famille en relation avec une collectivité dont une famille est membre. @fr
definition: Relaciona una família amb una entitat corporativa de la qual una família n’és un membre. @ca
definition: Relateert een familie aan een corporatie waarvan een familie lid is. @nl
definition: Relaterer en familie til en korporasjon som en familie er medlem av. @no
definition: Relaterer en familie til en korporation, som en familie er medlem af. @da
definition: Relates a family to a corporate body of whom a family is a member. @en
definition: Sasaista dzimtu/ģimeni ar institūciju, kā piederīgais ir dzimta/ģimene. @lv
definition: Seostab perekonna asutusega, milles perekond on liige. @et
definition: Setzt eine Familie in Beziehung zu einer Körperschaft, zu der eine Familie gehört. @de
definition: يربط عائلة بهيئة تكون العائلة عضوا فيها. @ar
definition: 将一个家族与有一个家族是其成员的一个团体关联起来。 @zh-hans

sukuhaara suvussa
has element type: 2
toolkit definition: A family of whom a family is a member. @en
toolkit definition: Bir ailenin üyesi olduğu bir aile. @tr
toolkit definition: Dzimta/ģimene, kā piederīgie ir dzimta/ģimene. @lv
toolkit definition: Een familie waarvan een familie lid is. @nl
toolkit definition: Egy család, amelynek tagja egy család. @hu
toolkit definition: Eine Familie, zu der eine Familie gehört. @de
toolkit definition: En familie som en familie er medlem av. @no
toolkit definition: Famiglia di cui una famiglia è membro. @it
toolkit definition: Familie, som en familie er medlem af. @da
toolkit definition: Famille dont une famille est membre. @fr
toolkit definition: Família de la qual una família n’és un membre. @ca
toolkit definition: Perekond, milles perekond on liige. @et
toolkit definition: Suku, jonka jäsen suku on.
toolkit definition: عائلة حيث عائلة عضو فيها. @ar
toolkit definition: 有一个家族是其一个成员的一个家族 @zh-hans
toolkit label: Familie als Familienmitglied von @de
toolkit label: ailenin aile üyesi @tr
toolkit label: családtagja a következő családnak: @hu
toolkit label: famiglia membro di famiglia di @it
toolkit label: familie som medlem av familie for @no
toolkit label: familie, som er medlem af familie af @da
toolkit label: familielid van familie van @nl
toolkit label: famille membre d’une famille de @fr
toolkit label: family member of family of @en
toolkit label: família membre d’una família de @ca
toolkit label: ir dzimtas/ģimenes dalībnieks (dzimta/ģimene) @lv
toolkit label: perekonna liige (perekond) perekonnas @et
toolkit label: sukuhaara suvussa
toolkit label: μέλος οικογένειας της οικογένειας του @el
toolkit label: عائلة عضو في عائلة @ar
toolkit label: ……的家族的家族成员 @zh-hans
has subproperty: suvun kantasuku
has subproperty: P50443
lexical alias: familyMemberOfFamilyOf.en
status: Published
type: Property
domain: C10008
label: ailesinin aile üyesidir @tr
label: családtagja a következő családnak: @hu
label: er familie som medlem av familie for @no
label: er familie, som er medlem af familie af @da
label: est une famille membre d’une famille de @fr
label: ir dzimtas/ģimenes dalībnieks (dzimta/ģimene) @lv
label: is familielid van familie van @nl
label: is family member of family of @en
label: ist Familie als Familienmitglied von @de
label: perekonna liige (perekond) perekonnas @et
label: è famiglia membro di famiglia di @it
label: és família membre d’una família de @ca
label: είναι μέλος οικογένειας της οικογένειας του @el
label: هي عائلة عضو في عائلة @ar
label: 是……的家族的家族成员 @zh-hans
sub property of: sukuun liittyvä suku
sub property of: sukujäsen yhteistoimijassa
alternative label: suvun jäsen suvussa
definition: Bir aileyi, ailenin üyesi olduğu bir aileyle ilişkilendirir. @tr
definition: Correla una famiglia a una famiglia di cui una famiglia è un membro. @it
definition: Hozzákapcsol egy családot egy családhoz, amelynek egy család a tagja. @hu
definition: Liittää suvun sukuun, jonka jäsen suku on.
definition: Met une famille en relation avec une famille dont une famille est membre. @fr
definition: Relaciona una família amb una família de la qual una família n’és un membre. @ca
definition: Relateert een familie aan een familie waarvan een familie lid is. @nl
definition: Relaterer en familie til en familie som en familie er medlem av. @no
definition: Relaterer en familie til en familie, som en familie er medlem af. @da
definition: Relates a family to a family of whom a family is a member. @en
definition: Sasaista dzimtu/ģimeni ar dzimtu/ģimeni, kā piederīgie ir dzimta/ģimene. @lv
definition: Seostab perekonna perekonnaga, milles perekond on liige. @et
definition: Setzt eine Familie in Beziehung zu einer Familie, zu der eine Familie gehört. @de
definition: يربط عائلة بعائلة تكون العائلة عضوا فيها. @ar
definition: 将一个家族与有一个家族是其一个成员的一个家族关联起来。 @zh-hans

henkilöjäsen yhteistoimijassa
has element type: 2
toolkit definition: A collective agent of whom a person is a member. @en
toolkit definition: Agent collectif dont une personne est membre. @fr
toolkit definition: Agent col·lectiu del qual una persona n’és un membre. @ca
toolkit definition: Agente collettivo di cui una persona è membro. @it
toolkit definition: Bir kişinin üyesi olduğu kolektif bir temsilci @tr
toolkit definition: Een collectieve actor waarvan een persoon lid is. @nl
toolkit definition: Egy kollektív ágens, amelynek egy személy a tagja. @hu
toolkit definition: Ein gemeinschaftlicher Akteur, dem eine Person angehört. @de
toolkit definition: En kollektiv agent som en person er medlem av. @no
toolkit definition: Grupa, kam pievienojas persona. @lv
toolkit definition: Kollektiiv, milles isik on liige. @et
toolkit definition: Kollektiv agent, som en person er medlem af. @da
toolkit definition: Yhteistoimija, jonka jäsen henkilö on.
toolkit definition: وكيل جماعي لديه شخص عضو. @ar
toolkit definition: 有一个个人是其一个成员的一个集体行为者 @zh-hans
toolkit label: Kolektif temsilcinin üyesi olan kişi @tr
toolkit label: Person als Mitglied eines gemeinschaftlichen Akteurs von @de
toolkit label: henkilöjäsen yhteistoimijassa
toolkit label: ir grupas dalībnieks (persona) @lv
toolkit label: kollektiivi liige (isik) kollektiivis @et
toolkit label: person member of collective agent of @en
toolkit label: person som medlem av kollektiv agent for @no
toolkit label: person, som er medlem af kollektiv agent af @da
toolkit label: persona membre d’un agent col·lectiu de @ca
toolkit label: persona membro di agente collettivo di @it
toolkit label: personne membre d’un agent collectif de @fr
toolkit label: persoonlijk lid van collectieve actor van @nl
toolkit label: személy tagja a következő kollektív ágensnek: @hu
toolkit label: φυσικό πρόσωπο μέλος του συλλογικού φορέα του @el
toolkit label: شخص عضو في وكيل جماعي @ar
toolkit label: ……的集体行为者的个人成员 @zh-hans
has subproperty: henkilöjäsen yhteisössä
has subproperty: henkilöjäsen suvussa
has subproperty: P50444
lexical alias: personMemberOfCollectiveAgentOf.en
status: Published
type: Property
domain: C10004
label: er person som medlem av kollektiv agent for @no
label: er person, som er medlem af kollektiv agent af @da
label: est une personne membre d’un agent collectif de @fr
label: ir grupas dalībnieks (persona) @lv
label: is person member of collective agent of @en
label: is persoonlijk lid van collectieve actor van @nl
label: ist Person als Mitglied eines gemeinschaftlichen Akteurs von @de
label: kolektif temsilcisinin kişi üyesidir @tr
label: kollektiivi liige (isik) kollektiivis @et
label: személy tagja a következő kollektív ágensnek: @hu
label: è persona membro di agente collettivo di @it
label: és persona membre d’un agent col·lectiu de @ca
label: είναι φυσικό πρόσωπο μέλος του συλλογικού φορέα του @el
label: هو شخص عضو في وكيل جماعي @ar
label: 是……的集体行为者的个人成员 @zh-hans
sub property of: henkilöön liittyvä yhteistoimija
definition: Bir kişiyi, kişinin üyesi olduğu kolektif bir temsilciyle ilişkilendirir. @tr
definition: Correla una persona a un agente collettivo di cui una persona è un membro. @it
definition: Hozzákapcsol egy személyt egy kollektív ágenshez, amelynek egy személy a tagja. @hu
definition: Liittää henkilön yhteistoimijaan, jonka jäsen henkilö on.
definition: Met une personne en relation avec un agent collectif dont une personne est membre. @fr
definition: Relaciona una persona amb un agent col·lectiu del qual una persona n’és un membre. @ca
definition: Relateert een persoon aan een collectieve actor waarvan een persoon lid is. @nl
definition: Relaterer en person til en kollektiv agent som en person er medlem av. @no
definition: Relaterer en person til en kollektiv agent, som en person er medlem af. @da
definition: Relates a person to a collective agent of whom a person is a member. @en
definition: Sasaista personu ar grupu, kam pievienojas persona. @lv
definition: Seostab isiku kollektiiviga, milles isik on liige. @et
definition: Setzt eine Person in Beziehung zu einem gemeinschaftlichen Akteur, dem eine Person angehört. @de
definition: يربط شخصا بوكيل جماعي لديه شخص عضو. @ar
definition: 将一个个人与有一个个人是其一个成员的一个集体行为者关联起来。 @zh-hans

yhteistoimijan henkilöjäsen
has element type: 2
toolkit definition: A person who is a member of a collective agent. @en
toolkit definition: Een persoon die een lid is van een collectieve actor. @nl
toolkit definition: Egy személy, aki egy kollektív ágens a tagja. @hu
toolkit definition: Eine Person, die Mitglied eines gemeinschaftlichen Akteurs ist. @de
toolkit definition: En person som er et medlem av en kollektiv agent. @no
toolkit definition: Henkilö, joka on yhteistoimijan jäsen.
toolkit definition: Isik, kes on kollektiivi liige. @et
toolkit definition: Kolektif temsilcinin üyesi olan bir kişi @tr
toolkit definition: Person, som er et medlem af en kollektiv agent. @da
toolkit definition: Persona che è membro di un agente collettivo. @it
toolkit definition: Persona que és un membre d’un agent col·lectiu. @ca
toolkit definition: Persona, kura pievienojas grupai. @lv
toolkit definition: Personne qui est membre d’un agent collectif. @fr
toolkit definition: شخص عضو في وكيل جماعي. @ar
toolkit definition: 是一个集体行为者一个成员的一个个人 @zh-hans
toolkit label: Kolektif temsilcinin üyesi olan kişi @tr
toolkit label: Mitglied eines gemeinschaftlichen Akteurs (Person) @de
toolkit label: grupas dalībnieks (persona) @lv
toolkit label: kollektiivi liige (isik) @et
toolkit label: kollektív ágens személy tagja: @hu
toolkit label: person medlem av kollektiv agent @no
toolkit label: person member of collective agent @en
toolkit label: person, som er medlem af kollektiv agent @da
toolkit label: persona membre d’un agent col·lectiu @ca
toolkit label: persona membro di agente collettivo @it
toolkit label: personne membre d’un agent collectif @fr
toolkit label: persoonlijk lid van collectieve actor @nl
toolkit label: yhteistoimijan henkilöjäsen
toolkit label: φυσικό πρόσωπο μέλος του συλλογικού φορέα @el
toolkit label: شخص عضو في وكيل جماعي @ar
toolkit label: 集体行为者的个人成员 @zh-hans
has subproperty: yhteisön henkilöjäsen
has subproperty: suvun henkilöjäsen
has subproperty: P50445
lexical alias: personMemberOfCollectiveAgent.en
status: Published
type: Property
domain: C10011
label: a pour personne membre d’un agent collectif @fr
label: grupas dalībnieks (persona) @lv
label: ha persona membro di agente collettivo @it
label: har person medlem av kollektiv agent @no
label: har person, som er medlem af kollektiv agent @da
label: has person member of collective agent @en
label: hat Mitglied eines gemeinschaftlichen Akteurs (Person) @de
label: heeft persoonlijk lid van collectieve actor @nl
label: kolektif temsilcinin kişi üyesi ile ilişkilidir @tr
label: kollektiivi liige (isik) @et
label: kollektív ágens személy tagja a következő: @hu
label: té com a persona membre d’un agent col·lectiu @ca
label: έχει φυσικό πρόσωπο μέλος του συλλογικού φορέα @el
label: له شخص عضو في وكيل جماعي @ar
label: 有集体行为者的个人成员 @zh-hans
sub property of: yhteistoimijaan liittyvä henkilö
definition: Correla un agente collettivo a una persona che è un membro di un agente collettivo. @it
definition: Hozzákapcsol egy kollektív ágenst egy személyhez, amely egy kollektív ágens a tagja. @hu
definition: Kolektif bir temsilciyi, kolektif temsilcinin üyesi olan bir kişiyle ilişkilendirir. @tr
definition: Liittää yhteistoimijan henkilöön, joka on yhteistoimijan jäsen.
definition: Met un agent collectif en relation avec une personne qui est membre d’un agent collectif. @fr
definition: Relaciona un agent col·lectiu amb una persona que és un membre d’un agent col·lectiu. @ca
definition: Relateert een collectieve actor aan een persoon die een lid is van een collectieve actor. @nl
definition: Relaterer en kollektiv agent til en person, som er et medlem af en kollektiv agent. @da
definition: Relaterer en person til en person som er et medlem av en kollektiv agent. @no
definition: Relates a collective agent to a person who is a member of a collective agent. @en
definition: Sasaista grupu ar personu, kura pievienojas grupai. @lv
definition: Seostab kollektiivi isikuga, kes on kollektiivi liige. @et
definition: Setzt einen gemeinschaftlichen Akteur in Beziehung zu einer Person, die Mitglied eines gemeinschaftlichen Akteurs ist. @de
definition: يربط وكيلا جماعيا بشخص هو عضو في وكيل جماعي. @ar
definition: 将一个集体行为者与是一个集体行为者一个成员的一个个人关联起来。 @zh-hans

muokkaaja (toimija) kappaleessa
has element type: 2
toolkit definition: An item that is changed by an agent without creating a new manifestation. @en
toolkit definition: Een item dat gewijzigd is door een actor zonder een nieuwe manifestatie te creëren. @nl
toolkit definition: Egy példány, amelyet egy ágens új megjelenési forma létrehozása nélkül változtat meg. @hu
toolkit definition: Ein Exemplar, das von einem Akteur verändert wird, ohne eine neue Manifestation zu erstellen. @de
toolkit definition: Eksemplar, mida tegija on muutnud, loomata uut kehastust. @et
toolkit definition: Eksemplar, som ændres af en agent uden at skabe en ny manifestation. @da
toolkit definition: Et eksemplar som blir endret av en agent uten at det skapes en ny manifestasjon. @no
toolkit definition: Item auquel un agent apporte des modifications sans créer une nouvelle manifestation. @fr
toolkit definition: Item modificato da un agente senza creare una nuova manifestazione. @it
toolkit definition: Kappale, johon toimija tekee muutoksia luomatta uutta manifestaatiota.
toolkit definition: Vienība, ko aģents mainījis, neradot jaunu manifestāciju. @lv
toolkit definition: Yeni bir gösterim oluşturmadan bir temsilci tarafından değiştirilen bir kopya. @tr
toolkit definition: Ítem que és canviat per un agent sense crear una nova manifestació. @ca
toolkit definition: مفردة قام وكيل بتغييرها دون إنشاء تجسيدة جديدة. @ar
toolkit definition: 被一个行为者修改而不创建一个新载体表现的一个单件 @zh-hans
toolkit label: Akteur als Bearbeiterin/Bearbeiter eines Exemplars von @de
toolkit label: Dönüştürücü temsilcisi @tr
toolkit label: aanpasser-actor van @nl
toolkit label: agent modificador de @ca
toolkit label: agent modificateur de @fr
toolkit label: agent, som er tilpasser af @da
toolkit label: ir modificētājs (aģents) @lv
toolkit label: modificatore agente di @it
toolkit label: modifier agent of @en
toolkit label: muokkaaja (toimija) kappaleessa
toolkit label: muutja (tegija) eksemplaris @et
toolkit label: módosító ágense: @hu
toolkit label: tilpasser av (agent) @no
toolkit label: τροποποιητής φορέας του @el
toolkit label: وكيل مسئول عن التعديل @ar
toolkit label: ……的修改者行为者 @zh-hans
has subproperty: muokkaaja (henkilö) kappaleessa
has subproperty: muokkaaja (yhteistoimija) kappaleessa
has subproperty: P50446
lexical alias: modifierAgentOf.en
status: Published
type: Property
domain: C10002
label: düzenleyici temsilcisidir @tr
label: er agent, som er tilpasser af @da
label: er tilpasser av (agent) @no
label: est un agent modificateur de @fr
label: ir modificētājs (aģents) @lv
label: is aanpasser-actor van @nl
label: is modifier agent of @en
label: ist Akteur als Bearbeiterin/Bearbeiter eines Exemplars von @de
label: muutja (tegija) eksemplaris @et
label: módosító ágense a következőnek: @hu
label: è modificatore agente di @it
label: és agent modificador de @ca
label: είναι τροποποιητής φορέας του @el
label: هو وكيل مُعدّل لـ @ar
label: 是……的修改者行为者 @zh-hans
sub property of: toimijaan liittyvä kappale
alternative label: Bearbeiter eines Exemplars von @de
alternative label: Dönüştürücü @tr
alternative label: modificador de @ca
alternative label: modificateur de @fr
alternative label: modificatore di @it
alternative label: modifier of @en
alternative label: muokkaajana kappaleessa
alternative label: muutja eksemplaris @et
alternative label: módosítója: @hu
alternative label: tilpasser af @da
alternative label: tilpasser av @no
alternative label: τροποποιητής του @el
alternative label: مُعّدل @ar
alternative label: ……的修改者 @zh-hans
definition: Bir temsilciyi, yeni bir gösterim oluşturmadan bir temsilci tarafından değiştirilen bir kopyayla ilişkilendirir. @tr
definition: Correla un agente a un item modificato da un agente senza creare una nuova manifestazione. @it
definition: Hozzákapcsol egy ágenst egy példányhoz, amelyet egy ágens új megjelenési forma létrehozása nélkül változtat meg. @hu
definition: Liittää toimijan kappaleeseen, johon toimija tekee muutoksia luomatta uutta manifestaatiota.
definition: Met un agent en relation avec un item auquel un agent apporte des modifications sans créer une nouvelle manifestation. @fr
definition: Relaciona un agent amb un ítem que és canviat per un agent sense crear una nova manifestació. @ca
definition: Relateert een actor aan een item dat gewijzigd is door een actor zonder een nieuwe manifestatie te creëren. @nl
definition: Relaterer en agent til et eksemplar som blir endret av en agent uten at det skapes en ny manifestasjon. @no
definition: Relaterer en agent til et eksemplar, som ændres af en agent uden at skabe en ny manifestation. @da
definition: Relates an agent to an item that is changed by an agent without creating a new manifestation. @en

tarkastaja (toimija) ekspressiossa
has element type: 2
toolkit definition: An expression that includes a contribution by an agent of making changes to the content of another expression. @en
toolkit definition: Başka bir ifadenin içeriğinde değişiklik yapan bir temsilcinin katkısını içeren bir anlatım. @tr
toolkit definition: Een expressie die omvat een bijdrage door een actor door wijzigingen te maken in de content van een andere expressie. @nl
toolkit definition: Egy kifejezési forma, amely magában foglalja egy ágens közreműködését egy másik kifejezési forma tartalmának megváltoztatásában. @hu
toolkit definition: Eine Expression, zu der ein Akteur beiträgt, indem er am Inhalt einer anderen Expression Veränderungen vornimmt. @de
toolkit definition: Ekspressio, jonka tekemiseen toimija osallistuu tekemällä muutoksia toisen ekspression sisältöön.
toolkit definition: Espressione che comprende un contributo di un agente nell'apportare cambiamenti al contenuto di un'altra espressione. @it
toolkit definition: Et uttrykk som inkluderer et bidrag fra en agent ved å gjøre endringer i innholdet av et annet uttrykk. @no
toolkit definition: Expression qui intègre une contribution de la part d’un agent consistant à apporter des modifications au contenu d’une autre expression. @fr
toolkit definition: Expressió que inclou una contribució d’un agent fent canvis en el contingut d’una altra expressió. @ca
toolkit definition: Izteiksme, kas ietver aģenta ieguldījumu, veicot izmaiņas citas izteiksmes saturā. @lv
toolkit definition: Udtryk, som omfatter en agents bidrag ved at foretage ændringer i indholdet af et andet udtryk. @da
toolkit definition: Väljendus, millesse tegija on andnud panuse, tehes muudatusi teise väljenduse sisusse. @et
toolkit definition: تعبيرة تتضمن إسهام وكيل في إجراء تغييرات محتوى تعبيرة أخرى. @ar
toolkit definition: 包括对另一种内容表达的内容作改动的一个行为者的贡献的一种内容表达 @zh-hans
toolkit label: Akteur als Überarbeiterin/Überarbeiter von @de
toolkit label: agent revisor de @ca
toolkit label: agent réviseur de @fr
toolkit label: agent, som er omarbejder af @da
toolkit label: gözden geçiren temsilci @tr
toolkit label: herziener-actor van @nl
toolkit label: ir korektors (aģents) @lv
toolkit label: omarbeider av (agent) @no
toolkit label: redigeerija (tegija) väljenduses @et
toolkit label: reviser agent of @en
toolkit label: revisore agente di @it
toolkit label: tarkastaja (toimija) ekspressiossa
toolkit label: átdolgozó ágense: @hu
toolkit label: αναθεωρητής φορέας του @el
toolkit label: وكيل مُراجع @ar
toolkit label: ……的修订者行为者 @zh-hans
has subproperty: sovittaja (toimija) ekspressiossa
has subproperty: transkriboija (toimija) ekspressiossa
has subproperty: lyhentäjä (toimija) ekspressiossa
has subproperty: sensori (toimija) ekspressiossa
has subproperty: ekspression entisöijä (toimija) ekspressiossa
has subproperty: tarkastaja (henkilö) ekspressiossa
has subproperty: tarkastaja (yhteistoimija) ekspressiossa
has subproperty: P50447
lexical alias: reviserAgentOf.en
status: Published
type: Property
domain: C10002
label: Gözden geçiren temsilci @tr
label: er agent, som er omarbejder af @da
label: er omarbeider av (agent) @no
label: est un agent réviseur de @fr
label: ir korektors (aģents) @lv
label: is herziener-actor van @nl
label: is reviser agent of @en
label: ist Akteur als Überarbeiterin/Überarbeiter von @de
label: redigeerija (tegija) väljenduses @et
label: átdolgozó ágense a következőnek: @hu
label: è revisore agente di @it
label: és agent revisor de @ca
label: είναι αναθεωρητής φορέας του @el
label: هو وكيل مراجع لـ @ar
label: 是……的修订者行为者 @zh-hans
sub property of: ekspression tekijä (toimija) ekspressiossa
alternative label: gözden geçiren @tr
alternative label: omarbeider av @no
alternative label: redigeerija väljenduses @et
alternative label: reviderer af @da
alternative label: reviser of @en
alternative label: revisor de @ca
alternative label: revisore di @it
alternative label: réviseur de @fr
alternative label: tarkastajana ekspressiossa
alternative label: Überarbeiter von @de
alternative label: átdolgozója: @hu
alternative label: αναθεωρητής του @el
alternative label: مراجع @ar
alternative label: ……的修订者 @zh-hans
definition: Bir temsilciyi, başka bir anlatımının içeriğinde değişiklik yapan bir temsilcinin katkısını içeren bir anlatımla ilişkilendirir. @tr
definition: Correla un agente a un'espressione che comprende un contributo di un agente nell'apportare cambiamenti al contenuto di un'altra espressione. @it
definition: Hozzákapcsol egy ágenst egy kifejezési formához, amely magában foglalja egy ágens közreműködését egy másik kifejezési forma tartalmának megváltoztatásában. @hu
definition: Liittää toimijan ekspressioon, jonka tekemiseen toimija osallistuu tekemällä muutoksia toisen ekspression sisältöön.
definition: Met un agent en relation avec une expression qui intègre une contribution de la part d’un agent consistant à apporter des modifications au contenu d’une autre expression. @fr

yhdistymään osallinen toimija ekspressiossa
has element type: 2
toolkit definition: An expression that includes a contribution by an agent to a seamless mix of kinds of content. @en
toolkit definition: Een expressie die omvat een bijdrage door een actor aan een naadloze mix van soorten content. @nl
toolkit definition: Egy kifejezési forma, amely magában foglalja egy ágens közreműködését a tartalom fajtáinak szabad keverésében. @hu
toolkit definition: Eine Expression, bei der ein Akteur zu einer nahtlosen Mischung von Inhalten beiträgt. @de
toolkit definition: Ekspressio, jossa toimija osallistuu sellaisen ekspression tekemiseen, joka on saumaton yhdistelmä erilaisia sisältöjä.
toolkit definition: Espressione che comprende un contributo di un agente a una varietà di tipi di contenuto senza soluzione di continuità. @it
toolkit definition: Et uttrykk som inkluderer et bidrag fra en agent til en sømløs blanding av forskjellig innhold. @no
toolkit definition: Expression qui intègre une contribution de la part d’un agent à un mélange intégré de différents genres de contenu. @fr
toolkit definition: Expressió que inclou una contribució d’un agent a una mescla sense continuïtat de classes de contingut. @ca
toolkit definition: Farklı türde içeriklerin kusursuz karışımını sağlayan bir temsilcinin katkısını içeren bir anlatım.​ @tr
toolkit definition: Izteiksme, kas ietver aģenta ieguldījumu dažādu satura veidu vienlaidu sajaukumā. @lv
toolkit definition: Udtryk, som omfatter en agents bidrag til en glat kombinering af forskellige slags af indhold. @da
toolkit definition: Väljendus, millesse tegija on andnud panuse, osaledes eri liiki sisu lahutamatu segu loomisel. @et
toolkit definition: تعبيرة تتضمن إسهام وكيل في مزج سلس لأنواع من المحتوى. @ar
toolkit definition: 包括将各种内容无缝融合的一个行为者的贡献的一种内容表达 @zh-hans
toolkit label: Akteur als Beiträgerin/Beiträger zu einer Verschmelzung von @de
toolkit label: agent contributeur à un amalgame de @fr
toolkit label: agent contribuïdor a una amalgama de @ca
toolkit label: agent, som er bidragsyder til sammensmeltning af @da
toolkit label: bidragsyter til sammenslutning for (agent) @no
toolkit label: bijdrager-actor aan amalgamering van @nl
toolkit label: birleşmeye katkıda bulunan temsilci @tr
toolkit label: contributor agent to amalgamation of @en
toolkit label: contributore agente di fusione di @it
toolkit label: ir amalgamāta līdzradītājs (aģents) @lv
toolkit label: közreműködő ágense a következő vegyes tartalomnak: @hu
toolkit label: sulami kaastööline (tegija) väljenduses @et
toolkit label: yhdistymään osallinen toimija ekspressiossa
toolkit label: συντελεστής φορέας σε μείξη του (?) @el
toolkit label: وكيل مساهم في مزج @ar
toolkit label: ……的融合体的贡献者行为者 @zh-hans
has subproperty: piirtäjä (toimija) ekspressiossa
has subproperty: tuomioistuimen kirjuri (toimija) ekspressiossa
has subproperty: pöytäkirjan laatija (toimija) ekspressiossa
has subproperty: tekstaaja (toimija) ekspressiossa
has subproperty: ohjelmistokehittäjä (toimija) ekspressiossa
has subproperty: värittäjä (toimija) ekspressiossa
has subproperty: esitykseen osallinen toimija ekspressiossa
has subproperty: toimittaja (toimija) ekspressiossa
has subproperty: yhdistymään osallinen henkilö ekspressiossa
has subproperty: yhdistymään osallinen yhteistoimija ekspressiossa
has subproperty: P50448
lexical alias: contributorAgentToAmalgamationOf.en
status: Published
type: Property
domain: C10002
label: Akteur als Beiträgerin/Beiträger zu einer Verschmelzung von @de
label: birleşimine katkıda bulunan temsilcidir @tr
label: er agent, som er bidragsyder til sammensmeltning af @da
label: er bidragsyter til sammenslutning for (agent) @no
label: est un agent contributeur à un amalgame de @fr
label: ir amalgamāta līdzradītājs (aģents) @lv
label: is bijdrager-actor aan amalgamering van @nl
label: is contributor agent to amalgamation of @en
label: közreműködő ágense a következő vegyes tartalomnak: @hu
label: sulami kaastööline (tegija) väljenduses @et
label: è contributore agente di fusione di @it
label: és agent contribuïdor a una amalgama de @ca
label: είναι συντελεστής φορέας σε μείξη του (?) @el
label: هو وكيل مساهم في دمج لـ @ar
label: 是……的融合体的贡献者行为者 @zh-hans
sub property of: ekspression tekijä (toimija) ekspressiossa
definition: Bir temsilciyi, bir temsilcinin içerik türlerinin kesintisiz bir birleşimine yaptığı katkıyı içeren bir anlatımla ilişkilendirir. @tr
definition: Correla un agente a un'espressione che comprende un contributo di un agente a una varietà di tipi di contenuto senza soluzione di continuità. @it
definition: Hozzákapcsol egy ágenst egy kifejezési formához, amely magában foglalja egy ágens közreműködését a tartalom fajtáinak szabad keverésében. @hu
definition: Liittää toimijan ekspressioon, jossa toimija osallistuu sellaisen ekspression tekemiseen, joka on saumaton yhdistelmä erilaisia sisältöjä.
definition: Met un agent en relation avec une expression qui intègre une contribution de la part d’un agent à un mélange intégré de différents genres de contenu. @fr
definition: Relaciona un agent amb una expressió que inclou una contribució d’un agent a una mescla sense continuïtat de classes de contingut. @ca
definition: Relateert een actor aan een expressie die omvat een bijdrage door een actor aan een naadloze mix van soorten content. @nl
definition: Relaterer en agent til et udtryk, som omfatter en agents bidrag til en glat kombinering af forskellige slags af indhold. @da
definition: Relaterer en agent til et uttrykk som inkluderer et bidrag fra en agent til en sømløs blanding av forskjellig innhold. @no
definition: Relates an agent to an expression that includes a contribution by an agent to a seamless mix of kinds of content. @en
definition: Sasaista aģentu ar izteiksmi, kas ietver aģenta ieguldījumu dažādu satura veidu vienlaidu sajaukumā. @lv
definition: Seostab tegija väljendusega, millesse tegija on andnud panuse, osaledes eri liiki sisu lahutamatu segu loomisel. @et
definition: Setzt einen Akteur in Beziehung zu einer Expression, bei der ein Akteur zu einer nahtlosen Mischung von Inhalten beiträgt. @de
definition: يربط وكيلا بتعبيرة تتضمن إسهام وكيل في مزج سلس لأنواع من المحتوى. @ar
definition: 将一个行为者与包括将各种内容无缝融合的一个行为者的贡献的一种内容表达关联起来。 @zh-hans

esitykseen osallinen toimija ekspressiossa
has element type: 2
toolkit definition: An expression that includes a contribution by an agent to a performance. @en
toolkit definition: Bir temsilcinin bir performansa katkısını içeren bir anlatım. @tr
toolkit definition: Een expressie die omvat een bijdrage door een actor aan een uitvoering. @nl
toolkit definition: Egy kifejezési forma, amely magában foglalja egy ágens közreműködését egy előadásban. @hu
toolkit definition: Eine Expression, bei der ein Akteur zu eine Darbietung beiträgt. @de
toolkit definition: Ekspressio, jossa toimija osallistuu sellaisen ekspression tekemiseen, joka on esitys.
toolkit definition: Espressione che comprende un contributo di un agente a un'esibizione. @it
toolkit definition: Et uttrykk som inkluderer et bidrag fra en agent til en framføring. @no
toolkit definition: Expression qui intègre une contribution de la part d’un agent à une prestation. @fr
toolkit definition: Expressió que inclou una contribució d’un agent a una interpretació. @ca
toolkit definition: Izteiksme, kas ietver aģenta ieguldījumu uzvedumā. @lv
toolkit definition: Udtryk, som omfatter en agents bidrag til en optræden @da
toolkit definition: Väljendus, millesse tegija on andnud panuse, osaledes esituse loomisel. @et
toolkit definition: تعبيرة تتضمن إسهام وكيل في أداء. @ar
toolkit definition: 包括一个行为者对一个表演之贡献的一种内容表达 @zh-hans
toolkit label: Akteur als Beiträgerin/Beiträger zu einer Darbietung von @de
toolkit label: agent contributeur à une prestation de @fr
toolkit label: agent contribuïdor a una interpretació de @ca
toolkit label: agent, som er bidragsyder til optræden af @da
toolkit label: bidragsyter til framføring av (agent) @no
toolkit label: bijdrager-actor aan uitvoering van @nl
toolkit label: contributor agent to performance of @en
toolkit label: contributore agente di performance di @it
toolkit label: esituse kaastööline (tegija) väljenduses @et
toolkit label: esitykseen osallinen toimija ekspressiossa
toolkit label: ir uzveduma līdzradītājs (aģents) @lv
toolkit label: közreműködő ágense a következő előadásnak: @hu
toolkit label: performansa katkıda bulunan temsilci @tr
toolkit label: συντελεστής φορέας σε εκτέλεση του @el
toolkit label: وكيل مساهم في أداء @ar
toolkit label: ……的表演的贡献者行为者 @zh-hans
has subproperty: animaattori (toimija) ekspressiossa
has subproperty: näyttämöohjaaja (toimija) ekspressiossa
has subproperty: ekspression haastattelija (toimija) ekspressiossa
has subproperty: musiikillinen johtaja (toimija) ekspressiossa
has subproperty: puvustaja (toimija) ekspressiossa
has subproperty: lavastaja (toimija) ekspressiossa
has subproperty: esittäjä (toimija) ekspressiossa
has subproperty: ekspression haastateltava (toimija) ekspressiossa
has subproperty: taltioija (toimija) ekspressiossa
has subproperty: leikkaaja (toimija) ekspressiossa
has subproperty: lavastussuunnittelija (toimija) ekspressiossa
has subproperty: visuaalisten tehosteiden tekijä (toimija) ekspressiossa
has subproperty: erikoistehosteiden tekijä (toimija) ekspressiossa
has subproperty: äänisuunnittelija (toimija) ekspressiossa
has subproperty: valosuunnittelija (toimija) ekspressiossa
has subproperty: liikkuvaan kuvaan osallistuja (toimija) ekspressiossa
has subproperty: maskeeraaja (toimija) ekspresiossa
has subproperty: ääniteknikko (toimija) ekspressiossa
has subproperty: DJ (toimija) ekspressiossa
has subproperty: dubbausohjaaja (toimija) ekspressiossa
has subproperty: musiikkiohjelmoija (toimija) ekspressiossa
has subproperty: esitykseen osallinen henkilö ekspressiossa
has subproperty: esitykseen osallinen yhteistoimija ekspressiossa
has subproperty: P50449
lexical alias: contributorAgentToPerformanceOf.en
status: Published
type: Property
domain: C10002
label: er agent, som er bidragsyder til optræden af @da
label: er bidragsyter til framføring av (agent) @no
label: esituse kaastööline (tegija) väljenduses @et
label: est un agent contributeur à une prestation de @fr
label: ir uzveduma līdzradītājs (aģents) @lv
label: is bijdrager-actor aan uitvoering van @nl
label: is contributor agent to performance of @en
label: ist Akteur als Beiträgerin/Beiträger zu einer Darbietung von @de
label: közreműködő ágense a következő előadásnak: @hu
label: peformansına katkıda bulunan temsilcidir @tr
label: è contributore agente di esibizione di @it
label: és agent contribuïdor a una interpretació de @ca
label: είναι συντελεστής φορέας σε εκτέλεση του @el
label: هو وكيل مساهم في أداء لـ @ar
label: 是……的表演的贡献者行为者 @zh-hans
sub property of: yhdistymään osallinen toimija ekspressiossa
definition: Bir temsilciyi, bir temcilcinin bir performansa katkısını içeren bir anlatımla ilişkilendirir. @tr
definition: Correla un agente a un'espressione che comprende un contributo di un agente a un'esibizione. @it
definition: Hozzákapcsol egy ágenst egy kifejezési formához, amely magában foglalja egy ágens közreműködését egy előadásban. @hu

toimittaja (toimija) ekspressiossa
has element type: 2
toolkit definition: An expression that includes a contribution by an agent of amending content created by other agents in order to meet standards for publication or other use. @en
toolkit definition: Een expressie die omvat een bijdrage door een actor door het aanpassen van content gecreëerd door andere actoren met de bedoeling te voldoen aan standaarden voor publicatie of ander gebruik. @nl
toolkit definition: Egy kifejezési forma, amely magában foglalja egy ágens más ágensek által létrehozott tartalmat módosító közreműködését, hogy az megfeleljen a publikáció és az egyéb felhasználás szabályainak. @hu
toolkit definition: Eine Expression, zu der ein Akteur beiträgt, indem er von anderen Akteuren erstellte Inhalte so verändert, dass sie den Standards für die Veröffentlichung oder einer anderweitigen Verwendung entsprechen. @de
toolkit definition: Ekspressio, jonka tekemiseen toimija osallistuu tarkistamalla muiden toimijoiden luomaa sisältöä julkaisu- tai muiden käyttöstandardien saavuttamiseksi.
toolkit definition: Espressione che comprende un contributo di un agente nella correzione di testo creato da altri agenti per soddisfare standard di pubblicazione come uniformità, chiarezza e stile. @it
toolkit definition: Et uttrykk som inkluderer et bidrag fra en agent ved å gjøre endringer i tekst skrevet av andre agenter for å imøtekomme utgivelsesstandarder for sammenheng, tydelighet og stil. @no
toolkit definition: Expression qui intègre une contribution de la part d’un agent consistant à modifier du contenu créé par d’autres agents afin de répondre à des normes pour la publication ou une autre utilisation. @fr
toolkit definition: Expressió que inclou una contribució d’un agent esmenant contingut creat per altres agents per tal de complir els estàndards de publicació o un altre ús. @ca
toolkit definition: Izteiksme, kas ietver aģenta ieguldījumu, pielāgojot citu aģentu radīto saturu, lai tas atbilstu publicēšanas vai citādas izmantošanas standartiem. @lv
toolkit definition: Udtryk, som omfatter en agents bidrag ved at ændre tekst skabt af andre agenter, for at opfylde publikationsstandarder eller for andet brug. @da
toolkit definition: Väljendus, millesse tegija on andnud panuse, parandades teiste tegijate loodud teksti, et see vastaks loogilisuse, selguse ja stiili poolest avaldamisnõuetele. @et
toolkit definition: Yayınlama veya diğer kullanım standartlarını karşılamak için diğer temsilciler tarafından oluşturulan içeriği düzelten bir temsilcinin katkısını içeren bir anlatım. @tr
toolkit definition: تعبيرة تتضمن إسهام وكيل في تعديل نص من تأليف وكلاء آخرين من أجل استيفاء معايير النشر مثل الاتساق والوضوح والأسلوب. @ar
toolkit definition: 包括修正其他行为者创作的内容以满足出版标准或其他用途的一个行为者的贡献的一种内容表达 @zh-hans
toolkit label: Akteur als Herausgeberin/Herausgeber von @de
toolkit label: agent editor de text de @ca
toolkit label: agent éditeur intellectuel de @fr
toolkit label: agent, som er redaktør af @da
toolkit label: curatore agente di testo di @it
toolkit label: editor agent of @en
toolkit label: editör temsilci @tr
toolkit label: ir redaktors (aģents) @lv
toolkit label: redacteur-actor van tekst van @nl
toolkit label: redaktør av tekst for (agent) @no
toolkit label: szerkesztő ágense: @hu
toolkit label: tekstitoimetaja (tegija) väljenduses @et
toolkit label: toimittaja (toimija) ekspressiossa
toolkit label: επιμελητής φορέας του κειμένου του @el
toolkit label: وكيل محرر نص @ar
toolkit label: ……的编者行为者 @zh-hans
has subproperty: toimittaja (henkilö) ekspressiossa
has subproperty: toimittaja (yhteistoimija) ekspressiossa
has subproperty: P50450
lexical alias: editorAgentOf.en
status: Published
type: Property
domain: C10002
label: editör temsilcisidir @tr
label: er agent, som er redaktør af @da
label: er redaktør av tekst for (agent) @no
label: est un agent éditeur intellectuel de @fr
label: ir redaktors (aģents) @lv
label: is editor agent of @en
label: is redacteur-actor van @nl
label: ist Akteur als Herausgeberin/Herausgeber von @de
label: szerkesztő ágense a következőnek: @hu
label: tekstitoimetaja (tegija) väljenduses @et
label: è curatore agente di testo di @it
label: és agent editor de text de @ca
label: είναι επιμελητής φορέας του κειμένου του @el
label: هو وكيل محرر نص لـ @ar
label: 是……的编者行为者 @zh-hans
sub property of: yhdistymään osallinen toimija ekspressiossa
alternative label: A tartalom mozgásírás, zenei lejegyzés, tapintható mozgásírás, tapintható zenei lejegyzés, tapintható szöveg és szöveg lehet. @hu
alternative label: Akteur als Herausgeberin/Herausgeber eines Texts von @de
alternative label: agent éditeur intellectuel de texte de @fr
alternative label: agente editor de texto de @es
alternative label: curatore di @it
alternative label: editor agent of text of @en
alternative label: editor de @es
alternative label: editor of @en
alternative label: editör @tr
alternative label: er agent, som er redaktør af tekst af @da
alternative label: keeletoimetaja väljenduses @et
alternative label: metnin editör temsilcisi @tr
alternative label: redaktør av @no
alternative label: szerkesztője: @hu
alternative label: toimetaja väljenduses @et
alternative label: éditeur intellectuel de @fr
alternative label: επιμελητής του @el
alternative label: وكيل محرر لنص @ar
alternative label: ……的文本的编者行为者 @zh-hans
alternative label: ……的编者 @zh-hans
definition: Bir temsilciyi, yayın veya diğer kullanım standartlarını karşılamak için diğer temsilciler tarafından oluşturulan içeriği değiştiren bir temsilcinin katkısını içeren bir anlatımla lişkilendirir. @tr
definition: Correla un agente con un'espressione che comprende un contributo di un agente nella correzione di testo creato da altri agenti per raggiungere standard di pubblicazione come uniformità, chiarezza e stile. @it
definition: Hozzákapcsol egy ágenst egy kifejezési formához, amely magában foglalja egy ágens más ágensek által létrehozott tartalmat módosító közreműködését, hogy az megfeleljen a publikáció és az egyéb felhasználás szabályainak. @hu
definition: Liittää toimijan ekspressioon, jonka tekemiseen toimija osallistuu tarkistamalla muiden toimijoiden luomaa sisältöä julkaisu- tai muiden käyttöstandardien saavuttamiseksi.

is contributor to aggregated content of (Deprecated)
has element type: 2
has subproperty: sävellys (ekspressio)
has subproperty: maanmittaus
has subproperty: kartantekijänä kartassa (ekspressio)
has subproperty: koreografina koreografiassa (ekspressio)
has subproperty: toimittajana aineistossa
has subproperty: kuvittajana kuvituksessa
has subproperty: valokuva (ekspressio)
has subproperty: P50451
lexical alias: contributorToAggregatedContentOf.en
status: Deprecated
type: Property

is author of expression of (Deprecated)
has element type: 2
has subproperty: oheisteksti
has subproperty: P50452
lexical alias: authorOfExpressionOf.en
status: Deprecated
type: Property

aggregaattori (toimija) teoksessa
has element type: 2
toolkit definition: A work that involves a responsibility of an agent for aggregation by selecting and arranging expressions of other works. @en
toolkit definition: Darbs, kas ietver aģenta atbildību par apkopošanu, atlasot un sakārtojot citu darbu izteiksmes. @lv
toolkit definition: Diğer eserlerin anlatımlarını seçip düzenleyerek bir araya getirmek için bir temsilcinin sorumluluğunu içeren bir çalışma. @tr
toolkit definition: Een werk dat met zich meebrengt een verantwoordelijkheid van een actor voor aggregeren door middel van selectie en arrangeren van expressies van andere werken. @nl
toolkit definition: Egy mű, amelyhez hozzátartozik egy ágens felelőssége más művek kifejezési formáinak kiválasztásával és elrendezésével járó aggregálásáért. @hu
toolkit definition: Ein Werk, bei dem ein Akteur für die Aggregation verantwortlich ist, indem er Expressionen von anderen Werken auswählt und zusammenstellt. @de
toolkit definition: Et verk som involverer ansvar fra en agent for aggregering ved å velge ut og arrangere uttrykk av andre verk. @no
toolkit definition: Obra que implica una responsabilitat d’un agent en l’agregació mitjançant la selecció i l’arranjament d’expressions d’altres obres. @ca
toolkit definition: Opera che implica una responsabilità di un agente nell'aggregazione tramite selezione e sistemazione di espressioni di altre opere. @it
toolkit definition: Teos, jossa toimija on vastuussa aggregoivan teoksen luomisesta valitsemalla ja järjestämällä muiden teosten ekspressioita.
toolkit definition: Teos, mis sisaldab tegija vastutust liitumi loomise eest, valides ja korrastades teiste teoste väljendused. @et
toolkit definition: Værk, som involverer en agents ansvar for sammenlægning ved at udvælge og arrangere udtryk af andre værk. @da
toolkit definition: Œuvre qui comporte une responsabilité de la part d’un agent en ce qui concerne l’agrégation par la sélection et l’arrangement d’expressions d’autres œuvres. @fr
toolkit definition: عمل يترتب عليه مسئولية وكيل عن التجميع عن طريق اختيار وترتيب تعبيرات الأعمال الأخرى. @ar
toolkit definition: 涉及把其他作品的内容表达选择和整理后编制合集的一个行为者的责任的一种作品 @zh-hans
toolkit label: Akteur als Aggregatorin/Aggregator von @de
toolkit label: Toplayıcı temsilci @tr
toolkit label: agent agregador de @ca
toolkit label: agent agrégateur de @fr
toolkit label: agent, som er samler af @da
toolkit label: aggregaattori (toimija) teoksessa
toolkit label: aggregator agent of @en
toolkit label: aggregator for (agent) @no
toolkit label: aggregator-actor van @nl
toolkit label: aggregatore agente di @it
toolkit label: aggregátor ágense: @hu
toolkit label: ir apkopotājs (aģents) @lv
toolkit label: liitja (tegija) teoses @et
toolkit label: συναθροιστής φορέας του @el
toolkit label: وكيل مجمع @ar
toolkit label: ……的合集编者行为者 @zh-hans
has subproperty: kokoaja (toimija) teoksessa
has subproperty: aggregaattori (henkilö) teoksessa
has subproperty: aggregaattori (yhteistoimija) teoksessa
has subproperty: P50453
lexical alias: aggregatorAgentOf.en
status: Published
type: Property
domain: C10002
label: aggregátor ágense a következőnek: @hu
label: er agent, som er samler af @da
label: er aggregator for (agent) @no
label: est un agent agrégateur de @fr
label: ir apkopotājs (aģents) @lv
label: is aggregator agent of @en
label: is aggregator-actor van @nl
label: ist Akteur als Aggregatorin/Aggregator von @de
label: liitja (tegija) teoses @et
label: toplayıcı temsilcisidir @tr
label: è aggregatore agente di @it
label: és agent agregador de @ca
label: είναι ερανιστής φορέας του @el
label: هو وكيل مجمع لـ @ar
label: 是……的合集编者行为者 @zh-hans
sub property of: teoksen tekijä (toimija) teoksessa
definition: Bir temsilciyi, diğer eserlerin anlatımlarını seçerek ve düzenleyerek toplamakla sorumlu bir temsilcinin sorumluluğunu içeren bir eserle ilişkilendirir. @tr
definition: Correla un agente con un'opera che implica una responsabilità di un agente nell'aggregazione tramite selezione e sistemazione di espressioni di altre opere. @it
definition: Hozzákapcsol egy ágenst egy műhöz, amelyhez hozzátartozik egy ágens felelőssége más művek kifejezési formáinak kiválasztásával és elrendezésével járó aggregálásáért. @hu
definition: Liittää toimijan teokseen, jossa toimija on vastuussa aggregoivan teoksen luomisesta valitsemalla ja järjestämällä muiden teosten ekspressioita.
definition: Met un agent en relation avec une œuvre qui comporte une responsabilité de la part d’un agent en ce qui concerne l’agrégation par la sélection et l’arrangement d’expressions d’autres œuvres. @fr
definition: Relaciona un agent amb una obra que implica una responsabilitat d’un agent en l’agregació mitjançant la selecció i l’arranjament d’expressions d’altres obres. @ca
definition: Relateert een actor aan een werk dat met zich meebrengt een verantwoordelijkheid van een actor voor aggregeren door middel van selectie en arrangeren van expressies van andere werken. @nl
definition: Relaterer en agent til et verk som involverer ansvar fra en agent for aggregering ved å velge ut og arrangere uttrykk av andre verk. @no
definition: Relaterer en agent til et værk, som involverer en agents ansvar for sammenlægning ved at udvælge og arrangere udtryk af andre værk. @da
definition: Relates an agent to a work that involves a responsibility of an agent for aggregation by selecting and arranging expressions of other works. @en
definition: Sasaista aģentu ar darbu, kas ietver aģenta atbildību par apkopošanu, atlasot un sakārtojot citu darbu izteiksmes. @lv
definition: Seostab tegija teosega, mis sisaldab tegija vastutust liitumi loomise eest, valides ja korrastades teiste teoste väljendused. @et
definition: Setzt einen Akteur in Beziehung zu einem Werk, bei dem ein Akteur für die Aggregation verantwortlich ist, indem er Expressionen von anderen Werken auswählt und zusammenstellt. @de
definition: يربط وكيلا بعمل يترتب عليه مسئولية وكيل عن التجميع عن طريق اختيار تعبيرات الأعمال الأخرى وترتيبها. @ar
definition: 将一个行为者与涉及把其他作品的内容表达选择和整理后编制合集的一个行为者的责任的一种作品关联起来。 @zh-hans

yhteisövastaaja rikosoikeudessa teoksessa
has element type: 2
toolkit definition: A work that involves a responsibility for being accused as a corporate body in a criminal proceeding. @en
toolkit definition: Bir ceza davasında tüzel bir kişi olarak suçlanma sorumluluğunu içeren bir çalışma. @tr
toolkit definition: Darbs, kas ietver atbildību par to, ka institūcija apsūdzēta kriminālprocesā. @lv
toolkit definition: Een werk dat met zich meebrengt een verantwoordelijkheid voor het beschuldigd worden als een corporatie in een strafproces. @nl
toolkit definition: Egy mű, amelyhez hozzátartozik annak felelőssége, hogy egy testületet egy büntetőeljárásban megvádolnak. @hu
toolkit definition: Ein Werk, das mit einer Verantwortung verbunden ist, als Körperschaft in einem Strafverfahren angeklagt zu sein. @de
toolkit definition: Et verk som involverer et ansvar for å være en saksøkt korporasjon i en straffesak. @no
toolkit definition: Obra que implica una responsabilitat de ser acusada com a entitat corporativa en un procés penal. @ca
toolkit definition: Opera che implica una responsabilità nell'essere accusato come ente in un processo criminale. @it
toolkit definition: Teos, jossa yhteisö on syytettynä rikosprosessissa.
toolkit definition: Teos, mis sisaldab asutuse vastu esitatud süüdistust kriminaalkohtumenetluses. @et
toolkit definition: Værk, som involverer et ansvar for at være en anklaget korporation i en straffesag. @da
toolkit definition: Œuvre qui comporte une responsabilité consistant à être accusée en tant que collectivité dans une poursuite criminelle. @fr
toolkit definition: عمل يترتب عليه مسئولية اتهامها كهيئة في دعوى جنائية. @ar
toolkit definition: 涉及在一项刑事诉讼中作为团体被指控的一个责任的一种作品 @zh-hans
toolkit label: Körperschaft als Angeklagte/Angeklagter in einem Strafverfahren von @de
toolkit label: bűnvádi eljárás alperes testülete: @hu
toolkit label: collectivité défenderesse criminelle de @fr
toolkit label: criminal defendant corporate body of @en
toolkit label: criminele verdachte-corporatie van @nl
toolkit label: entitat corporativa acusada penal de @ca
toolkit label: imputato penale ente di @it
toolkit label: ir atbildētājs kriminālprocesā (institūcija) @lv
toolkit label: korporation, som er sagsøgt af @da
toolkit label: strafferettslig saksøkt korporasjon for @no
toolkit label: suç sanığı tüzel kişi @tr
toolkit label: süüdistatav (asutus) teoses @et
toolkit label: yhteisövastaaja rikosoikeudessa teoksessa
toolkit label: ποινικά εναγόμενο συλλογικό όργανο του @el
toolkit label: هيئة مدعى عليها جنائياً @ar
toolkit label: ……的刑事被告团体 @zh-hans
has subproperty: P50454
lexical alias: criminalDefendantCorporateBodyOf.en
status: Published
type: Property
domain: C10005
label: bűnvádi eljárás alperes testülete a következőnek: @hu
label: er korporation, som er sagsøgt af @da
label: er strafferettslig saksøkt korporasjon for @no
label: est une collectivité défenderesse criminelle de @fr
label: ir atbildētājs kriminālprocesā (institūcija) @lv
label: is criminal defendant corporate body of @en
label: is criminele verdachte-corporatie van @nl
label: ist Körperschaft als Angeklagte/Angeklagter in einem Strafverfahren von @de
label: sanık tüzel kişisidir @tr
label: süüdistatav (asutus) teoses @et
label: è imputato penale ente di @it
label: és entitat corporativa acusada penal de @ca
label: είναι ποινικά εναγόμενο συλλογικό όργανο του @el
label: هي هيئة مدعى عليها جنائياً لـ @ar
label: 是……的刑事被告团体 @zh-hans
sub property of: yhteisö vastaajana kanteessa
definition: Bir tüzel kişiyi, bir ceza davasında tüzel kişi olarak suçlanma sorumluluğunu içeren bir eserle ilişkilendirir. @tr
definition: Correla un ente a un'opera che implica una responsabilità nell'essere accusato come ente in un processo criminale. @it
definition: Hozzákapcsol egy testületet egy műhöz, amelyhez hozzátartozik annak felelőssége, hogy egy testületet egy büntetőeljárásban megvádolnak. @hu
definition: Liittää yhteisön teokseen, jossa yhteisö on syytettynä rikosprosessissa.
definition: Met une collectivité en relation avec une œuvre qui comporte une responsabilité consistant à être accusée en tant que collectivité dans une poursuite criminelle. @fr
definition: Relaciona una entitat corporativa amb una obra que implica una responsabilitat de ser acusada com a entitat corporativa en un procés penal. @ca
definition: Relateert een corporatie aan een werk dat met zich meebrengt een verantwoordelijkheid voor het beschuldigd worden als een corporatie in een strafproces. @nl
definition: Relaterer en korporasjon til et verk som involverer et ansvar for å være en saksøkt korporasjon i en straffesak. @no
definition: Relaterer en korporation til et værk, som involverer et ansvar for at være en anklaget korporation i en straffesag. @da
definition: Relates a corporate body to a work that involves a responsibility for being accused as a corporate body in a criminal proceeding. @en
definition: Sasaista institūciju ar darbu, kas ietver atbildību par to, ka institūcija apsūdzēta kriminālprocesā. @lv
definition: Seostab asutuse teosega, mis sisaldab asutuse vastu esitatud süüdistust kriminaalkohtumenetluses. @et
definition: Setzt eine Körperschaft in Beziehung zu einem Werk, das mit einer Verantwortung verbunden ist, als Körperschaft in einem Strafverfahren angeklagt zu sein. @de
definition: يربط هيئة بعمل يترتب عليه مسئولية اتهامها كهيئة في دعوى جنائية. @ar
definition: 将一个团体与涉及在一项刑事诉讼中作为团体被指控的一个责任的一种作品关联起来。 @zh-hans

henkilövastaaja rikosoikeudessa teoksessa
has element type: 2
toolkit definition: A work that involves a responsibility for being accused as a person in a criminal proceeding. @en
toolkit definition: Bir ceza davasında kişi olarak suçlanma sorumluluğunu içeren bir çalışma. @tr
toolkit definition: Darbs, kas ietver atbildību par to, ka persona apsūdzēta kriminālprocesā. @lv
toolkit definition: Een werk dat met zich meebrengt een verantwoordelijkheid voor het beschuldigd worden als een persoon in een strafproces. @nl
toolkit definition: Egy mű, amelyhez hozzátartozik annak felelőssége, hogy egy személyt egy büntetőeljárásban megvádolnak. @hu
toolkit definition: Ein Werk, das mit einer Verantwortung verbunden ist, als Person in einem Strafverfahren angeklagt zu sein. @de
toolkit definition: Et verk som involverer et ansvar for å være en saksøkt person i en straffesak. @no
toolkit definition: Obra que implica una responsabilitat de ser acusada com a persona en un procés penal. @ca
toolkit definition: Opera che implica una responsabilità nell'essere accusato come persona in un processo criminale. @it
toolkit definition: Teos, jossa henkilö on syytettynä rikosprosessissa.
toolkit definition: Teos, mis sisaldab isiku vastu esitatud süüdistust kriminaalkohtumenetluses. @et
toolkit definition: Værk, som involverer et ansvar for at være en anklaget person i en straffesag. @da
toolkit definition: Œuvre qui comporte une responsabilité consistant à être accusée en tant que personne dans une poursuite criminelle. @fr
toolkit definition: عمل يترتب عليه مسئولية اتهامه كشخص في دعوى جنائية. @ar
toolkit definition: 涉及在一项刑事诉讼中作为个人被指控的一个责任的一种作品 @zh-hans
toolkit label: Person als Angeklagte/Angeklagter in einem Strafverfahren von @de
toolkit label: bűnvádi eljárás alperes személye: @hu
toolkit label: criminal defendant person of @en
toolkit label: criminele verdachte-persoon van @nl
toolkit label: henkilövastaaja rikosoikeudessa teoksessa
toolkit label: imputato penale persona di @it
toolkit label: ir atbildētājs kriminālprocesā (persona) @lv
toolkit label: person, som er sagsøgt af @da
toolkit label: persona acusada penal de @ca
toolkit label: personne défenderesse criminelle de @fr
toolkit label: strafferettslig saksøkt person for @no
toolkit label: suç sanığı kişi @tr
toolkit label: süüdistatav (isik) teoses @et
toolkit label: ποινικά εναγόμενο φυσικό πρόσωπο του @el
toolkit label: شخص مدعى عليه جنائيا @ar
toolkit label: ……的刑事被告个人 @zh-hans
has subproperty: P50455
lexical alias: criminalDefendantPersonOf.en
status: Published
type: Property
domain: C10004
label: bűnvádi eljárás alperes személye a következőnek: @hu
label: er person, som er sagsøgt af @da
label: er strafferettslig saksøkt person for @no
label: est une personne défenderesse criminelle de @fr
label: ir atbildētājs kriminālprocesā (persona) @lv
label: is criminal defendant person of @en
label: is criminele verdachte-persoon van @nl
label: ist Person als Angeklagte/Angeklagter in einem Strafverfahren von @de
label: sanık kişisidir @tr
label: süüdistatav (isik) teoses @et
label: è imputato penale persona di @it
label: és persona acusada penal de @ca
label: είναι ποινικά εναγόμενο φυσικό πρόσωπο του @el
label: هو شخص مدعى عليه جنائيا لـ @ar
label: 是……的刑事被告个人 @zh-hans
sub property of: henkilö vastaajana kanteessa
definition: Bir kişiyi, bir ceza davasında kişi olarak suçlanma sorumluluğunu içeren bir eserle ilişkilendirir. @tr
definition: Correla una persona a un'opera che implica una responsabilità nell'essere accusato come persona in un processo criminale. @it
definition: Hozzákapcsol egy személyt egy műhöz, amelyhez hozzátartozik annak felelőssége, hogy egy személyt egy büntetőeljárásban megvádolnak. @hu
definition: Liittää rikosprosessissa syytetyn henkilön teokseen.
definition: Met une personne en relation avec une œuvre qui comporte une responsabilité consistant à être accusée en tant que personne dans une poursuite criminelle. @fr
definition: Relaciona una persona amb una obra que implica una responsabilitat de ser acusada com a persona en un procés penal. @ca
definition: Relateert een persoon aan een werk dat met zich meebrengt een verantwoordelijkheid voor het beschuldigd worden als een persoon in een strafproces. @nl
definition: Relaterer en person til et verk som involverer et ansvar for å være en saksøkt person i en straffesak. @no
definition: Relaterer en person til et værk, som involverer et ansvar for at være en anklaget person i en straffesag. @da
definition: Relates a person to a work that involves a responsibility for being accused as a person in a criminal proceeding. @en
definition: Sasaista personu ar darbu, kas ietver atbildību par to, ka persona apsūdzēta kriminālprocesā. @lv
definition: Seostab isiku teosega, mis sisaldab isiku vastu esitatud süüdistust kriminaalkohtumenetluses. @et
definition: Setzt eine Person in Beziehung zu einem Werk, das mit einer Verantwortung verbunden ist, als Person in einem Strafverfahren angeklagt zu sein. @de
definition: يربط شخصا بعمل يترتب عليه مسئولية اتهامه كشخص في دعوى جنائية. @ar
definition: 将一个个人与涉及在一项刑事诉讼中作为个人被指控的一个责任的一种作品关联起来。 @zh-hans

yhteisövastaaja siviilioikeudessa teoksessa
has element type: 2
toolkit definition: A work that involves a responsibility for being sued as a corporate body in a civil proceeding. @en
toolkit definition: Bir hukuk davasında tüzel bir kişi olarak dava edilme sorumluluğunu içeren bir çalışma. @tr
toolkit definition: Darbs, kas ietver atbildību par to, ka institūcija iesūdzēta civillietā. @lv
toolkit definition: Een werk dat met zich meebrengt een verantwoordelijkheid van gedaagd worden als een corporatie in een civielrechtelijke procedure. @nl
toolkit definition: Egy mű, amelyhez hozzátartozik annak felelőssége, hogy egy testületet egy polgári jogi eljárásban beperelnek. @hu
toolkit definition: Ein Werk, das mit einer Verantwortung verbunden ist, als Körperschaft in einem Zivilverfahren verklagt zu werden. @de
toolkit definition: Et verk som involverer et ansvar for å være en saksøkt korporasjon i en sivilrettslig sak. @no
toolkit definition: Obra que implica una responsabilitat de ser demandada com a entitat corporativa en un procés civil. @ca
toolkit definition: Opera che implica una responsabilità nell'essere denunciato come ente in un processo civile. @it
toolkit definition: Teos, jossa yhteisöä vastaan on nostettu kanne.
toolkit definition: Teos, mis sisaldab asutuse vastu esitatud hagi tsiviilkohtumenetluses. @et
toolkit definition: Værk, som involverer et ansvar for at være en sagsøgt korporation i en civilretlig straffesag. @da
toolkit definition: Œuvre qui comporte une responsabilité consistant à être poursuivie en tant que collectivité dans une poursuite civile. @fr
toolkit definition: عمل يترتب عليه مسئولية اتهامها كهيئة في دعوى مدنية. @ar
toolkit definition: 涉及在一项民事诉讼中作为团体被控告的一个责任的一种作品 @zh-hans
toolkit label: Körperschaft als Beklagte/Beklagter in einem Zivilverfahren von @de
toolkit label: burgelijke verweerder-corporatie van @nl
toolkit label: civil defendant corporate body of @en
toolkit label: collectivité défenderesse civile de @fr
toolkit label: davalı tüzel kişi @tr
toolkit label: entitat corporativa acusada civil de @ca
toolkit label: imputato civile ente di @it
toolkit label: ir civiltiesisks atbildētājs (institūcija) @lv
toolkit label: korporation, som er civilretlig sagsøgt af @da
toolkit label: kostja (asutus) teoses @et
toolkit label: polgári eljárás alperes testülete: @hu
toolkit label: sivilrettslig saksøkt korporasjon for @no
toolkit label: yhteisövastaaja siviilioikeudessa teoksessa
toolkit label: αστικά εναγόμενο συλλογικό όργανο του @el
toolkit label: هيئة مدعى عليها مدنياً @ar
toolkit label: ……的民事被告团体 @zh-hans
has subproperty: P50456
lexical alias: civilDefendantCorporateBodyOf.en
status: Published
type: Property
domain: C10005
label: er korporation, som er civilretlig sagsøgt af @da
label: er sivilrettslig saksøkt korporasjon for @no
label: est une collectivité défenderesse civile de @fr
label: hukuki davalı tüzel kişisidir @tr
label: ir civiltiesisks atbildētājs (institūcija) @lv
label: is burgelijke verweerder-corporatie van @nl
label: is civil defendant corporate body of @en
label: ist Körperschaft als Beklagte/Beklagter in einem Zivilverfahren von @de
label: kostja (asutus) teoses @et
label: polgári eljárás alperes testülete a következőnek: @hu
label: è imputato civile ente di @it
label: és entitat corporativa acusada civil de @ca
label: είναι αστικά εναγόμενο συλλογικό όργανο του @el
label: هي هيئة مدعى عليها مدنياً لـ @ar
label: 是……的民事被告团体 @zh-hans
sub property of: yhteisö vastaajana kanteessa
definition: Bir tüzel kişiyi, bir hukuk davasında tüzel kişi olarak dava edilme sorumluluğunu içeren bir eserle ilişkilendirir. @tr
definition: Correla un ente a un'opera che implica una responsabilità nell'essere denunciato come ente in un processo civile. @it
definition: Hozzákapcsol egy testületet egy műhöz, amelyhez hozzátartozik annak felelőssége, hogy egy testületet egy polgári jogi eljárásban beperelnek. @hu
definition: Liittää yhteisön teokseen, jossa yhteisöä vastaan on nostettu kanne.
definition: Met une collectivité en relation avec une œuvre qui comporte une responsabilité consistant à être poursuivie en tant que collectivité dans une poursuite civile. @fr
definition: Relaciona una entitat corporativa amb una obra que implica una responsabilitat de ser demandada com a entitat corporativa en un procés civil. @ca
definition: Relateert een corporatie aan een werk dat met zich meebrengt een verantwoordelijkheid van gedaagd worden als een corporatie in een civielrechtelijke procedure. @nl
definition: Relaterer en korporasjon til et verk som involverer et ansvar for å være en saksøkt korporasjon i en sivilrettslig sak. @no
definition: Relaterer en korporation til et værk, som involverer et ansvar for at være en sagsøgt korporation i en civilretlig straffesag. @da
definition: Relates a corporate body to a work that involves a responsibility for being sued as a corporate body in a civil proceeding. @en
definition: Sasaista institūciju ar darbu, kas ietver atbildību par to, ka institūcija iesūdzēta civillietā. @lv
definition: Seostab asutuse teosega, mis sisaldab asutuse vastu esitatud hagi tsiviilkohtumenetluses. @et
definition: Setzt eine Körperschaft in Beziehung zu einem Werk, das mit einer Verantwortung verbunden ist, als Körperschaft in einem Zivilverfahren verklagt zu werden. @de
definition: يربط هيئة بعمل يترتب عليه مسئولية اتهامها كهيئة في دعوى مدنية. @ar
definition: 将一个团体与涉及在一项民事诉讼中作为团体被控告的一个责任的一种作品关联起来。 @zh-hans

henkilövastaaja siviilioikeudessa teoksessa
has element type: 2
toolkit definition: A work that involves a responsibility for being sued as a person in a civil proceeding. @en
toolkit definition: Bir hukuk davasında kişi olarak dava edilme sorumluluğunu içeren bir çalışma. @tr
toolkit definition: Darbs, kas ietver atbildību par to, ka persona iesūdzēta civillietā. @lv
toolkit definition: Een werk dat met zich meebrengt een verantwoordelijkheid van gedaagd worden als een persoon in een civielrechtelijke procedure. @nl
toolkit definition: Egy mű, amelyhez hozzátartozik annak felelőssége, hogy egy személyt egy polgári jogi eljárásban beperelnek. @hu
toolkit definition: Ein Werk, das mit einer Verantwortung verbunden ist, als Person in einem Zivilverfahren verklagt zu werden. @de
toolkit definition: Et verk som involverer et ansvar for å være en saksøkt person i en sivilrettslig sak. @no
toolkit definition: Obra que implica una responsabilitat de ser demandada com a persona en un procés civil. @ca
toolkit definition: Opera che implica una responsabilità nell'essere denunciato come persona in un processo civile. @it
toolkit definition: Teos, jossa henkilöä vastaan on nostettu kanne.
toolkit definition: Teos, mis sisaldab isiku vastu esitatud hagi tsiviilkohtumenetluses. @et
toolkit definition: Værk, som involverer et ansvar for at være en sagsøgt person i en civilretlig straffesag. @da
toolkit definition: Œuvre qui comporte une responsabilité consistant à être poursuivie en tant que personne dans une poursuite civile. @fr
toolkit definition: عمل يترتب عليه مسئولية اتهامه كشخص في دعوى مدنية. @ar
toolkit definition: 涉及在一项民事诉讼中作为个人被控告的一个责任的一种作品 @zh-hans
toolkit label: Person als Beklagte/Beklagter in einem Zivilverfahren von @de
toolkit label: burgelijke verweerder-persoon van @nl
toolkit label: civil defendant person of @en
toolkit label: davalı kişi @tr
toolkit label: henkilövastaaja siviilioikeudessa teoksessa
toolkit label: imputato civile persona di @it
toolkit label: ir civiltiesisks atbildētājs (persona) @lv
toolkit label: kostja (isik) teoses @et
toolkit label: person, som er civilretlig sagsøgt af @da
toolkit label: persona acusada civil de @ca
toolkit label: personne défenderesse civile de @fr
toolkit label: polgári eljárás alperes személye: @hu
toolkit label: sivilrettslig saksøkt person for @no
toolkit label: αστικά εναγόμενο φυσικό πρόσωπο του @el
toolkit label: شخص مدعى عليه مدنيا @ar
toolkit label: ……的民事被告个人 @zh-hans
has subproperty: P50457
lexical alias: civilDefendantPersonOf.en
status: Published
type: Property
domain: C10004
label: er person, som er civilretlig sagsøgt af @da
label: er sivilrettslig saksøkt person for @no
label: est une personne défenderesse civile de @fr
label: hukuki davalı kişisidir @tr
label: ir civiltiesisks atbildētājs (persona) @lv
label: is burgelijke verweerder-persoon van @nl
label: is civil defendant person of @en
label: ist Person als Beklagte/Beklagter in einem Zivilverfahren von @de
label: kostja (isik) teoses @et
label: polgári eljárás alperes személye a következőnek: @hu
label: è imputato civile persona di @it
label: és persona acusada civil de @ca
label: είναι αστικά εναγόμενο φυσικό πρόσωπο του @el
label: هو شخص مدعى عليه مدنيا لـ @ar
label: 是……的民事被告个人 @zh-hans
sub property of: henkilö vastaajana kanteessa
definition: Bir kişiyi, bir hukuk davasında kişi olarak dava edilme sorumluluğunu içeren bir eserle ilişkilendirir. @tr
definition: Correla una persona a un'opera che implica una responsabilità nell'essere denunciato come persona in un processo civile. @it
definition: Hozzákapcsol egy személyt egy műhöz, amelyhez hozzátartozik annak felelőssége, hogy egy személyt egy polgári jogi eljárásban beperelnek. @hu
definition: Liittää henkilön teokseen, jossa henkilöä vastaan on nostettu kanne.
definition: Met une personne en relation avec une œuvre qui comporte une responsabilité consistant à être poursuivie en tant que personne dans une poursuite civile. @fr
definition: Relaciona una persona amb una obra que implica una responsabilitat de ser demandada com a persona en un procés civil. @ca
definition: Relateert een persoon aan een werk dat met zich meebrengt een verantwoordelijkheid van gedaagd worden als een persoon in een civielrechtelijke procedure. @nl
definition: Relaterer en person til et verk som involverer et ansvar for å være en saksøkt person i en sivilrettslig sak. @no
definition: Relaterer en person til et værk, som involverer et ansvar for at være en sagsøgt person i en civilretlig straffesag. @da
definition: Relates a person to a work that involves a responsibility for being sued as a person in a civil proceeding. @en
definition: Sasaista personu ar darbu, kas ietver atbildību par to, ka persona iesūdzēta civillietā. @lv
definition: Seostab isiku teosega, mis sisaldab isiku vastu esitatud hagi tsiviilkohtumenetluses. @et
definition: Setzt eine Person in Beziehung zu einem Werk, das mit einer Verantwortung verbunden ist, als Person in einem Zivilverfahren verklagt zu werden. @de
definition: يربط شخصا بعمل يترتب عليه مسئولية اتهامه كشخص في دعوى مدنية. @ar
definition: 将一个个人与涉及在一项民事诉讼中作为个人被控告的一个责任的一种作品关联起来。 @zh-hans

akateeminen ohjaaja teoksessa
has element type: 2
toolkit definition: A work that involves a responsibility for overseeing academic activity of any kind that results in a work, including theses, research, and projects. @en
toolkit definition: Darbs, kas ietver personas atbildību, esot par zinātniska vai promocijas darba konsultantu vai vadītāju, pārraugot akadēmisku vai zinātnisku darbu. @lv
toolkit definition: Een werk dat met zich meebrengt een verantwoordelijkheid voor het toezicht houden op academische activiteiten van elke soort die resulteert in een werk, inclusief dissertaties, onderzoek en projecten. @nl
toolkit definition: Egy mű, amely magában foglalja bármilyen tudományos tevékenység felügyeletének felelősségét, amelynek eredménye egy mű, beleértve szakdolgozatokat, kutatást és projekteket. @hu
toolkit definition: Ein Werk, das mit einer Verantwortung verbunden ist, die akademische Tätigkeit jeglicher Art zu betreuen, die zu einem Werk führen. Darunter fallen Hochschulschriften, Forschungen und Projekte. @de
toolkit definition: Et verk som involverer et ansvar for å føre tilsyn med all akademisk aktivitet som resulterer i et verk, inklusive avhandlinger, forskning og prosjekter. @no
toolkit definition: Obra que implica una responsabilitat en la supervisió d’una activitat acadèmica de qualsevol classe que dona com a resultat una obra, incloses tesis, recerques i projectes. @ca
toolkit definition: Opera che implica una responsabilità nella supervisione di attività accademica di qualsiasi genere che risulta in un'opera, incluse tesi, ricerca e progetti. @it
toolkit definition: Teos, jossa henkilö on vastuussa kaikenlaisen akateemisen toiminnan valvonnasta, joka johtaa teokseen, mukaan lukien tutkielmat, tutkimukset ja projektit.
toolkit definition: Teos, mis sisaldab vastutust teoses (sh väitekirjad, uurimused ja projektid) väljenduva ükskõik millist laadi akadeemilise tegevuse ülevaatamise eest. @et
toolkit definition: Tezler, araştırmalar ve projeler de dahil olmak üzere, bir çalışmayla sonuçlanan her türlü akademik faaliyeti denetleme sorumluluğunu içeren bir çalışma. @tr
toolkit definition: Værk, som involverer et ansvar for at føre tilsyn med akademisk aktivitet af enhver art, som resulterer i et værk, herunder afhandlinger, forskning og projekter. @da
toolkit definition: Œuvre qui comporte une responsabilité consistant à superviser les activités universitaires de toute nature entraînant la création d’une œuvre, y compris les thèses, les travaux de recherche et les projets. @fr
toolkit definition: عمل يترتب عليه مسئولية الإشراف على نشاط أكاديمي من أي نوع يسفر عن عمل، ويشمل ذلك الأطروحات والبحوث والمشاريع. @ar
toolkit definition: 涉及导致一种作品的各种学术活动（包括论文、研究和项目）之监督责任的一种作品 @zh-hans
toolkit label: Akademik danışman @tr
toolkit label: Akademische Betreuerin/Akademischer Betreuer von @de
toolkit label: academic supervisor of @en
toolkit label: academisch begeleider van @nl
toolkit label: akadeemiline juhendaja teoses @et
toolkit label: akademisk veileder for @no
toolkit label: akademisk vejleder af @da
toolkit label: akateeminen ohjaaja teoksessa
toolkit label: ir akadēmiskā darba vadītājs @lv
toolkit label: superviseur académique de @fr
toolkit label: supervisor acadèmic de @ca
toolkit label: supervisore accademico di @it
toolkit label: tudományos témavezetője: @hu
toolkit label: ακαδημαϊκός επόπτης του @el
toolkit label: مشرف أكاديمي @ar
toolkit label: ……的学术主管 @zh-hans
has subproperty: opinnäytteen ohjaaja teoksessa
has subproperty: tutkimuksen ohjaaja teoksessa
has subproperty: projektin ohjaaja teoksessa
has subproperty: P50458
lexical alias: academicSupervisorOf.en
status: Published
type: Property
domain: C10004
label: akadeemiline juhendaja teoses @et
label: akademik danışmanıdır @tr
label: er akademisk veileder for @no
label: er akademisk vejleder af @da
label: est un superviseur académique de @fr
label: ir akadēmiskā darba vadītājs @lv
label: is academic supervisor of @en
label: is academisch begeleider van @nl
label: ist akademische Betreuerin/akademischer Betreuer von @de
label: tudományos témavezetője a következőnek: @hu
label: è supervisore accademico di @it
label: és supervisor acadèmic de @ca
label: είναι ακαδημαϊκός επόπτης του @el
label: هو مشرف أكاديمي لـ @ar
label: 是……的学术主管 @zh-hans
sub property of: henkilöön liittyvä teos
definition: Bir kişiyi, tezler, araştırmalar ve projeler de dahil olmak üzere bir çalışmayla sonuçlanan her türlü akademik faaliyeti denetleme sorumluluğunu içeren bir eserle ilişkilendirir. @tr
definition: Correla una persona a un'opera che implica una responsabilità nella supervisione di attività accademica di qualsiasi genere che risulta in un'opera, incluse tesi, ricerca e progetti. @it
definition: Hozzákapcsol egy személyt egy műhöz, amely magában foglalja bármilyen tudományos tevékenység felügyeletének felelősségét, amelynek eredménye egy mű, beleértve szakdolgozatokat, kutatást és projekteket. @hu
definition: Liittää henkilön teokseen, jossa henkilö on vastuussa kaikenlaisen akateemisen toiminnan valvonnasta, joka johtaa teokseen, mukaan lukien tutkielmat, tutkimukset ja projektit.
definition: Met une personne en relation avec une œuvre qui comporte une responsabilité consistant à superviser les activités universitaires de toute nature entraînant la création d’une œuvre, y compris les thèses, les travaux de recherche et les projets. @fr
definition: Relaciona una persona amb una obra que implica una responsabilitat en la supervisió d’una activitat acadèmica de qualsevol classe que dona com a resultat una obra, incloses tesis, recerques i projectes. @ca
definition: Relateert een persoon aan een werk dat met zich meebrengt een verantwoordelijkheid voor het toezicht houden op academische activiteiten van elke soort die resulteert in een werk, inclusief dissertaties, onderzoek en projecten. @nl
definition: Relaterer en person til et verk som involverer et ansvar for å føre tilsyn med all akademisk aktivitet som resulterer i et verk, inklusive avhandlinger, forskning og prosjekter. @no
definition: Relaterer en person til et værk, som involverer et ansvar for at føre tilsyn med akademisk aktivitet af enhver art, som resulterer i et værk, herunder afhandlinger, forskning og projekter. @da
definition: Relates a person to a work that involves a responsibility for overseeing academic activity of any kind that results in a work, including theses, research, and projects. @en
definition: Sasaista personu ar darbu, kas ietver personas atbildību, esot par zinātniska vai promocijas darba konsultantu vai vadītāju, pārraugot akadēmisku vai zinātnisku darbu. @lv
definition: Seostab isiku teosega, mis sisaldab vastutust teoses (sh väitekirjad, uurimused ja projektid) väljenduva ükskõik millist laadi akadeemilise tegevuse ülevaatamise eest. @et
definition: Setzt eine Person in Beziehung zu einem Werk, das mit einer Verantwortung verbunden ist, die akademische Tätigkeit jeglicher Art zu betreuen, die zu einem Werk führen. Darunter fallen Hochschulschriften, Forschungen und Projekte. @de
definition: يربط شخصا بعمل يترتب عليه مسئولية الإشراف على نشاط أكاديمي من أي نوع يسفر عن عمل، ويشمل ذلك الأطروحات والبحوث والمشاريع. @ar
definition: 将一个个人与涉及导致一种作品的各种学术活动（包括论文、研究和项目）之监督责任的一种作品关联起来。 @zh-hans

musiikkiin osallinen toimija manifestaatiossa
has element type: 2
instruction number: 18.5
toolkit definition: A manifestation that is an aggregate that embodies an expression of a musical work that is created by an agent. @en
toolkit definition: Bir temsilci tarafından oluşturulan bir müzik eserinin anlatımını somutlaştıran topluluk olan bir gösterim. @tr
toolkit definition: Een manifestatie die een aggregaat is die een expressie van een muziekwerk verwezenlijkt die is gecreëerd door een actor. @nl
toolkit definition: Egy aggregátum megjelenési forma, amely egy ágens által létrehozott zenemű kifejezési formáját testesíti meg. @hu
toolkit definition: Ein Aggregat (Manifestation), das eine Expression eines Musikwerks verkörpert, die ein Akteur erstellt hat. @de
toolkit definition: En manifestasjon som er et aggregat som realiserer et musikalsk verk skapt av en agent. @no
toolkit definition: Kehastus, mis on liitum, milles on teostatud tegija loodud muusikateose väljendus. @et
toolkit definition: Manifestaatio, joka on aggregaatti, joka sisältää musiikkiteoksen ekspression, jonka toimija on luonut.
toolkit definition: Manifestació que és un agregat que materialitza una expressió d’una obra musical que és creada per un agent. @ca
toolkit definition: Manifestation qui consiste en un agrégat matérialisant une expression d’une œuvre musicale créée par un agent. @fr
toolkit definition: Manifestation, som er en samling, som rummer et udtryk af et musikværk, som er skabt af en agent. @da
toolkit definition: Manifestazione che è un aggregato che materializza un'opera musicale creata da un agente. @it
toolkit definition: Manifestācija, kas ir apkopojums, kas ietver aģenta radītu mūzikas darbu. @lv
toolkit definition: تجسيدة عبارة عن تجميعة تجسد عملًا موسيقيًا ألفه الوكيل. @ar
toolkit definition: 作为一种合集、把一个行为者所创作的一种音乐作品的内容表达具体化的一种载体表现 @zh-hans
toolkit label: Akteur als Beiträgerin/Beiträger einer Musik von @de
toolkit label: agent contributeur de musique de @fr
toolkit label: agent contribuïdor de música de @ca
toolkit label: agent, som er bidragsyder til musik af @da
toolkit label: bijdrager-actor van muziek van @nl
toolkit label: contributor agent of music of @en
toolkit label: contributore agente di musica di @it
toolkit label: har bidragsyter til musikk for (agent) @no
toolkit label: ir mūzikas līdzradītājs (aģents) @lv
toolkit label: közreműködő ágense a következő zenének: @hu
toolkit label: musiikkiin osallinen toimija manifestaatiossa
toolkit label: muusikaline kaastööline (tegija) kehastuses @et
toolkit label: müzi̇ğe katkıda bulunan temsi̇lci̇ @tr
toolkit label: συντελεστής φορέας της μουσικής του @el
toolkit label: وكيل مساهم في موسيقى @ar
toolkit label: ……的音乐的贡献者行为者 @zh-hans
has subproperty: musiikkiin osallinen henkilö manifestaatiossa
has subproperty: musiikkiin osallinen yhteistoimija manifestaatiossa
has subproperty: P50459
lexical alias: contributorAgentOfMusicOf.en
status: Published
type: Property
domain: C10002
label: er agent, som er bidragsyder til musik af @da
label: er har bidragsyter til musikk for (agent) @no
label: est un agent contributeur de musique de @fr
label: ir mūzikas līdzradītājs (aģents) @lv
label: is bijdrager-actor van muziek van @nl
label: is contributor agent of music of @en
label: ist Akteur als Beiträgerin/Beiträger einer Musik von @de
label: közreműködő ágense a következő zenének: @hu
label: muusikaline kaastööline (tegija) kehastuses @et
label: müziğinin katkıda bulunan temsilcisidir @tr
label: è contributore agente di musica di @it
label: és agent contribuïdor de música de @ca
label: είναι συντελεστής φορέας της μουσικής του @el
label: هو وكيل مساهم في موسيقى لـ @ar
label: 是……的音乐的贡献者行为者 @zh-hans
sub property of: aggregaattiin osallinen toimija manifestaatiossa
alternative label: Komponistin/Komponist (Expression) von @de
alternative label: besteci (anlatım) @tr
alternative label: composer (expression) of @en
alternative label: compositeur (expression) de @fr
alternative label: compositor (expresión) de @es
alternative label: compositor (expressió) de @ca
alternative label: komponist (udtryk) af @da
alternative label: säveltäjä (ekspressio) manifestaatiossa
alternative label: zeneszerzője a következőnek (kifejezési forma): @hu
alternative label: ……的作曲者（内容表达） @zh-hans
definition: Bir temsilciyi, bir temsilci tarafından oluşturulan bir müzik eserinin anlatımını somutlaştıran bir topluluğun gösterimiyle ilişkilendirir. @tr
definition: Correla un agente a una manifestazione che è un aggregato che materializza un'opera musicale creata da un agente. @it
definition: Hozzákapcsol egy ágenst egy aggregátum megjelenési formához, amely egy ágens által létrehozott zenemű kifejezési formáját testesíti meg. @hu
definition: Liittää toimijan manifestaatioon, joka on aggregaatti, joka sisältää musiikkiteoksen ekspression, jonka toimija on luonut.
definition: Met un agent en relation avec une manifestation qui consiste en un agrégat matérialisant une expression d’une œuvre musicale créée par un agent. @fr
definition: Relaciona un agent amb una manifestació que és un agregat que materialitza una expressió d’una obra musical que és creada per un agent. @ca
definition: Relateert een actor aan een manifestatie die een aggregaat is die een expressie van een muziekwerk verwezenlijkt die is gecreëerd door een actor. @nl
definition: Relaterer en agent til en manifestasjon som er et aggregat som realiserer et musikalsk verk skapt av en agent. @no
definition: Relaterer en agent til en manifestation, som er en samling, som rummer et udtryk af et musikværk, som er skabt af en agent. @da
definition: Relates an agent to a manifestation that is an aggregate that embodies an expression of a musical work that is created by an agent. @en
definition: Sasaista aģentu ar manifestāciju, kas ir apkopojums, kas ietver aģenta radītu mūzikas darbu. @lv
definition: Seostab tegija kehastusega, mis on liitum, milles on teostatud tegija loodud muusikateose väljendus. @et
definition: Setzt einen Akteur in Beziehung zu einem Aggregat (Manifestation), das eine Expression eines Musikwerks verkörpert, die ein Akteur erstellt hat. @de

maanmittari (toimija) manifestaatiossa
has element type: 2
instruction number: 18.5
toolkit definition: A manifestation that is an aggregate that includes a contribution by an agent of providing measurements or dimensional relationships for a geographic area. @en
toolkit definition: Bir coğrafi alan için ölçümler veya boyutsal ilişkiler sağlayan bir temsilcinin katkısını içeren topluluk olan bir gösterim. @tr
toolkit definition: Een manifestatie die een aggregaat is die omvat een bijdrage door een actor die levert maten of dimensionale verhoudingen voor een geografisch gebied. @nl
toolkit definition: Egy aggregátum megjelenési forma, amely magában foglalja egy ágens közreműködését egy földrajzi terület mérésében vagy dimenziós összefüggéseinek szolgáltatásában. @hu
toolkit definition: Ein Aggregat (Manifestation), zu dem ein Akteur beiträgt, indem er Messwerte oder Abmessungsverhältnisse für einen dargestellten geografischen Bereich zur Verfügung stellt. @de
toolkit definition: En manifestasjon som er et aggregat som inkluderer et bidrag fra en agent i form av å tilføre målinger eller størrelsesforhold for et geografisk område. @no
toolkit definition: Kehastus, mis on liitum, millesse tegija on andnud panuse, hankides geograafilise piirkonna mõõdud või mõõdusuhted. @et
toolkit definition: Manifestaatio, joka on aggregaatti, jossa toimija on osallisena kartantekijänä maantieteellisen alueen mittojen tai mittasuhteiden tuottamisessa.
toolkit definition: Manifestació que és un agregat que inclou una contribució d’un agent proporcionant mesuraments o relacions dimensionals d’una àrea geogràfica. @ca
toolkit definition: Manifestation qui consiste en un agrégat qui intègre une contribution par un agent consistant à fournir des mesures ou des relations dimensionnelles pour une aire géographique. @fr
toolkit definition: Manifestation, som er en samling, som omfatter en agents bidrag ved at angive målinger eller dimensionelle forhold for et geografisk område. @da
toolkit definition: Manifestazione che è un aggregato che comprende un contributo di un agente nel fornire misurazioni o rapporti dimensionali per un'area geografica. @it
toolkit definition: Manifestācija, kas ir apkopojums, kas ietver aģenta ieguldījumu, nodrošinot ģeogrāfisko apgabalu mērījumus vai dimensiju attiecības. @lv
toolkit definition: تجسيدة عبارة عن تجميعة تتضمن إسهام وكيل في قياس الأبعاد أو العلاقات المكانية لمنطقة جغرافية. @ar
toolkit definition: 作为一种合集、包括为一个地理区域提供测量或尺寸关系的一个行为者的贡献的一种载体表现 @zh-hans
toolkit label: Akteur als Landvermesserin/Landvermesser von @de
toolkit label: agent agrimensor de @ca
toolkit label: agent arpenteur de @fr
toolkit label: agent, som er landinspektør af @da
toolkit label: agrimensore agente di @it
toolkit label: földmérő ágense: @hu
toolkit label: ir topogrāfs (aģents) @lv
toolkit label: landmeter-actor van @nl
toolkit label: landmåler for (agent) @no
toolkit label: maamõõtja (tegija) kehastuses @et
toolkit label: maanmittari (toimija) manifestaatiossa
toolkit label: surveyor agent of @en
toolkit label: topograf temsilci @tr
toolkit label: τοπογράφος μηχανικός φορέας του @el
toolkit label: وكيل مساح @ar
toolkit label: ……的测绘者行为者 @zh-hans
has subproperty: maanmittari (henkilö) manifestaatiossa
has subproperty: maanmittari (yhteistoimija) manifestaatiossa
has subproperty: P50460
lexical alias: surveyorAgentOf.en
status: Published
type: Property
domain: C10002
label: Topograf temsilcisi @tr
label: er agent, som er landinspektør af @da
label: er landmåler for (agent) @no
label: est un agent arpenteur de @fr
label: földmérő ágense a következőnek: @hu
label: ir topogrāfs (aģents) @lv
label: is landmeter-actor van @nl
label: is surveyor agent of @en
label: ist Akteur als Landvermesserin/Landvermesser von @de
label: maamõõtja (tegija) kehastuses @et
label: è agrimensore agente di @it
label: és agent agrimensor de @ca
label: είναι τοπογράφος μηχανικός φορέας του @el
label: هو وكيل مسّاح لـ @ar
label: 是……的测绘者行为者 @zh-hans
sub property of: kartografiaan osallinen toimija manifestaatiossa
alternative label: Landvermesser von @de
alternative label: agrimensor de @ca
alternative label: agrimensore di @it
alternative label: arpenteur de @fr
alternative label: földmérője: @hu
alternative label: landmåler af @da
alternative label: landmåler av @no
alternative label: maamõõtja kehastuses @et
alternative label: maanmittarina manifestaatiossa
alternative label: surveyor of @en
alternative label: topograf @tr
alternative label: τοπογράφος μηχανικός του @el
alternative label: مسّاح لـ @ar
alternative label: ……的测绘者 @zh-hans
definition: Bir temsilciyi, bir coğrafi alan için ölçümler veya boyutsal ilişkiler sağlayan bir temsilcinin katkısını içeren bir topluluğun bir gösterimle ilişkilendirir. @tr
definition: Correla un agente a una manifestazione che è un aggregato che comprende un contributo di un agente nel fornire misure o rapporti dimensionali per un'area geografica. @it
definition: Hozzákapcsol egy ágenst egy aggregátum megjelenési formához, amely magában foglalja egy ágens közreműködését egy földrajzi terület mérésében vagy dimenziós összefüggéseinek szolgáltatásában. @hu
definition: Liittää toimijan manifestaatioon, joka on aggregaatti, jossa toimija on osallisena kartantekijänä maantieteellisen alueen mittojen tai mittasuhteiden tuottamisessa.
definition: Met un agent en relation avec une manifestation qui consiste en un agrégat qui intègre une contribution par un agent consistant à fournir des mesures ou des relations dimensionnelles pour une aire géographique. @fr
definition: Relaciona un agent amb una manifestació que és un agregat que inclou una contribució d’un agent proporcionant mesuraments o relacions dimensionals d’una àrea geogràfica. @ca
definition: Relateert een actor aan een manifestatie die een aggregaat is die omvat een bijdrage door een actor die levert maten of dimensionale verhoudingen voor een geografisch gebied. @nl
definition: Relaterer en agent til en manifestasjon som er et aggregat som inkluderer et bidrag fra en agent i form av å tilføre målinger eller størrelsesforhold for et geografisk område. @no
definition: Relaterer en agent til en manifestation, som er en samling, som omfatter en agents bidrag ved at angive målinger eller dimensionelle forhold for et geografisk område. @da

kartografiaan osallinen toimija manifestaatiossa
has element type: 2
instruction number: 18.5
toolkit definition: A manifestation that is an aggregate that embodies an expression of a cartographic work that is created by an agent. @en
toolkit definition: Bir temsilci tarafından oluşturulan bir kartografik eserin anlatımını somutlaştıran topluluk olan bir gösterim. @tr
toolkit definition: Een manifestatie die een aggregaat is die een expressie van een cartografisch werk verwezenlijkt dat gecreëerd is door een actor. @nl
toolkit definition: Egy aggregátum megjelenési forma, amely egy ágens által létrehozott kartográfiai mű kifejezési formáját testesíti meg. @hu
toolkit definition: Ein Aggregat (Manifestation), das eine Expression eines kartografischen Werks verkörpert, die ein Akteur erstellt hat. @de
toolkit definition: En manifestasjon som er et aggregat som realiserer et kartografisk verk skapt av en agent. @no
toolkit definition: Kehastus, mis on liitum, milles on teostatud tegija loodud kartograafilise teose väljendus. @et
toolkit definition: Manifestaatio, joka on aggregaatti, joka sisältää kartografisen teoksen ekspression, jonka toimija on luonut.
toolkit definition: Manifestació que és un agregat que materialitza una expressió d’una obra cartogràfica que és creada per un agent. @ca
toolkit definition: Manifestation qui consiste en un agrégat matérialisant une expression d’une œuvre cartographique créée par un agent. @fr
toolkit definition: Manifestation, som er en samling, som rummer et udtryk af et kartografisk værk, som er skabt af en agent. @da
toolkit definition: Manifestazione che è un aggregato che materializza un'opera cartografica creata da un agente. @it
toolkit definition: Manifestācija, kas ir apkopojums, kas ietver aģenta radītu kartogrāfijas darbu. @lv
toolkit definition: تجسيدة عبارة عن تجميعة تجسد عملا رسم خرائطي أنشأه وكيل. @ar
toolkit definition: 作为一种合集、把一个行为者所创作的一种地图绘制作品的内容表达具体化的一种载体表现 @zh-hans
toolkit label: Akteur als Beiträgerin/Beiträger von einer Kartografie von @de
toolkit label: agent contributeur de cartographie de @fr
toolkit label: agent contribuïdor de cartografia de @ca
toolkit label: agent, som er bidragsyder til kartografi af @da
toolkit label: bidragsyter til kartografi for (agent) @no
toolkit label: bijdrager-actor van cartografie van @nl
toolkit label: contributor agent of cartography of @en
toolkit label: contributore agente di cartografia di @it
toolkit label: ir kartogrāfijas līdzradītās (aģents) @lv
toolkit label: kaastööline kartograafia alal (tegija) kehastuses @et
toolkit label: kartografiaan osallinen toimija manifestaatiossa
toolkit label: kartografyaya katkıda bulunan temsilci @tr
toolkit label: közreműködő ágense a következő kartográfiának: @hu
toolkit label: συντελεστής φορέας της χαρτογράφησης του @el
toolkit label: وكيل مساهم في رسم خرائط @ar
toolkit label: ……的地图绘制的贡献者行为者 @zh-hans
has subproperty: maanmittari (toimija) manifestaatiossa
has subproperty: kartografiaan osallinen henkilö manifestaatiossa
has subproperty: kartografiaan osallinen yhteistoimija manifestaatiossa
has subproperty: P50463
lexical alias: contributorAgentOfCartographyOf.en
status: Published
type: Property
domain: C10002
label: er agent, som er bidragsyder til kartografi af @da
label: er bidragsyter til kartografi for (agent) @no
label: est un agent contributeur de cartographie de @fr
label: ir kartogrāfijas līdzradītās (aģents) @lv
label: is bijdrager-actor van cartografie van @nl
label: is contributor agent of cartography of @en
label: ist Akteur als Beiträgerin/Beiträger von einer Kartografie von @de
label: kaastööline kartograafia alal (tegija) kehastuses @et
label: kartografisinin katkıda bulunan temsilcisidir @tr
label: közreműködő ágense a következő kartográfiának: @hu
label: è contributore agente di cartografia di @it
label: és agent contribuïdor de cartografia de @ca
label: είναι συντελεστής φορέας της χαρτογράφησης του @el
label: هو وكيل مساهم في رسم خرائط لـ @ar
label: 是……的地图绘制的贡献者行为者 @zh-hans
sub property of: aggregaattiin osallinen toimija manifestaatiossa
alternative label: Kartograf (Expression) von @de
alternative label: cartographe (expression) de @fr
alternative label: cartographer (expression) of @en
alternative label: cartògraf (expressió) de @ca
alternative label: cartógrafo (expresión) de @es
alternative label: kartantekijä (ekspressio) manifestaatiossa
alternative label: kartograf (anlatım) @tr
alternative label: kartograf (udtryk) af @da
alternative label: térképésze a következőnek (kifejezési forma): @hu
alternative label: ……的地图绘制者（内容表达） @zh-hans
definition: Bir temsilciyi, temsilci tarafından oluşturulan kartografik bir eserin anlatımını somutlaştıran topluluğun bir gösterimiyle ilişkilendirir. @tr
definition: Correla un agente a una manifestazione che è un aggregato che materializza un'opera cartografica creata da un agente. @it
definition: Hozzákapcsol egy ágenst egy aggregátum megjelenési formához, amely egy ágens által létrehozott kartográfiai mű kifejezési formáját testesíti meg. @hu
definition: Liittää toimijan manifestaatioon, joka on aggregaatti, joka sisältää kartografisen teoksen ekspression, jonka toimija on luonut.
definition: Met un agent en relation avec une manifestation qui consiste en un agrégat matérialisant une expression d’une œuvre cartographique créée par un agent. @fr
definition: Relaciona un agent amb una manifestació que és un agregat que materialitza una expressió d’una obra cartogràfica que és creada per un agent. @ca
definition: Relateert een actor aan een manifestatie die een aggregaat is die een expressie van een cartografisch werk verwezenlijkt dat gecreëerd is door een actor. @nl
definition: Relaterer en agent til en manifestasjon som er et aggregat som realiserer et kartografisk verk skapt av en agent. @no
definition: Relaterer en agent til en manifestation, som er en samling, som rummer et udtryk af et kartografisk værk, som er skabt af en agent. @da
definition: Relates an agent to a manifestation that is an aggregate that embodies an expression of a cartographic work that is created by an agent. @en
definition: Sasaista aģentu ar manifestāciju, kas ir apkopojums, kas ietver aģenta radītu kartogrāfijas darbu. @lv
definition: Seostab tegija kehastusega, mis on liitum, milles on teostatud tegija loodud kartograafilise teose väljendus. @et

koreografiaan osallinen toimija manifestaatiossa
has element type: 2
instruction number: 18.5
toolkit definition: A manifestation that is an aggregate that embodies an expression of a choreographic work that is created by an agent. @en
toolkit definition: Bir temsilci tarafından oluşturulan bir koreografik eserin anlatımını somutlaştıran topluluk olan bir gösterim. @tr
toolkit definition: Een manifestatie die een aggregaat is die een expressie van een choreografisch werk verwezenlijkt dat gecreëerd is door een actor. @nl
toolkit definition: Egy aggregátum megjelenési forma, amely egy ágens által létrehozott koreografikus mű kifejezési formáját testesíti meg. @hu
toolkit definition: Ein Aggregat (Manifestation), das eine Expression eines choreografischen Werks verkörpert, die ein Akteur erstellt hat. @de
toolkit definition: En manifestasjon som er et aggregat som realiserer et koreografisk verk skapt av en agent. @no
toolkit definition: Kehastus, mis on liitum, milles on teostatud tegija loodud koreograafilise teose väljendus. @et
toolkit definition: Manifestaatio, joka on aggregaatti, joka sisältää koreografisen teoksen ekspression, jonka toimija on luonut.
toolkit definition: Manifestació que és un agregat que materialitza una expressió que és una obra coreogràfica que és creada per un agent. @ca
toolkit definition: Manifestation qui consiste en un agrégat matérialisant une expression d’une œuvre chorégraphique créée par un agent. @fr
toolkit definition: Manifestation, som er en samling, som rummer et udtryk af et koreografisk værk, som er skabt af en agent. @da
toolkit definition: Manifestazione che è un aggregato che materializza un'opera coreografica creata da un agente. @it
toolkit definition: Manifestācija, kas ir apkopojums, kas ietver aģenta radītu horeogrāfijas darbu. @lv
toolkit definition: تجسيدة عبارة عن تجميعة تجسد عملا راقصا أنشأه وكيل. @ar
toolkit definition: 作为一种合集、把一个行为者所创作的一种编舞作品的内容表达具体化的一种载体表现 @zh-hans
toolkit label: Akteur als Beiträgerin/Beiträger von einer Choreografie von @de
toolkit label: agent contributeur de chorégraphie de @fr
toolkit label: agent contribuïdor de coreografia de @ca
toolkit label: agent, som er bidragsyder til koreografi af @da
toolkit label: bidragsyter til koreografi for (agent) @no
toolkit label: bijdrager-actor van choreografie van @nl
toolkit label: contributor agent of choreography of @en
toolkit label: contributore agente di coreografia di @it
toolkit label: ir heoreogrāfijas līdzradītājs (aģents) @lv
toolkit label: kaastööline koreograafia alal (tegija) kehastuses @et
toolkit label: koreografiaan osallinen toimija manifestaatiossa
toolkit label: koreografiye katkıda bulunan temsilci @tr
toolkit label: közreműködő ágense a következő koreográfiának: @hu
toolkit label: συντελεστής φορέας της χορογραφίας του @el
toolkit label: وكيل مساهم في رقص @ar
toolkit label: ……的编舞的贡献者行为者 @zh-hans
has subproperty: koreografiaan osallinen henkilö manifestaatiossa
has subproperty: koreografiaan osallinen yhteistoimija manifestaatiossa
has subproperty: P50464
lexical alias: contributorAgentOfChoreographyOf.en
status: Published
type: Property
domain: C10002
label: er agent, som er bidragsyder til koreografi af @da
label: er bidragsyter til koreografi for (agent) @no
label: est un agent contributeur de chorégraphie de @fr
label: ir heoreogrāfijas līdzradītājs (aģents) @lv
label: is bijdrager-actor van choreografie van @nl
label: is contributor agent of choreography of @en
label: ist Akteur als Beiträgerin/Beiträger von einer Choreografie von @de
label: kaastööline koreograafia alal (tegija) kehastuses @et
label: koreografisinin katkıda bulunan temsilcisidir @tr
label: közreműködő ágense a következő koreográfiának:: @hu
label: è contributore agente di coreografia di @it
label: és agent contribuïdor de coreografia de @ca
label: είναι συντελεστής φορέας της χορογραφίας του @el
label: هو وكيل مساهم في رقص لـ @ar
label: 是……的编舞的贡献者行为者 @zh-hans
sub property of: aggregaattiin osallinen toimija manifestaatiossa
definition: Bir temsilciyi, temsilci tarafından oluşturulan koreografik bir eserin anlatımını somutlaştıran topluluğun bir gösterimiyle ilişkilendirir. @tr
definition: Correla un agente a una manifestazione che è un aggregato che materializza un'opera coreografica creata da un agente. @it
definition: Hozzákapcsol egy ágenst egy aggregátum megjelenési formához, amely egy ágens által létrehozott koreografikus mű kifejezési formáját testesíti meg. @hu
definition: Liittää toimijan manifestaatioon, joka on aggregaatti, joka sisältää koreografisen teoksen ekspression, jonka toimija on luonut.
definition: Met un agent en relation avec une manifestation qui consiste en un agrégat matérialisant une expression d’une œuvre chorégraphique créée par un agent. @fr
definition: Relaciona un agent amb una manifestació que és un agregat que materialitza una expressió que és una obra coreogràfica que és creada per un agent. @ca
definition: Relateert een actor aan een manifestatie die een aggregaat is die een expressie van een choreografisch werk verwezenlijkt dat gecreëerd is door een actor. @nl
definition: Relaterer en agent til en manifestasjon som er et aggregat som realiserer et koreografisk verk skapt av en agent. @no
definition: Relaterer en agent til en manifestation, som er en samling, som rummer et udtryk af et koreografisk værk, som er skabt af en agent. @da
definition: Relates an agent to a manifestation that is an aggregate that embodies an expression of a choreographic work that is created by an agent. @en
definition: Sasaista aģentu ar manifestāciju, kas ir apkopojums, kas ietver aģenta radītu horeogrāfijas darbu. @lv
definition: Seostab tegija kehastusega, mis on liitum, milles on teostatud tegija loodud koreograafilise teose väljendus. @et
definition: Setzt einen Akteur in Beziehung zu einem Aggregat (Manifestation), das eine Expression eines choreografischen Werks verkörpert, die ein Akteur erstellt hat. @de
definition: يربط وكيلا بتجسيدة عبارة عن تجميعة تجسد عملا راقص أنشأه وكيل @ar
definition: 将一个行为者与作为一种合集、把一个行为者所创作的一种编舞作品的内容表达具体化的一种载体表现关联起来。 @zh-hans

stillkuvaan osallinen toimija manifestaatiossa
has element type: 2
instruction number: 18.5
toolkit definition: A manifestation that is an aggregate that embodies an expression of a still image work that is created by an agent. @en
toolkit definition: Bir temsilci tarafından oluşturulan hareketsiz bir görüntü eserinin anlatımını somutlaştıran topluluk olan bir gösterim. @tr
toolkit definition: Een manifestatie die een aggregaat is die een expressie van een stilstaand beeldwerk verwezenlijkt dat gecreëerd is door een actor. @nl
toolkit definition: Egy aggregátum megjelenési forma, amely egy ágens által létrehozott állóképmű kifejezési formáját testesíti meg. @hu
toolkit definition: Ein Aggregat (Manifestation), das eine Expression eines unbewegten Bildwerks verkörpert, die ein Akteur erstellt hat. @de
toolkit definition: En manifestasjon som er et aggregat som realiserer et blideverk skapt av en agent. @no
toolkit definition: Kehastus, mis on liitum, milles on teostatud tegija loodud liikumatust pildist koosneva teose väljendus. @et
toolkit definition: Manifestaatio, joka on aggregaatti, joka sisältää stillkuvateoksen ekspression, jonka toimija on luonut.
toolkit definition: Manifestació que és un agregat que materialitza una obra d’imatge fixa creada per un agent. @ca
toolkit definition: Manifestation qui consiste en un agrégat matérialisant une expression d’une œuvre d’image fixe créée par un agent. @fr
toolkit definition: Manifestation, som er en samling, som rummer et udtryk af et værk med stillbilleder, som er skabt af en agent. @da
toolkit definition: Manifestazione che è un aggregato che materializza un'immagine fissa creata da un agente. @it
toolkit definition: Manifestācija, kas ir apkopojums, kas ietver aģenta radītu attēla darbu. @lv
toolkit definition: تجسيدة عبارة عن تجميعة تجسد عملا اصور ثابتة أنشأه وكيل. @ar
toolkit definition: 作为一种合集、把一个行为者所创作的一种静态图像作品的内容表达具体化的一种载体表现 @zh-hans
toolkit label: Akteur als Illustratorin/Illustrator von @de
toolkit label: agent contributeur d’image fixe de @fr
toolkit label: agent contribuïdor d’imatge fixa de @ca
toolkit label: agent, som er bidragsyder til stillbillede af @da
toolkit label: bidragsyter til bilde for (agent) @no
toolkit label: bijdrager-actor van stilstaand beeld van @nl
toolkit label: contributor agent of still image of @en
toolkit label: contributore agente di immagine fissa di @it
toolkit label: hareketsiz görüntüye katkıda bulunan temsilci @tr
toolkit label: ir attēla līdzradītājs (aģents) @lv
toolkit label: kaastööline liikumatu pildi alal (tegija) kehastuses @et
toolkit label: közreműködő ágense a következő állóképnek: @hu
toolkit label: stillkuvaan osallinen toimija manifestaatiossa
toolkit label: συντελεστής φορέας της σταθερής εικόνας του @el
toolkit label: وكيل مساهم في صور ثابتة @ar
toolkit label: ……的静态图像的贡献者行为者 @zh-hans
has subproperty: stillkuvaan osallinen henkilö manifestaatiossa
has subproperty: stillkuvaan osallinen yhteistoimija manifestaatiossa
has subproperty: P50469
lexical alias: contributorAgentOfStillImageOf.en
status: Published
type: Property
domain: C10002
label: durağan görüntüsüne katkıda bulunan temsilcisidir @tr
label: er agent, som er bidragsyder til stillbillede af @da
label: er bidragsyter til bilde for (agent) @no
label: est un agent contributeur d’image fixe de @fr
label: ir attēla līdzradītājs (aģents) @lv
label: is bijdrager-actor van stilstaand beeld van @nl
label: is contributor agent of still image of @en
label: ist Akteur als Illustratorin/Illustrator von @de
label: kaastööline liikumatu pildi alal (tegija) kehastuses @et
label: közreműködő ágense a következő állóképnek: @hu
label: è contributore agente di immagine fissa di @it
label: és agent contribuïdor d’imatge fixa de @ca
label: είναι συντελεστής φορέας της σταθερής εικόνας του @el
label: هو وكيل مساهم في صور ثابتة لـ @ar
label: 是……的静态图像的贡献者行为者 @zh-hans
sub property of: aggregaattiin osallinen toimija manifestaatiossa
alternative label: Fotograf (Expression) von @de
alternative label: durağan görüntüsünün katkı sağlayan temsilcisidir @tr
alternative label: fotograf (udtryk) af @da
alternative label: fotoğrafçısı (anlatım) @tr
alternative label: fotógrafo (expresión) de @es
alternative label: fényképésze a következőnek (kifejezési forma): @hu
alternative label: illustrateur de @fr
alternative label: illustrator of @en
alternative label: illustratore di @it
alternative label: illustratør av @no
alternative label: illustreerija kehastuses @et
alternative label: illusztrátora: @hu
alternative label: ilustrador de @es
alternative label: photographe (expression) de @fr
alternative label: photographer (expression) of @en
alternative label: εικονογράφος του @el
alternative label: رسام صور إيضاحية لـ @ar
alternative label: ……的插图者 @zh-hans
alternative label: ……的摄影者（内容表达） @zh-hans
definition: Bir temsilciyi, temsilci tarafından oluşturulan bir durağan gösrüntü eserinin anlatımını somutlaştıran bir topluluğun gösterimiyle ilişkilendirir. @tr
definition: Correla un agente a una manifestazione che è un aggregato che materializza un'immagine fissa creata da un agente. @it
definition: Hozzákapcsol egy ágenst egy aggregátum megjelenési formához, amely egy ágens által létrehozott állóképmű kifejezési formáját testesíti meg. @hu
definition: Liittää toimijan manifestaatioon, joka on aggregaatti, joka sisältää stillkuvateoksen ekspression, jonka toimija on luonut.

liikkuvaan kuvaan osallinen toimija manifestaatiossa
has element type: 2
instruction number: 18.5
toolkit definition: A manifestation that is an aggregate that embodies an expression of a moving image work that is created by an agent. @en
toolkit definition: Bir temsilci tarafından oluşturulan hareketli bir görüntü eserinin anlatımını somutlaştıran topluluk olan bir gösterim. @tr
toolkit definition: Een manifestatie die een aggregaat is die een expressie van een bewegend beeldwerk verwezenlijkt dat gecreëerd is door een actor. @nl
toolkit definition: Egy aggregátum megjelenési forma, amely egy ágens által létrehozott mozgóképmű kifejezési formáját testesíti meg. @hu
toolkit definition: Ein Aggregat (Manifestation), das eine Expression eines Bewegtbildwerks verkörpert, die ein Akteur erstellt hat. @de
toolkit definition: En manifestasjon som er et aggregat som realiserer et verk med levende bilder skapt av en agent. @no
toolkit definition: Kehastus, mis on liitum, milles on teostatud tegija loodud liikuvast pildist koosneva teose väljendus. @et
toolkit definition: Manifestaatio, joka on aggregaatti, joka sisältää liikkuvan kuvan teoksen ekspression, jonka toimija on luonut.
toolkit definition: Manifestació que és un agregat que materialitza una expressió d’una obra d’imatge en moviment que és creada per un agent. @ca
toolkit definition: Manifestation qui consiste en un agrégat matérialisant une expression d’une œuvre d’images animées créée par un agent. @fr
toolkit definition: Manifestation, som er en samling, som rummer et udtryk af et værk med levende billeder, som er skabt af en agent. @da
toolkit definition: Manifestazione che è un aggregato che materializza un'immagine in movimento creata da un agente. @it
toolkit definition: Manifestācija, kas ir apkopojums, kas ietver aģenta radītu kustīga attēla darbu. @lv
toolkit definition: تجسيدة عبارة عن تجميعة تجسد عمل صور متحركة أنشأه وكيل. @ar
toolkit definition: 作为一种合集、把一个行为者所创作的一种动态图像作品的内容表达具体化的一种载体表现 @zh-hans
toolkit label: Akteur als Beiträgerin/Beiträger von einem Bewegtbild von @de
toolkit label: agent contributeur d’images animées de @fr
toolkit label: agent contribuïdor d’imatge en moviment de @ca
toolkit label: agent, som er bidragsyder til levende billede af @da
toolkit label: bidragsyter til levende bilder for (agent) @no
toolkit label: bijdrager-actor van bewegend beeld van @nl
toolkit label: contributor agent of moving image of @en
toolkit label: contributore agente di immagine in movimento di @it
toolkit label: hareketli görüntüye katkıda bulunan temsilci @tr
toolkit label: ir kustīgu attēlu līdzradītājs (aģents) @lv
toolkit label: kaastööline liikuva pildi alal (tegija) kehastuses @et
toolkit label: közreműködő ágense a következő mozgóképnek: @hu
toolkit label: liikkuvaan kuvaan osallinen toimija manifestaatiossa
toolkit label: συντελεστής φορέας της κινητής εικόνας του @el
toolkit label: وكيل مساهم في صور متحركة @ar
toolkit label: ……的动态图像的贡献者行为者 @zh-hans
has subproperty: liikkuvaan kuvaan osallinen henkilö manifestaatiossa
has subproperty: liikkuvaan kuvaan osallinen yhteistoimija
has subproperty: P50474
lexical alias: contributorAgentOfMovingImageOf.en
status: Published
type: Property
domain: C10002
label: er agent, som er bidragsyder til levende billede af @da
label: er bidragsyter til levende bilder for (agent) @no
label: est un agent contributeur d’images animées de @fr
label: hareketli görüntüsünün katkıda bulunan temsilcisidir @tr
label: ir kustīgu attēlu līdzradītājs (aģents) @lv
label: is bijdrager-actor van bewegend beeld van @nl
label: is contributor agent of moving image of @en
label: ist Akteur als Beiträgerin/Beiträger von einem Bewegtbild von @de
label: kaastööline liikuva pildi alal (tegija) kehastuses @et
label: közreműködő ágense a következő mozgóképnek: @hu
label: è contributore agente di immagine in movimento di @it
label: és agent contribuïdor d’imatge en moviment de @ca
label: είναι συντελεστής φορέας της κινητής εικόνας του @el
label: هو وكيل مساهم في صور متحركة لـ @ar
label: 是……的动态图像的贡献者行为者 @zh-hans
sub property of: aggregaattiin osallinen toimija manifestaatiossa
definition: Bir temsilciyi, temsilci tarafından oluşturulan hareketli görüntü eserinin anlatımını somutlaştıran topluluğun bir gösterimiyle ilişkilendirir. @tr
definition: Correla un agente a una manifestazione che è un aggregato che materializza un'immagine in movimento creata da un agente. @it
definition: Hozzákapcsol egy ágenst egy aggregátum megjelenési formához, amely egy ágens által létrehozott mozgóképmű kifejezési formáját testesíti meg. @hu
definition: Liittää toimijan manifestaatioon, joka on aggregaatti, joka sisältää liikkuvan kuvan teoksen ekspression, jonka toimija on luonut.
definition: Met un agent en relation avec une manifestation qui consiste en un agrégat matérialisant une expression d’une œuvre d’images animées créée par un agent. @fr
definition: Relaciona un agent amb una manifestació que és un agregat que materialitza una expressió d’una obra d’imatge en moviment que és creada per un agent. @ca
definition: Relateert een actor aan een manifestatie die een aggregaat is die een expressie van een bewegend beeldwerk verwezenlijkt dat gecreëerd is door een actor. @nl
definition: Relaterer en agent til en manifestasjon som er et aggregat som realiserer et verk med levende bilder skapt av en agent. @no
definition: Relaterer en agent til en manifestation, som er en samling, som rummer et udtryk af et værk med levende billeder, som er skabt af en agent. @da
definition: Relates an agent to a manifestation that is an aggregate that embodies an expression of a moving image work that is created by an agent. @en
definition: Sasaista aģentu ar manifestāciju, kas ir apkopojums, kas ietver aģenta radītu kustīga attēla darbu. @lv
definition: Seostab tegija kehastusega, mis on liitum, milles on teostatud tegija loodud liikuvast pildist koosneva teose väljendus. @et
definition: Setzt einen Akteur in Beziehung zu einem Aggregat (Manifestation), das eine Expression eines Bewegtbildwerks verkörpert, die ein Akteur erstellt hat. @de
definition: يربط وكيلا بتجسيدة عبارة عن تجميعة تجسد عمل صور متحركة أنشأه وكيل. @ar
definition: 将一个行为者与作为一种合集、把一个行为者所创作的一种动态图像作品的内容表达具体化的一种载体表现关联起来。 @zh-hans

tekstiin osallinen toimija manifestaatiossa
has element type: 2
toolkit definition: A manifestation that is an aggregate that embodies an expression of a textual work that is created by an agent. @en
toolkit definition: Bir temsilci tarafından oluşturulan metinsel bir eserin anlatımını somutlaştıran topluluk olan bir gösterim. @tr
toolkit definition: Een manifestatie die een aggregaat is die een expressie van een tekstwerk verwezenlijkt dat gecreëerd is door een actor. @nl
toolkit definition: Egy aggregátum megjelenési forma, amely az ágens által létrehozott szöveges művet testesíti meg. @hu
toolkit definition: Ein Aggregat (Manifestation), das eine Expression eines textlichen Werks verkörpert, die ein Akteur erstellt hat. @de
toolkit definition: En manifestasjon som er et aggregat som realiserer et tekstlig verk skapt av en agent. @no
toolkit definition: Kehastus, mis on liitum, milles on teostatud tegija loodud tekstteose väljendus. @et
toolkit definition: Manifestaatio, joka on aggregaatti, joka sisältää tekstiteoksen ekspression, jonka toimija on luonut.
toolkit definition: Manifestació que és un agregat que materialitza una expressió d’una obra textual que és creada per un agent. @ca
toolkit definition: Manifestation qui consiste en un agrégat matérialisant une expression d’une œuvre textuelle créée par un agent. @fr
toolkit definition: Manifestation, som er en samling, som rummer et udtryk af et tekstværk, som er skabt af en agent. @da
toolkit definition: Manifestazione che è un aggregato che materializza un'opera testuale creata da un agente. @it
toolkit definition: Manifestācija, kas ir apkopojums, kas ietver aģenta radītu teksta darbu. @lv
toolkit definition: تجسيدة تمثل تجميعة تجسد عملا نصيا أنشأه وكيل. @ar
toolkit definition: 作为一种合集、把一个行为者所创作的一种文字作品的内容表达具体化的一种载体表现 @zh-hans
toolkit label: Akteur als Beiträgerin/Beiträger von ergänzendem Text von @de
toolkit label: a következő szöveg közreműködő ágense: @hu
toolkit label: agent contributeur de texte de @fr
toolkit label: agent contribuïdor de text de @ca
toolkit label: agent, som er bidragsyder til tekst af @da
toolkit label: bidragsyter til tekst for (agent) @no
toolkit label: bijdrager-actor van tekst van @nl
toolkit label: contributor agent of text of @en
toolkit label: contributore agente di testo di @it
toolkit label: ir teksta līdzradītājs (aģents) @lv
toolkit label: metne katkıda bulunan temsilci @tr
toolkit label: tekstiin osallinen toimija manifestaatiossa
toolkit label: tekstiloome kaastööline (tegija) kehastuses @et
toolkit label: συντελεστής φορέας του κειμένου του @el
toolkit label: وكيل مساهم في نص @ar
toolkit label: ……的文本的贡献者行为者 @zh-hans
has subproperty: tekstiin osallinen henkilö manifestaatiossa
has subproperty: tekstiin osallinen yhteistoimija manifestaatiossa
has subproperty: P50475
lexical alias: contributorAgentOfTextOf.en
status: Published
type: Property
domain: C10002
label: er agent, som er bidragsyder til tekst af @da
label: er bidragsyter til tekst for (agent) @no
label: est un agent contributeur de texte de @fr
label: ir teksta līdzradītājs (aģents) @lv
label: is bijdrager-actor van tekst van @nl
label: is contributor agent of text of @en
label: ist Akteur als Beiträgerin/Beiträger von ergänzendem Text von @de
label: közreműködő ágense a következő szövegnek: @hu
label: metninin katkıda bulunan temsilcisidir @tr
label: tekstiloome kaastööline (tegija) kehastuses @et
label: è contributore agente di testo di @it
label: és agent contribuïdor de text de @ca
label: είναι συντελεστής φορέας του κειμένου του @el
label: هو وكيل مساهم في نص لـ @ar
label: 是……的文本的贡献者行为者 @zh-hans
sub property of: aggregaattiin osallinen toimija manifestaatiossa
alternative label: Verfasserin/Verfasser eines Vorworts von @de
alternative label: a következő bevezetés írója: @hu
alternative label: a következő hozzáadott dalszöveg írója: @hu
alternative label: a következő hozzáadott kommentár írója: @hu
alternative label: a következő hozzáadott szöveg írója: @hu
alternative label: a következő kiegészítő szöveges tartalom írója: @hu
alternative label: a következő szerzői előszó írója: @hu
alternative label: a következő szerzői utószó írója: @hu
alternative label: auteur de commentaire ajouté de @fr
alternative label: auteur de contenu textuel supplémentaire de @fr
alternative label: auteur de paroles ajoutées de @fr
alternative label: auteur de texte ajouté de @fr
alternative label: auteur d’après-propos de @fr
alternative label: auteur d’avant-propos de @fr
alternative label: auteur d’introduction de @fr
alternative label: eessõna autor kehastuses @et
alternative label: eklenen metnin yazarı @tr
alternative label: eklenen sözlerin yazarı @tr
alternative label: eklenen yorum yazarı @tr
alternative label: előszóírója: @hu
alternative label: escritor de comentarios añadidos de @es
alternative label: escritor de introducción de @es
alternative label: escritor de letras añadidas de @es
alternative label: escritor de texto añadido de @es

aggregaattiin osallinen toimija manifestaatiossa
has element type: 2
toolkit definition: A manifestation that is an aggregate that embodies an expression of a work that is created by an agent. @en
toolkit definition: Bir temsilci tarafından oluşturulan bir eserin anlatımını somutlaştıran topluluk olan bir gösterim. @tr
toolkit definition: Een manifestatie die een aggregaat is die een expressie van een werk verwezenlijkt dat gecreëerd is door een actor. @nl
toolkit definition: Egy aggregátum megjelenési forma, amely egy ágens által létrehozott mű kifejezési formáját testesíti meg. @hu
toolkit definition: Ein Aggregat (Manifestation), das eine Expression eines Werks verkörpert, die ein Akteur erstellt hat. @de
toolkit definition: En manifestasjon som er et aggregat som inkluderer et bidrag fra en agent. @no
toolkit definition: Kehastus, mis on liitum, milles on teostatud tegija loodud teose väljendus. @et
toolkit definition: Manifestaatio, joka on aggregaatti, joka sisältää teoksen ekspression, jonka toimija on luonut.
toolkit definition: Manifestació que és un agregat que materialitza una expressió d’una obra que és creada per un agent. @ca
toolkit definition: Manifestation qui consiste en un agrégat matérialisant une expression d’une œuvre créée par un agent. @fr
toolkit definition: Manifestation, som er en samling, som omfatter et udtryk af et værk, der er skabt af en agent. @da
toolkit definition: Manifestazione che è un aggregato che comprende un contributo di un agente. @it
toolkit definition: Manifestācija, kas ir apkopojums, kas ietver aģenta ieguldījumu/līdzdalību. @lv
toolkit definition: تجسيدة عبارة عن تجميعة تجسد تعبيرة لعمل أنشأه وكيل. @ar
toolkit definition: 作为一种合集、把一个行为者所创作的一种作品的内容表达具体化的一种载体表现 @zh-hans
toolkit label: Akteur als Beiträgerin/Beiträger zu einem Aggregat von @de
toolkit label: agent contributeur à un agrégat de @fr
toolkit label: agent contribuïdor a un agregat de @ca
toolkit label: agent, som er bidragsyder til samling af @da
toolkit label: aggregaattiin osallinen toimija manifestaatiossa
toolkit label: bidragsyter til aggregat for (agent) @no
toolkit label: bijdrager-actor aan aggregaat van @nl
toolkit label: contributor agent to aggregate of @en
toolkit label: contributore agente di aggregato di @it
toolkit label: ir apkopojuma līdzradītājs (aģents) @lv
toolkit label: közreműködő ágense a következő aggregátumnak: @hu
toolkit label: liitumi kaastööline (tegija) kehastuses @et
toolkit label: topluluğa katkıda bulunan temsilci @tr
toolkit label: συντελεστής φορέας της συνάθροισης του @el
toolkit label: وكيل مساهم في تجميع @ar
toolkit label: ……的合集的贡献者行为者 @zh-hans
has subproperty: musiikkiin osallinen toimija manifestaatiossa
has subproperty: kartografiaan osallinen toimija manifestaatiossa
has subproperty: koreografiaan osallinen toimija manifestaatiossa
has subproperty: stillkuvaan osallinen toimija manifestaatiossa
has subproperty: liikkuvaan kuvaan osallinen toimija manifestaatiossa
has subproperty: tekstiin osallinen toimija manifestaatiossa
has subproperty: puheeseen osallinen toimija manifestaatiossa
has subproperty: esineeseen osallinen toimija manifestaatiossa
has subproperty: digitaaliseen sisältöön osallinen toimija manifestaatiossa
has subproperty: aggregaattiin osallinen henkilö manifestaatiossa
has subproperty: aggregaattiin osallinen yhteistoimija manifestaatiossa
has subproperty: P50476
lexical alias: contributorAgentToAggregateOf.en
status: Published
type: Property
domain: C10002
label: er agent, som er bidragsyder til samling af @da
label: er bidragsyter til aggregat for (agent) @no
label: est un agent contributeur à un agrégat de @fr
label: ir apkopojuma līdzradītājs (aģents) @lv
label: is bijdrager-actor aan aggregaat van @nl
label: is contributor agent to aggregate of @en
label: ist Akteur als Beiträgerin/Beiträger zu einem Aggregat von @de
label: közreműködő ágense a következő aggregátumnak: @hu
label: liitumi kaastööline (tegija) kehastuses @et
label: toplanmasına katkıda bulunan temsilcidir @tr
label: è contributore agente di aggregato di @it
label: és agent contribuïdor a un agregat de @ca
label: είναι συντελεστής φορέας της συνάθροισης του @el
label: هو وكيل مساهم في تجميعة لـ @ar
label: 是……的合集的贡献者行为者 @zh-hans
sub property of: toimijaan liittyvä manifestaatio
definition: Bir temsilciyi, temsilci tarafından oluşturuan bir eserin anlatımını somutlaştıran bir topluluğun gösterimiyle ilişkilendirir. @tr
definition: Correla un agente a una manifestazione che è un aggregato che comprende un contributo di un agente. @it
definition: Hozzákapcsol egy ágenst egy aggregátum megjelenési formához, amely egy ágens által létrehozott mű kifejezési formáját testesíti meg. @hu
definition: Liittää toimijan manifestaatioon, joka on aggregaatti, joka sisältää teoksen ekspression, jonka toimija on luonut.
definition: Met un agent en relation avec une manifestation qui consiste en un agrégat matérialisant une expression d’une œuvre créée par un agent. @fr
definition: Relaciona un agent amb una manifestació que és un agregat que materialitza una expressió d’una obra que és creada per un agent. @ca
definition: Relateert een actor aan een manifestatie die een aggregaat is die een expressie van een werk verwezenlijkt dat gecreëerd is door een actor. @nl
definition: Relaterer en agent til en manifestasjon som er et aggregat som inkluderer et bidrag fra en agent. @no
definition: Relaterer en agent til en manifestation, som er en samling, som omfatter et udtryk af et værk, der er skabt af en agent. @da
definition: Relates an agent to a manifestation that is an aggregate that embodies an expression of a work that is created by an agent. @en
definition: Sasaista aģentu ar manifestāciju, kas ir apkopojums, kas ietver aģenta ieguldījumu/līdzdalību. @lv
definition: Seostab tegija kehastusega, mis on liitum, milles on teostatud tegija loodud teose väljendus. @et
definition: Setzt einen Akteur in Beziehung zu einem Aggregat (Manifestation), das eine Expression eines Werks verkörpert, die ein Akteur erstellt hat. @de
definition: يربط وكيلا بتجسيدة عبارة عن تجميعة تتضمن إسهام وكيل. @ar
definition: 将一个行为者与作为一种合集、把一个行为者所创作的一种作品的内容表达具体化的一种载体表现关联起来。 @zh-hans

manifestaation tekijä (toimija) manifestaatiossa
has element type: 2
toolkit definition: A manifestation that involves a responsibility of an agent for creation. @en
toolkit definition: Een manifestatie die met zich meebrengt een verantwoordelijkheid van een actor voor creatie. @nl
toolkit definition: Egy megjelenési forma, amelyhez hozzátartozik egy ágens felelőssége a létrehozásért. @hu
toolkit definition: Eine Manifestation, bei der ein Akteur für die Erstellung verantwortlich ist. @de
toolkit definition: En manifestasjon som involverer ansvar for en agent i form av skapelse. @no
toolkit definition: Kehastus, mis sisaldab tegija vastutust kehastuse loomise eest. @et
toolkit definition: Manifestaatio, jonka luomisesta toimija on vastuussa.
toolkit definition: Manifestació que implica una responsabilitat d’un agent en la creació. @ca
toolkit definition: Manifestation qui comporte une responsabilité de la part d’un agent en ce qui concerne la création. @fr
toolkit definition: Manifestation, som involverer en agents ansvar for skabelse. @da
toolkit definition: Manifestazione che implica una responsabilità di un agente per la creazione. @it
toolkit definition: Manifestācija, kas ietver aģenta atbildību par radīšanu. @lv
toolkit definition: Yaratım için bir temsilcinin sorumluluğunu içeren bir gösterim. @tr
toolkit definition: تجسيدة تنطوي على مسئولية وكيل عن إنشاء عمل. @ar
toolkit definition: 涉及一个行为者的创作责任的一种载体表现 @zh-hans
toolkit label: Akteur als Mitwirkende/Mitwirkender an einer Manifestation von @de
toolkit label: agent creador d’una manifestació de @ca
toolkit label: agent créateur d’une manifestation de @fr
toolkit label: agent, som er ophav til manifestation af @da
toolkit label: creator agent of manifestation of @en
toolkit label: creatore agente di manifestazione di @it
toolkit label: gösterimin yaratıcı temsilcisi @tr
toolkit label: ir radītājs (aģents) manifestācijai @lv
toolkit label: kehastuse teostaja (tegija) kehastuses @et
toolkit label: létrehozó ágense a következő megjelenési formának: @hu
toolkit label: maker-actor van manifestatie van @nl
toolkit label: manifestaation tekijä (toimija) manifestaatiossa
toolkit label: skaper av manifestasjon for (agent) @no
toolkit label: δημιουργός φορέας της εκδήλωσης του @el
toolkit label: وكيل منشئ تجسيدة لـ @ar
toolkit label: ……的载体表现的创建者行为者 @zh-hans
has subproperty: graafinen suunnittelija (toimija) manifestaatiossa
has subproperty: kuvalaatan valmistaja (toimija) manifestaatiossa
has subproperty: valaja (toimija) manifestaatiossa
has subproperty: painolaatan valmistaja (toimittaja) manifestaatiossa
has subproperty: julkaisemattoman manifestaation tuottaja (toimija) manifestaatiossa
has subproperty: kustantaja (toimija) manifestaatiossa
has subproperty: manifestaation tekijä (henkilö) manifestaatiossa
has subproperty: manifestaation tekijä (yhteistoimija) manifestaatiossa
has subproperty: P50477
lexical alias: creatorAgentOfManifestationOf.en
status: Published
type: Property
domain: C10002
label: er agent, som er ophav til manifestation af @da
label: er skaper av manifestasjon for (agent) @no
label: est un agent créateur d’une manifestation de @fr
label: gösteriminin yaratıcı temsilcisidir @tr
label: ir radītājs (aģents) manifestācijai @lv
label: is creator agent of manifestation of @en
label: is maker-actor van manifestatie van @nl
label: ist Akteur als Mitwirkende/Mitwirkender an einer Manifestation von @de
label: kehastuse teostaja (tegija) kehastuses @et
label: létrehozó ágense a következő megjelenési formának: @hu
label: è creatore agente di manifestazione di @it
label: és agent creador d’una manifestació de @ca
label: είναι δημιουργός φορέας της εκδήλωσης του @el
label: هو وكيل منشئ لتجسيدة لـ @ar
label: 是……的载体表现的创建者行为者 @zh-hans
sub property of: toimijaan liittyvä manifestaatio
alternative label: Mitwirkende/Mitwirkender an einer Manifestation von @de
alternative label: creador de la manifestación de @es
alternative label: creador d’una manifestació @ca
alternative label: creator of manifestation of @en
alternative label: creatore di manifestazione di @it
alternative label: créateur d’une manifestation de @fr
alternative label: gösterimin yaratıcısı @tr
alternative label: kehastuse teostaja kehastuses @et
alternative label: létrehozója a következő megjelenési formának: @hu
alternative label: manifestaation tekijä manifestaatiossa
alternative label: ophav til manifestation af @da
alternative label: skaper av manifestasjon for @no
alternative label: δημιουργός της εκδήλωσης του @el
alternative label: منشئ تجسيدة لـ @ar
alternative label: ……的载体表现的创建者 @zh-hans
definition: Bir temsilciyi, temsilcinin oluşturma sorumluluğunu içeren bir gösterimle ilişkilendirir. @tr
definition: Correla un agente a una manifestazione che implica una responsabilità di un agente per la creazione. @it
definition: Hozzákapcsol egy ágenst egy megjelenési formához, amelyhez hozzátartozik egy ágens felelőssége a létrehozásért. @hu

toimijaan liittyvä entiteetti
has element type: 1
toolkit definition: An entity that is associated with an agent. @en
toolkit definition: Bir temsilciyle bağlantılı olan bir varlık. @tr
toolkit definition: Een entiteit die is geassocieerd met een actor. @nl
toolkit definition: Egy entitás, amelyet egy ágenshez társítanak. @hu
toolkit definition: Eine Entität, die mit einem Akteur in Verbindung steht. @de
toolkit definition: En entitet som forbindes med en agent. @no
toolkit definition: Entitat que s’associa amb un agent. @ca
toolkit definition: Entiteetti, joka liittyy toimijaan.
toolkit definition: Entitet, som er knyttet til en agent. @da
toolkit definition: Entità associata a un agente. @it
toolkit definition: Entité qui est associée à un agent. @fr
toolkit definition: Entīte, kas saistīta ar aģentu. @lv
toolkit definition: Tegijaga seotud olem. @et
toolkit definition: كيان يكون مرتبطا بوكيل. @ar
toolkit definition: 和一个行为者有关的一个实体 @zh-hans
toolkit label: Mit Akteur in Beziehung stehende Entität @de
toolkit label: ar aģentu saistītā entīte @lv
toolkit label: entitat relacionada amb un agent @ca
toolkit label: entitet relateret til agent @da
toolkit label: entità correlata di agente @it
toolkit label: entité en relation avec un agent @fr
toolkit label: gerelateerde entiteit van actor @nl
toolkit label: related entity of agent @en
toolkit label: relatert entitet av agent @no
toolkit label: tegijaga seotud olem @et
toolkit label: temsilcinin ilişkili olduğu varlık @tr
toolkit label: toimijaan liittyvä entiteetti
toolkit label: ágens kapcsolódó entitása: @hu
toolkit label: σχετική οντότητα του φορέα @el
toolkit label: كيان مرتبط بوكيل @ar
toolkit label: 行为者的关联实体 @zh-hans
has subproperty: toimijaan liittyvä RDA-entiteetti
has subproperty: yhteistoimijaan liittyvä entiteetti
has subproperty: henkilöön liittyvä entiteetti
has subproperty: P50478
lexical alias: relatedEntityOfAgent.en
status: Published
type: Property
domain: C10002
label: a pour entité en relation avec un agent @fr
label: ar aģentu saistītā entīte @lv
label: ha come entità correlata di agente @it
label: har entitet relateret til agent @da
label: har relatert entitet av agent @no
label: has related entity of agent @en
label: hat mit Akteur in Beziehung stehende Entität @de
label: heeft gerelateerde entiteit van actor @nl
label: tegijaga seotud olem @et
label: temsilcinin ilgili varlığı ile ilişkilidir @tr
label: té com a entitat relacionada amb un agent @ca
label: ágens kapcsolódó entitása a következő: @hu
label: έχει σχετική οντότητα του φορέα @el
label: له كيان مرتبط بوكيل @ar
label: 有行为者的关联实体 @zh-hans
sub property of: P00028
definition: Bir temsilciyi, temsilciyle bağlantılı olan bir varlıkla ilişkilendirir. @tr
definition: Correla un agente a un'entità associata a un agente. @it
definition: Hozzákapcsol egy ágenst egy entitáshoz, amelyet egy ágenshez társítanak. @hu
definition: Liittää toimijan entiteettiin, joka liittyy toimijaan.
definition: Met un agent en relation avec une entité qui est associée à un agent. @fr
definition: Relaciona un agent amb una entitat que s’associa amb un agent. @ca
definition: Relateert een actor aan een entiteit die is geassocieerd met een actor. @nl
definition: Relaterer en agent til en entitet som forbindes med en agent. @no
definition: Relaterer en agent til en entitet, som er knyttet til en agent. @da
definition: Relates an agent to an entity that is associated with an agent. @en
definition: Sasaista aģentu ar entīti, kas saistīta ar aģentu. @lv
definition: Seostab tegija tegijaga seotud olemiga. @et
definition: Setzt einen Akteur in Beziehung zu einer Entität, die mit einem Akteur in Verbindung steht. @de
definition: يربط وكيلا بكيان مرتبط بوكيل. @ar
definition: 将一个行为者与和一个行为者有关的一个实体关联起来。 @zh-hans

yhteistoimijaan liittyvä entiteetti
has element type: 1
toolkit definition: An entity that is associated with a collective agent. @en
toolkit definition: Bir kolektif temsilciyle bağlantılı olan bir varlık. @tr
toolkit definition: Een entiteit die is geassocieerd met een collectieve actor. @nl
toolkit definition: Egy entitás, amelyet egy kollektív ágenshez társítanak. @hu
toolkit definition: Eine Entität, die mit einem gemeinschaftlichen Akteur in Verbindung steht. @de
toolkit definition: En entitet som forbindes med en kollektiv agent. @no
toolkit definition: Entitat que s’associa amb un agent col·lectiu. @ca
toolkit definition: Entiteetti, joka liittyy yhteistoimijaan.
toolkit definition: Entitet, som er knyttet til en kollektiv agent. @da
toolkit definition: Entità associata a un agente collettivo. @it
toolkit definition: Entité qui est associée à un agent collectif. @fr
toolkit definition: Entīte, kas saistīta ar grupu. @lv
toolkit definition: Kollektiiviga seotud olem. @et
toolkit definition: كيان مرتبط بوكيل جماعي. @ar
toolkit definition: 和一个集体行为者有关的一个实体 @zh-hans
toolkit label: Mit gemeinschaftlichem Akteur in Beziehung stehende Entität @de
toolkit label: ar grupu saistītā entīte @lv
toolkit label: entitat relacionada amb un agent col·lectiu @ca
toolkit label: entitet relateret til kollektiv agent @da
toolkit label: entità correlata di agente collettivo @it
toolkit label: entité en relation avec un agent collectif @fr
toolkit label: gerelateerde entiteit van collectieve actor @nl
toolkit label: kollektif temsilcinin ilişkili olduğu varlık @tr
toolkit label: kollektiiviga seotud olem @et
toolkit label: kollektív ágens kapcsolódó entitása a következő: @hu
toolkit label: related entity of collective agent @en
toolkit label: relatert entitet av kollektiv agent @no
toolkit label: yhteistoimijaan liittyvä entiteetti
toolkit label: σχετική οντότητα του συλλογικού φορέα @el
toolkit label: كيان مرتبط بوكيل جماعي @ar
toolkit label: 集体行为者的关联实体 @zh-hans
has subproperty: yhteistoimijaan liittyvä RDA-entiteetti
has subproperty: yhteisöön liittyvä entiteetti
has subproperty: sukuun liittyvä entiteetti
has subproperty: P50479
lexical alias: relatedEntityOfCollectiveAgent.en
status: Published
type: Property
domain: C10011
label: a pour entité en relation avec un agent collectif @fr
label: ar grupu saistītā entīte @lv
label: ha come entità correlata di agente collettivo @it
label: har entitet relateret til kollektiv agent @da
label: har relatert entitet av kollektiv agent @no
label: has related entity of collective agent @en
label: hat mit gemeinschaftlichem Akteur in Beziehung stehende Entität @de
label: heeft gerelateerde entiteit van collectieve actor @nl
label: kolektif temsilcinin ilgili varlığı ile ilişkilidir @tr
label: kollektiiviga seotud olem @et
label: kollektív ágens kapcsolódó entitása a következő: @hu
label: té com a entitat relacionada amb un agent col·lectiu @ca
label: έχει σχετική οντότητα του συλλογικού φορέα @el
label: له كيان مرتبط بوكيل جماعي @ar
label: 有集体行为者的关联实体 @zh-hans
sub property of: toimijaan liittyvä entiteetti
definition: Correla un agente collettivo a un'entità associata a un agente collettivo. @it
definition: Hozzákapcsol egy ágenst egy entitáshoz, amelyet egy kollektív ágenshez társítanak. @hu
definition: Kollektif bir temsilciyi, kollektif temsilciyle bağlantılı bir varlıkla ilişkilendirir. @tr
definition: Liittää yhteistoimijan entiteettiin, joka liittyy yhteistoimijaan.
definition: Met un agent collectif en relation avec une entité qui est associée à un agent collectif. @fr
definition: Relaciona un agent col·lectiu amb una entitat que s’associa amb un agent col·lectiu. @ca
definition: Relateert een collectieve actor aan een entiteit die is geassocieerd met een collectieve actor. @nl
definition: Relaterer en kollektiv agent til en entitet som forbindes med en kollektiv agent. @no
definition: Relaterer en kollektiv agent til en entitet, som er knyttet til en kollektiv agent. @da
definition: Relates a collective agent to an entity that is associated with a collective agent. @en
definition: Sasaista grupu ar entīti, kas saistīta ar grupu. @lv
definition: Seostab kollektiivi kollektiiviga seotud olemiga. @et
definition: Setzt einen gemeinschaftlichen Akteur in Beziehung zu einer Entität, die mit einem gemeinschaftlichen Akteur in Verbindung steht. @de
definition: يربط وكيلا جماعيا بكيان مرتبط بوكيل جماعي. @ar
definition: 将一个集体行为者与和一个集体行为者有关的一个实体关联起来。 @zh-hans

yhteisöön liittyvä entiteetti
has element type: 1
toolkit definition: An entity that is associated with a corporate body. @en
toolkit definition: Asutusega seotud olem. @et
toolkit definition: Bir tüzel kişilikle bağlantılı olan bir varlık. @tr
toolkit definition: Een entiteit die is geassocieerd met een corporatie. @nl
toolkit definition: Egy entitás, amelyet egy testülethez társítanak. @hu
toolkit definition: Eine Entität, die mit einer Körperschaft in Verbindung steht. @de
toolkit definition: En entitet som forbindes med en korporasjon. @no
toolkit definition: Entitat que s’associa amb una entitat corporativa. @ca
toolkit definition: Entiteetti, joka liittyy yhteisöön.
toolkit definition: Entitet, som er knyttet til en korporation. @da
toolkit definition: Entità associata a un ente. @it
toolkit definition: Entité qui est associée à une collectivité. @fr
toolkit definition: Entīte, kas saistīta ar institūciju. @lv
toolkit definition: كيان مرتبط بهيئة. @ar
toolkit definition: 和一个团体有关的一个实体 @zh-hans
toolkit label: Mit Körperschaft in Beziehung stehende Entität @de
toolkit label: ar institūciju saistītā entīte @lv
toolkit label: asutusega seotud olem @et
toolkit label: entitat relacionada amb una entitat corporativa @ca
toolkit label: entitet relateret til korporation @da
toolkit label: entità correlata di ente @it
toolkit label: entité en relation avec une collectivité @fr
toolkit label: gerelateerde entiteit van corporatie @nl
toolkit label: related entity of corporate body @en
toolkit label: relatert entitet av korporasjon @no
toolkit label: testület kapcsolódó entitása: @hu
toolkit label: tüzel kişiliğin ilişkili olduğu varlık @tr
toolkit label: yhteisöön liittyvä entiteetti
toolkit label: σχετική οντότητα του συλλογικού οργάνου @el
toolkit label: كيان مرتبط بهيئة @ar
toolkit label: 团体的关联实体 @zh-hans
has subproperty: yhteisöön liittyvä RDA-entiteetti
has subproperty: P50480
lexical alias: relatedEntityOfCorporateBody.en
status: Published
type: Property
domain: C10005
label: a pour entité en relation avec une collectivité @fr
label: ar institūciju saistītā entīte @lv
label: asutusega seotud olem @et
label: ha come entità correlata di ente @it
label: har entitet relateret til korporation @da
label: har relatert entitet av korporasjon @no
label: has related entity of corporate body @en
label: hat mit Körperschaft in Beziehung stehende Entität @de
label: heeft gerelateerde entiteit van corporatie @nl
label: testület kapcsolódó entitása következő: @hu
label: té com a entitat relacionada amb una entitat corporativa @ca
label: tüzel kişinin ilgili varlığı ile ilişkilidir @tr
label: έχει σχετική οντότητα του συλλογικού οργάνου @el
label: له كيان مرتبط بهيئة @ar
label: 有团体的关联实体 @zh-hans
sub property of: yhteistoimijaan liittyvä entiteetti
definition: Bir tüzel kişiyi, tüzel kişilikle bağlantılı kuruluşla ilişkilendirir. @tr
definition: Correla un ente a un'entità associata a un ente. @it
definition: Hozzákapcsol egy testületet egy entitáshoz, amelyet egy testülethez társítanak. @hu
definition: Liittää yhteisön entiteettiin, joka liittyy yhteisöön.
definition: Met une collectivité en relation avec une entité qui est associée à une collectivité. @fr
definition: Relaciona una entitat corporativa amb una entitat que s’associa amb una entitat corporativa. @ca
definition: Relateert een corporatie aan een entiteit die is geassocieerd met een corporatie. @nl
definition: Relaterer en korporasjon til en entitet som forbindes med en korporasjon. @no
definition: Relaterer en korporation til en entitet, som er knyttet til en korporation. @da
definition: Relates a corporate body to an entity that is associated with a corporate body. @en
definition: Sasaista institūciju ar entīti, kas saistīta ar institūciju. @lv
definition: Seostab asutuse asutusega seotud olemiga. @et
definition: Setzt eine Körperschaft in Beziehung zu einer Entität, die mit einer Körperschaft in Verbindung steht. @de
definition: يربط هيئة بكيان مرتبط بهيئة. @ar
definition: 将一个团体与和一个团体有关的一个实体关联起来。 @zh-hans

sukuun liittyvä entiteetti
has element type: 1
toolkit definition: An entity that is associated with a family. @en
toolkit definition: Bir aileyle bağlantılı olan bir varlık. @tr
toolkit definition: Een entiteit die is geassocieerd met een familie. @nl
toolkit definition: Egy entitás, amelyet egy családhoz társítanak. @hu
toolkit definition: Eine Entität, die mit einer Familie in Verbindung steht. @de
toolkit definition: En entitet som forbindes med en familie. @no
toolkit definition: Entitat que s’associa amb una família. @ca
toolkit definition: Entiteetti, joka liittyy sukuun.
toolkit definition: Entitet, som er knyttet til en familie. @da
toolkit definition: Entità associata a un famiglia. @it
toolkit definition: Entité qui est associée à une famille. @fr
toolkit definition: Entīte, kas saistīta ar dzimtu/ģimeni. @lv
toolkit definition: Perekonnaga seotud olem. @et
toolkit definition: كيان يكون مرتبطا بعائلة. @ar
toolkit definition: 和一个家族有关的一个实体 @zh-hans
toolkit label: Mit Familie in Beziehung stehende Entität @de
toolkit label: ailenin ilişkili olduğu varlık @tr
toolkit label: ar dzimtu/ģimeni saistītā entīte @lv
toolkit label: család kapcsolódó entitása: @hu
toolkit label: entitat relacionada amb una família @ca
toolkit label: entitet relateret til familie @da
toolkit label: entità correlata di famiglia @it
toolkit label: entité en relation avec une famille @fr
toolkit label: gerelateerde entiteit van famillie @nl
toolkit label: perekonnaga seotud olem @et
toolkit label: related entity of family @en
toolkit label: relatert entitet av familie @no
toolkit label: sukuun liittyvä entiteetti
toolkit label: σχετική οντότητα της οικογένειας @el
toolkit label: كيان مرتبط بعائلة @ar
toolkit label: 家族的关联实体 @zh-hans
has subproperty: sukuun liittyvä RDA-entiteetti
has subproperty: P50481
lexical alias: relatedEntityOfFamily.en
status: Published
type: Property
domain: C10008
label: a pour entité en relation avec une famille @fr
label: ailenin ilgili varlığı ile ilişkilidir @tr
label: ar dzimtu/ģimeni saistītā entīte @lv
label: család kapcsolódó entitása a következő: @hu
label: ha come entità correlata di famiglia @it
label: har entitet relateret til familie @da
label: har relatert entitet av familie @no
label: has related entity of family @en
label: hat mit Familie in Beziehung stehende Entität @de
label: heeft gerelateerde entiteit van famillie @nl
label: perekonnaga seotud olem @et
label: té com a entitat relacionada amb una família @ca
label: έχει σχετική οντότητα της οικογένειας @el
label: له كيان مرتبط بعائلة @ar
label: 有家族的关联实体 @zh-hans
sub property of: yhteistoimijaan liittyvä entiteetti
definition: Bir aileyi, aile ile bağlantılı varlıkla ilişkilendirir. @tr
definition: Correla una famiglia a un'entità associata a una famiglia. @it
definition: Hozzákapcsol egy családot egy entitáshoz, amelyet egy családhoz társítanak. @hu
definition: Liittää suvun entiteettiin, joka liittyy sukuun.
definition: Met une famille en relation avec une entité qui est associée à une famille. @fr
definition: Relaciona una família amb una entitat que s’associa amb una família. @ca
definition: Relateert een familie aan een entiteit die is geassocieerd met een familie. @nl
definition: Relaterer en familie til en entitet som forbindes med en familie. @no
definition: Relaterer en familie til en entitet, som er knyttet til en familie. @da
definition: Relates a family to an entity that is associated with a family. @en
definition: Sasaista dzimtu/ģimeni ar entīti, kas saistīta ar dzimtu/ģimeni. @lv
definition: Seostab perekonna perekonnaga seotud olemiga. @et
definition: Setzt eine Familie in Beziehung zu einer Entität, die mit einer Familie in Verbindung steht. @de
definition: يربط عائلة بكيان مرتبط بعائلة. @ar
definition: 将一个家族与和一个家族有关的一个实体关联起来。 @zh-hans

henkilöön liittyvä entiteetti
has element type: 1
toolkit definition: An entity that is associated with a person. @en
toolkit definition: Bir kişiyle bağlantılı olan bir varlık. @tr
toolkit definition: Een entiteit die is geassocieerd met een persoon. @nl
toolkit definition: Egy entitás, amelyet egy személyhez társítanak. @hu
toolkit definition: Eine Entität, die mit einer Person in Verbindung steht. @de
toolkit definition: En entitet som forbindes med en person. @no
toolkit definition: Entitat que s’associa amb una persona. @ca
toolkit definition: Entiteetti, joka liittyy henkilöön.
toolkit definition: Entitet, som er knyttet til en person. @da
toolkit definition: Entità associata a un persona. @it
toolkit definition: Entité qui est associée à une personne. @fr
toolkit definition: Entīte, kas saistīta ar personu. @lv
toolkit definition: Isikuga seotud olem. @et
toolkit definition: كيان مرتبط بشخص. @ar
toolkit definition: 和一个个人有关的一个实体 @zh-hans
toolkit label: Mit Person in Beziehung stehende Entität @de
toolkit label: ar personu saistītā entīte @lv
toolkit label: entitat relacionada amb una persona @ca
toolkit label: entitet relateret til person @da
toolkit label: entità correlata di persona @it
toolkit label: entité en relation avec une personne @fr
toolkit label: gerelateerde entiteit van persoon @nl
toolkit label: henkilöön liittyvä entiteetti
toolkit label: isikuga seotud olem @et
toolkit label: kişinin ilişkili olduğu varlık @tr
toolkit label: related entity of person @en
toolkit label: relatert entitet av familie @no
toolkit label: személy kapcsolódó entitása: @hu
toolkit label: σχετική οντότητα του φυσικού προσώπου @el
toolkit label: كيان مرتبط بشخص @ar
toolkit label: 个人的关联实体 @zh-hans
has subproperty: henkilöön liittyvä RDA-entiteetti
has subproperty: P50482
lexical alias: relatedEntityOfPerson.en
status: Published
type: Property
domain: C10004
label: a pour entité en relation avec une personne @fr
label: ar personu saistītā entīte @lv
label: ha come entità correlata di persona @it
label: har entitet relateret til person @da
label: har relatert entitet av familie @no
label: has related entity of person @en
label: hat mit Person in Beziehung stehende Entität @de
label: heeft gerelateerde entiteit van persoon @nl
label: isikuga seotud olem @et
label: kişinin ilgili varlığı ile ilişkilidir @tr
label: személy kapcsolódó entitása a következő: @hu
label: té com a entitat relacionada amb una persona @ca
label: έχει σχετική οντότητα του φυσικού προσώπου @el
label: له كيان مرتبط بشخص @ar
label: 有个人的关联实体 @zh-hans
sub property of: toimijaan liittyvä entiteetti
definition: Bir kişiyi, kişi ile bağlantılı olan bir kuruluşla ilişkilendirir. @tr
definition: Correla una persona a un'entità associata a una persona. @it
definition: Hozzákapcsol egy személyt egy entitáshoz, amelyet egy személyhez társítanak. @hu
definition: Liittää henkilön entiteettiin, joka liittyy henkilöön.
definition: Met une personne en relation avec une entité qui est associée à une personne. @fr
definition: Relaciona una persona amb una entitat que s’associa amb una persona. @ca
definition: Relateert een persoon aan een entiteit die is geassocieerd met een persoon. @nl
definition: Relaterer en person til en entitet som forbindes med en person. @no
definition: Relaterer en person til en entitet, som er knyttet til en person. @da
definition: Relates a person to an entity that is associated with a person. @en
definition: Sasaista personu ar entīti, kas saistīta ar personu. @lv
definition: Seostab isiku isikuga seotud olemiga. @et
definition: Setzt eine Person in Beziehung zu einer Entität, die mit einer Person in Verbindung steht. @de
definition: يربط شخصا بكيان مرتبط بشخص. @ar
definition: 将一个个人与和一个个人有关的一个实体关联起来。 @zh-hans

puheeseen osallinen toimija manifestaatiossa
has element type: 2
toolkit definition: A manifestation that is an aggregate that embodies an expression of a vocal work that is created by an agent. @en
toolkit definition: Bir temsilci tarafından oluşturulan bir vokal eserin anlatımını somutlaştıran topluluk olan bir gösterim. @tr
toolkit definition: Een manifestatie die een aggregaat is die een expressie van een vocaal werk verwezenlijkt dat is gecreëerd door een actor. @nl
toolkit definition: Egy aggregátum megjelenési forma, amely egy ágens által létrehozott beszédmű kifejezési formáját testesíti meg. @hu
toolkit definition: Ein Aggregat (Manifestation), das eine Expression eines gesprochenen Werks verkörpert, die ein Akteur erstellt hat. @de
toolkit definition: En manifestasjon som er et aggregat som realiserer et verk bestående av tale skapt av en agent. @no
toolkit definition: Kehastus, mis on liitum, milles on teostatud tegija loodud suulise teose väljendus. @et
toolkit definition: Manifestaatio, joka on aggregaatti, joka sisältää puheteoksen ekspression, jonka toimija on luonut.
toolkit definition: Manifestació que és un agregat que materialitza una expressió d’una obra vocal que és creada per un agent. @ca
toolkit definition: Manifestation qui consiste en un agrégat matérialisant une expression d’une œuvre vocale créée par un agent. @fr
toolkit definition: Manifestation, som er en samling, som rummer et udtryk af et værk med talte ord, som er skabt af en agent. @da
toolkit definition: Manifestazione che è un aggregato che materializza un'opera orale creata da un agente. @it
toolkit definition: Manifestācija, kas ir apkopojums, kas ietver aģenta radītu mutvārdu darbu. @lv
toolkit definition: تجسيدة تمثل تجميعة تجسد عملا بكلمات منطوقة أنشأه وكيل. @ar
toolkit definition: 作为一种合集、把一个行为者所创作的一种人声作品的内容表达具体化的一种载体表现 @zh-hans
toolkit label: Akteur als Beiträgerin/Beiträger einer Rede von @de
toolkit label: agent contributeur de contenu vocal de @fr
toolkit label: agent contribuïdor de discurs de @ca
toolkit label: agent, som er bidragsyder til tale af @da
toolkit label: bidragsyter til tale for (agent) @no
toolkit label: bijdrager-actor van spraak van @nl
toolkit label: contributor agent of speech of @en
toolkit label: contributore agente di discorso di @it
toolkit label: ir runas līdzradītājs (aģents) @lv
toolkit label: konuşmaya katkıda bulunan temsilci @tr
toolkit label: kõneloome kaastööline (tegija) kehastuses @et
toolkit label: közreműködő ágense a következő beszédnek: @hu
toolkit label: puheeseen osallinen toimija manifestaatiossa
toolkit label: συντελεστής φορέας της ομιλίας του @el
toolkit label: وكيل مساهم في حديث @ar
toolkit label: ……的讲话的贡献者行为者 @zh-hans
has subproperty: puheeseen osallinen henkilö manifestaatiossa
has subproperty: puheeseen osallinen yhteistoimija manifestaatiossa
has subproperty: P50483
lexical alias: contributorAgentOfSpeechOf.en
status: Published
type: Property
domain: C10002
label: er agent, som er bidragsyder til tale af @da
label: er bidragsyter til tale for (agent) @no
label: est un agent contributeur de contenu vocal de @fr
label: ir runas līdzradītājs (aģents) @lv
label: is bijdrager-actor van spraak van @nl
label: is contributor agent of speech of @en
label: ist Akteur als Beiträgerin/Beiträger einer Rede von @de
label: konuşmasının katkıda nulunan temsilcisidir @tr
label: kõneloome kaastööline (tegija) kehastuses @et
label: közreműködő ágense a következő beszédnek: @hu
label: è contributore agente di discorso di @it
label: és agent contribuïdor de discurs de @ca
label: είναι συντελεστής φορέας της ομιλίας του @el
label: هو وكيل مساهم في حديث لـ @ar
label: 是……的讲话的贡献者行为者 @zh-hans
sub property of: aggregaattiin osallinen toimija manifestaatiossa
definition: Bir temsilciyi, temsilci tarafından oluşturulan sesli bir eserin anlatımını somutlaştıran bir topluluğun gösterimiyle ilişkilendirir. @tr
definition: Correla un agente a una manifestazione che è un aggregato che materializza un'opera orale creata da un agente. @it
definition: Hozzákapcsol egy ágenst egy aggregátum megjelenési formához, amely egy ágens által létrehozott beszédmű kifejezési formáját testesíti meg. @hu
definition: Liittää toimijan manifestaatioon, joka on aggregaatti, joka sisältää puheteoksen ekspression, jonka toimija on luonut.
definition: Met un agent en relation avec une manifestation qui consiste en un agrégat matérialisant une expression d’une œuvre vocale créée par un agent. @fr
definition: Relaciona un agent amb una manifestació que és un agregat que materialitza una expressió d’una obra vocal que és creada per un agent. @ca
definition: Relateert een actor aan een manifestatie die een aggregaat is die een expressie van een vocaal werk verwezenlijkt dat is gecreëerd door een actor. @nl
definition: Relaterer en agent til en manifestasjon som er et aggregat som realiserer et verk bestående av tale skapt av en agent. @no
definition: Relaterer en agent til en manifestation, som er en samling, som rummer et udtryk af et værk med talte ord, som er skabt af en agent. @da
definition: Relates an agent to a manifestation that is an aggregate that embodies an expression of a vocal work that is created by an agent. @en
definition: Sasaista aģentu ar manifestāciju, kas ir apkopojums, kas ietver aģenta radītu mutvārdu darbu. @lv
definition: Seostab tegija kehastusega, mis on liitum, milles on teostatud tegija loodud suulise teose väljendus. @et
definition: Setzt einen Akteur in Beziehung zu einem Aggregat (Manifestation), das eine Expression eines gesprochenen Werks verkörpert, die ein Akteur erstellt hat. @de
definition: يربط وكيلا بتجسيدة عبارة عن تجميعة تجسد عملا بكلمات منطوقة أنشأه وكيل. @ar
definition: 将一个行为者与作为一种合集、把一个行为者所创作的一种人声作品的内容表达具体化的一种载体表现关联起来。 @zh-hans

esineeseen osallinen toimija manifestaatiossa
has element type: 2
toolkit definition: A manifestation that is an aggregate that embodies an expression of an object work that is created by an agent. @en
toolkit definition: Bir temsilci tarafından oluşturulan bir nesne eserinin anlatımını somutlaştıran topluluk olan bir gösterim. @tr
toolkit definition: Een manifestatie die een aggregaat is die een expressie van een objectwerk verwezenlijkt dat is gecreëerd door een actor. @nl
toolkit definition: Egy aggregátum megjelenési forma, amely egy ágens által létrehozott objektummű kifejezési formáját testesíti meg. @hu
toolkit definition: Ein Aggregat (Manifestation), das eine Expression eines gegenständlichen Werks verkörpert, die ein Akteur erstellt hat. @de
toolkit definition: En manifestasjon som er et aggregat som realiserer et verk bestående av et objekt skapt av en agent. @no
toolkit definition: Kehastus, mis on liitum, milles on teostatud tegija loodud objektteose väljendus. @et
toolkit definition: Manifestaatio, joka on aggregaatti, joka sisältää esineteoksen ekspression, jonka toimija on luonut.
toolkit definition: Manifestació que és un agregat que materialitza una expressió d’una obra d’objecte que és creada per un agent. @ca
toolkit definition: Manifestation qui consiste en un agrégat matérialisant une expression d’une œuvre objet créée par un agent. @fr
toolkit definition: Manifestation, som er en samling, som rummer et udtryk af et værk med objekt, som er skabt af en agent. @da
toolkit definition: Manifestazione che è un aggregato che materializza un oggetto creato da un agente. @it
toolkit definition: Manifestācija, kas ir apkopojums, kas ietver aģenta radītu objekta darbu. @lv
toolkit definition: تجسيدة تمثل تجميعة تجسد عملا كائنا أنشأه وكيل. @ar
toolkit definition: 作为一种合集、把一个行为者所创作的一种物体作品的内容表达具体化的一种载体表现 @zh-hans
toolkit label: Akteur als Beiträgerin/Beiträger von einem Gegenstand von @de
toolkit label: agent contributeur d’objet de @fr
toolkit label: agent contribuïdor d’objecte de @ca
toolkit label: agent, som er bidragsyder til objekt af @da
toolkit label: bidragsyter til objekt for (agent) @no
toolkit label: bijdrager-actor van object van @nl
toolkit label: contributor agent of object of @en
toolkit label: contributore agente di oggetto di @it
toolkit label: esineeseen osallinen toimija manifestaatiossa
toolkit label: ir objekta līdzradītājs (aģents) @lv
toolkit label: közreműködő ágense a következő objektumnak: @hu
toolkit label: nesneye katkıda bulunan temsilci @tr
toolkit label: objektiloome kaastööline (tegija) kehastuses @et
toolkit label: συντελεστής φορέας του αντικειμένου του @el
toolkit label: وكيل مساهم في كيان @ar
toolkit label: ……的物体的贡献者行为者 @zh-hans
has subproperty: esineeseen osallinen henkilö manifestaatiossa
has subproperty: esineeseen osallinen yhteistoimija manifestaatiossa
has subproperty: P50484
lexical alias: contributorAgentOfObjectOf.en
status: Published
type: Property
domain: C10002
label: er agent, som er bidragsyder til objekt af @da
label: er bidragsyter til objekt for (agent) @no
label: est un agent contributeur d’objet de @fr
label: ir objekta līdzradītājs (aģents) @lv
label: is bijdrager-actor van object van @nl
label: is contributor agent of object of @en
label: ist Akteur als Beiträgerin/Beiträger von einem Gegenstand von @de
label: közreműködő ágense a következő objektumnak: @hu
label: nesnesinin katkıda bulunan temsilcisidir @tr
label: objektiloome kaastööline (tegija) kehastuses @et
label: è contributore agente di oggetto di @it
label: és agent contribuïdor d’objecte de @ca
label: είναι συντελεστής φορέας του αντικειμένου του @el
label: هو وكيل مساهم في كيان لـ @ar
label: 是……的物体的贡献者行为者 @zh-hans
sub property of: aggregaattiin osallinen toimija manifestaatiossa
definition: Bir temsilciyi, temsilci tarafından oluşturulan bir nesne eserinin anlatımını somutlaştıran bir topluluğunun gösterimiyle ilişkilendirir. @tr
definition: Correla un agente a una manifestazione che è un aggregato che materializza un oggetto creato da un agente. @it
definition: Hozzákapcsol egy ágenst egy aggregátum megjelenési formához, amely egy ágens által létrehozott objektummű kifejezési formáját testesíti meg. @hu
definition: Liittää toimijan manifestaatioon, joka on aggregaatti, joka sisältää esineteoksen ekspression, jonka toimija on luonut.
definition: Met un agent en relation avec une manifestation qui consiste en un agrégat matérialisant une expression d’une œuvre objet créée par un agent. @fr
definition: Relaciona un agent amb una manifestació que és un agregat que materialitza una expressió d’una obra d’objecte que és creada per un agent. @ca
definition: Relateert een actor aan een manifestatie die een aggregaat is die een expressie van een objectwerk verwezenlijkt dat is gecreëerd door een actor. @nl
definition: Relaterer en agent til en manifestasjon som er et aggregat som realiserer et verk bestående av et objekt skapt av en agent. @no
definition: Relaterer en agent til en manifestation, som er en samling, som rummer et udtryk af et værk med objekt, som er skabt af en agent. @da
definition: Relates an agent to a manifestation that is an aggregate that embodies an expression of an object work that is created by an agent. @en
definition: Sasaista aģentu ar manifestāciju, kas ir apkopojums, kas ietver aģenta radītu objekta darbu. @lv
definition: Seostab tegija kehastusega, mis on liitum, milles on teostatud tegija loodud objektteose väljendus. @et
definition: Setzt einen Akteur in Beziehung zu einem Aggregat (Manifestation), das eine Expression eines gegenständlichen Werks verkörpert, die ein Akteur erstellt hat. @de
definition: يربط وكيلا بتجسيدة عبارة عن تجميعة تجسد عملا كائنا أنشأه وكيل. @ar
definition: 将一个行为者与作为一种合集、把一个行为者所创作的一种物体作品的内容表达具体化的一种载体表现关联起来。 @zh-hans

digitaaliseen sisältöön osallinen toimija manifestaatiossa
has element type: 2
toolkit definition: A manifestation that is an aggregate that embodies an expression of computer content created by an agent. @en
toolkit definition: Bir temsilci tarafından oluşturulan bir bilgisayar destekli içeriğin anlatımını somutlaştıran topluluk olan bir gösterim. @tr
toolkit definition: Een manifestatie die een aggregaat is die een expressie van computercontent verwezenlijkt die is gecreëerd door een actor. @nl
toolkit definition: Egy aggregátum megjelenési forma, amely egy ágens által létrehozott számítógépes tartalom kifejezési formáját testesíti meg. @hu
toolkit definition: Ein Aggregat (Manifestation), das eine Expression von Computer Content verkörpert, die ein Akteur erstellt hat. @de
toolkit definition: En manifestasjon som er et aggregat som realiserer maskinlesbart innhold skapt av en agent. @no
toolkit definition: Kehastus, mis on liitum, milles on teostatud tegija loodud digisisu väljendus. @et
toolkit definition: Manifestaatio, joka on aggregaatti, joka sisältää digitaalisen sisällön ekspression, jonka toimija on luonut.
toolkit definition: Manifestació que és un agregat que materialitza una expressió d’una obra de contingut informàtic creada per un agent. @ca
toolkit definition: Manifestation qui consiste en un agrégat matérialisant une expression d’un contenu informatique créé par un agent. @fr
toolkit definition: Manifestation, som er en samling, som rummer et udtryk af computerindhold skabt af en agent. @da
toolkit definition: Manifestazione che è un aggregato che materializza contenuto informatico creato da un agente. @it
toolkit definition: Manifestācija, kas ir apkopojums, kas ietver aģenta radītu datororientētu saturu. @lv
toolkit definition: تجسيدة تمثل تجميعة تجسد محتوى حاسوبي أنشأه وكيل. @ar
toolkit definition: 作为一种合集、把一个行为者所创作的一种计算机内容的内容表达具体化的一种载体表现 @zh-hans
toolkit label: Akteur ist Beiträgerin/Beiträger von Computer Content von @de
toolkit label: agent contributeur de contenu informatique de @fr
toolkit label: agent contribuïdor de contingut informàtic de @ca
toolkit label: agent, som er bidragsyder til computerindhold af @da
toolkit label: bidragsyter til maskinlesbart innhold for (agent) @no
toolkit label: bijdrager-actor van computercontent van @nl
toolkit label: bilgisayar içeriğine katkıda bulunan temsilci @tr
toolkit label: contributor agent of computer content of @en
toolkit label: contributore agente di contenuto informatico di @it
toolkit label: digisisu kaastööline (tegija) kehastuses @et
toolkit label: digitaaliseen sisältöön osallinen toimija manifestaatiossa
toolkit label: ir datororientēta satura līdzradītājs (aģents) @lv
toolkit label: közreműködő ágense a következő számítógépes tartalomnak: @hu
toolkit label: συντελεστής φορέας του περιεχομένου του υπολογιστή του @el
toolkit label: وكيل مساهم في محتوى حاسوبي @ar
toolkit label: ……的计算机内容贡献者行为者 @zh-hans
has subproperty: digitaaliseen sisältöön osallinen henkilö manifestaatiossa
has subproperty: digitaaliseen sisältöön osallinen yhteistoimija manifestaatiossa
has subproperty: P50485
lexical alias: contributorAgentOfComputerContentOf.en
status: Published
type: Property
domain: C10002
label: bilgisayar içeriğinin katkıda bulunan temsilcisidir @tr
label: digisisu kaastööline (tegija) kehastuses @et
label: er agent, som er bidragsyder til computerindhold af @da
label: er bidragsyter til maskinlesbart innhold for (agent) @no
label: est un agent contributeur de contenu informatique de @fr
label: ir datororientēta satura līdzradītājs (aģents) @lv
label: is bijdrager-actor van computercontent van @nl
label: is contributor agent of computer content of @en
label: ist Akteur ist Beiträgerin/Beiträger von Computer Content von @de
label: közreműködő ágense a következő számítógépes tartalomnak: @hu
label: è contributore agente di contenuto informatico di @it
label: és agent contribuïdor de contingut informàtic de @ca
label: είναι συντελεστής φορέας του περιεχομένου του υπολογιστή του @el
label: هو وكيل مساهم في محتوى حاسوبي لـ @ar
label: 是……的计算机内容贡献者行为者 @zh-hans
sub property of: aggregaattiin osallinen toimija manifestaatiossa
definition: Bir temsilciyi, temsilci tarafından oluşturulan bilgisayar içeriğinin anlatımını somutlaştıran bir topluluğun gösterimiyle ilişkilendirir. @tr
definition: Correla un agente a una manifestazione che è un aggregato che materializza contenuto informatico creato da un agente. @it
definition: Hozzákapcsol egy ágenst egy aggregátum megjelenési formához, amely egy ágens által létrehozott számítógépes tartalom kifejezési formáját testesíti meg. @hu
definition: Liittää toimijan manifestaatioon, joka on aggregaatti, joka sisältää digitaalisen sisällön ekspression, jonka toimija on luonut.
definition: Met un agent en relation avec une manifestation qui consiste en un agrégat matérialisant une expression d’un contenu informatique créé par un agent. @fr
definition: Relaciona un agent amb una manifestació que és un agregat que materialitza una expressió d’una obra de contingut informàtic creada per un agent. @ca
definition: Relateert een actor aan een manifestatie die een aggregaat is die een expressie van computercontent verwezenlijkt die is gecreëerd door een actor. @nl
definition: Relaterer en agent til en manifestasjon som er et aggregat som realiserer maskinlesbart innhold skapt av en agent. @no
definition: Relaterer en agent til en manifestation, som er en samling, som rummer et udtryk af computerindhold skabt af en agent. @da
definition: Relates an agent to a manifestation that is an aggregate that embodies an expression of computer content created by an agent. @en
definition: Sasaista aģentu ar manifestāciju, kas ir apkopojums, kas ietver aģenta radītu datororientētu saturu. @lv
definition: Seostab tegija kehastusega, mis on liitum, milles on teostatud tegija loodud digisisu väljendus. @et
definition: Setzt einen Akteur in Beziehung zu einem Aggregat (Manifestation), das eine Expression von Computer Content verkörpert, die ein Akteur erstellt hat. @de
definition: يربط وكيلا بتجسيدة عبارة عن تجميعة تجسد محتوى حاسوبي أنشأه وكيل. @ar
definition: 将一个行为者与作为一种合集、把一个行为者所创作的一种计算机内容的内容表达具体化的一种载体表现关联起来。 @zh-hans

tutkimuksen ohjaaja teoksessa
has element type: 2
toolkit definition: A work that involves a responsibility as an academic supervisor of research that results in a work. @en
toolkit definition: Bir çalışmayla sonuçlanan bir araştırmanın akademik danışmanı olarak sorumluluğunu içeren çalışma. @tr
toolkit definition: Darbs, kas ietver personas atbildību, esot par akadēmisko vadītāju pētījumam, kuras rezultātā radīts darbs. @lv
toolkit definition: Een werk dat met zich meebrengt een verantwoordelijkheid van een academische begeleider van onderzoek dat resulteert in een werk. @nl
toolkit definition: Egy mű, amely magában foglalja egy tudományos témavezető a felelősségét egy kutatásért, amely egy művet eredményez. @hu
toolkit definition: Ein Werk, bei dem eine akademische Betreuerin/ein akademischer Betreuer dafür verantwortlich ist, die Forschungstätigkeiten zu beaufsichtigen oder zu betreuen, die zu einem Werk führen. @de
toolkit definition: Et verk som involverer et ansvar som akademisk veileder for forskning som resulterer i et verk. @no
toolkit definition: Obra que implica una responsabilitat com a supervisor acadèmic de recerca que dona com a resultat una obra. @ca
toolkit definition: Opera che implica una responsabilità come supervisore accademico di ricerca che risulta in un'opera. @it
toolkit definition: Teos, jossa henkilö on vastuussa akateemiseen teokseen johtavan tutkimuksen ohjaamisesta.
toolkit definition: Teos, mis sisaldab akadeemilise juhendaja vastutust teoses väljenduva uurimistöö eest. @et
toolkit definition: Værk, som involverer et ansvar som akademisk vejleder for forskning, som resulterer i et værk. @da
toolkit definition: Œuvre qui comporte une responsabilité en tant que superviseur académique de travaux de recherche entraînant la création d’une œuvre. @fr
toolkit definition: عمل يترتب عليه تحمل المسئولية كمشرف أكاديمي على بحث يُسفر عن عمل. @ar
toolkit definition: 涉及导致一种作品的研究的一个学术主管的责任的一种作品 @zh-hans
toolkit label: Betreuerin/Betreuer von Forschungstätigkeiten von @de
toolkit label: araştırma danışmanı @tr
toolkit label: forskningsveileder for @no
toolkit label: forskningsvejleder af @da
toolkit label: ir pētnieciskā darba vadītājs @lv
toolkit label: kutatási témavezetője: @hu
toolkit label: onderzoeksbegeleider van @nl
toolkit label: research supervisor of @en
toolkit label: superviseur de recherche de @fr
toolkit label: supervisor de recerca de @ca
toolkit label: supervisore di ricerca di @it
toolkit label: tutkimuksen ohjaaja teoksessa
toolkit label: uurimistöö juhendaja teoses @et
toolkit label: επόπτης έρευνας του @el
toolkit label: مشرف بحوث @ar
toolkit label: ……的研究主管 @zh-hans
has subproperty: P50486
lexical alias: researchSupervisorOf.en
status: Published
type: Property
domain: C10004
label: araştırma danışmanıdır @tr
label: er forskningsveileder for @no
label: er forskningsvejleder af @da
label: est un superviseur de recherche de @fr
label: ir pētnieciskā darba vadītājs @lv
label: is onderzoeksbegeleider van @nl
label: is research supervisor of @en
label: ist Betreuerin/Betreuer von Forschungstätigkeiten von @de
label: kutatási témavezetője a következőnek: @hu
label: uurimistöö juhendaja teoses @et
label: è supervisore di ricerca di @it
label: és supervisor de recerca de @ca
label: είναι επόπτης έρευνας του @el
label: هو مشرف بحوث لـ @ar
label: 是……的研究主管 @zh-hans
sub property of: akateeminen ohjaaja teoksessa
definition: Bir kişiyi, bir eserle sonuçlanan araştırmanın akademik danışmanı olarak sorumluluğunu içeren eserle ilişkilendirir. @tr
definition: Correla una persona a un'opera che implica una responsabilità come supervisore accademico di ricerca che risulta in un'opera. @it
definition: Hozzákapcsol egy személyt egy műhöz, amely magában foglalja egy tudományos témavezető a felelősségét egy kutatásért, amely egy művet eredményez. @hu
definition: Liittää henkilön teokseen, jossa henkilö on vastuussa akateemiseen teokseen johtavan tutkimuksen ohjaamisesta.
definition: Met une personne en relation avec une œuvre qui comporte une responsabilité en tant que superviseur académique de travaux de recherche entraînant la création d’une œuvre. @fr
definition: Relaciona una persona amb una obra que implica una responsabilitat com a supervisor acadèmic de recerca que dona com a resultat una obra. @ca
definition: Relateert een persoon aan een werk dat met zich meebrengt een verantwoordelijkheid van een academische begeleider van onderzoek dat resulteert in een werk. @nl
definition: Relaterer en person til et verk som involverer et ansvar som akademisk veileder for forskning som resulterer i et verk. @no
definition: Relaterer en person til et værk, som involverer et ansvar som akademisk vejleder for forskning, som resulterer i et værk. @da
definition: Relates a person to a work that involves a responsibility as an academic supervisor of research that results in a work. @en
definition: Sasaista personu ar darbu, kas ietver personas atbildību, esot par akadēmisko vadītāju pētījumam, kuras rezultātā radīts darbs. @lv
definition: Seostab isiku teosega, mis sisaldab akadeemilise juhendaja vastutust teoses väljenduva uurimistöö eest. @et
definition: Setzt eine Person in Beziehung zu einem Werk, bei dem eine akademische Betreuerin/ein akademischer Betreuer dafür verantwortlich ist, die Forschungstätigkeiten zu beaufsichtigen oder zu betreuen, die zu einem Werk führen. @de
definition: يربط شخصا بعمل يترتب عليه تحمل المسئولية كمشرف أكاديمي على بحث يُسفر عن عمل. @ar
definition: 将一个个人与涉及导致一种作品的研究的一个学术主管的责任的一种作品关联起来。 @zh-hans

projektin ohjaaja teoksessa
has element type: 2
toolkit definition: A work that involves a responsibility as an academic supervisor of a project undertaken by a student that results in a work. @en
toolkit definition: Bir öğrencinin üstlendiği ve bir çalışmayla sonuçlanan bir projenin akademik danışmanı olarak sorumluluğunu içeren çalışma. @tr
toolkit definition: Darbs, kas ietver personas atbildību, esot par akadēmisko vadītāju studenta projektam, kura rezultātā radīts darbs. @lv
toolkit definition: Een werk dat met zich meebrengt een verantwoordelijkheid van een academische begeleider van een project ondernomen door een student dat resulteert in een werk. @nl
toolkit definition: Egy mű, amely magában foglalja egy projekt tudományos témavezetőjének a felelősségét, amely egy diák által készített művet eredményez. @hu
toolkit definition: Ein Werk, bei dem eine akademische Betreuerin/ein akademischer Betreuer dafür verantwortlich ist, ein Projekt einer Studentin/eines Studenten zu beaufsichtigen oder zu betreuen, das zu einem Werk führt. @de
toolkit definition: Et verk som involverer et ansvar som akademisk veileder for et prosjekt utført av en student og som resulterer i et verk. @no
toolkit definition: Obra que implica una responsabilitat com a supervisor acadèmic d’un projecte emprès per un estudiant que dona com a resultat una obra. @ca
toolkit definition: Opera che implica una responsabilità come supervisore accademico di un progetto intrapreso da uno studente che risulta in un'opera. @it
toolkit definition: Teos, jossa henkilö on vastuussa opiskelijan suorittaman, teokseen johtavan projektin ohjaamisesta.
toolkit definition: Teos, mis sisaldab akadeemilise juhendaja vastutust õppuri täidetava ja teoses väljenduva projekti eest. @et
toolkit definition: Værk, som involverer et ansvar som akademisk vejleder for et projekt, som udføres af en studerende, og som resulterer i et værk. @da
toolkit definition: Œuvre qui comporte une responsabilité en tant que superviseur académique d’un projet entrepris par un étudiant et entraînant la création d’une œuvre. @fr
toolkit definition: عمل يترتب عليه تحمل المسئولية كمشرف أكاديمي على مشروع ينفذه طالب، ويُسفر عن عمل @ar
toolkit definition: 涉及一个学生完成的导致一种作品的一个项目的一个学术主管的责任的一种作品 @zh-hans
toolkit label: Projektbetreuerin/Projektbetreuer von @de
toolkit label: ir studiju darba vadītājs @lv
toolkit label: proje yöneticisi @tr
toolkit label: project supervisor of @en
toolkit label: projectbegeleider van @nl
toolkit label: projekti juhendaja teoses @et
toolkit label: projektin ohjaaja teoksessa
toolkit label: projektvezetője: @hu
toolkit label: prosjektveileder for @no
toolkit label: superviseur de projet de @fr
toolkit label: supervisor de projecte de @ca
toolkit label: supervisore di progetto di @it
toolkit label: vejleder af @da
toolkit label: επόπτης έργου του @el
toolkit label: مشرف مشروع @ar
toolkit label: ……的项目主管 @zh-hans
has subproperty: P50487
lexical alias: projectSupervisorOf.en
status: Published
type: Property
domain: C10004
label: er prosjektveileder for @no
label: er vejleder af @da
label: est un superviseur de projet de @fr
label: ir studiju darba vadītājs @lv
label: is project supervisor of @en
label: is projectbegeleider van @nl
label: ist Projektbetreuerin/Projektbetreuer von @de
label: proje danışmanıdır @tr
label: projekti juhendaja teoses @et
label: projektvezetője a következőnek: @hu
label: è supervisore di progetto di @it
label: és supervisor de projecte de @ca
label: είναι επόπτης έργου του @el
label: هو مشرف مشروع لـ @ar
label: 是……的项目主管 @zh-hans
sub property of: akateeminen ohjaaja teoksessa
definition: Bir kişiyi, bir öğrenci tarafından üstlenilen ve bir çalışmayla sonuçlanan bir projenin akademik danışmanı olarak sorumluluğunudaki eserle ilişkilendirir. @tr
definition: Correla una persona a un'opera che implica una responsabilità come relatore accademico di un progetto intrapreso da uno studente che risulta in un'opera. @it
definition: Hozzákapcsol egy személyt egy műhöz, amely magában foglalja egy projekt tudományos témavezetőjének a felelősségét, amely egy diák által készített művet eredményez. @hu
definition: Liittää henkilön teokseen, jossa henkilö on vastuussa opiskelijan suorittaman, teokseen johtavan projektin ohjaamisesta.
definition: Met une personne en relation avec une œuvre qui comporte une responsabilité en tant que superviseur académique d’un projet entrepris par un étudiant et entraînant la création d’une œuvre. @fr
definition: Relaciona una persona amb una obra que implica una responsabilitat com a supervisor acadèmic d’un projecte emprès per un estudiant que dona com a resultat una obra. @ca
definition: Relateert een persoon aan een werk dat met zich meebrengt een verantwoordelijkheid van een academische begeleider van een project ondernomen door een student dat resulteert in een werk. @nl
definition: Relaterer en person til et verk som involverer et ansvar som akademisk veileder for et prosjekt utført av en student og som resulterer i et verk. @no
definition: Relaterer en person til et værk, som involverer et ansvar som akademisk vejleder for et projekt, som udføres af en studerende, og som resulterer i et værk. @da
definition: Relates a person to a work that involves a responsibility as an academic supervisor of a project undertaken by a student that results in a work. @en
definition: Sasaista personu ar darbu, kas ietver personas atbildību, esot par akadēmisko vadītāju studenta projektam, kura rezultātā radīts darbs. @lv
definition: Seostab isiku teosega, mis sisaldab akadeemilise juhendaja vastutust õppuri täidetava ja teoses väljenduva projekti eest. @et
definition: Setzt eine Person in Beziehung zu einem Werk, bei dem eine akademische Betreuerin/ein akademischer Betreuer dafür verantwortlich ist, ein Projekt einer Studentin/eines Studenten zu beaufsichtigen oder zu betreuen, das zu einem Werk führt. @de
definition: يربط شخصا بعمل ينطوي على تحمل المسئولية كمشرف أكاديمي على مشروع ينفذه طالب يُسفر عن عمل. @ar
definition: 将一个个人与涉及一个学生完成的导致一种作品的一个项目的一个学术主管的责任的一种作品关联起来。 @zh-hans

henkilön kategoria
has element type: 5
toolkit definition: A type to which a person belongs. @en
toolkit definition: Bir kişinin ait olduğu bir tür. @tr
toolkit definition: Een type waartoe een persoon behoort. @nl
toolkit definition: Egy típus, amelyhez a személy tartozik. @hu
toolkit definition: Eine Art, zu der eine Person gehört. @de
toolkit definition: En type som en person tilhører. @no
toolkit definition: Tipo a cui una persona appartiene. @it
toolkit definition: Tipus al qual pertany una persona. @ca
toolkit definition: Type auquel une personne appartient. @fr
toolkit definition: Type, som en person tilhører. @da
toolkit definition: Tyyppi tai jaottelu, johon henkilö kuuluu.
toolkit definition: Tüüp, millesse isik kuulub. @et
toolkit definition: Veids, pie kura pieder persona. @lv
toolkit definition: نوع ينتمي إليه شخص. @ar
toolkit definition: 一个个人所属于的一个类型 @zh-hans
toolkit label: Kategorie einer Person @de
toolkit label: categoria de persona @ca
toolkit label: categoria di persona @it
toolkit label: categorie van persoon @nl
toolkit label: category of person @en
toolkit label: catégorie de personne @fr
toolkit label: henkilön kategoria
toolkit label: isiku kategooria @et
toolkit label: kategori af person @da
toolkit label: kategori for person @no
toolkit label: kişi kategorisi @tr
toolkit label: personas kategorija @lv
toolkit label: személy kategóriája: @hu
toolkit label: κατηγορία του φυσικού προσώπου @el
toolkit label: فئة الشخص @ar
toolkit label: 个人的类别 @zh-hans
has subproperty: P50489
lexical alias: categoryOfPerson.en
status: Published
type: Property
domain: C10004
label: a pour catégorie de personne @fr
label: ha come categoria di persona @it
label: har kategori af person @da
label: har kategori for person @no
label: has category of person @en
label: hat Kategorie einer Person @de
label: heeft categorie van persoon @nl
label: isiku kategooria @et
label: kişinin kategorisi ile ilişkilidir @tr
label: personas kategorija @lv
label: személy kategóriája a következő: @hu
label: té com a categoria de persona @ca
label: έχει κατηγορία του φυσικού προσώπου @el
label: له فئة لشخص @ar
label: 有个人的类别 @zh-hans
sub property of: toimijan kategoria
alternative label: henkilön tyyppi
alternative label: isiku tüüp @et
alternative label: kişinin türü @tr
alternative label: személy típusa: @hu
alternative label: tipo de persona @es
alternative label: tipo di persona @it
alternative label: tipus de persona @ca
alternative label: type af person @da
alternative label: type de personne @fr
alternative label: type of person @en
alternative label: type person @no
alternative label: τύπος του φυσικού προσώπου @el
alternative label: نوع الشخص @ar
alternative label: 个人的类型 @zh-hans
definition: Bir kişiyi, kişinin ait olduğu tip ile ilişkilendirir. @tr
definition: Correla una persona a un tipo a cui una persona appartiene. @it
definition: Hozzákapcsol egy személyt ahhoz a típushoz, amelyhez a személy tartozik. @hu
definition: Liittää henkilön tyyppiin tai jaotteluun, johon henkilö kuuluu.
definition: Met une personne en relation avec un type auquel une personne appartient. @fr
definition: Relaciona una persona amb un tipus al qual pertany una persona. @ca
definition: Relateert een persoon aan een type waartoe een persoon behoort. @nl
definition: Relaterer en person til en type som en person tilhører. @no
definition: Relaterer en person til en type, som en person tilhører. @da
definition: Relates a person to a type to which a person belongs. @en
definition: Sasaista personu ar veidu, pie kura pieder persona. @lv
definition: Seostab isiku tüübiga, millesse isik kuulub. @et
definition: Setzt eine Person in Beziehung zu einer Art, zu der eine Person gehört. @de

toimijan kategoria
has element type: 5
toolkit definition: A type to which an agent belongs. @en
toolkit definition: Bir temsilcinin ait olduğu bir tür. @tr
toolkit definition: Een type waartoe een actor behoort. @nl
toolkit definition: Egy típus, amelyhez az ágens tartozik. @hu
toolkit definition: Eine Art, zu der ein Akteur gehört. @de
toolkit definition: En type som en agent tilhører. @no
toolkit definition: Tipo a cui un agente appartiene. @it
toolkit definition: Tipus al qual pertany un agent. @ca
toolkit definition: Type auquel un agent appartient. @fr
toolkit definition: Type, som en agent tilhører. @da
toolkit definition: Tyyppi tai jaottelu, johon toimija kuuluu.
toolkit definition: Tüüp, millesse tegija kuulub. @et
toolkit definition: Veids, pie kura pieder aģents. @lv
toolkit definition: نوع ينتمي إليه وكيل. @ar
toolkit definition: 一个行为者所属于的一个类型 @zh-hans
toolkit label: Kategorie eines Akteurs @de
toolkit label: aģenta kategorija @lv
toolkit label: categoria di agente @it
toolkit label: categoria d’agent @ca
toolkit label: categorie van actor @nl
toolkit label: category of agent @en
toolkit label: catégorie d’agent @fr
toolkit label: kategori af agent @da
toolkit label: kategori for agent @no
toolkit label: tegija kategooria @et
toolkit label: temsilci kategorisi @tr
toolkit label: toimijan kategoria
toolkit label: ágens kategóriája: @hu
toolkit label: κατηγορία του φορέα @el
toolkit label: فئة وكيل @ar
toolkit label: 行为者的类别 @zh-hans
has subproperty: henkilön kategoria
has subproperty: yhteistoimijan kategoria
has subproperty: P50490
lexical alias: categoryOfAgent.en
status: Published
type: Property
domain: C10002
label: a pour catégorie d’agent @fr
label: aģenta kategorija @lv
label: ha come categoria di agente @it
label: har kategori af agent @da
label: har kategori for agent @no
label: has category of agent @en
label: hat Kategorie eines Akteurs @de
label: heeft categorie van actor @nl
label: tegija kategooria @et
label: temsilcinin kategorisi ile ilişkilidir @tr
label: té com a categoria d’agent @ca
label: ágens kategóriája a következő: @hu
label: έχει κατηγορία του φορέα @el
label: له فئة لوكيل @ar
label: 有行为者的类别 @zh-hans
sub property of: P00029
alternative label: tegija tüüp @et
alternative label: temsilcinin türü @tr
alternative label: tipo de agente @es
alternative label: tipo di agente @it
alternative label: tipus d’agent @ca
alternative label: toimijan tyyppi
alternative label: type af agent @da
alternative label: type agent @no
alternative label: type d’agent @fr
alternative label: type of agent @en
alternative label: ágens típusa: @hu
alternative label: τύπος του φορέα @el
alternative label: نوع الوكيل @ar
alternative label: 行为者的类型 @zh-hans
definition: Bir temsilciyi, temsilcinin ait olduğu bir tür ilişkilendirir. @tr
definition: Correla un agente a un tipo a cui un agente appartiene. @it
definition: Hozzákapcsol egy ágenst ahhoz a típushoz, amelyhez az ágens tartozik. @hu
definition: Liittää toimijan tyyppiin tai jaotteluun, johon toimija kuuluu.
definition: Met un agent en relation avec un type auquel un agent appartient. @fr
definition: Relaciona un agent amb un tipus al qual pertany un agent. @ca
definition: Relateert een actor aan een type waartoe een actor behoort. @nl
definition: Relaterer en agent til en type som en agent tilhører. @no
definition: Relaterer en agent til en type, som en agent tilhører. @da
definition: Relates an agent to a type to which an agent belongs. @en

yhteistoimijan kategoria
has element type: 5
toolkit definition: A type to which a collective agent belongs. @en
toolkit definition: Bir kollektif temsilcinin ait olduğu tür. @tr
toolkit definition: Een type waartoe een collectieve actor behoort. @nl
toolkit definition: Egy típus, amelyhez a kollektív ágens tartozik. @hu
toolkit definition: Eine Art, zu der ein gemeinschaftlicher Akteur gehört. @de
toolkit definition: En type som en kollektiv agent tilhører. @no
toolkit definition: Tipo a cui un agente collettivo appartiene. @it
toolkit definition: Tipus al qual pertany un agent col·lectiu. @ca
toolkit definition: Type auquel un agent collectif appartient. @fr
toolkit definition: Type, som en kollektiv agent tilhører. @da
toolkit definition: Tyyppi tai jaottelu, johon yhteistoimija kuuluu.
toolkit definition: Tüüp, millesse kollektiiv kuulub. @et
toolkit definition: Veids, pie kura pieder grupa. @lv
toolkit definition: نوع ينتمي إليه وكيل جماعي. @ar
toolkit definition: 一个集体行为者所属于的一个类型 @zh-hans
toolkit label: Kategorie eines gemeinschaftlichen Akteurs @de
toolkit label: categoria di agente collettivo @it
toolkit label: categoria d’agent col·lectiu @ca
toolkit label: categorie van collectieve actor @nl
toolkit label: category of collective agent @en
toolkit label: catégorie d’agent collectif @fr
toolkit label: grupas kategorija @lv
toolkit label: kategori af kollektiv agent @da
toolkit label: kategori for kollektiv agent @no
toolkit label: kolektif temsilci kategorisi @tr
toolkit label: kollektiivi kategooria @et
toolkit label: kollektív ágens kategóriája: @hu
toolkit label: yhteistoimijan kategoria
toolkit label: κατηγορία του συλλογικού φορέα @el
toolkit label: فئة الوكيل الجماعي @ar
toolkit label: 集体行为者的类别 @zh-hans
has subproperty: suvun kategoria
has subproperty: yhteisön kategoria
has subproperty: P50491
lexical alias: categoryOfCollectiveAgent.en
status: Published
type: Property
domain: C10011
label: a pour catégorie d’agent collectif @fr
label: grupas kategorija @lv
label: ha come categoria di agente collettivo @it
label: har kategori af kollektiv agent @da
label: har kategori for kollektiv agent @no
label: has category of collective agent @en
label: hat Kategorie eines gemeinschaftlichen Akteurs @de
label: heeft categorie van collectieve actor @nl
label: kolektif temsilcinin kategorisi ile ilişkilidir @tr
label: kollektiivi kategooria @et
label: kollektív ágens kategóriája: @hu
label: té com a categoria d’agent col·lectiu @ca
label: έχει κατηγορία του συλλογικού φορέα @el
label: له فئة لوكيل جماعي @ar
label: 有集体行为者的类别 @zh-hans
sub property of: toimijan kategoria
alternative label: kollektif temsilcinin türü @tr
alternative label: kollektiivi tüüp @et
alternative label: kollektív ágens típusa: @hu
alternative label: tipo de agente coelctivo @es
alternative label: tipo di agente collettivo @it
alternative label: tipus d’agent col·lectiu @ca
alternative label: type af kollektiv agent @da
alternative label: type d’agent collectif @fr
alternative label: type kollektiv agent @no
alternative label: type of collective agent @en
alternative label: yhteistoimijan tyyppi
alternative label: τύπος του συλλογικού φορέα @el
alternative label: نوع الوكيل الجماعي @ar
alternative label: 集体行为者的类型 @zh-hans
definition: Correla un agente collettivo a un tipo a cui un agente collettivo appartiene. @it
definition: Hozzákapcsol egy kollektív ágenst ahhoz a típushoz, amelyhez a kollektív ágens tartozik. @hu
definition: Kollektif bir temsilciyi, kollektif temsilcinin ait olduğu türle ilişkilendirir. @tr
definition: Liittää yhteistoimijan tyyppiin tai jaotteluun, johon yhteistoimija kuuluu.
definition: Met un agent collectif en relation avec un type auquel un agent collectif appartient. @fr
definition: Relaciona un agent col·lectiu amb un tipus al qual pertany un agent col·lectiu. @ca
definition: Relateert een collectieve actor aan een type waartoe een collectieve actor behoort. @nl
definition: Relaterer en kollektiv agent til en type som en kollektiv agent tilhører. @no
definition: Relaterer en kollektiv agent til en type, som en kollektiv agent tilhører. @da
definition: Relates a collective agent to a type to which a collective agent belongs. @en

koreografi (henkilö) teoksessa
has element type: 2
toolkit definition: A work that involves a responsibility of a person for creating a choreographic work. @en
toolkit definition: Een werk dat met zich meebrengt een verantwoordelijkheid van een persoon voor het creëren van een choreografisch werk. @nl
toolkit definition: Egy mű, amelyhez hozzátartozik egy személy felelőssége egy koreografikus mű létrehozásáért. @hu
toolkit definition: Ein Werk, bei dem eine Person für die Schaffung eines choreografischen Werks verantwortlich ist. @de
toolkit definition: Et koreografisk verk som involverer et ansvar for en person i form av koreografi. @no
toolkit definition: Horeogrāfisks darbs, kas ietver personas atbildību par horeogrāfiju. @lv
toolkit definition: Koreograafiline teos, mis sisaldab isiku vastutust koreograafia eest. @et
toolkit definition: Koreografik bir eser oluşturmak için bir kişinin sorumluluğunu içeren bir eser. @tr
toolkit definition: Obra que implica una responsabilitat d’una persona en la creació d’una obra coreogràfica. @ca
toolkit definition: Opera coreografica che implica una responsabilità di una persona nella coreografia. @it
toolkit definition: Teos, joka on koreografinen teos, jonka luomisesta henkilö on vastuussa.
toolkit definition: Værk, som involverer en persons ansvar for at skabe et koreografisk værk. @da
toolkit definition: Œuvre qui comporte une responsabilité de la part d’une personne consistant à créer une œuvre chorégraphique. @fr
toolkit definition: عمل تصميم رقصات يترتب عليه مسئولية شخص عن وضع الألحان الراقصة. @ar
toolkit definition: 涉及创作一种编舞作品的一个个人的贡献的一种作品 @zh-hans
toolkit label: Person als Choreografin/Choreograf von @de
toolkit label: choreograaf-persoon van @nl
toolkit label: choreographer person of @en
toolkit label: coreografo persona di @it
toolkit label: ir horeogrāfs (persona) @lv
toolkit label: koreograaf (isik) teoses @et
toolkit label: koreograf @tr
toolkit label: koreograf for (person) @no
toolkit label: koreografi (henkilö) teoksessa
toolkit label: koreográfus személye: @hu
toolkit label: person, som er koreograf af @da
toolkit label: persona coreògrafa de @ca
toolkit label: personne chorégraphe de @fr
toolkit label: χορογράφος φυσικό πρόσωπο του @el
toolkit label: شخص واضع الألحان الراقصة لـ @ar
toolkit label: ……的编舞者个人 @zh-hans
has subproperty: P50492
lexical alias: choreographerPersonOf.en
status: Published
type: Property
domain: C10004
label: er koreograf for (person) @no
label: er person, som er koreograf af @da
label: est une personne chorégraphe de @fr
label: ir horeogrāfs (persona) @lv
label: is choreograaf-persoon van @nl
label: is choreographer person of @en
label: ist Person als Choreografin/Choreograf von @de
label: koreograaf (isik) teoses @et
label: koreograf kişisidir @tr
label: koreográfus személye a következőnek: @hu
label: è coreografo persona di @it
label: és persona coreògrafa de @ca
label: είναι χορογράφος φυσικό πρόσωπο του @el
label: هو شخص واضع الألحان الراقصة لـ @ar
label: 是……的编舞者个人 @zh-hans
sub property of: koreografi (toimija) teoksessa
sub property of: teoksen tekijä (henkilö) teoksessa
definition: Bir temsilciyi, bir kişinin koreografik bir eser oluşturma sorumluluğunu içeren bir eserle ilişkilendirir. @tr
definition: Correla una persona a un'opera coreografica che implica una responsabilità di una persona nella coreografia. @it
definition: Hozzákapcsol egy ágenst egy műhöz, amelyhez hozzátartozik egy személy felelőssége egy koreografikus mű létrehozásáért. @hu
definition: Liittää toimijan teokseen, joka on koreografinen teos, jonka luomisesta henkilö on vastuussa.
definition: Met une personne en relation avec une œuvre qui comporte une responsabilité de la part d’une personne consistant à créer une œuvre chorégraphique. @fr
definition: Relaciona una persona amb una obra que implica una responsabilitat d’una persona en la creació d’una obra coreogràfica. @ca
definition: Relateert een persoon aan een werk dat met zich meebrengt een verantwoordelijkheid van een persoon voor het creëren van een choreografisch werk. @nl
definition: Relaterer en agent til et værk, som involverer en persons ansvar for at skabe et koreografisk værk. @da
definition: Relaterer en person til et koreografisk verk som involverer et ansvar for en person i form av koreografi. @no
definition: Relates a person to a work that involves a responsibility of a person for creating a choreographic work. @en
definition: Sasaista aģentu ar horeogrāfijas darbu, kas ietver personas atbildību par horeogrāfiju. @lv
definition: Seostab isiku koreograafilise teosega, mis sisaldab isiku vastutust koreograafia eest. @et
definition: Setzt eine Person in Beziehung zu einem Werk, bei dem ein Akteur für die Schaffung eines choreografischen Werks verantwortlich ist. @de
definition: يربط شخصا بعمل يترتب عليه تحمل شخص مسئولية وضع الألحان الراقصة لعمل @ar
definition: 将一个行为者与涉及创作一种编舞作品的一个个人的贡献的一种作品关联起来。 @zh-hans

lähetyksestä vastaava henkilö manifestaatiossa
has element type: 2
toolkit definition: A manifestation that involves a responsibility of a person for broadcasting to an audience via radio, television, webcast, etc. @en
toolkit definition: Bir kişinin radyo, televizyon, web yayını vb. aracılığıyla bir izleyici kitlesine yayın yapma sorumluluğunu içeren bir gösterim. @tr
toolkit definition: Een manifestatie die met zich meebrengt een verantwoordelijkheid van een persoon voor uitzending naar een publiek via radio, televisie, webcast etc. @nl
toolkit definition: Egy megjelenési forma, amelyhez hozzátartozik egy személy felelőssége műsorszórásért, amely a közönség felé rádión, televízión, webes közvetítésen stb. keresztül történik. @hu
toolkit definition: Eine Manifestation, bei der eine Person für die Ausstrahlung über Hörfunk, Fernsehen oder Webcast verantwortlich ist. @de
toolkit definition: En manifestasjon som involverer et ansvar for en person i form av kringkasting til et publikum via radio, fjernsyn, webkast etc. @no
toolkit definition: Kehastus, mis sisaldab isiku vastutust avalikkusele levitamise eest raadio, televisiooni, veebi vms kaudu. @et
toolkit definition: Manifestaatio, jossa henkilö on vastuussa radio-, televisio-, suoratoisto- tms. lähetyksen toteuttamisesta yleisölle.
toolkit definition: Manifestació que implica una responsabilitat d’una persona en la difusió a uns destinataris mitjançant la ràdio, la televisió, el web, etc. @ca
toolkit definition: Manifestation qui comporte une responsabilité de la part d’une personne concernant la diffusion à un public par la radio, la télévision, la webdiffusion, etc. @fr
toolkit definition: Manifestation, som involverer en persons ansvar for at transmittere til et publikum via radio, tv, webcast etc. @da
toolkit definition: Manifestazione che implica una responsabilità di una persona nella trasmissione a un pubblico via radio, televisione, web, etc. @it
toolkit definition: Manifestācija, kas ietver personas atbildību par pārraidi, izmantojot radio, televīziju, tīmekļa apraidi u.tml. @lv
toolkit definition: تجسيدة تنطوي على مسئولية شخص عن البث إلى جمهور عبر الإذاعة والتلفزيون والإنترنت، الخ. @ar
toolkit definition: 涉及通过广播、电视、网络直播等向听众播音的一个个人的责任的一种载体表现 @zh-hans
toolkit label: Person als Sender von @de
toolkit label: broadcaster person of @en
toolkit label: emittente persona di @it
toolkit label: ir raidorganizācija (persona) @lv
toolkit label: kringkaster av (person) @no
toolkit label: leviedastaja (isik) kehastuses @et
toolkit label: lähetyksestä vastaava henkilö manifestaatiossa
toolkit label: műsorszolgáltató személye: @hu
toolkit label: person, som er broadcaster af @da
toolkit label: persona difusora audiovisual de @ca
toolkit label: personne diffuseuse audiovisuelle de @fr
toolkit label: uitzender-persoon van @nl
toolkit label: yayıncı @tr
toolkit label: ευρυεκπομπέας φυσικό πρόσωπο του @el
toolkit label: شخص مذيع @ar
toolkit label: ……的广播者个人 @zh-hans
has subproperty: P50493
lexical alias: broadcasterPersonOf.en
status: Published
type: Property
domain: C10004
label: er kringkaster av (person) @no
label: er person, som er broadcaster af @da
label: est une personne diffuseuse audiovisuelle de @fr
label: ir raidorganizācija (persona) @lv
label: is broadcaster person of @en
label: is uitzender-persoon van @nl
label: ist Person als Sender von @de
label: leviedastaja (isik) kehastuses @et
label: műsorszolgáltató személye a következőnek: @hu
label: yayıncı kişisidir @tr
label: è emittente persona di @it
label: és persona difusora audiovisual de @ca
label: είναι ευρυεκπομπέας φυσικό πρόσωπο του @el
label: هو شخص مذيع لـ @ar
label: 是……的广播者个人 @zh-hans
sub property of: lähetyksestä vastaava toimija manifestaatiossa
sub property of: kustantaja (henkilö) manifestaatiossa
definition: Bir kişiyi, radyo, televizyon, web yayını vb. aracılığıyla bir izleyici kitlesine yayın yapma sorumluluğunu içeren gösterimle ilişkilendirir. @tr
definition: Correla una persona a una manifestazione che implica una responsabilità di una persona nella trasmissione a un pubblico via radio, televisione, web, etc. @it
definition: Hozzákapcsol egy személyt egy megjelenési formához, amelyhez hozzátartozik egy személy felelőssége műsorszórásért, amely a közönség felé rádión, televízión, webes közvetítésen stb. keresztül történik. @hu
definition: Liittää henkilön manifestaatioon, jossa henkilö on vastuussa radio-, televisio-, suoratoisto- tms. lähetyksen toteuttamisesta yleisölle.
definition: Met une personne en relation avec une manifestation qui comporte une responsabilité de la part d’une personne concernant la diffusion à un public par la radio, la télévision, la webdiffusion, etc. @fr
definition: Relaciona una persona amb una manifestació que implica una responsabilitat d’una persona en la difusió a uns destinataris mitjançant la ràdio, la televisió, el web, etc. @ca
definition: Relateert een persoon aan een manifestatie die met zich meebrengt een verantwoordelijkheid van een persoon voor uitzending naar een publiek via radio, televisie, webcast etc. @nl
definition: Relaterer en person til en manifestasjon som involverer et ansvar for en person i form av kringkasting til et publikum via radio, fjernsyn, webkast etc. @no
definition: Relaterer en person til en manifestation, som involverer en persons ansvar for at transmittere til et publikum via radio, tv, webcast etc. @da
definition: Relates a person to a manifestation that involves a responsibility of a person for broadcasting to an audience via radio, television, webcast, etc. @en
definition: Sasaista personu ar manifestāciju, kas ietver personas atbildību par pārraidi, izmantojot radio, televīziju, tīmekļa apraidi u.tml. @lv
definition: Seostab isiku kehastusega, mis sisaldab isiku vastutust avalikkusele levitamise eest raadio, televisiooni, veebi vms kaudu. @et
definition: Setzt eine Person in Beziehung zu einer Manifestation, bei der eine Person für die Ausstrahlung über Hörfunk, Fernsehen oder Webcast verantwortlich ist. @de
definition: يربط شخصا بتجسيدة تنطوي على مسئولية شخص عن البث إلى جمهور عبر الإذاعة والتلفزيون والإنترنت، الخ. @ar
definition: 将一个个人与涉及通过广播、电视、网络直播等向听众播音的一个个人的责任的一种载体表现关联起来。 @zh-hans

manifestaation tekijä (henkilö) manifestaatiossa
has element type: 2
toolkit definition: A manifestation that involves a responsibility of a person for creation. @en
toolkit definition: Bir kişinin yaratımdaki sorumlulunuğunu içeren bir gösterim. @tr
toolkit definition: Een manifestatie die met zich meebrengt een verantwoordelijkheid van een persoon voor creatie. @nl
toolkit definition: Egy megjelenési forma, amelyhez hozzátartozik egy személy felelőssége a létrehozásért. @hu
toolkit definition: Eine Manifestation, bei der eine Person für deren Erstellung verantwortlich ist. @de
toolkit definition: En manifestasjon som involverer et ansvar for en person i form av skapelse. @no
toolkit definition: Kehastus, mis sisaldab isiku vastutust kehastuse loomise eest. @et
toolkit definition: Manifestaatio, jonka luomisesta henkilö on vastuussa.
toolkit definition: Manifestació que implica una responsabilitat d’una persona en la creació. @ca
toolkit definition: Manifestation qui comporte une responsabilité de la part d’une personne en ce qui concerne la création. @fr
toolkit definition: Manifestation, som involverer en persons ansvar for skabelse. @da
toolkit definition: Manifestazione che implica una responsabilità di una persona per la creazione. @it
toolkit definition: Manifestācija, kas ietver personas atbildību par radīšanu. @lv
toolkit definition: تجسيدة تنطوي على مسئولية شخص عن الإنشاء. @ar
toolkit definition: 涉及一个创作个人的责任的一种载体表现 @zh-hans
toolkit label: Person als Mitwirkende/Mitwirkender an einer Manifestation von @de
toolkit label: creator person of manifestation of @en
toolkit label: creatore persona di manifestazione di @it
toolkit label: gösterimin yaratıcısı @tr
toolkit label: ir radītājs (persona) manifestācijai @lv
toolkit label: kehastuse teostaja (isik) kehastuses @et
toolkit label: létrehozó személye a következő megjelenési formának: @hu
toolkit label: maker-persoon van manifestatie van @nl
toolkit label: manifestaation tekijä (henkilö) manifestaatiossa
toolkit label: person, som er ophav til manifestation af @da
toolkit label: persona creadora d’una manifestació de @ca
toolkit label: personne créatrice d’une manifestation de @fr
toolkit label: skaper av manifestasjon for (person) @no
toolkit label: δημιουργός φυσικό πρόσωπο της εκδήλωσης του @el
toolkit label: شخص منشئ لتجسيدة لـ @ar
toolkit label: ……的载体表现的创建者个人 @zh-hans
has subproperty: julkaisemattoman manifestaation tuottaja (henkilö) manifestaatiossa
has subproperty: kuvalaatan valmistaja (henkilö) manifestaatiossa
has subproperty: valaja (henkilö) manifestaatiossa
has subproperty: painolaatan valmistaja (henkilö) manifestaatiossa
has subproperty: kustantaja (henkilö) manifestaatiossa
has subproperty: graafinen suunnittelija (henkilö) manifestaatiossa
has subproperty: P50494
lexical alias: creatorPersonOfManifestationOf.en
status: Published
type: Property
domain: C10004
label: er person, som er ophav til manifestation af @da
label: er skaper av manifestasjon for (person) @no
label: est une personne créatrice d’une manifestation de @fr
label: gösteriminin yaratıcı kişisidir @tr
label: ir radītājs (persona) manifestācijai @lv
label: is creator person of manifestation of @en
label: is maker-persoon van manifestatie van @nl
label: ist Person als Mitwirkende/Mitwirkender an einer Manifestation von @de
label: kehastuse teostaja (isik) kehastuses @et
label: létrehozó személye a következő megjelenési formának: @hu
label: è creatore persona di manifestazione di @it
label: és persona creadora d’una manifestació de @ca
label: είναι δημιουργός φυσικό πρόσωπο της εκδήλωσης του @el
label: هو شخص منشئ لتجسيدة لـ @ar
label: 是……的载体表现的创建者个人 @zh-hans
sub property of: henkilöön liittyvä manifestaatio
sub property of: manifestaation tekijä (toimija) manifestaatiossa
definition: Bir kişiyi, bir kişinin yaratım sorumluluğunu içeren gösterimle ilişkilendirir. @tr
definition: Correla una persona a una manifestazione che implica una responsabilità di una persona per la creazione. @it
definition: Hozzákapcsol egy személyt egy megjelenési formához, amelyhez hozzátartozik egy személy felelőssége a létrehozásért. @hu
definition: Liittää henkilön manifestaatioon, jonka luomisesta henkilö on vastuussa.
definition: Met une personne en relation avec une manifestation qui comporte une responsabilité de la part d’une personne en ce qui concerne la création. @fr
definition: Relaciona una persona amb una manifestació que implica una responsabilitat d’una persona en la creació. @ca
definition: Relateert een persoon aan een manifestatie die met zich meebrengt een verantwoordelijkheid van een persoon voor creatie. @nl
definition: Relaterer en person til en manifestasjon som involverer et ansvar for en person i form av skapelse. @no
definition: Relaterer en person til en manifestation, som involverer en persons ansvar for skabelse. @da
definition: Relates a person to a manifestation that involves a responsibility of a person for creation. @en
definition: Sasaista personu ar manifestāciju, kas ietver personas atbildību par radīšanu. @lv
definition: Seostab isiku kehastusega, mis sisaldab isiku vastutust kehastuse loomise eest. @et
definition: Setzt eine Person in Beziehung zu einer Manifestation, bei der eine Person für deren Erstellung verantwortlich ist. @de
definition: يربط شخصا بتجسيدة تنطوي على مسئولية شخص عن الإنشاء. @ar
definition: 将一个个人与涉及一个创作个人的责任的一种载体表现关联起来。 @zh-hans
scope note: A creator of manifestation includes a manufacturer, producer, and publisher. @en
scope note: Darunter fallen Hersteller, Produzentinnen/Produzenten und Verlage. @de
scope note: Een maker van manifestatie omvat een vervaardiger, producent en uitgever. @nl
scope note: Egy megjelenési forma létrehozója magában foglalja a gyártót, az előállítót és a kiadót. @hu

kaivertaja (henkilö) manifestaatiossa
has element type: 2
toolkit definition: A manifestation that involves a responsibility of a person for cutting letters, figures, etc., on a surface such as a wooden or metal plate used for printing. @en
toolkit definition: Baskı için kullanılan ahşap veya metal bir levha gibi bir yüzey üzerine harf, şekil vb. kesmek için bir kişinin sorumluluğunu içeren bir gösterim. @tr
toolkit definition: Een manifestatie die met zich meebrengt een verantwoordelijkheid van een persoon voor het snijden van letters, figuren etc., in een ondergrond zoals een houten of metalen plaat gebruikt voor het drukken. @nl
toolkit definition: Egy megjelenési forma, amelyhez hozzátartozik egy személy felelőssége betűknek, számoknak stb. nyomtatáshoz használt fa- vagy fémlemez felületére történő metszéséért. @hu
toolkit definition: Eine Manifestation, bei der eine Person für das Schneiden von Buchstaben, figürlichen Darstellungen oder andere Zeichen in eine Oberfläche, wie zum Beispiel eine Holz- oder Metallplatte, die zum Drucken benutzt wird, verantwortlich ist. @de
toolkit definition: En manifestasjon som involverer et ansvar for en person i form av å skjære ut bokstaver, figurer, etc. i en overflate som en tre- eller metallplate som brukes til trykking. @no
toolkit definition: Kehastus, mis sisaldab isiku vastutust tähtede, kujundite jms lõikamise eest trükkimiseks kasutatava puidust, metallist või muust materjalist plaadi pinnale. @et
toolkit definition: Manifestaatio, jossa henkilö on vastuussa manifestaation valmistamisesta kaivertamalla kirjaimia, kuvioita tms. painamisessa käytettävälle pinnalle, kuten puu- tai metallipinnalle.
toolkit definition: Manifestació que implica una responsabilitat d’una persona en la gravació de lletres, figures, etc., sobre una superfície com ara una planxa de fusta o de metall usada en la impressió. @ca
toolkit definition: Manifestation qui comporte une responsabilité de la part d’une personne consistant à graver des lettres, des figures, etc. sur une surface telle qu’une plaque de bois ou de métal utilisée pour l’impression. @fr
toolkit definition: Manifestation, som involverer en persons ansvar for at udskære bogstaver, figurer etc. på en overflade såsom en træ- eller metalplade, som anvendes til trykning. @da
toolkit definition: Manifestazione che implica una responsabilità di una persona per l'incisione di lettere, figure, etc., su una superficie come una lastra di legno o metallo utilizzata per la stampa. @it
toolkit definition: Manifestācija, kas ietver personas atbildību par burtu, zīmju u.tml. iegriešanu uz drukāšanai izmantojama materiāla virsmas (piemēram, uz koka vai metāla plāksnes). @lv
toolkit definition: تجسيدة تنطوي على مسئولية شخص عن رص الحروف والأشكال، الخ، على سطح مثل لوح خشبي أو معدني يستخدم للطباعة. @ar
toolkit definition: 涉及在木质或金属印刷平板的表面上刻字母、图形等的一个个人的责任的一种载体表现 @zh-hans
toolkit label: Person als Stecherin/Stecher von @de
toolkit label: engraver person of @en
toolkit label: graveerija (isik) kehastuses @et
toolkit label: graveur-persoon van @nl
toolkit label: gravør for (person) @no
toolkit label: gravür sanatçısı @tr
toolkit label: incisore persona di @it
toolkit label: ir gravieris (persona) @lv
toolkit label: kaivertaja (henkilö) manifestaatiossa
toolkit label: person, som er gravør af @da
toolkit label: persona gravadora de @ca
toolkit label: personne graveuse de @fr
toolkit label: vésnök személye: @hu
toolkit label: χαράκτης φυσικό πρόσωπο του @el
toolkit label: شخص نقاش @ar
toolkit label: ……的雕版者个人 @zh-hans
has subproperty: P50495
lexical alias: engraverPersonOf.en
status: Published
type: Property
domain: C10004
label: er gravør for (person) @no
label: er person, som er gravør af @da
label: est une personne graveuse de @fr
label: graveerija (isik) kehastuses @et
label: gravür sanatçısı kişisidir @tr
label: ir gravieris (persona) @lv
label: is engraver person of @en
label: is graveur-persoon van @nl
label: ist Person als Stecherin/Stecher von @de
label: vésnök személye a következőnek: @hu
label: è incisore persona di @it
label: és persona gravadora de @ca
label: είναι χαράκτης φυσικό πρόσωπο του @el
label: هو شخص نقاش لـ @ar
label: 是……的雕版者个人 @zh-hans
sub property of: kaivertaja (toimija) manifestaatiossa
sub property of: kuvalaatan valmistaja (henkilö) manifestaatiossa
definition: Bir kişiyi, baskı için kullanılan ahşap veya metal bir levha gibi bir yüzey üzerine harf, şekil vb. kesme sorumluluğunu içeren gösterimle ilişkilendirir. @tr
definition: Correla una persona a una manifestazione che implica una responsabilità di una persona per l'incisione di lettere, figure, etc., su una superficie come una lastra di legno o metallo utilizzata per la stampa. @it
definition: Hozzákapcsol egy személyt egy megjelenési formához, amelyhez hozzátartozik egy személy felelőssége betűknek, számoknak stb. nyomtatáshoz használt fa- vagy fémlemez felületére történő metszéséért. @hu
definition: Liittää henkilön manifestaatioon, jossa henkilö on vastuussa manifestaation valmistamisesta kaivertamalla kirjaimia, kuvioita tms. painamisessa käytettävälle pinnalle, kuten puu- tai metallipinnalle.
definition: Met une personne en relation avec une manifestation qui comporte une responsabilité de la part d’une personne consistant à graver des lettres, des figures, etc. sur une surface telle qu’une plaque de bois ou de métal utilisée pour l’impression. @fr
definition: Relaciona una persona amb una manifestació que implica una responsabilitat d’una persona en la gravació de lletres, figures, etc., sobre una superfície com ara una planxa de fusta o de metall usada en la impressió. @ca
definition: Relateert een persoon aan een manifestatie die met zich meebrengt een verantwoordelijkheid van een persoon voor het snijden van letters, figuren etc., in een ondergrond zoals een houten of metalen plaat gebruikt voor het drukken. @nl
definition: Relaterer en person til en manifestasjon som involverer et ansvar for en person i form av å skjære ut bokstaver, figurer, etc. i en overflate som en tre- eller metallplate som brukes til trykking. @no
definition: Relaterer en person til en manifestation, som involverer en persons ansvar for at udskære bogstaver, figurer etc. på en overflade såsom en træ- eller metalplade, som anvendes til trykning. @da
definition: Relates a person to a manifestation that involves a responsibility of a person for cutting letters, figures, etc., on a surface such as a wooden or metal plate used for printing. @en
definition: Sasaista personu ar manifestāciju, kas ietver personas atbildību par burtu, zīmju u.tml. iegriešanu uz drukāšanai izmantojama materiāla virsmas (piemēram, uz koka vai metāla plāksnes). @lv
definition: Seostab isiku kehastusega, mis sisaldab isiku vastutust tähtede, kujundite jms lõikamise eest trükkimiseks kasutatava puidust, metallist või muust materjalist plaadi pinnale. @et
definition: Setzt eine Person in Beziehung zu einer Manifestation, bei der eine Person für das Schneiden von Buchstaben, figürlichen Darstellungen oder andere Zeichen in eine Oberfläche, wie zum Beispiel eine Holz- oder Metallplatte, die zum Drucken benutzt wird, verantwortlich ist. @de
definition: يربط شخصا بتجسيدة تنطوي على مسئولية شخص عن رص الحروف والأشكال، الخ، على سطح مثل لوح خشبي أو معدني يستخدم للطباعة. @ar
definition: 将一个个人与涉及在木质或金属印刷平板的表面上刻字母、图形等的一个个人的责任的一种载体表现关联起来。 @zh-hans

elokuvan jakelija (henkilö) manifestaatiossa
has element type: 2
toolkit definition: A manifestation that involves a responsibility of a person for distribution of a moving image to theaters or other channels. @en
toolkit definition: Een manifestatie die met zich meebrengt een verantwoordelijkheid van een persoon voor distributie van een bewegend beeld naar theaters of andere kanalen. @nl
toolkit definition: Egy megjelenési forma, amelyhez hozzátartozik egy személy felelőssége mozgókép filmszínházak vagy más csatornák útján történő terjesztéséért. @hu
toolkit definition: Eine Manifestation, bei der eine Person für den Vertrieb eines Bewegtbilds an Kinos oder andere Vertriebskanäle verantwortlich ist. @de
toolkit definition: En manifestasjon som involverer et ansvar for en person i form av distribusjon av levende bilder til kinoer eller andre kanaler. @no
toolkit definition: Hareketli bir görüntünün sinemalara veya diğer kanallara dağıtılması için bir kişinin sorumluluğunu içeren bir gösterim. @tr
toolkit definition: Kehastus, mis sisaldab isiku vastutust filmi levitamise eest kinodesse või muudesse levikanalitesse. @et
toolkit definition: Manifestaatio, jonka jakelusta elokuvateattereille tai muille jakelukanaville henkilö on vastuussa.
toolkit definition: Manifestació que implica una responsabilitat d’una persona en la difusió d’una imatge en moviment a cinemes o a altres canals de distribució. @ca
toolkit definition: Manifestation qui comporte une responsabilité de la part d’une personne en ce qui concerne la distribution d’images animées aux salles de cinéma ou aux autres réseaux de distribution. @fr
toolkit definition: Manifestation, som involverer en persons ansvar for distribution af et levende billede til biografer eller andre distributionskanaler. @da
toolkit definition: Manifestazione che implica una responsabilità di una persona nella distribuzione di un'immagine in movimento a teatri o altri canali. @it
toolkit definition: Manifestācija, kas ietver personas atbildību par filmas izplatīšanu kinoteātriem vai caur citiem izplatīšanas kanāliem. @lv
toolkit definition: تجسيدة تنطوي على مسئولية شخص عن توزيع فيلم على قاعات العرض أو عبر قنوات أخرى. @ar
toolkit definition: 涉及发行动态图像至剧院或其他渠道的一个个人的责任的一种载体表现 @zh-hans
toolkit label: Person als Filmvertrieb von @de
toolkit label: distributore cinematografico persona di @it
toolkit label: elokuvan jakelija (henkilö) manifestaatiossa
toolkit label: film dağıtıcısı @tr
toolkit label: film distributor person of @en
toolkit label: filmdistributeur-persoon van @nl
toolkit label: filmdistributør for (person) @no
toolkit label: filmilevitaja (isik) kehastuses @et
toolkit label: filmterjesztő személye: @hu
toolkit label: ir filmas izplatītājs (persona) @lv
toolkit label: person, som er filmdistributør af @da
toolkit label: persona distribuïdora de pel·lícules de @ca
toolkit label: personne distributrice de cinéma de @fr
toolkit label: διανομέας ταινίας φυσικό πρόσωπο του @el
toolkit label: شخص موزع أفلام @ar
toolkit label: ……的电影发行者个人 @zh-hans
has subproperty: P50496
lexical alias: filmDistributorPersonOf.en
status: Published
type: Property
domain: C10004
label: er filmdistributør for (person) @no
label: er person, som er filmdistributør af @da
label: est une personne distributrice de cinéma de @fr
label: film dağıtımcısı kişisidir @tr
label: filmilevitaja (isik) kehastuses @et
label: filmterjesztő személye a következőnek: @hu
label: ir filmas izplatītājs (persona) @lv
label: is film distributor person of @en
label: is filmdistributeur-persoon van @nl
label: ist Person als Filmvertrieb von @de
label: è distributore cinematografico persona di @it
label: és persona distribuïdora de pel·lícules de @ca
label: είναι διανομέας ταινίας φυσικό πρόσωπο του @el
label: هو شخص موزع أفلام لـ @ar
label: 是……的电影发行者个人 @zh-hans
sub property of: elokuvan jakelija (toimija) manifestaatiossa
sub property of: jakelija (henkilö) manifestaatiossa
alternative label: personne distributrice de film de @fr
definition: Bir kişiyi, hareketli bir görüntünün sinemalara veya diğer kanallara dağıtılması sorumluluğunu içeren gösterimle ilişkilendirir. @tr
definition: Correla una persona a una manifestazione che implica una responsabilità di una persona nella distribuzione di un'immagine in movimento a teatri o altri canali. @it
definition: Hozzákapcsol egy személyt egy megjelenési formához, amelyhez hozzátartozik egy személy felelőssége mozgókép filmszínházak vagy más csatornák útján történő terjesztéséért. @hu
definition: Liittää henkilön manifestaatioon, jonka jakelusta elokuvateattereille tai muille jakelukanaville henkilö on vastuussa.
definition: Met une personne en relation avec une manifestation qui comporte une responsabilité de la part d’une personne en ce qui concerne la distribution d’images animées aux salles de cinéma ou aux autres réseaux de distribution. @fr
definition: Relaciona una persona amb una manifestació que implica una responsabilitat d’una persona en la distribució d’una imatge en moviment a cinemes o a altres canals de distribució. @ca
definition: Relateert een persoon aan een manifestatie die met zich meebrengt een verantwoordelijkheid van een persoon voor distributie van een bewegend beeld naar theaters of andere kanalen. @nl
definition: Relaterer en person til en manifestasjon som involverer et ansvar for en person i form av distribusjon av levende bilder til kinoer eller andre kanaler. @no
definition: Relaterer en person til en manifestation, som involverer en persons ansvar for distribution af et levende billede til biografer eller andre distributionskanaler. @da
definition: Relates a person to a manifestation that involves a responsibility of a person for distribution of a moving image to theaters or other channels. @en
definition: Sasaista personu ar manifestāciju, kas ietver personas atbildību par filmas izplatīšanu kinoteātriem vai caur citiem izplatīšanas kanāliem. @lv
definition: Seostab isiku kehastusega, mis sisaldab isiku vastutust filmi levitamise eest kinodesse või muudesse levikanalitesse. @et
definition: Setzt eine Person in Beziehung zu einer Manifestation, bei der eine Person für den Vertrieb eines Bewegtbilds an Kinos oder andere Vertriebskanäle verantwortlich ist. @de
definition: يربط شخصا بتجسيدة تنطوي على مسئولية شخص عن توزيع فيلم على قاعات العرض أو عبر قنوات أخرى. @ar
definition: 将一个个人与涉及发行动态图像至剧院或其他渠道的一个个人的责任的一种载体表现关联起来。 @zh-hans

jakelija (henkilö) manifestaatiossa
has element type: 2
toolkit definition: A manifestation that involves a responsibility of a person for distribution. @en
toolkit definition: Bir kişinin dağıtımdaki sorumluluğunu içeren bir gösterim. @tr
toolkit definition: Een manifestatie die met zich meebrengt een verantwoordelijkheid van een persoon voor distributie. @nl
toolkit definition: Egy megjelenési forma, amelyhez hozzátartozik egy ágens felelőssége a terjesztésért. @hu
toolkit definition: Eine Manifestation, bei der eine Person für den Vertrieb verantwortlich ist. @de
toolkit definition: En manifestasjon som involverer et ansvar for en person i form av distribusjon. @no
toolkit definition: Kehastus, mis sisaldab isiku vastutust levitamise eest. @et
toolkit definition: Manifestaatio, jonka jakelusta henkilö on vastuussa.
toolkit definition: Manifestació que implica una responsabilitat d’una persona en la distribució. @ca
toolkit definition: Manifestation qui comporte une responsabilité de la part d’une personne en ce qui concerne la diffusion ou la distribution. @fr
toolkit definition: Manifestation, som involverer en persons ansvar for distribution. @da
toolkit definition: Manifestazione che implica una responsabilità di una persona nella distribuzione. @it
toolkit definition: Manifestācija, kas ietver personas atbildību par izplatīšanu. @lv
toolkit definition: تجسيدة تنطوي على مسئولية شخص عن التوزيع. @ar
toolkit definition: 涉及一个发行个人的责任的一种载体表现 @zh-hans
toolkit label: Person als Vertrieb von @de
toolkit label: dağıtıcı @tr
toolkit label: distributeur-persoon van @nl
toolkit label: distributor person of @en
toolkit label: distributore persona di @it
toolkit label: distributør for (person) @no
toolkit label: ir izplatītājs (persona) @lv
toolkit label: jakelija (henkilö) manifestaatiossa
toolkit label: levitaja (isik) kehastuses @et
toolkit label: person, som er distributør af @da
toolkit label: persona distribuïdora de @ca
toolkit label: personne diffuseuse ou distributrice de @fr
toolkit label: terjesztő személye: @hu
toolkit label: διανομέας φυσικό πρόσωπο του @el
toolkit label: شخص موزع @ar
toolkit label: ……的发行者个人 @zh-hans
has subproperty: elokuvan jakelija (henkilö) manifestaatiossa
has subproperty: P50497
lexical alias: distributorPersonOf.en
status: Published
type: Property
domain: C10004
label: dağıtımcı kişisidir @tr
label: er distributør for (person) @no
label: er person, som er distributør af @da
label: est une personne diffuseuse ou distributrice de @fr
label: ir izplatītājs (persona) @lv
label: is distributeur-persoon van @nl
label: is distributor person of @en
label: ist Person als Vertrieb von @de
label: levitaja (isik) kehastuses @et
label: terjesztő személye a következőnek: @hu
label: è distributore persona di @it
label: és persona distribuïdora de @ca
label: είναι διανομέας φυσικό πρόσωπο του @el
label: هو شخص موزع لـ @ar
label: 是……的发行者个人 @zh-hans
sub property of: jakelija (toimija) manifestaatiossa
sub property of: henkilöön liittyvä manifestaatio
definition: Bir kişiyi, kişinin dağıtımdaki sorumluğunun gösterimle ilişkilendirir. @tr
definition: Correla una persona a una manifestazione che implica una responsabilità di una persona nella distribuzione. @it
definition: Hozzákapcsol egy személyt egy megjelenési formához, amelyhez hozzátartozik egy személy felelőssége a terjesztésért. @hu
definition: Liittää henkilön manifestaatioon, jonka jakelusta henkilö on vastuussa.
definition: Met une personne en relation avec une manifestation qui comporte une responsabilité de la part d’une personne en ce qui concerne la diffusion ou la distribution. @fr
definition: Relaciona una persona amb una manifestació que implica una responsabilitat d’una persona en la distribució. @ca
definition: Relateert een persoon aan een manifestatie die met zich meebrengt een verantwoordelijkheid van een persoon voor distributie. @nl
definition: Relaterer en person til en manifestasjon som involverer et ansvar for en person i form av distribusjon. @no
definition: Relaterer en person til en manifestation, som involverer en persons ansvar for distribution. @da
definition: Relates a person to a manifestation that involves a responsibility of a person for distribution. @en
definition: Sasaista personu ar manifestāciju, kas ietver personas atbildību par izplatīšanu. @lv
definition: Seostab isiku kehastusega, mis sisaldab isiku vastutust levitamise eest. @et
definition: Setzt eine Person in Beziehung zu einer Manifestation, bei der eine Person für den Vertrieb verantwortlich ist. @de
definition: يربط شخصا بتجسيدة تنطوي على مسئولية شخص عن التوزيع. @ar
definition: 将一个个人与涉及一个发行个人的责任的一种载体表现关联起来。 @zh-hans

pistekirjoituksen tekijä (henkilö) manifestaatiossa
has element type: 2
toolkit definition: A manifestation that involves a responsibility of a person for embossing braille cells using a stylus, special embossing printer, or other device. @en
toolkit definition: Bir kalem, özel kabartma yazıcı veya başka bir cihaz kullanarak braille hücrelerini kabartmak için bir kişinin sorumluluğunu içeren bir gösterim. @tr
toolkit definition: Een manifestatie die met zich meebrengt een verantwoordelijkheid van een persoon voor het pregen van braille cellen met gebruikmaking van een stylus, speciale preegdrukmachine of ander instrument. @nl
toolkit definition: Egy megjelenési forma, amelyhez hozzátartozik egy ágens felelőssége braille-cellák dombornyomásáért íróvessző, speciális dombornyomtató vagy más eszköz használatával. @hu
toolkit definition: Eine Manifestation, bei der eine Person für das Prägen von Braillezeichen verantwortlich ist, indem sie einen Griffel, einen speziellen Brailledrucker oder ein anderes Gerät verwendet. @de
toolkit definition: En manifestasjon som involverer et ansvar for en person i form av å prege brailleceller ved hjelp av pren, punktskriftmaskin eller annen innretning. @no
toolkit definition: Kehastus, mis sisaldab isiku vastutust spetsiaalse kirjutusvahendi, punktkirjaprinteri või muu seadmega punktkirjamärkide tegemise eest. @et
toolkit definition: Manifestaatio, jonka tekemisestä henkilö on vastuussa tuottamalla pistekirjoitusmerkkejä piirtimen, erityistulostimen tai muun laitteen avulla.
toolkit definition: Manifestació que implica una responsabilitat d’una persona en el repujat de punts braille amb un punxó, una impressora especial d’estampar o un altre mecanisme. @ca
toolkit definition: Manifestation qui comporte une responsabilité de la part d’une personne consistant à embosser des cellules braille au moyen d’un poinçon, d’une imprimante spéciale ou d’un autre appareil. @fr
toolkit definition: Manifestation, som involverer en persons ansvar for at præge punktskriftsceller vha. en stift, særlig prægeprinter eller anden anordning. @da
toolkit definition: Manifestazione che implica una responsabililtà di una persona per lo sbalzo di punti braille utilizzando uno stilo, una speciale stampante a sbalzo o altro dispositivo. @it
toolkit definition: Manifestācija, kas ietver personas atbildību par Braila raksta matricas iespiešanu, izmantojot irbuli, īpaša ciļņa iespieduma printeri vai citu ierīci. @lv
toolkit definition: تجسيدة تنطوي على مسئولية شخص عن نقش خلايا برايل باستخدام قلم أو طابعة خاصة للنقش أو أي أداة أخرى. @ar
toolkit definition: 涉及用点字笔、特殊压印机或其他设备压印布莱叶盲文点字的一个个人的责任的一种载体表现 @zh-hans
toolkit label: Braille-dombornyomó személye: @hu
toolkit label: Person als Brailleschriftprägerin/Brailleschriftpräger von @de
toolkit label: braille embosser person of @en
toolkit label: braille kabartmacısı @tr
toolkit label: brailleerder-persoon van @nl
toolkit label: ir iespiedējs Braila rakstā (persona) @lv
toolkit label: person, som er punktskriftspræger af @da
toolkit label: persona estampadora braille de @ca
toolkit label: personne productrice braille de @fr
toolkit label: pistekirjoituksen tekijä (henkilö) manifestaatiossa
toolkit label: punktkirja kirjutaja (isik) kehastuses @et
toolkit label: punktskriftspreger for (person) @no
toolkit label: stampatore braille persona di @it
toolkit label: μπράιγ τυπογράφος φυσικό πρόσωπο του @el
toolkit label: شخص نقاش حروف بطريقة برايل @ar
toolkit label: ……的布莱叶盲文点字制作者个人 @zh-hans
has subproperty: P50498
lexical alias: brailleEmbosserPersonOf.en
status: Published
type: Property
domain: C10004
label: Braille-dombornyomó személye a következőnek: @hu
label: braille kabartmacısı kişisidir @tr
label: er person, som er punktskriftspræger af @da
label: er punktskriftspreger for (person) @no
label: est une personne productrice braille de @fr
label: ir iespiedējs Braila rakstā (persona) @lv
label: is braille embosser person of @en
label: is brailleerder-persoon van @nl
label: ist Person als Brailleschriftprägerin/Brailleschriftpräger von @de
label: punktkirja kirjutaja (isik) kehastuses @et
label: è stampatore braille persona di @it
label: és persona estampadora braille de @ca
label: είναι μπράιγ τυπογράφος φυσικό πρόσωπο του @el
label: هو شخص نقاش حروف بطريقة برايل @ar
label: 是……的布莱叶盲文点字制作者个人 @zh-hans
sub property of: pistekirjoituksen tekijä (toimija) manifestaatiossa
sub property of: valmistaja (henkilö) manifestaatiossa
definition: Bir kişiyi, kalem, özel kabartma yazıcı veya başka bir cihaz kullanarak braille hücrelerini kabartma sorumluluğunu içeren gösterimle ilişkilendirir. @tr
definition: Correla una persona a una manifestazione che implica una responsabililtà di una persona per lo sbalzo di punti braille utilizzando uno stilo, una speciale stampante a sbalzo o altro dispositivo. @it
definition: Hozzákapcsol egy személyt egy megjelenési formához, amelyhez hozzátartozik egy ágens felelőssége braille-cellák dombornyomásáért íróvessző, speciális dombornyomtató vagy más eszköz használatával. @hu
definition: Liittää henkilön manifestaatioon, jonka tekemisestä henkilö on vastuussa tuottamalla pistekirjoitusmerkkejä piirtimen, erityistulostimen tai muun laitteen avulla.
definition: Met une personne en relation avec une manifestation qui comporte une responsabilité de la part d’une personne consistant à embosser des cellules braille au moyen d’un poinçon, d’une imprimante spéciale ou d’un autre appareil. @fr
definition: Relaciona una persona amb una manifestació que implica una responsabilitat d’una persona en el repujat de punts braille amb un punxó, una impressora especial d’estampar o un altre mecanisme. @ca
definition: Relateert een persoon aan een manifestatie die met zich meebrengt een verantwoordelijkheid van een persoon voor het pregen van braille cellen met gebruikmaking van een stylus, speciale preegdrukmachine of ander instrument. @nl
definition: Relaterer en person til en manifestasjon som involverer et ansvar for en person i form av å prege brailleceller ved hjelp av pren, punktskriftmaskin eller annen innretning. @no
definition: Relaterer en person til en manifestation, som involverer en persons ansvar for at præge punktskriftsceller vha. en stift, særlig prægeprinter eller anden anordning. @da
definition: Relates a person to a manifestation that involves a responsibility of a person for embossing braille cells using a stylus, special embossing printer, or other device. @en
definition: Sasaista personu ar manifestāciju, kas ietver personas atbildību par Braila raksta matricas iespiešanu, izmantojot irbuli, īpaša ciļņa iespieduma printeri vai citu ierīci. @lv
definition: Seostab isiku kehastusega, mis sisaldab isiku vastutust spetsiaalse kirjutusvahendi, punktkirjaprinteri või muu seadmega punktkirjamärkide tegemise eest. @et
definition: Setzt eine Person in Beziehung zu einer Manifestation, bei der eine Person für das Prägen von Braillezeichen verantwortlich ist, indem sie einen Griffel, einen speziellen Brailledrucker oder ein anderes Gerät verwendet. @de
definition: يربط شخصا بتجسيدة تنطوي على مسئولية شخص عن نقش خلايا برايل باستخدام قلم أو طابعة خاصة للنقش أو أي أداة أخرى. @ar
definition: 将一个个人与涉及用点字笔、特殊压印机或其他设备压印布莱叶盲文点字的一个个人的责任的一种载体表现关联起来。 @zh-hans

julkaisemattoman manifestaation tuottaja (henkilö) manifestaatiossa
has element type: 2
toolkit definition: A manifestation that involves a responsibility of a person for inscribing, fabrication, construction, etc. @en
toolkit definition: Een manifestatie die met zich meebrengt een verantwoordelijkheid van een persoon voor afschrijven, fabriceren, construeren etc. @nl
toolkit definition: Egy megjelenési forma, amelyhez hozzátartozik egy ágens íráshoz, összeállításhoz, készítéshez stb. fűződő felelőssége. @hu
toolkit definition: Eine Manifestation, bei der eine Person für das Gravieren, Fabrizieren, Konstruieren oder eine andere Herstellungsmethode verantwortlich ist. @de
toolkit definition: En manifestasjon som involverer et ansvar for en person i form av inskripsjon, fabrikasjon, konstruksjon etc. @no
toolkit definition: Julkaisematon manifestaatio, jossa henkilö on vastuussa kaiverruksesta, valmistuksesta, kokoonpanosta tms.
toolkit definition: Kehastus, mis sisaldab isiku vastutust inskribeerimise, tootmise, ehitamise vms eest. @et
toolkit definition: Manifestació que implica una responsabilitat d’una persona en la inscripció, fabricació, construcció, etc. @ca
toolkit definition: Manifestation qui comporte une responsabilité de la part d’une personne en ce qui concerne la scription, la fabrication, la construction, etc. @fr
toolkit definition: Manifestation, som involverer en persons ansvar for indskrift, fremstilling, konstruktion etc. @da
toolkit definition: Manifestazione che implica una responsabilità di una persona nella scrittura, fabbricazione, costruzione, etc. @it
toolkit definition: Manifestācija, kas ietver personas atbildību par pierakstīšanu, izgatavošanu, radīšanu u.tml. @lv
toolkit definition: Yazma, üretim, yapım vb. için bir kişinin sorumluluğunu içeren bir gösterim. @tr
toolkit definition: تجسيدة تنطوي على مسئولية شخص عن الكتابة أو التصنيع أو البنية، إلخ. @ar
toolkit definition: 涉及镌刻、制造、构建等的一个个人的责任的一种载体表现 @zh-hans
toolkit label: Person als Erzeugerin/Erzeuger einer unveröffentlichten Manifestation von @de
toolkit label: avaldamata kehastuse tootja (isik) kehastuses @et
toolkit label: előállító személye a következő kiadatlan megjelenési formának: @hu
toolkit label: ir nepublicētas manifestācijas izgatavotājs (persona) @lv
toolkit label: julkaisemattoman manifestaation tuottaja (henkilö) manifestaatiossa
toolkit label: person, som er producer af upubliceret manifestation af @da
toolkit label: persona productora d’una manifestació no publicada de @ca
toolkit label: personne productrice d’une manifestation non publiée de @fr
toolkit label: producer person of unpublished manifestation of @en
toolkit label: productie-persoon van ongepubliceerde manifestatie van @nl
toolkit label: produsent av upublisert manifestasjon for (person) @no
toolkit label: produttore persona di manifestazione non pubblicata di @it
toolkit label: yayınlanmamış gösterinin yapımcı kişisi @tr
toolkit label: παραγωγός φυσικό πρόσωπο αδημοσίευτης εκδήλωσης @el
toolkit label: شخص منتج تجسيدة غير منشورة @ar
toolkit label: ……的非出版载体表现的制作者个人 @zh-hans
has subproperty: P50499
lexical alias: producerPersonOfUnpublishedManifestationOf.en
status: Published
type: Property
domain: C10004
label: avaldamata kehastuse tootja (isik) kehastuses @et
label: előállító személye a következő kiadatlan megjelenési formának: @hu
label: er person, som er producer af upubliceret manifestation af @da
label: er produsent av upublisert manifestasjon for (person) @no
label: est une personne productrice d’une manifestation non publiée de @fr
label: ir nepublicētas manifestācijas izgatavotājs (persona) @lv
label: is producent-persoon van ongepubliceerde manifestatie van @nl
label: is producer person of unpublished manifestation of @en
label: ist Person als Erzeugerin/Erzeuger einer unveröffentlichten Manifestation von @de
label: yayınlanmamış gösterimin yapımcı kişisidir @tr
label: è produttore persona di manifestazione non pubblicata di @it
label: és persona productora d’una manifestació no publicada de @ca
label: είναι παραγωγός φυσικό πρόσωπο αδημοσίευτης εκδήλωσης @el
label: هو شخص منتج تجسيدة غير منشورة لـ @ar
label: 是……的非出版载体表现的制作者个人 @zh-hans
sub property of: julkaisemattoman manifestaation tuottaja (toimija) manifestaatiossa
sub property of: manifestaation tekijä (henkilö) manifestaatiossa
definition: Bir kişiyi, bir kişinin yazım, üretim, yapım vb. sorumluluğunu içeren gösterimle ilişkilendirir. @tr
definition: Correla una persona a una manifestazione che implica una responsabilità di una persona nella scrittura, fabbricazione, costruzione, etc. @it
definition: Hozzákapcsol egy személyt egy megjelenési formához, amelyhez hozzátartozik egy ágens íráshoz, összeállításhoz, készítéshez stb. fűződő felelőssége. @hu
definition: Liittää henkilön julkaisemattomaan manifestaatioon, jossa henkilö on vastuussa kaiverruksesta, valmistuksesta, kokoonpanosta tms.
definition: Met une personne en relation avec une manifestation qui comporte une responsabilité de la part d’une personne en ce qui concerne la scription, la fabrication, la construction, etc. @fr
definition: Relaciona una persona amb una manifestació que implica una responsabilitat d’una persona en la inscripció, fabricació, construcció, etc. @ca
definition: Relateert een persoon aan een manifestatie die met zich meebrengt een verantwoordelijkheid van een persoon voor afschrijven, fabriceren, construeren etc. @nl
definition: Relaterer en person til en manifestasjon som involverer et ansvar for en person i form av inskripsjon, fabrikasjon, konstruksjon etc. @no
definition: Relaterer en person til en manifestation, som involverer en persons ansvar for indskrift, fremstilling, konstruktion etc. @da
definition: Relates a person to a manifestation that involves a responsibility of a person for inscribing, fabrication, construction, or other method of producing. @en
definition: Sasaista personu ar manifestāciju, kas ietver personas atbildību par pierakstīšanu, izgatavošanu, radīšanu u.tml. @lv
definition: Seostab isiku kehastusega, mis sisaldab isiku vastutust inskribeerimise, tootmise, ehitamise vms eest. @et
definition: Setzt eine Person in Beziehung zu einer Manifestation, bei der eine Person für das Gravieren, Fabrizieren, Konstruieren oder eine andere Herstellungsmethode verantwortlich ist. @de
definition: يربط شخصا بتجسيدة تنطوي على مسئولية شخص عن الكتابة أو التصنيع أو البنية، إلخ. @ar
definition: 将一个个人与涉及镌刻、制造、构建等的一个个人的责任的一种载体表现关联起来。 @zh-hans

kuvalaatan valmistaja (henkilö) manifestaatiossa
has element type: 2
toolkit definition: A manifestation that involves a responsibility of a person for making a relief, intaglio, or planographic printing surface. @en
toolkit definition: Bir kişinin kabartma, çukur baskı veya planografik baskı yüzeyi yapmak için sorumluluğunu içeren bir gösterim. @tr
toolkit definition: Een manifestatie die met zich meebrengt een verantwoordelijkheid van een persoon voor het maken van een relief, intaglio of vlakdruk oppervlak. @nl
toolkit definition: Egy megjelenési forma, amelyhez hozzátartozik egy ágens felelőssége egy relief, egy mélynyomásos vagy síknyomásos felület készítéséért. @hu
toolkit definition: Eine Manifestation, bei der eine Person für die Herstellung einer Hochdruck-, Tiefdruck- oder Flachdruckoberfläche verantwortlich ist. @de
toolkit definition: En manifestasjon som involverer et ansvar for en person i form av å lage en overflate for relieff-, intaglio- eller plantrykk. @no
toolkit definition: Kehastus, mis sisaldab isiku vastutust kõrgtrüki, sügavtrüki või lametrüki teel tõmmiste tegemise eest. @et
toolkit definition: Manifestaatio, jossa henkilö on vastuussa kohokuvan, syväpainon tai laakapainon painopinnan valmistamisesta.
toolkit definition: Manifestació que implica una responsabilitat d’una persona en la fabricació una superfície d’impressió en relleu, gravada en profunditat o planogràfica. @ca
toolkit definition: Manifestation qui comporte une responsabilité de la part d’une personne consistant à préparer un élément d’impression en relief, en creux ou planographique. @fr
toolkit definition: Manifestation, som involverer en persons ansvar for at lave en relief-, dybtryks- eller fladtryksoverflade. @da
toolkit definition: Manifestazione che implica una responsabilità di una persona per la realizzazione di una superficie a rilievo, intaglio o stampa planografica. @it
toolkit definition: Manifestācija, kas ietver personas atbildību par reljefa, dobspiedes vai gludspieduma drukāšanas virsmas izveidi. @lv
toolkit definition: تجسيدة تنطوي على مسئولية شخص عن إعداد سطح لطباعة بارزة، أو غائرة، أو مستوية. @ar
toolkit definition: 涉及制作浮雕、凹版或平版印刷表面的一个个人的责任的一种载体表现 @zh-hans
toolkit label: Grafiker kişisi @tr
toolkit label: Person als Druckgrafikerin/Druckgrafiker von @de
toolkit label: graafika trükkija (isik) kehastuses @et
toolkit label: grafiker for (person) @no
toolkit label: incisore persona di @it
toolkit label: ir gravīru meistars (persona) @lv
toolkit label: kuvalaatan valmistaja (henkilö) manifestaatiossa
toolkit label: nyomtatványkészítő személye: @hu
toolkit label: person, som er grafiker af @da
toolkit label: persona gravadora d’estampes de @ca
toolkit label: personne graveuse d’estampe de @fr
toolkit label: prentmaker-persoon van @nl
toolkit label: printmaker person of @en
toolkit label: χαράκτης φυσικό πρόσωπο του @el
toolkit label: شخص طبّاع @ar
toolkit label: ……的印版制作这个人 @zh-hans
has subproperty: kaivertaja (henkilö) manifestaatiossa
has subproperty: litografi (henkilö) manifestaatiossa
has subproperty: etsaaja (henkilö) manifestaatiossa
has subproperty: kollotypian valmistaja (henkilö) manifestaatiossa
has subproperty: P50500
lexical alias: printmakerPersonOf.en
status: Published
type: Property
domain: C10004
label: baskı sanatçısı kişisidir @tr
label: er grafiker for (person) @no
label: er person, som er grafiker af @da
label: est une personne graveuse d’estampe de @fr
label: graafika trükkija (isik) kehastuses @et
label: ir gravīru meistars (persona) @lv
label: is prentmaker-persoon van @nl
label: is printmaker person of @en
label: ist Person als Druckgrafikerin/Druckgrafiker von @de
label: nyomtatványkészítő személye a következőnek: @hu
label: è incisore persona di @it
label: és persona gravadora d’estampes de @ca
label: είναι χαράκτης φυσικό πρόσωπο του @el
label: هو شخص طبّاع لـ @ar
label: 是……的印版制作者个人 @zh-hans
sub property of: kuvalaatan valmistaja (toimija) manifestaatiossa
sub property of: manifestaation tekijä (henkilö) manifestaatiossa
definition: Bir kişiyi, kabartma, çukur baskı veya planografik baskı yüzeyi yapma sorumluluğunu içeren gösterimle ilişkilendirir. @tr
definition: Correla una persona a una manifestazione che implica una responsabilità di una persona per la realizzazione di una superficie a rilievo, intaglio o stampa planografica. @it
definition: Hozzákapcsol egy személyt egy megjelenési formához, amelyhez hozzátartozik egy ágens felelőssége egy relief, egy mélynyomásos vagy síknyomásos felület készítéséért. @hu
definition: Liittää henkilön manifestaatioon, jossa henkilö on vastuussa kohokuvan, syväpainon tai laakapainon painopinnan valmistamisesta.
definition: Met une personne en relation avec une manifestation qui comporte une responsabilité de la part d’une personne consistant à préparer un élément d’impression en relief, en creux ou planographique. @fr
definition: Relaciona una persona amb una manifestació que implica una responsabilitat d’una persona en la fabricació d’una superfície d’impressió en relleu, gravada en profunditat o planogràfica. @ca
definition: Relateert een persoon aan een manifestatie die met zich meebrengt een verantwoordelijkheid van een persoon voor het maken van een relief, intaglio of vlakdruk oppervlak. @nl
definition: Relaterer en person til en manifestasjon som involverer et ansvar for en person i form av å lage en overflate for relieff-, intaglio- eller plantrykk. @no
definition: Relaterer en person til en manifestation, som involverer en persons ansvar for at lave en relief-, dybtryks- eller fladtryksoverflade. @da
definition: Relates a person to a manifestation that involves a responsibility of a person for making a relief, intaglio, or planographic printing surface. @en
definition: Sasaista personu ar manifestāciju, kas ietver personas atbildību par reljefa, dobspiedes vai gludspieduma drukāšanas virsmas izveidi. @lv
definition: Seostab isiku kehastusega, mis sisaldab isiku vastutust kõrgtrüki, sügavtrüki või lametrüki teel tõmmiste tegemise eest. @et
definition: Setzt eine Person in Beziehung zu einer Manifestation, bei der eine Person für die Herstellung einer Hochdruck-, Tiefdruck- oder Flachdruckoberfläche verantwortlich ist. @de
definition: يربط شخصا بتجسيدة تنطوي على مسئولية شخص عن إعداد سطح لطباعة بارزة، أو غائرة، أو مستوية. @ar
definition: 将一个个人与涉及制作浮雕、凹版或平版印刷表面的一个个人的责任的一种载体表现关联起来。 @zh-hans

painaja (henkilö) manifestaatiossa
has element type: 2
toolkit definition: A manifestation that involves a responsibility of a person for manufacturing a printed manifestation that embodies text, notated music, cartographic content, notated movement, or still image content using a device that transfers ink or a similar medium to a surface. @en
toolkit definition: Bir kişinin basılı metin, notalı müzik veya diğer içerikleri yazı veya plakalardan üretme sorumluluğunu içeren bir gösterim. @tr
toolkit definition: Een manifestatie die met zich meebrengt een verantwoordelijkheid van een persoon voor het vervaardigen van gedrukte tekst, bladmuziek of andere content vanaf zetsel of platen. @nl
toolkit definition: Egy megjelenési forma, amelyhez hozzátartozik egy személy felelőssége egy nyomtatott szöveg, zenei lejegyzés vagy egyéb tartalom nyomdai szedésből vagy lemezekből történő gyártásáért. @hu
toolkit definition: Eine Manifestation, bei der eine Person für die Herstellung von gedrucktem Text, Noten oder anderem Inhalt durch Drucktypen oder Druckformen verantwortlich ist. @de
toolkit definition: En manifestasjon som involverer et ansvar for en person i form av framstilling av trykt tekst, nedskrevet musikk eller annet innhold fra typer eller plater. @no
toolkit definition: Kehastus, mis sisaldab isiku vastutust trükilaolt või -plaadilt teksti, nootide vm sisu trükkimise eest. @et
toolkit definition: Manifestaatio, jossa henkilö on vastuussa painolaatalta tai -levyltä painetun tekstin, nuottiaineiston tai muun sisällön valmistamisesta.
toolkit definition: Manifestació que implica una responsabilitat d’una persona en la fabricació d’una manifestació impresa que materialitza text, música notada, contingut cartogràfic, moviment notat o contingut d’imatge fixa usant un mecanisme que transfereix tinta o un mitjà similar a una superfície. @ca
toolkit definition: Manifestation qui comporte une responsabilité de la part d’une personne consistant à fabriquer une manifestation imprimée matérialisant du texte, de la musique notée, un contenu cartographique, du mouvement noté ou un contenu visuel fixe à l’aide d’un dispositif qui transfère de l’encre ou un médium semblable sur une surface. @fr
toolkit definition: Manifestation, som involverer en persons ansvar for fremstillingen af trykt tekst, noteret musik etc. fra typer eller plader. @da
toolkit definition: Manifestazione che implica una responsabilità di una persona per la produzione di testo, musica notata o altro contenuto a stampa a partire da caratteri o lastre. @it
toolkit definition: Manifestācija, kas ietver personas atbildību par iespiesta teksta, nošu vai cita veida satura izgatavošanu no burtu salikuma vai plāksnēm. @lv
toolkit definition: تجسيدة تنطوي على مسئولية شخص عن إنتاج نص مطبوع أو موسيقى مدونة أو محتوى من نوع أو من لوحات آخرى. @ar
toolkit definition: 涉及用活字或平版印刷文字、乐谱或其他内容的一个个人的责任的一种载体表现 @zh-hans
toolkit label: Person als Druckerin/Drucker von @de
toolkit label: Yazıcı @tr
toolkit label: drukker-persoon van @nl
toolkit label: ir iespiedējs (persona) @lv
toolkit label: nyomdász személye: @hu
toolkit label: painaja (henkilö) manifestaatiossa
toolkit label: person, som er trykker af @da
toolkit label: persona impressora de @ca
toolkit label: personne imprimeuse de @fr
toolkit label: printer person of @en
toolkit label: stampatore persona di @it
toolkit label: trykker for (person) @no
toolkit label: trükkija (isik) kehastuses @et
toolkit label: τυπογράφος φυσικό πρόσωπο του @el
toolkit label: شخص فني طباعة @ar
toolkit label: ……的印刷者个人 @zh-hans
has subproperty: P50501
lexical alias: printerPersonOf.en
status: Published
type: Property
domain: C10004
label: er person, som er trykker af @da
label: er trykker for (person) @no
label: est une personne imprimeuse de @fr
label: ir iespiedējs (persona) @lv
label: is drukker-persoon van @nl
label: is printer person of @en
label: ist Person als Druckerin/Drucker von @de
label: matbaacı kişisidir @tr
label: nyomdász személye a következőnek: @hu
label: trükkija (isik) kehastuses @et
label: è stampatore persona di @it
label: és persona impressora de @ca
label: είναι τυπογράφος φυσικό πρόσωπο του @el
label: هو شخص فني طباعة لـ @ar
label: 是……的印刷者个人 @zh-hans
sub property of: painaja (toimija) manifestaatiossa
sub property of: valmistaja (henkilö) manifestaatiossa
definition: Bir kişiyi, kişinin basılı metin, notalı müzik veya diğer içerikleri yazı veya plakalardan üretme sorumluluğunu içeren gösterimle ilişkilendirir @tr
definition: Correla una persona a una manifestazione che implica una responsabilità di una persona per la produzione di testo, musica notata o altro contenuto a stampa a partire da caratteri o lastre. @it
definition: Hozzákapcsol egy személyt egy megjelenési formához, amelyhez hozzátartozik egy személy felelőssége egy nyomtatott szöveg, zenei lejegyzés vagy egyéb tartalom nyomdai szedésből vagy lemezekből történő gyártásáért. @hu
definition: Liittää henkilön manifestaatioon, jossa henkilö on vastuussa painolaatalta tai -levyltä painetun tekstin, nuottiaineiston tai muun sisällön valmistamisesta.
definition: Met une personne en relation avec une manifestation qui comporte une responsabilité de la part d’une personne consistant à fabriquer une manifestation imprimée matérialisant du texte, de la musique notée, un contenu cartographique, du mouvement noté ou un contenu visuel fixe à l’aide d’un dispositif qui transfère de l’encre ou un médium semblable sur une surface. @fr
definition: Relaciona una persona amb una manifestació que implica una responsabilitat d’una persona en la fabricació d’una manifestació impresa que materialitza text, música notada, contingut cartogràfic, moviment notat o contingut d’imatge fixa usant un mecanisme que transfereix tinta o un mitjà similar a una superfície. @ca
definition: Relateert een persoon aan een manifestatie die met zich meebrengt een verantwoordelijkheid van een persoon voor het vervaardigen van gedrukte tekst, bladmuziek of andere content vanaf zetsel of platen. @nl
definition: Relaterer en person til en manifestasjon som involverer et ansvar for en person i form av framstilling av trykt tekst, nedskrevet musikk eller annet innhold fra typer eller plater. @no
definition: Relaterer en person til en manifestation, som involverer en persons ansvar for fremstillingen af trykt tekst, noteret musik etc. fra typer eller plader. @da
definition: Relates a person to a manifestation that involves a responsibility of a person for manufacturing a printed manifestation that embodies text, notated music, cartographic content, notated movement, or still image content using a device that transfers ink or a similar medium to a surface. @en
definition: Sasaista personu ar manifestāciju, kas ietver personas atbildību par iespiesta teksta, nošu vai cita veida satura izgatavošanu no burtu salikuma vai plāksnēm. @lv
definition: Seostab isiku kehastusega, mis sisaldab isiku vastutust trükilaolt või -plaadilt teksti, nootide vm sisu trükkimise eest. @et
definition: Setzt eine Person in Beziehung zu einer Manifestation, bei der eine Person für die Herstellung von gedrucktem Text, Noten oder anderem Inhalt durch Drucktypen oder Druckformen verantwortlich ist. @de
definition: يربط شخصا بتجسيدة تنطوي على مسئولية شخص عن إنتاج نص مطبوع أو موسيقى مدونة أو محتوى من نوع آخر أو من لوحات آخرى. @ar
definition: 将一个个人与涉及用活字或平版印刷文字、乐谱或其他内容的一个个人的责任的一种载体表现关联起来。 @zh-hans
scope note: Comprend la fabrication d’un livre, d’un journal, d’un magazine, d’un placard ou d’une partition. @fr
scope note: Inclou la fabricació d’un llibre, un diari, un magazín, un full solt o una partitura. @ca
scope note: Includes the manufacture of a book, newspaper, magazine, broadside, or score. @en

valaja (henkilö) manifestaatiossa
has element type: 2
toolkit definition: A manifestation that involves a responsibility of a person for pouring a liquid or molten substance into a mold and leaving it to solidify to take the shape of the mold. @en
toolkit definition: Bir kişinin kişinin sıvı veya erimiş bir maddeyi bir kalıba dökmek ve kalıbın şeklini almak üzere katılaşmaya bırakmaktaki sorumluluğunu içeren bir gösterim. @tr
toolkit definition: Een manifestatie die met zich meebrengt een verantwoordelijkheid van een persoon voor het gieten van een vloeistof of gesmolten substantie in een mal en het laten stollen om de vorm van de mal aan te laten nemen. @nl
toolkit definition: Egy megjelenési forma, amelyhez hozzátartozik egy ágens felelőssége folyékony vagy olvasztott anyag öntőformába öntéséért, hogy az ott megszilárduljon és fölvegye az öntőforma formáját. @hu
toolkit definition: Eine Manifestation, bei der eine Person dafür verantwortlich ist, eine Flüssigkeit oder eine geschmolzene Substanz in eine Form zu gießen, die in der Gießform verbleibt, bis sie ausgehärtet ist. @de
toolkit definition: En manifestasjon som involverer et ansvar for en person i form av å helle et flytende eller smeltet stoff i en støpeform og la det stivne i denne formen. @no
toolkit definition: Kehastus, mis sisaldab isiku vastutust vedela või sulatatud materjali valuvormi valamise ja valuvormi kuju võtmiseks tahkuda laskmise eest. @et
toolkit definition: Manifestaatio, jonka valmistamisesta henkilö on vastuussa muovaamalla sulatettua tai nestemäistä ainetta muotin avulla.
toolkit definition: Manifestació que implica una responsabilitat d’una persona en l’abocament d’un líquid o una substància fosa en un motlle tot deixant que se solidifiqui perquè prengui la forma del motlle. @ca
toolkit definition: Manifestation qui comporte une responsabilité de la part d’une personne consistant à verser un liquide ou une substance fondue dans un moule et à laisser ce liquide ou cette substance se solidifier pour prendre la forme du moule. @fr
toolkit definition: Manifestation, som involverer en persons ansvar for at hælde en væske eller et varmt, flydende stof i en form og lade det størkne, så det tager facon efter formen. @da
toolkit definition: Manifestazione che implica una responsabilità di una persona nel versare un liquido o sostanza fusa in uno stampo e lasciarlo solidificare per assumere la forma dello stampo. @it
toolkit definition: Manifestācija, kas ietver personas atbildību par šķidruma vai izkausētas vielas ieliešanu veidnē un atstāšanu sacietēt, lai tā saglabātu formu. @lv
toolkit definition: تجسيدة تنطوي على مسئولية شخص عن صب مادة سائلة أو مذابة في قالب وتركه ليتصلب ليأخذ شكل القالب. @ar
toolkit definition: 涉及将液体或融化的物质倒入模具中使其按模具固化成型的一个个人的责任的一种载体表现 @zh-hans
toolkit label: Person als Formgießerin/Formgießer von @de
toolkit label: caster person of @en
toolkit label: dökümcü @tr
toolkit label: fonditore persona di @it
toolkit label: gieter-persoon van @nl
toolkit label: ir atliešanas meistars (persona) @lv
toolkit label: person, som er støber af @da
toolkit label: persona emmotlladora de @ca
toolkit label: personne fondeuse de @fr
toolkit label: støper av (person) @no
toolkit label: valaja (henkilö) manifestaatiossa
toolkit label: valaja (isik) kehastuses @et
toolkit label: öntvénykészítő személye: @hu
toolkit label: χυτευτής φυσικό πρόσωπο του @el
toolkit label: شخص عامل صب @ar
toolkit label: ……的铸造者个人 @zh-hans
has subproperty: P50502
lexical alias: casterPersonOf.en
status: Published
type: Property
domain: C10004
label: dökümcü kişisidir @tr
label: er person, som er støber af @da
label: er støper av (person) @no
label: est une personne fondeuse de @fr
label: ir atliešanas meistars (persona) @lv
label: is caster person of @en
label: is gieter-persoon van @nl
label: ist Person als Formgießerin/Formgießer von @de
label: valaja (isik) kehastuses @et
label: è fonditore persona di @it
label: és persona emmotlladora de @ca
label: öntvénykészítő személye a következőnek: @hu
label: είναι χυτευτής φυσικό πρόσωπο του @el
label: هو شخص عامل صب لـ @ar
label: 是……的铸造者个人 @zh-hans
sub property of: valaja (toimija) manifestaatiossa
sub property of: manifestaation tekijä (henkilö) manifestaatiossa
definition: Bir kişiyi, kişinin sıvı veya erimiş bir maddeyi bir kalıba dökmek ve kalıbın şeklini almak üzere katılaşmaya bırakmaktaki sorumluluğunu içeren gösterimle ilişkilendirir. @tr
definition: Correla una persona a una manifestazione che implica una responsabilità di una persona nel versare un liquido o sostanza fusa in uno stampo e lasciarlo solidificare per assumere la forma dello stampo. @it
definition: Hozzákapcsol egy személyt egy megjelenési formához, amelyhez hozzátartozik egy ágens felelőssége folyékony vagy olvasztott anyag öntőformába öntéséért, hogy az ott megszilárduljon és fölvegye az öntőforma formáját. @hu
definition: Liittää henkilön manifestaatioon, jonka valmistamisesta henkilö on vastuussa muovaamalla sulatettua tai nestemäistä ainetta muotin avulla.
definition: Met une personne en relation avec une manifestation qui comporte une responsabilité de la part d’une personne consistant à verser un liquide ou une substance fondue dans un moule et à laisser ce liquide ou cette substance se solidifier pour prendre la forme du moule. @fr
definition: Relaciona una persona amb una manifestació que implica una responsabilitat d’una persona en l’abocament d’un líquid o una substància fosa en un motlle tot deixant que se solidifiqui perquè prengui la forma del motlle. @ca
definition: Relateert een persoon aan een manifestatie die met zich meebrengt een verantwoordelijkheid van een persoon voor het gieten van een vloeistof of gesmolten substantie in een mal en het laten stollen om de vorm van de mal aan te laten nemen. @nl
definition: Relaterer en person til en manifestasjon som involverer et ansvar for en person i form av å helle et flytende eller smeltet stoff i en støpeform og la det stivne i denne formen. @no
definition: Relaterer en person til en manifestation, som involverer en persons ansvar for at hælde en væske eller et varmt, flydende stof i en form og lade det størkne, så det tager facon efter formen. @da
definition: Relates a person to a manifestation that involves a responsibility of a person for pouring a liquid or molten substance into a mold and leaving it to solidify to take the shape of the mold. @en
definition: Sasaista personu ar manifestāciju, kas ietver personas atbildību par šķidruma vai izkausētas vielas ieliešanu veidnē un atstāšanu sacietēt, lai tā saglabātu formu. @lv
definition: Seostab isiku kehastusega, mis sisaldab isiku vastutust vedela või sulatatud materjali valuvormi valamise ja valuvormi kuju võtmiseks tahkuda laskmise eest. @et
definition: Setzt eine Person in Beziehung zu einer Manifestation, bei der eine Person dafür verantwortlich ist, eine Flüssigkeit oder eine geschmolzene Substanz in eine Form zu gießen, die in der Gießform verbleibt, bis sie ausgehärtet ist. @de
definition: يربط شخصا بتجسيدة تنطوي على مسئولية شخص عن صب مادة سائلة أو مذابة في قالب وتركه يتصلب ليأخذ شكل القالب. @ar
definition: 将一个个人与涉及将液体或融化的物质倒入模具中使其按模具固化成型的一个个人的责任的一种载体表现关联起来。 @zh-hans

litografi (henkilö) manifestaatiossa
has element type: 2
toolkit definition: A manifestation that involves a responsibility of a person for preparing a stone or plate for lithographic printing. @en
toolkit definition: Bir kişinin litografik baskı için bir taş veya plaka hazırlama sorumluluğunu içeren bir gösterim. @tr
toolkit definition: Een manifestatie die met zich meebrengt een verantwoordelijkheid van een persoon voor het prepareren van een steen of plaat voor lithografisch drukken. @nl
toolkit definition: Egy megjelenési forma, amelyhez hozzátartozik egy személy felelőssége egy kő vagy lemez litográfiai nyomtatáshoz történő előkészítéséért. @hu
toolkit definition: Eine Manifestation, bei der eine Person für die Vorbereitung eines Steins oder einer Platte für lithografischen Druck verantwortlich ist. @de
toolkit definition: En manifestasjon som involverer et ansvar for en person i form av å klargjøre en stein eller plate for litografisk trykk. @no
toolkit definition: Kehastus, mis sisaldab isiku vastutust kivi või plaadi litograafiliste tõmmiste jaoks ettevalmistamise eest. @et
toolkit definition: Manifestaatio, jossa henkilö on vastuussa litografiassa käytetyn kivilaatan tai muun painolaatan valmistamisesta.
toolkit definition: Manifestació que implica una responsabilitat d’una persona en la preparació d’una pedra o una planxa per a la impressió litogràfica. @ca
toolkit definition: Manifestation qui comporte une responsabilité de la part d’une personne consistant à préparer une pierre ou une plaque pour l’impression lithographique. @fr
toolkit definition: Manifestation, som involverer en persons ansvar for at klargøre en sten eller plade til litografisk trykning. @da
toolkit definition: Manifestazione che implica una responsabilità di una persona nel preparare una pietra o lastra per la stampa litografica. @it
toolkit definition: Manifestācija, kas ietver personas atbildību par akmens vai iespiedplates sagatavošanu drukāšanai litogrāfijas tehnikā. @lv
toolkit definition: تجسيدة تنطوي على مسئولية شخص عن تجهيز حجر أو لوح للطباعة الحجرية. @ar
toolkit definition: 涉及制作用于平版印刷的石头或平版的一个个人的责任的一种载体表现 @zh-hans
toolkit label: Person als Lithografin/Lithograf von @de
toolkit label: ir litogrāfs (persona) @lv
toolkit label: kőnyomatkészítő személye: @hu
toolkit label: lithograaf-persoon van @nl
toolkit label: lithographer person of @en
toolkit label: litograaf (isik) kehastuses @et
toolkit label: litograf for (person) @no
toolkit label: litografi (henkilö) manifestaatiossa
toolkit label: litografo persona di @it
toolkit label: person, som er litograf af @da
toolkit label: persona litògrafa de @ca
toolkit label: personne lithographe de @fr
toolkit label: taş baskıcısı @tr
toolkit label: λιθογράφος φυσικό πρόσωπο του @el
toolkit label: شخص طبّاع على الحجر @ar
toolkit label: ……的平版制作者个人 @zh-hans
has subproperty: P50503
lexical alias: lithographerPersonOf.en
status: Published
type: Property
domain: C10004
label: er litograf for (person) @no
label: er person, som er litograf af @da
label: est une personne lithographe de @fr
label: ir litogrāfs (persona) @lv
label: is lithograaf-persoon van @nl
label: is lithographer person of @en
label: ist Person als Lithografin/Lithograf von @de
label: kőnyomatkészítő személye a következőnek: @hu
label: litograaf (isik) kehastuses @et
label: taş baskı sanatçısı kişisidir @tr
label: è litografo persona di @it
label: és persona litògrafa de @ca
label: είναι λιθογράφος φυσικό πρόσωπο του @el
label: هو شخص طباع على الحجر لـ @ar
label: 是……的平版制作者个人 @zh-hans
sub property of: litografi (toimija) manifestaatiossa
sub property of: kuvalaatan valmistaja (henkilö) manifestaatiossa
definition: Bir kişiyi, kişinin taş baskı için bir taş veya plaka hazırlama sorumluluğunu içeren gösterimle ilişkilendirir. @tr
definition: Correla una persona a una manifestazione che implica una responsabilità di una persona nel preparare una pietra o lastra per la stampa litografica. @it
definition: Hozzákapcsol egy személyt egy megjelenési formához, amelyhez hozzátartozik egy személy felelőssége egy kő vagy lemez litográfiai nyomtatáshoz történő előkészítéséért. @hu
definition: Liittää henkilön manifestaatioon, jossa henkilö on vastuussa litografiassa käytetyn kivilaatan tai muun painolaatan valmistamisesta.
definition: Met une personne en relation avec une manifestation qui comporte une responsabilité de la part d’une personne consistant à préparer une pierre ou une plaque pour l’impression lithographique. @fr
definition: Relaciona una persona amb una manifestació que implica una responsabilitat d’una persona en la preparació d’una pedra o una planxa per a la impressió litogràfica. @ca
definition: Relateert een persoon aan een manifestatie die met zich meebrengt een verantwoordelijkheid van een persoon voor het prepareren van een steen of plaat voor lithografisch drukken. @nl
definition: Relaterer en person til en manifestasjon som involverer et ansvar for en person i form av å klargjøre en stein eller plate for litografisk trykk. @no
definition: Relaterer en person til en manifestation, som involverer en persons ansvar for at klargøre en sten eller plade til litografisk trykning. @da
definition: Relates a person to a manifestation that involves a responsibility of a person for preparing a stone or plate for lithographic printing. @en
definition: Sasaista personu ar manifestāciju, kas ietver personas atbildību par akmens vai iespiedplates sagatavošanu drukāšanai litogrāfijas tehnikā. @lv
definition: Seostab isiku kehastusega, mis sisaldab isiku vastutust kivi või plaadi litograafiliste tõmmiste jaoks ettevalmistamise eest. @et
definition: Setzt eine Person in Beziehung zu einer Manifestation, bei der eine Person für die Vorbereitung eines Steins oder einer Platte für lithografischen Druck verantwortlich ist. @de
definition: يربط شخصا بتجسيدة تنطوي على مسئولية شخص عن تجهيز حجر أو لوح للطباعة الحجرية. @ar
definition: 将一个个人与涉及制作用于平版印刷的石头或平版的一个个人的责任的一种载体表现关联起来。 @zh-hans
scope note: A lithographer includes a graphic artist creating a design directly on the surface from which printing will be done. @en
scope note: A litográfus egy grafikusművész, aki közvetlenül azon a felületen készít tervet, amelyről a nyomtatás történik. @hu
scope note: Bir taş baskı sanatçısı, baskının yapılacağı yüzey üzerinde doğrudan bir tasarım yaratan bir grafik sanatçısını da içerir. @tr
scope note: Darunter fallen Grafikerinnen/Grafiker, die ein Muster direkt auf der Oberfläche erstellen, von der aus gedruckt werden soll. @de
scope note: Een lithograaf omvat een grafisch kunstenaar die een ontwerp creëert direct op het oppervlak vanaf welke het drukken gedaan zal worden. @nl
scope note: En litograf inkluderer en grafiker som skaper et design direkte på overflaten som trykkingen vil bli gjort. @no
scope note: En litograf omfatter en grafiker, som skaber et design direkte på overfladen, hvorfra trykning vil blive udført. @da
scope note: Litograaf hõlmab ka graafikut, kes loob kujutise otse pinnale, millelt toimub trükkimine. @et
scope note: Litografi tarkoittaa myös graafikkoa, joka tekee piirroksen suoraan painamiseen käytettävälle pinnalle.
scope note: Litografo comprende un artista grafico che crea un disegno direttamente sulla superficie da cui verrà eseguita la stampa. @it

painolaatan valmistaja (henkilö) manifestaatiossa
has element type: 2
toolkit definition: A manifestation that involves a responsibility of a person for preparing plates used in the making of printed images or text. @en
toolkit definition: Bir kişinin resim veya metin baskısı yapımında kullanılan plakaların hazırlanması sorumluluğunu içeren bir gösterim. @tr
toolkit definition: Een manifestatie die met zich meebrengt een verantwoordelijkheid van een persoon voor het prepareren van platen gebruikt in de productie van gedrukte beelden of tekst. @nl
toolkit definition: Egy megjelenési forma, amelyhez hozzátartozik egy ágens felelőssége nyomólemezek előkészítéséért nyomtatott képek vagy szövegek előállításához. @hu
toolkit definition: Eine Manifestation, bei der eine Person für die Anfertigung von Druckformen für die Produktion von gedruckten Bildern oder gedrucktem Text verantwortlich ist. @de
toolkit definition: En manifestasjon som involverer et ansvar for en person i form av klargjøring av trykkplater som brukes ved produksjon av trykte bilder eller tekst. @no
toolkit definition: Kehastus, mis sisaldab isiku vastutust piltide või teksti trükkimiseks mõeldud plaatide ettevalmistamise eest. @et
toolkit definition: Manifestaatio, jossa henkilö on vastuussa painettujen kuvien tai tekstin tuottamisessa käytettyjen painolaattojen tai -levyjen valmistuksesta.
toolkit definition: Manifestació que implica una responsabilitat d’una persona en la preparació de les planxes usades en l’elaboració d’imatges impreses o text imprès. @ca
toolkit definition: Manifestation qui comporte une responsabilité de la part d’une personne consistant à préparer les planches utilisées pour la réalisation d’images ou de textes imprimés. @fr
toolkit definition: Manifestation, som involverer en persons ansvar for at forberede plader, som anvendes til fremstilling af trykte billeder eller tekst. @da
toolkit definition: Manifestazione che implica una responsabilità di una persona per la preparazione di lastre utilizzate nella produzione di immagini o testi a stampa. @it
toolkit definition: Manifestācija, kas ietver personas atbildību par plākšņu sagatavošanu, ko izmanto iespiestu attēlu vai teksta izgatavošanā. @lv
toolkit definition: تجسيدة تنطوي على مسئولية شخص عن تجهيز الأسطح المستخدمة في إنتاج صور أو نص مطبوع. @ar
toolkit definition: 涉及准备用于制作图像和/或文字印刷平版的一个个人的责任的一种载体表现 @zh-hans
toolkit label: Person als Druckformherstellerin/Druckformhersteller von @de
toolkit label: ir presformas izgatavotājs (persona) @lv
toolkit label: nyomólemez-készítő személye: @hu
toolkit label: painolaatan valmistaja (henkilö) manifestaatiossa
toolkit label: person, som er plademager af @da
toolkit label: persona gravadora de planxes de @ca
toolkit label: personne clicheuse de @fr
toolkit label: plaatmaker-persoon van @nl
toolkit label: plaka yapıcı kişisi @tr
toolkit label: platemaker person of @en
toolkit label: preparatore di lastre persona di @it
toolkit label: trykkplatemaker for (person) @no
toolkit label: trükiplaadi valmistaja (isik) kehastuses @et
toolkit label: κατασκευαστής εκτυπωτικής πλάκας φυσικό πρόσωπο του @el
toolkit label: شخص مُحضر لسطح طباعي @ar
toolkit label: ……的制版者个人 @zh-hans
has subproperty: P50504
lexical alias: platemakerPersonOf.en
status: Published
type: Property
domain: C10004
label: er person, som er plademager af @da
label: er trykkplatemaker for (person) @no
label: est une personne clicheuse de @fr
label: ir presformas izgatavotājs (persona) @lv
label: is plaatmaker-persoon van @nl
label: is platemaker person of @en
label: ist Person als Druckformherstellerin/Druckformhersteller von @de
label: levhacı kişisidir @tr
label: nyomólemez-készítő személye a következőnek: @hu
label: trükiplaadi valmistaja (isik) kehastuses @et
label: è preparatore di lastre persona di @it
label: és persona gravadora de planxes de @ca
label: είναι κατασκευαστής εκτυπωτικής πλάκας φυσικό πρόσωπο του @el
label: هو شخص مُحضر لسطح طباعي لـ @ar
label: 是……的制版者个人 @zh-hans
sub property of: painolaatan valmistaja (toimittaja) manifestaatiossa
sub property of: manifestaation tekijä (henkilö) manifestaatiossa
definition: Bir kişiyi, kişinin resim veya metin baskısı yapımında kullanılan plakaların hazırlanması sorumluluğunu içeren gösterimle ilişkilendirir. @tr
definition: Correla una persona a una manifestazione che implica una responsabilità di una persona per la preparazione di lastre utilizzate nella produzione di immagini o testi a stampa. @it
definition: Hozzákapcsol egy személyt egy megjelenési formához, amelyhez hozzátartozik egy ágens felelőssége nyomólemezek előkészítéséért nyomtatott képek vagy szövegek előállításához. @hu
definition: Liittää henkilön manifestaatioon, jossa henkilö on vastuussa painettujen kuvien tai tekstin tuottamisessa käytettyjen painolaattojen tai -levyjen valmistuksesta.
definition: Met une personne en relation avec une manifestation qui comporte une responsabilité de la part d’une personne consistant à préparer les planches utilisées pour la réalisation d’images ou de textes imprimés. @fr
definition: Relaciona una persona amb una manifestació que implica una responsabilitat d’una persona en la preparació de les planxes usades en l’elaboració d’imatges impreses o text imprès. @ca
definition: Relateert een persoon aan een manifestatie die met zich meebrengt een verantwoordelijkheid van een persoon voor het prepareren van platen gebruikt in de productie van gedrukte beelden of tekst. @nl
definition: Relaterer en person til en manifestasjon som involverer et ansvar for en person i form av klargjøring av trykkplater som brukes ved produksjon av trykte bilder eller tekst. @no
definition: Relaterer en person til en manifestation, som involverer en persons ansvar for at forberede plader, som anvendes til fremstilling af trykte billeder eller tekst. @da
definition: Relates a person to a manifestation that involves a responsibility of a person for preparing plates used in the making of printed images or text. @en
definition: Sasaista personu ar manifestāciju, kas ietver personas atbildību par plākšņu sagatavošanu, ko izmanto iespiestu attēlu vai teksta izgatavošanā. @lv
definition: Seostab isiku kehastusega, mis sisaldab isiku vastutust piltide või teksti trükkimiseks mõeldud plaatide ettevalmistamise eest. @et
definition: Setzt eine Person in Beziehung zu einer Manifestation, bei der eine Person für die Anfertigung von Druckformen für die Produktion von gedruckten Bildern oder gedrucktem Text verantwortlich ist. @de
definition: يربط شخصا بتجسيدة تنطوي على مسئولية شخص عن تجهيز الأسطح المستخدمة في إنتاج صور أو نص مطبوع. @ar
definition: 将一个个人与涉及准备用于制作图像和/或文字印刷平版的一个个人的责任的一种载体表现关联起来。 @zh-hans

valmistaja (henkilö) manifestaatiossa
has element type: 2
toolkit definition: A manifestation that involves a responsibility of a person for printing, duplicating, casting, etc. @en
toolkit definition: Bir kişinin çoğaltma, döküm, vb. sorumluluğunu içeren bir gösterim. @tr
toolkit definition: Een manifestatie die met zich meebrengt een verantwoordelijkheid van een persoon voor drukken, vermenigvuldigen, gieten etc. @nl
toolkit definition: Egy megjelenési forma, amelyhez hozzátartozik egy személy felelőssége nyomtatásért, sokszorosításért, öntésért stb. @hu
toolkit definition: Eine Manifestation, bei der eine Person für den Druck, die Vervielfältigung, den Guss und so weiter verantwortlich ist. @de
toolkit definition: En manifestasjon som involverer et ansvar for en person i form av trykking, mangfoldiggjøring, kasting etc. @no
toolkit definition: Kehastus, mis sisaldab isiku vastutust trükkimise, paljundamise, valamise vms eest. @et
toolkit definition: Manifestaatio, jonka painamisesta, monistamisesta, kirjasinten valamisesta tms. henkilö on vastuussa.
toolkit definition: Manifestació que implica una responsabilitat d’una persona en la impressió, la reproducció, el modelat, etc. @ca
toolkit definition: Manifestation qui comporte une responsabilité de la part d’une personne en ce qui concerne l’impression, la reproduction, le moulage, etc. @fr
toolkit definition: Manifestation, som involverer en persons ansvar for trykning, duplikering, støbning etc. @da
toolkit definition: Manifestazione che implica una responsabilità di una persona per la stampa, duplicazione, fusione, etc. @it
toolkit definition: Manifestācija, kas ietver personas atbildību par iespiešanu, pavairošanu u.tml. @lv
toolkit definition: تجسيدة من جانب شخص يترتب عليه مسئولية عن الطباعة أو النسخ أو الصب أو ما إلى ذلك. @ar
toolkit definition: 涉及印刷、复制、铸造等的一个个人的责任的一种载体表现 @zh-hans
toolkit label: Person als Herstellerin/Hersteller von @de
toolkit label: gyártó személye: @hu
toolkit label: ir ražotājs (persona) @lv
toolkit label: manifattura persona di @it
toolkit label: manufacturer person of @en
toolkit label: person, som er producent af @da
toolkit label: persona fabricant de @ca
toolkit label: personne fabricante de @fr
toolkit label: tilvirker av (person) @no
toolkit label: valmistaja (henkilö) manifestaatiossa
toolkit label: valmistaja (isik) kehastuses @et
toolkit label: vervaardiger-persoon van @nl
toolkit label: üreticisi @tr
toolkit label: είναι κατασκευαστής φυσικό πρόσωπο του @el
toolkit label: شخص مُصنع @ar
toolkit label: ……的生产者个人 @zh-hans
has subproperty: pistekirjoituksen tekijä (henkilö) manifestaatiossa
has subproperty: painaja (henkilö) manifestaatiossa
has subproperty: P50505
lexical alias: manufacturerPersonOf.en
status: Published
type: Property
domain: C10004
label: er person, som er producent af @da
label: er tilvirker av (person) @no
label: est une personne fabricante de @fr
label: gyártó személye a következőnek: @hu
label: ir ražotājs (persona) @lv
label: is manufacturer person of @en
label: is vervaardiger-persoon van @nl
label: ist Person als Herstellerin/Hersteller von @de
label: valmistaja (isik) kehastuses @et
label: è manifattura persona di @it
label: és persona fabricant de @ca
label: üretici kişisidir @tr
label: είναι κατασκευαστής φυσικό πρόσωπο του @el
label: هو شخص مُصنع لـ @ar
label: 是……的生产者个人 @zh-hans
sub property of: valmistaja (toimija) manifestaatiossa
sub property of: henkilöön liittyvä manifestaatio
definition: Bir kişiyi, kişinin baskı, çoğaltma, döküm, vb. sorumluluğunu içeren gösterimle ilişkilendirir. @tr
definition: Correla una persona a una manifestazione di una persona che implica una responsabilità per la stampa, duplicazione, fusione, etc. @it
definition: Hozzákapcsol egy személyt egy megjelenési formához, amelyhez hozzátartozik egy személy felelőssége nyomtatásért, sokszorosításért, öntésért stb. @hu
definition: Liittää henkilön manifestaatioon, jonka painamisesta, monistamisesta, kirjasinten valamisesta tms. henkilö on vastuussa.
definition: Met une personne en relation avec une manifestation qui comporte une responsabilité de la part d’une personne en ce qui concerne l’impression, la reproduction, le moulage, etc. @fr
definition: Relaciona una persona amb una manifestació que implica una responsabilitat d’una persona en la impressió, la reproducció, el modelat, etc. @ca
definition: Relateert een persoon aan een manifestatie die met zich meebrengt een verantwoordelijkheid van een persoon voor drukken, vermenigvuldigen, gieten etc. @nl
definition: Relaterer en person til en manifestasjon som involverer et ansvar for en person i form av trykking, mangfoldiggjøring, kasting etc. @no
definition: Relaterer en person til en manifestation, som involverer en persons ansvar for trykning, duplikering, støbning etc. @da
definition: Relates a person to a manifestation by a person that involves a responsibility for printing, duplicating, casting, etc. @en
definition: Sasaista personu ar manifestāciju, kas ietver personas atbildību par iespiešanu, pavairošanu u.tml. @lv
definition: Seostab isiku kehastusega, mis sisaldab isiku vastutust trükkimise, paljundamise, valamise vms eest. @et
definition: Setzt eine Person in Beziehung zu einer Manifestation, bei der eine Person für den Druck, die Vervielfältigung, den Guss und so weiter verantwortlich ist. @de
definition: يربط شخصا بتجسيدة من جانب شخص مسئول عن الطباعة أو النسخ أو الصب، الخ. @ar
definition: 将一个个人与涉及印刷、复制、铸造等的一个个人的责任的一种载体表现关联起来。 @zh-hans

paperinvalmistaja (henkilö) manifestaatiossa
has element type: 2
toolkit definition: A manifestation that involves a responsibility of a person for making paper. @en
toolkit definition: Bir kişinin kağıt yapımı için sorumluluğunu içeren bir gösterim. @tr
toolkit definition: Een manifestatie die met zich meebrengt een verantwoordelijkheid van een persoon voor productie van papier. @nl
toolkit definition: Egy megjelenési forma, amelyhez hozzátartozik egy személy felelőssége a papír előállításáért. @hu
toolkit definition: Eine Manifestation, bei der eine Person für die Produktion von Papier verantwortlich ist. @de
toolkit definition: En manifestasjon som involverer et ansvar for en person i form av å produsere papir. @no
toolkit definition: Kehastus, mis sisaldab isiku vastutust paberi tootmise eest. @et
toolkit definition: Manifestaatio, jossa käytettävän paperin valmistamisesta henkilö on vastuussa.
toolkit definition: Manifestació que implica una responsabilitat d’una persona en l’elaboració del paper. @ca
toolkit definition: Manifestation qui comporte une responsabilité de la part d’une personne consistant à confectionner du papier. @fr
toolkit definition: Manifestation, som involverer en persons ansvar for at producere papir. @da
toolkit definition: Manifestazione che implica una responsabilità di una persona per la produzione di carta. @it
toolkit definition: Manifestācija, kas ietver personas atbildību par papīra izgatavošanu. @lv
toolkit definition: تجسيدة تنطوي على مسئولية شخص عن إنتاج الورق. @ar
toolkit definition: 涉及一个造纸的个人的责任的一种载体表现 @zh-hans
toolkit label: Kağıt üreten kişi @tr
toolkit label: Person als Papiermacherin/Papiermacher von @de
toolkit label: cartaio persona di @it
toolkit label: ir papīra izgatavotājs (persona) @lv
toolkit label: paberivalmistaja (isik) kehastuses @et
toolkit label: paperinvalmistaja (henkilö) manifestaatiossa
toolkit label: papermaker person of @en
toolkit label: papiermaker-persoon van @nl
toolkit label: papirprodusent for (person) @no
toolkit label: papírgyártó személye: @hu
toolkit label: person, som er papirproducent af @da
toolkit label: persona paperera de @ca
toolkit label: personne papetière de @fr
toolkit label: χαρτοποιός φυσικό πρόσωπο του @el
toolkit label: شخص صانع الورق @ar
toolkit label: ……的造纸者个人 @zh-hans
has subproperty: P50506
lexical alias: papermakerPersonOf.en
status: Published
type: Property
domain: C10004
label: er papirprodusent for (person) @no
label: er person, som er papirproducent af @da
label: est une personne papetière de @fr
label: ir papīra izgatavotājs (persona) @lv
label: is papermaker person of @en
label: is papiermaker-persoon van @nl
label: ist Person als Papiermacherin/Papiermacher von @de
label: kağıt üreticisi kişisidir @tr
label: paberivalmistaja (isik) kehastuses @et
label: papírgyártó személye a következőnek: @hu
label: è cartaio persona di @it
label: és persona paperera de @ca
label: είναι χαρτοποιός φυσικό πρόσωπο του @el
label: هو شخص صانع االورق لـ @ar
label: 是……的造纸者个人 @zh-hans
sub property of: paperinvalmistaja (toimija) manifestaatiossa
sub property of: henkilöön liittyvä manifestaatio
definition: Bir kişiyi, kişinin kağıt yapımındaki sorumluluğunu içeren gösterimle ilişkilendirir. @tr
definition: Correla una persona a una manifestazione che implica una responsabilità di una persona per la produzione di carta. @it
definition: Hozzákapcsol egy személyt egy megjelenési formához, amelyhez hozzátartozik egy személy felelőssége a papír előállításáért. @hu
definition: Liittää henkilön manifestaatioon, jossa käytettävän paperin valmistamisesta henkilö on vastuussa.
definition: Met une personne en relation avec une manifestation qui comporte une responsabilité de la part d’une personne consistant à confectionner du papier. @fr
definition: Relaciona una persona amb una manifestació que implica una responsabilitat d’una persona en l’elaboració del paper. @ca
definition: Relateert een persoon aan een manifestatie die met zich meebrengt een verantwoordelijkheid van een persoon voor productie van papier. @nl
definition: Relaterer en person til en manifestasjon som involverer et ansvar for en person i form av å produsere papir. @no
definition: Relaterer en person til en manifestation, som involverer en persons ansvar for at producere papir. @da
definition: Relates a person to a manifestation that involves a responsibility of a person for making paper. @en
definition: Sasaista personu ar manifestāciju, kas ietver personas atbildību par papīra izgatavošanu. @lv
definition: Seostab isiku kehastusega, mis sisaldab isiku vastutust paberi tootmise eest. @et
definition: Setzt eine Person in Beziehung zu einer Manifestation, bei der eine Person für die Produktion von Papier verantwortlich ist. @de
definition: يربط شخصا بتجسيدة تنطوي على مسئولية شخص عن إنتاج الورق. @ar
definition: 将一个个人与涉及一个造纸的个人的责任的一种载体表现关联起来。 @zh-hans

kustantaja (henkilö) manifestaatiossa
has element type: 2
toolkit definition: A manifestation that involves a responsibility of a person for publishing, releasing, or issuing. @en
toolkit definition: Bir kişinin yayınlama, piyasaya sürme veya basma sorumluluğunu içeren bir gösterim. @tr
toolkit definition: Een manifestatie die met zich meebrengt een verantwoordelijkheid van een persoon voor uitgeven, uitbrengen of uitvaardigen. @nl
toolkit definition: Egy megjelenési forma, Hozzákapcsol egy személyt egy megjelenési formához, amelyhez hozzátartozik egy személy felelőssége közzétételért, kiadásért vagy kibocsátásért. @hu
toolkit definition: Eine Manifestation, bei der eine Person für das Veröffentlichen, die Freigabe oder die Herausgabe verantwortlich ist. @de
toolkit definition: En manifestasjon som involverer et ansvar for en person i form av publisering, tilgjengeliggjøring eller utgivelse. @no
toolkit definition: Kehastus, mis sisaldab isiku vastutust avaldamise, väljalaskmise või väljaandmise eest. @et
toolkit definition: Manifestaatio, jonka kustantamisesta, julkaisemisesta tai ilmestymisestä henkilö on vastuussa.
toolkit definition: Manifestació que implica una responsabilitat d’una persona en la publicació, la posada en circulació o l’emissió. @ca
toolkit definition: Manifestation qui comporte une responsabilité de la part d’une personne en ce qui concerne la publication, la mise à disposition ou l’édition. @fr
toolkit definition: Manifestation, som involverer en persons ansvar for publicering, frigivelse eller udgivelse. @da
toolkit definition: Manifestazione che implica una responsabilità di una persona per la pubblicazione, distribuzione o emissione. @it
toolkit definition: Manifestācija, kas ietver personas atbildību par publicēšanu, izlaišanu vai izdošanu. @lv
toolkit definition: تجسيدة تنطوي على مسئولية شخص عن النشر، التحرير، أو الإصدار. @ar
toolkit definition: 涉及出版、发布或发行的一个个人的责任的一种载体表现 @zh-hans
toolkit label: Person als Verlag von @de
toolkit label: editore persona di @it
toolkit label: ir izdevējs (persona) @lv
toolkit label: kiadó személye: @hu
toolkit label: kirjastaja (isik) kehastuses @et
toolkit label: kustantaja (henkilö) manifestaatiossa
toolkit label: person, som er udgiver af @da
toolkit label: persona editora de @ca
toolkit label: personne éditrice de @fr
toolkit label: publisher person of @en
toolkit label: uitgever-persoon van @nl
toolkit label: utgiver av (person) @no
toolkit label: yayımcı kişisi @tr
toolkit label: εκδότης φυσικό πρόσωπο του @el
toolkit label: شخص ناشر @ar
toolkit label: ……的出版者个人 @zh-hans
has subproperty: lähetyksestä vastaava henkilö manifestaatiossa
has subproperty: P50507
lexical alias: publisherPersonOf.en
status: Published
type: Property
domain: C10004
label: er person, som er udgiver af @da
label: er utgiver av (person) @no
label: est une personne éditrice de @fr
label: ir izdevējs (persona) @lv
label: is publisher person of @en
label: is uitgever-persoon van @nl
label: ist Person als Verlag von @de
label: kiadó személye a következőnek: @hu
label: kirjastaja (isik) kehastuses @et
label: yayıncı kişisidir @tr
label: è editore persona di @it
label: és persona editora de @ca
label: είναι εκδότης φυσικό πρόσωπο του @el
label: هو شخص ناشر لـ @ar
label: 是……的出版者个人 @zh-hans
sub property of: kustantaja (toimija) manifestaatiossa
sub property of: manifestaation tekijä (henkilö) manifestaatiossa
definition: Bir kişiyi, kişinin yayınlama, piyasaya sürme veya basma sorumluluğunu içeren gösterimle ilişkilendirir. @tr
definition: Correla una persona a una manifestazione che implica una responsabilità di una persona per la pubblicazione, distribuzione o emissione. @it
definition: Hozzákapcsol egy személyt egy megjelenési formához, amelyhez hozzátartozik egy személy felelőssége közzétételért, kiadásért vagy kibocsátásért. @hu
definition: Liittää henkilön manifestaatioon, jonka kustantamisesta, julkaisemisesta tai ilmestymisestä henkilö on vastuussa.
definition: Met une personne en relation avec une manifestation qui comporte une responsabilité de la part d’une personne en ce qui concerne la publication, la mise à disposition ou l’édition. @fr
definition: Relaciona una persona amb una manifestació que implica una responsabilitat d’una persona en la publicació, la posada en circulació o l’emissió. @ca
definition: Relateert een persoon aan een manifestatie die met zich meebrengt een verantwoordelijkheid van een persoon voor uitgeven, uitbrengen of uitvaardigen. @nl
definition: Relaterer en person til en manifestasjon som involverer et ansvar for en person i form av publisering, tilgjengeliggjøring eller utgivelse. @no
definition: Relaterer en person til en manifestation, som involverer en persons ansvar for publicering, frigivelse eller udgivelse. @da
definition: Relates a person to a manifestation that involves a responsibility of a person for publishing, releasing, or issuing. @en
definition: Sasaista personu ar manifestāciju, kas ietver personas atbildību par publicēšanu, izlaišanu vai izdošanu. @lv
definition: Seostab isiku kehastusega, mis sisaldab isiku vastutust avaldamise, väljalaskmise või väljaandmise eest. @et
definition: Setzt eine Person in Beziehung zu einer Manifestation, bei der eine Person für das Veröffentlichen, die Freigabe oder die Herausgabe verantwortlich ist. @de
definition: يربط شخصا بتجسيدة تنطوي على مسئولية شخص عن النشر، التحرير، أو الإصدار. @ar
definition: 将一个个人与涉及出版、发布或发行的一个个人的责任的一种载体表现关联起来。 @zh-hans

etsaaja (henkilö) manifestaatiossa
has element type: 2
toolkit definition: A manifestation that involves a responsibility of a person for subjecting metal, glass, or some other surface used for printing, to acid or another corrosive substance. @en
toolkit definition: Bir kişinin metal, cam veya baskı için kullanılan başka bir yüzeyi asit veya başka bir aşındırıcı maddeye maruz bırakma sorumluluğunu içeren bir gösterim. @tr
toolkit definition: Een manifestatie die met zich meebrengt een verantwoordelijkheid van een persoon voor het onderwerpen van metaal, glas of een ander oppervlak gebruikt voor drukken, aan zuur of andere bijtende substantie. @nl
toolkit definition: Egy megjelenési forma, amelyhez hozzátartozik egy személy felelőssége nyomtatáshoz használt fém-, üveg- vagy valamilyen más felület savnak vagy más maró anyagnak történő alávetéséért. @hu
toolkit definition: Eine Manifestation, bei der eine Person dafür verantwortlich ist, Metall, Glas oder eine andere Oberfläche, die zum Drucken benutzt wird, mit Säure oder einer anderen ätzenden Substanz zu behandeln. @de
toolkit definition: En manifestasjon som involverer et ansvar for en person i form av å utsette metall, glass eller et annet overflatemateriale som brukes til trykking, for syre eller et annet etsende stoff. @no
toolkit definition: Kehastus, mis sisaldab isiku vastutust trükkimiseks kasutatava metallist, klaasist või muust materjalist pinna töötlemise eest happe või muu söövitava ainega. @et
toolkit definition: Manifestaatio, jossa henkilö on vastuussa metallin, lasin tms. pinnan etsaamisesta hapon tai muun syövyttävän aineen avulla.
toolkit definition: Manifestació que implica una responsabilitat d’una persona sotmetent a l’àcid, o a qualsevol altra substància corrosiva, el metall, el vidre o qualsevol altra superfície usada en la impressió. @ca
toolkit definition: Manifestation qui comporte une responsabilité de la part d’une personne consistant à soumettre à l’acide ou à une autre substance corrosive du métal, du verre ou une autre surface utilisée pour l’impression. @fr
toolkit definition: Manifestation, som involverer en persons ansvar for at udsætte metal, glas eller en anden overflade, som anvendes til trykning, for syre eller et andet ætsende stof. @da
toolkit definition: Manifestazione che implica una responsabilità di una persona per l'esposizione di metallo, vetro o altra superficie utilizzata per la stampa, all'acido o altra sostanza corrosiva. @it
toolkit definition: Manifestācija, kas ietver personas atbildību par metāla, stikla vai citas virsmas pakļaušanu skābei vai citai kodīgai vielai, kas tikusi izmantota drukāšanai. @lv
toolkit definition: تجسيدة تنطوي على مسئولية شخص عن غمر معدن أو زجاج أو أي سطح آخر يستخدم للطباعة، في حامض، أو في أي مادة أخرى كاوية. @ar
toolkit definition: 涉及使用酸或其他腐蚀性物质施于用来印刷的金属、玻璃或其他表面上的一个个人的责任的一种载体表现 @zh-hans
toolkit label: Person als Radiererin/Radierer von @de
toolkit label: acquafortista persona di @it
toolkit label: etcher person of @en
toolkit label: etsaaja (henkilö) manifestaatiossa
toolkit label: etser av (person) @no
toolkit label: etser-persoon van @nl
toolkit label: ir ofortists (persona) @lv
toolkit label: karckészítő személye: @hu
toolkit label: oymacı @tr
toolkit label: person, som er raderer af @da
toolkit label: persona aiguafortista de @ca
toolkit label: personne aquafortiste de @fr
toolkit label: söövitaja (isik) kehastuses @et
toolkit label: οξυγράφος φυσικό πρόσωπο του @el
toolkit label: شخص حَفَّارُ بالزِنْكُوغْراف (الكليشيهات) @ar
toolkit label: ……的蚀刻者个人 @zh-hans
has subproperty: P50508
lexical alias: etcherPersonOf.en
status: Published
type: Property
domain: C10004
label: er etser av (person) @no
label: er person, som er raderer af @da
label: est une personne aquafortiste de @fr
label: ir ofortists (persona) @lv
label: is etcher person of @en
label: is etser-persoon van @nl
label: ist Person als Radiererin/Radierer von @de
label: karckészítő személye a következőnek: @hu
label: oymacı kişisidir @tr
label: söövitaja (isik) kehastuses @et
label: è acquafortista persona di @it
label: és persona aiguafortista de @ca
label: είναι οξυγράφος φυσικό πρόσωπο του @el
label: هو شخص حَفَّارُ بالزِنْكُوغْراف (الكليشيهات) لـ @ar
label: 是……的蚀刻者个人 @zh-hans
sub property of: etsaaja (toimija) mainifestaatiossa
sub property of: kuvalaatan valmistaja (henkilö) manifestaatiossa
definition: Bir kişiyi, kişinin metal, cam veya baskı için kullanılan başka bir yüzeyi asit veya başka bir aşındırıcı maddeye maruz bırakma sorumluluğunu içeren gösterimle ilişkilendirir. @tr
definition: Correla una persona a una manifestazione che implica una responsabilità di una persona per l'esposizione di metallo, vetro o altra superficie utilizzata per la stampa, all'acido o altra sostanza corrosiva. @it
definition: Hozzákapcsol egy személyt egy megjelenési formához, amelyhez hozzátartozik egy személy felelőssége nyomtatáshoz használt fém-, üveg- vagy valamilyen más felület savnak vagy más maró anyagnak történő alávetéséért. @hu
definition: Liittää henkilön manifestaatioon, jossa henkilö on vastuussa metallin, lasin tms. pinnan etsaamisesta hapon tai muun syövyttävän aineen avulla.
definition: Met une personne en relation avec une manifestation qui comporte une responsabilité de la part d’une personne consistant à soumettre à l’acide ou à une autre substance corrosive du métal, du verre ou une autre surface utilisée pour l’impression. @fr
definition: Relaciona una persona amb una manifestació que implica una responsabilitat d’una persona sotmetent a l’àcid, o a qualsevol altra substància corrosiva, el metall, el vidre o qualsevol altra superfície usada en la impressió. @ca
definition: Relateert een persoon aan een manifestatie die met zich meebrengt een verantwoordelijkheid van een persoon voor het onderwerpen van metaal, glas of een ander oppervlak gebruikt voor drukken, aan zuur of andere bijtende substantie. @nl
definition: Relaterer en person til en manifestasjon som involverer et ansvar for en person i form av å utsette metall, glass eller et annet overflatemateriale som brukes til trykking, for syre eller et annet etsende stoff. @no
definition: Relaterer en person til en manifestation, som involverer en persons ansvar for at udsætte metal, glas eller en anden overflade, som anvendes til trykning, for syre eller et andet ætsende stof. @da
definition: Relates a person to a manifestation that involves a responsibility of a person for subjecting metal, glass, or some other surface used for printing, to acid or another corrosive substance. @en
definition: Sasaista personu ar manifestāciju, kas ietver personas atbildību par metāla, stikla vai citas virsmas pakļaušanu skābei vai citai kodīgai vielai, kas tikusi izmantota drukāšanai. @lv
definition: Seostab isiku kehastusega, mis sisaldab isiku vastutust trükkimiseks kasutatava metallist, klaasist või muust materjalist pinna töötlemise eest happe või muu söövitava ainega. @et
definition: Setzt eine Person in Beziehung zu einer Manifestation, bei der eine Person dafür verantwortlich ist, Metall, Glas oder eine andere Oberfläche, die zum Drucken benutzt wird, mit Säure oder einer anderen ätzenden Substanz zu behandeln. @de
definition: يربط شخصا بتجسيدة تنطوي على مسئولية شخص عن غمر معدن أو زجاج أو أي سطح آخر يستخدم للطباعة، في حامض، أو في أي مادة أخرى كاوية. @ar
definition: 将一个个人与涉及使用酸或其他腐蚀性物质施于用来印刷的金属、玻璃或其他表面上的一个个人的责任的一种载体表现关联起来。 @zh-hans

graafinen suunnittelija (henkilö) manifestaatiossa
has element type: 2
toolkit definition: A manifestation that involves a responsibility of a person for the entire graphic design of a book, including arrangement of type and illustration, choice of materials, and process used. @en
toolkit definition: Bir kişinin yazı ve illüstrasyon düzenlemesi, malzeme seçimi ve kullanılan süreç dahil olmak üzere bir kitabın tüm grafik tasarımı için sorumluluğunu içeren bir gösterim. @tr
toolkit definition: Een manifestatie die met zich meebrengt een verantwoordelijkheid van een persoon voor het complete grafische ontwerp van een boek, inclusief indeling van font en illustratie, keuze van materialen en gebruikte methode. @nl
toolkit definition: Egy megjelenési forma, amelyhez hozzátartozik egy személy felelőssége egy könyv teljes grafikai tervezéséért, beleértve a nyomdai betűtípus és az illusztrációk elrendezését, az anyagválasztást és az alkalmazott eljárást. @hu
toolkit definition: Eine Manifestation, bei der eine Person für das gesamte grafische Design eines Buchs, einschließlich Schriftbild, Bildgestaltung, Materialwahl und angewandter Verfahren, verantwortlich ist. @de
toolkit definition: En manifestasjon som involverer et ansvar for en person i form av ansvar for hele den grafiske utformingen av en bok, inkludert oppsett av skrifttype og illustrasjoner, valg av materialer og hvilke prosesser som brukes. @no
toolkit definition: Kehastus, mis sisaldab isiku vastutust raamatu graafilise kujunduse eest, sealhulgas trükiteksti ja illustratsioonide paigutuse, materjalide valiku ja valmistamismenetluste eest. @et
toolkit definition: Manifestaatio, jossa henkilö on vastuussa koko kirjan graafisesta suunnittelusta, taitosta, materiaalien valinnasta ja käytettävistä valmistusmenetelmistä.
toolkit definition: Manifestació que implica una responsabilitat d’una persona en tot el disseny gràfic d’un llibre, inclosa la composició tipogràfica i la il·lustració, la tria dels materials i el procés utilitzat. @ca
toolkit definition: Manifestation qui comporte une responsabilité de la part d’une personne en ce qui concerne toute la conception graphique d’un livre, y compris la composition typographique, l’arrangement des illustrations, le choix des matériaux et le procédé utilisé. @fr
toolkit definition: Manifestation, som involverer en persons ansvar for hele det grafiske design af en bog, inkl. opsætning af tekst og illustrationer, materialevalg og anvendt proces. @da
toolkit definition: Manifestazione che implica una responsabilità di una persona nell'intera progettazione grafica di un libro, inclusa la disposizione dei caratteri e dell'illustrazione, la scelta dei materiali e il processo utilizzato. @it
toolkit definition: Manifestācija, kas ietver personas atbildību par grāmatas grafisko dizainu, tajā skaitā par izkātojuma veidu un ilustrācijām, materiālu izvēli un izmantoto procesu. @lv
toolkit definition: تجسيدة تنطوي على مسئولية شخص عن التصميم الجرافيكي لكتاب بالكامل، ويشمل ذلك تنسيق الحروف، والإيضاحيات، واختيار المواد، والعمليات المستخدمة. @ar
toolkit definition: 涉及一种图书的整体平面设计（包括字体和插图的设计、材料的选取和工艺流程的使用等）的一个个人的责任的一种载体表现 @zh-hans
toolkit label: Person als Buchgestalterin/Buchgestalter von @de
toolkit label: boekontwerper-persoon van @nl
toolkit label: bokdesigner for (person) @no
toolkit label: book designer person of @en
toolkit label: book designer persona di @it
toolkit label: graafinen suunnittelija (henkilö) manifestaatiossa
toolkit label: ir grāmatas dizainers (persona) @lv
toolkit label: kitap tasarımcısı @tr
toolkit label: könyvtervező személye: @hu
toolkit label: person, som er bogdesigner af @da
toolkit label: persona dissenyadora gràfica de @ca
toolkit label: personne maquettiste de livre de @fr
toolkit label: raamatukujundaja (isik) kehastuses @et
toolkit label: σχεδιαστής βιβλίου φυσικό πρόσωπο του @el
toolkit label: شخص مصمم كتب @ar
toolkit label: ……的图书设计者个人 @zh-hans
has subproperty: P50509
lexical alias: bookDesignerPersonOf.en
status: Published
type: Property
domain: C10004
label: er bokdesigner for (person) @no
label: er person, som er bogdesigner af @da
label: est une personne maquettiste de livre de @fr
label: ir grāmatas dizainers (persona) @lv
label: is boekontwerper-persoon van @nl
label: is book designer person of @en
label: ist Person als Buchgestalterin/Buchgestalter von @de
label: kitap tasarımcısı kişisidir @tr
label: könyvtervező személye a következőnek: @hu
label: raamatukujundaja (isik) kehastuses @et
label: è book designer persona di @it
label: és persona dissenyadora gràfica de @ca
label: είναι σχεδιαστής βιβλίου φυσικό πρόσωπο του @el
label: هو شخص مصمم كتب لـ @ar
label: 是……的图书设计者个人 @zh-hans
sub property of: graafinen suunnittelija (toimija) manifestaatiossa
sub property of: manifestaation tekijä (henkilö) manifestaatiossa
definition: Bir kişiyi, kişinin yazı ve illüstrasyon düzenlemesi, malzeme seçimi ve kullanılan süreç dahil olmak üzere bir kitabın tüm grafik tasarımı sorumluluğunu içeren gösterimle ilişkilendirir. @tr
definition: Correla una persona con una manifestazione che implica una responsabilità di una persona nell'intera progettazione grafica di un libro, inclusa la disposizione dei caratteri e dell'illustrazione, la scelta dei materiali e il processo utilizzato. @it
definition: Hozzákapcsol egy személyt egy megjelenési formához, amelyhez hozzátartozik egy személy felelőssége egy könyv teljes grafikai tervezéséért, beleértve a nyomdai betűtípus és az illusztrációk elrendezését, az anyagválasztást és az alkalmazott eljárást. @hu
definition: Liittää henkilön manifestaatioon, jossa henkilö on vastuussa koko kirjan graafisesta suunnittelusta, taitosta, materiaalien valinnasta ja käytettävistä valmistusmenetelmistä.
definition: Met une personne en relation avec une manifestation qui comporte une responsabilité de la part d’une personne en ce qui concerne toute la conception graphique d’un livre, y compris la composition typographique, l’arrangement des illustrations, le choix des matériaux et le procédé utilisé. @fr
definition: Relaciona una persona amb una manifestació que implica una responsabilitat d’una persona en tot el disseny gràfic d’un llibre, inclosa la composició tipogràfica i la il·lustració, la tria dels materials i el procés utilitzat. @ca
definition: Relateert een persoon aan een manifestatie die met zich meebrengt een verantwoordelijkheid van een persoon voor het complete grafische ontwerp van een boek, inclusief indeling van font en illustratie, keuze van materialen en gebruikte methode. @nl
definition: Relaterer en person til en manifestasjon som involverer et ansvar for en person i form av ansvar for hele den grafiske utformingen av en bok, inkludert oppsett av skrifttype og illustrasjoner, valg av materialer og hvilke prosesser som brukes. @no
definition: Relaterer en person til en manifestation, som involverer en persons ansvar for hele det grafiske design af en bog, inkl. opsætning af tekst og illustrationer, materialevalg og anvendt proces. @da
definition: Relates a person to a manifestation that involves a responsibility of a person for the entire graphic design of a book, including arrangement of type and illustration, choice of materials, and process used. @en
definition: Sasaista personu ar manifestāciju, kas ietver personas atbildību par grāmatas grafisko dizainu, tajā skaitā par izkātojuma veidu un ilustrācijām, materiālu izvēli un izmantoto procesu. @lv
definition: Seostab isiku kehastusega, mis sisaldab isiku vastutust raamatu graafilise kujunduse eest, sealhulgas trükiteksti ja illustratsioonide paigutuse, materjalide valiku ja valmistamismenetluste eest. @et
definition: Setzt eine Person in Beziehung zu einer Manifestation, bei der eine Person für das gesamte grafische Design eines Buchs, einschließlich Schriftbild, Bildgestaltung, Materialwahl und angewandter Verfahren, verantwortlich ist. @de
definition: يربط شخصا بتجسيدة تنطوي على مسئولية شخص عن التصميم الجرافيكي لكتاب بالكامل، ويشمل ذلك تنسيق الحروف، والإيضاحيات، واختيار المواد، والعمليات المستخدمة. @ar
definition: 将一个个人与涉及一种图书的整体平面设计（包括字体和插图的设计、材料的选取和工艺流程的使用等）的一个个人的责任的一种载体表现关联起来。 @zh-hans

kollotypian valmistaja (henkilö) manifestaatiossa
has element type: 2
toolkit definition: A manifestation that involves a responsibility of a person for preparing a hardened film of gelatin or other colloid that has ink-receptive and ink-repellent surfaces and that is used to make prints using a photomechanical process. @en
toolkit definition: Bir kişinin mürekkep alıcı ve mürekkep itici yüzeylere sahip olan ve fotomekanik bir işlem kullanarak baskı yapmak için kullanılan sertleştirilmiş jelatin veya başka bir kolloid filmin hazırlanması sorumluluğunu içeren bir gösterim. @tr
toolkit definition: Een manifestatie die met zich meebrengt een verantwoordelijkheid van een persoon voor het gebruiken van een fotomechanisch proces voor het maken van afdrukken direct vanaf een verharde film van gelatine of ander colloïde dat inktopnemende en inktafstotende oppervlakken heeft. @nl
toolkit definition: Egy megjelenési forma, amelyhez hozzátartozik egy személy felelőssége nyomtatványok fotómechanikai eljárással történő közvetlen előállításáért, amihez festékfelvevő és festéktaszító felülettel rendelkező zselatin vagy más kolloid megkeményedett filmjét használja. @hu
toolkit definition: Eine Manifestation, bei der eine Person für die Verwendung eines fotomechanischen Verfahrens zur Herstellung von Abzügen direkt von einem gehärteten Film aus Gelatine oder einem anderen Kolloid, der druckerfarbenaufnehmende und -abweisende Oberflächen aufweist, verantwortlich ist. @de
toolkit definition: En manifestasjon som involverer et ansvar for en person i form av bruk av en fotomekanisk prosess for å lage kopier direkte fra en stivnet film av gelatin eller et annet kolloid som har overflater som er mottagelige for blekk og motstandige mot blekk. @no
toolkit definition: Kehastus, mis sisaldab isiku vastutust fotomehaanilises protsessis tõmmiste tegemise eest otse želatiini või muu kolloidi tahkunud kihilt, mille pind osalt seob värvainet, osalt ei seo. @et
toolkit definition: Manifestaatio, jonka valmistamisesta henkilö on vastuussa tekemällä vedoksia suoraan kovettuneelta gelatiinifilmiltä tai muulta materiaalilta, jossa on mustetta imeviä ja hylkiviä pintoja.
toolkit definition: Manifestació que implica una responsabilitat d’una persona en la preparació d’una pel·lícula endurida de gelatina o d’un altre col·loide que té superfícies que accepten o rebutgen la tinta i que s'usa per fer gravats usant un procés fotomecànic. @ca
toolkit definition: Manifestation qui comporte une responsabilité de la part d’une personne consistant à préparer un film durci de gélatine ou d’un autre colloïde présentant des surfaces réceptives et répulsives à l’encre et servant à réaliser des images imprimées à l’aide d’un procédé photomécanique. @fr
toolkit definition: Manifestation, som involverer en persons ansvar for en fotomekanisk proces, hvorved der laves tryk direkte fra et hærdet gelatinelag eller andet kolloid, som har blækmodtagelige og blækafvisende overflader. @da
toolkit definition: Manifestācija, kas ietver personas atbildību par fotomehānisku procesu, lai izgatavotu izdrukas tieši no plates, kas pārklāta ar gaismjutīga hromželatīna slāni vai citu koloīdu, kuram ir tinti piesaistošas un tinti atgrūdošas virsmas. @lv
toolkit definition: تجسيدة تنطوي على مسئولية شخص عن استخدام عمليات ميكانيكية ضوئية لإنتاج المطبوعات مباشرة من فيلم صلد من الجيلاتين أو غيره من المواد الغروية التي تحتوي على أسطح مستقبلة أو طاردة للحبر. @ar
toolkit definition: 涉及利用一面吸墨而另一面不吸墨的明胶或其他硬胶片进行影印的一个个人的责任的一种载体表现 @zh-hans
toolkit label: Person als Lichtdruckerin/Lichtdrucker von @de
toolkit label: collotyper person of @en
toolkit label: fénynyomatkészítő személye: @hu
toolkit label: ir fotogravieris (persona) @lv
toolkit label: kollotypian valmistaja (henkilö) manifestaatiossa
toolkit label: kollotüübi valmistaja (isik) kehastuses @et
toolkit label: lichtdrukker-persoon van @nl
toolkit label: lystrykker for (person) @no
toolkit label: person, som er lystrykker af @da
toolkit label: persona fototipista de @ca
toolkit label: personne phototypeuse de @fr
toolkit label: taş baskıcı @tr
toolkit label: κατασκευαστής κολλοτυπίας φυσικό πρόσωπο του @el
toolkit label: وكيل طبّاع صور فوتوغرافية @ar
toolkit label: ……的珂罗版制作者个人 @zh-hans
has subproperty: P50510
lexical alias: collotyperPersonOf.en
status: Published
type: Property
domain: C10004
label: er lystrykker for (person) @no
label: er person, som er lystrykker af @da
label: est une personne phototypeuse de @fr
label: fénynyomatkészítő személye a következőnek: @hu
label: ir fotogravieris (persona) @lv
label: is collotyper person of @en
label: is lichtdrukker-persoon van @nl
label: ist Person als Lichtdruckerin/Lichtdrucker von @de
label: kollotüübi valmistaja (isik) kehastuses @et
label: kolotip baskıcı kişisidir @tr
label: és persona fototipista de @ca
label: είναι κατασκευαστής κολλοτυπίας φυσικό πρόσωπο του @el
label: هو وكيل طبّاع صور فوتوغرافية لـ @ar
label: 是……的珂罗版制作者个人 @zh-hans
sub property of: kollotypian valmistaja (toimija) manifestaatiossa
sub property of: kuvalaatan valmistaja (henkilö) manifestaatiossa
alternative label: -
alternative label: collotypist person of @en
alternative label: persona calotipista de @es
alternative label: personne collotypiste de @fr
alternative label: taş baskı uzmanı @tr
alternative label: ……的珂罗版制作者个人 @zh-hans
definition: Bir kişiyi, kişinin mürekkep alıcı ve mürekkep itici yüzeylere sahip olan ve fotomekanik bir işlem kullanarak baskı yapmak için kullanılan sertleştirilmiş jelatin veya başka bir kolloid filmin hazırlanması sorumluluğunu içeren gösterimle ilişkilendirir. @tr
definition: Hozzákapcsol egy személyt egy megjelenési formához, amelyhez hozzátartozik egy személy felelőssége nyomtatványok fotómechanikai eljárással történő közvetlen előállításáért, amihez festékfelvevő és festéktaszító felülettel rendelkező zselatin vagy más kolloid megkeményedett filmjét használja. @hu
definition: Liittää henkilön manifestaatioon, jonka valmistamisesta henkilö on vastuussa tekemällä vedoksia suoraan kovettuneelta gelatiinifilmiltä tai muulta materiaalilta, jossa on mustetta imeviä ja hylkiviä pintoja.
definition: Met une personne en relation avec une manifestation qui comporte une responsabilité de la part d’une personne consistant à préparer un film durci de gélatine ou d’un autre colloïde présentant des surfaces réceptives et répulsives à l’encre et servant à réaliser des images imprimées à l’aide d’un procédé photomécanique. @fr
definition: Relaciona una persona amb una manifestació que implica una responsabilitat d’una persona en la preparació d’una pel·lícula endurida de gelatina o d’un altre col·loide que té superfícies que accepten o rebutgen la tinta i que s'usa per fer gravats usant un procés fotomecànic. @ca
definition: Relateert een persoon aan een manifestatie die met zich meebrengt een verantwoordelijkheid van een persoon voor het gebruiken van een fotomechanisch proces voor het maken van afdrukken direct vanaf een verharde film van gelatine of ander colloïde dat inktopnemende en inktafstotende oppervlakken heeft. @nl
definition: Relaterer en person til en manifestasjon som involverer et ansvar for en person i form av bruk av en fotomekanisk prosess for å lage kopier direkte fra en stivnet film av gelatin eller et annet kolloid som har overflater som er mottagelige for blekk og motstandige mot blekk. @no
definition: Relaterer en person til en manifestation, som involverer en persons ansvar for en fotomekanisk proces, hvorved der laves tryk direkte fra et hærdet gelatinelag eller andet kolloid, som har blækmodtagelige og blækafvisende overflader. @da
definition: Relates a person to a manifestation that involves a responsibility of a person for preparing a hardened film of gelatin or other colloid that has ink-receptive and ink-repellent surfaces and that is used to make prints using a photomechanical process. @en
definition: Sasaista personu ar manifestāciju, kas ietver personas atbildību par fotomehānisku procesu, lai izgatavotu izdrukas tieši no plates, kas pārklāta ar gaismjutīga hromželatīna slāni vai citu koloīdu, kuram ir tinti piesaistošas un tinti atgrūdošas virsmas. @lv
definition: Seostab isiku kehastusega, mis sisaldab isiku vastutust fotomehaanilises protsessis tõmmiste tegemise eest otse želatiini või muu kolloidi tahkunud kihilt, mille pind osalt seob värvainet, osalt ei seo. @et
definition: Setzt eine Person in Beziehung zu einer Manifestation, bei der eine Person für die Verwendung eines fotomechanischen Verfahrens zur Herstellung von Abzügen direkt von einem gehärteten Film aus Gelatine oder einem anderen Kolloid, der druckerfarbenaufnehmende und -abweisende Oberflächen aufweist, verantwortlich ist. @de
definition: يربط شخصا بتجسيدة تنطوي على مسئولية شخص عن استخدام عمليات ميكانيكية ضوئية لإنتاج المطبوعات مباشرة من فيلم صلد من الجيلاتين أو غيره من المواد الغروية التي تحتوي على أسطح مستقبلة أو طاردة للحبر. @ar
definition: 将一个个人与涉及利用一面吸墨而另一面不吸墨的明胶或其他硬胶片进行影印的一个个人的责任的一种载体表现关联起来。 @zh-hans

kartografiaan osallinen henkilö manifestaatiossa
has element type: 2
toolkit definition: A manifestation that is an aggregate that embodies an expression of a cartographic work that is created by a person. @en
toolkit definition: Bir kişi tarafından oluşturulan bir kartografik eserin anlatımını somutlaştıran topluluk olan bir gösterim. @tr
toolkit definition: Een manifestatie die een aggregaat is die een expressie van een cartografisch werk verwezenlijkt dat is gecreëerd door een persoon. @nl
toolkit definition: Egy aggregátum megjelenési forma, amely egy személy által létrehozott kartográfiai mű kifejezési formáját testesíti meg. @hu
toolkit definition: Ein Aggregat (Manifestation), das eine Expression eines kartografischen Werks verkörpert, die eine Person erstellt hat. @de
toolkit definition: En manifestasjon som er et aggregat som realiserer et kartografisk verk skapt av en person. @no
toolkit definition: Kehastus, mis on liitum, milles on teostatud isiku loodud kartograafilise teose väljendus. @et
toolkit definition: Manifestaatio, joka on aggregaatti, joka sisältää kartografisen teoksen ekspression, jonka henkilö on luonut.
toolkit definition: Manifestació que és un agregat que materialitza una expressió d’una obra cartogràfica que és creada per una persona. @ca
toolkit definition: Manifestation qui consiste en un agrégat matérialisant une expression d’une œuvre cartographique créée par une personne. @fr
toolkit definition: Manifestation, som er en samling, som rummer et udtryk af et kartografisk værk, som er skabt af en person. @da
toolkit definition: Manifestazione che è un aggregato che materializza un'opera cartografica creata da una persona. @it
toolkit definition: Manifestācija, kas ir apkopojums, kas ietver personas radītu kartogrāfijas darbu. @lv
toolkit definition: تجسيدة تمثل تجميعة تجسد عملا رسم الخرائط أنشأه شخص. @ar
toolkit definition: 作为一种合集、把一个个人所创作的一种地图作品的内容表达具体化的一种载体表现 @zh-hans
toolkit label: Person als Beiträgerin/Beiträger von einer Kartografie von @de
toolkit label: bidragsyter til kartografi for (person) @no
toolkit label: bijdrager-persoon van cartografie van @nl
toolkit label: contributor person of cartography of @en
toolkit label: contributore persona di cartografia di @it
toolkit label: ir kartogrāfijas līdzradītājs (persona) @lv
toolkit label: kaastööline kartograafia alal (isik) kehastuses @et
toolkit label: kartografiaan osallinen henkilö manifestaatiossa
toolkit label: kartografiye katkıda bulunan kişi @tr
toolkit label: közreműködő személye a következő kartográfiának: @hu
toolkit label: person, som er bidragsyder til kartografi af @da
toolkit label: persona contribuïdora de cartografia de @ca
toolkit label: personne contributrice de cartographie de @fr
toolkit label: συντελεστής φυσικό πρόσωπο της χαρτογράφησης του @el
toolkit label: شخص مساهم في رسم خرائط @ar
toolkit label: ……的地图绘制的贡献者个人 @zh-hans
has subproperty: maanmittari (henkilö) manifestaatiossa
has subproperty: P50511
lexical alias: contributorPersonOfCartographyOf.en
status: Published
type: Property
domain: C10004
label: er bidragsyter til kartografi for (person) @no
label: er person, som er bidragsyder til kartografi af @da
label: est une personne contributrice de cartographie de @fr
label: ir kartogrāfijas līdzradītājs (persona) @lv
label: is bijdrager-persoon van cartografie van @nl
label: is contributor person of cartography of @en
label: ist Person als Beiträgerin/Beiträger von einer Kartografie von @de
label: kaastööline kartograafia alal (isik) kehastuses @et
label: kartografisinin katkıda bulunan kişisidir @tr
label: közreműködő személye a következő kartográfiának: @hu
label: è contributore persona di cartografia di @it
label: és persona contribuïdora de cartografia de @ca
label: είναι συντελεστής φυσικό πρόσωπο της χαρτογράφησης του @el
label: هو شخص مساهم في رسم خرائط لـ @ar
label: 是……的地图绘制的贡献者个人 @zh-hans
sub property of: kartografiaan osallinen toimija manifestaatiossa
sub property of: aggregaattiin osallinen henkilö manifestaatiossa
definition: Bir kişiyi, bir kişi tarafından yaratılan bir kartografik çalışmanın anlamını somutlaştıran bir bütün olan gösterimle ilişkilendirir. @tr
definition: Correla una persona a una manifestazione che è un aggregato che materializza un'opera cartografica creata da una persona. @it
definition: Hozzákapcsol egy személyt egy aggregátum megjelenési formához, amely egy személy által létrehozott kartográfiai mű kifejezési formáját testesíti meg. @hu
definition: Liittää henkilön manifestaatioon, joka on aggregaatti, joka sisältää kartografisen teoksen ekspression, jonka henkilö on luonut.
definition: Met une personne en relation avec une manifestation qui consiste en un agrégat matérialisant une expression d’une œuvre cartographique créée par une personne. @fr
definition: Relaciona una persona amb una manifestació que és un agregat que materialitza una expressió d’una obra cartogràfica que és creada per una persona. @ca
definition: Relateert een persoon aan een manifestatie die een aggregaat is die een expressie van een cartografisch werk verwezenlijkt dat is gecreëerd door een persoon. @nl
definition: Relaterer en person til en manifestasjon som er et aggregat som realiserer et kartografisk verk skapt av en person. @no
definition: Relaterer en person til en manifestation, som er en samling, som rummer et udtryk af et kartografisk værk, som er skabt af en person. @da
definition: Relates a person to a manifestation that is an aggregate that embodies an expression of a cartographic work that is created by a person. @en
definition: Sasaista personu ar manifestāciju, kas ir apkopojums, kas ietver personas radītu kartogrāfijas darbu. @lv
definition: Seostab isiku kehastusega, mis on liitum, milles on teostatud isiku loodud kartograafilise teose väljendus. @et
definition: Setzt eine Person in Beziehung zu einem Aggregat (Manifestation), das eine Expression eines kartografischen Werks verkörpert, die eine Person erstellt hat. @de
definition: يربط شخصا بتجسيدة عبارة عن تجميعة تجسد عملا رسم خرائطي أنشأه شخص. @ar
definition: 将一个个人与作为一种合集、把一个个人所创作的一种地图作品的内容表达具体化的一种载体表现关联起来。 @zh-hans

koreografiaan osallinen henkilö manifestaatiossa
has element type: 2
toolkit definition: A manifestation that is an aggregate that embodies an expression of a choreographic work that is created by a person. @en
toolkit definition: Bir kişi tarafından oluşturulan bir koreografik eserin anlatımını somutlaştıran topluluk olan bir gösterim. @tr
toolkit definition: Een manifestatie die een aggregaat is die een expressie van een choreografisch werk verwezenlijkt dat is gecreëerd door een persoon. @nl
toolkit definition: Egy aggregátum megjelenési forma, amely egy személy által létrehozott koreografikus mű kifejezési formáját testesíti meg. @hu
toolkit definition: Ein Aggregat (Manifestation), das eine Expression eines choreografischen Werks verkörpert, die eine Person erstellt hat. @de
toolkit definition: En manifestasjon som er et aggregat som realiserer et koreografisk verk skapt av en person. @no
toolkit definition: Kehastus, mis on liitum, milles on teostatud isiku loodud koreograafilise teose väljendus. @et
toolkit definition: Manifestaatio, joka on aggregaatti, joka sisältää koreografisen teoksen ekspression, jonka henkilö on luonut.
toolkit definition: Manifestació que és un agregat que materialitza una expressió d’una obra coreogràfica que és creada per una persona. @ca
toolkit definition: Manifestation qui consiste en un agrégat matérialisant une expression d’une œuvre chorégraphique créée par une personne. @fr
toolkit definition: Manifestation, som er en samling, som rummer et udtryk af et koreografisk værk, som er skabt af en person. @da
toolkit definition: Manifestazione che è un aggregato che materializza un'opera coreografica creata da una persona. @it
toolkit definition: Manifestācija, kas ir apkopojums, kas ietver personas radītu horeogrāfijas darbu. @lv
toolkit definition: تجسيدة تمثل تجميعة تجسد عملا راقص أبدعه شخص. @ar
toolkit definition: 作为一种合集、把一个个人所创作的一种编舞作品的内容表达具体化的一种载体表现 @zh-hans
toolkit label: Person als Beiträgerin/Beiträger von einer Choreografie von @de
toolkit label: bidragsyter til koreografi for (person) @no
toolkit label: bijdrager-persoon van choreografie van @nl
toolkit label: contributor person of choreography of @en
toolkit label: contributore persona di coreografia di @it
toolkit label: ir horeogrāfijas līdzradītājs (persona) @lv
toolkit label: kaastööline koreograafia alal (isik) kehastuses @et
toolkit label: koreografiaan osallinen henkilö manifestaatiossa
toolkit label: koreografiye katkıda bulunan kişi @tr
toolkit label: közreműködő személye a következő koreográfiának: @hu
toolkit label: person, som er bidragsyder til koreografi af @da
toolkit label: persona contribuïdora de coreografia de @ca
toolkit label: personne contributrice de chorégraphie de @fr
toolkit label: συντελεστής φυσικό πρόσωπο της χορογραφίας του @el
toolkit label: شخص مساهم في رقص @ar
toolkit label: ……的编舞的贡献者个人 @zh-hans
has subproperty: P50512
lexical alias: contributorPersonOfChoreographyOf.en
status: Published
type: Property
domain: C10004
label: er bidragsyter til koreografi for (person) @no
label: er person, som er bidragsyder til koreografi af @da
label: est une personne contributrice de chorégraphie de @fr
label: ir horeogrāfijas līdzradītājs (persona) @lv
label: is bijdrager-persoon van choreografie van @nl
label: is contributor person of choreography of @en
label: ist Person als Beiträgerin/Beiträger von einer Choreografie von @de
label: kaastööline koreograafia alal (isik) kehastuses @et
label: kerografisinin katkıda bulunan kişisidir @tr
label: közreműködő személye a következő koreográfiának: @hu
label: è contributore persona di coreografia di @it
label: és persona contribuïdora de coreografia de @ca
label: είναι συντελεστής φυσικό πρόσωπο της χορογραφίας του @el
label: هو شخص مساهم في رقص لـ @ar
label: 是……的编舞的贡献者个人 @zh-hans
sub property of: koreografiaan osallinen toimija manifestaatiossa
sub property of: aggregaattiin osallinen henkilö manifestaatiossa
definition: Bir kişiyi, bir kişi tarafından yaratılan bir koreografi çalışmasının anlatımını somutlaştıran bir bütün olan gösterimle ilişkilendirir. @tr
definition: Correla una persona a una manifestazione che è un aggregato che materializza un'opera coreografica creata da una persona. @it
definition: Hozzákapcsol egy személyt egy aggregátum megjelenési formához, amely egy személy által létrehozott koreografikus mű kifejezési formáját testesíti meg. @hu
definition: Liittää henkilön manifestaatioon, joka on aggregaatti, joka sisältää koreografisen teoksen ekspression, jonka henkilö on luonut.
definition: Met une personne en relation avec une manifestation qui consiste en un agrégat matérialisant une expression d’une œuvre chorégraphique créée par une personne. @fr
definition: Relaciona una persona amb una manifestació que és un agregat que materialitza una expressió d’una obra coreogràfica que és creada per una persona. @ca
definition: Relateert een persoon aan een manifestatie die een aggregaat is die een expressie van een choreografisch werk verwezenlijkt dat is gecreëerd door een persoon. @nl
definition: Relaterer en person til en manifestasjon som er et aggregat som realiserer et koreografisk verk skapt av en person. @no
definition: Relaterer en person til en manifestation, som er en samling, som rummer et udtryk af et koreografisk værk, som er skabt af en person. @da
definition: Relates a person to a manifestation that is an aggregate that embodies an expression of a choreographic work that is created by a person. @en
definition: Sasaista personu ar manifestāciju, kas ir apkopojums, kas ietver personas radītu horeogrāfijas darbu. @lv
definition: Seostab isiku kehastusega, mis on liitum, milles on teostatud isiku loodud koreograafilise teose väljendus. @et
definition: Setzt eine Person in Beziehung zu einem Aggregat (Manifestation), das eine Expression eines choreografischen Werks verkörpert, die eine Person erstellt hat. @de
definition: يربط شخصا بتجسيدة عبارة عن تجميعة تجسد عملا راقص أنشأه شخص. @ar
definition: 将一个个人与作为一种合集、把一个个人所创作的一种编舞作品的内容表达具体化的一种载体表现关联起来。 @zh-hans

liikkuvaan kuvaan osallinen henkilö manifestaatiossa
has element type: 2
toolkit definition: A manifestation that is an aggregate that embodies an expression of a moving image work that is created by a person. @en
toolkit definition: Bir kişi tarafından oluşturulan hareketli bir görüntü eserinin anlatımını somutlaştıran topluluk olan bir gösterim. @tr
toolkit definition: Een manifestatie die een aggregaat is die een expressie van een bewegend beeldwerk verwezenlijkt dat is gecreëerd door een persoon. @nl
toolkit definition: Egy aggregátum megjelenési forma, amely egy személy által létrehozott mozgóképmű kifejezési formáját testesíti meg. @hu
toolkit definition: Ein Aggregat (Manifestation), das eine Expression eines Bewegtbildwerks verkörpert, die eine Person erstellt hat. @de
toolkit definition: En manifestasjon som er et aggregat som realiserer et verk med levende bilder skapt av en person. @no
toolkit definition: Kehastus, mis on liitum, milles on teostatud isiku loodud liikuvast pildist koosneva teose väljendus. @et
toolkit definition: Manifestaatio, joka on aggregaatti, joka sisältää liikkuvan kuvan teoksen ekspression, jonka henkilö on luonut.
toolkit definition: Manifestació que és un agregat que materialitza una expressió d’una obra d’imatge en moviment que és creada per una persona. @ca
toolkit definition: Manifestation qui consiste en un agrégat matérialisant une expression d’une œuvre d’images animées créée par une personne. @fr
toolkit definition: Manifestation, som er en samling, som rummer et udtryk af et værk med levende billeder, som er skabt af en person. @da
toolkit definition: Manifestazione che è un aggregato che materializza un'opera consistente in un'immagine in movimento creata da una persona. @it
toolkit definition: Manifestācija, kas ir apkopojums, kas ietver personas radītu kustīga attēla darbu. @lv
toolkit definition: تجسيدة تمثل تجميعة تجسد عمل صور متحركة أنشأه شخص. @ar
toolkit definition: 作为一种合集、把一个个人所创作的一种动态图像作品的内容表达具体化的一种载体表现 @zh-hans
toolkit label: Person als Beiträgerin/Beiträger von einem Bewegtbild von @de
toolkit label: bidragsyter til levende bilder for (person) @no
toolkit label: bijdrager-persoon van bewegend beeld van @nl
toolkit label: contributor person of moving image of @en
toolkit label: contributore persona di immagine in movimento di @it
toolkit label: hareketli görüntüye katkıda bulunan kişi @tr
toolkit label: ir kustīga attēla līdzradītājs (persona) @lv
toolkit label: kaastööline liikuva pildi alal (isik) kehastuses @et
toolkit label: közreműködő személye a következő mozgóképnek: @hu
toolkit label: liikkuvaan kuvaan osallinen henkilö manifestaatiossa
toolkit label: person, som er bidragsyder til levende billede af @da
toolkit label: persona contribuïdora d’imatge en moviment de @ca
toolkit label: personne contributrice d’images animées de @fr
toolkit label: συντελεστής φυσικό πρόσωπο της κινητής εικόνας του @el
toolkit label: شخص مساهم في صور متحركة @ar
toolkit label: ……的动态图像的贡献者个人 @zh-hans
has subproperty: P50513
lexical alias: contributorPersonOfMovingImageOf.en
status: Published
type: Property
domain: C10004
label: er bidragsyter til levende bilder for (person) @no
label: er person, som er bidragsyder til levende billede af @da
label: est une personne contributrice d’images animées de @fr
label: hareketli görüntüsünün katkıda bulunan kişisidir @tr
label: ir kustīga attēla līdzradītājs (persona) @lv
label: is bijdrager-persoon van bewegend beeld van @nl
label: is contributor person of moving image of @en
label: ist Person als Beiträgerin/Beiträger von einem Bewegtbild von @de
label: kaastööline liikuva pildi alal (isik) kehastuses @et
label: közreműködő személye a következő mozgóképnek: @hu
label: è contributore persona di immagine in movimento di @it
label: és persona contribuïdora d’imatge en moviment de @ca
label: είναι συντελεστής φυσικό πρόσωπο της κινητής εικόνας του @el
label: هو شخص مساهم في صور متحركة لـ @ar
label: 是……的动态图像的贡献者个人 @zh-hans
sub property of: liikkuvaan kuvaan osallinen toimija manifestaatiossa
sub property of: aggregaattiin osallinen henkilö manifestaatiossa
definition: Bir kişiyi, bir kişi tarafından yaratılan bir hareketli görüntü çalışmasının anlatımını somutlaştıran bir bütün olan gösterimle ilişkilendirir. @tr
definition: Correla una persona a una manifestazione che è un aggregato che materializza un'immagine in movimento creata da una persona. @it
definition: Hozzákapcsol egy személyt egy aggregátum megjelenési formához, amely egy személy által létrehozott mozgóképmű kifejezési formáját testesíti meg. @hu
definition: Liittää henkilö manifestaatioon, joka on aggregaatti, joka sisältää liikkuvan kuvan teoksen ekspression, jonka henkilö on luonut.
definition: Met une personne en relation avec une manifestation qui consiste en un agrégat matérialisant une expression d’une œuvre d’images animées créée par une personne. @fr
definition: Relaciona una persona amb una manifestació que és un agregat que materialitza una expressió d’una obra d’imatge en moviment que és creada per una persona. @ca
definition: Relateert een persoon aan een manifestatie die een aggregaat is die een expressie van een bewegend beeldwerk verwezenlijkt dat is gecreëerd door een persoon. @nl
definition: Relaterer en person til en manifestasjon som er et aggregat som realiserer et verk med levende bilder skapt av en person. @no
definition: Relaterer en person til en manifestation, som er en samling, som rummer et udtryk af et værk med levende billeder, som er skabt af en person. @da
definition: Relates a person to a manifestation that is an aggregate that embodies an expression of a moving image work that is created by a person. @en
definition: Sasaista personu ar manifestāciju, kas ir apkopojums, kas ietver personas radītu kustīga attēla darbu. @lv
definition: Seostab isiku kehastusega, mis on liitum, milles on teostatud isiku loodud liikuvast pildist koosneva teose väljendus. @et
definition: Setzt eine Person in Beziehung zu einem Aggregat (Manifestation), das eine Expression eines Bewegtbildwerks verkörpert, die eine Person erstellt hat. @de
definition: يربط شخصا بتجسيدة عبارة عن تجميعة تجسد عمل صور متحركة أنشأه شخص. @ar
definition: 将一个个人与作为一种合集、把一个个人所创作的一种动态图像作品的内容表达具体化的一种载体表现关联起来。 @zh-hans

musiikkiin osallinen henkilö manifestaatiossa
has element type: 2
toolkit definition: A manifestation that is an aggregate that embodies an expression of a musical work that is created by a person. @en
toolkit definition: Bir kişi tarafından oluşturulan bir müzik eserinin anlatımını somutlaştıran topluluk olan bir gösterim. @tr
toolkit definition: Een manifestatie die een aggregaat is die een expressie van een muziekwerk verwezenlijkt dat is gecreëerd door een persoon. @nl
toolkit definition: Egy aggregátum megjelenési forma, amely egy személy által létrehozott zenemű kifejezési formáját testesíti meg. @hu
toolkit definition: Ein Aggregat (Manifestation), das eine Expression eines Musikwerks verkörpert, die eine Person erstellt hat. @de
toolkit definition: En manifestasjon som er et aggregat som realiserer et musikalsk verk skapt av en person. @no
toolkit definition: Kehastus, mis on liitum, milles on teostatud isiku loodud muusikateose väljendus. @et
toolkit definition: Manifestaatio, joka on aggregaatti, joka sisältää musiikkiteoksen ekspression, jonka henkilö on luonut.
toolkit definition: Manifestació que és un agregat que materialitza una expressió d’una obra musical que és creada per una persona. @ca
toolkit definition: Manifestation qui consiste en un agrégat matérialisant une expression d’une œuvre musicale créée par une personne. @fr
toolkit definition: Manifestation, som er en samling, som rummer et udtryk af et musikværk, som er skabt af en person. @da
toolkit definition: Manifestazione che è un aggregato che materializza un'opera musicale creata da una persona. @it
toolkit definition: Manifestācija, kas ir apkopojums, kas ietver personas radītu mūzikas darbu. @lv
toolkit definition: تجسيدة تمثل تجميعة تجسد عمل موسيقي أنشأه شخص. @ar
toolkit definition: 作为一种合集、把一个个人所创作的一种音乐作品的内容表达具体化的一种载体表现 @zh-hans
toolkit label: Person als Beiträgerin/Beiträger einer Musik von @de
toolkit label: bidragsyter til musikk for (person) @no
toolkit label: bijdrager-persoon van muziek van @nl
toolkit label: contributor person of music of @en
toolkit label: contributore persona di musica di @it
toolkit label: ir mūzikas līdzradītājs (persona) @lv
toolkit label: közreműködő személye a következő zenének: @hu
toolkit label: musiikkiin osallinen henkilö manifestaatiossa
toolkit label: muusikaline kaastööline (isik) kehastuses @et
toolkit label: müziğine katkıda bulunan kişi @tr
toolkit label: person, som er bidragsyder til musik af @da
toolkit label: persona contribuïdora de música de @ca
toolkit label: personne contributrice de musique de @fr
toolkit label: συντελεστής φυσικό πρόσωπο της μουσικής του @el
toolkit label: شخص مساهم في موسيقى @ar
toolkit label: ……的音乐的贡献者个人 @zh-hans
has subproperty: P50514
lexical alias: contributorPersonOfMusicOf.en
status: Published
type: Property
domain: C10004
label: er bidragsyter til musikk for (person) @no
label: er person, som er bidragsyder til musik af @da
label: est une personne contributrice de musique de @fr
label: ir mūzikas līdzradītājs (persona) @lv
label: is bijdrager-persoon van muziek van @nl
label: is contributor person of music of @en
label: ist Person als Beiträgerin/Beiträger einer Musik von @de
label: közreműködő személye a következő zenének: @hu
label: muusikaline kaastööline (isik) kehastuses @et
label: müziğinin katkıda bulunan kişisidir @tr
label: è contributore persona di musica di @it
label: és persona contribuïdora de música de @ca
label: είναι συντελεστής φυσικό πρόσωπο της μουσικής του @el
label: هو شخص مساهم في موسيقى لـ @ar
label: 是……的音乐的贡献者个人 @zh-hans
sub property of: musiikkiin osallinen toimija manifestaatiossa
sub property of: aggregaattiin osallinen henkilö manifestaatiossa
definition: Bir kişiyi, bir kişi tarafından yaratılan bir müzik çalışmasının anlatımını somutlaştıran bir bütün olan gösterimle ilişkilendirir. @tr
definition: Correla una persona a una manifestazione che è un aggregato che materializza un'opera musicale creata da una persona. @it
definition: Hozzákapcsol egy személyt egy aggregátum megjelenési formához, amely egy személy által létrehozott zenemű kifejezési formáját testesíti meg. @hu
definition: Liittää henkilön manifestaatioon, joka on aggregaatti, joka sisältää musiikkiteoksen ekspression, jonka henkilö on luonut.
definition: Met une personne en relation avec une manifestation qui consiste en un agrégat matérialisant une expression d’une œuvre musicale créée par une personne. @fr
definition: Relaciona una persona amb una manifestació que és un agregat que materialitza una expressió d’una obra musical que és creada per una persona. @ca
definition: Relateert een persoon aan een manifestatie die een aggregaat is die een expressie van een muziekwerk verwezenlijkt dat is gecreëerd door een persoon. @nl
definition: Relaterer en person til en manifestasjon som er et aggregat som realiserer et musikalsk verk skapt av en person. @no
definition: Relaterer en person til en manifestation, som er en samling, som rummer et udtryk af et musikværk, som er skabt af en person. @da
definition: Relates a person to a manifestation that is an aggregate that embodies an expression of a musical work that is created by a person. @en
definition: Sasaista personu ar manifestāciju, kas ir apkopojums, kas ietver personas radītu mūzikas darbu. @lv
definition: Seostab isiku kehastusega, mis on liitum, milles on teostatud isiku loodud muusikateose väljendus. @et
definition: Setzt eine Person in Beziehung zu einem Aggregat (Manifestation), das eine Expression eines Musikwerks verkörpert, die eine Person erstellt hat. @de
definition: يربط شخصا بتجسيدة عبارة عن تجميعة تجسد عمل موسيقي أنشأه شخص. @ar
definition: 将一个个人与作为一种合集、把一个个人所创作的一种音乐作品的内容表达具体化的一种载体表现关联起来。 @zh-hans

puheeseen osallinen henkilö manifestaatiossa
has element type: 2
toolkit definition: A manifestation that is an aggregate that embodies an expression of a vocal work that is created by a person. @en
toolkit definition: Bir kişi tarafından oluşturulan bir vokal eserin anlatımını somutlaştıran topluluk olan bir gösterim. @tr
toolkit definition: Een manifestatie die een aggregaat is die een expressie van een vocaal werk verwezenlijkt dat is gecreëerd door een persoon. @nl
toolkit definition: Egy aggregátum megjelenési forma, amely egy személy által létrehozott beszédmű kifejezési formáját testesíti meg. @hu
toolkit definition: Ein Aggregat (Manifestation), das eine Expression eines gesprochenen Werks verkörpert, die eine Person erstellt hat. @de
toolkit definition: En manifestasjon som er et aggregat som realiserer et verk av tale skapt av en person. @no
toolkit definition: Kehastus, mis on liitum, milles on teostatud isiku loodud suulise teose väljendus. @et
toolkit definition: Manifestaatio, joka on aggregaatti, joka sisältää puheteoksen ekspression, jonka henkilö on luonut.
toolkit definition: Manifestació que és un agregat que materialitza una expressió d’una obra vocal que és creada per una persona. @ca
toolkit definition: Manifestation qui consiste en un agrégat matérialisant une expression d’une œuvre vocale créée par une personne. @fr
toolkit definition: Manifestation, som er en samling, som rummer et udtryk af et værk med talte ord, som er skabt af en person. @da
toolkit definition: Manifestazione che è un aggregato che materializza un'opera orale creata da una persona. @it
toolkit definition: Manifestācija, kas ir apkopojums, kas ietver personas radītu mutvārdu darbu. @lv
toolkit definition: تجسيدة تمثل تجميعة تجسد عمل كلمة منطوقة أنشأه شخص. @ar
toolkit definition: 作为一种合集、把一个个人所创作的一种人声作品的内容表达具体化的一种载体表现 @zh-hans
toolkit label: Person als Beiträgerin/Beiträger von einer Rede von @de
toolkit label: bidragsyter til tale for (person) @no
toolkit label: bijdrager-persoon van spraak van @nl
toolkit label: contributor person of speech of @en
toolkit label: contributore persona di discorso di @it
toolkit label: ir runas līdzradītājs (persona) @lv
toolkit label: konuşmaya katkıda bulunan kişi @tr
toolkit label: kõneloome kaastööline (isik) kehastuses @et
toolkit label: közreműködő személye a következő beszédnek: @hu
toolkit label: person, som er bidragsyder til tale af @da
toolkit label: persona contribuïdora de discurs de @ca
toolkit label: personne contributrice de contenu vocal de @fr
toolkit label: puheeseen osallinen henkilö manifestaatiossa
toolkit label: συντελεστής φυσικό πρόσωπο της ομιλίας του @el
toolkit label: شخص مساهم في حديث @ar
toolkit label: ……的讲话的贡献者个人 @zh-hans
has subproperty: P50515
lexical alias: contributorPersonOfSpeechOf.en
status: Published
type: Property
domain: C10004
label: er bidragsyter til tale for (person) @no
label: er person, som er bidragsyder til tale af @da
label: est une personne contributrice de contenu vocal de @fr
label: ir runas līdzradītājs (persona) @lv
label: is bijdrager-persoon van spraak van @nl
label: is contributor person of speech of @en
label: ist Person als Beiträgerin/Beiträger von einer Rede von @de
label: konuşmasının katkıda bulunan kişisidir @tr
label: kõneloome kaastööline (isik) kehastuses @et
label: közreműködő személye a következő beszédnek: @hu
label: è contributore persona di discorso di @it
label: és persona contribuïdora de discurs de @ca
label: είναι συντελεστής φυσικό πρόσωπο της ομιλίας του @el
label: هو شخص مساهم في حديث لـ @ar
label: 是……的讲话的贡献者个人 @zh-hans
sub property of: puheeseen osallinen toimija manifestaatiossa
sub property of: aggregaattiin osallinen henkilö manifestaatiossa
definition: Bir kişiyi, bir kişi tarafından yaratılan bir ses çalışmasının anlatımını somutlaştıran bir bütün olan gösterimle ilişkilendirir. @tr
definition: Correla una persona a una manifestazione che è un aggregato che materializza un'opera orale creata da una persona. @it
definition: Hozzákapcsol egy személyt egy aggregátum megjelenési formához, amely egy személy által létrehozott beszédmű kifejezési formáját testesíti meg. @hu
definition: Liittää henkilön manifestaatioon, joka on aggregaatti, joka sisältää puheteoksen ekspression, jonka henkilö on luonut.
definition: Met une personne en relation avec une manifestation qui consiste en un agrégat matérialisant une expression d’une œuvre vocale créée par une personne. @fr
definition: Relaciona una persona amb una manifestació que és un agregat que materialitza una expressió d’una obra vocal que és creada per una persona. @ca
definition: Relateert een persoon aan een manifestatie die een aggregaat is die een expressie van een vocaal werk verwezenlijkt dat is gecreëerd door een persoon. @nl
definition: Relaterer en person til en manifestasjon som er et aggregat som realiserer et verk av tale skapt av en person. @no
definition: Relaterer en person til en manifestation, som er en samling, som rummer et udtryk af et værk med talte ord, som er skabt af en person. @da
definition: Relates a person to a manifestation that is an aggregate that embodies an expression of a vocal work that is created by a person. @en
definition: Sasaista personu ar manifestāciju, kas ir apkopojums, kas ietver personas radītu mutvārdu darbu. @lv
definition: Seostab isiku kehastusega, mis on liitum, milles on teostatud isiku loodud suulise teose väljendus. @et
definition: Setzt eine Person in Beziehung zu einem Aggregat (Manifestation), das eine Expression eines gesprochenen Werks verkörpert, die eine Person erstellt hat. @de
definition: يربط شخصا بتجسيدة عبارة عن تجميعة تجسد عمل كلمة منطوقة أنشأه شخص. @ar
definition: 将一个个人与作为一种合集、把一个个人所创作的一种人声作品的内容表达具体化的一种载体表现关联起来。 @zh-hans

stillkuvaan osallinen henkilö manifestaatiossa
has element type: 2
toolkit definition: A manifestation that is an aggregate that embodies an expression of a still image work that is created by a person. @en
toolkit definition: Bir kişi tarafından oluşturulan hareketsiz bir görüntü eserinin anlatımını somutlaştıran topluluk olan bir gösterim. @tr
toolkit definition: Een manifestatie die een aggregaat is die een expressie van een stilstaand beeldwerk verwezenlijkt dat is gecreëerd door een persoon. @nl
toolkit definition: Egy aggregátum megjelenési forma, amely egy személy által létrehozott állóképmű kifejezési formáját testesíti meg. @hu
toolkit definition: Ein Aggregat (Manifestation), das eine Expression eines unbewegten Bildwerks verkörpert, die eine Person erstellt hat. @de
toolkit definition: En manifestasjon som er et aggregat som realiserer et bildeverk skapt av en person. @no
toolkit definition: Kehastus, mis on liitum, milles on teostatud isiku loodud liikumatust pildist koosneva teose väljendus. @et
toolkit definition: Manifestaatio, joka on aggregaatti, joka sisältää stillkuvateoksen ekspression, jonka henkilö on luonut.
toolkit definition: Manifestació que és un agregat que materialitza una expressió d’una obra d’imatge fixa que és creada per una persona. @ca
toolkit definition: Manifestation qui consiste en un agrégat matérialisant une expression d’une œuvre d’image fixe créée par une personne. @fr
toolkit definition: Manifestation, som er en samling, som rummer et udtryk af et værk med stillbilleder, som er skabt af en person. @da
toolkit definition: Manifestazione che è un aggregato che materializza un'immagine fissa creata da una persona. @it
toolkit definition: Manifestācija, kas ir apkopojums, kas ietver personas radītu attēla darbu. @lv
toolkit definition: تجسيدة تمثل تجميعة تجسد عملا اصور ثابتة أنشأه شخص. @ar
toolkit definition: 作为一种合集、把一个个人所创作的一种静态图像作品的内容表达具体化的一种载体表现 @zh-hans
toolkit label: Person als Illustratorin/Illustrator von @de
toolkit label: bidragsyter til bilde for (person) @no
toolkit label: bijdrager-persoon van stilstaand beeld van @nl
toolkit label: contributor person of still image of @en
toolkit label: contributore persona di immagine fissa di @it
toolkit label: hareketsiz görüntüye katkıda bulunan kişi @tr
toolkit label: ir attēla līdzradītājs (persona) @lv
toolkit label: kaastööline liikumatu pildi alal (isik) kehastuses @et
toolkit label: közreműködő személye a következő állóképnek: @hu
toolkit label: person, som er bidragsyder til stillbillede af @da
toolkit label: persona contribuïdora d’imatge fixa de @ca
toolkit label: personne contributrice d’image fixe de @fr
toolkit label: stillkuvaan osallinen henkilö manifestaatiossa
toolkit label: συντελεστής φυσικό πρόσωπο της σταθερής εικόνας του @el
toolkit label: شخص مساهم في صور ثابتة @ar
toolkit label: ……的静态图像的贡献者个人 @zh-hans
has subproperty: P50516
lexical alias: contributorPersonOfStillImageOf.en
status: Published
type: Property
domain: C10004
label: durağan görüntüsünün katkıda bulunan kişisidir @tr
label: er bidragsyter til bilde for (person) @no
label: er person, som er bidragsyder til stillbillede af @da
label: est une personne contributrice d’image fixe de @fr
label: ir attēla līdzradītājs (persona) @lv
label: is bijdrager-persoon van stilstaand beeld van @nl
label: is contributor person of still image of @en
label: ist Person als Illustratorin/Illustrator von @de
label: kaastööline liikumatu pildi alal (isik) kehastuses @et
label: közreműködő személye a következő állóképnek: @hu
label: è contributore persona di immagine fissa di @it
label: és persona contribuïdora d’imatge fixa de @ca
label: είναι συντελεστής φυσικό πρόσωπο της σταθερής εικόνας του @el
label: هو شخص مساهم في صور ثابتة لـ @ar
label: 是……的静态图像的贡献者个人 @zh-hans
sub property of: stillkuvaan osallinen toimija manifestaatiossa
sub property of: aggregaattiin osallinen henkilö manifestaatiossa
definition: Bir kişiyi, bir kişi tarafından yaratılan bir hareketsiz görüntü çalışmasının anlatımını somutlaştıran bir bütün olan gösterimle ilişkilendirir. @tr
definition: Correla una persona a una manifestazione che è un aggregato che materializza un'immagine fissa creata da una persona. @it
definition: Hozzákapcsol egy személyt egy aggregátum megjelenési formához, amely egy személy által létrehozott állóképmű kifejezési formáját testesíti meg. @hu
definition: Liittää henkilön manifestaatioon, joka on aggregaatti, joka sisältää stillkuvateoksen ekspression, jonka henkilö on luonut.
definition: Met une personne en relation avec une manifestation qui consiste en un agrégat matérialisant une expression d’une œuvre d’image fixe créée par une personne. @fr
definition: Relaciona una persona amb una manifestació que és un agregat que materialitza una expressió d’una obra d’imatge fixa que és creada per una persona. @ca
definition: Relateert een persoon aan een manifestatie die een aggregaat is die een expressie van een stilstaand beeldwerk verwezenlijkt dat is gecreëerd door een persoon. @nl
definition: Relaterer en person til en manifestasjon som er et aggregat som realiserer et bildeverk skapt av en person. @no
definition: Relaterer en person til en manifestation, som er en samling, som rummer et udtryk af et værk med stillbilleder, som er skabt af en person. @da
definition: Relates a person to a manifestation that is an aggregate that embodies an expression of a still image work that is created by a person. @en
definition: Sasaista personu ar manifestāciju, kas ir apkopojums, kas ietver personas radītu attēla darbu. @lv
definition: Seostab isiku kehastusega, mis on liitum, milles on teostatud isiku loodud liikumatust pildist koosneva teose väljendus. @et
definition: Setzt eine Person in Beziehung zu einem Aggregat (Manifestation), das eine Expression eines unbewegten Bildwerks verkörpert, die eine Person erstellt hat. @de
definition: يربط شخصا بتجسيدة عبارة عن تجميعة تجسد عملا بصور ثابتة أنشأه شخص. @ar
definition: 将一个个人与作为一种合集、把一个个人所创作的一种静态图像作品的内容表达具体化的一种载体表现关联起来。 @zh-hans

tekstiin osallinen henkilö manifestaatiossa
has element type: 2
toolkit definition: A manifestation that is an aggregate that embodies an expression of a textual work that is created by a person. @en
toolkit definition: Bir kişi tarafından oluşturulan metinsel bir eserin anlatımını somutlaştıran topluluk olan bir gösterim. @tr
toolkit definition: Een manifestatie die een aggregaat is die een expressie van een tekstwerk verwezenlijkt dat is gecreëerd door een persoon. @nl
toolkit definition: Egy aggregátum megjelenési forma, amely egy személy által létrehozott szöveges mű kifejezési formáját testesíti meg. @hu
toolkit definition: Ein Aggregat (Manifestation), das eine Expression eines textlichen Werks verkörpert, die eine Person erstellt hat. @de
toolkit definition: En manifestasjon som er et aggregat som realiserer et tekstlig verk skapt av en person. @no
toolkit definition: Kehastus, mis on liitum, milles on teostatud isiku loodud tekstteose väljendus. @et
toolkit definition: Manifestaatio, joka on aggregaatti, joka sisältää tekstiteoksen ekspression, jonka henkilö on luonut.
toolkit definition: Manifestació que és un agregat que materialitza una expressió d’una obra textual que és creada per una persona. @ca
toolkit definition: Manifestation qui consiste en un agrégat matérialisant une expression d’une œuvre textuelle créée par une personne. @fr
toolkit definition: Manifestation, som er en samling, som rummer et udtryk af et tekstværk, som er skabt af en person. @da
toolkit definition: Manifestazione che è un aggregato che materializza un'opera testuale creata da una persona. @it
toolkit definition: Manifestācija, kas ir apkopojums, kas ietver personas radītu teksta darbu. @lv
toolkit definition: تجسيدة تمثل تجميعة تجسد عمل نصيا أنشأه شخص. @ar
toolkit definition: 作为一种合集、把一个个人所创作的一种文字作品的内容表达具体化的一种载体表现 @zh-hans
toolkit label: Person als Beiträgerin/Beiträger von ergänzendem Text von @de
toolkit label: bidragsyter til tekst for (person) @no
toolkit label: bijdrager-persoon van tekst van @nl
toolkit label: contributor person of text of @en
toolkit label: contributore persona di testo di @it
toolkit label: ir teksta līdzradītājs (persona) @lv
toolkit label: közreműködő személye a következő szövegnek: @hu
toolkit label: metne katkıda bulunan kişi @tr
toolkit label: person, som er bidragsyder til tekst af @da
toolkit label: persona contribuïdora de text de @ca
toolkit label: personne contributrice de texte de @fr
toolkit label: tekstiin osallinen henkilö manifestaatiossa
toolkit label: tekstiloome kaastööline (isik) kehastuses @et
toolkit label: συντελεστής φυσικό πρόσωπο του κειμένου του @el
toolkit label: شخص مساهم في نص @ar
toolkit label: ……的文本的贡献者个人 @zh-hans
has subproperty: P50517
lexical alias: contributorPersonOfTextOf.en
status: Published
type: Property
domain: C10004
label: er bidragsyter til tekst for (person) @no
label: er person, som er bidragsyder til tekst af @da
label: est une personne contributrice de texte de @fr
label: ir teksta līdzradītājs (persona) @lv
label: is bijdrager-persoon van tekst van @nl
label: is contributor person of text of @en
label: ist Person als Beiträgerin/Beiträger von ergänzendem Text von @de
label: közreműködő személye a következő szövegnek: @hu
label: metninin katkıda bulunan kişisidir @tr
label: tekstiloome kaastööline (isik) kehastuses @et
label: è contributore persona di testo di @it
label: és persona contribuïdora de text de @ca
label: είναι συντελεστής φυσικό πρόσωπο του κειμένου του @el
label: هو شخص مساهم في نص لـ @ar
label: 是……的文本的贡献者个人 @zh-hans
sub property of: tekstiin osallinen toimija manifestaatiossa
sub property of: aggregaattiin osallinen henkilö manifestaatiossa
definition: Bir kişiyi, bir kişi tarafından yaratılan bir metinsel çalışmanın anlatımını somutlaştıran bir bütün olan gösterimle ilişkilendirir. @tr
definition: Correla una persona a una manifestazione che è un aggregato che materializza un'opera testuale creata da una persona. @it
definition: Hozzákapcsol egy személyt egy aggregátum megjelenési formához, amely egy személy által létrehozott szöveges mű kifejezési formáját testesíti meg. @hu
definition: Liittää henkilön manifestaatioon, joka on aggregaatti, joka sisältää tekstiteoksen ekspression, jonka henkilö on luonut.
definition: Met une personne en relation avec une manifestation qui consiste en un agrégat matérialisant une expression d’une œuvre textuelle créée par une personne. @fr
definition: Relaciona una persona amb una manifestació que és un agregat que materialitza una expressió d’una obra textual que és creada per una persona. @ca
definition: Relateert een persoon aan een manifestatie die een aggregaat is die een expressie van een tekstwerk verwezenlijkt dat is gecreëerd door een persoon. @nl
definition: Relaterer en person til en manifestasjon som er et aggregat som realiserer et tekstlig verk skapt av en person. @no
definition: Relaterer en person til en manifestation, som er en samling, som rummer et udtryk af et tekstværk, som er skabt af en person. @da
definition: Relates a person to a manifestation that is an aggregate that embodies an expression of a textual work that is created by a person. @en
definition: Sasaista personu ar manifestāciju, kas ir apkopojums, kas ietver personas radītu teksta darbu. @lv
definition: Seostab isiku kehastusega, mis on liitum, milles on teostatud isiku loodud tekstteose väljendus. @et
definition: Setzt eine Person in Beziehung zu einem Aggregat (Manifestation), das eine Expression eines textlichen Werks verkörpert, die eine Person erstellt hat. @de
definition: يربط شخصا بتجسيدة عبارة عن تجميعة تجسد عمل نصيا أنشأه شخص. @ar
definition: 将一个个人与作为一种合集、把一个个人所创作的一种文字作品的内容表达具体化的一种载体表现关联起来。 @zh-hans

esineeseen osallinen henkilö manifestaatiossa
has element type: 2
toolkit definition: A manifestation that is an aggregate that embodies an expression of an object work that is created by a person. @en
toolkit definition: Bir kişi tarafından oluşturulan bir nesne eserinin anlatımını somutlaştıran topluluk olan bir gösterim. @tr
toolkit definition: Een manifestatie die een aggregaat is die een expressie van een objectwerk verwezenlijkt dat is gecreëerd door een persoon. @nl
toolkit definition: Egy aggregátum megjelenési forma, amely egy személy által létrehozott objektummű kifejezési formáját testesíti meg. @hu
toolkit definition: Ein Aggregat (Manifestation), das eine Expression eines gegenständlichen Werks verkörpert, die eine Person erstellt hat. @de
toolkit definition: En manifestasjon som er et aggregat som realiserer et verk som er en gjenstand skapt av en person. @no
toolkit definition: Kehastus, mis on liitum, milles on teostatud isiku loodud objektteose väljendus. @et
toolkit definition: Manifestaatio, joka on aggregaatti, joka sisältää esineteoksen ekspression, jonka henkilö on luonut.
toolkit definition: Manifestació que és un agregat que materialitza una expressió d’una obra d’objecte que és creada per una persona. @ca
toolkit definition: Manifestation qui consiste en un agrégat matérialisant une expression d’une œuvre objet créée par une personne. @fr
toolkit definition: Manifestation, som er en samling, som rummer et udtryk af et værk med objekt, som er skabt af en person. @da
toolkit definition: Manifestazione che è un aggregato che materializza un oggetto creato da una persona. @it
toolkit definition: Manifestācija, kas ir apkopojums, kas ietver personas radītu objekta darbu. @lv
toolkit definition: تجسيدة تمثل تجميعة تجسد عمل كيان أنشأه شخص. @ar
toolkit definition: 作为一种合集、把一个个人所创作的一种物体作品的内容表达具体化的一种载体表现 @zh-hans
toolkit label: Person als Beiträgerin/Beiträger von einem Gegenstand von @de
toolkit label: bidragsyter til gjenstand for (person) @no
toolkit label: bijdrager-persoon van object van @nl
toolkit label: contributor person of object of @en
toolkit label: contributore persona di oggetto di @it
toolkit label: esineeseen osallinen henkilö manifestaatiossa
toolkit label: ir objekta līdzradītājs (persona) @lv
toolkit label: közreműködő személye a következő objektumnak: @hu
toolkit label: nesneye katkıda bulunan kişi @tr
toolkit label: objektiloome kaastööline (isik) kehastuses @et
toolkit label: person, som er bidragsyder til objekt af @da
toolkit label: persona contribuïdora d’objecte de @ca
toolkit label: personne contributrice d’objet de @fr
toolkit label: συντελεστής φυσικό πρόσωπο του αντικειμένου του @el
toolkit label: شخص مساهم في كيان @ar
toolkit label: ……的物体的贡献者个人 @zh-hans
has subproperty: P50518
lexical alias: contributorPersonOfObjectOf.en
status: Published
type: Property
domain: C10004
label: er bidragsyter til gjenstand for (person) @no
label: er person, som er bidragsyder til objekt af @da
label: est une personne contributrice d’objet de @fr
label: ir objekta līdzradītājs (persona) @lv
label: is bijdrager-persoon van object van @nl
label: is contributor person of object of @en
label: ist Person als Beiträgerin/Beiträger von einem Gegenstand von @de
label: közreműködő személye a következő objektumnak: @hu
label: nesnesinin katkıda bulunan kişisidir @tr
label: objektiloome kaastööline (isik) kehastuses @et
label: è contributore persona di oggetto di @it
label: és persona contribuïdora d’objecte de @ca
label: είναι συντελεστής φυσικό πρόσωπο του αντικειμένου του @el
label: هو شخص مساهم في كيان لـ @ar
label: 是……的物体的贡献者个人 @zh-hans
sub property of: esineeseen osallinen toimija manifestaatiossa
sub property of: aggregaattiin osallinen henkilö manifestaatiossa
definition: Bir kişiyi, kişi tarafından yaratılan bir nesne çalışmasının anlatımını somutlaştıran bir bütün olan gösterimle ilişkilendirir. @tr
definition: Correla una persona a una manifestazione che è un aggregato che materializza un oggetto creato da una persona. @it
definition: Hozzákapcsol egy személyt egy aggregátum megjelenési formához, amely egy személy által létrehozott objektummű kifejezési formáját testesíti meg. @hu
definition: Liittää henkilön manifestaatioon, joka on aggregaatti, joka sisältää esineteoksen ekspression, jonka henkilö on luonut.
definition: Met une personne en relation avec une manifestation qui consiste en un agrégat matérialisant une expression d’une œuvre objet créée par une personne. @fr
definition: Relaciona una persona amb una manifestació que és un agregat que materialitza una expressió d’una obra d’objecte que és creada per una persona. @ca
definition: Relateert een persoon aan een manifestatie die een aggregaat is die een expressie van een objectwerk verwezenlijkt dat is gecreëerd door een persoon. @nl
definition: Relaterer en person til en manifestasjon som er et aggregat som realiserer et verk som er en gjenstand skapt av en person. @no
definition: Relaterer en person til en manifestation, som er en samling, som rummer et udtryk af et værk med objekt, som er skabt af en person. @da
definition: Relates a person to a manifestation that is an aggregate that embodies an expression of an object work that is created by a person. @en
definition: Sasaista personu ar manifestāciju, kas ir apkopojums, kas ietver personas radītu objekta darbu. @lv
definition: Seostab isiku kehastusega, mis on liitum, milles on teostatud isiku loodud objektteose väljendus. @et
definition: Setzt eine Person in Beziehung zu einem Aggregat (Manifestation), das eine Expression eines gegenständlichen Werks verkörpert, die eine Person erstellt hat. @de
definition: يربط شخصا بتجسيدة عبارة عن تجميعة تجسد تعبيرة لعمل كيان أنشأه شخص. @ar
definition: 将一个个人与作为一种合集、把一个个人所创作的一种物体作品的内容表达具体化的一种载体表现关联起来。 @zh-hans

digitaaliseen sisältöön osallinen henkilö manifestaatiossa
has element type: 2
toolkit definition: A manifestation that is an aggregate that embodies an expression of computer content created by a person. @en
toolkit definition: Bir kişi tarafından oluşturulan bir bilgisayar destekli içeriğin anlatımını somutlaştıran topluluk olan bir gösterim. @tr
toolkit definition: Een manifestatie die een aggregaat is die een expressie van computercontent verwezenlijkt die is gecreëerd door een persoon. @nl
toolkit definition: Egy aggregátum megjelenési forma, amely egy személy által létrehozott számítógépes tartalom kifejezési formáját testesíti meg. @hu
toolkit definition: Ein Aggregat (Manifestation), das eine Expression von Computer Content verkörpert, die eine Person erstellt hat. @de
toolkit definition: En manifestasjon som er et aggregat som realiserer datamaskininnhold skapt av en person. @no
toolkit definition: Kehastus, mis on liitum, milles on teostatud isiku loodud digisisu väljendus. @et
toolkit definition: Manifestaatio, joka on aggregaatti, joka sisältää digitaalisen sisällön ekspression, jonka henkilö on luonut.
toolkit definition: Manifestació que és un agregat que materialitza una expressió d’una obra de contingut informàtic que és creada per una persona. @ca
toolkit definition: Manifestation qui consiste en un agrégat matérialisant une expression d’un contenu informatique créé par une personne. @fr
toolkit definition: Manifestation, som er en samling, som rummer et udtryk af computerindhold skabt af en person. @da
toolkit definition: Manifestazione che è un aggregato che materializza contenuto informatico creato da una persona. @it
toolkit definition: Manifestācija, kas ir apkopojums, kas ietver personas radītu datororientētu saturu. @lv
toolkit definition: تجسيدة تمثل تجميعة تجسد عملا محتوى حاسوبي أنشأه شخص. @ar
toolkit definition: 作为一种合集、把一个个人所创作的计算机内容的内容表达具体化的一种载体表现 @zh-hans
toolkit label: Person als Beiträgerin/Beiträger von Computer Content von @de
toolkit label: bidragsyter til datamaskininnhold for (person) @no
toolkit label: bijdrager-persoon van computercontent van @nl
toolkit label: bilgisayar içeriğine katkıda bulunan kişi @tr
toolkit label: contributor person of computer content of @en
toolkit label: contributore persona di contenuto informatico di @it
toolkit label: digisisu kaastööline (isik) kehastuses @et
toolkit label: digitaaliseen sisältöön osallinen henkilö manifestaatiossa
toolkit label: ir datororientēta satura līdzradītājs (persona) @lv
toolkit label: közreműködő személye a következő számítógépes tartalomnak: @hu
toolkit label: person, som er bidragsyder til computerindhold af @da
toolkit label: persona contribuïdora de contingut informàtic de @ca
toolkit label: personne contributrice de contenu informatique de @fr
toolkit label: συντελεστής φυσικό πρόσωπο του περιεχομένου του υπολογιστή του @el
toolkit label: شخص مساهم في محتوى حاسوبي @ar
toolkit label: ……的计算机内容的贡献者个人 @zh-hans
has subproperty: P50519
lexical alias: contributorPersonOfComputerContentOf.en
status: Published
type: Property
domain: C10004
label: bilgisayar içeriğinin katkıda bulunan kişisidir @tr
label: digisisu kaastööline (isik) kehastuses @et
label: er bidragsyter til datamaskininnhold for (person) @no
label: er person, som er bidragsyder til computerindhold af @da
label: est une personne contributrice de contenu informatique de @fr
label: ir datororientēta satura līdzradītājs (persona) @lv
label: is bijdrager-persoon van computercontent van @nl
label: is contributor person of computer content of @en
label: ist Person als Beiträgerin/Beiträger von Computer Content von @de
label: közreműködő személye a következő számítógépes tartalomnak: @hu
label: è contributore persona di contenuto informatico di @it
label: és persona contribuïdora de contingut informàtic de @ca
label: είναι συντελεστής φυσικό πρόσωπο του περιεχομένου του υπολογιστή του @el
label: هو شخص مساهم في محتوى حاسوبي لـ @ar
label: 是……的计算机内容的贡献者个人 @zh-hans
sub property of: digitaaliseen sisältöön osallinen toimija manifestaatiossa
sub property of: aggregaattiin osallinen henkilö manifestaatiossa
definition: Bir kişiyi, kişi tarafından yaratılan bir bilgisayar içeriğinin anlatımını somutlaştıran bir bütün olan gösterimle ilişkilendirir. @tr
definition: Correla una persona a una manifestazione che è un aggregato che materializza contenuto informatico creato da una persona. @it
definition: Hozzákapcsol egy személyt egy aggregátum megjelenési formához, amely egy személy által létrehozott számítógépes tartalom kifejezési formáját testesíti meg. @hu
definition: Liittää henkilön manifestaatioon, joka on aggregaatti, joka sisältää digitaalisen sisällön ekspression, jonka henkilö on luonut.
definition: Met une personne en relation avec une manifestation qui consiste en un agrégat matérialisant une expression d’un contenu informatique créé par une personne. @fr
definition: Relaciona una persona amb una manifestació que és un agregat que materialitza una expressió d’una obra de contingut informàtic que és creada per una persona. @ca
definition: Relateert een persoon aan een manifestatie die een aggregaat is die een expressie van computercontent verwezenlijkt die is gecreëerd door een persoon. @nl
definition: Relaterer en person til en manifestasjon som er et aggregat som realiserer datamaskininnhold skapt av en person. @no
definition: Relaterer en person til en manifestation, som er en samling, som rummer et udtryk af computerindhold skabt af en person. @da
definition: Relates a person to a manifestation that is an aggregate that embodies an expression of computer content created by a person. @en
definition: Sasaista personu ar manifestāciju, kas ir apkopojums, kas ietver personas radītu datororientētu saturu. @lv
definition: Seostab isiku kehastusega, mis on liitum, milles on teostatud isiku loodud digisisu väljendus. @et
definition: Setzt eine Person in Beziehung zu einem Aggregat (Manifestation), das eine Expression von Computer Content verkörpert, die eine Person erstellt hat. @de
definition: يربط شخصا بتجسيدة عبارة عن تجميعة تجسد عمل محتوى حاسوبي أنشأه شخص. @ar
definition: 将一个个人与作为一种合集、把一个个人所创作的计算机内容的内容表达具体化的一种载体表现关联起来。 @zh-hans

maanmittari (henkilö) manifestaatiossa
has element type: 2
toolkit definition: A manifestation that is an aggregate that includes a contribution by a person of providing measurements or dimensional relationships for a geographic area. @en
toolkit definition: Bir coğrafi alan için ölçümler veya boyutsal ilişkiler sağlayan bir kişinin katkısını içeren topluluk olan bir gösterim. @tr
toolkit definition: Een manifestatie die een aggregaat is die omvat een bijdrage door een persoon die levert maten of dimensionale verhoudingen voor een geografisch gebied. @nl
toolkit definition: Egy aggregátum megjelenési forma, amely magában foglalja egy személy közreműködését egy földrajzi terület mérésében vagy dimenziós összefüggéseinek szolgáltatásában. @hu
toolkit definition: Ein Aggregat (Manifestation), zu dem eine Person beiträgt, indem sie Messwerte oder Abmessungsverhältnisse für einen dargestellten geografischen Bereich zur Verfügung stellt. @de
toolkit definition: En manifestasjon som er et aggregat som inkluderer et bidrag fra en person i form av å tilføre målinger eller størrelsesforhold for et geografisk område. @no
toolkit definition: Kehastus, mis on liitum, millesse isik on andnud panuse, hankides geograafilise piirkonna mõõdud või mõõdusuhted. @et
toolkit definition: Manifestaatio, joka on aggregaatti, jossa henkilö on osallisena kartantekijänä maantieteellisen alueen mittojen tai mittasuhteiden tuottamisessa.
toolkit definition: Manifestació que és un agregat que inclou una contribució d’una persona proporcionant mesuraments o relacions dimensionals d’una àrea geogràfica. @ca
toolkit definition: Manifestation qui consiste en un agrégat qui intègre une contribution par une personne consistant à fournir des mesures ou des relations dimensionnelles pour une aire géographique. @fr
toolkit definition: Manifestation, som er en samling, som omfatter en persons bidrag ved at angive målinger eller dimensionelle forhold for et geografisk område. @da
toolkit definition: Manifestazione che è un aggregato che comprende un contributo di una persona nel fornire misurazioni o rapporti dimensionali per un'area geografica. @it
toolkit definition: Manifestācija, kas ir apkopojums, kas ietver personas ieguldījumu, nodrošinot ģeogrāfisko apgabalu mērījumus vai dimensiju attiecības. @lv
toolkit definition: تجسيدة تمثل تجميعة تتضمن إسهام شخص في قياس الأبعاد أو العلاقات المكانية لمنطقة جغرافية. @ar
toolkit definition: 作为一种合集、包括为一个地理区域提供测量或尺寸关系的一个个人的贡献的一种载体表现 @zh-hans
toolkit label: Personal als Landvermesserin/Landvermesser von @de
toolkit label: agrimensore persona di @it
toolkit label: földmérő személye: @hu
toolkit label: ir topogrāfs (persona) @lv
toolkit label: kartograf @tr
toolkit label: landmeter-persoon van @nl
toolkit label: landmåler for (person) @no
toolkit label: maamõõtja (isik) kehastuses @et
toolkit label: maanmittari (henkilö) manifestaatiossa
toolkit label: person, som er landinspektør af @da
toolkit label: persona agrimensora de @ca
toolkit label: personne arpenteuse de @fr
toolkit label: surveyor person of @en
toolkit label: τοπογράφος μηχανικός φυσικό πρόσωπο του @el
toolkit label: شخص مسّاح @ar
toolkit label: ……的测绘者个人 @zh-hans
has subproperty: P50520
lexical alias: surveyorPersonOf.en
status: Published
type: Property
domain: C10004
label: er landmåler for (person) @no
label: er person, som er landinspektør af @da
label: est une personne arpenteuse de @fr
label: földmérő személye a következőnek: @hu
label: ir topogrāfs (persona) @lv
label: is landmeter-persoon van @nl
label: is surveyor person of @en
label: ist Person als Landvermesserin/Landvermesser von @de
label: maamõõtja (isik) kehastuses @et
label: topoğraf kişisidir @tr
label: è agrimensore persona di @it
label: és persona agrimensora de @ca
label: είναι τοπογράφος μηχανικός φυσικό πρόσωπο του @el
label: هو شخص مسّاح لـ @ar
label: 是……的测绘者个人 @zh-hans
sub property of: maanmittari (toimija) manifestaatiossa
sub property of: kartografiaan osallinen henkilö manifestaatiossa
definition: Bir kişiyi, bir kişinin coğrafi alan ölçümlerine veya boyutsal ilişkilerini sağladığı katkıyı içeren bir bütün olan bir gösterimle ilişkilendirir. @tr
definition: Correla una persona a una manifestazione che è un aggregato che comprende un contributo di una persona nel fornire misurazioni o rapporti dimensionali per un'area geografica. @it
definition: Hozzákapcsol egy személyt egy aggregátum megjelenési formához, amely magában foglalja egy személy közreműködését egy földrajzi terület mérésében vagy dimenziós összefüggéseinek szolgáltatásában. @hu
definition: Liittää henkilön manifestaatioon, joka on aggregaatti, jossa henkilö on osallisena kartantekijänä maantieteellisen alueen mittojen tai mittasuhteiden tuottamisessa.
definition: Met une personne en relation avec une manifestation qui consiste en un agrégat qui intègre une contribution par une personne consistant à fournir des mesures ou des relations dimensionnelles pour une aire géographique. @fr
definition: Relaciona una persona amb una manifestació que és un agregat que inclou una contribució d’una persona proporcionant mesuraments o relacions dimensionals d’una àrea geogràfica. @ca
definition: Relateert een persoon aan een manifestatie die een aggregaat is die omvat een bijdrage door een persoon die levert maten of dimensionale verhoudingen voor een geografisch gebied. @nl
definition: Relaterer en person til en manifestasjon som er et aggregat som inkluderer et bidrag fra en person i form av å tilføre målinger eller størrelsesforhold for et geografisk område. @no
definition: Relaterer en person til en manifestation, som er en samling, som omfatter en persons bidrag ved at angive målinger eller dimensionelle forhold for et geografisk område. @da
definition: Relates a person to a manifestation that is an aggregate that includes a contribution by a person of providing measurements or dimensional relationships for a geographic area. @en
definition: Sasaista personu ar manifestāciju, kas ir apkopojums, kas ietver personas ieguldījumu, nodrošinot ģeogrāfisko apgabalu mērījumus vai dimensiju attiecības. @lv
definition: Seostab isiku kehastusega, mis on liitum, millesse isik on andnud panuse, hankides geograafilise piirkonna mõõdud või mõõdusuhted. @et
definition: Setzt eine Person in Beziehung zu einem Aggregat (Manifestation), zu dem eine Person beiträgt, indem sie Messwerte oder Abmessungsverhältnisse für einen dargestellten geografischen Bereich zur Verfügung stellt. @de
definition: يربط شخصا بتجسيدة عبارة عن تجميعة تتضمن إسهام شخص في توفير قياس الأبعاد أو العلاقات المكانية لمنطقة جغرافية. @ar
definition: 将一个个人与作为一种合集、包括为一个地理区域提供测量或尺寸关系的一个个人的贡献的一种载体表现关联起来。 @zh-hans

aggregaattiin osallinen henkilö manifestaatiossa
has element type: 2
toolkit definition: A manifestation that is an aggregate that embodies an expression of a work that is created by a person. @en
toolkit definition: Bir kişi tarafından oluşturulan bir eserin anlatımını somutlaştıran topluluk olan bir gösterim. @tr
toolkit definition: Een manifestatie die een aggregaat is die een expressie van een werk verwezenlijkt die is gecreëerd door een persoon. @nl
toolkit definition: Egy aggregátum megjelenési forma, amely egy személy által létrehozott mű kifejezési formáját testesíti meg. @hu
toolkit definition: Ein Aggregat (Manifestation), das eine Expression eines Werks verkörpert, die eine Person erstellt hat. @de
toolkit definition: En manifestasjon som er et aggregat som inkluderer et bidrag fra en person. @no
toolkit definition: Kehastus, mis on liitum, milles on teostatud isiku loodud teose väljendus. @et
toolkit definition: Manifestaatio, joka on aggregaatti, joka sisältää teoksen ekspression, jonka henkilö on luonut.
toolkit definition: Manifestació que és un agregat que materialitza una expressió d’una obra que és creada per una persona. @ca
toolkit definition: Manifestation qui consiste en un agrégat matérialisant une expression d’une œuvre créée par une personne. @fr
toolkit definition: Manifestation, som er en samling, som omfatter en persons bidrag, der rummer et udtryk af et værk, som er skabt af en person. @da
toolkit definition: Manifestazione che è un aggregato che comprende un contributo di una persona. @it
toolkit definition: Manifestācija, kas ir apkopojums, kas ietver personas ieguldījumu/līdzdalību. @lv
toolkit definition: تجسيدة تمثل تجميعة يتضمن إسهام شخص. @ar
toolkit definition: 作为一种合集、把一个个人所创作的一种作品的内容表达具体化的一种载体表现 @zh-hans
toolkit label: Person als Beiträgerin/Beiträger zu einem Aggregat von @de
toolkit label: aggregaattiin osallinen henkilö manifestaatiossa
toolkit label: bidragsyter til aggregat for (person) @no
toolkit label: bijdrager-persoon aan aggregaat van @nl
toolkit label: contributor person to aggregate of @en
toolkit label: contributore persona di aggregato di @it
toolkit label: ir apkopojuma līdzradītājs (persona) @lv
toolkit label: közreműködő személye a következő aggregátumnak: @hu
toolkit label: liitumi kaastööline (isik) kehastuses @et
toolkit label: person, som er bidragsyder til samling af @da
toolkit label: persona contribuïdora a un agregat de @ca
toolkit label: personne contributrice à un agrégat de @fr
toolkit label: topluluğa katkıda bulunan kişi @tr
toolkit label: συντελεστής φυσικό πρόσωπο της συνάθροισης του @el
toolkit label: شخص مساهم في تجميعة @ar
toolkit label: ……的合集的贡献者个人 @zh-hans
has subproperty: kartografiaan osallinen henkilö manifestaatiossa
has subproperty: koreografiaan osallinen henkilö manifestaatiossa
has subproperty: liikkuvaan kuvaan osallinen henkilö manifestaatiossa
has subproperty: musiikkiin osallinen henkilö manifestaatiossa
has subproperty: puheeseen osallinen henkilö manifestaatiossa
has subproperty: stillkuvaan osallinen henkilö manifestaatiossa
has subproperty: tekstiin osallinen henkilö manifestaatiossa
has subproperty: esineeseen osallinen henkilö manifestaatiossa
has subproperty: digitaaliseen sisältöön osallinen henkilö manifestaatiossa
has subproperty: P50521
lexical alias: contributorPersonToAggregateOf.en
status: Published
type: Property
domain: C10004
label: er bidragsyter til aggregat for (person) @no
label: er person, som er bidragsyder til samling af @da
label: est une personne contributrice à un agrégat de @fr
label: ir apkopojuma līdzradītājs (persona) @lv
label: is bijdrager-persoon aan aggregaat van @nl
label: is contributor person to aggregate of @en
label: ist Person als Beiträgerin/Beiträger zu einem Aggregat von @de
label: közreműködő személye a következő aggregátumnak: @hu
label: liitumi kaastööline (isik) kehastuses @et
label: toplanmasına katkıda bulunan kişidir @tr
label: è contributore persona di aggregato di @it
label: és persona contribuïdora a un agregat de @ca
label: είναι συντελεστής φυσικό πρόσωπο της συνάθροισης του @el
label: هو شخص مساهم في تجميعة لـ @ar
label: 是……的合集的贡献者个人 @zh-hans
sub property of: henkilöön liittyvä manifestaatio
sub property of: aggregaattiin osallinen toimija manifestaatiossa
definition: Bir kişiyi, bir kişi tarafından yaratılan bir eserin ifadesini somutlaştıran bir bütün olan bir gösterimle ilişkilendirir. @tr
definition: Correla una persona a una manifestazione che è un aggregato che comprende un contributo di una persona. @it
definition: Hozzákapcsol egy személyt egy aggregátum megjelenési formához, amely egy személy által létrehozott mű kifejezési formáját testesíti meg. @hu
definition: Liittää henkilön manifestaatioon, joka on aggregaatti, joka sisältää teoksen ekspression, jonka henkilö on luonut.
definition: Met une personne en relation avec une manifestation qui consiste en un agrégat matérialisant une expression d’une œuvre créée par une personne. @fr
definition: Relaciona una persona amb una manifestació que és un agregat que materialitza una expressió d’una obra que és creada per una persona. @ca
definition: Relateert een persoon aan een manifestatie die een aggregaat is die een expressie van een werk verwezenlijkt die is gecreëerd door een persoon. @nl
definition: Relaterer en person til en manifestasjon som er et aggregat som inkluderer et bidrag fra en person. @no
definition: Relaterer en person til en manifestation, som er en samling, der rummer et udtryk af et værk, som er skabt af en person. @da
definition: Relates a person to a manifestation that is an aggregate that embodies an expression of a work that is created by a person. @en
definition: Sasaista personu ar manifestāciju, kas ir apkopojums, kas ietver personas ieguldījumu/līdzdalību. @lv
definition: Seostab isiku kehastusega, mis on liitum, milles on teostatud isiku loodud teose väljendus. @et
definition: Setzt eine Person in Beziehung zu einem Aggregat (Manifestation), das eine Expression eines Werks verkörpert, die eine Person erstellt hat. @de
definition: يربط شخصا بتجسيدة عبارة عن تجميعة تجسد تعبيرة لعمل أنشاه شخص. @ar
definition: 将一个个人与作为一种合集、把一个个人所创作的一种作品的内容表达具体化的一种载体表现关联起来。 @zh-hans

teoksen säveltäjä (henkilö) musiikkiteoksessa
has element type: 2
toolkit definition: A work that involves a responsibility of a person for creating a musical work. @en
toolkit definition: Bir müzik eseri yaratmak için bir kişinin sorumluluğunu içeren bir eser. @tr
toolkit definition: Een werk dat is een muziekwerk dat met zich meebrengt een verantwoordelijkheid van een persoon voor muziek. @nl
toolkit definition: Egy zenemű, amelyhez hozzátartozik egy személy felelőssége a zenéért. @hu
toolkit definition: Ein Musikwerk, bei dem eine Person für die Musik verantwortlich ist. @de
toolkit definition: Et musikalsk verk som involverer et ansvar for en person i form av musikk. @no
toolkit definition: Muusikateos, mis sisaldab isiku vastutust muusika loomise eest. @et
toolkit definition: Mūzikas darbs, kas ietver personas atbildību par mūzikas radīšanu. @lv
toolkit definition: Obra que implica un responsabilitat d’una persona en la creació d’una obra musical. @ca
toolkit definition: Opera musicale che implica una responsabilità di una persona per la musica. @it
toolkit definition: Teos, joka on musiikkiteos, jonka luomisesta henkilö on vastuussa.
toolkit definition: Værk, som er et musikværk, som involverer en persons ansvar for musik. @da
toolkit definition: Œuvre qui comporte une responsabilité de la part d’une personne consistant à créer une œuvre musicale. @fr
toolkit definition: عمل عبارة عن عمل موسيقي يترتب عليه تحمل شخص المسئولية عن الموسيقى. @ar
toolkit definition: 涉及创作一种音乐作品的一个个人的责任的一种作品 @zh-hans
toolkit label: Person als Komponistin/Komponist eines Werks von @de
toolkit label: componist-persoon van werk van @nl
toolkit label: composer person of work of @en
toolkit label: compositore persona di opera di @it
toolkit label: eserin bestecisi @tr
toolkit label: ir komponists (persona) darbam @lv
toolkit label: komponist for verk for (person) @no
toolkit label: person, som er komponist af værk af @da
toolkit label: persona compositora d’una obra de @ca
toolkit label: personne compositrice d’une œuvre de @fr
toolkit label: teoksen säveltäjä (henkilö) musiikkiteoksessa
toolkit label: teose helilooja (isik) teoses @et
toolkit label: zeneszerző személye a következő műnek: @hu
toolkit label: συνθέτης φυσικό πρόσωπο του έργου του @el
toolkit label: شخص ملحن عمل @ar
toolkit label: ……的作品的作曲者个人 @zh-hans
has subproperty: P50522
lexical alias: composerPersonOfWorkOf.en
status: Published
type: Property
domain: C10004
label: er komponist for verk for (person) @no
label: er person, som er komponist af værk af @da
label: eserinin besteci kişisidir @tr
label: est une personne compositrice d’une œuvre de @fr
label: ir komponists (persona) darbam @lv
label: is componist-persoon van werk van @nl
label: is composer person of work of @en
label: ist Person als Komponistin/Komponist eines Werks von @de
label: teose helilooja (isik) teoses @et
label: zeneszerző személye a következő műnek: @hu
label: è compositore persona di opera di @it
label: és persona compositora d’una obra de @ca
label: είναι συνθέτης φυσικό πρόσωπο του έργου του @el
label: هو شخص ملحن عمل لـ @ar
label: 是……的作品的作曲者个人 @zh-hans
sub property of: teoksen säveltäjä (toimija) musiikkiteoksessa
sub property of: teoksen tekijä (henkilö) teoksessa
definition: Bir kişiyi, kişinin bir müzik eseri yaratma sorumluluğunu içeren bir eserle ilişkilendirir. @tr
definition: Correla una persona a un'opera musicale che implica una responsabilità di una persona per la musica. @it
definition: Hozzákapcsol egy személyt egy zeneműhöz, amelyhez hozzátartozik egy személy felelőssége a zenéért. @hu
definition: Liittää henkilön teokseen, joka on musiikkiteos, jonka luomisesta henkilö on vastuussa.
definition: Met une personne en relation avec une œuvre qui comporte une responsabilité de la part d’une personne consistant à créer une œuvre musicale. @fr
definition: Relaciona una persona amb una obra que implica una responsabilitat d’una persona en la creació d’una obra musical. @ca
definition: Relateert een persoon aan een werk dat is een muziekwerk dat met zich meebrengt een verantwoordelijkheid van een persoon voor muziek. @nl
definition: Relaterer en person til et musikalsk verk som involverer et ansvar for en person i form av musikk. @no
definition: Relaterer en person til et værk, som er et musikværk, som involverer en persons ansvar for musik. @da
definition: Relates a person to a work that involves a responsibility of a person for creating a musical work. @en
definition: Sasaista personu ar darbu, kas ir mūzikas darbs, kas ietver personas atbildību par mūzikas radīšanu. @lv
definition: Seostab isiku muusikateosega, mis sisaldab isiku vastutust muusika loomise eest. @et
definition: Setzt eine Person in Beziehung zu einem Musikwerk, bei dem eine Person für die Musik verantwortlich ist. @de
definition: يربط شخصا بعمل موسيقي يترتب عليه مسئولية شخص عن الموسيقى. @ar
definition: 将一个个人与涉及创作一种音乐作品的一个个人的责任的一种作品关联起来。 @zh-hans

vastaanottaja (henkilö) teoksessa
has element type: 2
toolkit definition: A work or a portion of a work that is addressed to a person. @en
toolkit definition: Bir kişiye hitap eden bir eser veya eserin bir bölümü. @tr
toolkit definition: Darbs vai darba daļa, kas adresēta personai @lv
toolkit definition: Een werk of een deel van een werk dat is gericht aan een persoon. @nl
toolkit definition: Egy személynek címzett mű, vagy műrészlet. @hu
toolkit definition: Ein Werk oder ein Teil eines Werks, das an eine Person adressiert ist. @de
toolkit definition: Et verk eller en del av et verk som er adressert til en person. @no
toolkit definition: Obra o una part d’una obra que s’adreça a una persona. @ca
toolkit definition: Opera o porzione di un'opera indirizzata a una persona. @it
toolkit definition: Teos tai teoksen osa, joka on osoitettu henkilölle.
toolkit definition: Teos või teose osa, mis on adresseeritud isikule. @et
toolkit definition: Værk eller en del af et værk, som er adresseret til en person. @da
toolkit definition: Œuvre ou portion d’œuvre qui est adressée à une personne. @fr
toolkit definition: عمل أو جزء من عمل موجه إلى شخص. @ar
toolkit definition: 要被一个个人接受的一种作品或作品的一部分 @zh-hans
toolkit label: Muhatap kişi @tr
toolkit label: Person als Adressatin/Adressat von @de
toolkit label: addressee person of @en
toolkit label: adressaat (isik) teoses @et
toolkit label: adressat for (person) @no
toolkit label: címzett személye: @hu
toolkit label: destinatario persona di @it
toolkit label: geadresseerde persoon van @nl
toolkit label: ir adresāts (persona) @lv
toolkit label: person, som er adressat af @da
toolkit label: persona destinatària de @ca
toolkit label: personne destinataire de @fr
toolkit label: vastaanottaja (henkilö) teoksessa
toolkit label: παραλήπτης φυσικό πρόσωπο του @el
toolkit label: شخص مرسل إليه @ar
toolkit label: ……的接受者个人 @zh-hans
has subproperty: P50523
lexical alias: addresseePersonOf.en
status: Published
type: Property
domain: C10004
label: adressaat (isik) teoses @et
label: címzett személye a következőnek: @hu
label: er adressat for (person) @no
label: er person, som er adressat af @da
label: est une personne destinataire de @fr
label: ir adresāts (persona) @lv
label: is addressee person of @en
label: is geadresseerde persoon van @nl
label: ist Person als Adressatin/Adressat von @de
label: muhatap kişisidir @tr
label: è destinatario persona di @it
label: és persona destinatària de @ca
label: είναι παραλήπτης φυσικό πρόσωπο του @el
label: هو شخص مرسل إليه لـ @ar
label: 是……的接受者个人 @zh-hans
sub property of: vastaanottaja (toimija) teoksessa
sub property of: henkilöön liittyvä teos
definition: Bir kişiyi, kişinin muhatabı olduğu bir eserle veya eserin bir bölümüyle ilişkilendirir. @tr
definition: Correla una persona a un'opera o porzione di un'opera indirizzata a una persona. @it
definition: Hozzákapcsol egy személyt egy személynek címzett műhöz, vagy műrészlethez. @hu
definition: Liittää henkilön teokseen tai teoksen osaan, joka on osoitettu henkilölle.
definition: Met une personne en relation avec une œuvre ou portion d’œuvre qui est adressée à une personne. @fr
definition: Relaciona una persona amb una obra o una part d’una obra que s’adreça a una persona. @ca
definition: Relateert een persoon aan een werk of een deel van een werk dat is gericht aan een persoon. @nl
definition: Relaterer en person til et verk eller en del av et verk som er adressert til en person. @no
definition: Relaterer en person til et værk eller en del af et værk, som er adresseret til en person. @da
definition: Relates a person to a work or a portion of a work that is addressed to a person. @en
definition: Sasaista personu ar darbu vai darba daļa, kas adresēta personai. @lv
definition: Seostab isiku teose või teose osaga, mis on adresseeritud isikule. @et
definition: Setzt eine Person in Beziehung zu einem Werk oder einem Teil eines Werks, das an eine Person adressiert ist. @de
definition: يربط شخصا بعمل أو بجزء من عمل موجه إلى شخص. @ar
definition: 将一个个人与要被一个个人接受的一种作品或作品的一部分关联起来。 @zh-hans

toimituspäällikkö (henkilö) teoksessa
has element type: 2
toolkit definition: A work that involves a legal or intellectual responsibility, but not creative responsibility, of a person for the editorial policy and content of a diachronic work. @en
toolkit definition: Artzamanlı bir eserin yayın politikası ve içeriği için bir kişinin yasal veya entelektüel sorumluluğunu içeren, ancak yaratıcı sorumluluğunu içermeyen bir eser. @tr
toolkit definition: Darbs, kas ietver personas juridisku vai intelektuālu, bet ne radošu, atbildību par diahroniskā darba izdošanas politiku un saturu. @lv
toolkit definition: Een werk dat met zich meebrengt een wettelijke of intellectuele verantwoordelijkheid, maar niet creatieve verantwoordelijkheid, van een persoon voor redactioneel beleid en content van een diachronisch werk. @nl
toolkit definition: Egy mű, amely magában foglalja egy személy jogi vagy szellemi, de nem alkotói felelősségét egy diakronikus mű szerkesztési politikájáért és tartalmáért. @hu
toolkit definition: Ein Werk, bei dem eine Person die rechtliche oder intellektuelle, aber keine kreative, Verantwortung für die redaktionelle Vorgehensweise und den Inhalt eines diachronen Werks trägt. @de
toolkit definition: Et verk som involverer juridisk eller intellektuelt ansvar, bortsett fra kreativt ansvar, for det redaksjonelle innholdet i et diakronisk verk. @no
toolkit definition: Obra que implica una responsabilitat legal o intel·lectual, però no una responsabilitat creativa, d’una persona en la política i el contingut editorial d’una obra diacrònica. @ca
toolkit definition: Opera che implica una responsabilità legale o intellettuale, ma non una responsabilità creativa, di una persona nella politica editoriale e contenuto di un'opera diacronica. @it
toolkit definition: Teos, jossa henkilö on juridisesti tai tiedollisesti muttei luovasti vastuussa diakronisen teoksen toimituslinjasta ja sisällöstä.
toolkit definition: Teos, mis sisaldab isiku juriidilist või intellektuaalset, kuid mitte loomingulist vastutust diakroonilise teose toimetamispõhimõtete ja sisu eest. @et
toolkit definition: Værk, som involverer en persons juridiske eller intellektuelle ansvar, men ikke skabelsesansvar, for et diakronisk værks redaktionelle linje og indhold. @da
toolkit definition: Œuvre qui comporte une responsabilité légale ou intellectuelle, mais non une responsabilité créative, de la part d’une personne en ce qui concerne la politique éditoriale et le contenu d’une œuvre diachronique. @fr
toolkit definition: عمل يترتب عليه تحمل وكيل المسئولية القانونية أو الفكرية، وليس الإبداعية عن السياسة التحريرية ومحتوى عمل ممتد زمنيا. @ar
toolkit definition: 涉及一个个人对一种历时作品的编辑政策和内容的法律或知识责任（但非创作责任）的一种作品 @zh-hans
toolkit label: Person als Chefredakteurin/Chefredakteur von @de
toolkit label: direttore editoriale persona di @it
toolkit label: editorial director person of @en
toolkit label: főszerkesztő személye: @hu
toolkit label: hoofdredacteur-persoon van @nl
toolkit label: ir galvenais redaktors (persona) @lv
toolkit label: peatoimetaja (isik) teoses @et
toolkit label: person, som er ansvarshavende redaktør af @da
toolkit label: persona directora editorial de @ca
toolkit label: personne directrice de publication de @fr
toolkit label: redaksjonssjef for (person) @no
toolkit label: toimituspäällikkö (henkilö) teoksessa
toolkit label: yayın yönetmeni @tr
toolkit label: διευθυντής σύνταξης φυσικό πρόσωπο του @el
toolkit label: شخص مدير تحرير @ar
toolkit label: ……的主编个人 @zh-hans
has subproperty: P50524
lexical alias: editorialDirectorPersonOf.en
status: Published
type: Property
domain: C10004
label: er person, som er ansvarshavende redaktør af @da
label: er redaksjonssjef for (person) @no
label: est une personne directrice de publication de @fr
label: főszerkesztő személye a következőnek: @hu
label: ir galvenais redaktors (persona) @lv
label: is editorial director person of @en
label: is hoofdredacteur-persoon van @nl
label: ist Person als Chefredakteurin/Chefredakteur von @de
label: peatoimetaja (isik) teoses @et
label: yayın yönetmeni kişisidir @tr
label: è direttore editoriale persona di @it
label: és persona directora editorial de @ca
label: είναι διευθυντής σύνταξης φυσικό πρόσωπο του @el
label: هو شخص مدير تحرير لـ @ar
label: 是……的主编个人 @zh-hans
sub property of: toimituspäällikkö (toimija) teoksessa
sub property of: henkilöön liittyvä teos
definition: Bir kişiyi, artzamanlı bir çalışmanın yayın politikası ve içeriği için bir kişinin yaratıcı sorumluluğu ile değil ancak yasal veya entelektüel sorumluluğunu içeren bir eserle ilişkilendirir. @tr
definition: Correla una persona a un'opera che implica una responsabilità legale o intellettuale, ma non una responsabilità creativa, di una persona nella politica editoriale e contenuto di un'opera diacronica. @it
definition: Hozzákapcsol egy személyt egy műhöz, amely magában foglalja egy személy jogi vagy szellemi, de nem alkotói felelősségét egy diakronikus mű szerkesztési politikájáért és tartalmáért. @hu
definition: Liittää henkilön teokseen, jossa henkilö on juridisesti tai tiedollisesti muttei luovasti vastuussa diakronisen teoksen toimituslinjasta ja sisällöstä.
definition: Met une personne en relation avec une œuvre qui comporte une responsabilité légale ou intellectuelle, mais non une responsabilité créative, de la part d’une personne en ce qui concerne la politique éditoriale et le contenu d’une œuvre diachronique. @fr
definition: Relaciona una persona amb una obra que implica una responsabilitat legal o intel·lectual, però no una responsabilitat creativa, d’una persona en la política i el contingut editorial d’una obra diacrònica. @ca
definition: Relateert een persoon aan een werk dat met zich meebrengt een wettelijke of intellectuele verantwoordelijkheid, maar niet creatieve verantwoordelijkheid, van een persoon voor redactioneel beleid en content van een diachronisch werk. @nl
definition: Relaterer en person til et verk som involverer juridisk eller intellektuelt ansvar, bortsett fra kreativt ansvar, for det redaksjonelle innholdet i et diakronisk verk. @no
definition: Relaterer en person til et værk, som involverer en persons juridiske eller intellektuelle ansvar, men ikke skabelsesansvar, for et diakronisk værks redaktionelle linje og indhold. @da
definition: Relates a person to a work that involves a legal or intellectual responsibility, but not creative responsibility, of a person for the editorial policy and content of a diachronic work. @en
definition: Sasaista personu ar darbu, kas ietver personas juridisku vai intelektuālu, bet ne radošu, atbildību par diahroniskā darba izdošanas politiku un saturu. @lv
definition: Seostab isiku teosega, mis sisaldab isiku juriidilist või intellektuaalset, kuid mitte loomingulist vastutust diakroonilise teose toimetamispõhimõtete ja sisu eest. @et
definition: Setzt eine Person in Beziehung zu einem Werk, bei dem eine Person die rechtliche oder intellektuelle, aber keine kreative, Verantwortung für die redaktionelle Vorgehensweise und den Inhalt eines diachronen Werks trägt. @de
definition: يربط شخصا بعمل يترتب عليه مسئوليته القانونية أو الفكرية، وليس الإبداعية عن السياسة التحريرية وعن محتوى عمل ممتد زمنيا. @ar
definition: 将一个个人与涉及一个个人对一种历时作品的编辑政策和内容的法律或知识责任（但非创作责任）的一种作品关联起来。 @zh-hans

teoksen kartantekijä (henkilö) teoksessa
has element type: 2
toolkit definition: A work that involves a responsibility of a person for creating a cartographic work. @en
toolkit definition: Darbs, kas ietver personas atbildību par karti, atlantu, globusu vai citu kartogrāfijas materiālu. @lv
toolkit definition: Een werk dat met zich meebrengt een verantwoordelijkheid van een persoon voor het creëren van een cartografisch werk. @nl
toolkit definition: Egy mű, amelyhez hozzátartozik egy személy felelőssége egy kartográfiai mű létrehozásáért. @hu
toolkit definition: Ein Werk, bei dem eine Person für die Schaffung eines kartografischen Werks verantwortlich ist. @de
toolkit definition: Et verk som involverer et ansvar for en person i form av et kartografisk verk. @no
toolkit definition: Kartografik bir eser oluşturmak için bir kişinin sorumluluğunu içeren bir çalışma. @tr
toolkit definition: Obra que implica una responsabilitat d’una persona en la creació d’una obra cartogràfica. @ca
toolkit definition: Opera che implica una responsabilità di una persona per un'opera cartografica. @it
toolkit definition: Teos, joka on kartografinen teos, jonka luomisesta henkilö on vastuussa.
toolkit definition: Teos, mis sisaldab isiku vastutust kartograafilise teose eest. @et
toolkit definition: Værk, som involverer en persons ansvar for at skabe et kartografisk værk. @da
toolkit definition: Œuvre qui comporte une responsabilité de la part d’une personne consistant à créer une œuvre cartographique. @fr
toolkit definition: عمل يترتب عليه مسئولية شخص عن أعمال رسم الخرائط. @ar
toolkit definition: 涉及创作一种地图作品的一个个人的责任的一种作品 @zh-hans
toolkit label: Person als Kartografin/Kartograf eines Werks von @de
toolkit label: cartograaf-persoon van werk van @nl
toolkit label: cartografo persona di opera di @it
toolkit label: cartographer person of work of @en
toolkit label: eserin kartografı @tr
toolkit label: ir kartogrāfs (persona) darbam @lv
toolkit label: kartograf for verk for (person) @no
toolkit label: person, som er kartograf for værk af @da
toolkit label: persona cartògrafa d’una obra de @ca
toolkit label: personne cartographe d’une œuvre de @fr
toolkit label: teoksen kartantekijä (henkilö) teoksessa
toolkit label: teose kartograaf (isik) teoses @et
toolkit label: térképész személye a következő műnek: @hu
toolkit label: χαρτογράφος φυσικό πρόσωπο του έργου του @el
toolkit label: شخص رسام خرائط لعمل @ar
toolkit label: ……的作品的地图绘制者个人 @zh-hans
has subproperty: P50525
lexical alias: cartographerPersonOfWorkOf.en
status: Published
type: Property
domain: C10004
label: er kartograf for verk for (person) @no
label: er person, som er kartograf for værk af @da
label: eserinin kartograf kişisidir @tr
label: est une personne cartographe d’une œuvre de @fr
label: ir kartogrāfs (persona) darbam @lv
label: is cartograaf-persoon van werk van @nl
label: is cartographer person of work of @en
label: ist Person als Kartografin/Kartograf eines Werks von @de
label: teose kartograaf (isik) teoses @et
label: térképész személye a következő műnek: @hu
label: è cartografo persona di opera di @it
label: és persona cartògrafa d’una obra de @ca
label: είναι χαρτογράφος φυσικό πρόσωπο του έργου του @el
label: هو شخص رسام خرائط لعمل لـ @ar
label: 是……的作品的地图绘制者个人 @zh-hans
sub property of: teoksen kartantekijä (toimija) teoksessa
sub property of: teoksen tekijä (henkilö) teoksessa
definition: Bir kişiyi, bir kişinin haritacılık çalışması oluşturma sorumluluğunu içeren bir eserle ilişkilendirir. @tr
definition: Correla una persona a un'opera che implica una responsabilità di una persona per una mappa, atlante, mappamondo o altra risorsa cartografica. @it
definition: Hozzákapcsol egy személyt egy műhöz, amelyhez hozzátartozik egy személy felelőssége egy kartográfiai mű létrehozásáért. @hu
definition: Liittää henkilön teokseen, joka on kartografinen teos, jonka luomisesta henkilö on vastuussa.
definition: Met une personne en relation avec une œuvre qui comporte une responsabilité de la part d’une personne consistant à créer une œuvre cartographique. @fr
definition: Relaciona una persona amb una obra que implica una responsabilitat d’una persona en la creació d’una obra cartogràfica. @ca
definition: Relateert een persoon aan een werk dat met zich meebrengt een verantwoordelijkheid van een persoon voor het creëren van een cartografisch werk. @nl
definition: Relaterer en person til et verk som involverer et ansvar for en person i form av et kartografisk verk. @no
definition: Relaterer en person til et værk, som involverer en persons ansvar for at skabe et kartografisk værk. @da
definition: Relates a person to a work that involves a responsibility of a person for creating a cartographic work. @en
definition: Sasaista personu ar darbu, kas ietver personas atbildību par karti, atlantu, globusu vai citu kartogrāfijas materiālu. @lv
definition: Seostab isiku teosega, mis sisaldab isiku vastutust kartograafilise teose eest. @et
definition: Setzt eine Person in Beziehung zu einem Werk, bei dem eine Person für die Schaffung eines kartografischen Werks verantwortlich ist. @de
definition: يربط شخصا بعمل يترتب عليه مسئولية شخص ما عن أعمال رسم الخرائط. @ar
definition: 将一个个人与涉及创作一种地图作品的一个个人的责任的一种作品关联起来。 @zh-hans

keksijä (henkilö) teoksessa
has element type: 2
toolkit definition: A work that involves a responsibility of a person for creating a new device or process. @en
toolkit definition: Darbs, kas ietver personas atbildību par jaunas ierīces vai procesa radīšanu. @lv
toolkit definition: Een werk dat met zich meebrengt een verantwoordelijkheid van een persoon voor het creëren van een nieuw apparaat of proces. @nl
toolkit definition: Egy mű, amelyhez hozzátartozik egy személy felelőssége egy új eszköz vagy eljárás létrehozásáért. @hu
toolkit definition: Ein Werk, bei dem eine Person für die Schaffung eines neuen Geräts oder Prozesses verantwortlich ist. @de
toolkit definition: Et verk som involverer et ansvar for en person i form av en ny innretning eller prosess. @no
toolkit definition: Obra que implica una responsabilitat d’una persona en la creació d’un mecanisme o procés nou. @ca
toolkit definition: Opera che implica una responsabilità di una persona per un nuovo dispositivo o processo. @it
toolkit definition: Teos, jossa henkilö on vastuussa uuden välineen tai menetelmän luomisesta.
toolkit definition: Teos, mis sisaldab isiku vastutust uue seadme või protsessi eest. @et
toolkit definition: Værk, som involverer en persons ansvar for at skabe en ny anordning eller proces. @da
toolkit definition: Yeni bir cihaz veya süreç oluşturmak için bir kişinin sorumluluğunu içeren bir çalışma. @tr
toolkit definition: Œuvre qui comporte une responsabilité de la part d’une personne consistant à créer un nouveau dispositif ou procédé. @fr
toolkit definition: عمل يترتب عليه مسئولية شخص عن ابتكار جهاز أو عملية جديدة. @ar
toolkit definition: 涉及创建一个新装置或新过程的一个个人的责任的一种作品 @zh-hans
toolkit label: Person als Erfinderin/Erfinder von @de
toolkit label: feltaláló személye: @hu
toolkit label: inventor person of @en
toolkit label: inventore persona di @it
toolkit label: ir izgudrotājs (persona) @lv
toolkit label: keksijä (henkilö) teoksessa
toolkit label: leiutaja (isik) teoses @et
toolkit label: mucit kişisidir @tr
toolkit label: oppfinner av (person) @no
toolkit label: person, som er opfinder af @da
toolkit label: persona inventora de @ca
toolkit label: personne inventrice de @fr
toolkit label: uitvinder-persoon van @nl
toolkit label: εφευρέτης φυσικό πρόσωπο του @el
toolkit label: شخص مخترع @ar
toolkit label: ……的发明者个人 @zh-hans
has subproperty: P50526
lexical alias: inventorPersonOf.en
status: Published
type: Property
domain: C10004
label: er oppfinner av (person) @no
label: er person, som er opfinder af @da
label: est une personne inventrice de @fr
label: feltaláló személye a következőnek: @hu
label: ir izgudrotājs (persona) @lv
label: is inventor person of @en
label: is uitvinder-persoon van @nl
label: ist Person als Erfinderin/Erfinder von @de
label: leiutaja (isik) teoses @et
label: mucit kişisidir @tr
label: è inventore persona di @it
label: és persona inventora de @ca
label: είναι εφευρέτης φυσικό πρόσωπο του @el
label: هو شخص مخترع لـ @ar
label: 是……的发明者个人 @zh-hans
sub property of: keksijä (toimija) teoksessa
sub property of: teoksen tekijä (henkilö) teoksessa
definition: Bir kişiyi yeni bir cihaz veya süreç yaratma sorumluluğunu içeren bir eserle ilişkilendirir. @tr
definition: Correla una persona a un'opera che implica una responsabilità di una persona per un nuovo dispositivo o processo. @it
definition: Hozzákapcsol egy személyt egy műhöz, amelyhez hozzátartozik egy személy felelőssége egy új eszköz vagy eljárás létrehozásáért. @hu
definition: Liittää henkilön teokseen, jossa henkilö on vastuussa uuden välineen tai menetelmän luomisesta.
definition: Met une personne en relation avec une œuvre qui comporte une responsabilité de la part d’une personne consistant à créer un nouveau dispositif ou procédé. @fr
definition: Relaciona una persona amb una obra que implica una responsabilitat d’una persona en la creació d’un mecanisme o procés nou. @ca
definition: Relateert een persoon aan een werk dat met zich meebrengt een verantwoordelijkheid van een persoon voor het creëren van een nieuw apparaat of proces. @nl
definition: Relaterer en person til et verk som involverer et ansvar for en person i form av en ny innretning eller prosess. @no
definition: Relaterer en person til et værk, som involverer en persons ansvar for at skabe en ny anordning eller proces. @da
definition: Relates a person to a work that involves a responsibility of a person for creating a new device or process. @en
definition: Sasaista personu ar darbu, kas ietver personas atbildību par jaunas ierīces vai procesa radīšanu. @lv
definition: Seostab isiku teosega, mis sisaldab isiku vastutust uue seadme või protsessi eest. @et
definition: Setzt eine Person in Beziehung zu einem Werk, bei dem eine Person für die Schaffung eines neuen Geräts oder Prozesses verantwortlich ist. @de
definition: يربط شخصا بعمل يترتب عليه مسئولية شخص عن ابتكار جهاز أو عملية جديدة. @ar
definition: 将一个个人与涉及创建一个新装置或新过程的一个个人的责任的一种作品关联起来。 @zh-hans

teoksen haastattelija (henkilö) teoksessa
has element type: 2
toolkit definition: A work that involves a responsibility of a person for acting as an interviewer, reporter, pollster, or some other kind of person who gathers information. @en
toolkit definition: Bir kişinin görüşmeci, muhabir, anketör veya bilgi toplayan başka türde bir kişi olarak hareket etme sorumluluğunu içeren bir çalışma. @tr
toolkit definition: Darbs, kas ietver personas atbildību, darbojoties kā intervētājs, reportieris, aptaujas organizētājs vai kāds cits informācijas apkopotājs. @lv
toolkit definition: Een werk dat met zich meebrengt een verantwoordelijkheid van een persoon voor optreden als een interviewer, verslaggever, opiniepeiler of een andere soort persoon die informatie verzamelt. @nl
toolkit definition: Egy mű, amelyhez hozzátartozik egy személy felelőssége interjúkészítőként, riporterként, közvélemény-kutatóként, vagy valamilyen más információgyűjtő személyként. @hu
toolkit definition: Ein Werk, bei dem eine Person als Interviewerin/Interviewer, Reporterin/Reporter, Meinungsforscherin/Meinungsforscher oder andere Person Informationen zusammenträgt. @de
toolkit definition: Et verk som involverer et ansvar for en person i form av å fungere som intervjuer, reporter, eller som en annen person som samler inn informasjon. @no
toolkit definition: Obra que implica una responsabilitat d’una persona actuant com un entrevistador, un periodista, un enquestador o qualsevol altra persona que recull la informació. @ca
toolkit definition: Opera che implica una responsabilità di una persona nell'agire come intervistatore, giornalista, sondaggista o altro tipo di persona che raccoglie informazioni. @it
toolkit definition: Teos, jonka luomisesta henkilö on vastuussa toimimalla haastattelijana, toimittajana, mielipidetutkijana tai jonkinlaisena muuna tietoja keräävänä henkilönä.
toolkit definition: Teos, mis sisaldab isiku vastutust tegutsemise eest intervjueerija, reporteri, küsitleja või muu infot koguva isikuna. @et
toolkit definition: Værk, som involverer en persons ansvar for at optræde som interviewer, journalist, meningsmåler eller en anden form for person, som indsamler information. @da
toolkit definition: Œuvre qui comporte une responsabilité de la part d’une personne consistant à agir à titre d’intervieweur, de reporteur, de sondeur ou d’autre type de personne recueillant de l’information. @fr
toolkit definition: عمل يترتب عليه مسئولية وكيل عن العمل كمحاور أو مراسل أو كاتب استطلاع أو أي نوع آخر من الأشخاص الذين يجمعون المعلومات. @ar
toolkit definition: 涉及担当采访者、记者、民意调查员的一个个人或其他类型信息搜集个人的责任的一种作品 @zh-hans
toolkit label: Person als Interviewerin/Interviewer eines Werks von @de
toolkit label: eserinin görüşmeci kişisidir @tr
toolkit label: interjúkészítő személye a következő műnek: @hu
toolkit label: interviewer person of work of @en
toolkit label: interviewer-persoon van werk van @nl
toolkit label: intervistatore persona di opera di @it
toolkit label: intervjueerija (isik) teoses @et
toolkit label: intervjuer for verk for (person) @no
toolkit label: ir intervētājs (persona) darbā @lv
toolkit label: person, som er interviewer for værk af @da
toolkit label: persona entrevistadora d’una obra de @ca
toolkit label: personne intervieweuse d’une œuvre de @fr
toolkit label: teoksen haastattelija (henkilö) teoksessa
toolkit label: συνεντευκτής φυσικό πρόσωπο του έργου του @el
toolkit label: شخص محاور في عمل @ar
toolkit label: ……的作品的采访者个人 @zh-hans
has subproperty: P50527
lexical alias: interviewerPersonOfWorkOf.en
status: Published
type: Property
domain: C10004
label: er intervjuer for verk for (person) @no
label: er person, som er interviewer for værk af @da
label: eserinin görüşmeci kişisidir @tr
label: est une personne intervieweuse d’une œuvre de @fr
label: interjúkészítő személye a következő műnek: @hu
label: intervjueerija (isik) teoses @et
label: ir intervētājs (persona) darbā @lv
label: is interviewer person of work of @en
label: is interviewer-persoon van werk van @nl
label: ist Person als Interviewerin/Interviewer eines Werks von @de
label: è intervistatore persona di opera di @it
label: és persona entrevistadora d’una obra de @ca
label: είναι συνεντευκτής φυσικό πρόσωπο του έργου του @el
label: هو شخص محاور في عمل لـ @ar
label: 是……的作品的采访者个人 @zh-hans
sub property of: teoksen haastattelija (toimija) teoksessa
sub property of: teoksen tekijä (henkilö) teoksessa
definition: Bir kişiyi, bir kişinin mülakatçı, muhabir, anketör veya bilgi toplayan başka tür bir kişi olarak hareket etme sorumluluğunu içeren bir eserle ilişkilendirir. @tr
definition: Correla una persona a un'opera che implica una responsabilità di una persona nell'agire come intervistatore, giornalista, sondaggista o altro tipo di persona che raccoglie informazioni. @it
definition: Hozzákapcsol egy személyt egy műhöz, amelyhez hozzátartozik egy személy felelőssége interjúkészítőként, riporterként, közvélemény-kutatóként, vagy valamilyen más információgyűjtő személyként. @hu
definition: Liittää henkilön teokseen, jonka luomisesta henkilö on vastuussa toimimalla haastattelijana, toimittajana, mielipidetutkijana tai jonkinlaisena muuna tietoja keräävänä henkilönä.
definition: Met une personne en relation avec une œuvre qui comporte une responsabilité de la part d’une personne consistant à agir à titre d’intervieweur, de reporteur, de sondeur ou d’autre type de personne recueillant de l’information. @fr
definition: Relaciona una persona amb una obra que implica una responsabilitat d’una persona actuant com un entrevistador, un periodista, un enquestador o qualsevol altra persona que recull la informació. @ca
definition: Relateert een persoon aan een werk dat met zich meebrengt een verantwoordelijkheid van een persoon voor optreden als een interviewer, verslaggever, opiniepeiler of een andere soort persoon die informatie verzamelt. @nl
definition: Relaterer en person til et verk som involverer et ansvar for en person i form av å fungere som intervjuer, reporter, eller som en annen person som samler inn informasjon. @no
definition: Relaterer en person til et værk, som involverer en persons ansvar for at optræde som interviewer, journalist, meningsmåler eller en anden form for person, som indsamler information. @da
definition: Relates a person to a work that involves a responsibility by a person for acting as an interviewer, reporter, pollster, or some other kind of person who gathers information. @en
definition: Sasaista personu ar darbu, kas ietver personas atbildību, darbojoties kā intervētājs, reportieris, aptaujas organizētājs vai kāds cits informācijas apkopotājs. @lv
definition: Seostab isiku teosega, mis sisaldab isiku vastutust tegutsemise eest intervjueerija, reporteri, küsitleja või muu infot koguva isikuna. @et
definition: Setzt eine Person in Beziehung zu einem Werk, bei dem eine Person als Interviewerin/Interviewer, Reporterin/Reporter, Meinungsforscherin/Meinungsforscher oder andere Person Informationen zusammenträgt. @de
definition: يربط شخصا بعمل ينطوي على مسئولية شخص عن العمل كمحاور أو مراسل أو كاتب استطلاع أو أي نوع آخر من الأشخاص الذين يجمعون المعلومات. @ar
definition: 将一个个人与涉及担当采访者、记者、民意调查员的一个个人或其他类型信息搜集个人的责任的一种作品关联起来。 @zh-hans

aggregaattori (henkilö) teoksessa
has element type: 2
toolkit definition: A work that involves a responsibility of a person for aggregation by selecting and arranging expressions of other works. @en
toolkit definition: Darbs, kas ietver personas atbildību par apkopošanu, atlasot un sakārtojot citu darbu izteiksmes. @lv
toolkit definition: Diğer eserlerin anlatımlarını seçip düzenleyerek bir araya getirmek için bir kişinin sorumluluğunu içeren bir çalışma. @tr
toolkit definition: Een werk dat met zich meebrengt een verantwoordelijkheid van een persoon voor aggregeren door middel van selectie en arrangeren van expressies van andere werken. @nl
toolkit definition: Egy mű, amelyhez hozzátartozik egy személy felelőssége más művek kifejezési formáinak kiválasztásával és elrendezésével járó aggregálásért. @hu
toolkit definition: Ein Werk, bei dem eine Person für die Aggregation verantwortlich ist, indem sie Expressionen von anderen Werken auswählt und zusammenstellt. @de
toolkit definition: Et verk som involverer et ansvar for en person i form av aggregering gjennom å velge ut og arrangere uttrykk av andre verk. @no
toolkit definition: Obra que implica una responsabilitat d’una persona en l’agregació mitjançant la selecció i l’arranjament d’expressions d’altres obres. @ca
toolkit definition: Opera che implica una responsabilità di una persona nell'aggregazione selezionando e organizzando espressioni di altre opere. @it
toolkit definition: Teos, jossa henkilö on vastuussa aggregoivan teoksen luomisesta valitsemalla ja järjestämällä muiden teosten ekspressioita.
toolkit definition: Teos, mis sisaldab isiku vastutust liitumi loomise eest, valides ja korrastades teiste teoste väljendused. @et
toolkit definition: Værk, som involverer en persons ansvar for sammenlægning ved at udvælge og arrangere udtryk af andre værk. @da
toolkit definition: Œuvre qui comporte une responsabilité de la part d’une personne en ce qui concerne l’agrégation par la sélection et l’arrangement d’expressions d’autres œuvres. @fr
toolkit definition: عمل يترتب عليه مسئولية شخص عن التجميع من خلال اختيار تعبيرات الأعمال الأخرى وترتيبها. @ar
toolkit definition: 涉及把其他作品的内容表达选择和整理后编制合集的一个个人的责任的一种作品 @zh-hans
toolkit label: Person als Aggregatorin/Aggregator von @de
toolkit label: Toplayıcı kişi @tr
toolkit label: aggregaattori (henkilö) teoksessa
toolkit label: aggregator av (person) @no
toolkit label: aggregator person of @en
toolkit label: aggregator-persoon van @nl
toolkit label: aggregatore persona di @it
toolkit label: aggregátor személye: @hu
toolkit label: ir apkopotājs (persona) @lv
toolkit label: liitja (isik) teoses @et
toolkit label: person, som er samler af @da
toolkit label: persona agregadora de @ca
toolkit label: personne agrégatrice de @fr
toolkit label: συναθροιστής φυσικό πρόσωπο του @el
toolkit label: شخص مجمع @ar
toolkit label: ……的合集编者个人 @zh-hans
has subproperty: kokoaja (henkilö) teoksessa
has subproperty: P50528
lexical alias: aggregatorPersonOf.en
status: Published
type: Property
domain: C10004
label: Person als Aggregatorin/Aggregator von @de
label: aggregátor személye a következőnek: @hu
label: er aggregator av (person) @no
label: er person, som er samler af @da
label: est une personne agrégatrice de @fr
label: ir apkopotājs (persona) @lv
label: is aggregator person of @en
label: is aggregator-persoon van @nl
label: liitja (isik) teoses @et
label: toplayıcı kişisidir @tr
label: è aggregatore persona di @it
label: és persona agregadora de @ca
label: είναι ερανιστής φυσικό πρόσωπο του @el
label: هو شخص مجمع لـ @ar
label: 是……的合集编者个人 @zh-hans
sub property of: aggregaattori (toimija) teoksessa
sub property of: teoksen tekijä (henkilö) teoksessa
definition: Bir kişiyi, başka eserlerin ifadelerini seçerek ve düzenleyerek bir araya getirme sorumluluğunu içeren bir eserle ilişkilendirir. @tr
definition: Correla una persona a un'opera che implica una responsabilità di una persona nell'aggregazione selezionando e organizzando espressioni di altre opere. @it
definition: Hozzákapcsol egy személyt egy műhöz, amelyhez hozzátartozik egy személy felelőssége más művek kifejezési formáinak kiválasztásával és elrendezésével járó aggregálásért. @hu
definition: Liittää henkilön teokseen, jossa henkilö on vastuussa aggregoivan teoksen luomisesta valitsemalla ja järjestämällä muiden teosten ekspressioita.
definition: Met une personne en relation avec une œuvre qui comporte une responsabilité de la part d’une personne en ce qui concerne l’agrégation par la sélection et l’arrangement d’expressions d’autres œuvres. @fr
definition: Relaciona una persona amb una obra que implica una responsabilitat d’una persona en l’agregació mitjançant la selecció i l’arranjament d’expressions d’altres obres. @ca
definition: Relateert een persoon aan een werk dat met zich meebrengt een verantwoordelijkheid van een persoon voor aggregeren door middel van selectie en arrangeren van expressies van andere werken. @nl
definition: Relaterer en person til et verk som involverer et ansvar for en person i form av aggregering gjennom å velge ut og arrangere uttrykk av andre verk. @no
definition: Relaterer en person til et værk, som involverer en persons ansvar for sammenlægning ved at udvælge og arrangere udtryk af andre værk. @da
definition: Relates a person to a work that involves a responsibility of a person for aggregation by selecting and arranging expressions of other works. @en
definition: Sasaista personu ar darbu, kas ietver personas atbildību par apkopošanu, atlasot un sakārtojot citu darbu izteiksmes. @lv
definition: Seostab isiku teosega, mis sisaldab isiku vastutust liitumi loomise eest, valides ja korrastades teiste teoste väljendused. @et
definition: Setzt eine Person in Beziehung zu einem Werk, bei dem eine Person für die Aggregation verantwortlich ist, indem sie Expressionen von anderen Werken auswählt und zusammenstellt. @de
definition: يربط شخصا بعمل يترتب عليه مسئولية شخص عن التجميع من خلال اختيار تعبيرات الأعمال الأخرى وترتيبها. @ar
definition: 将一个个人与涉及把其他作品的内容表达选择和整理后编制合集的一个个人的责任的一种作品关联起来。 @zh-hans

arkkitehti (henkilö) teoksessa
has element type: 2
toolkit definition: A work that involves a responsibility of a person for creating an architectural design, including a pictorial representation intended to show how a building or other structure will look when completed. @en
toolkit definition: Bir binanın veya başka bir yapının tamamlandığında nasıl görüneceğini göstermeyi amaçlayan görsel bir temsil de dahil olmak üzere, bir kişinin mimari bir tasarım oluşturma sorumluluğunu içeren bir çalışma. @tr
toolkit definition: Darbs, kas ietver personas atbildību par arhitektūras projekta radīšanu, ieskaitot projekta skici, lai parādītu, kā ēka vai cita struktūra izskatīsies, kad tā tiks pabeigta. @lv
toolkit definition: Een werk dat met zich meebrengt een verantwoordelijkheid van een persoon voor het creëren van een architectonisch ontwerp, omvattende een picturale representatie bedoeld te laten zien hoe een gebouw of andere structuur er na voltooiing uit zal zien. @nl
toolkit definition: Egy mű, amelyhez hozzátartozik egy személy felelőssége egy építészeti terv létrehozásáért, beleértve egy képi reprezentációt, amely bemutatja, hogy egy épület vagy más szerkezet hogyan fog kinézni, amikor elkészül. @hu
toolkit definition: Ein Werk, bei dem eine Person für die Schaffung eines architektonischen Entwurfs verantwortlich ist, einschließlich einer bildlichen Darstellung, die zeigt, wie ein Gebäude oder eine andere Konstruktion nach der Fertigstellung aussehen soll. @de
toolkit definition: Et verk som involverer et ansvar for en person i form av arkitektonisk utforming, inkludert en gjengivelse i bildeform som er ment å vise hvordan en bygning eller annen struktur vil se ut når den er ferdig. @no
toolkit definition: Obra que implica una responsabilitat d’una persona en la creació d’un disseny arquitectònic, inclosa una representació il·lustrada concebuda per mostrar com serà un edifici o qualsevol altra estructura una vegada complet. @ca
toolkit definition: Opera che implica una responsabilità di una persona nella creazione di un progetto architettonico, inclusa una rappresentazione pittorica destinata a mostrare come apparirà un edificio o altra struttura una volta completato. @it
toolkit definition: Teos, jossa henkilö on vastuussa arkkitehtisuunnitelman luomisesta, mukaan lukien kuvaesityksestä, jonka tarkoitus on näyttää, miltä rakennus tai muu rakennelma näyttää valmiina.
toolkit definition: Teos, mis sisaldab isiku vastutust arhitektuurse kujunduse loomise eest, k.a pildiline esitus näitamaks, kuidas ehitis või muu konstruktsioon valmides välja hakkab nägema. @et
toolkit definition: Værk, som involverer en persons ansvar for at skabe et arkitektonisk design, inkl. en billedrepræsentation, som skal vise, hvordan en bygning eller anden struktur vil se ud, når den er færdig. @da
toolkit definition: Œuvre qui comporte une responsabilité de la part d’une personne consistant à créer une conception architecturale, y compris une représentation illustrée conçue pour montrer à quoi ressemblera un bâtiment ou une autre structure une fois la construction terminée. @fr
toolkit definition: عمل يترتب عليه مسئولية شخص عن إنشاء تصميم معماري، ويشمل ذلك إعداد عرض تصويري يبين كيف سيبدو المبنى أو أي بناء آخر عند اكتماله. @ar
toolkit definition: 涉及建筑设计（包括用于展示建筑或其他结构完成之后外观效果的绘画作品）创作的个人的责任的一种作品 @zh-hans
toolkit label: Person als Architektin/Architekt von @de
toolkit label: architect person of @en
toolkit label: architect-persoon van @nl
toolkit label: architetto persona di @it
toolkit label: arhitekt (isik) teoses @et
toolkit label: arkitekt for (person) @no
toolkit label: arkkitehti (henkilö) teoksessa
toolkit label: ir arhitekts (persona) @lv
toolkit label: mimar kişi @tr
toolkit label: person, som er arkitekt af @da
toolkit label: persona arquitecta de @ca
toolkit label: personne architecte de @fr
toolkit label: építész személye: @hu
toolkit label: αρχιτέκτονας φυσικό πρόσωπο του @el
toolkit label: شخص مهندس معماري @ar
toolkit label: ……的建筑设计师个人 @zh-hans
has subproperty: maisema-arkkitehti (henkilö) teoksessa
has subproperty: P50529
lexical alias: architectPersonOf.en
status: Published
type: Property
domain: C10004
label: arhitekt (isik) teoses @et
label: er arkitekt for (person) @no
label: er person, som er arkitekt af @da
label: est une personne architecte de @fr
label: ir arhitekts (persona) @lv
label: is architect person of @en
label: is architect-persoon van @nl
label: ist Person als Architektin/Architekt von @de
label: mimar kişisidir @tr
label: è architetto persona di @it
label: építész személye a következőnek: @hu
label: és persona arquitecta de @ca
label: είναι αρχιτέκτονας φυσικό πρόσωπο του @el
label: هو شخص مهندس معماري لـ @ar
label: 是……的建筑设计师个人 @zh-hans
sub property of: arkkitehti (toimija) teoksessa
sub property of: teoksen tekijä (henkilö) teoksessa
definition: Bir kişiyi, bir binanın veya başka bir yapının tamamlandığında nasıl görüneceğini göstermeyi amaçlayan görsel bir temsil de dahil olmak üzere, bir kişinin mimari bir tasarım oluşturma sorumluluğunu içeren bir eserle ilişkilendirir. @tr
definition: Correla una persona a un'opera che implica una responsabilità di una persona nella creazione di un progetto architettonico, inclusa una rappresentazione pittorica destinata a mostrare come apparirà un edificio o altra struttura una volta completato. @it
definition: Hozzákapcsol egy személyt egy műhöz, amelyhez hozzátartozik egy személy felelőssége egy építészeti terv létrehozásáért, beleértve egy képi reprezentációt, amely bemutatja, hogy egy épület vagy más szerkezet hogyan fog kinézni, amikor elkészül. @hu
definition: Liittää henkilön teokseen, jossa henkilö on vastuussa arkkitehtisuunnitelman luomisesta, mukaan lukien kuvaesityksestä, jonka tarkoitus on näyttää, miltä rakennus tai muu rakennelma näyttää valmiina.
definition: Met une personne en relation avec une œuvre qui comporte une responsabilité de la part d’une personne en ce qui concerne une conception architecturale, y compris une représentation illustrée conçue pour montrer à quoi ressemblera un bâtiment ou une autre structure une fois la construction terminée. @fr
definition: Relaciona una persona amb una obra que implica una responsabilitat d’una persona en la creació d’un disseny arquitectònic, inclosa una representació il·lustrada concebuda per mostrar com serà un edifici o qualsevol altra estructura una vegada complet. @ca
definition: Relateert een persoon aan een werk dat met zich meebrengt een verantwoordelijkheid van een persoon voor het creëren van een architectonisch ontwerp, omvattende een picturale representatie bedoeld te laten zien hoe een gebouw of andere structuur er na voltooiing uit zal zien. @nl
definition: Relaterer en person til et verk som involverer et ansvar for en person i form av arkitektonisk utforming, inkludert en gjengivelse i bildeform som er ment å vise hvordan en bygning eller annen struktur vil se ut når den er ferdig. @no
definition: Relaterer en person til et værk, som involverer en persons ansvar for at skabe et arkitektonisk design, inkl. en billedrepræsentation, som skal vise, hvordan en bygning eller anden struktur vil se ud, når den er færdig. @da
definition: Relates a person to a work that involves a responsibility of a person for creating an architectural design, including a pictorial representation intended to show how a building or other structure will look when completed. @en
definition: Sasaista personu ar darbu, kas ietver personas atbildību par arhitektūras projekta radīšanu, ieskaitot projekta skici, lai parādītu, kā ēka vai cita struktūra izskatīsies, kad tā tiks pabeigta. @lv
definition: Seostab isiku teosega, mis sisaldab isiku vastutust arhitektuurse kujunduse loomise eest, k.a pildiline esitus näitamaks, kuidas ehitis või muu konstruktsioon valmides välja hakkab nägema. @et
definition: Setzt eine Person in Beziehung zu einem Werk, bei dem eine Person für die Schaffung eines architektonischen Entwurfs verantwortlich ist, einschließlich einer bildlichen Darstellung, die zeigt, wie ein Gebäude oder eine andere Konstruktion nach der Fertigstellung aussehen soll. @de
definition: يربط شخصا بعمل يترتب عليه مسئولية شخص عن إنشاء تصميم معماري، ويشمل ذلك إعداد عرض تصويري يبين كيف سيبدو المبنى أو أي بناء آخر عند اكتماله. @ar
definition: 将一个个人与涉及建筑设计（包括用于展示建筑或其他结构完成之后外观效果的绘画作品）创作的个人的责任的一种作品关联起来。 @zh-hans

elokuvantekijä (henkilö) teoksessa
has element type: 2
toolkit definition: A work that involves a responsibility of a person for creating an independent or personal film. @en
toolkit definition: Bağımsız veya kişisel bir film yaratmak için bir kişinin sorumluluğunu içeren bir çalışma. @tr
toolkit definition: Darbs, kas ietver personas atbildību par neatkarīgas vai privātas filmas veidošanu un izpildi visos aspektos. @lv
toolkit definition: Een werk met zich meebrengt een verantwoordelijkheid van een persoon voor het creëren van een zelfstandige of persoonlijke film. @nl
toolkit definition: Egy mű, amelyhez hozzátartozik egy személy felelőssége egy független- vagy magánfilm létrehozásáért. @hu
toolkit definition: Ein Werk, bei dem eine Person für die Schaffung eines unabhängigen oder privaten Films verantwortlich ist. @de
toolkit definition: Et verk som involverer et ansvar for en person for en uavhengig eller personlig film. @no
toolkit definition: Obra que implica una responsabilitat d’una persona en la creació d’una pel·lícula cinematogràfica independent o personal. @ca
toolkit definition: Opera che implica una responsabilità di una persona per un film indipendente o personale. @it
toolkit definition: Teos, jossa hennkilö on vastuussa riippumattoman tai henkilökohtaisen elokuvan luomisesta.
toolkit definition: Teos, mis sisaldab isiku vastutust sõltumatu või autorifilmi eest. @et
toolkit definition: Værk, som involverer en persons ansvar for at skabe en indiefilm eller personlig film. @da
toolkit definition: Œuvre qui comporte une responsabilité de la part d’une personne consistant à créer un film indépendant ou personnel. @fr
toolkit definition: عمل يترتب عليه مسئولية شخص عن فيلم مستقل أو شخصي. @ar
toolkit definition: 涉及创作一部独立或个人电影的一个个人的责任的一种作品 @zh-hans
toolkit label: elokuvantekijä (henkilö) teoksessa
toolkit label: film üreticisi @tr
toolkit label: filmitegija (isik) teoses @et
toolkit label: filmkészítő személye: @hu
toolkit label: filmmaker person of @en
toolkit label: filmmaker-persoon van @nl
toolkit label: filmskaper av (person) @no
toolkit label: ir filmas veidotājs (persona) @lv
toolkit label: ist Person als Filmemacherin/Filmemacher von @de
toolkit label: person, som er filmskaber af @da
toolkit label: persona cineasta de @ca
toolkit label: personne cinéaste de @fr
toolkit label: regista cinematografico persona di @it
toolkit label: σκηνοθέτης φυσικό πρόσωπο του @el
toolkit label: شخص صانع أفلام @ar
toolkit label: ……的制片人个人 @zh-hans
has subproperty: P50530
lexical alias: filmmakerPersonOf.en
status: Published
type: Property
domain: C10004
label: er filmskaper av (person) @no
label: er person, som er filmskaber af @da
label: est une personne cinéaste de @fr
label: film üreticisi kişisidir @tr
label: filmitegija (isik) teoses @et
label: filmkészítő személye a következőnek: @hu
label: ir filmas veidotājs (persona) @lv
label: is filmmaker person of @en
label: is filmmaker-persoon van @nl
label: ist Person als Filmemacherin/Filmemacher von @de
label: è regista cinematografico persona di @it
label: és persona cineasta de @ca
label: είναι σκηνοθέτης φυσικό πρόσωπο του @el
label: هو شخص صانع أفلام لـ @ar
label: 是……的制片人个人 @zh-hans
sub property of: elokuvantekijä (toimija) teoksessa
sub property of: teoksen tekijä (henkilö) teoksessa
definition: Bir kişiyi, bağımsız veya kişisel bir film yaratma sorumluluğunu içeren bir eserle ilişkilendirir. @tr
definition: Correla una persona a un'opera che implica una responsabilità di una persona per un film indipendente o personale. @it
definition: Hozzákapcsol egy személyt egy műhöz, amelyhez hozzátartozik egy személy felelőssége egy független- vagy magánfilm létrehozásáért. @hu
definition: Liittää henkilön teokseen, jossa hennkilö on vastuussa riippumattoman tai henkilökohtaisen elokuvan luomisesta.
definition: Met une personne en relation avec une œuvre qui comporte une responsabilité de la part d’une personne consistant à créer un film indépendant ou personnel. @fr
definition: Relaciona una persona amb una obra que implica una responsabilitat d’una persona en la creació d’una pel·lícula cinematogràfica independent o personal. @ca
definition: Relateert een persoon aan een werk met zich meebrengt een verantwoordelijkheid van een persoon voor het creëren van een zelfstandige of persoonlijke film. @nl
definition: Relaterer en person til et verk som involverer et ansvar for en person for en uavhengig eller personlig film. @no
definition: Relaterer en person til et værk, som involverer en persons ansvar for at skabe en indiefilm eller personlig film. @da
definition: Relates a person to a work that involves a responsibility of a person for creating an independent or personal film. @en
definition: Sasaista personu ar darbu, kas ietver personas atbildību par neatkarīgas vai privātas filmas veidošanu un izpildi visos aspektos. @lv
definition: Seostab isiku teosega, mis sisaldab isiku vastutust sõltumatu või autorifilmi eest. @et
definition: Setzt eine Person in Beziehung zu einem Werk, bei dem eine Person für die Schaffung eines unabhängigen oder privaten Films verantwortlich ist. @de
definition: يربط شخصا بعمل يترتب عليه مسئولية شخص عن فيلم مستقل أو شخصي. @ar
definition: 将一个个人与涉及创作一部独立或个人电影的一个个人的责任的一种作品关联起来。 @zh-hans
scope note: A filmmaker is individually responsible for the conception and execution of all aspects of the film. @en
scope note: Bir film yapımcısı, filmin tüm yönlerinin tasarlanmasından ve yürütülmesinden bireysel olarak sorumludur. @tr
scope note: Een filmmaker is zelf verantwoordelijk voor het idee en de uitvoering van alle aspecten van de film. @nl
scope note: Egy filmkészítő egyénileg felelős egy film koncepciójáért és összes aspektusának végrehajtásáért. @hu
scope note: Eine Filmemacherin/Ein Filmemacher ist persönlich für das Konzept und die Ausführung aller Aspekte des Films verantwortlich. @de
scope note: En filmskaper har personlig ansvar for planen med og gjennomføringen av alle aspektene ved filmen. @no
scope note: Filmas veidotājs ir pilnībā atbildīgs par visiem filmas koncepcijas un realizācijas aspektiem. @lv
scope note: Filmitegija vastutab üksinda kõigi filmi aspektide kontseptsiooni ja teostamise eest. @et
scope note: Filmskaberen er individuelt ansvarlig for udtænkning og udførelse af alle filmens aspekter. @da
scope note: Tekijä vastaa itse kaikilta osin elokuvan ideoinnista ja toteuttamisesta.

maisema-arkkitehti (henkilö) teoksessa
has element type: 2
toolkit definition: A work that involves a responsibility of a person for creating landscapes. @en
toolkit definition: Bir kişinin peyzaj oluşturma sorumluluğunu içeren bir eser. @tr
toolkit definition: Darbs, kas ietver personas atbildību par ainavu arhitektūras aspektiem. @lv
toolkit definition: Een werk dat met zich meebrengt een verantwoordelijkheid van een persoon voor het creëren van landschappen. @nl
toolkit definition: Egy mű, amelyhez hozzátartozik egy személy felelőssége a tájépítészet építészeti vonatkozásaiért. @hu
toolkit definition: Ein Werk, bei dem eine Person für die Schaffung von Landschaften verantwortlich ist. @de
toolkit definition: Et verk som involverer et ansvar for en person for arkitekoniske aspekter ved landskapsanlegg. @no
toolkit definition: Obra que implica una responsabilitat d’una persona en la creació de paisatges. @ca
toolkit definition: Opera che implica una responsabilità di una persona per gli aspetti architettonici del paesaggio. @it
toolkit definition: Teos, jonka maisemoinnin luomisesta henkilö on vastuussa.
toolkit definition: Teos, mis sisaldab isiku vastutust maastikukujunduse arhitektuursete aspektide eest. @et
toolkit definition: Værk, som involverer en persons ansvar for at skabe landskaber. @da
toolkit definition: Œuvre qui comporte une responsabilité de la part d’une personne consistant à créer des paysages. @fr
toolkit definition: عمل يترتب عليه مسئولية شخص عن تنسيق المواقع الخارجية. @ar
toolkit definition: 涉及创作景观的一个个人的责任的一种作品 @zh-hans
toolkit label: Person als Landschaftsarchitektin/Landschaftsarchitekt von @de
toolkit label: architetto paesaggista persona di @it
toolkit label: ir ainavu arhitekts (persona) @lv
toolkit label: landscape architect person of @en
toolkit label: landschapsarchitect-persoon van @nl
toolkit label: landskapsarkitekt for (person) @no
toolkit label: maastikuarhitekt (isik) teoses @et
toolkit label: maisema-arkkitehti (henkilö) teoksessa
toolkit label: person, som er landskabsarkitekt af @da
toolkit label: persona arquitecta paisatgista de @ca
toolkit label: personne architecte paysagiste de @fr
toolkit label: peyzaj mimarı kişi @tr
toolkit label: tájépítész személye: @hu
toolkit label: αρχιτέκτονας τοπίου φυσικό πρόσωπο του @el
toolkit label: شخص مهندس تنسيق مواقع @ar
toolkit label: ……的景观设计师个人 @zh-hans
has subproperty: P50531
lexical alias: landscapeArchitectPersonOf.en
status: Published
type: Property
domain: C10004
label: er landskapsarkitekt for (person) @no
label: er person, som er landskabsarkitekt af @da
label: est une personne architecte paysagiste de @fr
label: ir ainavu arhitekts (persona) @lv
label: is landscape architect person of @en
label: is landschapsarchitect-persoon van @nl
label: ist Person als Landschaftsarchitektin/Landschaftsarchitekt von @de
label: maastikuarhitekt (isik) teoses @et
label: peyzaj mimarı kişisidir @tr
label: tájépítész személye a következőnek: @hu
label: è architetto paesaggista persona di @it
label: és persona arquitecta paisatgista de @ca
label: είναι αρχιτέκτονας τοπίου φυσικό πρόσωπο του @el
label: هو شخص مهندس تنسيق المواقع الخارجية لـ @ar
label: 是……的景观设计师个人 @zh-hans
sub property of: maisema-arkkitehti (toimija) teoksessa
sub property of: arkkitehti (henkilö) teoksessa
definition: Bir kişiyi, bir kişinin peyzaj yaratma sorumluluğunu içeren bir eserle ilişkilendirir. @tr
definition: Correla una persona a un'opera che implica una responsabilità di una persona per gli aspetti architettonici del paesaggio. @it
definition: Hozzákapcsol egy személyt egy műhöz, amelyhez hozzátartozik egy személy felelőssége a tájépítészet építészeti vonatkozásaiért. @hu
definition: Liittää henkilön teokseen, jonka maisemoinnin luomisesta henkilö on vastuussa.
definition: Met une personne en relation avec une œuvre qui comporte une responsabilité de la part d’une personne consistant à créer des paysages. @fr
definition: Relaciona una persona amb una obra que implica una responsabilitat d’una persona en la creació de paisatges. @ca
definition: Relateert een persoon aan een werk dat met zich meebrengt een verantwoordelijkheid van een persoon voor het creëren van landschappen. @nl
definition: Relaterer en person til et verk som involverer et ansvar for en person for arkitekoniske aspekter ved landskapsanlegg. @no
definition: Relaterer en person til et værk, som involverer en persons ansvar for at skabe landskaber. @da
definition: Relates a person to a work that involves a responsibility of a person for creating landscapes. @en
definition: Sasaista personu ar darbu, kas ietver personas atbildību par ainavu arhitektūras aspektiem. @lv
definition: Seostab isiku teosega, mis sisaldab isiku vastutust maastikukujunduse arhitektuursete aspektide eest. @et
definition: Setzt eine Person in Beziehung zu einem Werk, bei dem eine Person für die Schaffung von Landschaften verantwortlich ist. @de
definition: يربط شخصا بعمل يترتب عليه مسئولية شخص عن تنسيق المواقع الخارجية. @ar
definition: 将一个个人与涉及创作景观的一个个人的责任的一种作品关联起来。 @zh-hans

käsikirjoittaja (henkilö) teoksessa
has element type: 2
toolkit definition: A work that involves a responsibility of a person for authoring a screenplay, script, or scene. @en
toolkit definition: Bir senaryo, metin veya sahne yazmak için bir kişinin sorumluluğunu içeren bir çalışma. @tr
toolkit definition: Darbs, kas ietver personas atbildību par scenārija, uzveduma plāna vai ainas radīšanu. @lv
toolkit definition: Een werk dat met zich meebrengt een verantwoordelijkheid van een persoon voor schrijven van een scenario, script of scène. @nl
toolkit definition: Egy mű, amelyhez hozzátartozik egy személy felelőssége egy forgatókönyv, szövegkönyv vagy jelenet szerzőségéért. @hu
toolkit definition: Ein Werk, bei dem eine Person für das Verfassen eines Drehbuchs, eines Skripts oder einer Szene verantwortlich ist. @de
toolkit definition: Et verk som involverer et ansvar for en person i form av å være forfatter av et skuespill, et manuskript eller en scene. @no
toolkit definition: Obra que implica una responsabilitat d’una persona en l’autoria d’un guió, un argument o una escena. @ca
toolkit definition: Opera che implica una responsabilità di una persona come autore di una sceneggiatura, copione o scena. @it
toolkit definition: Teos, jossa henkilö on vastuussa käsikirjoituksen tai kohtauksen kirjoittamisesta.
toolkit definition: Teos, mis sisaldab isiku vastutust stsenaariumi või stseeni kirjutamise eest. @et
toolkit definition: Værk, som involverer en persons ansvar for at forfatte en drejebog, et manuskript eller en scene. @da
toolkit definition: Œuvre qui comporte une responsabilité de la part d’une personne consistant à être l’auteur d’un scénario, d’un script ou d’une scène. @fr
toolkit definition: عمل يترتب عليه مسئولية شخص عن تأليف نص سينمائي، أو سيناريو، أو مشهد. @ar
toolkit definition: 涉及写作影视剧剧本、脚本或场景的一个个人的责任的一种作品 @zh-hans
toolkit label: Person als Drehbuchautorin/Drehbuchautor von @de
toolkit label: forgatókönyvíró személye: @hu
toolkit label: ir scenārists (persona) @lv
toolkit label: käsikirjoittaja (henkilö) teoksessa
toolkit label: manusforfatter for (person) @no
toolkit label: person, som er manuskriptforfatter af @da
toolkit label: persona guionista de @ca
toolkit label: personne scénariste de @fr
toolkit label: scenarioschrijver-persoon van @nl
toolkit label: sceneggiatore persona di @it
toolkit label: screenwriter person of @en
toolkit label: senarist kişi @tr
toolkit label: stsenarist (isik) teoses @et
toolkit label: σεναριογράφος φυσικό πρόσωπο του @el
toolkit label: شخص كاتب سيناريو @ar
toolkit label: ……的影视剧编剧个人 @zh-hans
has subproperty: P50532
lexical alias: screenwriterPersonOf.en
status: Published
type: Property
domain: C10004
label: er manusforfatter for (person) @no
label: er person, som er manuskriptforfatter af @da
label: est une personne scénariste de @fr
label: forgatókönyvíró személye a következőnek: @hu
label: ir scenārists (persona) @lv
label: is scenarioschrijver-persoon van @nl
label: is screenwriter person of @en
label: ist Person als Drehbuchautorin/Drehbuchautor von @de
label: senarist kişidir @tr
label: stsenarist (isik) teoses @et
label: è sceneggiatore persona di @it
label: és persona guionista de @ca
label: είναι σεναριογράφος φυσικό πρόσωπο του @el
label: هو شخص كاتب سيناريو لـ @ar
label: 是……的影视剧编剧个人 @zh-hans
sub property of: käsikirjoittaja (toimija) teoksessa
sub property of: kirjoittaja (henkilö) teoksessa
definition: Bir kişiyi, bir senaryo, oyun metni veya sahnenin yazılmasında bir kişinin sorumluluğunu içeren bir eserle ilişkilendirir. @tr
definition: Correla una persona a un'opera che implica una responsabilità di una persona come autore di una sceneggiatura, copione o scena. @it
definition: Hozzákapcsol egy személyt egy műhöz, amelyhez hozzátartozik egy személy felelőssége egy forgatókönyv, szövegkönyv vagy jelenet szerzőségéért. @hu
definition: Liittää henkilön teokseen, jossa henkilö on vastuussa käsikirjoituksen tai kohtauksen kirjoittamisesta.
definition: Met une personne en relation avec une œuvre qui comporte une responsabilité de la part d’une personne consistant à être l’auteur d’un scénario, d’un script ou d’une scène. @fr
definition: Relaciona una persona amb una obra que implica una responsabilitat d’una persona en l’autoria d’un guió, un argument o una escena. @ca
definition: Relateert een persoon aan een werk dat met zich meebrengt een verantwoordelijkheid van een persoon voor schrijven van een scenario, script of scène. @nl
definition: Relaterer en person til et verk som involverer et ansvar for en person i form av å være forfatter av et skuespill, et manuskript eller en scene. @no
definition: Relaterer en person til et værk, som involverer en persons ansvar for at forfatte en drejebog, et manuskript eller en scene. @da
definition: Relates a person to a work that involves a responsibility of a person for authoring a screenplay, script, or scene. @en
definition: Sasaista personu ar darbu, kas ietver personas atbildību par scenārija, uzveduma plāna vai ainas radīšanu. @lv
definition: Seostab isiku teosega, mis sisaldab isiku vastutust stsenaariumi või stseeni kirjutamise eest. @et
definition: Setzt eine Person in Beziehung zu einem Werk, bei dem eine Person für das Verfassen eines Drehbuchs, eines Skripts oder einer Szene verantwortlich ist. @de
definition: يربط شخصا بعمل يترتب عليه مسئولية شخص عن تأليف نص سينمائي، أو سيناريو، أو مشهد. @ar
definition: 将一个个人与涉及写作影视剧剧本、脚本或场景的一个个人的责任的一种作品关联起来。 @zh-hans

sanoittaja (henkilö) teoksessa
has element type: 2
toolkit definition: A work that involves a responsibility of a person for authoring the words of a popular song, including a song from a musical. @en
toolkit definition: Bir müzikalden bir şarkı da dahil olmak üzere popüler bir şarkının sözlerini yazmak için bir kişinin sorumluluğunu içeren bir çalışma. @tr
toolkit definition: Darbs, kas ietver personas atbildību par dziesmas vārdiem, ieskaitot dziesmas no mūzikla. @lv
toolkit definition: Een werk dat met zich meebrengt een verantwoordelijkheid van een persoon voor schrijven van de woorden van een populair lied, inclusief een lied uit een musical. @nl
toolkit definition: Egy mű, amelyhez hozzátartozik egy személy felelőssége egy könyűzenei dalszöveg szerzőségéért, musicaldalt is beleértve. @hu
toolkit definition: Ein Werk, bei dem eine Person für das Verfassen des Texts eines populären Lieds, einschließlich eines Lieds aus einem Musical, verantwortlich ist. @de
toolkit definition: Et verk som involverer et ansvar for en person i form av å være forfatter av teksten til en populær sang, inkludert en sang fra en musikal. @no
toolkit definition: Obra que implica una responsabilitat d’una persona en l’autoria d’una cançó popular, inclosa una cançó d’un musical. @ca
toolkit definition: Opera che implica una responsabilità di una persona come autore delle parole di una canzone, inclusa una canzone di un musical. @it
toolkit definition: Teos, jossa henkilö on vastuussa populaarimusiikkiin kuuluvan laulun (mukaan lukien musikaalilaulun) sanojen kirjoittamisesta.
toolkit definition: Teos, mis sisaldab isiku vastutust levilaulu (k.a laul muusikalist) sõnade kirjutamise eest. @et
toolkit definition: Værk, som involverer en persons ansvar for at forfatte ordene til en populær sang, inkl. en sang fra en musical. @da
toolkit definition: Œuvre qui comporte une responsabilité de la part d’une personne consistant à être l’auteur des paroles d’une chanson populaire, y compris une chanson d’une comédie musicale. @fr
toolkit definition: عمل يترتب عليه مسئولية شخص عن تأليف كلمات الأغنية الشعبية، بما في ذلك أغنية من مَسرحية موسيقِيّة. @ar
toolkit definition: 涉及流行歌曲（包括音乐剧中的歌曲）歌词的写作的一个个人的责任的一种作品 @zh-hans
toolkit label: Person als Textdichterin/Textdichter von @de
toolkit label: dalszövegíró személye: @hu
toolkit label: ir dziesmas teksta autors (persona) @lv
toolkit label: liedtekstschrijver-persoon van @nl
toolkit label: lyricist person of @en
toolkit label: paroliere persona di @it
toolkit label: person, som er tekstforfatter af @da
toolkit label: persona lletrista de @ca
toolkit label: personne parolière de @fr
toolkit label: sangtekstforfatter for (person) @no
toolkit label: sanoittaja (henkilö) teoksessa
toolkit label: sõnade autor (isik) teoses @et
toolkit label: söz yazarı kişisi @tr
toolkit label: στιχουργός φυσικό πρόσωπο του @el
toolkit label: شخص كاتب أغاني @ar
toolkit label: ……的歌词作者 @zh-hans
has subproperty: P50533
lexical alias: lyricistPersonOf.en
status: Published
type: Property
domain: C10004
label: dalszövegíró személye a következőnek: @hu
label: er person, som er tekstforfatter af @da
label: er sangtekstforfatter for (person) @no
label: est une personne parolière de @fr
label: ir dziesmas teksta autors (persona) @lv
label: is liedtekstschrijver-persoon van @nl
label: is lyricist person of @en
label: ist Person als Textdichterin/Textdichter von @de
label: sõnade autor (isik) teoses @et
label: söz yazarı kişisidir @tr
label: è paroliere persona di @it
label: és persona lletrista de @ca
label: είναι στιχουργός φυσικό πρόσωπο του @el
label: هو شخص كاتب أغاني لـ @ar
label: 是……的歌词作者 @zh-hans
sub property of: sanoittaja (toimija) teoksessa
sub property of: kirjoittaja (henkilö) teoksessa
definition: Bir kişiyi, bir müzikalden bir şarkı da dahil olmak üzere popüler bir şarkının sözlerini yazma sorumluluğunu içeren bir eserle ilişkilendirir. @tr
definition: Correla una persona a un'opera che implica una responsabilità di una persona come autore delle parole di una canzone, inclusa una canzone di un musical. @it
definition: Hozzákapcsol egy személyt egy műhöz, amelyhez hozzátartozik egy személy felelőssége egy könyűzenei dalszöveg szerzőségéért, musicaldalt is beleértve. @hu
definition: Liittää henkilön teokseen, jossa henkilö on vastuussa populaarimusiikkiin kuuluvan laulun (mukaan lukien musikaalilaulun) sanojen kirjoittamisesta.
definition: Met une personne en relation avec une œuvre qui comporte une responsabilité de la part d’une personne consistant à être l’auteur des paroles d’une chanson populaire, y compris une chanson d’une comédie musicale. @fr
definition: Relaciona una persona amb una obra que implica una responsabilitat d’una persona en l’autoria d’una cançó popular, inclosa una cançó d’un musical. @ca
definition: Relateert een persoon aan een werk dat met zich meebrengt een verantwoordelijkheid van een persoon voor schrijven van de woorden van een populair lied, inclusief een lied uit een musical. @nl
definition: Relaterer en person til et verk som involverer et ansvar for en person i form av å være forfatter av teksten til en populær sang, inkludert en sang fra en musikal. @no
definition: Relaterer en person til et værk, som involverer en persons ansvar for at forfatte ordene til en populær sang, inkl. en sang fra en musical. @da
definition: Relates a person to a work that involves a responsibility of a person for authoring the words of a popular song, including a song from a musical. @en
definition: Sasaista personu ar darbu, kas ietver personas atbildību par dziesmas vārdiem, ieskaitot dziesmas no mūzikla. @lv
definition: Seostab isiku teosega, mis sisaldab isiku vastutust levilaulu (k.a laul muusikalist) sõnade kirjutamise eest. @et
definition: Setzt eine Person in Beziehung zu einem Werk, bei dem eine Person für das Verfassen des Texts eines populären Lieds, einschließlich eines Lieds aus einem Musical, verantwortlich ist. @de
definition: يربط شخصا بعمل يترتب عليه مسئولية شخص عن تأليف كلمات الأغنية الشعبية، بما في ذلك أغنية من مَسرحية موسيقِيّة. @ar
definition: 将一个个人与涉及流行歌曲（包括音乐剧中的歌曲）歌词的写作的一个个人的责任的一种作品关联起来。 @zh-hans
scope note: At forfatte kun dialogen til en musical er ikke omfattet. @da
scope note: Authoring of only the dialogue from a musical is excluded. @en
scope note: Bir müzikalde yalnızca diyaloglarının yazılması hariçtir. @tr
scope note: Det å bare skrive dialogen fra en musikal, er ikke inkludert. @no
scope note: Ei hõlma üksnes muusikali dialoogide kirjutamist. @et
scope note: Ei kata pelkän musikaalin dialogin kirjoittajaa.
scope note: Le fait d’être l’auteur uniquement des dialogues d’une comédie musicale est exclu. @fr
scope note: Musical párbeszédeinek szerzősége nem tartozik ide. @hu
scope note: Neietver mūzikla dialogus. @lv
scope note: Nur das Verfassen des Dialogs eines Musicals fällt nicht darunter. @de

libretisti (henkilö) teoksessa
has element type: 2
toolkit definition: A work that involves a responsibility of a person for authoring the words of an opera or other musical stage work, or an oratorio. @en
toolkit definition: Bir opera veya diğer müzikal sahne eserinin veya bir oratoryonun sözlerinin yazılmasında bir kişinin sorumluluğunu içeren bir eser. @tr
toolkit definition: Darbs, kas ietver personas atbildību par tekstu operai vai citam muzikālam skatuves darbam, vai oratorijai. @lv
toolkit definition: Een werk dat met zich meebrengt een verantwoordelijkheid van een persoon voor schrijven van de woorden van een opera of ander muzikaal podiumwerk of een oratorium. @nl
toolkit definition: Egy mű, amelyhez hozzátartozik egy személy felelőssége egy opera vagy más zenés színpadi mű vagy egy oratórium szövegének szerzőségéért. @hu
toolkit definition: Ein Werk, bei dem eine Person für das Verfassen des Texts einer Oper, eines sonstigen Bühnenwerks oder eines Oratoriums verantwortlich ist. @de
toolkit definition: Et verk som involverer et ansvar for en person i form av å være forfatter av ordene i en opera eller annet verk for en musikalsk scene, eller et oriatorium. @no
toolkit definition: Obra que implica una responsabilitat d’una persona en l’autoria de les paraules d’una òpera o una altra obra escènica musical o d’un oratori. @ca
toolkit definition: Opera che implica una responsabilità di una persona come autore dei testi di un'opera lirica, altra opera musicale da palcoscenico o oratorio. @it
toolkit definition: Teos, jossa henkilö on vastuussa musiikki- tai koreografisen teoksen, kuten oopperan, baletin tai muun musiikillisen näyttämöteoksen tai oratorion sanojen kirjoittamisesta.
toolkit definition: Teos, mis sisaldab isiku vastutust ooperi või muu muusikalise lavateose või oratooriumi sõnade kirjutamise eest. @et
toolkit definition: Værk, som involverer en persons ansvar for at forfatte ordene til en opera eller andet musikalsk sceneværk eller et oratorium. @da
toolkit definition: Œuvre qui comporte une responsabilité de la part d’une personne consistant à être l’auteur des paroles d’un opéra ou d’une autre œuvre musicale scénique ou d’un oratorio. @fr
toolkit definition: عمل يترتب عليه مسئولية شخص عن تأليف كلمات الأوبرا أو غيرها من أعمال المسرح الموسيقي، أو موشحات دينية. @ar
toolkit definition: 涉及歌剧或其他舞台音乐作品或者清唱剧的歌词的写作的一个个人的责任的一种作品 @zh-hans
toolkit label: Opera metni yazarı @tr
toolkit label: Person als Librettistin/Librettist von @de
toolkit label: ir libretists (persona) @lv
toolkit label: libretist (isik) teoses @et
toolkit label: libretisti (henkilö) teoksessa
toolkit label: librettist for (person) @no
toolkit label: librettist person of @en
toolkit label: librettist-persoon van @nl
toolkit label: librettista persona di @it
toolkit label: librettista személye: @hu
toolkit label: person, som er librettist af @da
toolkit label: persona llibretista de @ca
toolkit label: personne librettiste de @fr
toolkit label: λιμπρετίστας φυσικό πρόσωπο του @el
toolkit label: شخص واضع كلمات الأوبرا @ar
toolkit label: ……的台本作者个人 @zh-hans
has subproperty: P50534
lexical alias: librettistPersonOf.en
status: Published
type: Property
domain: C10004
label: er librettist for (person) @no
label: er person, som er librettist af @da
label: est une personne librettiste de @fr
label: ir libretists (persona) @lv
label: is librettist person of @en
label: is librettist-persoon van @nl
label: ist Person als Librettistin/Librettist von @de
label: libretist (isik) teoses @et
label: librettista személye a következőnek: @hu
label: libretto yazarı kişisidir @tr
label: è librettista persona di @it
label: és persona llibretista de @ca
label: είναι λιμπρετίστας φυσικό πρόσωπο του @el
label: هو شخص واضع كلمات الأوبرا لـ @ar
label: 是……的台本作者个人 @zh-hans
sub property of: libretisti (toimija) teoksessa
sub property of: kirjoittaja (henkilö) teoksessa
definition: Bir kişiyi, bir operanın veya başka bir müzikalin veya bir oratoryonun yazma sorumluluğunu içeren bir eserle ilişkilendirir @tr
definition: Correla una persona a un'opera che implica una responsabilità di una persona come autore dei testi di un'opera lirica, altra opera musicale da palcoscenico o oratorio. @it
definition: Hozzákapcsol egy személyt egy műhöz, amelyhez hozzátartozik egy személy felelőssége egy opera vagy más zenés színpadi mű vagy egy oratórium szövegének szerzőségéért. @hu
definition: Liittää henkilön teokseen, jossa henkilö on vastuussa musiikki- tai koreografisen teoksen, kuten oopperan, baletin tai muun musiikillisen näyttämöteoksen tai oratorion sanojen kirjoittamisesta.
definition: Met une personne en relation avec une œuvre qui comporte une responsabilité de la part d’une personne consistant à être l’auteur des paroles d’un opéra ou d’une autre œuvre musicale scénique ou d’un oratorio. @fr
definition: Relaciona una persona amb una obra que implica una responsabilitat d’una persona en l’autoria de les paraules d’una òpera o una altra obra escènica musical o d’un oratori. @ca
definition: Relateert een persoon aan een werk dat met zich meebrengt een verantwoordelijkheid van een persoon voor schrijven van de woorden van een opera of ander muzikaal podiumwerk of een oratorium. @nl
definition: Relaterer en person til et verk som involverer et ansvar for en person i form av å være forfatter av ordene i en opera eller annet verk for en musikalsk scene, eller et oriatorium. @no
definition: Relaterer en person til et værk, som involverer en persons ansvar for at forfatte ordene til en opera eller andet musikalsk sceneværk eller et oratorium. @da
definition: Relates a person to a work that involves a responsibility of a person for authoring the words of an opera or other musical stage work, or an oratorio. @en
definition: Sasaista personu ar darbu, kas ietver personas atbildību par tekstu operai vai citam muzikālam skatuves darbam, vai oratorijai. @lv
definition: Seostab isiku teosega, mis sisaldab isiku vastutust ooperi või muu muusikalise lavateose või oratooriumi sõnade kirjutamise eest. @et
definition: Setzt eine Person in Beziehung zu einem Werk, bei dem eine Person für das Verfassen des Texts einer Oper, eines sonstigen Bühnenwerks oder eines Oratoriums verantwortlich ist. @de
definition: يربط شخصا بعمل يترتب عليه مسئولية شخص عن تأليف كلمات الأوبرا أو غيرها من أعمال المسرح الموسيقي، أو موشحات دينية @ar
definition: 将一个个人与涉及歌剧或其他舞台音乐作品或者清唱剧的歌词的写作的一个个人的责任的一种作品关联起来。 @zh-hans

teoksen omistuksen kohde (henkilö) teoksessa
has element type: 2
toolkit definition: A work that involves a responsibility of a person for being commemorated. @en
toolkit definition: Bir kişinin anılma sorumluluğunu içeren bir eser. @tr
toolkit definition: Darbs, kas ietver personas atbildību par tai adresēto veltījumu. @lv
toolkit definition: Een werk dat met zich meebrengt een verantwoordelijkheid van een persoon om herdacht te worden. @nl
toolkit definition: Egy mű, amely magában foglalja egy személynek azt a felelősségét, amiért megemlékeznek róla. @hu
toolkit definition: Ein Werk, das einer Person gewidmet ist. @de
toolkit definition: Et verk som involverer et ansvar for en person i form av å bli hedret. @no
toolkit definition: Obra que implica una responsabilitat d’una persona de ser commemorat. @ca
toolkit definition: Opera che implica una responsabilità di una persona per essere commemorata. @it
toolkit definition: Teos, joka on omistettu henkilölle.
toolkit definition: Teos, mis on isikule pühendatud. @et
toolkit definition: Værk, som involverer en persons ansvar for at blive fejret. @da
toolkit definition: Œuvre qui comporte une responsabilité de la part d’une personne consistant à être commémoré. @fr
toolkit definition: عمل يترتب عليه مسئولية شخص عن الاحتفال به. @ar
toolkit definition: 涉及被纪念的一个个人的责任的一种作品 @zh-hans
toolkit label: Person als Widmungsempfängerin/Widmungsempfänger eines Werks von @de
toolkit label: dedicatario persona di opera di @it
toolkit label: dedicatee person of work of @en
toolkit label: dedikált személye a következő műnek: @hu
toolkit label: eserin adandığı kişi @tr
toolkit label: ir veltījuma adresāts (persona) darbā @lv
toolkit label: opgedragene-persoon van werk van @nl
toolkit label: person som verk er tilegnet til @no
toolkit label: person, som er tilegnet i værk af @da
toolkit label: persona dedicatària d’una obra de @ca
toolkit label: personne dédicataire d’une œuvre de @fr
toolkit label: teoksen omistuksen kohde (henkilö) teoksessa
toolkit label: teose pühenduse saaja (isik) teoses @et
toolkit label: αποδέκτης αφιέρωσης φυσικό πρόσωπο του έργου του @el
toolkit label: شخص مُهدى إليه عمل لـ @ar
toolkit label: ……的作品的被题献者个人 @zh-hans
has subproperty: P50535
lexical alias: dedicateePersonOfWorkOf.en
status: Published
type: Property
domain: C10004
label: dedikált személye a következő műnek: @hu
label: er person som verk er tilegnet til @no
label: er person, som er tilegnet i værk af @da
label: eserinin ithaf edilen kişisidir @tr
label: est une personne dédicataire d’une œuvre de @fr
label: ir veltījuma adresāts (persona) darbā @lv
label: is dedicatee person of work of @en
label: is opgedragene-persoon van werk van @nl
label: ist Person als Widmungsempfängerin/Widmungsempfänger eines Werks von @de
label: teose pühenduse saaja (isik) teoses @et
label: è dedicatario persona di opera di @it
label: és persona dedicatària d’una obra de @ca
label: είναι αποδέκτης αφιέρωσης φυσικό πρόσωπο του έργου του @el
label: هو شخص مُهدى إليه عمل لـ @ar
label: 是……的作品的被题献者个人 @zh-hans
sub property of: teoksen omistuksen kohde (toimija) teoksessa
sub property of: henkilöön liittyvä teos
definition: Bir kişiyi, anılması gereken bir sorumluluğunu içeren bir eserle ilişkilendirir. @tr
definition: Correla una persona a un'opera che implica una responsabilità di una persona per essere commemorata. @it
definition: Hozzákapcsol egy személyt egy műhöz, amely magában foglalja egy személynek azt a felelősségét, amiért megemlékeznek róla. @hu
definition: Liittää henkilön teokseen, joka on omistettu henkilölle.
definition: Met une personne en relation avec une œuvre qui comporte une responsabilité de la part d’une personne consistant à être commémoré. @fr
definition: Relaciona una persona amb una obra que implica una responsabilitat d’una persona de ser commemorat. @ca
definition: Relateert een persoon aan een werk dat met zich meebrengt een verantwoordelijkheid van een persoon om herdacht te worden. @nl
definition: Relaterer en person til et verk som involverer et ansvar for en person i form av å bli hedret. @no
definition: Relaterer en person til et værk, som involverer en persons ansvar for at blive fejret. @da
definition: Relates a person to a work that involves a responsibility of a person for being commemorated. @en
definition: Sasaista personu ar darbu, kas ietver personas atbildību par tai adresēto veltījumu. @lv
definition: Seostab isiku teosega, mis on isikule pühendatud. @et
definition: Setzt eine Person in Beziehung zu einem Werk, das einer Person gewidmet ist. @de
definition: يربط شخصا بعمل يترتب عليه مسئولية شخص عن الاحتفال به. @ar
definition: 将一个个人与涉及被纪念的一个个人的责任的一种作品关联起来。 @zh-hans

kalligrafi (henkilö) teoksessa
has element type: 2
toolkit definition: A work that involves a responsibility of a person for calligraphy where the focus of interest lies in the aesthetic value of the penmanship or graphic artistry, regardless of whether the same person is also responsible for the inscribed text. @en
toolkit definition: Darbs, kas ietver personas atbildību par kaligrāfiju, kurā galvenā uzmanība tiek pievērsta mākslinieciskās vai grafiskās meistarības estētiskajai vērtībai, neatkarīgi no tā, vai tā pati grupa ir atbildīgs arī par uzrakstīto tekstu @lv
toolkit definition: Een werk dat met zich meebrengt een verantwoordelijkheid van een persoon voor kalligrafie waar de aandacht primair uitgaat naar de esthetische waarde van de schrijfkunst of grafische kunstenaarschap, ongeacht of dezelfde persoon ook verantwoordelijk is voor de inscriptie. @nl
toolkit definition: Egy mű, amelyhez hozzátartozik egy személy szépírással kapcsolatos felelőssége, ahol az érdeklődés középpontjában a kézírás esztétikai értéke vagy a grafika művészisége áll, tekintet nélkül arra, hogy ugyanaz a személy a lejegyzett szöveg szerzője is egyben vagy sem. @hu
toolkit definition: Ein Werk, bei dem eine Person für die Kalligrafie verantwortlich ist, bei der der ästhetische Wert der Schreibkunst oder die grafische Kunstfertigkeit im Mittelpunkt des Interesses liegt, unabhängig davon, ob dieselbe Person auch für den aufgeschriebenen Text verantwortlich ist. @de
toolkit definition: Et verk som involverer et ansvar for en person i form av kalligrafi der fokus er på den estetiske verdien av pennekunsten eller kunstnerisk dyktighet, uavhengig av om den samme personen også er ansvarlig for tekstinnholdet. @no
toolkit definition: Obra que implica una responsabilitat d’una persona en la cal·ligrafia on el centre de l’interès se situa en el valor estètic de la cal·ligrafia o del grafisme, independentment de si la mateixa persona és també responsable del text inscrit. @ca
toolkit definition: Opera che implica una responsabilità di una persona nella calligrafia dove il focus dell'interesse risiede nel valore estetico della scrittura o della perizia grafica, a prescindere che la stessa persona sia responsabile anche del testo scritto. @it
toolkit definition: Teos, jossa toimija on vastuussa kalligrafiasta, jossa pääpaino on käsin kirjoittamisen tai graafisen taiteen esteettisissä arvoissa, riippumatta siitä, onko sama toimija myös vastuussa kirjoitetusta tekstistä.
toolkit definition: Teos, mis sisaldab isiku vastutust ilukirja eest. Ilukirja põhirõhk on kirjakunsti või graafilise kunstnikutöö esteetilisel väärtusel, olenemata sellest, kas sama isik on vastutav ka kirjutatud teksti eest. @et
toolkit definition: Værk, som involverer en persons ansvar for kalligrafi, hvor fokus ligger på den æstetiske værdi af skrivekunsten eller den kunstneriske grafiske dygtighed, uagtet om den samme person også har forfattet den indskrevne tekst. @da
toolkit definition: Yazılı metinden aynı kişinin sorumlu olup olmadığına bakılmaksızın, ilgi odağı hattatlığın veya grafik sanatının estetik değerinde olan hat sanatı için bir kişinin sorumluluğunu içeren bir eser. @tr
toolkit definition: Œuvre qui comporte une responsabilité de la part d’une personne en ce qui concerne la calligraphie où l’accent est mis sur la valeur esthétique de la calligraphie ou du graphisme, peu importe que la même personne soit aussi responsable du texte calligraphié. @fr
toolkit definition: عمل يترتب عليه مسئولية شخص عن الخطاطة، حيث ينصب الاهتمام على القيمة الجمالية لفن الخط أو الرسم، عن مسئولية هذا الوكيل أيضًا عن النص المكتوب. @ar
toolkit definition: 涉及书法（其中兴趣重点是书法或图形艺术的美学价值，不管同一个人是否负责题写文字）的一个个人的责任的一种作品 @zh-hans
toolkit label: Person als Kalligrafin/Kalligraf von @de
toolkit label: calligrafo persona di @it
toolkit label: calligrapher person of @en
toolkit label: ir kaligrāfs (persona) @lv
toolkit label: kaligraf @tr
toolkit label: kalligraaf (isik) teoses @et
toolkit label: kalligraaf-persoon van @nl
toolkit label: kalligraf for (person) @no
toolkit label: kalligrafi (henkilö) teoksessa
toolkit label: kalligráfus személye: @hu
toolkit label: person, som er kalligraf af @da
toolkit label: persona cal·lígrafa de @ca
toolkit label: personne calligraphe de @fr
toolkit label: καλλιγράφος φυσικό πρόσωπο του @el
toolkit label: شخص خطاط @ar
toolkit label: ……的书法者个人 @zh-hans
has subproperty: P50536
lexical alias: calligrapherPersonOf.en
status: Published
type: Property
domain: C10004
label: er kalligraf for (person) @no
label: er person, som er kalligraf af @da
label: est une personne calligraphe de @fr
label: ir kaligrāfs (persona) @lv
label: is calligrapher person of @en
label: is kalligraaf-persoon van @nl
label: ist Person als Kalligrafin/Kalligraf von @de
label: kaligraf kişisidir @tr
label: kalligraaf (isik) teoses @et
label: kalligráfus személye a következőnek: @hu
label: è calligrafo persona di @it
label: és persona cal·lígrafa de @ca
label: είναι καλλιγράφος φυσικό πρόσωπο του @el
label: هو شخص خطاط لـ @ar
label: 是……的书法者个人 @zh-hans
sub property of: kalligrafi (toimija) teoksessa
sub property of: taiteilija (henkilö) teoksessa
definition: Bir kişiyi, aynı kişinin yazılı metinden de sorumlu olup olmadığına bakılmaksızın, ilgi odağının hattatlığın veya grafik sanatının estetik değerinde olduğu hat sanatı için bir kişinin sorumluluğunu içeren bir eserle ilişkilendirir. @tr
definition: Correla una persona a un'opera che implica una responsabilità di una persona nella calligrafia dove l'interesse risiede nel valore estetico della scrittura o della perizia grafica, a prescindere che la stessa persona sia responsabile anche del testo scritto. @it
definition: Hozzákapcsol egy személyt egy műhöz, amelyhez hozzátartozik egy személy szépírással kapcsolatos felelőssége, ahol az érdeklődés középpontjában a kézírás esztétikai értéke vagy a grafika művészisége áll, tekintet nélkül arra, hogy ugyanaz a személy a lejegyzett szöveg szerzője is egyben vagy sem. @hu
definition: Liittää henkilön teokseen, jossa toimija on vastuussa kalligrafiasta, jossa pääpaino on käsin kirjoittamisen tai graafisen taiteen esteettisissä arvoissa, riippumatta siitä, onko sama toimija myös vastuussa kirjoitetusta tekstistä.
definition: Met une personne en relation avec une œuvre qui comporte une responsabilité de la part d’une personne en ce qui concerne la calligraphie où l’accent est mis sur la valeur esthétique de la calligraphie ou du graphisme, peu importe que la même personne soit aussi responsable du texte calligraphié. @fr
definition: Relaciona una persona amb una obra que implica una responsabilitat d’una persona en la cal·ligrafia on el centre de l’interès se situa en el valor estètic de la cal·ligrafia o del grafisme, independentment de si la mateixa persona és també responsable del text inscrit. @ca
definition: Relateert een persoon aan een werk dat met zich meebrengt een verantwoordelijkheid van een persoon voor kalligrafie waar de aandacht primair uitgaat naar de esthetische waarde van de schrijfkunst of grafische kunstenaarschap, ongeacht of dezelfde persoon ook verantwoordelijk is voor de inscriptie. @nl
definition: Relaterer en person til et verk som involverer et ansvar for en person i form av kalligrafi der fokus er på den estetiske verdien av pennekunsten eller kunstnerisk dyktighet, uavhengig av om den samme personen også er ansvarlig for tekstinnholdet. @no
definition: Relaterer en person til et værk, som involverer en persons ansvar for kalligrafi, hvor fokus ligger på den æstetiske værdi af skrivekunsten eller den kunstneriske grafiske dygtighed, uagtet om den samme person også har forfattet den indskrevne tekst. @da
definition: Relates a person to a work that involves a responsibility of a person for calligraphy where the focus of interest lies in the aesthetic value of the penmanship or graphic artistry, regardless of whether the same person is also responsible for the inscribed text. @en
definition: Sasaista personu ar darbu, kas ietver personas atbildību par kaligrāfiju, kurā galvenā uzmanība tiek pievērsta mākslinieciskās vai grafiskās meistarības estētiskajai vērtībai, neatkarīgi no tā, vai tā pati grupa ir atbildīgs arī par uzrakstīto tekstu. @lv
definition: Seostab isiku teosega, mis sisaldab isiku vastutust ilukirja eest. Ilukirja põhirõhk on kirjakunsti või graafilise kunstnikutöö esteetilisel väärtusel, olenemata sellest, kas sama isik on vastutav ka kirjutatud teksti eest. @et
definition: Setzt eine Person in Beziehung zu einem Werk, bei dem eine Person für die Kalligrafie verantwortlich ist, bei der der ästhetische Wert der Schreibkunst oder die grafische Kunstfertigkeit im Mittelpunkt des Interesses liegt, unabhängig davon, ob dieselbe Person auch für den aufgeschriebenen Text verantwortlich ist. @de
definition: يربط شخصا بعمل يترتب عليه مسئولية شخص عن الخطاطة، حيث ينصب الاهتمام على القيمة الجمالية لفن الخط أو الرسم، بغض النظر عن مسئولية هذا الوكيل أيضًا عن النص المكتوب. @ar
definition: 将一个个人与涉及书法（其中兴趣重点是书法或图形艺术的美学价值，不管同一个人是否负责题写文字）的一个个人的责任的一种作品关联起来。 @zh-hans

kuvaaja (henkilö) teoksessa
has element type: 2
toolkit definition: A work that involves a responsibility of a person for capturing images, either electronically or on film or video stock, and often selecting and arranging the lighting. @en
toolkit definition: Darbs, kas ietver personas atbildību par attēlu uzņemšanu elektroniski vai uz filmas, vai video un bieži izvēlas, un izvieto apgaismojumu. @lv
toolkit definition: Een werk dat met zich meebrengt een verantwoordelijkheid van een persoon voor het vastleggen van beelden, elektronisch of op film- of videomateriaal, en vaak het selecteren en arrangeren van de belichting. @nl
toolkit definition: Egy mű, amelyhez hozzátartozik egy személy felelőssége képek elektronikusan, filmen vagy videoállományon történő rögzítéséért, gyakran a világítás kiválasztásáért és elrendezéséért is. @hu
toolkit definition: Ein Werk, bei dem eine Person für die Aufzeichnung von Bildern, entweder elektronisch oder auf Film- oder Videomaterial, verantwortlich ist und häufig die Belichtung auswählt und arrangiert. @de
toolkit definition: Elektronik olarak veya film veya video stoğunda görüntü yakalamak ve genellikle aydınlatmayı seçmek ve düzenlemek için bir kişinin sorumluluğunu içeren bir çalışma. @tr
toolkit definition: Et verk som involverer et ansvar for en person i form av å ta bilder, enten elektronisk eller på film eller video, og som ofte velger og arrangerer lyssetting. @no
toolkit definition: Obra que implica una responsabilitat d’una persona en la captura d’imatges, ja sigui electrònicament o sobre pel·lícula o vídeo, i que sovint selecciona i organitza la il·luminació. @ca
toolkit definition: Opera che implica una responsabilità di una persona per l'acquisizione di immagini, elettronicamente o su pellicola o video, e spesso nella scelta e organizzazione dell'illuminazione. @it
toolkit definition: Teos, jossa henkilö on vastuussa kuvien tallentamisesta joko sähköisesti tai filmille tai videolle, usein myös valaistuksen valitsemisesta ja järjestämisestä.
toolkit definition: Teos, mis sisaldab isiku vastutust pildi jäädvustamise eest kas elektrooniliselt või filmi- või videolindile ning sageli valgustuse valimise ja ülesseadmise eest. @et
toolkit definition: Værk, som involverer en persons ansvar for at optage billeder, enten elektronisk eller på film eller video, og ofte også for at udvælge og arrangere lyssætningen. @da
toolkit definition: Œuvre qui comporte une responsabilité de la part d’une personne consistant à capter des images, de manière électronique ou bien sur film ou vidéo, et qui, souvent, choisit et dispose l’éclairage. @fr
toolkit definition: عمل يترتب عليه مسئولية شخص عن التقاط الصور، إما إلكترونيًا أو في فيلم أو في مقاطع فيديو، وغالبا ما يكون مسئولا عن اختيار الإضاءة وتوزيعها. @ar
toolkit definition: 涉及通过电子、胶片或视频存储方式摄录影像、且经常负责灯光的选择和布置的一个个人的责任的一种作品 @zh-hans
toolkit label: Person als Kamerafrau/Kameramann von @de
toolkit label: cameraregisseur-persoon van @nl
toolkit label: director person of photography of @en
toolkit label: direttore della fotografia persona di @it
toolkit label: filmfotograf for (person) @no
toolkit label: görüntü yönetmeni @tr
toolkit label: ir kinooperators (persona) @lv
toolkit label: kuvaaja (henkilö) teoksessa
toolkit label: operaator-lavastaja (isik) teoses @et
toolkit label: operatőr személye: @hu
toolkit label: person, som er filmfotograf af @da
toolkit label: persona directora de fotografia de @ca
toolkit label: personne directrice de la photographie de @fr
toolkit label: διευθυντής φωτογραφίας φυσικό πρόσωπο του @el
toolkit label: شخص مدير التصوير @ar
toolkit label: ……的摄影指导个人 @zh-hans
has subproperty: P50537
lexical alias: directorPersonOfPhotographyOf.en
status: Published
type: Property
domain: C10004
label: er filmfotograf for (person) @no
label: er person, som er filmfotograf af @da
label: est une personne directrice de la photographie de @fr
label: görüntü yönetmeni kişisidir @tr
label: ir kinooperators (persona) @lv
label: is cameraregisseur-persoon van @nl
label: is director person of photography of @en
label: ist Person als Kamerafrau/Kameramann von @de
label: operaator-lavastaja (isik) teoses @et
label: operatőr személye a következőnek: @hu
label: è direttore persona della fotografia di @it
label: és persona directora de fotografia de @ca
label: είναι διευθυντής φωτογραφίας φυσικό πρόσωπο του @el
label: هو شخص مدير تصوير لـ @ar
label: 是……的摄影指导个人 @zh-hans
sub property of: kuvaaja (toimija) teoksessa
sub property of: henkilöön liittyvä teos
definition: Bir kişiyi, elektronik olarak veya film veya video stoku üzerinde fotoğraf çekme ve genellikle aydınlatmayı seçme ve düzenleme sorumluluğunu içeren bir eserle ilişkilendirir. @tr
definition: Correla una persona a un'opera che implica una responsabilità di una persona per l'acquisizione di immagini, elettronicamente o su pellicola o video, e spesso nella scelta e organizzazione dell'illuminazione. @it
definition: Hozzákapcsol egy személyt egy műhöz, amelyhez hozzátartozik egy személy felelőssége képek elektronikusan, filmen vagy videoállományon történő rögzítéséért, gyakran a világítás kiválasztásáért és elrendezéséért is. @hu
definition: Liittää henkilön teokseen, jossa henkilö on vastuussa kuvien tallentamisesta joko sähköisesti tai filmille tai videolle, usein myös valaistuksen valitsemisesta ja järjestämisestä.
definition: Met une personne en relation avec une œuvre qui comporte une responsabilité de la part d’une personne consistant à capter des images, de manière électronique ou bien sur film ou vidéo, et qui, souvent, choisit et dispose l’éclairage. @fr
definition: Relaciona una persona amb una obra que implica una responsabilitat d’una persona en la captura d’imatges, ja sigui electrònicament o sobre pel·lícula o vídeo, i que sovint selecciona i organitza la il·luminació. @ca
definition: Relateert een persoon aan een werk dat met zich meebrengt een verantwoordelijkheid van een persoon voor het vastleggen van beelden, elektronisch of op film- of videomateriaal, en vaak het selecteren en arrangeren van de belichting. @nl
definition: Relaterer en person til et verk som involverer et ansvar for en person i form av å ta bilder, enten elektronisk eller på film eller video, og som ofte velger og arrangerer lyssetting. @no
definition: Relaterer en person til et værk, som involverer en persons ansvar for at optage billeder, enten elektronisk eller på film eller video, og ofte også for at udvælge og arrangere lyssætningen. @da
definition: Relates a person to a work that involves a responsibility of a person for capturing images, either electronically or on film or video stock, and often selecting and arranging the lighting. @en
definition: Sasaista personu ar darbu, kas ietver personas atbildību par attēlu uzņemšanu elektroniski vai uz filmas, vai video un bieži izvēlas, un izvieto apgaismojumu. @lv
definition: Seostab isiku teosega, mis sisaldab isiku vastutust pildi jäädvustamise eest kas elektrooniliselt või filmi- või videolindile ning sageli valgustuse valimise ja ülesseadmise eest. @et
definition: Setzt eine Person in Beziehung zu einem Werk, bei dem eine Person für die Aufzeichnung von Bildern, entweder elektronisch oder auf Film- oder Videomaterial, verantwortlich ist und häufig die Belichtung auswählt und arrangiert. @de
definition: يربط شخصا بعمل يترتب عليه مسئولية شخص عن التقاط الصور، إما إلكترونيًا أو في فيلم أو في مقاطع فيديو، وغالبا ما يكون مسئولا عن اختيار الإضاءة وتوزيعها. @ar
definition: 将一个个人与涉及通过电子、胶片或视频存储方式摄录影像、且经常负责灯光的选择和布置的一个个人的责任的一种作品关联起来。 @zh-hans
scope note: A director of photography for a movie is also called a chief cinematographer. @en
scope note: Bir filmin görüntü yönetmeni aynı zamanda, baş sinematograf olarak adlandırılır. @tr
scope note: Een cameraregisseur bij een film wordt ook director of photography of hoofdcinematograaf genoemd. @nl
scope note: Egy film operatőrét vezető operatőrnek is nevezik. @hu
scope note: Eine Kamerafrau/Ein Kameramann für einen Film wird auch als "Bildregisseurin/Bildregisseur" bezeichnet. @de
scope note: Elokuvan kuvaajaa kutsutaan myös elokuvaajaksi.
scope note: Filmfotografen for en film kalles også sjefsfotograf. @no
scope note: Filmfotografen på en film kaldes også for en cheffotograf. @da
scope note: Filmi operaator-lavastajat nimetatakse inglise keeles sageli ka chief cinematographer. @et
scope note: Kinooperatoru mēdz saukt arī par galveno operatoru. @lv

toimeksiantaja (henkilö) teoksessa
has element type: 2
toolkit definition: A work that involves a responsibility of a person for commissioning a work. @en
toolkit definition: Bir eser için bir kişinin sorumluluğunu içeren bir çalışma. @tr
toolkit definition: Darbs, kas ietver personas atbildību par darba pasūtīšanu. @lv
toolkit definition: Een werk dat met zich meebrengt een verantwoordelijkheid van een persoon voor opdracht geven tot een werk. @nl
toolkit definition: Egy mű, amelyhez hozzátartozik egy személy felelőssége egy mű megrendeléséért. @hu
toolkit definition: Ein Werk, bei dem eine Person dafür verantwortlich ist, ein Werk in Auftrag zu geben. @de
toolkit definition: Et verk som involverer et ansvar for en person i form av å bestille et verk. @no
toolkit definition: Obra que implica una responsabilitat d’una persona d’encarregar una obra. @ca
toolkit definition: Opera che implica una responsabilità di una persona nella committenza di un'opera. @it
toolkit definition: Teos, jossa henkilö on vastuussa teoksen teettämisestä.
toolkit definition: Teos, mis sisaldab isiku vastutust teose tellimise eest. @et
toolkit definition: Værk, som involverer en persons ansvar for at bestille et værk. @da
toolkit definition: Œuvre qui comporte une responsabilité de la part d’une personne consistant à commander une œuvre. @fr
toolkit definition: عمل يترتب عليه مسئولية شخص عن إصدار التكليف بعمل @ar
toolkit definition: 涉及委托一种作品的一个个人的责任的一种作品 @zh-hans
toolkit label: Person als Auftraggeberin/Auftraggeber von @de
toolkit label: commissioning person of @en
toolkit label: ente committente persona di @it
toolkit label: görevlendiren kişi @tr
toolkit label: ir pasūtītājs (persona) @lv
toolkit label: megrendelő személye: @hu
toolkit label: opdrachtgever-persoon van @nl
toolkit label: oppdragsgiver for (person) @no
toolkit label: person, som er opgavestiller af @da
toolkit label: persona comitent de @ca
toolkit label: personne commanditaire de @fr
toolkit label: tellija (isik) teoses @et
toolkit label: toimeksiantaja (henkilö) teoksessa
toolkit label: αναθέτων όργανο φυσικό πρόσωπο του @el
toolkit label: شخص جهة تكليف @ar
toolkit label: ……的委托个人 @zh-hans
has subproperty: P50538
lexical alias: commissioningPersonOf.en
status: Published
type: Property
domain: C10004
label: er oppdragsgiver for (person) @no
label: er person, som er opgavestiller af @da
label: est une personne commanditaire de @fr
label: görevlendiren kişisidir @tr
label: ir pasūtītājs (persona) @lv
label: is commissioning person of @en
label: is opdrachtgever-persoon van @nl
label: ist Person als Auftraggeberin/Auftraggeber von @de
label: megrendelő személye a következőnek: @hu
label: tellija (isik) teoses @et
label: è ente committente persona di @it
label: és persona comitent de @ca
label: είναι προσληφθέν όργανο φυσικό πρόσωπο του @el
label: هو شخص جهة تكليف لـ @ar
label: 是……的委托个人 @zh-hans
sub property of: toimeksiantaja (toimija) teoksessa
sub property of: henkilöön liittyvä teos
definition: Bir kişiyi, görevlendirmek için kişinin sorumluluğunu içeren bir eserle ilişkilendirir. @tr
definition: Correla una persona a un'opera che implica una responsabilità di una persona nella committenza di un'opera. @it
definition: Hozzákapcsol egy személyt egy műhöz, amelyhez hozzátartozik egy személy felelőssége egy mű megrendeléséért. @hu
definition: Liittää henkilön teokseen, jossa henkilö on vastuussa teoksen teettämisestä.
definition: Met une personne en relation avec une œuvre qui comporte une responsabilité de la part d’une personne consistant à commander une œuvre. @fr
definition: Relaciona una persona amb una obra que implica una responsabilitat d’una persona d’encarregar una obra. @ca
definition: Relateert een persoon aan een werk dat met zich meebrengt een verantwoordelijkheid van een persoon voor opdracht geven tot een werk. @nl
definition: Relaterer en person til et verk som involverer et ansvar for en person i form av å bestille et verk. @no
definition: Relaterer en person til et værk, som involverer en persons ansvar for at bestille et værk. @da
definition: Relates a person to a work that involves a responsibility of a person for commissioning a work. @en
definition: Sasaista personu ar darbu, kas ietver personas atbildību par darba pasūtīšanu. @lv
definition: Seostab isiku teosega, mis sisaldab isiku vastutust teose tellimise eest. @et
definition: Setzt eine Person in Beziehung zu einem Werk, bei dem eine Person dafür verantwortlich ist, ein Werk in Auftrag zu geben. @de
definition: يربط شخصا بعمل يترتب عليه مسئولية شخص عن التكليف بعمل. @ar
definition: 将一个个人与涉及委托一种作品的一个个人的责任的一种作品关联起来。 @zh-hans

ohjelmoija (henkilö) teoksessa
has element type: 2
toolkit definition: A work that involves a responsibility of a person for creating a computer program. @en
toolkit definition: Bir bilgisayar programı oluşturmak için bir kişinin sorumluluğunu içeren bir eser. @tr
toolkit definition: Darbs, kas ietver personas atbildību par datorprogrammas izveidi. @lv
toolkit definition: Een werk dat met zich meebrengt een verantwoordelijkheid van een persoon voor programmeren voor een computer. @nl
toolkit definition: Egy mű, amelyhez hozzátartozik egy személy felelőssége számítógépes programozásért. @hu
toolkit definition: Ein Werk, bei dem eine Person für die Schaffung eines Computerprogramms verantwortlich ist. @de
toolkit definition: Et verk som involverer et ansvar for en person i form av programmering. @no
toolkit definition: Obra que implica una responsabilitat d’una persona en la creació d’un programa informàtic. @ca
toolkit definition: Opera che implica una responsabilità di una persona per la programmazione informatica. @it
toolkit definition: Teos, jossa henkilö on vastuussa tietokoneohjelman luomisesta.
toolkit definition: Teos, mis sisaldab isiku vastutust programmeerimise eest. @et
toolkit definition: Værk, som involverer en persons ansvar for computerprogrammering. @da
toolkit definition: Œuvre qui comporte une responsabilité de la part d’une personne consistant à créer un programme informatique. @fr
toolkit definition: عمل يترتب عليه مسئولية شخص عن البرمجة الحاسبوبية. @ar
toolkit definition: 涉及创建一个计算机程序的一个个人的责任的一种作品 @zh-hans
toolkit label: Person als Programmiererin/Programmierer von @de
toolkit label: Programcı kişisi @tr
toolkit label: ir programmētājs (persona) @lv
toolkit label: ohjelmoija (henkilö) teoksessa
toolkit label: person, som er programmør af @da
toolkit label: persona programadora de @ca
toolkit label: personne programmeuse de @fr
toolkit label: programmatore persona di @it
toolkit label: programmeerija (isik) teoses @et
toolkit label: programmer person of @en
toolkit label: programmerer av (person) @no
toolkit label: programmeur-persoon van @nl
toolkit label: programozó személye: @hu
toolkit label: προγραμματιστής φυσικό πρόσωπο του @el
toolkit label: شخص مبرمج @ar
toolkit label: ……的编程者个人 @zh-hans
has subproperty: P50539
lexical alias: programmerPersonOf.en
status: Published
type: Property
domain: C10004
label: er person, som er programmør af @da
label: er programmerer av (person) @no
label: est une personne programmeuse de @fr
label: ir programmētājs (persona) @lv
label: is programmer person of @en
label: is programmeur-persoon van @nl
label: ist Person als Programmiererin/Programmierer von @de
label: programcı kişisidir @tr
label: programmeerija (isik) teoses @et
label: programozó személye a következőnek: @hu
label: è programmatore persona di @it
label: és persona programadora de @ca
label: είναι προγραμματιστής φυσικό πρόσωπο του @el
label: هو شخص مبرمج لـ @ar
label: 是……的编程者个人 @zh-hans
sub property of: ohjelmoija (toimija) teoksessa
sub property of: teoksen tekijä (henkilö) teoksessa
definition: Bir kişiyi, bilgisayar programı oluşturma sorumluluğunu içeren bir eser ile ilişkilendirir. @tr
definition: Correla una persona a un'opera che implica una responsabilità di una persona per la programmazione informatica. @it
definition: Hozzákapcsol egy személyt egy műhöz, amelyhez hozzátartozik egy személy felelőssége számítógépes programozásért. @hu
definition: Liittää henkilön teokseen, jossa henkilö on vastuussa tietokoneohjelman luomisesta.
definition: Met une personne en relation avec une œuvre qui comporte une responsabilité de la part d’une personne consistant à créer un programme informatique. @fr
definition: Relaciona una persona amb una obra que implica una responsabilitat d’una persona en la creació d’un programa informàtic. @ca
definition: Relateert een persoon aan een werk dat met zich meebrengt een verantwoordelijkheid van een persoon voor programmeren voor een computer. @nl
definition: Relaterer en person til et verk som involverer et ansvar for en person i form av programmering. @no
definition: Relaterer en person til et værk, som involverer en persons ansvar for computerprogrammering. @da
definition: Relates a person to a work that involves a responsibility of a person for creating a computer program. @en
definition: Sasaista personu ar darbu, kas ietver personas atbildību par datorprogrammas izveidi. @lv
definition: Seostab isiku teosega, mis sisaldab isiku vastutust programmeerimise eest. @et
definition: Setzt eine Person in Beziehung zu einem Werk, bei dem eine Person für die Schaffung eines Computerprogramms verantwortlich ist. @de
definition: يربط شخصا بعمل يترتب عليه مسئولية شخص عن البرمجة الحاسبوبية. @ar
definition: 将一个个人与涉及创建一个计算机程序的一个个人的责任的一种作品关联起来。 @zh-hans

taiteilija (henkilö) teoksessa
has element type: 2
toolkit definition: A work that involves a responsibility of a person for conceiving, and often implementing, an original graphic design, drawing, painting, etc. @en
toolkit definition: Darbs, kas ietver personas atbildību par oriģinālu estampa, zīmējuma, gleznas u.tml. radīšanu un īstenošanu. @lv
toolkit definition: Een werk dat met zich meebrengt een verantwoordelijkheid van een persoon voor bedenken, en vaak uitvoeren, van een oorspronkelijk grafisch ontwerp, tekening, schilderij etc. @nl
toolkit definition: Egy mű, amelyhez hozzátartozik egy személy felelőssége egy eredeti grafikai terv, rajz, festmény stb. elgondolásáért és gyakran kivitelezéséért is. @hu
toolkit definition: Ein Werk, bei dem eine Person für die Konzeption und oft auch Umsetzung einer originalen grafischen Gestaltung, einer Zeichnung oder eines Gemäldes und so weiter verantwortlich ist. @de
toolkit definition: Et verk som involverer et ansvar for en person i form av å skape, og ofte implementere, et originalt grafisk design, en tegning, et maleri etc. @no
toolkit definition: Obra que implica una responsabilitat d’una persona concebent, i sovint realitzant, un disseny gràfic, un dibuix, una pintura, original etc. @ca
toolkit definition: Opera che implica una responsabilità di una persona per la concezione, e spesso per lo sviluppo, di un progetto grafico, disegno, dipinto, etc. originale. @it
toolkit definition: Teos, jossa henkilö on vastuussa alkuperäisen graafisen suunnitelman, piirroksen, maalauksen tms. luomisesta.
toolkit definition: Teos, mis sisaldab isiku vastutust originaalse graafilise kujunduse, joonistuse, maali vms kavandamise ja sageli ka teostamise eest. @et
toolkit definition: Værk, som involverer en persons ansvar for at udtænke, og ofte udføre, et originalt grafisk design, en original tegning, et originalt maleri etc. @da
toolkit definition: Özgün bir grafik tasarım, çizim, resim vb. tasarlamak ve sıklıkla uygulamak için bir kişinin sorumluluğunu içeren bir çalışma. @tr
toolkit definition: Œuvre qui comporte une responsabilité de la part d’une personne consistant à concevoir et souvent à réaliser un graphisme, une peinture, un dessin, etc. original. @fr
toolkit definition: عمل يترتب عليه مسئولية شخص عن وضع تصور لتصميم جرافيكي، أو لرسم، أو للوحة زيتية أصلية، إلخ وغالبا تنفيذها. @ar
toolkit definition: 涉及构思并经常是完成原创图形设计、绘图、绘画等的一个个人的责任的一种作品 @zh-hans
toolkit label: Person als Künstlerin/Künstler von @de
toolkit label: artist person of @en
toolkit label: artista persona di @it
toolkit label: ir mākslinieks (persona) @lv
toolkit label: kunstenaar-persoon van @nl
toolkit label: kunstner av (person) @no
toolkit label: kunstnik (isik) teoses @et
toolkit label: művész személye: @hu
toolkit label: person, som er kunstner af @da
toolkit label: persona artista de @ca
toolkit label: personne artiste de @fr
toolkit label: sanatçı @tr
toolkit label: taiteilija (henkilö) teoksessa
toolkit label: καλλιτέχνης φυσικό πρόσωπο του @el
toolkit label: شخص فنان @ar
toolkit label: ……的美术家个人 @zh-hans
has subproperty: kalligrafi (henkilö) teoksessa
has subproperty: kirjataiteilija (henkilö) teoksessa
has subproperty: kuvanveistäjä (henkilö) teoksessa
has subproperty: P50540
lexical alias: artistPersonOf.en
status: Published
type: Property
domain: C10004
label: er kunstner av (person) @no
label: er person, som er kunstner af @da
label: est une personne artiste de @fr
label: ir mākslinieks (persona) @lv
label: is artist person of @en
label: is kunstenaar-persoon van @nl
label: ist Person als Künstlerin/Künstler von @de
label: kunstnik (isik) teoses @et
label: művész személye a következőnek: @hu
label: sanatçı kişisidir @tr
label: è artista persona di @it
label: és persona artista de @ca
label: είναι καλλιτέχνης φυσικό πρόσωπο του @el
label: هو شخص فنان لـ @ar
label: 是……的美术家个人 @zh-hans
sub property of: taiteilija (toimija) teoksessa
sub property of: teoksen tekijä (henkilö) teoksessa
definition: Bir kişiyi, özgün bir grafik tasarım, çizim, resim vb. tasarlama ve sıklıkla uygulama sorumluluğunu içeren bir eserle ilişkilendirir. @tr
definition: Correla una persona a un'opera che implica una responsabilità di una persona per la concezione, e spesso per lo sviluppo, di un progetto grafico, disegno, dipinto, etc. originale. @it
definition: Hozzákapcsol egy személyt egy műhöz, amelyhez hozzátartozik egy személy felelőssége egy eredeti grafikai terv, rajz, festmény stb. elgondolásáért és gyakran kivitelezéséért is. @hu
definition: Liittää henkilön teokseen, jossa henkilö on vastuussa alkuperäisen graafisen suunnitelman, piirroksen, maalauksen tms. luomisesta.
definition: Met une personne en relation avec une œuvre qui comporte une responsabilité de la part d’une personne consistant à concevoir et souvent à réaliser un graphisme, une peinture, un dessin, etc. original. @fr
definition: Relaciona una persona amb una obra que implica una responsabilitat d’una persona concebent, i sovint realitzant, un disseny gràfic, un dibuix, una pintura, original etc. @ca
definition: Relateert een persoon aan een werk dat met zich meebrengt een verantwoordelijkheid van een persoon voor bedenken, en vaak uitvoeren, van een oorspronkelijk grafisch ontwerp, tekening, schilderij etc. @nl
definition: Relaterer en person til et verk som involverer et ansvar for en person i form av å skape, og ofte implementere, et originalt grafisk design, en tegning, et maleri etc. @no
definition: Relaterer en person til et værk, som involverer en persons ansvar for at udtænke, og ofte udføre, et originalt grafisk design, en original tegning, et originalt maleri etc. @da
definition: Relates a person to a work that involves a responsibility of a person for conceiving, and often implementing, an original graphic design, drawing, painting, etc. @en
definition: Sasaista personu ar darbu, kas ietver personas atbildību par oriģinālu estampa, zīmējuma, gleznas u.tml. radīšanu un īstenošanu. @lv
definition: Seostab isiku teosega, mis sisaldab isiku vastutust originaalse graafilise kujunduse, joonistuse, maali vms kavandamise ja sageli ka teostamise eest. @et
definition: Setzt eine Person in Beziehung zu einem Werk, bei dem eine Person für die Konzeption und oft auch Umsetzung einer originalen grafischen Gestaltung, einer Zeichnung oder eines Gemäldes und so weiter verantwortlich ist. @de
definition: يربط شخصا بعمل يترتب عليه مسئولية شخص عن وضع تصور لتصميم جرافيكي، أو لرسم، أو للوحة زيتية أصلية، إلخ وغالبا تنفيذه. @ar
definition: 将一个个人与涉及构思并经常是完成原创图形设计、绘图、绘画等的一个个人的责任的一种作品关联起来。 @zh-hans

kirjoittaja (henkilö) teoksessa
has element type: 2
toolkit definition: A work that involves a responsibility of a person for creating a textual work. @en
toolkit definition: Darbs, kas ietver personas atbildību par tekstuāla darba radīšanu. @lv
toolkit definition: Een werk met zich meebrengt een verantwoordelijkheid van een persoon voor creëren van een tekstwerk. @nl
toolkit definition: Egy mű, amelyhez hozzátartozik egy személy felelőssége egy szöveges mű létrehozásáért. @hu
toolkit definition: Ein Werk, bei dem eine Person für die Schaffung eines textlichen Werks verantwortlich ist. @de
toolkit definition: Et verk som involverer et ansvar for en person i form av å skape et tekstlig verk. @no
toolkit definition: Metinsel bir çalışma oluşturmak için bir kişinin sorumluluğunu içeren bir eser. @tr
toolkit definition: Obra que implica una responsabilitat d’una persona en la creació d’una obra textual. @ca
toolkit definition: Opera che implica una responsabilità di una persona per la creazione di un'opera testuale. @it
toolkit definition: Teos, joka on tekstiteos, jonka luomisesta henkilö on vastuussa.
toolkit definition: Teos, mis sisaldab isiku vastutust tekstteose loomise eest. @et
toolkit definition: Værk, som involverer en persons ansvar for at skabe et tekstværk. @da
toolkit definition: Œuvre qui comporte une responsabilité de la part d’une personne consistant à créer une œuvre textuelle. @fr
toolkit definition: عمل يترتب عليه مسئولية شخص عن إنشاء عمل نصي. @ar
toolkit definition: 涉及创作一种文字作品的一个个人的责任的一种作品 @zh-hans
toolkit label: Person als Verfasserin/Verfasser von @de
toolkit label: auteur-persoon van @nl
toolkit label: author person of @en
toolkit label: autore persona di @it
toolkit label: forfatter av (person) @no
toolkit label: ir autors (persona) @lv
toolkit label: kirjoittaja (henkilö) teoksessa
toolkit label: person, som er forfatter af @da
toolkit label: persona autora de @ca
toolkit label: personne autrice de @fr
toolkit label: szerző személye: @hu
toolkit label: tekstteose autor (isik) teoses @et
toolkit label: yazar @tr
toolkit label: συγγραφέας φυσικό πρόσωπο του @el
toolkit label: شخص مؤلف لـ @ar
toolkit label: ……的著者个人 @zh-hans
has subproperty: käsikirjoittaja (henkilö) teoksessa
has subproperty: sanoittaja (henkilö) teoksessa
has subproperty: libretisti (henkilö) teoksessa
has subproperty: kokousten raportoija (henkilö) teoksessa
has subproperty: P50541
lexical alias: authorPersonOf.en
status: Published
type: Property
domain: C10004
label: er forfatter av (person) @no
label: er person, som er forfatter af @da
label: est une personne autrice de @fr
label: ir autors (persona) @lv
label: is auteur-persoon van @nl
label: is author person of @en
label: ist Person als Verfasserin/Verfasser von @de
label: szerző személye a következőnek: @hu
label: tekstteose autor (isik) teoses @et
label: yazar kişisidir @tr
label: è autore persona di @it
label: és persona autora de @ca
label: είναι συγγραφέας φυσικό πρόσωπο του @el
label: هو شخص مؤلف لـ @ar
label: 是……的著者个人 @zh-hans
sub property of: kirjoittaja (toimija) teoksessa
sub property of: teoksen tekijä (henkilö) teoksessa
definition: Bir kişiyi, metinsel bir eser yaratma sorumluluğunu içeren bir eserle ilişkilendirir. @tr
definition: Correla una persona a un'opera che implica una responsabilità di una persona per la creazione di un'opera testuale. @it
definition: Hozzákapcsol egy személyt egy műhöz, amelyhez hozzátartozik egy személy felelőssége egy szöveges mű létrehozásáért. @hu
definition: Liittää henkilön teokseen, joka on tekstiteos, jonka luomisesta henkilö on vastuussa.
definition: Met une personne en relation avec une œuvre qui comporte une responsabilité de la part d’une personne consistant à créer une œuvre textuelle. @fr
definition: Relaciona una persona amb una obra que implica una responsabilitat d’una persona en la creació d’una obra textual. @ca
definition: Relateert een persoon aan een werk met zich meebrengt een verantwoordelijkheid van een persoon voor creëren van een tekstwerk. @nl
definition: Relaterer en person til et verk som involverer et ansvar for en person i form av å skape et tekstlig verk. @no
definition: Relaterer en person til et værk, som involverer en persons ansvar for at skabe et tekstværk. @da
definition: Relates a person to a work that involves a responsibility of a person for creating a textual work. @en
definition: Sasaista personu ar darbu, kas ietver personas atbildību par tekstuāla darba radīšanu. @lv
definition: Seostab isiku teosega, mis sisaldab isiku vastutust tekstteose loomise eest. @et
definition: Setzt eine Person in Beziehung zu einem Werk, bei dem eine Person für die Schaffung eines textlichen Werks verantwortlich ist. @de
definition: يربط شخصا بعمل يترتب عليه مسئولية شخص عن إنشاء عمل نصي. @ar
definition: 将一个个人与涉及创作一种文字作品的一个个人的责任的一种作品关联起来。 @zh-hans

teoksen tekijä (henkilö) teoksessa
has element type: 2
toolkit definition: A work that involves a responsibility of a person for creation. @en
toolkit definition: Bir kişinin yaratım sorumluluğunu içeren bir eser. @tr
toolkit definition: Darbs, kas ietver personas atbildību par radīšanu. @lv
toolkit definition: Een werk dat met zich meebrengt een verantwoordelijkheid van een persoon voor creatie. @nl
toolkit definition: Egy mű, amelyhez hozzátartozik egy személy felelőssége a létrehozásért. @hu
toolkit definition: Ein Werk, bei dem eine Person für dessen Schaffung verantwortlich ist. @de
toolkit definition: Et verk som involverer et ansvar for en person i form av skapelse. @no
toolkit definition: Obra que implica una responsabilitat d’una persona en la creació. @ca
toolkit definition: Opera che implica una responsabilità di una persona nella creazione. @it
toolkit definition: Teos, jonka luomisesta henkilö on vastuussa.
toolkit definition: Teos, mis sisaldab isiku vastutust teose loomise eest. @et
toolkit definition: Værk, som involverer en persons ansvar for skabelse. @da
toolkit definition: Œuvre qui comporte une responsabilité de la part d’une personne en ce qui concerne la création. @fr
toolkit definition: عمل يترتب عليه مسئولية شخص عن إنشاء عمل. @ar
toolkit definition: 涉及一个创作个人的责任的一种作品 @zh-hans
toolkit label: Person als geistige Schöpferin/geistiger Schöpfer eines Werks von @de
toolkit label: creator person of work of @en
toolkit label: creatore persona di opera di @it
toolkit label: eserin yaratıcısı @tr
toolkit label: ir radītājs (persona) darbam @lv
toolkit label: létrehozó személye a következő műnek: @hu
toolkit label: maker-persoon van werk van @nl
toolkit label: person, som er ophav til værk af @da
toolkit label: persona creadora d’una obra de @ca
toolkit label: personne créatrice d’une œuvre de @fr
toolkit label: skaper av verk for (person) @no
toolkit label: teoksen tekijä (henkilö) teoksessa
toolkit label: teose autor (isik) teoses @et
toolkit label: δημιουργός φυσικό πρόσωπο του έργου του @el
toolkit label: شخص منشئ عمل لـ @ar
toolkit label: ……的作品的创作者个人 @zh-hans
has subproperty: respondentti teoksessa
has subproperty: henkilö muutoksenhakijan vastapuolena teoksessa
has subproperty: meedio teoksessa
has subproperty: henkilön muutoshakemus oikeudessa
has subproperty: henkilökantaja teoksessa
has subproperty: tuomari teoksessa
has subproperty: preeses teokselle
has subproperty: opinnäytteen tarkastaja teoksessa
has subproperty: henkilö vastaajana kanteessa
has subproperty: koreografi (henkilö) teoksessa
has subproperty: teoksen säveltäjä (henkilö) musiikkiteoksessa
has subproperty: teoksen kartantekijä (henkilö) teoksessa
has subproperty: keksijä (henkilö) teoksessa
has subproperty: teoksen haastattelija (henkilö) teoksessa
has subproperty: aggregaattori (henkilö) teoksessa
has subproperty: arkkitehti (henkilö) teoksessa
has subproperty: elokuvantekijä (henkilö) teoksessa
has subproperty: ohjelmoija (henkilö) teoksessa
has subproperty: taiteilija (henkilö) teoksessa
has subproperty: kirjoittaja (henkilö) teoksessa
has subproperty: designer (henkilö) teoksessa
has subproperty: uudelleenmiksaaja (henkilö) teoksessa
has subproperty: roolittaja (henkilö) teoksessa
has subproperty: tuottaja (henkilö) teoksessa
has subproperty: teoksen valokuvaaja (henkilö) teoksessa
has subproperty: teoksen haastateltava (henkilö) teoksessa
has subproperty: muodostaja (henkilö) kokoelmalle
has subproperty: P50542
lexical alias: creatorPersonOfWorkOf.en
status: Published
type: Property
domain: C10004
label: er person, som er ophav til værk af @da
label: er skaper av verk for (person) @no
label: eserinin yaratıcı kişisidir @tr
label: est une personne créatrice d’une œuvre de @fr
label: ir radītājs (persona) darbam @lv
label: is creator person of work of @en
label: is maker-persoon van werk van @nl
label: ist Person als geistige Schöpferin/geistiger Schöpfer eines Werks von @de
label: létrehozó személye a következő műnek: @hu
label: teose autor (isik) teoses @et
label: è creatore persona di opera di @it
label: és persona creadora d’una obra de @ca
label: είναι δημιουργός φυσικό πρόσωπο του έργου του @el
label: هو شخص منشئ عمل لـ @ar
label: 是……的作品的创作者个人 @zh-hans

designer (henkilö) teoksessa
has element type: 2
toolkit definition: A work that involves a responsibility of a person for designing an object. @en
toolkit definition: Bir nesneyi tasarlamak için bir kişinin sorumluluğunu içeren bir eser. @tr
toolkit definition: Darbs, kas ietver personas atbildību par objekta dizaina radīšanu. @lv
toolkit definition: Een werk dat met zich meebrengt een verantwoordelijkheid van een persoon voor het ontwerpen van een object. @nl
toolkit definition: Egy mű, amelyhez hozzátartozik egy személy felelőssége egy tárgy tervezéséért. @hu
toolkit definition: Ein Werk, bei dem eine Person für die Gestaltung des Designs eines Objekts verantwortlich ist. @de
toolkit definition: Et verk som involverer et ansvar for en person i form av å designe en gjenstand. @no
toolkit definition: Obra que implica una responsabilitat d’una persona en el disseny d’un objecte. @ca
toolkit definition: Opera che implica una responsabilità di una persona per la progettazione di oggetto. @it
toolkit definition: Teos, jossa henkilö on vastuussa kohteen suunnittelusta tai muotoilusta.
toolkit definition: Teos, mis sisaldab isiku vastutust objekti kujunduse eest. @et
toolkit definition: Værk, som involverer en persons ansvar for at designe et objekt. @da
toolkit definition: Œuvre qui comporte une responsabilité de la part d’une personne consistant à concevoir un objet. @fr
toolkit definition: عمل يترتب عليه مسئولية شخص عن تصميم كائن. @ar
toolkit definition: 涉及设计一个物体的一个个人的责任的一种作品 @zh-hans
toolkit label: Person als Designerin/Designer von @de
toolkit label: designer (henkilö) teoksessa
toolkit label: designer av (person) @no
toolkit label: designer person of @en
toolkit label: designer persona di @it
toolkit label: ir dizainers (persona) @lv
toolkit label: kujundaja (isik) teoses @et
toolkit label: ontwerper-persoon van @nl
toolkit label: person, som er designer af @da
toolkit label: persona dissenyadora de @ca
toolkit label: personne designer de @fr
toolkit label: tasarımcı kişi @tr
toolkit label: tervező személye: @hu
toolkit label: σχεδιαστής φυσικό πρόσωπο του @el
toolkit label: شخص مصمم @ar
toolkit label: ……的设计者个人 @zh-hans
has subproperty: P50543
lexical alias: designerPersonOf.en
status: Published
type: Property
domain: C10004
label: er designer av (person) @no
label: er person, som er designer af @da
label: est une personne designer de @fr
label: ir dizainers (persona) @lv
label: is designer person of @en
label: is ontwerper-persoon van @nl
label: ist Person als Designerin/Designer von @de
label: kujundaja (isik) teoses @et
label: tasarımcı kişisidir @tr
label: tervező személye a következőnek: @hu
label: è designer persona di @it
label: és persona dissenyadora de @ca
label: είναι σχεδιαστής φυσικό πρόσωπο του @el
label: هو شخص مصمم لـ @ar
label: 是……的设计者个人 @zh-hans
sub property of: designer (toimija) teoksessa
sub property of: teoksen tekijä (henkilö) teoksessa
definition: Bir kişiyi, bir nesneyi tasarlama sorumluluğunu içeren bir eserle ilişkilendirir. @tr
definition: Correla una persona a un'opera che implica una responsabilità di una persona per la progettazione di oggetto. @it
definition: Hozzákapcsol egy személyt egy műhöz, amelyhez hozzátartozik egy személy felelőssége egy tárgy tervezéséért. @hu
definition: Liittää henkilön teokseen, jossa henkilö on vastuussa kohteen suunnittelusta tai muotoilusta.
definition: Met une personne en relation avec une œuvre qui comporte une responsabilité de la part d’une personne consistant à concevoir un objet. @fr
definition: Relaciona una persona amb una obra que implica una responsabilitat d’una persona en el disseny d’un objecte. @ca
definition: Relateert een persoon aan een werk dat met zich meebrengt een verantwoordelijkheid van een persoon voor het ontwerpen van een object. @nl
definition: Relaterer en person til et verk som involverer et ansvar for en person i form av å designe en gjenstand. @no
definition: Relaterer en person til et værk, som involverer en persons ansvar for at designe et objekt. @da
definition: Relates a person to a work that involves a responsibility of a person for designing an object. @en
definition: Sasaista personu ar darbu, kas ietver personas atbildību par objekta dizaina radīšanu. @lv
definition: Seostab isiku teosega, mis sisaldab isiku vastutust objekti kujunduse eest. @et
definition: Setzt eine Person in Beziehung zu einem Werk, bei dem eine Person für die Gestaltung des Designs eines Objekts verantwortlich ist. @de
definition: يربط شخصا بعمل يشتمل على مسئولية شخص عن تصميم كائن. @ar
definition: 将一个个人与涉及设计一个物体的一个个人的责任的一种作品关联起来。 @zh-hans

kirjataiteilija (henkilö) teoksessa
has element type: 2
toolkit definition: A work that involves a responsibility of a person for exploiting the book form or altering its physical structure. @en
toolkit definition: Darbs, kas ietver personas atbildību par grāmatas formas izmantošanu vai tās fiziskās struktūras pārveidošanu. @lv
toolkit definition: Een werk dat met zich meebrengt een verantwoordelijkheid van een persoon voor het benutten van de vorm van het boek of veranderen van de fysieke structuur. @nl
toolkit definition: Egy mű, amelyhez hozzátartozik egy személy felelőssége a könyvforma kiaknázásáért vagy fizikai szerkezetének megváltoztatásáért. @hu
toolkit definition: Ein Werk, bei dem eine Person für die Verwertung der Buchform oder für die Veränderung ihrer physischen Struktur verantwortlich ist. @de
toolkit definition: Et verk som involverer et ansvar for en person i form av å utnytte bokformatet eller endre dets fysiske struktur. @no
toolkit definition: Kitap biçiminden yararlanmak veya fiziksel yapısını değiştirmek için bir kişinin sorumluluğunu içeren bir eser. @tr
toolkit definition: Obra que implica una responsabilitat d’una persona en l’explotació de la forma llibre o en la modificació de la seva estructura física. @ca
toolkit definition: Opera che implica una responsabilità di una persona per la valorizzazione del formato del libro o l'alterazione della sua struttura fisica. @it
toolkit definition: Teos, jossa henkilö on vastuussa kirjan muodon hyödyntämisestä tai sen fyysisen rakenteen muuttamisesta.
toolkit definition: Teos, mis sisaldab isiku vastutust raamatu vormi rakendamise või selle füüsilise struktuuri muutmise eest. @et
toolkit definition: Værk, som involverer en persons ansvar for at udnytte bogformen eller ændre dens fysiske struktur. @da
toolkit definition: Œuvre qui comporte une responsabilité de la part d’une personne consistant à exploiter la forme livre ou à modifier sa structure physique. @fr
toolkit definition: عمل يترتب عليه مسئولية شخص عن استغلال شكل الكتاب أو تغيير بنيته المادية. @ar
toolkit definition: 涉及开发图书外形或改变其物理结构的一个个人的责任的一种作品 @zh-hans
toolkit label: Person als Buchkünstlerin/Buchkünstler von @de
toolkit label: boekkunstenaar-persoon van @nl
toolkit label: bokkunstner for (person) @no
toolkit label: book artist person of @en
toolkit label: book artist persona di @it
toolkit label: ir grāmatu mākslinieks (persona) @lv
toolkit label: kirjataiteilija (henkilö) teoksessa
toolkit label: kitap sanatçısı @tr
toolkit label: könyvművész személye: @hu
toolkit label: person, som er bogkunstner af @da
toolkit label: persona artista de llibre d’art de @ca
toolkit label: personne artiste du livre de @fr
toolkit label: raamatukunstnik (isik) teoses @et
toolkit label: βιβλίο του καλλιτέχνη φυσικό πρόσωπο του ? @el
toolkit label: شخص رسام كتب مصورة @ar
toolkit label: ……的图书美术家个人 @zh-hans
has subproperty: P50544
lexical alias: bookArtistPersonOf.en
status: Published
type: Property
domain: C10004
label: er bokkunstner for (person) @no
label: er person, som er bogkunstner af @da
label: est une personne artiste du livre de @fr
label: ir grāmatu mākslinieks (persona) @lv
label: is boekkunstenaar-persoon van @nl
label: is book artist person of @en
label: ist Person als Buchkünstlerin/Buchkünstler von @de
label: kitap sanatçısı kişisidir @tr
label: könyvművész személye a következőnek: @hu
label: raamatukunstnik (isik) teoses @et
label: è book artist persona di @it
label: és persona artista de llibre d’art de @ca
label: είναι βιβλίο του καλλιτέχνη φυσικό πρόσωπο του ? @el
label: هو شخص رسام كتب مصورة لـ @ar
label: 是……的图书美术家个人 @zh-hans
sub property of: kirjataiteilija (toimija) teoksessa
sub property of: taiteilija (henkilö) teoksessa
definition: Bir kişiyi, kitabın biçimini kullanmak veya fiziksel yapısını değiştirmek için bir kişinin sorumluluğunu içeren bir eserle ilişkilendirir. @tr
definition: Correla una persona a un'opera che implica una responsabilità di una persona per la valorizzazione del formato del libro o l'alterazione della sua struttura fisica. @it
definition: Hozzákapcsol egy személyt egy műhöz, amelyhez hozzátartozik egy személy felelőssége a könyvforma kiaknázásáért vagy fizikai szerkezetének megváltoztatásáért. @hu
definition: Liittää henkilön teokseen, jossa henkilö on vastuussa kirjan muodon hyödyntämisestä tai sen fyysisen rakenteen muuttamisesta.
definition: Met une personne en relation avec une œuvre qui comporte une responsabilité de la part d’une personne consistant à exploiter la forme livre ou à modifier sa structure physique. @fr
definition: Relaciona una persona amb una obra que implica una responsabilitat d’una persona en l’explotació de la forma llibre o en la modificació de la seva estructura física. @ca
definition: Relateert een persoon aan een werk dat met zich meebrengt een verantwoordelijkheid van een persoon voor het benutten van de vorm van het boek of veranderen van de fysieke structuur. @nl
definition: Relaterer en person til et verk som involverer et ansvar for en person i form av å utnytte bokformatet eller endre dets fysiske struktur. @no
definition: Relaterer en person til et værk, som involverer en persons ansvar for at udnytte bogformen eller ændre dens fysiske struktur. @da
definition: Relates a person to a work that involves a responsibility of a person for exploiting the book form or altering its physical structure. @en
definition: Sasaista personu ar darbu, kas ietver personas atbildību par grāmatas formas izmantošanu vai tās fiziskās struktūras pārveidošanu. @lv
definition: Seostab isiku teosega, mis sisaldab isiku vastutust raamatu vormi rakendamise või selle füüsilise struktuuri muutmise eest. @et
definition: Setzt eine Person in Beziehung zu einem Werk, bei dem eine Person für die Verwertung der Buchform oder für die Veränderung ihrer physischen Struktur verantwortlich ist. @de
definition: يربط شخصا بعمل يترتب عليه مسئولية شخص عن استغلال شكل الكتاب أو تغيير بنيته المادية. @ar
definition: 将一个个人与涉及开发图书外形或改变其物理结构的一个个人的责任的一种作品关联起来。 @zh-hans

teoksen perustaja (henkilö) teoksessa
has element type: 2
toolkit definition: A work that involves a responsibility of a person for initiating a diachronic work. @en
toolkit definition: Artzamanlı bir çalışmayı başlatmak için bir kişinin sorumluluğunu içeren bir eser. @tr
toolkit definition: Darbs, kas ietver personas atbildību par tā (seriālizdevuma, integrētā resursa vai vairākdaļu monogrāfijas) izveidošanu. @lv
toolkit definition: Een werk dat met zich meebrengt een verantwoordelijkheid van een persoon voor het initiëren van een diachronisch werk. @nl
toolkit definition: Egy mű, amelyhez hozzátartozik egy személy felelőssége egy diakronikus mű elindításáért. @hu
toolkit definition: Ein Werk, bei dem eine Person für das Begründen eines diachronen Werks verantwortlich ist. @de
toolkit definition: Et verk som involverer et ansvar for en person i form av å etablere et diakronisk verk. @no
toolkit definition: Obra que implica una responsabilitat d’una persona d’iniciar una obra diacrònica. @ca
toolkit definition: Opera che implica una responsabilità di una persona nell'avvio di un'opera diacronica. @it
toolkit definition: Teos, jossa henkilö on vastuussa diakronisen teoksen alullepanosta.
toolkit definition: Teos, mis sisaldab isiku vastutust diakroonilise teose ellukutsumise eest. @et
toolkit definition: Værk, som involverer en persons ansvar for at igangsætte et diakronisk værk. @da
toolkit definition: Œuvre qui comporte une responsabilité de la part d’une personne consistant à lancer une œuvre diachronique. @fr
toolkit definition: عمل يترتب عليه مسئولية شخص عن البدء في عمل تزامني. @ar
toolkit definition: 涉及发起一种历时作品的一个个人的责任的一种作品 @zh-hans
toolkit label: Person als Begründerin/Begründer eines Werks @de
toolkit label: alapító személye a következő műnek: @hu
toolkit label: eserin kurucusu @tr
toolkit label: fondatore persona di opera di @it
toolkit label: founder person of work of @en
toolkit label: grunnlegger av verk for (person) @no
toolkit label: ir dibinātājs (persona) darbam @lv
toolkit label: oprichter-persoon van werk van @nl
toolkit label: person, som er stifter af værk af @da
toolkit label: persona fundadora d’una obra de @ca
toolkit label: personne fondatrice d’une œuvre de @fr
toolkit label: teoksen perustaja (henkilö) teoksessa
toolkit label: teose asutaja (isik) teoses @et
toolkit label: ιδρυτής φυσικό πρόσωπο του έργου του @el
toolkit label: شخص مؤسس عمل @ar
toolkit label: ……作品的创办者个人 @zh-hans
has subproperty: P50545
lexical alias: founderPersonOfWorkOf.en
status: Published
type: Property
domain: C10004
label: alapító személye a következő műnek: @hu
label: er grunnlegger av verk for (person) @no
label: er person, som er stifter af værk af @da
label: eserinin kurucu kişisidir @tr
label: est une personne fondatrice d’une œuvre de @fr
label: ir dibinātājs (persona) darbam @lv
label: is founder person of work of @en
label: is oprichter-persoon van werk van @nl
label: ist Person als Begründerin/Begründer eines Werks @de
label: teose asutaja (isik) teoses @et
label: è fondatore persona di opera di @it
label: és persona fundadora d’una obra de @ca
label: είναι ιδρυτής φυσικό πρόσωπο του έργου του @el
label: هو شخص مؤسس عمل لـ @ar
label: 是……作品的创办者个人 @zh-hans
sub property of: teoksen perustaja (toimija) teoksessa
sub property of: henkilöön liittyvä teos
definition: Bir kişiyi, artzamanlı bir çalışmayı başlatma sorumluluğunu içeren bir eserle ilişkilendirir. @tr
definition: Correla una persona a un'opera che implica una responsabilità di una persona nell'avvio di un'opera diacronica. @it
definition: Hozzákapcsol egy személyt egy műhöz, amelyhez hozzátartozik egy személy felelőssége egy diakronikus mű elindításáért. @hu
definition: Liittää henkilön teokseen, jossa henkilö on vastuussa diakronisen teoksen alullepanosta.
definition: Met une personne en relation avec une œuvre qui comporte une responsabilité de la part d’une personne consistant à lancer une œuvre diachronique. @fr
definition: Relaciona una persona amb una obra que implica una responsabilitat d’una persona d’iniciar una obra diacrònica. @ca
definition: Relateert een persoon aan een werk dat met zich meebrengt een verantwoordelijkheid van een persoon voor het initiëren van een diachronisch werk. @nl
definition: Relaterer en person til et verk som involverer et ansvar for en person i form av å etablere et diakronisk verk. @no
definition: Relaterer en person til et værk, som involverer en persons ansvar for at igangsætte et diakronisk værk. @da
definition: Relates a person to a work that involves a responsibility of a person for initiating a diachronic work. @en
definition: Sasaista personu ar darbu, kas ietver personas atbildību par tā (seriālizdevuma, integrētā resursa vai vairākdaļu monogrāfijas) izveidošanu. @lv
definition: Seostab isiku teosega, mis sisaldab isiku vastutust diakroonilise teose ellukutsumise eest. @et
definition: Setzt eine Person in Beziehung zu einem Werk, bei dem eine Person für das Begründen eines diachronen Werks verantwortlich ist. @de
definition: يربط شخصا بعمل يترتب عليه مسئولية شخص عن البدء في عمل تزامني. @ar
definition: 将一个个人与涉及发起一种历时作品的一个个人的责任的一种作品关联起来。 @zh-hans

julkaisija (henkilö) teokselle
has element type: 2
toolkit definition: A work that involves a responsibility of a person for issuing a work, such as an official organ of the body. @en
toolkit definition: Bir kurumun resmi bir organı gibi, bir eserin yayınlanmasına ilişkin bir kişinin sorumluluğunu içeren bir eser. @tr
toolkit definition: Darbs, kas ietver personas atbildību par darba publicēšanu, piemēram, iestādes biļetens. @lv
toolkit definition: Een werk dat met zich meebrengt een verantwoordelijkheid van een persoon voor uitvaardigen van een werk, zoals een officieel orgaan van de instantie. @nl
toolkit definition: Egy mű, amelyhez hozzátartozik egy személy felelőssége egy olyan mű kibocsátásáért, mint amilyen egy társaság hivatalos orgánuma. @hu
toolkit definition: Ein Werk, bei dem eine Person für die Herausgabe eines Werks, zum Beispiel eines offiziellen Organs der Körperschaft, verantwortlich ist. @de
toolkit definition: Et verk som involverer et ansvar for en person i form av å utgi et verk. @no
toolkit definition: Obra que implica una responsabilitat d’una persona en la publicació d’una obra, com ara un òrgan oficial de l’entitat. @ca
toolkit definition: Opera che implica una responsabilità di una persona per l'emissione di un'opera, come un organo ufficiale dell'ente. @it
toolkit definition: Teos, jossa henkilö on vastuussa (esim. virallisena toimielimenä) teoksen julkaisemisesta.
toolkit definition: Teos, mis sisaldab isiku vastutust teose, nt asutuse ametliku häälekandja väljaandmise eest. @et
toolkit definition: Værk, som involverer en persons ansvar for at udgive et værk, som et officielt organ for en organisation. @da
toolkit definition: Œuvre qui comporte une responsabilité de la part d’une personne consistant à publier une œuvre, tel un organe officiel de la personne. @fr
toolkit definition: عمل يترتب عليه مسئولية شخص عن إصدار عمل، مثل الصحيفة الرسمية لهيئة. @ar
toolkit definition: 涉及一个颁布一种作品（例如一个团体的机关刊物）的个人的责任的一种作品 @zh-hans
toolkit label: Herausgebende Person von @de
toolkit label: Yayınlayan kişisi @tr
toolkit label: ente emittente persona di @it
toolkit label: ir publicētājs (persona) @lv
toolkit label: issuing person of @en
toolkit label: julkaisija (henkilö) teokselle
toolkit label: kibocsátó személye: @hu
toolkit label: persona d’entitat editora de @ca
toolkit label: personne émettrice de @fr
toolkit label: udstedende person af @da
toolkit label: uitvaardiger-persoon van @nl
toolkit label: utgiver av (person) @no
toolkit label: väljaandja (isik) teoses @et
toolkit label: οργανισμός έκδοσης φυσικό πρόσωπο του @el
toolkit label: شخص جهة إصدار @ar
toolkit label: ……的颁布个人 @zh-hans
has subproperty: P50546
lexical alias: issuingPersonOf.en
status: Published
type: Property
domain: C10004
label: er udstedende person af @da
label: er utgiver av (person) @no
label: est une personne émettrice de @fr
label: ir publicētājs (persona) @lv
label: is issuing person of @en
label: is uitvaardiger-persoon van @nl
label: ist herausgebende Person von @de
label: kibocsátó személye a következőnek: @hu
label: piyasaya çıkaran kişisidir @tr
label: väljaandja (isik) teoses @et
label: è ente emittente persona di @it
label: és persona d’entitat editora de @ca
label: είναι οργανισμός έκδοσης φυσικό πρόσωπο του @el
label: هو شخص جهة إصدار لـ @ar
label: 是……的颁布个人 @zh-hans
sub property of: julkaisija (toimija) teokselle
sub property of: henkilöön liittyvä teos
definition: Bir kişiyi, vücudun resmi bir organı gibi bir eser yayınlama sorumluluğunu içeren bir eserle ilişkilendirir. @tr
definition: Correla una persona a un'opera che implica una responsabilità di una persona per l'emissione di un'opera, come un organo ufficiale dell'ente. @it
definition: Hozzákapcsol egy személyt egy műhöz, amelyhez hozzátartozik egy személy felelőssége egy olyan mű kibocsátásáért, mint amilyen egy társaság hivatalos orgánuma. @hu
definition: Liittää henkilön teokseen, jossa henkilö on vastuussa (esim. virallisena toimielimenä) teoksen julkaisemisesta.
definition: Met une personne en relation avec une œuvre qui comporte une responsabilité de la part d’une personne consistant à publier une œuvre, tel un organe officiel de la personne. @fr
definition: Relaciona una persona amb una obra que implica una responsabilitat d’una persona en la publicació d’una obra, com ara un òrgan oficial de l’entitat. @ca
definition: Relateert een persoon aan een werk dat met zich meebrengt een verantwoordelijkheid van een persoon voor uitvaardigen van een werk, zoals een officieel orgaan van de instantie. @nl
definition: Relaterer en person til et verk som involverer et ansvar for en person i form av å utgi et verk. @no
definition: Relaterer en person til et værk, som involverer en persons ansvar for at udgive et værk, som et officielt organ for en organisation. @da
definition: Relates a person to a work that involves a responsibility of a person for issuing a work, such as an official organ of the body. @en
definition: Sasaista personu ar darbu, kas ietver personas atbildību par darba publicēšanu, piemēram, iestādes biļetens. @lv
definition: Seostab isiku teosega, mis sisaldab isiku vastutust teose, nt asutuse ametliku häälekandja väljaandmise eest. @et
definition: Setzt eine Person in Beziehung zu einem Werk, bei dem eine Person für die Herausgabe eines Werks, zum Beispiel eines offiziellen Organs der Körperschaft, verantwortlich ist. @de
definition: يربط شخصا بعمل يترتب عليه مسئولية شخص عن إصدار عمل، مثل الصحيفة الرسمية لهيئة. @ar
definition: 将一个个人与涉及一个颁布一种作品（例如一个团体的机关刊物）的个人的责任的一种作品关联起来。 @zh-hans

äänituottaja (henkilö) teoksessa
has element type: 2
toolkit definition: A work that involves a responsibility of a person for managing most of the business aspects of an audio recording. @en
toolkit definition: Bir ses kaydının ticari yönlerinin çoğunu yönetmek için bir kişinin sorumluluğunu içeren bir eser. @tr
toolkit definition: Darbs, kas ietver personas atbildību par lielāko daļu skaņu ieraksta biznesa aspektiem. @lv
toolkit definition: Een werk dat met zich meebrengt een verantwoordelijkheid van een persoon voor het merendeel van de zakelijke aspecten van de productie van een geluidsopname. @nl
toolkit definition: Egy mű, amelyhez hozzátartozik egy személy felelőssége egy audiofelvétel legtöbb üzleti vonatkozásának menedzseléséért. @hu
toolkit definition: Ein Werk, bei dem eine Person für die meisten geschäftlichen Aspekte einer Audioaufnahme verantwortlich ist. @de
toolkit definition: Et verk som involverer et ansvar for en person i form av å håndtere de fleste forretningsmessige aspektene ved et lydopptak. @no
toolkit definition: Obra que implica una responsabilitat d’una persona en la gestió de la majoria dels aspectes comercials d’un enregistrament àudio. @ca
toolkit definition: Opera che implica una responsabilità di una persona per la gestione della maggior parte degli aspetti commerciali di una registrazione audio. @it
toolkit definition: Teos, jossa henkilö on vastuussa useimpien äänitteen liiketoiminnallisten tehtävien hoitamisesta.
toolkit definition: Teos, mis sisaldab isiku vastutust helisalvestuse enamiku äriliste aspektide korraldamise eest. @et
toolkit definition: Værk, som involverer en persons ansvar for at håndtere de fleste forretningsmæssige aspekter af en lydoptagelse. @da
toolkit definition: Œuvre qui comporte une responsabilité de la part d’une personne consistant à gérer la majeure partie des aspects commerciaux d’un enregistrement audio. @fr
toolkit definition: عمل يترتب عليه مسئولية شخص عن إدارة معظم جوانب الأعمال التجارية للتسجيل الصوتي. @ar
toolkit definition: 涉及音频录制工作大多数方面之管理的一个个人的责任的一种作品 @zh-hans
toolkit label: Person als Produzentin/Produzent einer Tonaufnahme von @de
toolkit label: Ses yapımcısı @tr
toolkit label: audio producer person of @en
toolkit label: audio-producer személye: @hu
toolkit label: audioprodutsent (isik) teoses @et
toolkit label: geluidsproducent-persoon van @nl
toolkit label: ir skaņu ierakstu producents (persona) @lv
toolkit label: lydprodusent for (person) @no
toolkit label: person, som er lydproducer af @da
toolkit label: persona productora d’àudio de @ca
toolkit label: personne productrice audio de @fr
toolkit label: produttore audio persona di @it
toolkit label: äänituottaja (henkilö) teoksessa
toolkit label: παραγωγός ήχου φυσικό πρόσωπο του @el
toolkit label: شخص منتج مواد صوتية @ar
toolkit label: ……的音频制作者个人 @zh-hans
has subproperty: P50547
lexical alias: audioProducerPersonOf.en
status: Published
type: Property
domain: C10004
label: audio-producer személye a következőnek: @hu
label: audioprodutsent (isik) teoses @et
label: er lydprodusent for (person) @no
label: er person, som er lydproducer af @da
label: est une personne productrice audio de @fr
label: ir skaņu ierakstu producents (persona) @lv
label: is audio producer person of @en
label: is geluidsproducent-persoon van @nl
label: ist Person als Produzentin/Produzent einer Tonaufnahme von @de
label: ses yapımcısı kişisidir @tr
label: è produttore audio persona di @it
label: és persona productora d’àudio de @ca
label: είναι παραγωγός ήχου φυσικό πρόσωπο του @el
label: هو شخص منتج مواد صوتية لـ @ar
label: 是……的音频制作者个人 @zh-hans
sub property of: äänituottaja (toimija) teoksessa
sub property of: tuottaja (henkilö) teoksessa
definition: Bir kişiyi, bir ses kaydının ticari yönlerinin çoğunu yönetmek için bir kişinin sorumluluğunu içeren bir eserle ilişkilendirir. @tr
definition: Correla una persona a un'opera che implica una responsabilità di una persona nella gestione della maggior parte degli aspetti commerciali di una registrazione audio. @it
definition: Hozzákapcsol egy személyt egy műhöz, amelyhez hozzátartozik egy személy felelőssége egy audiofelvétel legtöbb üzleti vonatkozásának menedzseléséért. @hu
definition: Liittää henkilön teokseen, jossa henkilö on vastuussa useimpien äänitteen liiketoiminnallisten tehtävien hoitamisesta.
definition: Met une personne en relation avec une œuvre qui comporte une responsabilité de la part d’une personne consistant à gérer la majeure partie des aspects commerciaux d’un enregistrement audio. @fr
definition: Relaciona una persona amb una obra que implica una responsabilitat d’una persona en la gestió de la majoria dels aspectes comercials d’un enregistrament àudio. @ca
definition: Relateert een persoon aan een werk dat met zich meebrengt een verantwoordelijkheid van een persoon voor het merendeel van de zakelijke aspecten van de productie van een geluidsopname. @nl
definition: Relaterer en person til et verk som involverer et ansvar for en person i form av å håndtere de fleste forretningsmessige aspektene ved et lydopptak. @no
definition: Relaterer en person til et værk, som involverer en persons ansvar for at håndtere de fleste forretningsmæssige aspekter af en lydoptagelse. @da
definition: Relates a person to a work that involves a responsibility of a person for managing most of the business aspects of an audio recording. @en
definition: Sasaista personu ar darbu, kas ietver personas atbildību par lielāko daļu skaņu ieraksta biznesa aspektiem. @lv
definition: Seostab isiku teosega, mis sisaldab isiku vastutust helisalvestuse enamiku äriliste aspektide korraldamise eest. @et
definition: Setzt eine Person in Beziehung zu einem Werk, bei dem eine Person für die meisten geschäftlichen Aspekte einer Audioaufnahme verantwortlich ist. @de
definition: يربط شخصا بعمل يترتب عليه مسئولية شخص عن إدارة معظم جوانب الأعمال التجارية للتسجيل الصوتي. @ar
definition: 将一个个人与涉及音频录制工作大多数方面之管理的一个个人的责任的一种作品关联起来。 @zh-hans

uudelleenmiksaaja (henkilö) teoksessa
has element type: 2
toolkit definition: A work that involves a responsibility of a person for manipulating, recombining, mixing, and reproducing previously recorded sounds. @en
toolkit definition: Darbs, kas ietver personas atbildību par iepriekš ierakstītas skaņas manipulāciju, pārkombinēšanu, miksēšanu un atkārtotu atskaņošanu. @lv
toolkit definition: Een werk dat met zich meebrengt een verantwoordelijkheid van een persoon voor manipuleren, opnieuw combineren, mixen en reproduceren van eerder opgenomen geluiden. @nl
toolkit definition: Egy mű, amelyhez hozzátartozik egy személy felelőssége korábbi hangfelvételek manipulálásáért, újrakombinálásáért, keveréséért és reprodukálásáért. @hu
toolkit definition: Ein Werk, bei dem eine Person für das Bearbeiten, Rekombinieren, Mischen und Reproduzieren einer bestehenden Tonaufnahme verantwortlich ist. @de
toolkit definition: Et verk som involverer et ansvar for en person i form av å manipulere, sette sammen og reprodusere lyd som er spilt inn tidligere. @no
toolkit definition: Obra que implica una responsabilitat d’una persona en la manipulació, la recombinació, la mescla i la reproducció de sons enregistrats prèviament. @ca
toolkit definition: Opera che implica una responsabilità di una persona nella manipolazione, ricombinazione, missaggio e riproduzione di suoni precedentemente registrati. @it
toolkit definition: Teos, jossa henkilö on vastuussa ääniteoksen luomisesta manipuloimalla, yhdistelemällä, sekoittamalla ja uudelleen tuottamalla aiemmin äänitettyjä ääniä.
toolkit definition: Teos, mis sisaldab isiku vastutust varem salvestatud helide manipuleerimise, ümberkombineerimise, segamise ja taastekitamise eest. @et
toolkit definition: Værk, som involverer en persons ansvar for manipulering, rekombinering, mixing og gengivelse af tidligere indspillede lyde. @da
toolkit definition: Önceden kaydedilmiş sesleri düzenleme, yeniden birleştirme, miksleme ve yeniden üretmek için bir kişinin sorumluluğunu içeren bir eser. @tr
toolkit definition: Œuvre qui comporte une responsabilité de la part d’une personne consistant à manipuler, à recombiner, à mixer et à reproduire des sons préalablement enregistrés. @fr
toolkit definition: عمل يترتب عليه مسئولية شخص عن معالجة المواد السمعية المسجلة مسبقًا وإعادة تجميعها ومزجها واستنساخها. @ar
toolkit definition: 涉及操纵、重新组合、混合和复制事先录制的声音的一个个人的责任的一种作品 @zh-hans
toolkit label: Person als Remix Artist von @de
toolkit label: artista di remix persona di @it
toolkit label: ir remiksa mākslinieks (persona) @lv
toolkit label: person, som er remixer af @da
toolkit label: persona artista de remescla de @ca
toolkit label: personne remixeuse de @fr
toolkit label: remiks sanatçısı kişi @tr
toolkit label: remikser av (person) @no
toolkit label: remiksija (isik) teoses @et
toolkit label: remix artist person of @en
toolkit label: remix καλλιτέχνης φυσικό πρόσωπο του @el
toolkit label: remixartiest-persoon van @nl
toolkit label: remixművész személye: @hu
toolkit label: uudelleenmiksaaja (henkilö) teoksessa
toolkit label: شخص فنان ريميكس @ar
toolkit label: ……的合成艺术家个人 @zh-hans
has subproperty: P50548
lexical alias: remixArtistPersonOf.en
status: Published
type: Property
domain: C10004
label: er person, som er remixer af @da
label: er remikser av (person) @no
label: est une personne remixeuse de @fr
label: ir remiksa mākslinieks (persona) @lv
label: is remix artist person of @en
label: is remixartiest-persoon van @nl
label: ist Person als Remix Artist von @de
label: remiksija (isik) teoses @et
label: remix sanatçısı kişisidir @tr
label: remixművész személye a következőnek: @hu
label: è artista di remix persona di @it
label: és persona artista de remescla de @ca
label: είναι remix καλλιτέχνης φυσικό πρόσωπο του @el
label: هو شخص فنان ريميكس لـ @ar
label: 是……的合成艺术家个人 @zh-hans
sub property of: uudelleenmiksaaja (toimija) teoksessa
sub property of: teoksen tekijä (henkilö) teoksessa
definition: Bir kişiyi, önceden kaydedilmiş sesleri işleme, yeniden birleştirme, karıştırma ve yeniden üretmeyi içeren bir eserle ilişkilendirir. @tr
definition: Correla una persona a un'opera che implica una responsabilità di una persona nella manipolazione, ricombinazione, missaggio e riproduzione di suoni precedentemente registrati. @it
definition: Hozzákapcsol egy személyt egy műhöz, amelyhez hozzátartozik egy személy felelőssége korábbi hangfelvételek manipulálásáért, újrakombinálásáért, keveréséért és reprodukálásáért. @hu
definition: Liittää henkilön teokseen, jossa henkilö on vastuussa ääniteoksen luomisesta manipuloimalla, yhdistelemällä, sekoittamalla ja uudelleen tuottamalla aiemmin äänitettyjä ääniä.
definition: Met une personne en relation avec une œuvre qui comporte une responsabilité de la part d’une personne consistant à manipuler, à recombiner, à mixer et à reproduire des sons préalablement enregistrés. @fr
definition: Relaciona una persona amb una obra que implica una responsabilitat d’una persona en la manipulació, la recombinació, la mescla i la reproducció de sons enregistrats prèviament. @ca
definition: Relateert een persoon aan een werk dat met zich meebrengt een verantwoordelijkheid van een persoon voor manipuleren, opnieuw combineren, mixen en reproduceren van eerder opgenomen geluiden. @nl
definition: Relaterer en person til et verk som involverer et ansvar for en person i form av å manipulere, sette sammen og reprodusere lyd som er spilt inn tidligere. @no
definition: Relaterer en person til et værk, som involverer en persons ansvar for manipulering, rekombinering, mixing og gengivelse af tidligere indspillede lyde. @da
definition: Relates a person to a work that involves a responsibility of a person for manipulating, recombining, mixing, and reproducing previously recorded sounds. @en
definition: Sasaista personu ar darbu, kas ietver personas atbildību par iepriekš ierakstītas skaņas manipulāciju, pārkombinēšanu, miksēšanu un atkārtotu atskaņošanu. @lv
definition: Seostab isiku teosega, mis sisaldab isiku vastutust varem salvestatud helide manipuleerimise, ümberkombineerimise, segamise ja taastekitamise eest. @et
definition: Setzt eine Person in Beziehung zu einem Werk, bei dem eine Person für das Bearbeiten, Rekombinieren, Mischen und Reproduzieren einer bestehenden Tonaufnahme verantwortlich ist. @de
definition: يربط شخصا بعمل يترتب عليه مسئولية شخص عن معالجة المواد السمعية المسجلة مسبقًا وإعادة تجميعها ومزجها واستنساخها. @ar
definition: 将一个个人与涉及操纵、重新组合、混合和复制事先录制的声音的一个个人的责任的一种作品关联起来。 @zh-hans
scope note: Darunter fallen keine Nachbearbeitungen, die weder Art noch Inhalt des Originalwerks wesentlich verändern, sowie das Zusammenmischen von aufgenommenen Einzelspuren (Kanälen) zu einem scheinbar ununterbrochen durchgehenden Klangerlebnis. @de
scope note: Ei hõlma remiksimist, mis ei muuda oluliselt originaalteose olemust ja sisu, ega salvestatud heliradade kokkupanekut üheks helirajaks. @et
scope note: Ei kata uudelleenmiksaamista, joka ei oleellisesti muuta alkuperäisen teoksen luonnetta ja sisältöä eikä aiemmin äänitettyjen musiikkikappaleiden yhdistämistä yhdeksi musiikkikappaleeksi.
scope note: Neietver remiksēšanas darbības, kas būtiski nemaina oriģinālā darba būtību un saturu, kā arī ierakstu celiņu apvienošanu vienā ieraksta celiņā. @lv
scope note: Nem tartoznak ide sem azok a remixelési tevékenységek, amelyek nem változtatják meg lényegesen az eredeti mű jellegét és tartalmát, sem a rögzített sávok látszólag egy folyamatos sávként való összemixelése. @hu
scope note: Orijinal çalışmanın niteliğini ve içeriğini önemli ölçüde değiştirmeyen remiks faaliyetleri ve kaydedilen parçaları kesintisiz tek bir parça olarak görünecek şekilde karıştırılması hariçtir. @tr
scope note: Remiksaktiviteter som ikke i betydelig grad endrer originalverkets særpreg og innhold, og miksing av innspilte spor slik at resultatet høres ut som ett sammenhengende spor, er ikke inkludert. @no
scope note: Remixhandelingen die de aard en content van de oorspronkelijke resource niet substantieel wijzigen, resulterend in een nieuwe resource, en mixen en samenstellen van meerdere sporen van een opname zijn uitgesloten. @nl
scope note: Remixing activities that do not substantially change the nature and content of the original work, and mixing recorded tracks together to appear as one continuous track, are excluded. @en
scope note: Remixing-aktiviteter, som ikke væsentligt forandrer originalværkets karakter og indhold, samt mixe indspillede lydspor sammen for at fremstå som ét uafbrudt spor, er ikke omfattet. @da

roolittaja (henkilö) teoksessa
has element type: 2
toolkit definition: A work that involves a responsibility of a person for most aspects of assigning roles and duties to performers. @en
toolkit definition: Darbs, kas ietver personas atbildību par lomu sadali un pienākumu piešķiršanu izpildītājiem. @lv
toolkit definition: Een werk dat met zich meebrengt een verantwoordelijkheid van een persoon voor de meeste aspecten van het toewijzen van rollen en taken aan uitvoerders. @nl
toolkit definition: Egy mű, amelyhez hozzátartozik egy személy felelőssége a szerepek és feladatok előadókra osztásának legtöbb vonatkozásáért. @hu
toolkit definition: Ein Werk, bei dem eine Person für die meisten Aspekte der Rollenvergabe und Aufgabenzuteilung an Ausführende verantwortlich ist. @de
toolkit definition: Et verk som involverer et ansvar for en person i form av de fleste aspektene ved å fordele roller og oppgaver mellom utøvere. @no
toolkit definition: Obra que implica una responsabilitat d’una persona en la majoria dels aspectes de l’assignació de papers i funcions als intèrprets. @ca
toolkit definition: Opera che implica una responsabilità di una persona nella maggior parte degli aspetti dell'assegnazione di ruoli e incarichi agli attori. @it
toolkit definition: Sanatçılara roller ve görevler atamanın çoğu yönü için bir kişinin sorumluluğunu içeren bir eser. @tr
toolkit definition: Teos, jossa henkilö on vastuussa useimmista esiintyjien roolien ja tehtävien antamiseen kuuluvista tehtävistä.
toolkit definition: Teos, mis sisaldab isiku vastutust esitajatele rollide ja ülesannete jagamise enamiku aspektide eest. @et
toolkit definition: Værk, som involverer en persons ansvar for de fleste aspekter ved tildeling af roller og opgaver til udøvere. @da
toolkit definition: Œuvre qui comporte une responsabilité de la part d’une personne en ce qui concerne la majeure partie des aspects relatifs à la distribution des rôles et des fonctions aux interprètes. @fr
toolkit definition: عمل يترتب عليه مسئولية شخص عن تحديد معظم الجوانب المتعلقة بأدوار الممثلين ومهامهم. @ar
toolkit definition: 涉及给演员分配角色和任务的大多数工作的一个个人的责任的一种作品 @zh-hans
toolkit label: Person als Casting Director von @de
toolkit label: casting director for (person) @no
toolkit label: casting director person of @en
toolkit label: casting'u juht (isik) teoses @et
toolkit label: castingdirector-persoon van @nl
toolkit label: direttore del casting persona di @it
toolkit label: ir aktieru atlases režisors (persona) @lv
toolkit label: kast yönetmeni @tr
toolkit label: person, som er caster af @da
toolkit label: persona directora de càsting de @ca
toolkit label: personne directrice de casting de @fr
toolkit label: roolittaja (henkilö) teoksessa
toolkit label: szereposztó rendező személye: @hu
toolkit label: διευθυντής διανομής ρόλων φυσικό πρόσωπο του @el
toolkit label: شخص مدير طاقم التمثيل @ar
toolkit label: ……的角色导演个人 @zh-hans
has subproperty: P50549
lexical alias: castingDirectorPersonOf.en
status: Published
type: Property
domain: C10004
label: cast yönetmeni kişisidir @tr
label: casting'u juht (isik) teoses @et
label: er casting director for (person) @no
label: er person, som er caster af @da
label: est une personne directrice de casting de @fr
label: ir aktieru atlases režisors (persona) @lv
label: is casting director person of @en
label: is castingdirector-persoon van @nl
label: ist Person als Casting Director von @de
label: szereposztó rendező személye a következőnek: @hu
label: è direttore del casting persona di @it
label: és persona directora de càsting de @ca
label: είναι διευθυντής διανομής ρόλων φυσικό πρόσωπο του @el
label: هو شخص مدير طاقم التمثيل لـ @ar
label: 是……的角色导演个人 @zh-hans
sub property of: roolittaja (toimija) teoksessa
sub property of: teoksen tekijä (henkilö) teoksessa
definition: Bir kişiyi, sanatçılara rol ve görev atamanın çoğu yönü için bir kişinin sorumluluğunu içeren bir eserle ilişkilendirir. @tr
definition: Correla una persona a un'opera che implica una responsabilità di una persona nella maggior parte degli aspetti dell'assegnazione di ruoli e incarichi agli attori. @it
definition: Hozzákapcsol egy személyt egy műhöz, amelyhez hozzátartozik egy személy felelőssége a szerepek és feladatok előadókra osztásának legtöbb vonatkozásáért. @hu
definition: Liittää henkilön teokseen, jossa henkilö on vastuussa useimmista esiintyjien roolien ja tehtävien antamiseen kuuluvista tehtävistä.
definition: Met une personne en relation avec une œuvre qui comporte une responsabilité de la part d’une personne en ce qui concerne la majeure partie des aspects relatifs à la distribution des rôles et des fonctions aux interprètes. @fr
definition: Relaciona una persona amb una obra que implica una responsabilitat d’una persona en la majoria dels aspectes de l’assignació de papers i funcions als intèrprets. @ca
definition: Relateert een persoon aan een werk dat met zich meebrengt een verantwoordelijkheid van een persoon voor de meeste aspecten van het toewijzen van rollen en taken aan uitvoerders. @nl
definition: Relaterer en person til et verk som involverer et ansvar for en person i form av de fleste aspektene ved å fordele roller og oppgaver mellom utøvere. @no
definition: Relaterer en person til et værk, som involverer en persons ansvar for de fleste aspekter ved tildeling af roller og opgaver til udøvere. @da
definition: Relates a person to a work that involves a responsibility of a person for most aspects of assigning roles and duties to performers. @en
definition: Sasaista personu ar darbu, kas ietver personas atbildību par lomu sadali un pienākumu piešķiršanu izpildītājiem. @lv
definition: Seostab isiku teosega, mis sisaldab isiku vastutust esitajatele rollide ja ülesannete jagamise enamiku aspektide eest. @et
definition: Setzt eine Person in Beziehung zu einem Werk, bei dem eine Person für die meisten Aspekte der Rollenvergabe und Aufgabenzuteilung an Ausführende verantwortlich ist. @de
definition: يربط شخصا بعمل يترتب عليه مسئولية شخص عن تحديد معظم الجوانب المتعلقة بأدوار الممثلين ومهامهم. @ar
definition: 将一个个人与涉及给演员分配角色和任务的大多数工作的一个个人的责任的一种作品关联起来。 @zh-hans

tuottaja (henkilö) teoksessa
has element type: 2
toolkit definition: A work that involves a responsibility of a person for most of the business aspects of a production for screen, sound recording, television, webcast, etc. @en
toolkit definition: Darbs, kas ietver personas atbildību par filmas, mūzikas ierakstu, televīzijas, tīmekļa pārraižu u.tml. biznesa aspektiem. @lv
toolkit definition: Een werk dat met zich meebrengt een verantwoordelijkheid van een persoon voor het merendeel van de zakelijke aspecten van een productie voor scherm, geluidsopname, televisie, webcast etc. @nl
toolkit definition: Egy mű, amelyhez hozzátartozik egy személy felelőssége képernyőre kerülő műsor, hangfelvétel, televíziós, webes közvetítés, stb. legtöbb üzleti vonatkozásáért. @hu
toolkit definition: Ein Werk, bei dem eine Person für die meisten geschäftlichen Aspekte einer Produktion für die Leinwand, für eine Tonaufnahme, für das Fernsehen, für einen Webcast und so weiter verantwortlich ist. @de
toolkit definition: Ekran, ses kaydı, televizyon, web yayını vb. için bir prodüksiyonun ticari yönlerinin çoğu için bir kişinin sorumluluğunu içeren bir eser. @tr
toolkit definition: Et verk som involverer et ansvar for en person i form av de fleste forretningsmessige aspektene ved en produksjon for film eller fjensyn, lydinnspilling, webkast etc. @no
toolkit definition: Obra que implica una responsabilitat d’una persona en la majoria dels aspectes comercials d’una producció d’una pel·lícula, d’un enregistrament sonor, d’un programa de televisió, d’una emissió web, etc. @ca
toolkit definition: Opera che implica una responsabilità di una persona per la maggior parte degli aspetti commerciali di una produzione per la proiezione, registrazione del suono, televisione, trasmissione via web, etc. @it
toolkit definition: Teos, jossa henkilö on vastuussa suurimmasta osasta elokuva-, äänite-, televisio-, suoratoisto- tms. tuotannon liiketoiminnallisista tehtävistä.
toolkit definition: Teos, mis sisaldab isiku vastutust enamiku äriliste aspektide eest filmide, helisalvestiste, telesaadete, veebiülekannete jms tootmisel. @et
toolkit definition: Værk, som involverer en persons ansvar for størstedelen af de forretningsmæssige aspekter ved en produktion beregnet til lærred, lydoptagelse, tv, webcast etc. @da
toolkit definition: Œuvre qui comporte une responsabilité de la part d’une personne en ce qui concerne la majeure partie des aspects commerciaux de la production d’un film, d’un enregistrement audio, d’une émission de télévision, d’une webémission, etc. @fr
toolkit definition: عمل يترتب عليه مسئولية شخص عن معظم جوانب العمل في إنتاج للشاشة، وللتسجيل الصوتي، وللتلفزيون، وللبث عبر الإنترنت، إلخ. @ar
toolkit definition: 涉及对银幕、录音、电视、网络直播等制作的大部分商业运作的一个个人的责任的一种作品 @zh-hans
toolkit label: Person als Produzentin/Produzent von @de
toolkit label: ir producents (persona) @lv
toolkit label: person, som er producer af @da
toolkit label: persona productora de @ca
toolkit label: personne productrice de @fr
toolkit label: producent-persoon van @nl
toolkit label: producer person of @en
toolkit label: producer személye: @hu
toolkit label: produsent av (person) @no
toolkit label: produtsent (isik) teoses @et
toolkit label: produttore persona di @it
toolkit label: tuottaja (henkilö) teoksessa
toolkit label: yapımcı kişisi @tr
toolkit label: παραγωγός φυσικό πρόσωπο του @el
toolkit label: شخص منتج لـ @ar
toolkit label: ……的制作者个人 @zh-hans
has subproperty: äänituottaja (henkilö) teoksessa
has subproperty: elokuvatuottaja (henkilö) teoksessa
has subproperty: radiotuottaja (henkilö) teoksessa
has subproperty: televisiotuottaja (henkilö) teoksessa
has subproperty: P50550
lexical alias: producerPersonOf.en
status: Published
type: Property
domain: C10004
label: er person, som er producer af @da
label: er produsent av (person) @no
label: est une personne productrice de @fr
label: ir producents (persona) @lv
label: is producent-persoon van @nl
label: is producer person of @en
label: ist Person als Produzentin/Produzent von @de
label: producer személye a következőnek: @hu
label: produtsent (isik) teoses @et
label: yapımcı kişisidir @tr
label: è produttore persona di @it
label: és persona productora de @ca
label: είναι παραγωγός φυσικό πρόσωπο του @el
label: هو شخص منتج لـ @ar
label: 是……的制作者个人 @zh-hans
sub property of: tuottaja (toimija) teoksessa
sub property of: teoksen tekijä (henkilö) teoksessa
definition: Bir kişiyi, ekran, ses kaydı, televizyon, web yayını vb. için bir prodüksiyonun ticari yönlerinin çoğu için bir kişinin sorumluluğunu içeren bir eserle ilişkilendirir. @tr
definition: Correla una persona a un'opera che implica una responsabilità di una persona per la maggior parte degli aspetti commerciali di una produzione per la proiezione, registrazione del suono, televisione, trasmissione via web, etc. @it
definition: Hozzákapcsol egy személyt egy műhöz, amelyhez hozzátartozik egy személy felelőssége képernyőre kerülő műsor, hangfelvétel, televíziós, webes közvetítés, stb. legtöbb üzleti vonatkozásáért. @hu
definition: Liittää henkilön teokseen, jossa henkilö on vastuussa suurimmasta osasta elokuva-, äänite-, televisio-, suoratoisto- tms. tuotannon liiketoiminnallisista tehtävistä.
definition: Met une personne en relation avec une œuvre qui comporte une responsabilité de la part d’une personne en ce qui concerne la majeure partie des aspects commerciaux de la production d’un film, d’un enregistrement audio, d’une émission de télévision, d’une webémission, etc. @fr
definition: Relaciona una persona amb una obra que implica una responsabilitat d’una persona en la majoria dels aspectes comercials d’una producció d’una pel·lícula, d’un enregistrament sonor, d’un programa de televisió, d’una emissió web, etc. @ca
definition: Relateert een persoon aan een werk dat met zich meebrengt een verantwoordelijkheid van een persoon voor het merendeel van de zakelijke aspecten van een productie voor scherm, geluidsopname, televisie, webcast etc. @nl
definition: Relaterer en person til et verk som involverer et ansvar for en person i form av de fleste forretningsmessige aspektene ved en produksjon for film eller fjensyn, lydinnspilling, webkast etc. @no
definition: Relaterer en person til et værk, som involverer en persons ansvar for størstedelen af de forretningsmæssige aspekter ved en produktion beregnet til lærred, lydoptagelse, tv, webcast etc. @da
definition: Relates a person to a work that involves a responsibility of a person for most of the business aspects of a production for screen, sound recording, television, webcast, etc. @en
definition: Sasaista personu ar darbu, kas ietver personas atbildību par filmas, mūzikas ierakstu, televīzijas, tīmekļa pārraižu u.tml. biznesa aspektiem. @lv
definition: Seostab isiku teosega, mis sisaldab isiku vastutust enamiku äriliste aspektide eest filmide, helisalvestiste, telesaadete, veebiülekannete jms tootmisel. @et
definition: Setzt eine Person in Beziehung zu einem Werk, bei dem eine Person für die meisten geschäftlichen Aspekte einer Produktion für die Leinwand, für eine Tonaufnahme, für das Fernsehen, für einen Webcast und so weiter verantwortlich ist. @de
definition: يربط شخصا بعمل يترتب عليه مسئولية شخص عن معظم جوانب العمل في إنتاج للشاشة، وللتسجيل الصوتي، وللتلفزيون، وللبث عبر الإنترنت، إلخ. @ar
definition: 将一个个人与涉及对银幕、录音、电视、网络直播等制作的大部分商业运作的一个个人的责任的一种作品关联起来。 @zh-hans
scope note: A producer is generally responsible for fundraising, managing the production, hiring key personnel, arranging for distributors, etc. @en
scope note: Bir yapımcı genellikle kaynak yaratma, üretimi yönetme, kilit personel işe alma, dağıtımcıları ayarlama vb. işlerden sorumludur. @tr
scope note: Een producent is over het algemeen verantwoordelijk voor fondsenwerving, het beheer van de productie, inhuren van belangrijkste personeel, regelen van distributoren etc. @nl
scope note: Egy producer általában felelős az adománygyűjtésért, a produkció irányításáért, a kulcsfontosságú személyzet felvételéért, a forgalmazók megszervezéséért stb. @hu
scope note: Eine Produzentin/Ein Produzent ist im Allgemeinen für die Geldbeschaffung, das Produktionsmanagement, das Einstellen von wichtigem Personal, die Organisation des Vertriebs und so weiter verantwortlich. @de
scope note: En general, un productor és responsable d’assegurar el finançament, de gestionar la producció, de contractar el personal clau, d’organitzar la distribució, etc. @ca

elokuvatuottaja (henkilö) teoksessa
has element type: 2
toolkit definition: A work that involves a responsibility of a person for most of the business aspects of the production of a film. @en
toolkit definition: Bir filmin yapımının ticari yönlerinin çoğu için bir kişinin sorumluluğunu içeren bir eser. @tr
toolkit definition: Darbs, kas ietver personas atbildību par filmas uzņemšanas finansiālajiem aspektiem. @lv
toolkit definition: Een werk dat met zich meebrengt een verantwoordelijkheid van een persoon voor het merendeel van de zakelijke aspecten van de productie van een film. @nl
toolkit definition: Egy mű, amelyhez hozzátartozik egy személy felelőssége egy filmprodukció legtöbb üzleti vonatkozásáért. @hu
toolkit definition: Ein Werk, bei dem eine Person für die meisten geschäftlichen Aspekte bei der Produktion eines Films verantwortlich ist. @de
toolkit definition: Et verk som involverer et ansvar for en person i form av de fleste forretningsmessige aspektene ved produksjon av en film. @no
toolkit definition: Obra que implica una responsabilitat d’una persona en la majoria dels aspectes comercials de la producció d’una pel·lícula. @ca
toolkit definition: Opera che implica una responsabilità di una persona per la maggior parte degli aspetti commerciali della produzione di un film. @it
toolkit definition: Teos, jossa henkilö on vastuussa suurimmasta osasta elokuvan liiketoimintaa.
toolkit definition: Teos, mis sisaldab isiku vastutust enamiku äriliste aspektide eest filmi tootmisel. @et
toolkit definition: Værk, som involverer en persons ansvar for størstedelen af de forretningsmæssige aspekter ved en film. @da
toolkit definition: Œuvre qui comporte une responsabilité de la part d’une personne en ce qui concerne la majeure partie des aspects commerciaux de la production d’un film. @fr
toolkit definition: عمل يترتب عليه مسئولية شخص عن معظم الجوانب التجارية لإنتاج فيلم. @ar
toolkit definition: 涉及电影制作的大部分商业运作的一个个人的责任的一种作品 @zh-hans
toolkit label: Person als Filmproduzentin/Filmproduzent von @de
toolkit label: elokuvatuottaja (henkilö) teoksessa
toolkit label: film producer person of @en
toolkit label: film yapımcısı @tr
toolkit label: filmiprodutsent (isik) teoses @et
toolkit label: filmproducent-persoon van @nl
toolkit label: filmproducer személye: @hu
toolkit label: filmprodusent for (person) @no
toolkit label: ir filmas producents (persona) @lv
toolkit label: person, som er filmproducer af @da
toolkit label: persona productora cinematogràfica de @ca
toolkit label: personne productrice de cinéma de @fr
toolkit label: produttore cinematografico persona di @it
toolkit label: παραγωγός ταινίας φυσικό πρόσωπο του @el
toolkit label: شخص منتج الفيلم @ar
toolkit label: ……的电影制作人个人 @zh-hans
has subproperty: P50551
lexical alias: filmProducerPersonOf.en
status: Published
type: Property
domain: C10004
label: er filmprodusent for (person) @no
label: er person, som er filmproducer af @da
label: est une personne productrice de cinéma de @fr
label: film yapımcısı kişisidir @tr
label: filmiprodutsent (isik) teoses @et
label: filmproducer személye a következőnek: @hu
label: ir filmas producents (persona) @lv
label: is film producer person of @en
label: is filmproducent-persoon van @nl
label: ist Person als Filmproduzentin/Filmproduzent von @de
label: è produttore cinematografico persona di @it
label: és persona productora cinematogràfica de @ca
label: είναι παραγωγός ταινίας φυσικό πρόσωπο του @el
label: هو شخص منتج لفيلم لـ @ar
label: 是……的电影制作人个人 @zh-hans
sub property of: elokuvatuottaja (toimija) teoksessa
sub property of: tuottaja (henkilö) teoksessa
alternative label: personne productrice de film de @fr
definition: Bir kişiyi, bir filmin yapımının ticari yönlerinin çoğundan bir kişinin sorumluluğunu içeren bir eserle ilişkilendirir. @tr
definition: Correla una persona a un'opera che implica una responsabilità di una persona per la maggior parte degli aspetti commerciali della produzione di un film. @it
definition: Hozzákapcsol egy személyt egy műhöz, amelyhez hozzátartozik egy személy felelőssége egy filmprodukció legtöbb üzleti vonatkozásáért. @hu
definition: Liittää henkilön teokseen, jossa henkilö on vastuussa suurimmasta osasta elokuvan liiketoimintaa.
definition: Met une personne en relation avec une œuvre qui comporte une responsabilité de la part d’une personne en ce qui concerne la majeure partie des aspects commerciaux de la production d’un film. @fr
definition: Relaciona una persona amb una obra que implica una responsabilitat d’una persona en la majoria dels aspectes comercials de la producció d’una pel·lícula. @ca
definition: Relateert een persoon aan een werk dat met zich meebrengt een verantwoordelijkheid van een persoon voor het merendeel van de zakelijke aspecten van de productie van een film. @nl
definition: Relaterer en person til et verk som involverer et ansvar for en person i form av de fleste forretningsmessige aspektene ved produksjon av en film. @no
definition: Relaterer en person til et værk, som involverer en persons ansvar for størstedelen af de forretningsmæssige aspekter ved en film. @da
definition: Relates a person to a work that involves a responsibility of a person for most of the business aspects of the production of a film. @en
definition: Sasaista personu ar darbu, kas ietver personas atbildību par filmas uzņemšanas finansiālajiem aspektiem. @lv
definition: Seostab isiku teosega, mis sisaldab isiku vastutust enamiku äriliste aspektide eest filmi tootmisel. @et
definition: Setzt eine Person in Beziehung zu einem Werk, bei dem eine Person für die meisten geschäftlichen Aspekte bei der Produktion eines Films verantwortlich ist. @de
definition: يربط شخصا بعمل يترتب عليه مسئولية وكيل عن معظم الجوانب التجارية لإنتاج فيلم. @ar
definition: 将一个个人与涉及电影制作的大部分商业运作的一个个人的责任的一种作品关联起来。 @zh-hans

radiotuottaja (henkilö) teoksessa
has element type: 2
toolkit definition: A work that involves a responsibility of a person for most of the business aspects of the production of a radio program. @en
toolkit definition: Bir radyo programının yapımının ticari yönlerinin çoğu için bir kişinin sorumluluğunu içeren bir eser. @tr
toolkit definition: Darbs, kas ietver personas atbildību par radio raidījuma darbības/biznesa aspektiem. @lv
toolkit definition: Een werk dat met zich meebrengt een verantwoordelijkheid van een persoon voor het merendeel van de zakelijke aspecten van het produceren van een radioprogramma. @nl
toolkit definition: Egy mű, amelyhez hozzátartozik egy személy felelőssége egy rádióműsor legtöbb üzleti vonatkozásáért. @hu
toolkit definition: Ein Werk, bei dem eine Person für die meisten geschäftlichen Aspekte einer Hörfunksendung verantwortlich ist. @de
toolkit definition: Et verk som involverer et ansvar for en person i form av de fleste forretningsmessige aspektene ved produksjon av et radioprogram. @no
toolkit definition: Obra que implica una responsabilitat d’una persona en la majoria dels aspectes comercials de la producció d’un programa radiofònic. @ca
toolkit definition: Opera che implica una responsabilità di una persona per la maggior parte degli aspetti commerciali della produzione di un programma radiofonico. @it
toolkit definition: Teos, jossa henkilö on vastuussa suurimmasta osasta radio-ohjelman liiketoimintaa.
toolkit definition: Teos, mis sisaldab isiku vastutust enamiku äriliste aspektide eest raadiosaate tootmisel. @et
toolkit definition: Værk, som involverer en persons ansvar for størstedelen af de forretningsmæssige aspekter ved et radioprogram. @da
toolkit definition: Œuvre qui comporte une responsabilité de la part d’une personne en ce qui concerne la majeure partie des aspects commerciaux de la production d’une émission de radio. @fr
toolkit definition: عمل يترتب عليه مسئولية شخص عن معظم الجوانب التجارية لإنتاج برنامج إذاعي. @ar
toolkit definition: 涉及广播节目制作的大部分商业运作的一个个人的责任的一种作品 @zh-hans
toolkit label: Person als Hörfunkproduzentin/Hörfunkproduzent von @de
toolkit label: ir radio raidījuma producents (persona) @lv
toolkit label: person, som er radioproducer af @da
toolkit label: persona productora radiofònica de @ca
toolkit label: personne productrice de radio de @fr
toolkit label: produttore radiofonico persona di @it
toolkit label: raadioprodutsent (isik) teoses @et
toolkit label: radio producer person of @en
toolkit label: radioproducent-persoon van @nl
toolkit label: radioprodusent for (person) @no
toolkit label: radiotuottaja (henkilö) teoksessa
toolkit label: radyo yapımcısı olan kişi @tr
toolkit label: rádióproducer személye: @hu
toolkit label: ραδιοφωνικός παραγωγός φυσικό πρόσωπο του @el
toolkit label: شخص منتج إذاعي لـ @ar
toolkit label: ……的广播制作人个人 @zh-hans
has subproperty: P50552
lexical alias: radioProducerPersonOf.en
status: Published
type: Property
domain: C10004
label: er person, som er radioproducer af @da
label: er radioprodusent for (person) @no
label: est une personne productrice de radio de @fr
label: ir radio raidījuma producents (persona) @lv
label: is radio producer person of @en
label: is radioproducent-persoon van @nl
label: ist Person als Hörfunkproduzentin/Hörfunkproduzent von @de
label: raadioprodutsent (isik) teoses @et
label: radyo yapımcısı kişisidir @tr
label: rádióproducer személye a következőnek: @hu
label: è produttore radiofonico persona di @it
label: és persona productora radiofònica de @ca
label: είναι ραδιοφωνικός παραγωγός φυσικό πρόσωπο του @el
label: هو شخص منتج إذاعي لـ @ar
label: 是……的广播制作人个人 @zh-hans
sub property of: radiotuottaja (toimija) teoksessa
sub property of: tuottaja (henkilö) teoksessa
definition: Bir kişiyi, bir radyo programının üretiminin ticari yönlerinin çoğu için bir kişinin sorumluluğunu içeren bir eserle ilişkilendirir. @tr
definition: Correla una persona a un'opera che implica una responsabilità di una persona per la maggior parte degli aspetti commerciali della produzione di un programma radiofonico. @it
definition: Hozzákapcsol egy személyt egy műhöz, amelyhez hozzátartozik egy személy felelőssége egy rádióműsor legtöbb üzleti vonatkozásáért. @hu
definition: Liittää henkilön teokseen, jossa henkilö on vastuussa suurimmasta osasta radio-ohjelman liiketoimintaa.
definition: Met une personne en relation avec une œuvre qui comporte une responsabilité de la part d’une personne en ce qui concerne la majeure partie des aspects commerciaux de la production d’une émission de radio. @fr
definition: Relaciona una persona amb una obra que implica una responsabilitat d’una persona en la majoria dels aspectes comercials de la producció d’un programa radiofònic. @ca
definition: Relateert een persoon aan een werk dat met zich meebrengt een verantwoordelijkheid van een persoon voor het merendeel van de zakelijke aspecten van het produceren van een radioprogramma. @nl
definition: Relaterer en person til et verk som involverer et ansvar for en person i form av de fleste forretningsmessige aspektene ved produksjon av et radioprogram. @no
definition: Relaterer en person til et værk, som involverer en persons ansvar for størstedelen af de forretningsmæssige aspekter ved et radioprogram. @da
definition: Relates a person to a work that involves a responsibility of a person for most of the business aspects of the production of a radio program. @en
definition: Sasaista personu ar darbu, kas ietver personas atbildību par radio raidījuma darbības/biznesa aspektiem. @lv
definition: Seostab isiku teosega, mis sisaldab isiku vastutust enamiku äriliste aspektide eest raadiosaate tootmisel. @et
definition: Setzt eine Person in Beziehung zu einem Werk, bei dem eine Person für die meisten geschäftlichen Aspekte einer Hörfunksendung verantwortlich ist. @de
definition: يربط شخصا بعمل يترتب عليه مسئولية شخص عن معظم الجوانب التجارية لإنتاج برنامج إذاعي. @ar
definition: 将一个个人与涉及广播节目制作的大部分商业运作的一个个人的责任的一种作品关联起来。 @zh-hans

televisiotuottaja (henkilö) teoksessa
has element type: 2
toolkit definition: A work that involves a responsibility of a person for most of the business aspects of the production of a television program. @en
toolkit definition: Bir televizyon programının yapımının ticari yönlerinin çoğu için bir kişinin sorumluluğunu içeren bir çalışma @tr
toolkit definition: Darbs, kas ietver personas atbildību par televīzijas raidījuma biznesa aspektiem. @lv
toolkit definition: Een werk dat met zich meebrengt een verantwoordelijkheid van een persoon voor het merendeel van de zakelijke aspecten van de productie van een televisieprogramma. @nl
toolkit definition: Egy mű, amelyhez hozzátartozik egy személy felelőssége egy televízióműsor legtöbb üzleti vonatkozásáért. @hu
toolkit definition: Ein Werk, bei dem eine Person für die meisten geschäftlichen Aspekte einer Fernsehsendung verantwortlich ist. @de
toolkit definition: Et verk som involverer et ansvar for en person i form av de fleste forretningsmessige aspektene ved produksjon av et fjernsynsprogram. @no
toolkit definition: Obra que implica una responsabilitat d’una persona en la majoria dels aspectes comercials de la producció d’un programa de televisió. @ca
toolkit definition: Opera che implica una responsabilità di una persona per la maggior parte degli aspetti commerciali della produzione di un programma televisivo. @it
toolkit definition: Teos, jossa henkilö on vastuussa suurimmasta osasta televisio-ohjelman liiketoimintaa.
toolkit definition: Teos, mis sisaldab isiku vastutust enamiku äriliste aspektide eest telesaate tootmisel. @et
toolkit definition: Værk, som involverer en persons ansvar for størstedelen af de forretningsmæssige aspekter ved et tv-program. @da
toolkit definition: Œuvre qui comporte une responsabilité de la part d’une personne en ce qui concerne la majeure partie des aspects commerciaux de la production d’une émission de télévision. @fr
toolkit definition: عمل يترتب عليه مسئولية شخص عن معظم الجوانب التجارية لإنتاج برنامج تليفزيوني. @ar
toolkit definition: 涉及电视节目制作的大部分商业运作的一个个人的责任的一种作品 @zh-hans
toolkit label: Person als Fernsehproduzentin/Fernsehproduzent von @de
toolkit label: fjernsynsprodusent for (person) @no
toolkit label: ir televīzijas raidījuma producents (persona) @lv
toolkit label: person, som er tv-producer af @da
toolkit label: persona productora de televisió de @ca
toolkit label: personne productrice de télévision de @fr
toolkit label: produttore televisivo persona di @it
toolkit label: teleprodutsent (isik) teoses @et
toolkit label: televisieproducent-persoon van @nl
toolkit label: television producer person of @en
toolkit label: televisiotuottaja (henkilö) teoksessa
toolkit label: televizyon yapımcısı olam kişi @tr
toolkit label: televízió-producer személye: @hu
toolkit label: τηλεοπτικός παραγωγός φυσικό πρόσωπο του @el
toolkit label: شخص منتج تليفزيوني @ar
toolkit label: ……的电视制作人个人 @zh-hans
has subproperty: P50553
lexical alias: televisionProducerPersonOf.en
status: Published
type: Property
domain: C10004
label: er fjernsynsprodusent for (person) @no
label: er person, som er tv-producer af @da
label: est une personne productrice de télévision de @fr
label: ir televīzijas raidījuma producents (persona) @lv
label: is televisieproducent-persoon van @nl
label: is television producer person of @en
label: ist Person als Fernsehproduzentin/Fernsehproduzent von @de
label: teleprodutsent (isik) teoses @et
label: televizyon yapımcısıdır @tr
label: televízió-producer személye a következőnek: @hu
label: è produttore televisivo persona di @it
label: és persona productora de televisió de @ca
label: είναι τηλεοπτικός παραγωγός φυσικό πρόσωπο του @el
label: هو شخص منتج تليفزيوني لـ @ar
label: 是……的电视制作人个人 @zh-hans
sub property of: televisiotuottaja (toimija) teoksessa
sub property of: tuottaja (henkilö) teoksessa
definition: Bir kişiyi, bir televizyon programının yapımının ticari yönlerinin çoğu için bir kişinin sorumluluğunu içeren bir eserle ilişkilendirir. @tr
definition: Correla una persona a un'opera che implica una responsabilità di una persona per la maggior parte degli aspetti commerciali della produzione di un programma televisivo. @it
definition: Hozzákapcsol egy személyt egy műhöz, amelyhez hozzátartozik egy személy felelőssége egy televízióműsor legtöbb üzleti vonatkozásáért. @hu
definition: Liittää henkilön teokseen, jossa henkilö on vastuussa suurimmasta osasta televisio-ohjelman liiketoimintaa.
definition: Met une personne en relation avec une œuvre qui comporte une responsabilité de la part d’une personne en ce qui concerne la majeure partie des aspects commerciaux de la production d’une émission de télévision. @fr
definition: Relaciona una persona amb una obra que implica una responsabilitat d’una persona en la majoria dels aspectes comercials de la producció d’un programa de televisió. @ca
definition: Relateert een persoon aan een werk dat met zich meebrengt een verantwoordelijkheid van een persoon voor het merendeel van de zakelijke aspecten van de productie van een televisieprogramma. @nl
definition: Relaterer en person til et verk som involverer et ansvar for en person i form av de fleste forretningsmessige aspektene ved produksjon av et fjernsynsprogram. @no
definition: Relaterer en person til et værk, som involverer en persons ansvar for størstedelen af de forretningsmæssige aspekter ved et tv-program. @da
definition: Relates a person to a work that involves a responsibility of a person for most of the business aspects of the production of a television program. @en
definition: Sasaista personu ar darbu, kas ietver personas atbildību par televīzijas raidījuma biznesa aspektiem. @lv
definition: Seostab isiku teosega, mis sisaldab isiku vastutust enamiku äriliste aspektide eest telesaate tootmisel. @et
definition: Setzt eine Person in Beziehung zu einem Werk, bei dem eine Person für die meisten geschäftlichen Aspekte einer Fernsehsendung verantwortlich ist. @de
definition: يربط شخصا بعمل يترتب عليه مسئولية شخص عن معظم الجوانب التجارية لإنتاج برنامج تليفزيوني. @ar
definition: 将一个个人与涉及电视节目制作的大部分商业运作的一个个人的责任的一种作品关联起来。 @zh-hans

järjestäjä (henkilö) teoksessa
has element type: 2
toolkit definition: A work that involves a responsibility of a person for organizing a conference, exhibition, or other event that gives rise to a work. @en
toolkit definition: Bir konferansı, sergiyi ya da bir çalışmaya yol açan başka bir etkinliği düzenlemek için bir kişinin sorumluluğunu içeren bir çalışma @tr
toolkit definition: Darbs, kas ietver personas atbildību par konferences, izstādes vai pasākuma organizēšanu. @lv
toolkit definition: Een werk dat met zich meebrengt een verantwoordelijkheid van een persoon voor het organiseren van een conferentie, tentoonstelling of andere gebeurtenis die aanleiding geeft tot een werk. @nl
toolkit definition: Egy mű, amelyhez hozzátartozik egy személy felelőssége egy mű létrejöttét eredményező konferencia, kiállítás vagy más esemény szervezéséért. @hu
toolkit definition: Ein Werk, bei dem eine Person für die Organisation beziehungsweise Veranstaltung einer Konferenz, einer Ausstellung oder eines anderen Ereignisses verantwortlich ist, aus der/dem ein Werk hervorgeht. @de
toolkit definition: Et verk som involverer et ansvar for en person i form av å organisere en konferanse, en utstilling eller et annet arrangement som gir opphav til et verk. @no
toolkit definition: Obra que implica una responsabilitat d’una persona organitzant un congrés, una exposició o qualsevol altre esdeveniment que dona lloc a una obra. @ca
toolkit definition: Opera che implica una responsabilità di una persona nell'organizzazione di una conferenza, mostra o altro evento che dà origine a un'opera. @it
toolkit definition: Teos, jossa henkilö on vastuussa konferenssin, näyttelyn tai muun tapahtuman järjestämisestä ja jonka seurauksena syntyy teos.
toolkit definition: Teos, mis sisaldab isiku vastutust teosele aluse pannud konverentsi, näituse vm ürituse korraldamise eest. @et
toolkit definition: Værk, som involverer en persons ansvar for at organisere en konference, udstilling eller anden begivenhed, som giver anledning til et værk. @da
toolkit definition: Œuvre qui comporte une responsabilité de la part d’une personne consistant à organiser un congrès, une exposition ou un autre événement qui donne lieu à la création d’une œuvre. @fr
toolkit definition: عمل يترتب عليه مسئولية شخص عن تنظيم مؤتمر أو معرض أو فعالية أخرى ينشأ عنها عمل. @ar
toolkit definition: 涉及组织会议、展览或其他事件产生一种作品的一个个人的责任的一种作品 @zh-hans
toolkit label: Person als Veranstalterin/Veranstalter von @de
toolkit label: arrangør av (person) @no
toolkit label: ir organizators (persona) @lv
toolkit label: järjestäjä (henkilö) teoksessa
toolkit label: korraldaja (isik) teoses @et
toolkit label: organisator-persoon van @nl
toolkit label: organizatör kişisi @tr
toolkit label: organizer person of @en
toolkit label: organizzatore persona di @it
toolkit label: person, som er arrangør af @da
toolkit label: persona organitzadora de @ca
toolkit label: personne organisatrice de @fr
toolkit label: szervező személye: @hu
toolkit label: οργανωτής φορέας του @el
toolkit label: شخص منظم @ar
toolkit label: ……的组织者个人 @zh-hans
has subproperty: P50554
lexical alias: organizerPersonOf.en
status: Published
type: Property
domain: C10004
label: er arrangør av (person) @no
label: er person, som er arrangør af @da
label: est une personne organisatrice de @fr
label: ir organizators (persona) @lv
label: is organisator-persoon van @nl
label: is organizer person of @en
label: ist Person als Veranstalterin/Veranstalter von @de
label: korraldaja (isik) teoses @et
label: organizatör kişisidir @tr
label: szervező személye a következőnek: @hu
label: è organizzatore persona di @it
label: és persona organitzadora de @ca
label: είναι οργανωτής φορέας του @el
label: هو شخص منظم لـ @ar
label: 是……的组织者个人 @zh-hans
sub property of: järjestäjä (toimija) teoksessa
sub property of: henkilöön liittyvä teos
definition: Bir kişiyi, bir esere yol açan bir konferans, sergi veya başka bir etkinlik düzenleme sorumluluğunu içeren bir eserle ilişkilendirir. @tr
definition: Correla una persona a un'opera che implica una responsabilità di una persona nell'organizzazione di una conferenza, mostra o altro evento che dà origine a un'opera. @it
definition: Hozzákapcsol egy személyt egy műhöz, amelyhez hozzátartozik egy személy felelőssége egy mű létrejöttét eredményező konferencia, kiállítás vagy más esemény szervezéséért. @hu
definition: Liittää henkilön teokseen, jossa henkilö on vastuussa konferenssin, näyttelyn tai muun tapahtuman järjestämisestä ja jonka seurauksena syntyy teos.
definition: Met une personne en relation avec une œuvre qui comporte une responsabilité de la part d’une personne consistant à organiser un congrès, une exposition ou un autre événement qui donne lieu à la création d’une œuvre. @fr
definition: Relaciona una persona amb una obra que implica una responsabilitat d’una persona organitzant un congrés, una exposició o qualsevol altre esdeveniment que dona lloc a una obra. @ca
definition: Relateert een persoon aan een werk dat met zich meebrengt een verantwoordelijkheid van een persoon voor het organiseren van een conferentie, tentoonstelling of andere gebeurtenis die aanleiding geeft tot een werk. @nl
definition: Relaterer en person til et verk som involverer et ansvar for en person i form av å organisere en konferanse, en utstilling eller et annet arrangement som gir opphav til et verk. @no
definition: Relaterer en person til et værk, som involverer en persons ansvar for at organisere en konference, udstilling eller anden begivenhed, som giver anledning til et værk. @da
definition: Relates a person to a work that involves a responsibility of a person for organizing a conference, exhibition, or other event that gives rise to a work. @en
definition: Sasaista personu ar darbu, kas ietver personas atbildību par konferences, izstādes vai pasākuma organizēšanu. @lv
definition: Seostab isiku teosega, mis sisaldab isiku vastutust teosele aluse pannud konverentsi, näituse vm ürituse korraldamise eest. @et
definition: Setzt eine Person in Beziehung zu einem Werk, bei dem eine Person für die Organisation beziehungsweise Veranstaltung einer Konferenz, einer Ausstellung oder eines anderen Ereignisses verantwortlich ist, aus der/dem ein Werk hervorgeht. @de
definition: يربط شخصا بعمل يترتب عليه مسئولية شخص عن تنظيم مؤتمر أو معرض أو فعالية أخرى ينشأ عنها عمل. @ar
definition: 将一个个人与涉及组织会议、展览或其他事件产生一种作品的一个个人的责任的一种作品关联起来。 @zh-hans

teoksen valokuvaaja (henkilö) teoksessa
has element type: 2
toolkit definition: A work that involves a responsibility of a person for creating a photographic work. @en
toolkit definition: Bir fotoğrafik çalışma yaratmak için bir kişinin sorumluluğunu içeren bir eser. @tr
toolkit definition: Darbs, kas ietver personas atbildību par fotografēšanu. @lv
toolkit definition: Een werk dat is een fotografisch werk dat met zich meebrengt een verantwoordelijkheid van een persoon voor fotografie. @nl
toolkit definition: Egy fényképészeti mű, amelyhez hozzátartozik egy személy felelőssége a fotózásért. @hu
toolkit definition: Ein fotografisches Werk, bei dem eine Person für die Fotografie verantwortlich ist. @de
toolkit definition: Et verk som involverer et ansvar for en person i form av fotografi. @no
toolkit definition: Obra que implica una responsabilitat d’una persona en la creació d’una obra fotogràfica. @ca
toolkit definition: Opera che implica una responsabilità di una persona per la fotografia. @it
toolkit definition: Teos, joka on valokuvateos, jonka luomisesta henkilö on vastuussa.
toolkit definition: Teos, mis sisaldab isiku vastutust fotograafia eest. @et
toolkit definition: Værk, som er et fotografisk værk, som involverer en persons ansvar for fotografi. @da
toolkit definition: Œuvre qui comporte une responsabilité de la part d’une personne consistant à créer une œuvre photographique. @fr
toolkit definition: عمل عبارة عن عمل فوتوغرافي يترتب عليه مسئولية شخص عن التصوير. @ar
toolkit definition: 涉及创作一种摄影作品的个人的责任的一种作品 @zh-hans
toolkit label: Eserin fotoğrafçısı @tr
toolkit label: Person als Fotografin/Fotograf eines Werks von @de
toolkit label: fotograaf-persoon van werk van @nl
toolkit label: fotograf for verk for (person) @no
toolkit label: fotografo persona di opera di @it
toolkit label: fényképész személye a következő műnek: @hu
toolkit label: ir fotogrāfs (persona) @lv
toolkit label: person, som er fotograf af værk af @da
toolkit label: persona fotògrafa d’una obra de @ca
toolkit label: personne photographe d’une œuvre de @fr
toolkit label: photographer person of work of @en
toolkit label: teoksen valokuvaaja (henkilö) teoksessa
toolkit label: teose fotograaf (isik) teoses @et
toolkit label: φωτογράφος φυσικό πρόσωπο του έργου του @el
toolkit label: شخص مصور عمل @ar
toolkit label: ……作品的摄影者个人 @zh-hans
has subproperty: P50555
lexical alias: photographerPersonOfWorkOf.en
status: Published
type: Property
domain: C10004
label: er fotograf for verk for (person) @no
label: er person, som er fotograf af værk af @da
label: eserinin fotoğrafçı kişisidir @tr
label: est une personne photographe d’une œuvre de @fr
label: fényképész személye a következő műnek: @hu
label: ir fotogrāfs (persona) @lv
label: is fotograaf-persoon van werk van @nl
label: is photographer person of work of @en
label: ist Person als Fotografin/Fotograf eines Werks von @de
label: teose fotograaf (isik) teoses @et
label: è fotografo persona di opera di @it
label: és persona fotògrafa d’una obra de @ca
label: είναι φωτογράφος φυσικό πρόσωπο του έργου του @el
label: هو شخص مصور لعمل @ar
label: 是……作品的摄影者个人 @zh-hans
sub property of: teoksen valokuvaaja (toimija) teoksessa
sub property of: teoksen tekijä (henkilö) teoksessa
definition: Bir kişiyi, fotoğrafik bir eser yaratmak için bir kişinin sorumluluğunu içeren bir eserle ilişkilendirir. @tr
definition: Correla una persona a un'opera che implica una responsabilità di una persona per la fotografia. @it
definition: Hozzákapcsol egy személyt egy fényképészeti műhöz, amelyhez hozzátartozik egy személy felelőssége a fotózásért. @hu
definition: Liittää henkilön teokseen, joka on valokuvateos, jonka luomisesta henkilö on vastuussa.
definition: Met une personne en relation avec une œuvre qui comporte une responsabilité de la part d’une personne consistant à créer une œuvre photographique. @fr
definition: Relaciona una persona amb una obra que implica una responsabilitat d’una persona en la creació d’una obra fotogràfica. @ca
definition: Relateert een persoon aan een werk dat is een fotografisch werk dat met zich meebrengt een verantwoordelijkheid van een persoon voor fotografie. @nl
definition: Relaterer en person til et verk som involverer et ansvar for en person i form av fotografi. @no
definition: Relaterer en person til et værk, som er et fotografsik værk, som involverer en persons ansvar for fotografi. @da
definition: Relates a person to a work that involves a responsibility of a person for creating a photographic work. @en
definition: Sasaista personu ar darbu, kas ietver personas atbildību par fotografēšanu. @lv
definition: Seostab isiku teosega, mis sisaldab isiku vastutust fotograafia eest. @et
definition: Setzt eine Person in Beziehung zu einem fotografischen Werk, bei dem eine Person für die Fotografie verantwortlich ist. @de
definition: يربط شخصا بعمل عبارة عن عمل فوتوغرافي يترتب عليه مسئولية شخص عن التصوير. @ar
definition: 将一个个人与涉及创作一种摄影作品的个人的责任的一种作品关联起来。 @zh-hans

asiantuntija (henkilö) teoksessa
has element type: 2
toolkit definition: A work that involves a responsibility of a person for providing consultation services, and often making recommendations, to a creator of a work. @en
toolkit definition: Bir eserin yaratıcısına danışmanlık hizmetleri sağlama ve genellikle tavsiyelerde bulunma konusunda bir kişinin sorumluluğunu içeren bir eser. @tr
toolkit definition: Darbs, kas ietver personas atbildību par konsultāciju pakalpojumu un ieteikumu sniegšanu citam aģentam, kas ir darba radītājs. @lv
toolkit definition: Een werk dat met zich meebrengt een verantwoordelijkheid van een persoon voor het leveren van diensten van raadgeving, en vaak het doen van aanbevelingen, aan een maker van een werk. @nl
toolkit definition: Egy mű, amelyhez hozzátartozik egy személy felelőssége tanácsadó szolgáltatásért és gyakran egy mű létrehozójának tett javaslatokért is. @hu
toolkit definition: Ein Werk, bei dem eine Person einer geistigen Schöpferin/einem geistigen Schöpfer eines Werks Beratungsdienste anbietet und Empfehlungen macht. @de
toolkit definition: Et verk som involverer et ansvar for en person i form av å levere konsulenttjenester og ofte gi anbefalinger til en skaper av et verk. @no
toolkit definition: Obra que implica una responsabilitat d’una persona proporcionant serveis d’assessorament, i que sovint fa recomanacions, a un creador d’una obra. @ca
toolkit definition: Opera che implica una responsabilità di una persona nel fornire servizi di consulenza e spesso raccomandazioni a un creatore di un'opera. @it
toolkit definition: Teos, jossa henkilö on vastuussa asiantuntijapalveluiden tarjoamisesta ja suositusten antamisesta teoksen tekijälle.
toolkit definition: Teos, mis sisaldab isiku vastutust konsultatsiooni ja sageli ka soovituste andmise eest teose autorile. @et
toolkit definition: Værk, som involverer en persons ansvar for at yde rådgivning og ofte komme med anbefalinger til et ophav til et værk. @da
toolkit definition: Œuvre qui comporte une responsabilité de la part d’une personne consistant à fournir des services de consultation et souvent à faire des recommandations à un créateur d’une œuvre. @fr
toolkit definition: عمل يترتب عليه مسئولية شخص عن تقديم خدمات استشارية، وغالبا ما يقدم مقترحات إلى منشئ عمل. @ar
toolkit definition: 涉及向作品创作者提供咨询服务并经常提供建议的一个行为者的责任的一种作品 @zh-hans
toolkit label: Person als Beraterin/Berater von @de
toolkit label: asiantuntija (henkilö) teoksessa
toolkit label: consulente persona di @it
toolkit label: consultant person of @en
toolkit label: consultant-persoon van @nl
toolkit label: danışman @tr
toolkit label: ir konsultants (persona) @lv
toolkit label: konsulent for (person) @no
toolkit label: konsultant (isik) teoses @et
toolkit label: person, som er rådgiver af @da
toolkit label: persona consultora de @ca
toolkit label: personne consultante de @fr
toolkit label: tanácsadó személye: @hu
toolkit label: σύμβουλος φυσικό πρόσωπο του @el
toolkit label: شخص استشاري @ar
toolkit label: ……的顾问个人 @zh-hans
has subproperty: P50556
lexical alias: consultantPersonOf.en
status: Published
type: Property
domain: C10004
label: danışman kişisidir @tr
label: er konsulent for (person) @no
label: er person, som er rådgiver af @da
label: est une personne consultante de @fr
label: ir konsultants (persona) @lv
label: is consultant person of @en
label: is consultant-persoon van @nl
label: ist Person als Beraterin/Berater von @de
label: konsultant (isik) teoses @et
label: tanácsadó személye a következőnek: @hu
label: è consulente persona di @it
label: és persona consultora de @ca
label: είναι σύμβουλος φυσικό πρόσωπο του @el
label: هو شخص استشاري لـ @ar
label: 是……的顾问个人 @zh-hans
sub property of: asiantuntija (toimija) teoksessa
sub property of: henkilöön liittyvä teos
definition: Bir kişiyi, bir eserin yaratıcısına danışma hizmetleri sağlama ve genellikle tavsiyelerde bulunma sorumluluğunu içeren bir eserle ilişkilendirir. @tr
definition: Correla una persona a un'opera che implica una responsabilità di una persona nel fornire servizi di consulenza e spesso raccomandazioni a un creatore di un'opera. @it
definition: Hozzákapcsol egy személyt egy műhöz, amelyhez hozzátartozik egy személy felelőssége tanácsadó szolgáltatásért és gyakran egy mű létrehozójának tett javaslatokért is. @hu
definition: Liittää henkilön teokseen, jossa henkilö on vastuussa asiantuntijapalveluiden tarjoamisesta ja suositusten antamisesta teoksen tekijälle.
definition: Met une personne en relation avec une œuvre qui comporte une responsabilité de la part d’une personne consistant à fournir des services de consultation et souvent à faire des recommandations à un créateur d’une œuvre. @fr
definition: Relaciona una persona amb una obra que implica una responsabilitat d’una persona proporcionant serveis d’assessorament, i que sovint fa recomanacions, a un creador d’una obra. @ca
definition: Relateert een persoon aan een werk dat met zich meebrengt een verantwoordelijkheid van een persoon voor het leveren van diensten van raadgeving, en vaak het doen van aanbevelingen, aan een maker van een werk. @nl
definition: Relaterer en person til et verk som involverer et ansvar for en person i form av å levere konsulenttjenester og ofte gi anbefalinger til en skaper av et verk. @no
definition: Relaterer en person til et værk, som involverer en persons ansvar for at yde rådgivning og ofte komme med anbefalinger til et ophav til et værk. @da
definition: Relates a person to a work that involves a responsibility of a person for providing consultation services, and often making recommendations, to a creator of a work. @en
definition: Sasaista personu ar darbu, kas ietver personas atbildību par konsultāciju pakalpojumu un ieteikumu sniegšanu citam aģentam, kas ir darba radītājs. @lv
definition: Seostab isiku teosega, mis sisaldab isiku vastutust konsultatsiooni ja sageli ka soovituste andmise eest teose autorile. @et
definition: Setzt eine Person in Beziehung zu einem Werk, bei dem eine Person einer geistigen Schöpferin/einem geistigen Schöpfer eines Werks Beratungsdienste anbietet und Empfehlungen macht. @de
definition: يربط شخصا بعمل يترتب عليه مسئولية شخص عن تقديم خدمات استشارية، وغالبا ما يقدم مقترحات إلى منشئ عمل. @ar
definition: 将一个个人与涉及向作品创作者提供咨询服务并经常提供建议的一个行为者的责任的一种作品关联起来。 @zh-hans

kokousten raportoija (henkilö) teoksessa
has element type: 2
toolkit definition: A work that involves a responsibility of a person for reporting on the proceedings of meetings of an organization. @en
toolkit definition: Bir organizasyonun toplantılarının bildirilerini raporlamak için bir kişinin sorumluluğunu içeren bir eser. @tr
toolkit definition: Darbs, kas ietver personas atbildību par ziņošanu par organizācijas sanāksmju norisi. @lv
toolkit definition: Een werk dat met zich meebrengt een verantwoordelijkheid van een persoon voor het rapporteren van handelingen van bijeenkomsten van een organisatie. @nl
toolkit definition: Egy mű, amelyhez hozzátartozik egy személy felelőssége egy szervezet üléseinek lefolyásáról szóló jelentésért. @hu
toolkit definition: Ein Werk, bei dem eine Person für das Berichten über den Ablauf von Sitzungen einer Organisation verantwortlich ist. @de
toolkit definition: Et verk som involverer et ansvar for en person i form av å rapportere fra møtene i en organisasjon. @no
toolkit definition: Obra que implica una responsabilitat d’una persona en la redacció de les actes de les reunions d’una organització. @ca
toolkit definition: Opera che implica una responsabilità di una persona per la redazione dei verbali degli incontri di un'organizzazione. @it
toolkit definition: Teos, jossa henkilön vastuulla on raportoida organisaation kokousmenettelyistä.
toolkit definition: Teos, mis sisaldab isiku vastutust organisatsiooni koosolekute toimingutest aruande kirjutamise eest. @et
toolkit definition: Værk, som involverer en persons ansvar for at rapportere om udviklingerne ved en organisations møder. @da
toolkit definition: Œuvre qui comporte une responsabilité de la part d’une personne consistant à rédiger les comptes rendus des réunions d’une organisation. @fr
toolkit definition: عمل يترتب عليه مسئولية شخص عن إعداد تقرير عن وقائع اجتماعات مؤسسة. @ar
toolkit definition: 涉及一个组织的会议文集报告的一个个人的责任的一种作品 @zh-hans
toolkit label: Person als Berichterstatterin/Berichterstatter von @de
toolkit label: aruande koostaja (isik) teoses @et
toolkit label: ir ziņotājs (persona) @lv
toolkit label: kokousten raportoija (henkilö) teoksessa
toolkit label: person, som er rapportør af @da
toolkit label: persona relatora de @ca
toolkit label: personne rapporteuse de @fr
toolkit label: raportör kişisi @tr
toolkit label: raportőr személye: @hu
toolkit label: rapporteur person of @en
toolkit label: rapporteur-persoon van @nl
toolkit label: rapportør for (person) @no
toolkit label: relatore persona di @it
toolkit label: εισηγητής φυσικό πρόσωπο του @el
toolkit label: شخص مقرر @ar
toolkit label: ……的会务报告人个人 @zh-hans
has subproperty: P50557
lexical alias: rapporteurPersonOf.en
status: Published
type: Property
domain: C10004
label: aruande koostaja (isik) teoses @et
label: er person, som er rapportør af @da
label: er rapportør for (person) @no
label: est une personne rapporteuse de @fr
label: ir ziņotājs (persona) @lv
label: is rapporteur person of @en
label: is rapporteur-persoon van @nl
label: ist Person als Berichterstatterin/Berichterstatter von @de
label: raportör kişisidir @tr
label: raportőr személye a következőnek: @hu
label: è relatore persona di @it
label: és persona relatora de @ca
label: είναι εισηγητής φυσικό πρόσωπο του @el
label: هو شخص مقرر لـ @ar
label: 是……的会务报告人个人 @zh-hans
sub property of: kokousten raportoija (toimija) teoksessa
sub property of: kirjoittaja (henkilö) teoksessa
definition: Bir kişiyi, bir kuruluşun toplantılarının tutanaklarını raporlama sorumluluğunu içeren bir eserle ilişkilendirir. @tr
definition: Correla una persona a un'opera che implica una responsabilità di una persona per la redazione dei verbali degli incontri di un'organizzazione. @it
definition: Hozzákapcsol egy személyt egy műhöz, amelyhez hozzátartozik egy személy felelőssége egy szervezet üléseinek lefolyásáról szóló jelentésért. @hu
definition: Liittää henkilön teokseen, jossa henkilön vastuulla on raportoida organisaation kokousmenettelyistä.
definition: Met une personne en relation avec une œuvre qui comporte une responsabilité de la part d’une personne consistant à rédiger les comptes rendus des réunions d’une organisation. @fr
definition: Relaciona una persona amb una obra que implica una responsabilitat d’una persona en la redacció de les actes de les reunions d’una organització. @ca
definition: Relateert een persoon aan een werk dat met zich meebrengt een verantwoordelijkheid van een persoon voor het rapporteren van handelingen van bijeenkomsten van een organisatie. @nl
definition: Relaterer en person til et verk som involverer et ansvar for en person i form av å rapportere fra møtene i en organisasjon. @no
definition: Relaterer en person til et værk, som involverer en persons ansvar for at rapportere om udviklingerne ved en organisations møder. @da
definition: Relates a person to a work that involves a responsibility of a person for reporting on the proceedings of meetings of an organization. @en
definition: Sasaista personu ar darbu, kas ietver personas atbildību par ziņošanu par organizācijas sanāksmju norisi. @lv
definition: Seostab isiku teosega, mis sisaldab isiku vastutust organisatsiooni koosolekute toimingutest aruande kirjutamise eest. @et
definition: Setzt eine Person in Beziehung zu einem Werk, bei dem eine Person für das Berichten über den Ablauf von Sitzungen einer Organisation verantwortlich ist. @de
definition: يربط شخصا بعمل يترتب عليه مسئولية شخص عن إعداد تقرير عن وقائع اجتماعات مؤسسة. @ar
definition: 将一个个人与涉及一个组织的会议文集报告的一个个人的责任的一种作品关联起来。 @zh-hans

tutkija (henkilö) teoksessa
has element type: 2
toolkit definition: A work that involves a responsibility of a person for research in support of a work. @en
toolkit definition: Bir çalışmayı destekleyen bir araştırma için bir kişinin sorumluluğunu içeren bir eser. @tr
toolkit definition: Darbs, kas ietver personas atbildību par pētījumu, lai atbalstītu darba radīšanu. @lv
toolkit definition: Een werk dat met zich meebrengt een verantwoordelijkheid van een persoon voor onderzoek ter ondersteuning van een werk. @nl
toolkit definition: Egy mű, amelyhez hozzátartozik egy személy felelőssége egy művet támogató kutatásért. @hu
toolkit definition: Ein Werk, bei dem eine Person für die Forschung zur Unterstützung eines Werks verantwortlich ist. @de
toolkit definition: Et verk som involverer et ansvar for en person i form av forskning som støtte for et verk. @no
toolkit definition: Obra que implica una responsabilitat d’una persona en la recerca per donar suport a una obra. @ca
toolkit definition: Opera che implica una responsabilità di una persona nella ricerca in supporto di un'opera. @it
toolkit definition: Teos, jossa henkilö on vastuussa tutkimuksesta, joka tukee teoksen syntymistä.
toolkit definition: Teos, mis sisaldab isiku vastutust teose heaks uurimistöö tegemise eest. @et
toolkit definition: Værk, som involverer en persons ansvar for research til at understøtte et værk. @da
toolkit definition: Œuvre qui comporte une responsabilité de la part d’une personne consistant à effectuer des recherches pour aider à la création d’une œuvre. @fr
toolkit definition: عمل يترتب عليه مسئولية شخص عن البحث لدعم عمل. @ar
toolkit definition: 涉及对一种作品研究支持的一个个人的责任的一种作品 @zh-hans
toolkit label: Person als Forscherin/Forscher von @de
toolkit label: araştırmacı kişi @tr
toolkit label: forsker for (person) @no
toolkit label: ir pētnieks (persona) @lv
toolkit label: kutató személye: @hu
toolkit label: onderzoeker-persoon van @nl
toolkit label: person, som er researcher af @da
toolkit label: persona investigadora de @ca
toolkit label: personne recherchiste de @fr
toolkit label: researcher person of @en
toolkit label: ricercatore persona di @it
toolkit label: tutkija (henkilö) teoksessa
toolkit label: uurija (isik) teoses @et
toolkit label: ερευνητής φυσικό πρόσωπο του @el
toolkit label: شخص باحث لـ @ar
toolkit label: ……的研究者个人 @zh-hans
has subproperty: P50558
lexical alias: researcherPersonOf.en
status: Published
type: Property
domain: C10004
label: araştırmacı kişisidir @tr
label: er forsker for (person) @no
label: er person, som er researcher af @da
label: est une personne recherchiste de @fr
label: ir pētnieks (persona) @lv
label: is onderzoeker-persoon van @nl
label: is researcher person of @en
label: ist Person als Forscherin/Forscher von @de
label: kutató személye a következőnek: @hu
label: uurija (isik) teoses @et
label: è ricercatore persona di @it
label: és persona investigadora de @ca
label: είναι ερευνητής φυσικό πρόσωπο του @el
label: هو شخص باحث لـ @ar
label: 是……的研究者个人 @zh-hans
sub property of: tutkija (toimija) teoksessa
sub property of: henkilöön liittyvä teos
definition: Bir kişiyi, bir çalışmayı desteklemek üzere yapılan araştırma için bir kişinin sorumluluğunu içeren bir eserle ilişkilendirir. @tr
definition: Correla una persona a un'opera che implica una responsabilità di una persona nella ricerca in supporto di un'opera. @it
definition: Hozzákapcsol egy személyt egy műhöz, amelyhez hozzátartozik egy személy felelőssége egy művet támogató kutatásért. @hu
definition: Liittää henkilön teokseen, jossa henkilö on vastuussa tutkimuksesta, joka tukee teoksen syntymistä.
definition: Met une personne en relation avec une œuvre qui comporte une responsabilité de la part d’une personne consistant à effectuer des recherches pour aider à la création d’une œuvre. @fr
definition: Relaciona una persona amb una obra que implica una responsabilitat d’una persona en la recerca per donar suport a una obra. @ca
definition: Relateert een persoon aan een werk dat met zich meebrengt een verantwoordelijkheid van een persoon voor onderzoek ter ondersteuning van een werk. @nl
definition: Relaterer en person til et verk som involverer et ansvar for en person i form av forskning som støtte for et verk. @no
definition: Relaterer en person til et værk, som involverer en persons ansvar for research til at understøtte et værk. @da
definition: Relates a person to a work that involves a responsibility of a person for research in support of a work. @en
definition: Sasaista personu ar darbu, kas ietver personas atbildību par pētījumu, lai atbalstītu darba radīšanu. @lv
definition: Seostab isiku teosega, mis sisaldab isiku vastutust teose heaks uurimistöö tegemise eest. @et
definition: Setzt eine Person in Beziehung zu einem Werk, bei dem eine Person für die Forschung zur Unterstützung eines Werks verantwortlich ist. @de
definition: يربط شخصا بعمل يترتب عليه مسئولية شخص عن البحث لدعم عمل. @ar
definition: 将一个个人与涉及对一种作品研究支持的一个个人的责任的一种作品关联起来。 @zh-hans

teoksen haastateltava (henkilö) teoksessa
has element type: 2
toolkit definition: A work that involves a responsibility of a person for responding to an interviewer, usually a reporter, pollster, or some other kind of agent who gathers information. @en
toolkit definition: Bir görüşmeciye, genellikle bir muhabire, anketöre veya bilgi toplayan başka bir tür temsilciye yanıt verme konusunda bir kişinin sorumluluğunu içeren bir çalışma. @tr
toolkit definition: Darbs, kas ietver personas atbildību, atbildot uz intervētāja, parasti reportiera, aptaujas organizētāja vai kāda cita informācijas apkopotāja jautājumiem. @lv
toolkit definition: Een werk dat met zich meebrengt een verantwoordelijkheid van een persoon voor reageren op een interviewer, verslaggever, opiniepeiler of een andere soort actor die informatie verzamelt. @nl
toolkit definition: Egy mű, amelyhez hozzátartozik egy személy felelőssége egy interjúkészítőnek, általában riporternek, közvélemény-kutatónak, vagy valamilyen más információgyűjtő ágensnek, adott válaszért. @hu
toolkit definition: Ein Werk, bei dem eine Person einer Interviewerin/einem Interviewer antwortet. Dabei handelt es sich normalerweise um eine Reporterin/einen Reporter, eine Meinungsforscherin/einen Meinungsforscher oder anderen Akteur, die/der Informationen zusammenträgt. @de
toolkit definition: Et verk som involverer et ansvar for en person i form av å svare på spørsmål fra en intervjuer, som oftest en reporter eller annen agent som samler inn informasjon. @no
toolkit definition: Obra que implica una responsabilitat d’una persona responent a un entrevistador, habitualment un periodista, un enquestador o qualsevol altre tipus d’agent que recull la informació. @ca
toolkit definition: Opera che implica una responsabilità di una persona nel rispondere a un intervistatore, di solito un giornalista, sondaggista o un altro tipo di agente che raccoglie informazioni. @it
toolkit definition: Teos, jossa henkilö on vastuussa teoksen luomisesta vastaamalla haastattelijalle, tavallisesti toimittajalle, mielipidetutkijalle tai muulle tietoa keräävälle toimijalle.
toolkit definition: Teos, mis sisaldab isiku vastutust intervjueerijale, reporterile, küsitlejale või muule infot koguvale tegijale vastamise eest. @et
toolkit definition: Værk, som involverer en persons ansvar for at besvare spørgsmål fra en interviewer, normalt en journalist, meningsmåler eller en anden form for agent, som indsamler information. @da
toolkit definition: Œuvre qui comporte une responsabilité de la part d’une personne consistant à répondre à un intervieweur, habituellement un reporteur, un sondeur ou un autre type d’agent recueillant de l’information. @fr
toolkit definition: عمل يترتب عليه مسئولية شخص عن الاستجابة لمحاور، وعادة ما يكون مراسلًا أو مستطلع رأي أو وكيل من نوع آخر يجمع معلومات. @ar
toolkit definition: 涉及回答采访者、记者、民意调查员行为者或其他类型信息搜集个人的责任的一种作品 @zh-hans
toolkit label: Person als Interviewte/Interviewter eines Werks von @de
toolkit label: eserinin görüşülen kişisidir @tr
toolkit label: geïnterviewde persoon van werk van @nl
toolkit label: interjúalany személye a következő műnek: @hu
toolkit label: interviewee person of work of @en
toolkit label: intervistato persona di opera di @it
toolkit label: intervjueeritav (isik) teoses @et
toolkit label: intervjuobjekt for verk for (person) @no
toolkit label: intervējamais (persona) darbā @lv
toolkit label: person, som er interviewperson for udtryk af @da
toolkit label: persona entrevistada d’una obra de @ca
toolkit label: personne interviewée d’une œuvre de @fr
toolkit label: teoksen haastateltava (henkilö) teoksessa
toolkit label: συνεντευξιαζόμενος φυσικό πρόσωπο του έργου του @el
toolkit label: شخص ضيف مقابلة في عمل @ar
toolkit label: ……的作品的受访者个人 @zh-hans
has subproperty: P50559
lexical alias: intervieweePersonOfWorkOf.en
status: Published
type: Property
domain: C10004
label: er intervjuobjekt for verk for (person) @no
label: er person, som er interviewperson for værk af @da
label: eserinin görüşülen kişisidir @tr
label: est une personne interviewée d’une œuvre de @fr
label: interjúalany személye a következő műnek: @hu
label: intervjueeritav (isik) teoses @et
label: ir intervējamais (persona) darbā @lv
label: is geïnterviewde persoon van werk van @nl
label: is interviewee person of work of @en
label: ist Person als Interviewte/Interviewter eines Werks von @de
label: è intervistato persona di opera di @it
label: és persona entrevistada d’una obra de @ca
label: είναι συνεντευξιαζόμενος φυσικό πρόσωπο του έργου του @el
label: هو شخص ضيف مقابلة في عمل @ar
label: 是……的作品的受访者个人 @zh-hans
sub property of: teoksen haastateltava (toimija) teoksessa
sub property of: teoksen tekijä (henkilö) teoksessa
definition: Bir kişiyi, bir kişinin bir görüşmeciye, genellikle bir muhabire, anketöre veya bilgi toplayan başka bir tür aracıya yanıt verme sorumluluğunu içeren bir eserle ilişkilendirir. @tr
definition: Correla una persona a un'opera che implica una responsabilità di una persona nel rispondere a un intervistatore, solitamente un giornalista, sondaggista o altro tipo di agente che raccoglie informazioni. @it
definition: Hozzákapcsol egy személyt egy műhöz, amelyhez hozzátartozik egy személy felelőssége egy interjúkészítőnek, általában riporternek, közvélemény-kutatónak, vagy valamilyen más információgyűjtő ágensnek, adott válaszért. @hu
definition: Liittää henkilön teokseen, jossa henkilö on vastuussa teoksen luomisesta vastaamalla haastattelijalle, tavallisesti toimittajalle, mielipidetutkijalle tai muulle tietoa keräävälle toimijalle.
definition: Met une personne en relation avec une œuvre qui comporte une responsabilité de la part d’une personne consistant à répondre à un intervieweur, habituellement un reporteur, un sondeur ou un autre type d’agent recueillant de l’information. @fr
definition: Relaciona una persona amb una obra que implica una responsabilitat d’una persona responent a un entrevistador, habitualment un periodista, un enquestador o qualsevol altre tipus d’agent que recull la informació. @ca
definition: Relateert een persoon aan een werk dat met zich meebrengt een verantwoordelijkheid van een persoon voor reageren op een interviewer, verslaggever, opiniepeiler of een andere soort actor die informatie verzamelt. @nl
definition: Relaterer en person til et verk som involverer et ansvar for en person i form av å svare på spørsmål fra en intervjuer, som oftest en reporter eller annen agent som samler inn informasjon. @no
definition: Relaterer en person til et værk, som involverer en persons ansvar for at besvare spørgsmål fra en interviewer, normalt en journalist, meningsmåler eller en anden form for agent, som indsamler information. @da
definition: Relates a person to a work that involves a responsibility of a person for responding to an interviewer, usually a reporter, pollster, or some other kind of agent who gathers information. @en
definition: Sasaista personu ar darbu, kas ietver personas atbildību, atbildot uz intervētāja, parasti reportiera, aptaujas organizētāja vai kāda cita informācijas apkopotāja jautājumiem. @lv
definition: Seostab isiku teosega, mis sisaldab isiku vastutust intervjueerijale, reporterile, küsitlejale või muule infot koguvale tegijale vastamise eest. @et
definition: Setzt eine Person in Beziehung zu einem Werk, bei dem eine Person einer Interviewerin/einem Interviewer antwortet. Dabei handelt es sich normalerweise um eine Reporterin/einen Reporter, eine Meinungsforscherin/einen Meinungsforscher oder anderen Akteur, die/der Informationen zusammenträgt. @de
definition: يربط شخصا بعمل يترتب عليه مسئولية شخص عن الاستجابة لمحاور، وعادة ما يكون مراسلًا أو مستطلع رأي أو وكيل من نوع آخر يجمع معلومات. @ar
definition: 将一个个人与涉及回答采访者、记者、民意调查员行为者或其他类型信息搜集个人的责任的一种作品关联起来。 @zh-hans

kokoaja (henkilö) teoksessa
has element type: 2
toolkit definition: A work that involves a responsibility of a person for creating a metadata description set. @en
toolkit definition: Bir üstveri seti oluşturmak için bir kişinin sorumluluğunu içeren bir çalışma. @tr
toolkit definition: Darbs, kas ietver personas atbildību par datu un informācijas atlasi, sakārtošanu, apkopošanu un rediģēšanu tādam darbam kā bibliogrāfija vai rādītājs. @lv
toolkit definition: Een werk dat met zich meebrengt een verantwoordelijkheid van een persoon voor selecteren, arrangeren, verzamelen en redigeren van data en informatie voor een werk zoals een bibliografie of een adresboek. @nl
toolkit definition: Egy mű, amelyhez hozzátartozik egy személy felelőssége a kiválasztásáért, elrendezésért, aggregálásért, adatok és információk szerkesztéséért egy olyan mű számára, mint egy bibliográfia vagy egy címtár. @hu
toolkit definition: Ein Werk, bei dem eine Person für das Selektieren, Gliedern, Zusammentragen und Editieren von Daten und Informationen für ein Werk, zum Beispiel einer Bibliografie oder eines Verzeichnisses, verantwortlich ist. @de
toolkit definition: Et verk som involverer et ansvar for en person i form av utvelgelse, arrangering, samling og redigering av data og informasjon for et verk slik som en bibliografi eller en katalog. @no
toolkit definition: Obra que implica una responsabilitat d’una persona en la creació un conjunt de descripció de metadades. @ca
toolkit definition: Opera che implica una responsabilità di una persona nella selezione, disposizione, aggregazione e redazione di dati e informazioni per un'opera come una bibliografia o una directory. @it
toolkit definition: Teos, jossa henkilö on vastuussa metatietokokonaisuuden luomisesta.
toolkit definition: Teos, mis sisaldab isiku vastutust andmete ja info valimise, korrastamise, koondamise ja toimetamise eest teose, nt bibliograafia või teatmiku jaoks. @et
toolkit definition: Værk, som involverer en persons ansvar for at udvælge, arrangere, sammenlægge og redigere data og information til et værk, såsom en bibliografi eller en fortegnelse. @da
toolkit definition: Œuvre qui comporte une responsabilité de la part d’une personne consistant à créer un ensemble de métadonnées descriptives. @fr
toolkit definition: عمل يترتب عليه مسئولية شخص عن اختيار البيانات والمعلومات للعمل وترتيبها وتجميعها وتحريرها في ببليوجرافية أو في دليل. @ar
toolkit definition: 涉及创建一个元数据描述集的个人的责任的一种作品 @zh-hans
toolkit label: Person als Zusammenstellende/Zusammenstellender von @de
toolkit label: compilatore persona di @it
toolkit label: compiler person of @en
toolkit label: derleyici @tr
toolkit label: ir sastādītājs (persona) @lv
toolkit label: kokoaja (henkilö) teoksessa
toolkit label: koostaja (isik) teoses @et
toolkit label: person, som er kompilator af @da
toolkit label: persona compiladora de @ca
toolkit label: personne compilatrice de @fr
toolkit label: samensteller-persoon van @nl
toolkit label: utarbeider for (person) @no
toolkit label: összeállító személye: @hu
toolkit label: συμπιλητής φυσικό πρόσωπο του @el
toolkit label: شخص جامع لـ @ar
toolkit label: ……的编纂者个人 @zh-hans
has subproperty: kokoelman luetteloija (henkilö) teokselle
has subproperty: P50560
lexical alias: compilerPersonOf.en
status: Published
type: Property
domain: C10004
label: derleyici kişisidir @tr
label: er person, som er kompilator af @da
label: er utarbeider for (person) @no
label: est une personne compilatrice de @fr
label: ir sastādītājs (persona) @lv
label: is compiler person of @en
label: is samensteller-persoon van @nl
label: ist Person als Zusammenstellende/Zusammenstellender von @de
label: koostaja (isik) teoses @et
label: è compilatore persona di @it
label: és persona compiladora de @ca
label: összeállító személye a következőnek: @hu
label: είναι συμπιλητής φυσικό πρόσωπο του @el
label: هو شخص جامع لـ @ar
label: 是……的编纂者个人 @zh-hans
sub property of: kokoaja (toimija) teoksessa
sub property of: aggregaattori (henkilö) teoksessa
definition: Bir kişiyi, bir kişinin üst veri tanım seti oluşturma sorumluluğunu içeren bir eserle ilişkilendirir. @tr
definition: Correla una persona a un'opera che implica una responsabilità di una persona nella selezione, disposizione, aggregazione e redazione di dati e informazioni per un'opera come una bibliografia o una directory. @it
definition: Hozzákapcsol egy személyt egy műhöz, amelyhez hozzátartozik egy személy felelőssége a kiválasztásáért, elrendezésért, aggregálásért, adatok és információk szerkesztéséért egy olyan mű számára, mint egy bibliográfia vagy egy címtár. @hu
definition: Liittää henkilön teokseen, jossa henkilö on vastuussa metatietokokonaisuuden luomisesta.
definition: Met une personne en relation avec une œuvre qui comporte une responsabilité de la part d’une personne consistant à créer un ensemble de métadonnées descriptives. @fr
definition: Relaciona una persona amb una obra que implica una responsabilitat d’una persona en la creació d’un conjunt de creació de metadades. @ca
definition: Relateert een persoon aan een werk dat met zich meebrengt een verantwoordelijkheid van een persoon voor selecteren, arrangeren, verzamelen en redigeren van data en informatie voor een werk zoals een bibliografie of een adresboek. @nl
definition: Relaterer en person til et verk som involverer et ansvar for en person i form av utvelgelse, arrangering, samling og redigering av data og informasjon for et verk slik som en bibliografi eller en katalog. @no
definition: Relaterer en person til et værk, som involverer en persons ansvar for at udvælge, arrangere, sammenlægge og redigere data og information til et værk, såsom en bibliografi eller en fortegnelse. @da
definition: Relates a person to a work that involves a responsibility of a person for creating a metadata description set. @en
definition: Sasaista personu ar darbu, kas ietver personas atbildību par datu un informācijas atlasi, sakārtošanu, apkopošanu un rediģēšanu tādam darbam kā bibliogrāfija vai rādītājs. @lv
definition: Seostab isiku teosega, mis sisaldab isiku vastutust andmete ja info valimise, korrastamise, koondamise ja toimetamise eest teose, nt bibliograafia või teatmiku jaoks. @et
definition: Setzt eine Person in Beziehung zu einem Werk, bei dem eine Person für das Selektieren, Gliedern, Aggregieren und Editieren von Daten und Informationen für ein Werk, zum Beispiel einer Bibliografie oder eines Verzeichnisses, verantwortlich ist. @de
definition: يربط شخصا بعمل يترتب عليه مسئولية شخص عن اختيار البيانات والمعلومات للعمل وترتيبها وتجميعها وتحريرها في ببليوجرافية أو في دليل. @ar
definition: 将一个个人与涉及创建一个元数据描述集的个人的责任的一种作品关联起来。 @zh-hans
scope note: A metadata description set includes a bibliography of works, expressions, or manifestations, a directory of agents and places, and an analytic finding aid. @en
scope note: Bir üstveri seti, eserlerin, anlatımların veya gösterimlerin bir bibliyografyasını, temsilciler ve yerler dizinini ve analitik rehber bilgi içerir. @tr
scope note: Darunter fallen keine Überarbeitungen oder Erläuterungen des Inhalts einer Expression eines Werks und die Auswahl und Zusammenstellung von Expressionen von Werken oder Teilen von Werken. @de
scope note: Det å redigere innholdet i et uttrykk av et verk eller gjøre det klarere, eller velge ut og kombinere uttrykk av et verk eller deler av et verk, er ikke inkludert. @no
scope note: Ei hõlma teose väljenduse sisu läbivaatamist ja parandamist ega teoste või nende osade väljenduste väljavalimist ja kokkupanemist. @et
scope note: Herzien of verduidelijken van de inhoud van een expressie van een werk en selecteren en combineren van expressies van werken of delen van werken zijn uitgesloten. @nl
scope note: Metatietokokonaisuus kattaa teosten, ekspressioiden tai manifestaatioiden bibliografian, toimija- tai paikkahakemiston ja analyyttisen luettelon.
scope note: Neietver satura pārskatīšanu vai precizēšanu, viena vai vairāku radītāju darbu vai to daļu atlasi vai apvienošanu. @lv
scope note: Nem tartozik ide sem egy mű kifejezési formájának tartalmi felülvizsgálata vagy tisztázása, sem a művek vagy műrészek kifejezési formáinak kiválasztása és összeállítása. @hu

ohjaaja (henkilö) teoksessa
has element type: 2
toolkit definition: A work that involves a responsibility of a person for the general management and supervision of a filmed performance, a radio or television program, etc. @en
toolkit definition: Darbs, kas ietver personas atbildību par vispārējo vadību un par filmētā materiāla, radio vai televīzijas raidījuma, u.tml. uzraudzību. @lv
toolkit definition: Een werk dat met zich meebrengt een verantwoordelijkheid van een persoon voor het algemene beheer en toezicht van een gefilmde uitvoering, een radio- of televisieprogramma etc. @nl
toolkit definition: Egy mű, amelyhez hozzátartozik egy személy felelőssége egy filmforgatás, egy rádió- vagy televízióműsor, stb. általános menedzseléséért és felügyeletéért. @hu
toolkit definition: Ein Werk, bei dem eine Person für das allgemeine Management und die Leitung einer verfilmten Darbietung, einer Hörfunk- oder Fernsehsendung und so weiter verantwortlich ist. @de
toolkit definition: Et verk som involverer et ansvar for en person for den generelle ledelsen og tilsyn med en filmet forestilling, et radio- eller fjernsynsprogram etc. @no
toolkit definition: Filme alınmış bir performansın, bir radyo veya televizyon programı vb. genel yönetimi ve denetimi için bir kişinin sorumluluğunda olan bir eser. @tr
toolkit definition: Obra que implica una responsabilitat d’una persona en la gestió general i la supervisió d’una actuació filmada, d’un programa radiofònic o de televisió, etc. @ca
toolkit definition: Opera che implica una responsabilità di una persona per la gestione generale e supervisione di un'interpretazione filmata, programma radiofonico o televisivo, etc. @it
toolkit definition: Teos, jossa henkilö on vastuussa elokuvatun esityksen, radio- tai televisio-ohjelman tms. yleisestä johtamisesta.
toolkit definition: Teos, mis sisaldab isiku vastutust filmitava etenduse, raadio- või telesaate vms üldise juhtimise ja juhendamise eest. @et
toolkit definition: Værk, som involverer en persons ansvar for den generelle ledelse af- og tilsyn med en filmoptagelse, et radio- eller tv-program etc. @da
toolkit definition: Œuvre qui comporte une responsabilité de la part d’une personne consistant à assurer la gestion et la supervision générales d’une prestation filmée, d’une émission de radio ou de télévision, etc. @fr
toolkit definition: عمل يترتب عليه مسئولية شخص عن الإدارة العامة، والإشراف على أداء مصور، أو برنامج إذاعي أو تليفزيوني، إلخ. @ar
toolkit definition: 涉及电影表演、广播或电视节目等的全面管理和监督的一个个人的责任的一种作品 @zh-hans
toolkit label: Person als Regisseurin/Regisseur von @de
toolkit label: director person of @en
toolkit label: direttore persona di @it
toolkit label: ir režisors (persona) @lv
toolkit label: ohjaaja (henkilö) teoksessa
toolkit label: person, som er instruktør af @da
toolkit label: persona realitzadora de @ca
toolkit label: personne réalisatrice de @fr
toolkit label: regisseur-person van @nl
toolkit label: regissør av (person) @no
toolkit label: rendező személye: @hu
toolkit label: režissöör (isik) teoses @et
toolkit label: yönetmen @tr
toolkit label: διευθυντής φυσικό πρόσωπο του @el
toolkit label: شخص مخرج @ar
toolkit label: ……的导演个人 @zh-hans
has subproperty: elokuvaohjaaja (henkilö) teoksessa
has subproperty: radio-ohjaaja (henkilö) teoksessa
has subproperty: televisio-ohjaaja (henkilö) teoksessa
has subproperty: P50561
lexical alias: directorPersonOf.en
status: Published
type: Property
domain: C10004
label: er person, som er instruktør af @da
label: er regissør av (person) @no
label: est une personne réalisatrice de @fr
label: ir režisors (persona) @lv
label: is director person of @en
label: is regisseur-person van @nl
label: ist Person als Regisseurin/Regisseur von @de
label: rendező személye a következőnek: @hu
label: režissöör (isik) teoses @et
label: yönetmen kişisidir @tr
label: è direttore persona di @it
label: és persona realitzadora de @ca
label: είναι διευθυντής φυσικό πρόσωπο του @el
label: هو شخص مخرج لـ @ar
label: 是……的导演个人 @zh-hans
sub property of: ohjaaja (toimija) teoksessa
sub property of: henkilöön liittyvä teos
definition: Bir kişiyi, filme alınmış bir performansın, bir radyo veya televizyon programının vb. genel yönetimi ve denetimi sorumluluğunu içeren bir eserle ilişkilendirir. @tr
definition: Correla una persona a un'opera che implica una responsabilità di una persona per la gestione e supervisione generale di un'interpretazione filmata, programma radiofonico o televisivo, etc. @it
definition: Hozzákapcsol egy személyt egy műhöz, amelyhez hozzátartozik egy személy felelőssége egy filmforgatás, egy rádió- vagy televízióműsor, stb. általános menedzseléséért és felügyeletéért. @hu
definition: Liittää henkilön teokseen, jossa henkilö on vastuussa elokuvatun esityksen, radio- tai televisio-ohjelman tms. yleisestä johtamisesta.
definition: Met une personne en relation avec une œuvre qui comporte une responsabilité de la part d’une personne consistant à assurer la gestion et la supervision générales d’une prestation filmée, d’une émission de radio ou de télévision, etc. @fr
definition: Relaciona una persona amb una obra que implica una responsabilitat d’una persona en la gestió general i la supervisió d’una actuació filmada, d’un programa radiofònic o de televisió, etc. @ca
definition: Relateert een persoon aan een werk dat met zich meebrengt een verantwoordelijkheid van een persoon voor het algemene beheer en toezicht van een gefilmde uitvoering, een radio- of televisieprogramma etc. @nl
definition: Relaterer en person til et verk som involverer et ansvar for en person for den generelle ledelsen og tilsyn med en filmet forestilling, et radio- eller fjernsynsprogram etc. @no
definition: Relaterer en person til et værk, som involverer en persons ansvar for den generelle ledelse af- og tilsyn med en filmoptagelse, et radio- eller tv-program etc. @da
definition: Relates a person to a work that involves a responsibility of a person for the general management and supervision of a filmed performance, a radio or television program, etc. @en
definition: Sasaista personu ar darbu, kas ietver personas atbildību par vispārējo vadību un par filmētā materiāla, radio vai televīzijas raidījuma, u.tml. uzraudzību. @lv
definition: Seostab isiku teosega, mis sisaldab isiku vastutust filmitava etenduse, raadio- või telesaate vms üldise juhtimise ja juhendamise eest. @et
definition: Setzt eine Person in Beziehung zu einem Werk, bei dem eine Person für das allgemeine Management und die Leitung einer verfilmten Darbietung, einer Hörfunk- oder Fernsehsendung und so weiter verantwortlich ist. @de
definition: يربط شخصا بعمل يترتب عليه مسئولية شخص عن الإدارة العامة، والإشراف على أداء مصور، أو على برنامج إذاعي أو تليفزيوني، إلخ. @ar
definition: 将一个个人与涉及电影表演、广播或电视节目等的全面管理和监督的一个个人的责任的一种作品关联起来。 @zh-hans

elokuvaohjaaja (henkilö) teoksessa
has element type: 2
toolkit definition: A work that involves a responsibility of a person for the general management and supervision of a filmed performance. @en
toolkit definition: Darbs, kas ietver personas atbildību par uzfilmētā pasākuma vispārējo vadību un uzraudzību @lv
toolkit definition: Een werk dat met zich meebrengt een verantwoordelijkheid van een persoon voor het algemeen beheer en toezicht van een gefilmde uitvoering. @nl
toolkit definition: Egy mű, amelyhez hozzátartozik egy személy felelőssége egy filmforgatás általános menedzseléséért és felügyeletéért. @hu
toolkit definition: Ein Werk, bei dem eine Person für das allgemeine Management und die Leitung einer verfilmten Darbietung verantwortlich ist. @de
toolkit definition: Et verk som involverer et ansvar for en person for den generelle ledelsen og tilsyn med en filmet forestilling. @no
toolkit definition: Filme alınmış bir performansın genel yönetimi ve denetimi için bir kişinin sorumluluğunu içeren bir eser. @tr
toolkit definition: Obra que implica una responsabilitat d’una persona en la gestió general i la supervisió d’una actuació filmada. @ca
toolkit definition: Opera che implica una responsabilità di una persona per la gestione e supervisione generale di un'interpretazione filmata. @it
toolkit definition: Teos, joka sisältää vastuun elokuvatun esityksen yleisestä johtamisesta ja valvonnasta.
toolkit definition: Teos, mis sisaldab isiku vastutust filmitava etenduse üldise juhtimise ja juhendamise eest. @et
toolkit definition: Værk, som involverer en persons ansvar for den generelle ledelse af- og tilsyn med en filmoptagelse. @da
toolkit definition: Œuvre qui comporte une responsabilité de la part d’une personne consistant à assurer la gestion et la supervision générales d’une prestation filmée. @fr
toolkit definition: عمل يترتب عليه مسئولية شخص عن الإدارة العامة والإشراف على أداء مصور. @ar
toolkit definition: 涉及拍摄表演的总体管理和监督的一个个人的责任的一种作品 @zh-hans
toolkit label: Person als Filmregisseurin/Filmregisseur von @de
toolkit label: elokuvaohjaaja (henkilö) teoksessa
toolkit label: film director person of @en
toolkit label: film yönetmeni @tr
toolkit label: filmirežissöör (isik) teoses @et
toolkit label: filmregisseur-persoon van @nl
toolkit label: filmregissør for (person) @no
toolkit label: filmrendező személye: @hu
toolkit label: ir kinorežisors (persona) @lv
toolkit label: person, som er filminstruktør af @da
toolkit label: persona directora cinematogràfica de @ca
toolkit label: personne réalisatrice de cinéma de @fr
toolkit label: regista cinematografico persona di @it
toolkit label: σκηνοθέτης φυσικό πρόσωπο του @el
toolkit label: شخص مخرج الفيلم @ar
toolkit label: ……的电影导演个人 @zh-hans
has subproperty: P50562
lexical alias: filmDirectorPersonOf.en
status: Published
type: Property
domain: C10004
label: er filmregissør for (person) @no
label: er person, som er filminstruktør af @da
label: est une personne réalisatrice de cinéma de @fr
label: film yönetmeni kişisidir @tr
label: filmirežissöör (isik) teoses @et
label: filmrendező személye a következőnek: @hu
label: ir kinorežisors (persona) @lv
label: is film director person of @en
label: is filmregisseur-persoon van @nl
label: ist Person als Filmregisseurin/Filmregisseur von @de
label: è regista cinematografico persona di @it
label: és persona directora cinematogràfica de @ca
label: είναι σκηνοθέτης φυσικό πρόσωπο του @el
label: هو شخص مخرج فيلم لـ @ar
label: 是……的电影导演个人 @zh-hans
sub property of: elokuvaohjaaja (toimija) teoksessa
sub property of: ohjaaja (henkilö) teoksessa
alternative label: personne réalisatrice de film de @fr
definition: Bir kişiyi, filme alınmış bir performansın genel yönetimi ve denetimi için bir kişinin sorumluluğunu içeren bir eserle ilişkilendirir. @tr
definition: Correla una persona a un'opera che implica una responsabilità di una persona per la gestione e supervisione generale di un'interpretazione filmata. @it
definition: Hozzákapcsol egy személyt egy műhöz, amelyhez hozzátartozik egy személy felelőssége egy filmforgatás általános menedzseléséért és felügyeletéért. @hu
definition: Liittää henkilön teokseen, joka sisältää vastuun elokuvatun esityksen yleisestä johtamisesta ja valvonnasta.
definition: Met une personne en relation avec une œuvre qui comporte une responsabilité de la part d’une personne consistant à assurer la gestion et la supervision générales d’une prestation filmée. @fr
definition: Relaciona una persona amb una obra que implica una responsabilitat d’una persona en la gestió general i la supervisió d’una actuació filmada. @ca
definition: Relateert een persoon aan een werk dat met zich meebrengt een verantwoordelijkheid van een persoon voor het algemeen beheer en toezicht van een gefilmde uitvoering. @nl
definition: Relaterer en person til et verk som involverer et ansvar for en person for den generelle ledelsen og tilsyn med en filmet forestilling. @no
definition: Relaterer en person til et værk, som involverer en persons ansvar for den generelle ledelse af- og tilsyn med en filmoptagelse. @da
definition: Relates a person to a work that involves a responsibility of a person for the general management and supervision of a filmed performance. @en
definition: Sasaista personu ar darbu, kas ietver personas atbildību par uzfilmētā pasākuma vispārējo vadību un uzraudzību. @lv
definition: Seostab isiku teosega, mis sisaldab isiku vastutust filmitava etenduse üldise juhtimise ja juhendamise eest. @et
definition: Setzt eine Person in Beziehung zu einem Werk, bei dem eine Person für das allgemeine Management und die Leitung einer verfilmten Darbietung verantwortlich ist. @de
definition: يربط شخصا بعمل يترتب عليه مسئولية شخص عن الإدارة العامة والإشراف على أداء مصور. @ar
definition: 将一个个人与涉及拍摄表演的总体管理和监督的一个个人的责任的一种作品关联起来。 @zh-hans

radio-ohjaaja (henkilö) teoksessa
has element type: 2
toolkit definition: A work that involves a responsibility of a person for the general management and supervision of a radio program. @en
toolkit definition: Bir radyo programının genel yönetimi ve denetimi için bir kişinin sorumluluğunu içeren bir çalışma @tr
toolkit definition: Darbs, kas ietver personas atbildību par radio raidījuma vispārējo vadību un uzraudzību. @lv
toolkit definition: Een werk dat met zich meebrengt een verantwoordelijkheid van een persoon voor het algemeen beheer en toezicht van een radioprogramma. @nl
toolkit definition: Egy mű, amelyhez hozzátartozik egy személy felelőssége egy rádióműsor általános menedzseléséért és felügyeletéért. @hu
toolkit definition: Ein Werk, bei dem eine Person für das allgemeine Management und die Leitung einer Hörfunksendung verantwortlich ist. @de
toolkit definition: Et verk som involverer et ansvar for en person for den generelle ledelsen og tilsyn med et radioprogram. @no
toolkit definition: Obra que implica una responsabilitat d’una persona en la gestió general i la supervisió d’un programa radiofònic. @ca
toolkit definition: Opera che implica una responsabilità di una persona per la gestione e supervisione generale di un programma radiofonico. @it
toolkit definition: Teos, joka sisältää vastuun radio-ohjelman yleisestä johtamisesta ja valvonnasta.
toolkit definition: Teos, mis sisaldab isiku vastutust raadiosaate üldise juhtimise ja juhendamise eest. @et
toolkit definition: Værk, som involverer en persons ansvar for den generelle ledelse af- og tilsyn med et radioprogram. @da
toolkit definition: Œuvre qui comporte une responsabilité de la part d’une personne consistant à assurer la gestion et la supervision générales d’une émission de radio. @fr
toolkit definition: عمل يترتب عليه مسئولية شخص عن الإدارة العامة والإشراف على برنامج إذاعي. @ar
toolkit definition: 涉及广播节目的总体管理和监督的一个个人的责任的一种作品 @zh-hans
toolkit label: Person als Hörfunkregisseurin/Hörfunkregisseur von @de
toolkit label: ir radio raidījuma direktors (persona) @lv
toolkit label: person, som er radioregissør af @da
toolkit label: persona realitzadora radiofònica de @ca
toolkit label: personne réalisatrice de radio de @fr
toolkit label: raadiorežissöör (isik) teoses @et
toolkit label: radio director person of @en
toolkit label: radio-ohjaaja (henkilö) teoksessa
toolkit label: radioregisseur-persoon van @nl
toolkit label: radioregissør for (person) @no
toolkit label: radyo yönetmeni olan kişi @tr
toolkit label: regista radiofonico persona di @it
toolkit label: rádiós rendező személye: @hu
toolkit label: διευθυντής ραδιοφώνου φυσικό πρόσωπο του @el
toolkit label: شخص مخرج إذاعي @ar
toolkit label: ……的广播导演个人 @zh-hans
has subproperty: P50563
lexical alias: radioDirectorPersonOf.en
status: Published
type: Property
domain: C10004
label: er person, som er radioregissør af @da
label: er radioregissør for (person) @no
label: est une personne réalisatrice de radio de @fr
label: ir radio raidījuma direktors (persona) @lv
label: is radio director person of @en
label: is radioregisseur-persoon van @nl
label: ist Person als Hörfunkregisseurin/Hörfunkregisseur von @de
label: raadiorežissöör (isik) teoses @et
label: radyo yönetmeni kişisidir @tr
label: rádiós rendező személye a következőnek: @hu
label: è regista radiofonico persona di @it
label: és persona realitzadora radiofònica de @ca
label: είναι διευθυντής ραδιοφώνου φυσικό πρόσωπο του @el
label: هو شخص مخرج إذاعي لـ @ar
label: 是……的广播导演个人 @zh-hans
sub property of: radio-ohjaaja (toimija) teoksessa
sub property of: ohjaaja (henkilö) teoksessa
definition: Bir kişiyi, bir radyo programının genel yönetim ve denetim sorumluluğunu içeren bir eserle ilişkilendirir. @tr
definition: Correla una persona a un'opera che implica una responsabilità di una persona per la gestione e supervisione generale di un programma radiofonico. @it
definition: Hozzákapcsol egy személyt egy műhöz, amelyhez hozzátartozik egy személy felelőssége egy rádióműsor általános menedzseléséért és felügyeletéért. @hu
definition: Liittää henkilön teokseen, joka sisältää vastuun radio-ohjelman yleisestä johtamisesta ja valvonnasta.
definition: Met une personne en relation avec une œuvre qui comporte une responsabilité de la part d’une personne consistant à assurer la gestion et la supervision générales d’une émission de radio. @fr
definition: Relaciona una persona amb una obra que implica una responsabilitat d’una persona en la gestió general i la supervisió d’un programa radiofònic. @ca
definition: Relateert een persoon aan een werk dat met zich meebrengt een verantwoordelijkheid van een persoon voor het algemeen beheer en toezicht van een radioprogramma. @nl
definition: Relaterer en person til et verk som involverer et ansvar for en person for den generelle ledelsen og tilsyn med et radioprogram. @no
definition: Relaterer en person til et værk, som involverer en persons ansvar for den generelle ledelse af- og tilsyn med et radioprogram. @da
definition: Relates a person to a work that involves a responsibility of a person for the general management and supervision of a radio program. @en
definition: Sasaista personu ar darbu, kas ietver personas atbildību par radio raidījuma vispārējo vadību un uzraudzību. @lv
definition: Seostab isiku teosega, mis sisaldab isiku vastutust raadiosaate üldise juhtimise ja juhendamise eest. @et
definition: Setzt eine Person in Beziehung zu einem Werk, bei dem eine Person für das allgemeine Management und die Leitung einer Hörfunksendung verantwortlich ist. @de
definition: يربط شخصا بعمل يترتب عليه مسئولية شخص عن الإدارة العامة والإشراف على برنامج إذاعي. @ar
definition: 将一个个人与涉及广播节目的总体管理和监督的一个个人的责任的一种作品关联起来。 @zh-hans

televisio-ohjaaja (henkilö) teoksessa
has element type: 2
toolkit definition: A work that involves a responsibility of a person for the general management and supervision of a television program. @en
toolkit definition: Bir televizyon programının genel yönetimi ve denetimi için bir kişinin sorumluluğunu içeren bir çalışma. @tr
toolkit definition: Darbs, kas ietver personas atbildību par televīzijas raidījuma vispārēju vadību un uzraudzību. @lv
toolkit definition: Een werk dat met zich meebrengt een verantwoordelijkheid van een persoon voor het algemeen beheer en toezicht van een televisieprogramma. @nl
toolkit definition: Egy mű, amelyhez hozzátartozik egy személy felelőssége egy televízióműsor általános menedzseléséért és felügyeletéért. @hu
toolkit definition: Ein Werk, bei dem eine Person für das allgemeine Management und die Leitung einer Fernsehsendung verantwortlich ist. @de
toolkit definition: Et verk som involverer et ansvar for en person for den generelle ledelsen og tilsyn med et fjernsynsprogram. @no
toolkit definition: Obra que implica una responsabilitat d’una persona en la gestió general i la supervisió d’un programa de televisió. @ca
toolkit definition: Opera che implica una responsabilità di una persona per la gestione e supervisione generale di un programma televisivo. @it
toolkit definition: Teos, joka sisältää vastuun televisio-ohjelman yleisestä johtamisesta ja valvonnasta.
toolkit definition: Teos, mis sisaldab isiku vastutust telesaate üldise juhtimise ja juhendamise eest. @et
toolkit definition: Værk, som involverer en persons ansvar for den generelle ledelse af- og tilsyn med et tv-program. @da
toolkit definition: Œuvre qui comporte une responsabilité de la part d’une personne consistant à assurer la gestion et la supervision générales d’une émission de télévision. @fr
toolkit definition: عمل يترتب عليه مسئولية شخص عن الإدارة العامة والإشراف على برنامج تليفزيوني. @ar
toolkit definition: 涉及电视节目的总体管理和监督的一个个人的责任的一种作品 @zh-hans
toolkit label: Person als Fernsehregisseurin/Fernsehregisseur von @de
toolkit label: fjernsynsregissør for (person) @no
toolkit label: ir televīzijas raidījuma direktors (persona) @lv
toolkit label: person, som er tv-regissør af @da
toolkit label: persona realitzadora de televisió de @ca
toolkit label: personne réalisatrice de télévision de @fr
toolkit label: regista televisivo persona di @it
toolkit label: telerežissöör (isik) teoses @et
toolkit label: televisieregisseur-persoon van @nl
toolkit label: televisio-ohjaaja (henkilö) teoksessa
toolkit label: television director person of @en
toolkit label: televizyon yönetmeni olan kişi @tr
toolkit label: televíziós rendező személye: @hu
toolkit label: τηλεοπτικός διευθυντής φυσικό πρόσωπο του @el
toolkit label: شخص مخرج تليفزيوني @ar
toolkit label: ……的电视导演个人 @zh-hans
has subproperty: P50564
lexical alias: televisionDirectorPersonOf.en
status: Published
type: Property
domain: C10004
label: er fjernsynsregissør for (person) @no
label: er person, som er tv-regissør af @da
label: est une personne réalisatrice de télévision de @fr
label: ir televīzijas raidījuma direktors (persona) @lv
label: is televisieregisseur-persoon van @nl
label: is television director person of @en
label: ist Person als Fernsehregisseurin/Fernsehregisseur von @de
label: telerežissöör (isik) teoses @et
label: televizyon yönetmeni @tr
label: televíziós rendező személye a következőnek: @hu
label: è regista televisivo persona di @it
label: és persona realitzadora de televisió de @ca
label: είναι τηλεοπτικός διευθυντής φυσικό πρόσωπο του @el
label: هو شخص مخرج تليفزيوني لـ @ar
label: 是……的电视导演个人 @zh-hans
sub property of: televisio-ohjaaja (toimija) teoksessa
sub property of: ohjaaja (henkilö) teoksessa
definition: Bir kişiyi, bir televizyon programının genel yönetim ve denetim sorumluluğunu içeren bir işle ilişkilendirir. @tr
definition: Correla una persona a un'opera che implica una responsabilità di una persona per la gestione e supervisione generale di un programma televisivo. @it
definition: Hozzákapcsol egy személyt egy műhöz, amelyhez hozzátartozik egy személy felelőssége egy televízióműsor általános menedzseléséért és felügyeletéért. @hu
definition: Liittää henkilön teokseen, joka sisältää vastuun televisio-ohjelman yleisestä johtamisesta ja valvonnasta.
definition: Met une personne en relation avec une œuvre qui comporte une responsabilité de la part d’une personne consistant à assurer la gestion et la supervision générales d’une émission de télévision. @fr
definition: Relaciona una persona amb una obra que implica una responsabilitat d’una persona en la gestió general i la supervisió d’un programa de televisió. @ca
definition: Relateert een persoon aan een werk dat met zich meebrengt een verantwoordelijkheid van een persoon voor het algemeen beheer en toezicht van een televisieprogramma. @nl
definition: Relaterer en person til et verk som involverer et ansvar for en person for den generelle ledelsen og tilsyn med et fjernsynsprogram. @no
definition: Relaterer en person til et værk, som involverer en persons ansvar for den generelle ledelse af- og tilsyn med et tv-program. @da
definition: Relates a person to a work that involves a responsibility of a person for the general management and supervision of a television program. @en
definition: Sasaista personu ar darbu, kas ietver personas atbildību par televīzijas raidījuma vispārēju vadību un uzraudzību. @lv
definition: Seostab isiku teosega, mis sisaldab isiku vastutust telesaate üldise juhtimise ja juhendamise eest. @et
definition: Setzt eine Person in Beziehung zu einem Werk, bei dem eine Person für das allgemeine Management und die Leitung einer Fernsehsendung verantwortlich ist. @de
definition: يربط شخصا بعمل يترتب عليه مسئولية شخص عن الإدارة العامة والإشراف على برنامج تليفزيوني. @ar
definition: 将一个个人与涉及电视节目的总体管理和监督的一个个人的责任的一种作品关联起来。 @zh-hans

kuvanveistäjä (henkilö) teoksessa
has element type: 2
toolkit definition: A work that involves a responsibility of a person for three-dimensional modeling, carving, or similar technique. @en
toolkit definition: Darbs, kas ietver personas atbildību par trīsdimensionālu modelēšanu, grebšanu vai līdzīgu tehniku. @lv
toolkit definition: Een werk dat met zich meebrengt een verantwoordelijkheid van een persoon voor driedimensionaal modelleren, snijden of gelijksoortige techniek. @nl
toolkit definition: Egy mű, amelyhez hozzátartozik egy személy felelőssége háromdimenziós modellezésért, faragásért vagy hasonló technikáért. @hu
toolkit definition: Ein Werk, bei dem ein Akteur für dreidimensionales Modellieren, Schnitzen oder ähnliche Techniken verantwortlich ist. @de
toolkit definition: Et verk som involverer et ansvar for en person i form av modellering, utskjæring eller lignende teknikker for et tredimensjonalt verk. @no
toolkit definition: Obra que implica una responsabilitat d’una persona en el modelatge, la talla o una tècnica tridimensional similar. @ca
toolkit definition: Opera che implica una responsabilità di una persona per la modellazione tridimensionale, scultura o tecnica simile. @it
toolkit definition: Teos, jossa henkilö on vastuussa kolmiulotteisen teoksen luomisesta muovaamalla, veistämällä tai vastaavalla tekniikalla.
toolkit definition: Teos, mis sisaldab isiku vastutust kolmemõõtmelise modelleerimise, nikerdamise või muu sellise tehnika eest. @et
toolkit definition: Værk, som involverer en persons ansvar for tredimensionel modellering, udskæring eller lignende teknik. @da
toolkit definition: Üç boyutlu modelleme, oyma veya benzeri bir teknik için bir kişinin sorumluluğunu içeren bir çalışma. @tr
toolkit definition: Œuvre qui comporte une responsabilité de la part d’une personne consistant à utiliser le modelage, la taille ou une technique similaire pour une œuvre tridimensionnelle. @fr
toolkit definition: عمل يترتب عليه مسئولية شخص عن النمذجة ثلاثية الأبعاد أو النحت أو تقنية مماثلة. @ar
toolkit definition: 涉及三维模型、雕刻或类似技术的一个个人的责任的一种作品 @zh-hans
toolkit label: Person als Bildhauerin/Bildhauer von @de
toolkit label: beeldhouwer-persoon van @nl
toolkit label: heykeltıraş kişi @tr
toolkit label: ir tēlnieks (persona) @lv
toolkit label: kuvanveistäjä (henkilö) teoksessa
toolkit label: person, som er skulptør af @da
toolkit label: persona escultora de @ca
toolkit label: personne sculptrice de @fr
toolkit label: sculptor person of @en
toolkit label: scultore persona di @it
toolkit label: skulptor (isik) teoses @et
toolkit label: skulptør for (person) @no
toolkit label: szobrász személye: @hu
toolkit label: γλύπτης φυσικό πρόσωπο του @el
toolkit label: شخص نحات @ar
toolkit label: ……的雕塑家个人 @zh-hans
has subproperty: P50565
lexical alias: sculptorPersonOf.en
status: Published
type: Property
domain: C10004
label: er person, som er skulptør af @da
label: er skulptør for (person) @no
label: est une personne sculptrice de @fr
label: heykeltıraşdır @tr
label: ir tēlnieks (persona) @lv
label: is beeldhouwer-persoon van @nl
label: is sculptor person of @en
label: ist Person als Bildhauerin/Bildhauer von @de
label: skulptor (isik) teoses @et
label: szobrász személye a következőnek: @hu
label: è scultore persona di @it
label: és persona escultora de @ca
label: είναι γλύπτης φυσικό πρόσωπο του @el
label: هو شخص نحات لـ @ar
label: 是……的雕塑家个人 @zh-hans
sub property of: kuvanveistäjä (toimija) teoksessa
sub property of: taiteilija (henkilö) teoksessa
definition: Bir kişiyi, üç boyutlu modelleme, oyma veya benzeri bir teknikle yapma sorumluluğunu içeren bir eserle ilişkilendirir. @tr
definition: Correla una persona a un'opera che implica una responsabilità di una persona per la modellazione tridimensionale, scultura o tecnica simile. @it
definition: Hozzákapcsol egy személyt egy műhöz, amelyhez hozzátartozik egy személy felelőssége háromdimenziós modellezésért, faragásért vagy hasonló technikáért. @hu
definition: Liittää henkilön teokseen, jossa henkilö on vastuussa kolmiulotteisen teoksen luomisesta muovaamalla, veistämällä tai vastaavalla tekniikalla.
definition: Met une personne en relation avec une œuvre qui comporte une responsabilité de la part d’une personne consistant à utiliser le modelage, la taille ou une technique similaire pour une œuvre tridimensionnelle. @fr
definition: Relaciona una persona amb una obra que implica una responsabilitat d’una persona en el modelatge, la talla o una tècnica tridimensional similar. @ca
definition: Relateert een persoon aan een werk dat met zich meebrengt een verantwoordelijkheid van een persoon voor driedimensionaal modelleren, snijden of gelijksoortige techniek. @nl
definition: Relaterer en person til et verk som involverer et ansvar for en person i form av modellering, utskjæring eller lignende teknikker for et tredimensjonalt verk. @no
definition: Relaterer en person til et værk, som involverer en persons ansvar for tredimensionel modellering, udskæring eller lignende teknik. @da
definition: Relates a person to a work that involves a responsibility of a person for three-dimensional modeling, carving, or similar technique. @en
definition: Sasaista personu ar darbu, kas ietver personas atbildību par trīsdimensionālu modelēšanu, grebšanu vai līdzīgu tehniku. @lv
definition: Seostab isiku teosega, mis sisaldab isiku vastutust kolmemõõtmelise modelleerimise, nikerdamise või muu sellise tehnika eest. @et
definition: Setzt eine Person in Beziehung zu einem Werk, bei dem eine Person für dreidimensionales Modellieren, Schnitzen oder ähnliche Techniken verantwortlich ist. @de
definition: يربط شخصا بعمل يترتب عليه مسئولية شخص عن نمذجة ثلاثية الأبعاد أو نحت أو تقنية مماثلة. @ar
definition: 将一个个人与涉及三维模型、雕刻或类似技术的一个个人的责任的一种作品关联起来。 @zh-hans

omistuskirjoituksen tekijä (henkilö) teoksessa
has element type: 2
toolkit definition: A work that is assigned as an acknowledgment of the inspiration or support of a related person. @en
toolkit definition: Darbs, kas ir veltīts pateicībā par saistītās personas iedvesmojumu vai atbalstu. @lv
toolkit definition: Een werk dat toegekend is als erkenning van de inspiratie of hulp van een gerelateerde persoon. @nl
toolkit definition: Egy mű, amelyet egy műhöz kapcsolódó személy ösztönzésének vagy támogatásának köszöneteként jelölnek meg. @hu
toolkit definition: Ein Werk, das als Zeichen der Anerkennung oder Unterstützung einer in Beziehung stehenden Person gewidmet ist. @de
toolkit definition: Et verk som er tilegnet som en anerkjennelse for inspirasjonen eller støtten fra en relatert person. @no
toolkit definition: Obra que s’assigna com a reconeixement per la inspiració o suport d’una persona relacionada. @ca
toolkit definition: Opera assegnata come riconoscimento dell'ispirazione o supporto di una persona correlata. @it
toolkit definition: Teos, joka on omistettu sitä innoittaneelle tai tukeneelle henkilölle.
toolkit definition: Teos, mille seotud isik on pühendanud kellelegi tänuavaldusena innustuse või toetuse eest. @et
toolkit definition: Værk, som er tilegnet en relateret person, som en anerkendelse af inspiration eller støtte. @da
toolkit definition: İlgili bir kişinin ilhamının veya desteğinin bir teşekkürü olarak atanan bir eser. @tr
toolkit definition: Œuvre qui est dédiée en reconnaissance de l’inspiration ou du soutien d’une personne en relation. @fr
toolkit definition: عمل تم تخصيصه كإقرار بالإلهام أو الدعم لشخص ذي الصلة. @ar
toolkit definition: 被指定对一个相关个人的启发或支持之感谢的一种作品 @zh-hans
toolkit label: Person als Widmende/Widmender von @de
toolkit label: adayan kişi @tr
toolkit label: dedicante persona di @it
toolkit label: dedicator person of @en
toolkit label: dedikáló személye: @hu
toolkit label: dediserende person av @no
toolkit label: ir darba veltītājs (persona) @lv
toolkit label: omistuskirjoituksen tekijä (henkilö) teoksessa
toolkit label: opdrager-persoon van @nl
toolkit label: person, som er dedikationsskriver af @da
toolkit label: persona dedicant de @ca
toolkit label: personne dédicatrice d’une œuvre de @fr
toolkit label: pühendaja (isik) teoses @et
toolkit label: αφιερωτής φυσικό πρόσωπο του @el
toolkit label: شخص مُهدي كتاب @ar
toolkit label: ……的题献者个人 @zh-hans
has subproperty: P50566
lexical alias: dedicatorPersonOf.en
status: Published
type: Property
domain: C10004
label: dedikáló személye a következőnek: @hu
label: er dediserende person av @no
label: er person, som er dedikationsskriver af @da
label: est une personne dédicatrice d’une œuvre de @fr
label: ir darba veltītājs (persona) @lv
label: is dedicator person of @en
label: is opdrager-persoon van @nl
label: ist Person als Widmende/Widmender von @de
label: ithaf eden kişidir @tr
label: pühendaja (isik) teoses @et
label: è dedicante persona di @it
label: és persona dedicant de @ca
label: είναι αφιερωτής φυσικό πρόσωπο του @el
label: هو شخص مُهدي كتاب لـ @ar
label: 是……的题献者个人 @zh-hans
sub property of: omistuskirjoituksen tekijä (toimija) teoksessa
sub property of: henkilöön liittyvä teos
definition: Bir kişiyi, ilgili bir kişinin ilhamı veya desteğinin bir göstergesi olarak atanan bir eserle ilişkilendirir. @tr
definition: Correla una persona a un'opera assegnata come riconoscimento dell'ispirazione o supporto di una persona correlata. @it
definition: Hozzákapcsol egy személyt egy műhöz, amelyet egy műhöz kapcsolódó személy ösztönzésének vagy támogatásának köszöneteként jelölnek meg. @hu
definition: Liittää henkilön teokseen, joka on omistettu sitä innoittaneelle tai tukeneelle henkilölle.
definition: Met une personne en relation avec une œuvre qui est dédiée en reconnaissance de l’inspiration ou du soutien d’une personne en relation. @fr
definition: Relaciona una persona amb una obra que s’assigna com a reconeixement per la inspiració o suport d’una persona relacionada. @ca
definition: Relateert een persoon aan een werk dat toegekend is als erkenning van de inspiratie of hulp van een gerelateerde persoon. @nl
definition: Relaterer en person til et verk som er tilegnet som en anerkjennelse for inspirasjonen eller støtten fra en relatert person. @no
definition: Relaterer en person til et værk, som er tilegnet en relateret person, som en anerkendelse af inspiration eller støtte. @da
definition: Relates a person to a work that is assigned as an acknowledgment of the inspiration or support of a related person. @en
definition: Sasaista personu ar darbu, kas ir veltīts pateicībā par saistītās personas iedvesmojumu vai atbalstu. @lv
definition: Seostab isiku teosega, mille seotud isik on pühendanud kellelegi tänuavaldusena innustuse või toetuse eest. @et
definition: Setzt eine Person in Beziehung zu einem Werk, das als Zeichen der Anerkennung oder Unterstützung einer in Beziehung stehenden Person gewidmet ist. @de
definition: يربط شخصا بعمل تم تخصيصه كإقرار بالإلهام أو الدعم لشخص ذي الصلة. @ar
definition: 将一个个人与被指定对一个相关个人的启发或支持之感谢的一种作品关联起来。 @zh-hans

teoksella kunnioitettu henkilö teoksessa
has element type: 2
toolkit definition: A work that marks the esteem of and respect for a person. @en
toolkit definition: Bir kişinin temsilcinin itibarını ve saygısını simgeleyen bir eser. @tr
toolkit definition: Darbs, ar kuru godināta persona. @lv
toolkit definition: Een werk dat toont de waardering en respect voor een persoon. @nl
toolkit definition: Egy mű, amely jelzi egy személy megbecsülését és tiszteletét. @hu
toolkit definition: Ein Werk, das eine Person ehrt. @de
toolkit definition: Et verk som markerer aktelsen og respekten for en person. @no
toolkit definition: Obra que marca l’estima i el respecte per una persona. @ca
toolkit definition: Opera che esprime la stima e il rispetto per una persona. @it
toolkit definition: Teos, joka osoittaa arvostusta ja kunnioitusta henkilölle.
toolkit definition: Teos, mis märgib lugupidamist ja austust isiku vastu. @et
toolkit definition: Værk, som markerer en hædring af en person. @da
toolkit definition: Œuvre qui marque l’estime et le respect pour une personne. @fr
toolkit definition: عمل يدل على تقدير واحترام شخص. @ar
toolkit definition: 表示对一个个人尊重或尊敬的一种作品 @zh-hans
toolkit label: Person als Gefeierte/Gefeierter eines Werks von @de
toolkit label: austusavalduse saaja (isik) teoses @et
toolkit label: beæret person av verk for @no
toolkit label: eserinin onurlandırılan kişisidir @tr
toolkit label: geëerde persoon van werk van @nl
toolkit label: honouree person of work of @en
toolkit label: méltatott személye a következő műnek: @hu
toolkit label: onorato persona di opera di @it
toolkit label: person, som beæres af værk af @da
toolkit label: persona homenatjada d’una obra de @ca
toolkit label: personne honorée d’une œuvre de @fr
toolkit label: personu godinošais darbs @lv
toolkit label: teoksella kunnioitettu henkilö teoksessa
toolkit label: τιμώμενο φυσικό πρόσωπο του έργου του @el
toolkit label: شخص مكرم عن عمل @ar
toolkit label: ……的作品的被纪念者个人 @zh-hans
has subproperty: P50567
lexical alias: honoureePersonOfWorkOf.en
status: Published
type: Property
domain: C10004
label: austusavalduse saaja (isik) teoses @et
label: er beæret person av verk for @no
label: er person, som beæres af værk af @da
label: eserinin onurlandırılan kişisidir @tr
label: est une personne honorée d’une œuvre de @fr
label: is geëerde persoon van werk van @nl
label: is honouree person of work of @en
label: ist Person als Gefeierte/Gefeierter eines Werks von @de
label: méltatott személye a következő műnek: @hu
label: personu godinošais darbs @lv
label: è onorato persona di opera di @it
label: és persona homenatjada d’una obra de @ca
label: είναι τιμώμενο φυσικό πρόσωπο του έργου του @el
label: هو شخص مكرم بعمل لـ @ar
label: 是……的作品的被纪念者个人 @zh-hans
sub property of: teoksella kunnioitettu toimija teoksessa
sub property of: henkilöön liittyvä teos
alternative label: Person als Gefeierte/Gefeierter eines Werks von @de
alternative label: honoree person of work of @en
alternative label: kunnioitettu henkilö teoksessa
alternative label: onorato persona di opera di @it
alternative label: person, som er hædersperson i værk af @da
alternative label: persona homenajeada por la obra de @es
alternative label: τιμώμενο φυσικό πρόσωπο του έργου του @el
alternative label: شخص مكرم بعمل @ar
alternative label: ……的作品的被纪念者个人 @zh-hans
definition: Bir kişiyi, bir kişiye duyulan saygıyı ve saygıyı gösteren bir eserle ilişkilendirir. @tr
definition: Correla una persona a un'opera che esprime la stima e il rispetto per una persona. @it
definition: Hozzákapcsol egy személyt egy műhöz, amely jelzi egy személy megbecsülését és tiszteletét. @hu
definition: Liittää henkilön teokseen, joka osoittaa arvostusta ja kunnioitusta henkilölle.
definition: Met une personne en relation avec une œuvre qui marque l’estime et le respect pour une personne. @fr
definition: Relaciona una persona amb una obra que marca l’estima i el respecte per una persona. @ca
definition: Relateert een persoon aan een werk dat toont de waardering en respect voor een persoon. @nl
definition: Relaterer en person til et verk som markerer aktelsen og respekten for en person. @no
definition: Relaterer en person til et værk, som markerer en hædring af en person. @da
definition: Relates a person to a work that marks the esteem of and respect for a person. @en
definition: Sasaista personu ar darbu, ar kuru godināta persona. @lv
definition: Seostab isiku teosega, mis märgib lugupidamist ja austust isiku vastu. @et
definition: Setzt eine Person in Beziehung zu einem Werk, das eine Person ehrt. @de
definition: يربط شخصا بعمل يدل على تقدير واحترام شخص @ar
definition: 将一个个人与表示对一个个人尊重或尊敬的一种作品关联起来。 @zh-hans

näyttelijä (henkilö) ekspressiossa
has element type: 2
toolkit definition: An expression that includes a contribution by a person of acting as a cast member or player in a musical or dramatic presentation. @en
toolkit definition: Bir müzikal veya dramatik sunumda oyuncu veya oyuncu kadrosu üyesi olarak hareket eden bir kişinin katkısını içeren bir anlatım. @tr
toolkit definition: Een expressie die omvat een bijdrage door een persoon die optreedt als een lid van een gezelschap of speler in een muziek- of dramapresentatie. @nl
toolkit definition: Egy kifejezési forma, amely magában foglalja egy személynek, mint a szereposztás egy tagjának vagy előadójának a közreműködését egy zenei vagy drámai bemutatóban. @hu
toolkit definition: Eine Expression, zu der eine Person beiträgt, indem sie als Ensemble-Mitglied oder Darstellerin/Darsteller in einer musikalischen oder dramatischen Darbietung fungiert. @de
toolkit definition: Ekspressio, jonka tekemisessä henkilö on osallisena näyttelemällä musiikki- tai näytelmäesityksessä.
toolkit definition: Espressione che comprende un contributo di una persona nella recitazione come membro del cast o musicista in una presentazione musicale o drammatica. @it
toolkit definition: Et uttrykk som inkluderer et bidrag fra en person i form av å spille en rolle eller som utøver i en musikalsk eller dramatisk forestilling. @no
toolkit definition: Expression qui intègre une contribution de la part d’une personne consistant à agir à titre de membre d’une distribution artistique ou de comédien dans une présentation musicale ou dramatique. @fr
toolkit definition: Expressió que inclou una contribució d’una persona actuant com un membre del repartiment o com un comediant d’una representació musical o dramàtica. @ca
toolkit definition: Izteiksme, kas ietver personas ieguldījumu, izpildot lomu dramatiskā uzvedumā vai spēlējot mūzikas uzvedumā. @lv
toolkit definition: Udtryk, som omfatter en persons bidrag ved at være skuespiller eller musiker i en musikalsk eller dramatisk præsentation. @da
toolkit definition: Väljendus, millesse isik on andnud panuse, osaledes trupiliikme või näitlejana muusika- või draamaetenduses. @et
toolkit definition: تعبيرة تتضمن إسهام شخص يعمل كعضو فريق تمثيل أو عازف في عرض موسيقي أو درامي. @ar
toolkit definition: 包括在音乐或戏剧呈现中扮演角色或演奏的一个个人的贡献的一种内容表达 @zh-hans
toolkit label: Oyuncu kişi @tr
toolkit label: Person als Schauspielerin/Schauspieler von @de
toolkit label: acteur-persoon van @nl
toolkit label: actor person of @en
toolkit label: attore persona di @it
toolkit label: ir aktieris (persona) @lv
toolkit label: näitleja (isik) väljenduses @et
toolkit label: näyttelijä (henkilö) ekspressiossa
toolkit label: person, som er skuespiller af @da
toolkit label: persona actriu de @ca
toolkit label: personne actrice de @fr
toolkit label: skuepiller for (person) @no
toolkit label: színész személye a következőnek @hu
toolkit label: ηθοποιός φυσικό πρόσωπο του @el
toolkit label: شخص ممثل @ar
toolkit label: ……的演员个人 @zh-hans
has subproperty: ääninäyttelijä (henkilö) ekspressiossa
has subproperty: P50568
lexical alias: actorPersonOf.en
status: Published
type: Property
domain: C10004
label: aktör kişisidir @tr
label: er person, som er skuespiller af @da
label: er skuepiller for (person) @no
label: est une personne actrice de @fr
label: ir aktieris (persona) @lv
label: is acteur-persoon van @nl
label: is actor person of @en
label: ist Person als Schauspielerin/Schauspieler von @de
label: näitleja (isik) väljenduses @et
label: színész személye a következőnek: @hu
label: è attore persona di @it
label: és persona actriu de @ca
label: είναι ηθοποιός φυσικό πρόσωπο του @el
label: هو شخص ممثل لـ @ar
label: 是……的演员个人 @zh-hans
sub property of: näyttelijä (toimija) ekspressiossa
sub property of: esittäjä (henkilö) ekspressiossa
definition: Bir kişiyi, müzikal veya dramatik bir sunumda oyuncu veya oyuncu olarak rol alan bir kişinin katkısını içeren bir anlatımla ilişkilendirir. @tr
definition: Correla una persona a un'espressione che comprende un contributo di una persona nella recitazione come membro del cast o musicista in una presentazione musicale o drammatica. @it
definition: Hozzákapcsol egy személyt egy kifejezési formához, amely magában foglalja egy személynek, mint a szereposztás egy tagjának vagy előadójának a közreműködését egy zenei vagy drámai bemutatóban. @hu
definition: Liittää henkilön ekspressioon, jonka tekemisessä henkilö on osallisena näyttelemällä musiikki- tai näytelmäesityksessä.
definition: Met une personne en relation avec une expression qui intègre une contribution de la part d’une personne consistant à agir à titre de membre d’une distribution artistique ou de comédien dans une présentation musicale ou dramatique. @fr
definition: Relaciona una persona amb una expressió que inclou una contribució d’una persona actuant com un membre del repartiment o com un comediant d’una representació musical o dramàtica. @ca
definition: Relateert een persoon aan een expressie die omvat een bijdrage door een persoon die optreedt als een lid van een gezelschap of speler in een muziek- of dramapresentatie. @nl
definition: Relaterer en person til et udtryk, som omfatter en persons bidrag ved at være skuespiller eller musiker i en musikalsk eller dramatisk præsentation. @da
definition: Relaterer en person til et uttrykk som inkluderer et bidrag fra en person i form av å spille en rolle eller som utøver i en musikalsk eller dramatisk forestilling. @no
definition: Relates a person to an expression that includes a contribution by a person of acting as a cast member or player in a musical or dramatic presentation. @en
definition: Sasaista personu ar izteiksmi, kas ietver personas ieguldījumu, izpildot lomu dramatiskā uzvedumā vai spēlējot mūzikas uzvedumā. @lv
definition: Seostab isiku väljendusega, millesse isik on andnud panuse, osaledes trupiliikme või näitlejana muusika- või draamaetenduses. @et
definition: Setzt eine Person in Beziehung zu einer Expression, zu der eine Person beiträgt, indem sie als Ensemble-Mitglied oder Darstellerin/Darsteller in einer musikalischen oder dramatischen Darbietung fungiert. @de
definition: يربط شخصا بتعبيرة تتضمن إسهام شخص يعمل كعضو في فريق تمثيل أو عازف في عرض موسيقي أو درامي. @ar
definition: 将一个个人与包括在音乐或戏剧呈现中扮演角色或演奏的一个个人的贡献的一种内容表达关联起来。 @zh-hans

toimittaja (henkilö) ekspressiossa
has element type: 2
toolkit definition: An expression that includes a contribution by a person of amending content created by other agents in order to meet standards for publication or other use. @en
toolkit definition: Een expressie die omvat een bijdrage door een persoon door aanpassen van content gecreëerd door andere actoren met de bedoeling te voldoen aan standaarden voor publicatie of ander gebruik. @nl
toolkit definition: Egy kifejezési forma, amely magában foglalja egy személy közreműködését, melynek során más ágensek által létrehozott szöveget módosít, hogy az megfeleljen az olyan publikációs szabályoknak, mint a következetesség, az egyértelműség és a stílus. @hu
toolkit definition: Eine Expression, zu der eine Person beiträgt, indem sie von anderen Akteuren erstellte Inhalte so verändert, dass sie den Standards für die Veröffentlichung oder einer anderweitigen Verwendung entsprechen. @de
toolkit definition: Ekspressio, jonka tekemisessä henkilö on osallisena tarkistamalla muiden toimijoiden luomaa sisältöä julkaisu- tai muiden käyttöstandardien saavuttamiseksi.
toolkit definition: Espressione che comprende un contributo di una persona nella correzione di testo creato da altre persone per soddisfare standard di pubblicazione come uniformità, chiarezza e stile. @it
toolkit definition: Et uttrykk som inkluderer et bidrag fra en person i form av å å gjøre endringer i tekst skrevet av andre personer for å imøtekomme utgivelsesstandarder for sammenheng, tydelighet og stil. @no
toolkit definition: Expression qui intègre une contribution de la part d’une personne consistant à modifier du contenu créé par d’autres agents afin de répondre à des normes pour la publication ou une autre utilisation. @fr
toolkit definition: Expressió que inclou una contribució d’una persona esmenant contingut creat per altres agents per tal de complir els estàndards de publicació o un altre ús. @ca
toolkit definition: Izteiksme, kas ietver personas ieguldījumu, pielāgojot citu aģentu radīto saturu, lai tas atbilstu publicēšanas vai citādas izmantošanas standartiem. @lv
toolkit definition: Udtryk, som omfatter en persons bidrag ved at ændre indhold skabt af andre agenter for at opfylde publikationsstandarder eller for andet brug. @da
toolkit definition: Väljendus, millesse isik on andnud panuse, parandades teiste isikute loodud teksti, et see vastaks loogilisuse, selguse ja stiili poolest avaldamisnõuetele. @et
toolkit definition: Yayınlama veya diğer kullanım standartlarını karşılamak için diğer temsilciler tarafından oluşturulan içeriği düzelten bir kişinin katkısını içeren bir anlatım. @tr
toolkit definition: تعبيرة تتضمن إسهام شخص في تعديل نص من تأليف وكلاء آخرين من أجل استيفاء معايير النشر مثل الاتساق والوضوح والأسلوب. @ar
toolkit definition: 包括修正其他行为者创作的内容以满足出版标准或其他用途的一个个人的贡献的一种内容表达 @zh-hans
toolkit label: Person als Herausgeberin/Herausgeber von @de
toolkit label: curatore persona di testo di @it
toolkit label: editor person of @en
toolkit label: editör @tr
toolkit label: ir redaktors (persona) @lv
toolkit label: person, som er redaktør af @da
toolkit label: persona editora literària de @ca
toolkit label: personne éditrice intellectuelle de @fr
toolkit label: redacteur-persoon van tekst van @nl
toolkit label: redaktør av tekst for (person) @no
toolkit label: szerkesztő személye: @hu
toolkit label: tekstitoimetaja (isik) väljenduses @et
toolkit label: toimittaja (henkilö) ekspressiossa
toolkit label: επιμελητής φυσικό πρόσωπο του κειμένου του @el
toolkit label: شخص محرر نص @ar
toolkit label: ……的编者个人 @zh-hans
has subproperty: P50569
lexical alias: editorPersonOf.en
status: Published
type: Property
domain: C10004
label: editör kişisidir @tr
label: er person, som er redaktør af @da
label: er redaktør av tekst for (person) @no
label: est une personne éditrice intellectuelle de @fr
label: ir redaktors (persona) @lv
label: is editor person of @en
label: is redacteur-persoon van @nl
label: ist Person als Herausgeberin/Herausgeber von @de
label: szerkesztő személye a következőnek: @hu
label: tekstitoimetaja (isik) väljenduses @et
label: è curatore persona di testo di @it
label: és persona editora literària de @ca
label: είναι επιμελητής φυσικό πρόσωπο του κειμένου του @el
label: هو شخص محرر نص لـ @ar
label: 是……的编者个人 @zh-hans
sub property of: toimittaja (toimija) ekspressiossa
sub property of: yhdistymään osallinen henkilö ekspressiossa
alternative label: A tartalom mozgásírás, zenei lejegyzés, tapintható mozgásírás, tapintható zenei lejegyzés, tapintható szöveg és szöveg lehet. @hu
alternative label: Personal als Herausgeberin/Herausgeber eines Texts von @de
alternative label: Redactor de texto de @es
alternative label: editor person of text of @en
alternative label: metnin editörü @tr
alternative label: person, som er redaktør af tekst af @da
alternative label: persona editora de text de @ca
alternative label: personne éditrice intellectuelle de texte de @fr
alternative label: tekstin toimittaja (henkilö) ekspressiossa
alternative label: شخص محرر لنص لـ @ar
alternative label: ……的文本的编者个人 @zh-hans
definition: Bir kişiyi, yayın veya diğer kullanım standartlarını karşılamak için diğer aracılar tarafından oluşturulan içeriği değiştiren bir kişinin katkısını içeren bir anlatımla ilişkilendirir. @tr
definition: Correla una persona a un'espressione che comprende un contributo di una persona nella correzione di testo creato da altre persone per soddisfare standard di pubblicazione come uniformità, chiarezza e stile. @it
definition: Hozzákapcsol egy személyt egy kifejezési formához, amely magában foglalja egy személy közreműködését, melynek során más ágensek által létrehozott szöveget módosít, hogy az megfeleljen az olyan publikációs szabályoknak, mint a következetesség, az egyértelműség és a stílus. @hu
definition: Liittää henkilön ekspressioon, jonka tekemisessä henkilö on osallisena tarkistamalla muiden toimijoiden luomaa sisältöä julkaisu- tai muiden käyttöstandardien saavuttamiseksi.
definition: Met une personne en relation avec une expression qui intègre une contribution de la part d’une personne consistant à modifier du contenu créé par d’autres agents afin de répondre à des normes pour la publication ou une autre utilisation. @fr
definition: Relaciona una persona amb una expressió que inclou una contribució d’una persona esmenant contingut creat per altres agents per tal de complir els estàndards de publicació o un altre ús. @ca
definition: Relateert een persoon aan een expressie die omvat een bijdrage door een persoon door aanpassen van content gecreëerd door andere actoren met de bedoeling te voldoen aan standaarden voor publicatie of ander gebruik. @nl
definition: Relaterer en person til et udtryk, som omfatter en persons bidrag ved at ændre indhold skabt af andre agenter for at opfylde publikationsstandarder eller for andet brug. @da
definition: Relaterer en person til et uttrykk som inkluderer et bidrag fra en person i form av å å gjøre endringer i tekst skrevet av andre personer for å imøtekomme utgivelsesstandarder for sammenheng, tydelighet og stil. @no
definition: Relates a person to an expression that includes a contribution by a person of amending content created by other agents in order to meet standards for publication or other use. @en
definition: Sasaista personu ar izteiksmi, kas ietver personas ieguldījumu, pielāgojot citu aģentu radīto saturu, lai tas atbilstu publicēšanas vai citādas izmantošanas standartiem. @lv
definition: Seostab isiku väljendusega, millesse isik on andnud panuse, parandades teiste isikute loodud teksti, et see vastaks loogilisuse, selguse ja stiili poolest avaldamisnõuetele. @et
definition: Setzt eine Person in Beziehung zu einer Expression, zu der eine Person beiträgt, indem sie von anderen Akteuren erstellte Inhalte so verändert, dass sie den Standards für die Veröffentlichung oder einer anderweitigen Verwendung entsprechen. @de
definition: يربط شخصا بتعبيرة تتضمن إسهام شخص في تعديل نص من تأليف وكلاء آخرين من أجل استيفاء معايير النشر مثل الاتساق والوضوح والأسلوب. @ar
scope note: Content includes notated movement, notated music, tactile notated movement, tactile notated music, tactile text, and text. @en

esittelijä (henkilö) ekspressiossa
has element type: 2
toolkit definition: An expression that includes a contribution by a person of appearing on-screen to provide contextual or background information. @en
toolkit definition: Bağlamsal veya arka plan bilgisi vermek amacı ile ekranda görünen bir kişinin katkısını içeren bir anlatım. @tr
toolkit definition: Een expressie die omvat een bijdrage door een persoon door in beeld te verschijnen om contextuele of achtergrondinformatie te geven. @nl
toolkit definition: Egy kifejezési forma, amely magában foglalja egy képernyőn megjelenő személy közreműködését szövegösszefüggésre vonatkozó vagy háttérinformáció szolgáltatásában. @hu
toolkit definition: Eine Expression, zu der eine Person beiträgt, indem sie auf dem Bildschirm erscheint, um Kontext- und Hintergrundinformationen zu liefern. @de
toolkit definition: Ekspressio, jonka tekemisessä henkilö on osallisena esiintymällä televisiossa tai elokuvassa taustatiedon antajana.
toolkit definition: Espressione che comprende un contributo di una persona nell'apparire sullo schermo per fornire informazioni contestuali o in sottofondo. @it
toolkit definition: Et uttrykk som inkluderer et bidrag fra en person i form av å vises på skjermen for å gi kontekst eller bakgrunnsinformasjon. @no
toolkit definition: Expression qui intègre une contribution de la part d’une personne consistant à apparaître à l’écran pour fournir de l’information contextuelle ou complémentaire. @fr
toolkit definition: Expressió que inclou una contribució d’una persona apareixent en pantalla per proporcionar informació contextual o dels antecedents. @ca
toolkit definition: Izteiksme, kas ietver personas ieguldījumu, parādoties ekrānā, lai nodrošinātu konteksta vai fona informāciju. @lv
toolkit definition: Udtryk, som omfatter en persons bidrag ved at optræde på en skærm for at give kontekstuel- eller baggrundsinformation. @da
toolkit definition: Väljendus, millesse isik on andnud panuse, pakkudes ekraanil kontekstilist ja taustinfot. @et
toolkit definition: تعبيرة تتضمن إسهام شخص بظهوره على الشاشة لتقديم معلومات سياقية أو معلومات أساسية. @ar
toolkit definition: 包括有出现在屏幕上提供语境或背景信息的一个个人的贡献的一种内容表达 @zh-hans
toolkit label: Person als On-Screen-Präsentatorin/On-Screen-Präsentator von @de
toolkit label: ekraanil esineja (isik) väljenduses @et
toolkit label: ekrandaki sunucu kişi @tr
toolkit label: esittelijä (henkilö) ekspressiossa
toolkit label: ir ekrānā redzamais vadītājs (persona) @lv
toolkit label: képernyőn megjelenő előadó személye: @hu
toolkit label: onscreen presenter person of @en
toolkit label: person, som er programvært af @da
toolkit label: persona presentadora en pantalla de @ca
toolkit label: personne présentatrice à l’écran de @fr
toolkit label: presentator in beeld-persoon van @nl
toolkit label: presentatore video persona di @it
toolkit label: programleder for (person) @no
toolkit label: οθονικός παρουσιαστής φυσικό πρόσωπο του @el
toolkit label: شخص مقدم برامج على الشاشة @ar
toolkit label: ……的屏幕主持人个人 @zh-hans
has subproperty: P50570
lexical alias: onscreenPresenterPersonOf.en
status: Published
type: Property
domain: C10004
label: ekraanil esineja (isik) väljenduses @et
label: ekran sunucusu kişisidir @tr
label: er person, som er programvært af @da
label: er programleder for (person) @no
label: est une personne présentatrice à l’écran de @fr
label: ir ekrānā redzamais vadītājs (persona) @lv
label: is onscreen presenter person of @en
label: is presentator in beeld-persoon van @nl
label: ist Person als On-Screen-Präsentatorin/On-Screen-Präsentator von @de
label: képernyőn megjelenő előadó személye a következőnek: @hu
label: è presentatore video persona di @it
label: és persona presentadora en pantalla de @ca
label: είναι οθονικός παρουσιαστής φυσικό πρόσωπο του @el
label: هو شخص مقدم برامج على الشاشة لـ @ar
label: 是……的屏幕主持人个人 @zh-hans
sub property of: esittelijä (toimija) ekspressiossa
sub property of: esittäjä (henkilö) ekspressiossa
definition: Bir kişiyi, bağlamsal veya arka plan bilgisi sağlamak için ekranda görünen bir kişinin katkısını içeren bir anlatımla ilişkilendirir. @tr
definition: Correla una persona a un'espressione che comprende un contributo di una persona nell'apparire sullo schermo per fornire informazioni contestuali o in sottofondo. @it
definition: Hozzákapcsol egy személyt egy kifejezési formához, amely magában foglalja egy képernyőn megjelenő személy közreműködését szövegösszefüggésre vonatkozó vagy háttérinformáció szolgáltatásában. @hu
definition: Liittää henkilön ekspressioon, jonka tekemisessä henkilö on osallisena esiintymällä televisiossa tai elokuvassa taustatiedon antajana.
definition: Met une personne en relation avec une expression qui intègre une contribution de la part d’une personne consistant à apparaître à l’écran pour fournir de l’information contextuelle ou complémentaire. @fr
definition: Relaciona una persona amb una expressió que inclou una contribució d’una persona apareixent en pantalla per proporcionar informació contextual o dels antecedents. @ca
definition: Relateert een persoon aan een expressie die omvat een bijdrage door een persoon door in beeld te verschijnen om contextuele of achtergrondinformatie te geven. @nl
definition: Relaterer en person til et udtryk, som omfatter en persons bidrag ved at optræde på en skærm for at give kontekstuel- eller baggrundsinformation. @da
definition: Relaterer en person til et uttrykk som inkluderer et bidrag fra en person i form av å vises på skjermen for å gi kontekst eller bakgrunnsinformasjon. @no
definition: Relates a person to an expression that includes a contribution by a person of appearing on screen to provide contextual or background information. @en
definition: Sasaista personu ar izteiksmi, kas ietver personas ieguldījumu, parādoties ekrānā, lai nodrošinātu konteksta vai fona informāciju. @lv
definition: Seostab isiku väljendusega, millesse isik on andnud panuse, pakkudes ekraanil kontekstilist ja taustinfot. @et
definition: Setzt eine Person in Beziehung zu einer Expression, zu der eine Person beiträgt, indem sie auf dem Bildschirm erscheint, um Kontext- und Hintergrundinformationen zu liefern. @de
definition: يربط شخصا بتعبيرة تتضمن إسهام شخص بظهوره على الشاشة لتقديم معلومات سياقية أو معلومات أساسية. @ar
definition: 将一个个人与包括有出现在屏幕上提供语境或背景信息的一个个人的贡献的一种内容表达关联起来。 @zh-hans
scope note: An on-screen presenter may appear in nonfiction moving image materials or in introductions to fiction moving image materials. @en
scope note: Bir ekran sunucusu, kurgusal olmayan hareketli görüntü materyallerinde veya kurgusal hareketli görüntü materyallerine girişlerde görünebilir. @tr
scope note: Darunter fallen Auftritte in nicht-fiktionalen Bewegtbildmaterialien oder in Einführungen zu fiktionalen Bewegtbildmaterialien. @de
scope note: Een presentator in beeld kan voorkomen in non-fictie bewegend beeldmaterialen of in inleidingen op fictie bewegend beeldmaterialen. @nl
scope note: Egy képernyőn megjelenő előadó tényszerű mozgóképanyagokban vagy fikciós mozgóképanyagok bevezetőiben is látható. @hu
scope note: Ekraanil esineja võib esineda mittefiktsioonilistes filmides ja fiktsioonfilmide sissejuhatavates osades. @et
scope note: Ekrānā redzamais vadītājs var parādīties dokumentālās filmas materiālos, vai spēlfilmas pieteikumos. @lv
scope note: En programvært kan optræde i levende billedmaterialer af faktuel karakter eller i introduktioner til levende billedmaterialer af fiktiv karakter. @da
scope note: Esittelijä voi esiintyä ei-fiktiivisessä ohjelmassa tai fiktiivisen elokuvan johdannossa.
scope note: Un presentador en pantalla pot aparèixer en els materials d’imatge en moviment de no ficció o en les introduccions de materials d’imatge en moviment de ficció. @ca

värittäjä (henkilö) ekspressiossa
has element type: 2
toolkit definition: An expression that includes a contribution by a person of applying colour to drawings, prints, photographs, maps, moving images, and other visual content. @en
toolkit definition: Een expressie die omvat een bijdrage door een persoon door toevoegen van kleur aan tekeningen, afdrukken, foto's, kaarten, bewegende beelden en andere visuele content. @nl
toolkit definition: Egy kifejezési forma, amely magában foglalja egy személy közreműködését szín felhordásában rajzokra, nyomtatványokra, fényképekre, térképekre, mozgóképekre és más vizuális tartalmakra. @hu
toolkit definition: Eine Expression, zu der eine Person beiträgt, indem sie Farben auf Zeichnungen, Drucke, Fotografien, Karten, Bewegtbilder und so weiter aufbringt. @de
toolkit definition: Ekspressio, jossa henkilö on osallisena värittämällä piirustuksia, vedoksia, valokuvia, karttoja, elokuvia tms.
toolkit definition: Espressione che comprende un contributo di una persona nell'applicazione di colore a disegni, stampe, fotografie, mappe, immagini in movimento e altri contenuti visivi. @it
toolkit definition: Et uttrykk som inkluderer et bidrag fra en person i form av fargelegge tegninger, trykk, fotografier, kart, levende bilder og annet visuelt materiale. @no
toolkit definition: Expression qui intègre une contribution de la part d’une personne consistant à appliquer de la couleur à des dessins, des images imprimées, des photographies, des cartes, des images animées et d’autres contenus visuels. @fr
toolkit definition: Expressió que inclou una contribució d’una persona aplicant color a dibuixos, gravats, fotografies, mapes, imatges en moviment i a qualsevol altre contingut visual. @ca
toolkit definition: Izteiksme, kas ietver personas ieguldījumu, izkrāsojot zīmējumu, gravīru, fotogrāfiju, karšu, kustīgo attēlu, u. tml. @lv
toolkit definition: Udtryk, som omfatter en persons bidrag ved at farvelægge tegninger, tryk, fotos, kort, levende billeder og andet visuelt indhold. @da
toolkit definition: Väljendus, millesse isik on andnud panuse, värvides joonistusi, tõmmiseid, fotosid, kaarte, liikuvaid pilte ja muud visuaalset sisu. @et
toolkit definition: Çizimlere, baskılara, fotoğraflara, haritalara, hareketli resimlere ve diğer görsel içeriğe renk uygulamaları yapan bir kişinin katkısını içeren bir anlatım. @tr
toolkit definition: تعبيرة تتضمن إسهام شخص بتلوين الرسومات، والمطبوعات، والصور الفوتوغرافية، والخرائط، والصور المتحركة، وأي محتوى مرئي آخر. @ar
toolkit definition: 包括将颜色施加于图画、印刷品、照片、地图、动态图像和其他视觉内容上的一个个人的贡献的一种内容表达 @zh-hans
toolkit label: Person als Koloristin/Kolorist von @de
toolkit label: colorist személye: @hu
toolkit label: colorista persona di @it
toolkit label: colourist person of @en
toolkit label: fargelegger for (person) @no
toolkit label: inkleurder-persoon van @nl
toolkit label: ir kolorists (persona) @lv
toolkit label: koloreerija (isik) väljenduses @et
toolkit label: person, som er farvelægger af @da
toolkit label: persona colorista de @ca
toolkit label: personne coloriste de @fr
toolkit label: renklendirici @tr
toolkit label: värittäjä (henkilö) ekspressiossa
toolkit label: επιχρωματιστής φυσικό πρόσωπο του @el
toolkit label: شخص فني تلوين لـ (هجاء بريطاني) @ar
toolkit label: ……的着色者个人 @zh-hans
has subproperty: P50571
lexical alias: colouristPersonOf.en
status: Published
type: Property
domain: C10004
label: colorist személye a következőnek: @hu
label: er fargelegger for (person) @no
label: er person, som er farvelægger af @da
label: est une personne coloriste de @fr
label: ir kolorists (persona) @lv
label: is colourist person of @en
label: is inkleurder-persoon van @nl
label: ist Person als Koloristin/Kolorist von @de
label: koloreerija (isik) väljenduses @et
label: renklendirici kişisidir @tr
label: è colorista persona di @it
label: és persona colorista de @ca
label: είναι επιχρωματιστής φυσικό πρόσωπο του @el
label: هو شخص فني تلوين لـ @ar
label: 是……的着色者个人 @zh-hans
sub property of: värittäjä (toimija) ekspressiossa
sub property of: yhdistymään osallinen henkilö ekspressiossa
alternative label: -
alternative label: Person als Coloristin/Colorist von @de
alternative label: colorist person of @en
alternative label: colorista de @es
alternative label: person, som er farvelægger af @da
alternative label: renklendirici @tr
alternative label: színező személye: @hu
alternative label: شخص فني تلوين لـ (هجاء أمريكي) @ar
alternative label: ……的着色者个人 @zh-hans
definition: Bir kişiyi çizimlere, baskılara, fotoğraflara, haritalara, hareketli görüntülere ve diğer görsel içeriğe renk uygulama katkısını içeren bir anlatımla ilişkilendirir. @tr
definition: Correla una persona a un'espressione che comprende un contributo di una persona nell'applicazione di colore a disegni, stampe, fotografie, mappe, immagini in movimento e altri contenuti visivi. @it
definition: Hozzákapcsol egy személyt egy kifejezési formához, amely magában foglalja egy személy közreműködését szín felhordásában rajzokra, nyomtatványokra, fényképekre, térképekre, mozgóképekre és más vizuális tartalmakra. @hu
definition: Liittää henkilön ekspressioon, jossa henkilö on osallisena värittämällä piirustuksia, vedoksia, valokuvia, karttoja, elokuvia tms.
definition: Met une personne en relation avec une expression qui intègre une contribution de la part d’une personne consistant à appliquer de la couleur à des dessins, des images imprimées, des photographies, des cartes, des images animées et d’autres contenus visuels. @fr
definition: Relaciona una persona amb una expressió que inclou una contribució d’una persona aplicant color a dibuixos, gravats, fotografies, mapes, imatges en moviment i a qualsevol altre contingut visual. @ca
definition: Relateert een persoon aan een expressie die omvat een bijdrage door een persoon door toevoegen van kleur aan tekeningen, afdrukken, foto's, kaarten, bewegende beelden en andere visuele content. @nl
definition: Relaterer en person til et udtryk, som omfatter en persons bidrag ved at farvelægge tegninger, tryk, fotos, kort, levende billeder og andet visuelt indhold. @da
definition: Relaterer en person til et uttrykk som inkluderer et bidrag fra en person i form av fargelegge tegninger, trykk, fotografier, kart, levende bilder og annet visuelt materiale. @no
definition: Relates a person to an expression that includes a contribution by a person of applying colour to drawings, prints, photographs, maps, moving images, and other visual content. @en
definition: Sasaista personu ar izteiksmi, kas ietver personas ieguldījumu, izkrāsojot zīmējumu, gravīru, fotogrāfiju, karšu, kustīgo attēlu, u. tml. @lv
definition: Seostab isiku väljendusega, millesse isik on andnud panuse, värvides joonistusi, tõmmiseid, fotosid, kaarte, liikuvaid pilte ja muud visuaalset sisu. @et
definition: Setzt eine Person in Beziehung zu einer Expression, zu der eine Person beiträgt, indem sie Farben auf Zeichnungen, Drucke, Fotografien, Karten, Bewegtbilder und so weiter aufbringt. @de
definition: يربط شخصا بتعبيرة تتضمن إسهام شخص في تلوين رسومات، ومطبوعات، وصور فوتوغرافية، وخرائط، وصور متحركة، وأي محتوى مرئي آخر. @ar
definition: 将一个个人与包括将颜色施加于图画、印刷品、照片、地图、动态图像和其他视觉内容上的一个个人的贡献的一种内容表达关联起来。 @zh-hans

maskeeraaja (henkilö) ekspressiossa
has element type: 2
toolkit definition: An expression that includes a contribution by a person of applying makeup and prosthetics for a moving image production or for a musical or dramatic presentation or entertainment. @en
toolkit definition: Een expressie die omvat een bijdrage door een persoon door aanbrengen van make-up en protheses voor een bewegend beeld-productie of voor een muzikale of dramatische presentatie of vermaak. @nl
toolkit definition: Egy kifejezési forma, amely magában foglalja egy személy közreműködését makeup és protézisek alkalmazásában egy mozgókép-produkcióhoz, zenei vagy drámai előadáshoz, vagy szórakoztató műsorhoz. @hu
toolkit definition: Eine Expression zu der eine Person beiträgt, indem sie Schminke und Prothetik für eine Bewegtbildproduktion oder eine musikalische oder dramatische Darbietung oder Aufführung aufträgt. @de
toolkit definition: Ekspressio, jossa henkilö on osallisena vastaamalla elokuvan, musikaalin tai näyttämöteoksen maskeerauksesta.
toolkit definition: Espressione che comprende un contributo di una persona nell'applicazione di trucco e protesi per una produzione di immagini in movimento o per una presentazione o spettacolo musicale o drammatico. @it
toolkit definition: Et uttrykk som inkluderer et bidrag fra en person i form av å bruke sminke og proteser for en produksjon med levende bilder eller en musikalsk eller dramatisk forestilling eller form for underholdning. @no
toolkit definition: Expression qui intègre une contribution de la part d’une personne consistant à appliquer du maquillage et des prothèses pour une production d’images animées ou bien pour une présentation ou un spectacle musical ou dramatique. @fr
toolkit definition: Expressió que inclou una contribució d’una persona aplicant maquillatge i pròtesis en el cas d’una producció d’imatge en moviment o una representació o un espectacle musical o dramàtic. @ca
toolkit definition: Hareketli bir görüntü üretimi veya müzikal veya dramatik bir sunum veya eğlence için bir kişinin makyaj ve protez uygulama katkısını içeren bir anlatım. @tr
toolkit definition: Izteiksme, kas ietver personas ieguldījumu, pielietojot dekoratīvo kosmētiku un protezēšanu filmu veidošanā, mūzikas vai dramatiskā uzvedumā vai izklaides pasākumā. @lv
toolkit definition: Udtryk, som omfatter en persons bidrag ved at lægge makeup og påsætte proteser til en levende billedproduktion eller til en musikalsk eller dramatisk præsentation eller til underholdning. @da
toolkit definition: Väljendus, millesse isik on andnud panuse, tehes grimmi ja proteesgrimmi filmi tootmise, muusika- või draamaetenduse või meelelahutusürituse jaoks. @et
toolkit definition: تعبيرة تتضمن إسهام شخص بوضع مكياج أو أطراف صناعية في إنتاج صور متحركة أو في عرض موسيقي أو درامي أو ترفيهي. @ar
toolkit definition: 包括为动态图像制作或者为音乐或戏剧呈现或娱乐施加化妆品或假体的一个个人的贡献的一种内容表达 @zh-hans
toolkit label: Makyaj sanatçısı @tr
toolkit label: Person als Maskenbildnerin/Maskenbildner von @de
toolkit label: grimmikunstnik (isik) väljenduses @et
toolkit label: ir grima mākslinieks (persona) @lv
toolkit label: make-upartiest-persoon van @nl
toolkit label: makeup artist person of @en
toolkit label: maskeeraaja (henkilö) ekspressiossa
toolkit label: person, som er sminkør af @da
toolkit label: persona maquilladora de @ca
toolkit label: personne maquilleuse de @fr
toolkit label: sminkmester személye: @hu
toolkit label: sminkør for (person) @no
toolkit label: truccatore persona di @it
toolkit label: ψιμυθιολόγος φυσικό πρόσωπο του @el
toolkit label: شخص فنان مكياج @ar
toolkit label: ……的化妆艺术家个人 @zh-hans
has subproperty: P50572
lexical alias: makeupArtistPersonOf.en
status: Published
type: Property
domain: C10004
label: er person, som er sminkør af @da
label: er sminkør for (person) @no
label: est une personne maquilleuse de @fr
label: grimmikunstnik (isik) väljenduses @et
label: ir grima mākslinieks (persona) @lv
label: is make-upartiest-persoon van @nl
label: is makeup artist person of @en
label: ist Person als Maskenbildnerin/Maskenbildner von @de
label: makyaj sanatçısı kişisidir @tr
label: sminkmester személye a következőnek: @hu
label: è truccatore persona di @it
label: és persona maquilladora de @ca
label: είναι ψιμυθιολόγος φυσικό πρόσωπο του @el
label: هو شخص فنان مكياج لـ @ar
label: 是……的化妆艺术家个人 @zh-hans
sub property of: maskeeraaja (toimija) ekspresiossa
sub property of: esitykseen osallinen henkilö ekspressiossa
definition: Bir kişiyi, hareketli bir görüntü prodüksiyonu veya müzikal ya da dramatik bir sunum veya gösteri için makyaj ve sahne estetiği uygulayan bir kişinin katkısını içeren bir anlatımla ilişkilendirir. @tr
definition: Correla una persona a un'espressione che comprende un contributo di una persona nell'applicazione di trucco e protesi per una produzione di immagini in movimento o per una presentazione o spettacolo musicale o drammatico. @it
definition: Hozzákapcsol egy személyt egy kifejezési formához, amely magában foglalja egy személy közreműködését makeup és protézisek alkalmazásában egy mozgókép-produkcióhoz, zenei vagy drámai előadáshoz, vagy szórakoztató műsorhoz. @hu
definition: Liittää henkilön ekspressioon, jossa henkilö on osallisena vastaamalla elokuvan, musikaalin tai näyttämöteoksen maskeerauksesta.
definition: Met une personne en relation avec une expression qui intègre une contribution de la part d’une personne consistant à appliquer du maquillage et des prothèses pour une production d’images animées ou bien pour une présentation ou un spectacle musical ou dramatique. @fr
definition: Relaciona una persona amb una expressió que inclou una contribució d’una persona aplicant maquillatge i pròtesis en el cas d’una producció d’imatge en moviment o una representació o un espectacle musical o dramàtic. @ca
definition: Relateert een persoon aan een expressie die omvat een bijdrage door een persoon door aanbrengen van make-up en protheses voor een bewegend beeld-productie of voor een muzikale of dramatische presentatie of vermaak. @nl
definition: Relaterer en person til et udtryk, som omfatter en persons bidrag ved at lægge makeup og påsætte proteser til en levende billedproduktion eller til en musikalsk eller dramatisk præsentation eller til underholdning. @da
definition: Relaterer en person til et uttrykk som inkluderer et bidrag fra en person i form av å bruke sminke og proteser for en produksjon med levende bilder eller en musikalsk eller dramatisk forestilling eller form for underholdning. @no
definition: Relates a person to an expression that includes a contribution by a person of applying makeup and prosthetics for a moving image production or for a musical or dramatic presentation or entertainment. @en
definition: Sasaista personu ar izteiksmi, kas ietver personas ieguldījumu, pielietojot dekoratīvo kosmētiku un protezēšanu filmu veidošanā, mūzikas vai dramatiskā uzvedumā vai izklaides pasākumā. @lv
definition: Seostab isiku väljendusega, millesse isik on andnud panuse, tehes grimmi ja proteesgrimmi filmi tootmise, muusika- või draamaetenduse või meelelahutusürituse jaoks. @et
definition: Setzt eine Person in Beziehung zu einer Expression, zu der eine Person beiträgt, indem sie Schminke und Prothetik für eine Bewegtbildproduktion oder eine musikalische oder dramatische Darbietung oder Aufführung aufträgt. @de
definition: يربط شخصا بتعبيرة تتضمن إسهام شخص بوضع مكياج أو أطراف صناعية في إنتاج صور متحركة أو في عرض موسيقي أو درامي أو ترفيهي. @ar
definition: 将一个个人与包括为动态图像制作或者为音乐或戏剧呈现或娱乐施加化妆品或假体的一个个人的贡献的一种内容表达关联起来。 @zh-hans

leikkaaja (henkilö) ekspressiossa
has element type: 2
toolkit definition: An expression that includes a contribution by a person of assembling, arranging, and trimming film, video, or other moving image formats, including both visual and audio aspects. @en
toolkit definition: Een expressie die omvat een bijdrage door een persoon door samenstellen, arrangeren en couperen van film, video of andere bewegend beeld-vormen, inclusief zowel visuele als geluidaspecten. @nl
toolkit definition: Egy kifejezési forma, amely magában foglalja egy személy film, videó vagy más mozgóképformátum összeállításával, elrendezésével és vágásával járó közreműködését, beleértve mind a vizuális, mind az audió szempontokat. @hu
toolkit definition: Eine Expression, zu der eine Person beiträgt, indem sie für das Zusammensetzen, Arrangieren und Nachschneiden von Film-, Video- oder anderen Bewegtbildformaten zuständig ist. Darunter fallen Video- und Audio-Eigenschaften. @de
toolkit definition: Ekspressio, jonka tekemisessä henkilö on osallisena elokuvan, videon tai muiden elokuvaformaattien kokoamisessa, järjestämisessä ja leikkauksessa sekä kuvan että äänen osalta.
toolkit definition: Espressione che comprende un contributo di una persona per l'assemblaggio, organizzazione e taglio di film, video o altri formati di immagini in movimento, inclusi gli aspetti sia visivi sia audio. @it
toolkit definition: Et uttrykk som inkluderer et bidrag fra en person i form av å sette sammen, arrangere og klippe film, video eller andre formater for levende bilder, inkludert både bilde- og lydaspekter. @no
toolkit definition: Expression qui intègre une contribution de la part d’une personne consistant à assembler, à agencer et à découper du film, de la vidéo ou d’autres formats d’images animées, y compris les aspects visuels et sonores. @fr
toolkit definition: Expressió que inclou una contribució d’una persona d’aplegar, arranjar i retallar pel·lícules, vídeos i altres formats d’imatge en moviment, inclosos tant els aspectes visuals com els d’àudio. @ca
toolkit definition: Film, video veya diğer hareketli görüntü formatlarının montajı, düzenlenmesi ve kırpılmasından oluşan, hem görsel hem de işitsel yönleri içeren bir kişinin katkısını içeren bir anlatım. @tr
toolkit definition: Izteiksme, kas ietver personas ieguldījumu, montējot, pārkārtojot un saīsinot filmas, video vai citu kustīga attēla formātu, ietverot gan vizuālos, gan audio aspektus. @lv
toolkit definition: Udtryk, som omfatter en persons bidrag ved at sammensætte, arrangere og klippe film, video eller andre levende billedformater, inkl. både visuelle og lydmæssige aspekter. @da
toolkit definition: Väljendus, millesse isik on andnud panuse, monteerides, järjestades ja lõigates filmist, videost jm liikuvast pildist koosnevaid formaate, hõlmates nii visuaalseid kui ka heli aspekte. @et
toolkit definition: تعبيرة تتضمن إسهام شخص في تجميع فيلم، أو فيديو أو شكل آخر من أشكال الصور المتحركة وترتيبها واقتطاعها، بما في ذلك الجوانب المرئية والمسموعة. @ar
toolkit definition: 包括对影片、视频或其他动态图像格式（包括视频和音频方面）的汇编、编排和剪辑的一个个人的贡献的一种内容表达 @zh-hans
toolkit label: Person als Filmeditorin/Filmeditor von @de
toolkit label: curatore persona di opera immagine in movimento di @it
toolkit label: editor person of moving image work of @en
toolkit label: filmeditor-persoon van bewegend beeldwerk van @nl
toolkit label: filmiteose monteerija (isik) väljenduses @et
toolkit label: hareketli görüntü eserinin editörü @tr
toolkit label: ir filmas montāžas redaktors (persona) @lv
toolkit label: leikkaaja (henkilö) ekspressiossa
toolkit label: person, som er klipper af levende billedværk af @da
toolkit label: persona editora d’una obra d’imatge en moviment de @ca
toolkit label: personne monteuse d’une œuvre d’images animées de @fr
toolkit label: redaktør av verk i form av levende bilder for (person) @no
toolkit label: vágó személye a következő mozgóképműnek: @hu
toolkit label: επιμελητής φυσικό πρόσωπο του έργου κινητής εικόνας του @el
toolkit label: شخص محرر عمل صور متحركة @ar
toolkit label: ……的动态图像作品的剪辑师个人 @zh-hans
has subproperty: P50573
lexical alias: editorPersonOfMovingImageWorkOf.en
status: Published
type: Property
domain: C10004
label: er person, som er klipper af levende billedværk af @da
label: er redaktør av verk i form av levende bilder for (person) @no
label: est une personne monteuse d’une œuvre d’images animées de @fr
label: filmiteose monteerija (isik) väljenduses @et
label: hareketli görüntü eserinin editör kişisidir @tr
label: ir filmas montāžas redaktors (persona) @lv
label: is editor person of moving image work of @en
label: is filmeditor-persoon van bewegend beeldwerk van @nl
label: ist Person als Filmeditorin/Filmeditor von @de
label: vágó személye a következő mozgóképműnek: @hu
label: è curatore persona di opera immagine in movimento di @it
label: és persona editora d’una obra d’imatge en moviment de @ca
label: είναι επιμελητής φυσικό πρόσωπο του έργου κινητής εικόνας του @el
label: هو شخص محرر عمل صور متحركة لـ @ar
label: 是……的动态图像作品的剪辑师个人 @zh-hans
sub property of: leikkaaja (toimija) ekspressiossa
sub property of: esitykseen osallinen henkilö ekspressiossa
definition: Bir kişiyi, hem görsel hem de işitsel yönleri içeren film, video veya diğer hareketli görüntü formatlarını bir araya getirme, düzenleme ve kırpma konusunda bir kişinin katkısını içeren bir anlatımla ilişkilendirir. @tr
definition: Correla una persona a un'espressione che comprende un contributo di una persona per l'assemblaggio, organizzazione e taglio di film, video o altri formati di immagini in movimento, inclusi gli aspetti sia visivi sia audio. @it
definition: Hozzákapcsol egy személyt egy kifejezési formához, amely magában foglalja egy személy film, videó vagy más mozgóképformátum összeállításával, elrendezésével és vágásával járó közreműködését, beleértve mind a vizuális, mind az audió szempontokat. @hu
definition: Liittää henkilön ekspressioon, jonka tekemisessä henkilö on osallisena elokuvan, videon tai muiden elokuvaformaattien kokoamisessa, järjestämisessä ja leikkauksessa sekä kuvan että äänen osalta.
definition: Met une personne en relation avec une expression qui intègre une contribution de la part d’une personne consistant à assembler, à agencer et à découper du film, de la vidéo ou d’autres formats d’images animées, y compris les aspects visuels et sonores. @fr
definition: Relaciona una persona amb una expressió que inclou una contribució d’una persona d’aplegar, arranjar i retallar pel·lícules, vídeos i altres formats d’imatge en moviment, inclosos tant els aspectes visuals com els d’àudio. @ca
definition: Relateert een persoon aan een expressie die omvat een bijdrage door een persoon door samenstellen, arrangeren en couperen van film, video of andere bewegend beeld-vormen, inclusief zowel visuele als geluidaspecten. @nl
definition: Relaterer en person til et udtryk, som omfatter en persons bidrag ved at sammensætte, arrangere og klippe film, video eller andre levende billedformater, inkl. både visuelle og lydmæssige aspekter. @da
definition: Relaterer en person til et uttrykk som inkluderer et bidrag fra en person i form av å sette sammen, arrangere og klippe film, video eller andre formater for levende bilder, inkludert både bilde- og lydaspekter. @no
definition: Relates a person to an expression that includes a contribution by a person of assembling, arranging, and trimming film, video, or other moving image formats, including both visual and audio aspects. @en
definition: Sasaista personu ar izteiksmi, kas ietver personas ieguldījumu, montējot, pārkārtojot un saīsinot filmas, video vai citu kustīga attēla formātu, ietverot gan vizuālos, gan audio aspektus. @lv
definition: Seostab isiku väljendusega, millesse isik on andnud panuse, monteerides, järjestades ja lõigates filmist, videost jm liikuvast pildist koosnevaid formaate, hõlmates nii visuaalseid kui ka heli aspekte. @et
definition: Setzt eine Person in Beziehung zu einer Expression, zu der eine Person beiträgt, indem sie für das Zusammensetzen, Arrangieren und Nachschneiden von Film-, Video- oder anderen Bewegtbildformaten zuständig ist. Darunter fallen Video- und Audio-Eigenschaften. @de
definition: يربط شخصا بتعبيرة تتضمن إسهام شخص في تجميع فيلم، أو فيديو أو شكل آخر من أشكال الصور المتحركة وترتيبها واقتطاعها، بما في ذلك الجوانب المرئية والمسموعة. @ar
definition: 将一个个人与包括对影片、视频或其他动态图像格式（包括视频和音频方面）的汇编、编排和剪辑的一个个人的贡献的一种内容表达关联起来。 @zh-hans

ekspression haastateltava (henkilö) ekspressiossa
has element type: 2
toolkit definition: An expression that includes a contribution by a person of being interviewed, usually by a reporter or some other kind of agent who gathers information. @en
toolkit definition: Een expressie die omvat een bijdrage door een persoon door ondervraagd worden, meestal door een journalist of een andere soort actor die informatie verzamelt. @nl
toolkit definition: Egy kifejezési forma, amelyhez hozzátartozik egy személy felelőssége a válaszadásért egy interjúkészítőnek, rendszerint egy riporternek vagy más információgyűjtő ágensnek. @hu
toolkit definition: Eine Expression, zu der eine Person beiträgt, indem sie einer Interviewerin/einem Interviewer antwortet. Dabei handelt es sich normalerweise um eine Reporterin/einen Reporter oder einen anderen Akteur, der Informationen zusammenträgt. @de
toolkit definition: Ekspressio, jonka tekemisessä henkilö on osallisena vastaamalla haastattelijalle, tavallisesti toimittajalle, tai muulle tietoa keräävälle toimijalle.
toolkit definition: Espressione che comprende un contributo di una persona nell'essere intervistato, solitamente da un giornalista o altro tipo di agente che raccoglie informazioni. @it
toolkit definition: Et uttrykk som inkluderer et bidrag fra en person i form av å svare på spørsmål fra en intervjuer, reporter eller annen agent som samler inn informasjon. @no
toolkit definition: Expression qui intègre une contribution de la part d’une personne consistant à être interviewé, habituellement par un reporteur ou un autre type d’agent recueillant de l’information. @fr
toolkit definition: Expressió que inclou una contribució d’una persona essent entrevistat, habitualment per un periodista o qualsevol altre tipus d’agent que recull la informació. @ca
toolkit definition: Genellikle bir muhabir veya bilgi toplayan başka bir tür temsilci tarafından röportaj yapılmasına bir kişinin katkıda bulunmasını içeren bir anlatım. @tr
toolkit definition: Izteiksme, kas ietver personas ieguldījumu, atbildot uz intervētāja, parasti reportiera, aptaujas organizētāja vai kāda cita informācijas apkopotāja jautājumiem. @lv
toolkit definition: Udtryk, som omfatter en persons bidrag ved at besvare spørgsmål fra en interviewer, normalt en journalist eller en anden form for agent, som indsamler information. @da
toolkit definition: Väljendus, millesse isik on andnud panuse, vastates intervjueerijale, reporterile või muule infot koguvale tegijale. @et
toolkit definition: تعبيرة تتضمن إسهام شخص يكون ضيف مقابلة عادةً مع مراسل أو وكيل من نوع آخر يجمع معلومات. @ar
toolkit definition: 包括一个被采访（通常由记者或其他某种信息收集的行为者）的一个个人的贡献的一种内容表达 @zh-hans
toolkit label: Person als Interviewte/Interviewter einer Expression von @de
toolkit label: anlatımının görüşülen kişisidir @tr
toolkit label: ekspression haastateltava (henkilö) ekspressiossa
toolkit label: geïnterviewde persoon van expressie van @nl
toolkit label: interjúalany személye a következő kifejezési formának: @hu
toolkit label: interviewee person of expression of @en
toolkit label: intervistato persona di espressione di @it
toolkit label: intervjueeritav (isik) väljenduses @et
toolkit label: intervjuobjekt for uttrykk for (person) @no
toolkit label: ir intervējamais (persona) izteiksmē @lv
toolkit label: person, som er interviewperson for udtryk af @da
toolkit label: persona entrevistada d’una expressió de @ca
toolkit label: personne interviewée d’une expression de @fr
toolkit label: συνεντευξιαζόμενος φυσικό πρόσωπο της έκφρασης του @el
toolkit label: شخص ضيف مقابلة في تعبيرة @ar
toolkit label: ……的内容表达的受访者个人 @zh-hans
has subproperty: P50574
lexical alias: intervieweePersonOfExpressionOf.en
status: Published
type: Property
domain: C10004
label: anlatımının görüşülen kişisidir @tr
label: er intervjuobjekt for uttrykk for (person) @no
label: er person, som er interviewperson for udtryk af @da
label: est une personne interviewée d’une expression de @fr
label: interjúalany személye a következő kifejezési formának: @hu
label: intervjueeritav (isik) väljenduses @et
label: ir intervējamais (persona) izteiksmē @lv
label: is geïnterviewde persoon van expressie van @nl
label: is interviewee person of expression of @en
label: ist Person als Interviewte/Interviewter einer Expression von @de
label: è intervistato persona di espressione di @it
label: és persona entrevistada d’una expressió de @ca
label: είναι συνεντευξιαζόμενος φυσικό πρόσωπο της έκφρασης του @el
label: هو شخص ضيف مقابلة في تعبيرة @ar
label: 是……的内容表达的受访者个人 @zh-hans
sub property of: ekspression haastateltava (toimija) ekspressiossa
sub property of: esitykseen osallinen henkilö ekspressiossa
definition: Bir kişiyi, genellikle bir muhabir veya bilgi toplayan başka bir tür temsilci tarafından, röportaj yapılan bir kişinin katkısını içeren bir anlatımla ilişkilendirir. @tr
definition: Correla una persona a un'espressione che comprende un contributo di una persona nell'essere intervistato, solitamente da un giornalista o altro tipo di agente che raccoglie informazioni. @it
definition: Hozzákapcsol egy személyt egy kifejezési formához, amelyhez hozzátartozik egy személy felelőssége a válaszadásért egy interjúkészítőnek, rendszerint egy riporternek vagy más információgyűjtő ágensnek. @hu
definition: Liittää henkilön ekspressioon, jonka tekemisessä henkilö on osallisena vastaamalla haastattelijalle, tavallisesti toimittajalle, tai muulle tietoa keräävälle toimijalle.
definition: Met une personne en relation avec une expression qui intègre une contribution de la part d’une personne consistant à être interviewé, habituellement par un reporteur ou un autre type d’agent recueillant de l’information. @fr
definition: Relaciona una persona amb una expressió que inclou una contribució d’una persona essent entrevistat, habitualment per un periodista o qualsevol altre tipus d’agent que recull la informació. @ca
definition: Relateert een persoon aan een expressie die omvat een bijdrage door een persoon door ondervraagd worden, meestal door een journalist of een andere soort actor die informatie verzamelt. @nl
definition: Relaterer en person til et udtryk, som omfatter en persons bidrag ved at besvare spørgsmål fra en interviewer, normalt en journalist eller en anden form for agent, som indsamler information. @da
definition: Relaterer en person til et uttrykk som inkluderer et bidrag fra en person i form av å svare på spørsmål fra en intervjuer, reporter eller annen agent som samler inn informasjon. @no
definition: Relates a person to an expression that includes a contribution by a person of being interviewed, usually by a reporter or some other kind of agent who gathers information. @en
definition: Sasaista personu ar izteiksmi, kas ietver personas ieguldījumu, atbildot uz intervētāja, parasti reportiera, aptaujas organizētāja vai kāda cita informācijas apkopotāja jautājumiem. @lv
definition: Seostab isiku väljendusega, millesse isik on andnud panuse, vastates intervjueerijale, reporterile või muule infot koguvale tegijale. @et
definition: Setzt eine Person in Beziehung zu einer Expression, zu der eine Person beiträgt, indem sie einer Interviewerin/einem Interviewer antwortet. Dabei handelt es sich normalerweise um eine Reporterin/einen Reporter oder einen anderen Akteur, der Informationen zusammenträgt. @de
definition: يربط شخصا بتعبيرة تتضمن إسهام شخص يكون ضيف مقابلة عادةً مع مراسل أو وكيل من نوع آخر يجمع معلومات. @ar
definition: 将一个个人与包括一个被采访（通常由记者或其他某种信息收集的行为者）的一个个人的贡献的一种内容表达关联起来。 @zh-hans

kapellimestari (henkilö) ekspressiossa
has element type: 2
toolkit definition: An expression that includes a contribution by a person of conducting and leading an instrumental performing group in a musical or dramatic presentation. @en
toolkit definition: Een expressie die omvat een bijdrage door een persoon van dirigeren en leiden van een instrumentaal optredende groep in een muziek- of dramapresentatie. @nl
toolkit definition: Egy kifejezési forma, amely magában foglalja egy zenei vagy drámai bemutatóban hangszeres előadói csoportot vezénylő és vezető személy közreműködését. @hu
toolkit definition: Eine Expression, zu der eine Person beiträgt, indem sie eine Instrumentalgruppe in einer musikalischen oder dramatischen Darbietung leitet. @de
toolkit definition: Ekspressio, jonka tekemisessä henkilö on osallisena johtamalla soitinryhmää musiikki- tai näytelmäesityksessä tms.
toolkit definition: Espressione che comprende un contributo di una persona nella direzione e conduzione di un gruppo di esecuzione strumentale in una presentazione musicale o drammatica. @it
toolkit definition: Et uttrykk som inkluderer et bidrag fra en person i form av direksjon og ledelse av en instrumentalgruppe i en musikalsk eller dramatisk forestilling. @no
toolkit definition: Expression qui intègre une contribution de la part d’une personne consistant à diriger un groupe d’instrumentistes dans une présentation musicale ou dramatique. @fr
toolkit definition: Expressió que inclou una contribució d’una persona dirigint un grup instrumental en una representació musical o dramàtica. @ca
toolkit definition: Izteiksme, kas ietver personas ieguldījumu, diriģējot un vadot orķestri muzikālā vai dramatiskā uzvedumā. @lv
toolkit definition: Müzikal veya dramatik bir sunumda enstrümantal bir performans grubunu yöneten ve yönlendiren bir kişinin katkısını içeren bir anlatım. @tr
toolkit definition: Udtryk, som omfatter en persons bidrag ved at lede en optrædende instrumentalgruppe i en musikalsk eller dramatisk præsentation. @da
toolkit definition: Väljendus, millesse isik on andnud panuse, juhatades instrumentaalkoosseisu muusika- või draamaetenduses. @et
toolkit definition: تعبيرة تتضمن إسهام شخص في إدارة فرقة عزف وقيادتها في عرض موسيقي أو درامي. @ar
toolkit definition: 包括在音乐或戏剧呈现中指挥并领导一个器乐表演团体的一个个人的贡献的一种内容表达 @zh-hans
toolkit label: Person als Orchesterleiterin/Orchesterleiter von @de
toolkit label: direttore d'orchestra persona di @it
toolkit label: enstrüman şefi kişisidir @tr
toolkit label: instrumentaal dirigent-persoon van @nl
toolkit label: instrumental conductor person of @en
toolkit label: instrumentaldirigent for (person) @no
toolkit label: ir orķestra diriģents (persona) @lv
toolkit label: kapellimestari (henkilö) ekspressiossa
toolkit label: orkestrijuht (isik) väljenduses @et
toolkit label: person, som er instrumentaldirigent af @da
toolkit label: persona directora instrumental de @ca
toolkit label: personne chef d’orchestre de @fr
toolkit label: zenekari karmester személye: @hu
toolkit label: διευθυντής ορχήστρας φυσικό πρόσωπο του @el
toolkit label: شخص قائد فرقة آلات عزف @ar
toolkit label: ……的器乐指挥个人 @zh-hans
has subproperty: P50575
lexical alias: instrumentalConductorPersonOf.en
status: Published
type: Property
domain: C10004
label: enstrüman şefi kişisidir @tr
label: er instrumentaldirigent for (person) @no
label: er person, som er instrumentaldirigent af @da
label: est une personne chef d’orchestre de @fr
label: ir orķestra diriģents (persona) @lv
label: is instrumentaal dirigent-persoon van @nl
label: is instrumental conductor person of @en
label: ist Person als Orchesterleiterin/Orchesterleiter von @de
label: orkestrijuht (isik) väljenduses @et
label: zenekari karmester személye a következőnek: @hu
label: è direttore d'orchestra persona di @it
label: és persona directora instrumental de @ca
label: είναι διευθυντής ορχήστρας φυσικό πρόσωπο του @el
label: هو شخص قائد فرقة عزف لـ @ar
label: 是……的器乐指挥个人 @zh-hans
sub property of: kapellimestari (toimija) ekspressiossa
sub property of: johtaja (henkilö) ekspressiossa
definition: Bir kişiyi, müzikal veya dramatik bir sunumda enstrümantal bir performans grubunu yöneten ve yönlendiren bir kişinin katkısını içeren bir anlatımla ilişkilendirir. @tr
definition: Correla una persona a un'espressione che comprende un contributo di una persona nella direzione e conduzione di un gruppo di esecuzione strumentale in una presentazione musicale o drammatica. @it
definition: Hozzákapcsol egy személyt egy kifejezési formához, amely magában foglalja egy zenei vagy drámai bemutatóban hangszeres előadói csoportot vezénylő és vezető személy közreműködését. @hu
definition: Liittää henkilön ekspressioon, jonka tekemisessä henkilö on osallisena johtamalla soitinryhmää musiikki- tai näytelmäesityksessä tms.
definition: Met une personne en relation avec une expression qui intègre une contribution de la part d’une personne consistant à diriger un groupe d’instrumentistes dans une présentation musicale ou dramatique. @fr
definition: Relaciona una persona amb una expressió que inclou una contribució d’una persona dirigint un grup instrumental en una representació musical o dramàtica. @ca
definition: Relateert een persoon aan een expressie die omvat een bijdrage door een persoon van dirigeren en leiden van een instrumentaal optredende groep in een muziek- of dramapresentatie. @nl
definition: Relaterer en person til et udtryk, som omfatter en persons bidrag ved at lede en optrædende instrumentalgruppe i en musikalsk eller dramatisk præsentation. @da
definition: Relaterer en person til et uttrykk som inkluderer et bidrag fra en person i form av direksjon og ledelse av en instrumentalgruppe i en musikalsk eller dramatisk forestilling. @no
definition: Relates a person to an expression that includes a contribution by a person of conducting and leading an instrumental performing group in a musical or dramatic presentation. @en
definition: Sasaista personu ar izteiksmi, kas ietver personas ieguldījumu, diriģējot un vadot orķestri muzikālā vai dramatiskā uzvedumā. @lv
definition: Seostab isiku väljendusega, millesse isik on andnud panuse, juhatades instrumentaalkoosseisu muusika- või draamaetenduses. @et
definition: Setzt eine Person in Beziehung zu einer Expression, zu der eine Person beiträgt, indem sie eine Instrumentalgruppe in einer musikalischen oder dramatischen Darbietung leitet. @de
definition: يربط شخصا بتعبيرة تتضمن إسهام شخص في إدارة فرقة عزف وقيادتها في عرض موسيقي أو درامي. @ar
definition: 将一个个人与包括在音乐或戏剧呈现中指挥并领导一个器乐表演团体的一个个人的贡献的一种内容表达关联起来。 @zh-hans

musiikillinen johtaja (henkilö) ekspressiossa
has element type: 2
toolkit definition: An expression that includes a contribution by a person of coordinating the activities of composers, sound editors, and sound mixers for a moving image production or for a musical or dramatic presentation or entertainment. @en
toolkit definition: Een expressie die omvat een bijdrage van een persoon in het coördineren van de activiteiten van componisten, geluidseditors en geluidsmixers voor een bewegend beeld-productie of in een muziek- of dramapresentatie of vermaak. @nl
toolkit definition: Egy kifejezési forma, amely magában foglalja egy személy közreműködését zeneszerzők, hangszerkesztők és hangkeverők feladatainak összehangolásában mozgókép-produkcióban, zenei vagy drámai előadásban vagy szórakoztató műsorban. @hu
toolkit definition: Eine Expression, zu der eine Person beiträgt, indem sie die Arbeit der Komponistin/des Komponisten, der Tonbearbeiterin/des Tonbearbeiters und der Tonmeisterin/des Tonmeisters für eine Bewegtbildproduktion oder eine musikalische oder dramatische Darbietung oder Aufführung koordiniert. @de
toolkit definition: Ekspressio, jonka tekemisessä henkilö on osallisena koordinoimalla säveltäjien, äänileikkaajien ja äänimiksaajien toimintaa elokuvatuotannossa tai musiikki- tai näytelmäesityksessä.
toolkit definition: Espressione che comprende un contributo di una persona nel coordinamento delle attività di compositori, curatori del suono e addetti al missaggio per una produzione di immagini in movimento o per una presentazione o spettacolo musicale o drammatico. @it
toolkit definition: Et uttrykk som inkluderer et bidrag fra en person i form av koordinasjon av aktivitetene til komponist, lydtekniker og lydmiksere for en produksjon med levende bilder eller en musikalsk eller dramatisk forestilling eller annen form for underholdning. @no
toolkit definition: Expression qui intègre une contribution de la part d’une personne consistant à coordonner les activités des compositeurs, des monteurs son et des mixeurs de son pour une production d’images animées ou bien pour une présentation ou un spectacle musical ou dramatique. @fr
toolkit definition: Expressió que inclou una contribució d’una persona amb la coordinació de les activitats de compositors, editors de so i mescladors de so en el cas d’una producció d’imatge en moviment o d’una representació o un espectacle musical o dramàtic. @ca
toolkit definition: Hareketli bir görüntü prodüksiyonu veya müzikal ya da dramatik bir sunum veya eğlence için bestecilerin, ses editörlerinin ve ses mikserlerinin faaliyetlerini koordine eden bir kişinin katkısını içeren bir anlatım. @tr
toolkit definition: Izteiksme, kas ietver personas ieguldījumu, koordinējot komponista, skaņu redaktora un skaņas miksētāja kustīga attēla izveidi, mūzikāla vai dramatiska darba prezentācijā vai izklaidē. @lv
toolkit definition: Udtryk, som omfatter en persons bidrag ved at koordinere komponister, tonemestre og lydmixeres aktiviteter til en levende billedproduktion eller en musikalsk eller dramatisk præsentation eller underholdning. @da
toolkit definition: Väljendus, millesse isik on andnud panuse, koordineerides heliloojate, helimonteerijate ja helimiksijate tegevust filmi tootmise, muusika- või draamaetenduse või meelelahutusürituse jaoks. @et
toolkit definition: تعبيرة تتضمن إسهام شخص في تنسيق أنشطة ملحنين؛ ومحرري؛ و مازجي الصوت لإنتاج فيلم؛ أو لعرض موسيقي أو درامي أو ترفيهي. @ar
toolkit definition: 包括为动态图像制作或者为音乐或戏剧呈现或娱乐协调作曲者、音响编辑、音响师的一个个人的贡献的一种内容表达 @zh-hans
toolkit label: Person als Musikalische Leiterin/Musikalischer Leiter von @de
toolkit label: direttore musicale persona di @it
toolkit label: ir muzikālais vadītājs (persona) @lv
toolkit label: musical director person of @en
toolkit label: musiikillinen johtaja (henkilö) ekspressiossa
toolkit label: musikalregissør for (person) @no
toolkit label: muusikajuht (isik) väljenduses @et
toolkit label: muzikaal director-persoon van @nl
toolkit label: müzikal yönetmeni @tr
toolkit label: person, som er musikdirektør af @da
toolkit label: persona directora musical de @ca
toolkit label: personne directrice musicale de @fr
toolkit label: zenei rendező személye: @hu
toolkit label: μουσικός διευθυντής φυσικό πρόσωπο του @el
toolkit label: شخص مدير موسيقي @ar
toolkit label: ……的音乐总监个人 @zh-hans
has subproperty: P50576
lexical alias: musicalDirectorPersonOf.en
status: Published
type: Property
domain: C10004
label: er musikalregissør for (person) @no
label: er person, som er musikdirektør af @da
label: est une personne directrice musicale de @fr
label: ir muzikālais vadītājs (persona) @lv
label: is musical director person of @en
label: is muzikaal director-persoon van @nl
label: ist Person als Musikalische Leiterin/Musikalischer Leiter von @de
label: muusikajuht (isik) väljenduses @et
label: müzik yönetmeni kişisidir @tr
label: zenei rendező személye a következőnek: @hu
label: è direttore musicale persona di @it
label: és persona directora musical de @ca
label: είναι μουσικός διευθυντής φυσικό πρόσωπο του @el
label: هو شخص مدير موسيقي لـ @ar
label: 是……的音乐总监个人 @zh-hans
sub property of: musiikillinen johtaja (toimija) ekspressiossa
sub property of: esitykseen osallinen henkilö ekspressiossa
definition: Bir kişiyi, hareketli bir görüntü prodüksiyonu veya müzikal ya da dramatik bir sunum veya gösteri için bestecilerin, ses editörlerinin ve ses miksajcılarının faaliyetlerini koordine eden bir kişinin katkısını içeren bir anlatımla ilişkilendirir. @tr
definition: Correla una persona a un'espressione che comprende un contributo di una persona nel coordinamento delle attività di compositori, curatori del suono e addetti al missaggio per una produzione di immagini in movimento o per una presentazione o spettacolo musicale o drammatico. @it
definition: Hozzákapcsol egy személyt egy kifejezési formához, amely magában foglalja egy személy közreműködését zeneszerzők, hangszerkesztők és hangkeverők feladatainak összehangolásában mozgókép-produkcióban, zenei vagy drámai előadásban vagy szórakoztató műsorban. @hu
definition: Liittää henkilön ekspressioon, jonka tekemisessä henkilö on osallisena koordinoimalla säveltäjien, äänileikkaajien ja äänimiksaajien toimintaa elokuvatuotannossa tai musiikki- tai näytelmäesityksessä.
definition: Met une personne en relation avec une expression qui intègre une contribution de la part d’une personne consistant à coordonner les activités des compositeurs, des monteurs son et des mixeurs de son pour une production d’images animées ou bien pour une présentation ou un spectacle musical ou dramatique. @fr
definition: Relaciona una persona amb una expressió que inclou una contribució d’una persona en la coordinació de les activitats de compositors, editors de so i mescladors de so en el cas d’una producció d’imatge en moviment o d’una representació o un espectacle musical o dramàtic. @ca
definition: Relateert een persoon aan een expressie die omvat een bijdrage van een persoon in het coördineren van de activiteiten van componisten, geluidseditors en geluidsmixers voor een bewegend beeld-productie of in een muziek- of dramapresentatie of vermaak. @nl
definition: Relaterer en person til et udtryk, som omfatter en persons bidrag ved at koordinere komponister, tonemestre og lydmixeres aktiviteter til en levende billedproduktion eller en musikalsk eller dramatisk præsentation eller underholdning. @da
definition: Relaterer en person til et uttrykk som inkluderer et bidrag fra en person i form av koordinasjon av aktivitetene til komponist, lydtekniker og lydmiksere for en produksjon med levende bilder eller en musikalsk eller dramatisk forestilling eller annen form for underholdning. @no
definition: Relates a person to an expression that includes a contribution by a person of coordinating the activities of composers, sound editors, and sound mixers for a moving image production or for a musical or dramatic presentation or entertainment. @en
definition: Sasaista personu ar izteiksmi, kas ietver personas ieguldījumu, koordinējot komponista, skaņu redaktora un skaņas miksētāja kustīga attēla izveidi, mūzikāla vai dramatiska darba prezentācijā vai izklaidē. @lv
definition: Seostab isiku väljendusega, millesse isik on andnud panuse, koordineerides heliloojate, helimonteerijate ja helimiksijate tegevust filmi tootmise, muusika- või draamaetenduse või meelelahutusürituse jaoks. @et
definition: Setzt eine Person in Beziehung zu einer Expression, zu der eine Person beiträgt, indem sie die Arbeit der Komponistin/des Komponisten, der Tonbearbeiterin/des Tonbearbeiters und der Tonmeisterin/des Tonmeisters für eine Bewegtbildproduktion oder eine musikalische oder dramatische Darbietung oder Aufführung koordiniert. @de
definition: يربط شخصا بتعبيرة تتضمن إسهام شخص في تنسيق أنشطة الملحنين؛ ومحرري الصوت؛ ومازجي الصوت لإنتاج فيلم؛ أو لعرض موسيقي أو درامي أو ترفيهي. @ar
definition: 将一个个人与包括为动态图像制作或者为音乐或戏剧呈现或娱乐协调作曲者、音响编辑、音响师的一个个人的贡献的一种内容表达关联起来。 @zh-hans

tanssija (henkilö) ekspressiossa
has element type: 2
toolkit definition: An expression that includes a contribution by a person of dancing in a musical or dramatic presentation. @en
toolkit definition: Een expressie die omvat een bijdrage van een persoon door het dansen in een muziek- of dramapresentatie. @nl
toolkit definition: Egy kifejezési forma, amely magában foglalja egy zenei vagy drámai bemutatóban táncoló személy közreműködését. @hu
toolkit definition: Eine Expression, zu der eine Person beiträgt, indem sie in einer musikalischen oder dramatischen Darbietung tanzt. @de
toolkit definition: Ekspressio, jonka tekemisessä henkilö on osallisena tanssimalla musiikki- tai näyttämöesityksessä.
toolkit definition: Espressione che comprende un contributo di una persona nella danza in una presentazione musicale o drammatica. @it
toolkit definition: Et uttrykk som inkluderer et bidrag fra en person i form av dansing i en musikalsk eller dramatisk forestilling. @no
toolkit definition: Expression qui intègre une contribution de la part d’une personne consistant à danser dans une présentation musicale ou dramatique. @fr
toolkit definition: Expressió que inclou una contribució d’una persona dansant en una representació musical o dramàtica. @ca
toolkit definition: Izteiksme, kas ietver personas ieguldījumu, dejojot muzikālā vai dramatiskā uzvedumā. @lv
toolkit definition: Müzikal veya dramatik bir sunumda dans eden bir kişinin katkısını içeren bir anlatım. @tr
toolkit definition: Udtryk, som omfatter en persons bidrag ved at danse i en musikalsk eller dramatisk præsentation. @da
toolkit definition: Väljendus, millesse isik on andnud panuse, tantsides muusika- või draamaetenduses. @et
toolkit definition: تعبيرة تتضمن إسهام شخص بالرقص في عرض موسيقي أو درامي. @ar
toolkit definition: 包括在音乐或戏剧呈现中的一个舞蹈个人的贡献的一种内容表达 @zh-hans
toolkit label: Person als Tänzerin/Tänzer von @de
toolkit label: ballerino persona di @it
toolkit label: dancer person of @en
toolkit label: danser for (person) @no
toolkit label: danser-persoon van @nl
toolkit label: dansçı @tr
toolkit label: ir dejotājs (persona) @lv
toolkit label: person, som er danser af @da
toolkit label: persona ballarina de @ca
toolkit label: personne danseuse de @fr
toolkit label: tanssija (henkilö) ekspressiossa
toolkit label: tantsija (isik) väljenduses @et
toolkit label: táncos személye: @hu
toolkit label: χορευτής φυσικό πρόσωπο του @el
toolkit label: شخص راقص @ar
toolkit label: ……的舞蹈者个人 @zh-hans
has subproperty: P50577
lexical alias: dancerPersonOf.en
status: Published
type: Property
domain: C10004
label: dansçı kişisidir @tr
label: er danser for (person) @no
label: er person, som er danser af @da
label: est une personne danseuse de @fr
label: ir dejotājs (persona) @lv
label: is dancer person of @en
label: is danser-persoon van @nl
label: ist Person als Tänzerin/Tänzer von @de
label: tantsija (isik) väljenduses @et
label: táncos személye a következőnek: @hu
label: è ballerino persona di @it
label: és persona ballarina de @ca
label: είναι χορευτής φυσικό πρόσωπο του @el
label: هو شخص راقص لـ @ar
label: 是……的舞蹈者个人 @zh-hans
sub property of: tanssija (toimija) ekspressiossa
sub property of: esittäjä (henkilö) ekspressiossa
definition: Bir kişiyi, müzikal veya dramatik bir sunumda dans eden bir kişinin katkısını içeren bir anlatımla ilişkilendirir. @tr
definition: Correla una persona a un'espressione che comprende un contributo di una persona nella danza in una presentazione musicale o drammatica. @it
definition: Hozzákapcsol egy személyt egy kifejezési formához, amely magában foglalja egy zenei vagy drámai bemutatóban táncoló személy közreműködését. @hu
definition: Liittää henkilön ekspressioon, jonka tekemisessä henkilö on osallisena tanssimalla musiikki- tai näyttämöesityksessä.
definition: Met une personne en relation avec une expression qui intègre une contribution de la part d’une personne consistant à danser dans une présentation musicale ou dramatique. @fr
definition: Relaciona una persona amb una expressió que inclou una contribució d’una persona dansant en una representació musical o dramàtica. @ca
definition: Relateert een persoon aan een expressie die omvat een bijdrage van een persoon door het dansen in een muziek- of dramapresentatie. @nl
definition: Relaterer en person til et udtryk, som omfatter en persons bidrag ved at danse i en musikalsk eller dramatisk præsentation. @da
definition: Relaterer en person til et uttrykk som inkluderer et bidrag fra en person i form av dansing i en musikalsk eller dramatisk forestilling. @no
definition: Relates a person to an expression that includes a contribution by a person of dancing in a musical or dramatic presentation. @en
definition: Sasaista personu ar izteiksmi, kas ietver personas ieguldījumu, dejojot muzikālā vai dramatiskā uzvedumā. @lv
definition: Seostab isiku väljendusega, millesse isik on andnud panuse, tantsides muusika- või draamaetenduses. @et
definition: Setzt eine Person in Beziehung zu einer Expression, zu der eine Person beiträgt, indem sie in einer musikalischen oder dramatischen Darbietung tanzt. @de
definition: يربط شخصا بتعبيرة تتضمن إسهام شخص بالرقص في عرض موسيقي أو درامي. @ar
definition: 将一个个人与包括在音乐或戏剧呈现中的一个舞蹈个人的贡献的一种内容表达关联起来。 @zh-hans

äänisuunnittelija (henkilö) ekspressiossa
has element type: 2
toolkit definition: An expression that includes a contribution by a person of designing and creating audio or sound components. @en
toolkit definition: Een expressie die omvat een bijdrage door een persoon door ontwerpen en creëren van audio- en geluidseffecten. @nl
toolkit definition: Egy kifejezési forma, amely magában foglalja egy személy közreműködését audio- vagy hangösszetevők tervezésében és létrehozásában. @hu
toolkit definition: Eine Expression, zu der eine Person beiträgt, indem sie Tonelemente entwirft und erstellt. @de
toolkit definition: Ekspressio, jossa henkilö on osallisena suunnittelemalla ja luomalla äänikomponentteja.
toolkit definition: Espressione che comprende un contributo di una persona per la progettazione e creazione di componenti audio o sonori. @it
toolkit definition: Et uttrykk som inkluderer et bidrag fra en person i form av å utforme og skape lydkomponenter. @no
toolkit definition: Expression qui intègre une contribution de la part d’une personne consistant à concevoir et à créer des effets audio ou sonores. @fr
toolkit definition: Expressió que inclou una contribució d’una persona en el disseny i la creació de components àudio o sonors. @ca
toolkit definition: Izteiksme, kas ietver personas ieguldījumu, izstrādājot un radot audio vai skaņas komponentus. @lv
toolkit definition: Ses veya ses bileşenleri tasarlayan ve yaratan bir kişinin katkısını içeren bir anlatım. @tr
toolkit definition: Udtryk, som omfatter en persons bidrag ved at designe og skabe audio- eller lyddele. @da
toolkit definition: Väljendus, millesse isik on andnud panuse, kavandades ja luues selle helikomponendid. @et
toolkit definition: تعبيرة تتضمن إسهام شخص في تصميم عناصر سمعية أو صوتية وإنشائها. @ar
toolkit definition: 包括设计并创作音频或音响组成部分的一个个人的贡献的一种内容表达 @zh-hans
toolkit label: Person als Tongestalterin/Tongestalter von @de
toolkit label: geluidsontwerper-persoon van @nl
toolkit label: hangtervező személye: @hu
toolkit label: helikujundaja (isik) väljenduses @et
toolkit label: ir skaņu mākslinieks (persona) @lv
toolkit label: lyddesigner for (person) @no
toolkit label: person, som er lyddesigner af @da
toolkit label: persona dissenyadora de so de @ca
toolkit label: personne conceptrice sonore de @fr
toolkit label: progettista del suono persona di @it
toolkit label: ses tasarımcısı kişi @tr
toolkit label: sound designer person of @en
toolkit label: äänisuunnittelija (henkilö) ekspressiossa
toolkit label: σχεδιαστής ήχου φυσικό πρόσωπο του @el
toolkit label: شخص مصمم صوت @ar
toolkit label: ……的音响设计者个人 @zh-hans
has subproperty: P50578
lexical alias: soundDesignerPersonOf.en
status: Published
type: Property
domain: C10004
label: Ses tasarımcısıdır @tr
label: er lyddesigner for (person) @no
label: er person, som er lyddesigner af @da
label: est une personne conceptrice sonore de @fr
label: hangtervező személye a következőnek: @hu
label: helikujundaja (isik) väljenduses @et
label: ir skaņu mākslinieks (persona) @lv
label: is geluidsontwerper-persoon van @nl
label: is sound designer person of @en
label: ist Person als Tongestalterin/Tongestalter von @de
label: è progettista del suono persona di @it
label: és persona dissenyadora de so de @ca
label: είναι σχεδιαστής ήχου φυσικό πρόσωπο του @el
label: هو شخص مصمم صوت لـ @ar
label: 是……的音响设计者个人 @zh-hans
sub property of: äänisuunnittelija (toimija) ekspressiossa
sub property of: esitykseen osallinen henkilö ekspressiossa
definition: Bir kişiyi, bir kişinin ses veya ses bileşenleri tasarlama ve oluşturma katkısını içeren bir anlatımla ilişkilendirir. @tr
definition: Correla una persona a un'espressione che comprende un contributo di una persona per la progettazione e creazione di componenti audio o sonori. @it
definition: Hozzákapcsol egy személyt egy kifejezési formához, amely magában foglalja egy személy közreműködését audio- vagy hangösszetevők tervezésében és létrehozásában. @hu
definition: Liittää henkilön ekspressioon, jossa henkilö on osallisena suunnittelemalla ja luomalla äänikomponentteja.
definition: Met une personne en relation avec une expression qui intègre une contribution de la part d’une personne consistant à concevoir et à créer des effets audio ou sonores. @fr
definition: Relaciona una persona amb una expressió que inclou una contribució d’una persona en el disseny i la creació de components àudio o sonors. @ca
definition: Relateert een persoon aan een expressie die omvat een bijdrage door een persoon door ontwerpen en creëren van audio- en geluidseffecten. @nl
definition: Relaterer en person til et udtryk, som omfatter en persons bidrag ved at designe og skabe audio- eller lyddele. @da
definition: Relaterer en person til et uttrykk som inkluderer et bidrag fra en person i form av å utforme og skape lydkomponenter. @no
definition: Relates a person to an expression that includes a contribution by a person of designing and creating audio or sound components. @en
definition: Sasaista personu ar izteiksmi, kas ietver personas ieguldījumu, izstrādājot un radot audio vai skaņas komponentus. @lv
definition: Seostab isiku väljendusega, millesse isik on andnud panuse, kavandades ja luues selle helikomponendid. @et
definition: Setzt eine Person in Beziehung zu einer Expression, zu der eine Person beiträgt, indem sie Tonelemente entwirft und erstellt. @de
definition: يربط شخصا بتعبيرة تتضمن إسهام شخص في تصميم عناصر سمعية أو صوتية وإنشائها. @ar
definition: 将一个个人与包括设计并创作音频或音响组成部分的一个个人的贡献的一种内容表达关联起来。 @zh-hans

valosuunnittelija (henkilö) ekspressiossa
has element type: 2
toolkit definition: An expression that includes a contribution by a person of designing and creating lighting components. @en
toolkit definition: Aydınlatma bileşenleri tasarlayan ve yaratan bir kişinin katkısını içeren bir anlatım. @tr
toolkit definition: Een expressie die omvat een bijdrage door een persoon door ontwerpen en creëren van lichteffecten. @nl
toolkit definition: Egy kifejezési forma, amely magában foglalja egy személy közreműködését világítási összetevők tervezésében és létrehozásában. @hu
toolkit definition: Eine Expression, zu der eine Person beiträgt, indem sie Lichtelemente entwirft und erstellt. @de
toolkit definition: Ekspressio, jossa henkilö on osallisena suunnittelemalla ja luomalla valokomponentteja.
toolkit definition: Espressione che comprende un contributo di una persona nella progettazione e creazione di componenti per l'illuminazione. @it
toolkit definition: Et uttrykk som inkluderer et bidrag fra en person i form av å utforme og skape lyssettingskomponenter. @no
toolkit definition: Expression qui intègre une contribution de la part d’une personne consistant à concevoir et à créer des effets de lumière. @fr
toolkit definition: Expressió que inclou una contribució d’una persona en el disseny i creació de components luminotècnics. @ca
toolkit definition: Izteiksme, kas ietver personas ieguldījumu, izstrādājot un radot apgaismojuma efektus. @lv
toolkit definition: Udtryk, som omfatter en persons bidrag ved at designe og skabe belysningsdele. @da
toolkit definition: Väljendus, millesse isik on andnud panuse, kavandades ja luues selle valguskomponendid. @et
toolkit definition: تعبيرة تتضمن إسهام شخص في تصميم عناصرالإضاءة وإنشائها. @ar
toolkit definition: 包括设计并创作灯光组成部分的一个个人的贡献的一种内容表达 @zh-hans
toolkit label: Işık tasarımcısı kişisi @tr
toolkit label: Person als Lichtgestalterin/Lichtgestalter von @de
toolkit label: ir gaismu mākslinieks (persona) @lv
toolkit label: lichtontwerper-persoon van @nl
toolkit label: lighting designer person of @en
toolkit label: lysdesigner for (person) @no
toolkit label: person, som er belysningsdesigner af @da
toolkit label: persona dissenyadora d’il·luminació de @ca
toolkit label: personne éclairagiste de @fr
toolkit label: progettista dell'illuminazione persona di @it
toolkit label: valguskujundaja (isik) väljenduses @et
toolkit label: valosuunnittelija (henkilö) ekspressiossa
toolkit label: világítástervező személye: @hu
toolkit label: σχεδιαστής φωτισμού φυσικό πρόσωπο του @el
toolkit label: شخص مصمم إضاءة @ar
toolkit label: ……的灯光设计者个人 @zh-hans
has subproperty: P50579
lexical alias: lightingDesignerPersonOf.en
status: Published
type: Property
domain: C10004
label: er lysdesigner for (person) @no
label: er person, som er belysningsdesigner af @da
label: est une personne éclairagiste de @fr
label: ir gaismu mākslinieks (persona) @lv
label: is lichtontwerper-persoon van @nl
label: is lighting designer person of @en
label: ist Person als Lichtgestalterin/Lichtgestalter von @de
label: valguskujundaja (isik) väljenduses @et
label: világítástervező személye a következőnek: @hu
label: è progettista dell'illuminazione persona di @it
label: és persona dissenyadora d’il·luminació de @ca
label: ışık tasarımcısı kişisidir @tr
label: είναι σχεδιαστής φωτισμού φυσικό πρόσωπο του @el
label: هو شخص مصمم إضاءة لـ @ar
label: 是……的灯光设计者个人 @zh-hans
sub property of: valosuunnittelija (toimija) ekspressiossa
sub property of: esitykseen osallinen henkilö ekspressiossa
definition: Bir kişiyi, bir kişinin aydınlatma bileşenleri tasarlama ve oluşturma katkısını içeren bir anlatımla ilişkilendirir. @tr
definition: Correla una persona a un'espressione che comprende un contributo di una persona nella progettazione e creazione di componenti per l'illuminazione. @it
definition: Hozzákapcsol egy személyt egy kifejezési formához, amely magában foglalja egy személy közreműködését világítási összetevők tervezésében és létrehozásában. @hu
definition: Liittää henkilön ekspressioon, jossa henkilö on osallisena suunnittelemalla ja luomalla valokomponentteja.
definition: Met une personne en relation avec une expression qui intègre une contribution de la part d’une personne consistant à concevoir et à créer des effets de lumière. @fr
definition: Relaciona una persona amb una expressió que inclou una contribució d’una persona en el disseny i creació de components luminotècnics. @ca
definition: Relateert een persoon aan een expressie die omvat een bijdrage door een persoon door ontwerpen en creëren van lichteffecten. @nl
definition: Relaterer en person til et udtryk, som omfatter en persons bidrag ved at designe og skabe belysningsdele. @da
definition: Relaterer en person til et uttrykk som inkluderer et bidrag fra en person i form av å utforme og skape lyssettingskomponenter. @no
definition: Relates a person to an expression that includes a contribution by a person of designing and creating lighting components. @en
definition: Sasaista personu ar izteiksmi, kas ietver personas ieguldījumu, izstrādājot un radot apgaismojuma efektus. @lv
definition: Seostab isiku väljendusega, millesse isik on andnud panuse, kavandades ja luues selle valguskomponendid. @et
definition: Setzt eine Person in Beziehung zu einer Expression, zu der eine Person beiträgt, indem sie Lichtelemente entwirft und erstellt. @de
definition: يربط شخصا بتعبيرة تتضمن إسهام شخص في تصميم عناصرالإضاءة وإنشائها. @ar
definition: 将一个个人与包括设计并创作灯光组成部分的一个个人的贡献的一种内容表达关联起来。 @zh-hans

erikoistehosteiden tekijä (henkilö) ekspressiossa
has element type: 2
toolkit definition: An expression that includes a contribution by a person of designing and creating on-set special effects, such as on-set mechanical effects and in-camera optical effects. @en
toolkit definition: Een expressie die omvat een bijdrage door een persoon door ontwerpen en creëren van op-de-set speciale effecten, zoals op-de-set mechanische effecten en in-camera optische effecten. @nl
toolkit definition: Egy kifejezési forma, amely magában foglalja egy személy közreműködését olyan helyszíni speciális effektusok tervezésében és létrehozásában, mint a mechanikai és kamerán belüli optikai hatások. @hu
toolkit definition: Eine Expression, zu der eine Person beiträgt, indem sie am Set Spezialeffekte, wie zum Beispiel mechanische Effekte am Set und optische Effekte in der Kamera, entwirft und erstellt. @de
toolkit definition: Ekspressio, jossa henkilö on osallisena liikkuvan kuvan tai ääniteoksen ekspression tekemisessä suunnittelemalla ja luomalla taltioinnin aikana tapahtuvat erikoistehosteet, kuten mekaaniset tehosteet ja kameralla toteutettavat optiset tehosteet.
toolkit definition: Espressione che comprende un contributo di una persona nella progettazione e creazione di effetti speciali sul set, quali effetti meccanici sul set ed effetti ottici della telecamera. @it
toolkit definition: Et uttrykk som inkluderer et bidrag fra en person i form av å utforme og skape spesialeffekter under innspilling, for eksempel mekaniske effekter på settet eller optiske effekter i kameraet. @no
toolkit definition: Expression qui intègre une contribution de la part d’une personne consistant à concevoir et à créer des effets spéciaux de plateau tels que des effets mécaniques de plateau et des effets d’optique dans la caméra. @fr
toolkit definition: Expressió que inclou una contribució d’una persona en el disseny i la creació d’efectes especials de plató, com ara efectes mecànics de plató i efectes òptics de càmera. @ca
toolkit definition: Izteiksme, kas ietver personas ieguldījumu, izstrādājot un radot scēnu specefektus, piemēram, radot scēnas mehāniskos efektus un kameras specifiskos optiskos efektus. @lv
toolkit definition: Set içi mekanik efektler ve kamera içi optik efektler gibi set içi özel efektlerin tasarlanması ve yaratılması konusunda bir kişinin katkısını içeren bir anlatım. @tr
toolkit definition: Udtryk, som omfatter en persons bidrag ved at designe og skabe specialeffekter på stedet, såsom mekaniske effekter og optiske kameraeffekter. @da
toolkit definition: Väljendus, millesse isik on andnud panuse, kavandades ja luues salvestusaegsed eriefektid, nt salvestusaegsed mehaanilised efektid ja kaameraga tehtavad optilised efektid. @et
toolkit definition: تعبيرة تتضمن إسهام شخص في تصميم وإنشاء مؤثرات خاصة مدمجة، مثل المؤثرات الميكانيكية المضبوطة والمؤثرات البصرية في الكاميرا. @ar
toolkit definition: 包括设计并创作现场特殊效果（例如现场机械效果和相机光学效果）的一个个人的贡献的一种内容表达 @zh-hans
toolkit label: Person als Special-effects-Provider von @de
toolkit label: aanbieder speciale effecten-persoon van @nl
toolkit label: curatore degli effetti speciali persona di @it
toolkit label: eriefektide tootja (isik) väljenduses @et
toolkit label: erikoistehosteiden tekijä (henkilö) ekspressiossa
toolkit label: ir specefektu mākslinieks (persona) @lv
toolkit label: leverandør av spesialeffekter for (person) @no
toolkit label: person, som er leverandør af specialeffekter af @da
toolkit label: persona proveïdora d’efectes especials de @ca
toolkit label: personne fournisseuse d’effets spéciaux de @fr
toolkit label: special effects provider person of @en
toolkit label: speciális effektusokat szolgáltató személye: @hu
toolkit label: özel efekt sağlayıcı kişi @tr
toolkit label: παροχέας ειδικών αποτελεσμάτων φυσικό πρόσωπο του @el
toolkit label: شخص مورد مؤثرات خاصة @ar
toolkit label: ……的特殊效果提供者个人 @zh-hans
has subproperty: P50580
lexical alias: specialEffectsProviderPersonOf.en
status: Published
type: Property
domain: C10004
label: er leverandør av spesialeffekter for (person) @no
label: er person, som er leverandør af specialeffekter af @da
label: eriefektide tootja (isik) väljenduses @et
label: est une personne fournisseuse d’effets spéciaux de @fr
label: ir specefektu mākslinieks (persona) @lv
label: is aanbieder speciale effecten-persoon van @nl
label: is special effects provider person of @en
label: ist Person als Special-effects-Provider von @de
label: speciális effektusokat szolgáltató személye a következőnek: @hu
label: Özel Efekt sağlayıcı kişidir @tr
label: è curatore degli effetti speciali persona di @it
label: és persona proveïdora d’efectes especials de @ca
label: είναι παροχέας ειδικών αποτελεσμάτων φυσικό πρόσωπο του @el
label: هو شخص مورد مؤثرات خاصة لـ @ar
label: 是……的特殊效果提供者个人 @zh-hans
sub property of: erikoistehosteiden tekijä (toimija) ekspressiossa
sub property of: esitykseen osallinen henkilö ekspressiossa
definition: Bir kişiyi, set içi mekanik efektler ve kamera içi optik efektler gibi set içi özel efektlerin tasarlanması ve oluşturulmasında bir kişinin katkısını içeren bir anlatımla ilişkilendirir. @tr
definition: Correla una persona a un'espressione che comprende un contributo di una persona nella progettazione e creazione di effetti speciali sul set, quali effetti meccanici sul set ed effetti ottici della telecamera. @it
definition: Hozzákapcsol egy személyt egy kifejezési formához, amely magában foglalja egy személy közreműködését olyan helyszíni speciális effektusok tervezésében és létrehozásában, mint a mechanikai és kamerán belüli optikai hatások. @hu
definition: Liittää henkilön ekspressioon, jossa henkilö on osallisena liikkuvan kuvan tai ääniteoksen ekspression tekemisessä suunnittelemalla ja luomalla taltioinnin aikana tapahtuvat erikoistehosteet, kuten mekaaniset tehosteet ja kameralla toteutettavat optiset tehosteet.
definition: Met une personne en relation avec une expression qui intègre une contribution de la part d’une personne consistant à concevoir et à créer des effets spéciaux de plateau tels que des effets mécaniques de plateau et des effets d’optique dans la caméra. @fr
definition: Relaciona una persona amb una expressió que inclou una contribució d’una persona en el disseny i la creació d’efectes especials de plató, com ara efectes mecànics de plató i efectes òptics de càmera. @ca
definition: Relateert een persoon aan een expressie die omvat een bijdrage door een persoon door ontwerpen en creëren van op-de-set speciale effecten, zoals op-de-set mechanische effecten en in-camera optische effecten. @nl
definition: Relaterer en person til et udtryk, som omfatter en persons bidrag ved at designe og skabe specialeffekter på stedet, såsom mekaniske effekter og optiske kameraeffekter. @da
definition: Relaterer en person til et uttrykk som inkluderer et bidrag fra en person i form av å utforme og skape spesialeffekter under innspilling, for eksempel mekaniske effekter på settet eller optiske effekter i kameraet. @no
definition: Relates a person to an expression that includes a contribution by a person of designing and creating on-set special effects, such as on-set mechanical effects and in-camera optical effects. @en
definition: Sasaista personu ar izteiksmi, kas ietver personas ieguldījumu, izstrādājot un radot scēnu specefektus, piemēram, radot scēnas mehāniskos efektus un kameras specifiskos optiskos efektus. @lv
definition: Seostab isiku väljendusega, millesse isik on andnud panuse, kavandades ja luues salvestusaegsed eriefektid, nt salvestusaegsed mehaanilised efektid ja kaameraga tehtavad optilised efektid. @et
definition: Setzt eine Person in Beziehung zu einer Expression, zu der eine Person beiträgt, indem sie am Set Spezialeffekte, wie zum Beispiel mechanische Effekte am Set und optische Effekte in der Kamera, entwirft und erstellt. @de
definition: يربط شخصا بتعبيرة تتضمن إسهام شخص لتصميم وإنشاء مؤثرات خاصة مدمجة، مثل المؤثرات الميكانيكية المضبوطة والمؤثرات البصرية في الكاميرا. @ar
definition: 将一个个人与包括设计并创作现场特殊效果（例如现场机械效果和相机光学效果）的一个个人的贡献的一种内容表达关联起来。 @zh-hans

visuaalisten tehosteiden tekijä (henkilö) ekspressiossa
has element type: 2
toolkit definition: An expression that includes a contribution by a person of designing and creating post-production visual effects. @en
toolkit definition: Een expressie die omvat een bijdrage door een persoon door ontwerpen en creëren van post-productie visuele effecten. @nl
toolkit definition: Egy kifejezési forma, amely magában foglalja egy személy közreműködését utómunkálati vizuális effektusok tervezésében és létrehozásában. @hu
toolkit definition: Eine Expression, zu der eine Person beiträgt, indem sie in der Postproduktion visuelle Effekte entwirft und erstellt. @de
toolkit definition: Ekspressio, jossa henkilö on osallisena liikkuvan kuvan teoksen ekspression tekemisessä suunnittelemalla ja luomalla visuaaliset tehosteet jälkituotantovaiheessa.
toolkit definition: Espressione che comprende un contributo di una persona nella progettazione e creazione di effetti visivi in post-produzione. @it
toolkit definition: Et uttrykk som inkluderer et bidrag fra en person i form av å utforme og skape visuelle effekter i etterproduksjon. @no
toolkit definition: Expression qui intègre une contribution de la part d’une personne consistant à concevoir et à créer des effets visuels en postproduction. @fr
toolkit definition: Expressió que inclou una contribució d’una persona en el disseny i la creació dels efectes visuals de postproducció. @ca
toolkit definition: Izteiksme, kas ietver personas ieguldījumu, izstrādājot un radot kustīga attēla pēcapstrādes vizuālos efektus. @lv
toolkit definition: Prodüksiyon sonrası görsel efektleri tasarlayan ve yaratan bir kişinin katkısını içeren bir anlatım. @tr
toolkit definition: Udtryk, som omfatter en persons bidrag ved at designe og skabe visuelle effekter efter produktionen. @da
toolkit definition: Väljendus, millesse isik on andnud panuse, kavandades ja luues järelproduktsiooni ajal visuaalseid efekte. @et
toolkit definition: تعبيرة تتضمن إسهام شخص في تصميم وإنشاء مؤثرات مرئية لما بعد الإنتاج. @ar
toolkit definition: 包括设计并创作制作后视觉效果的一个个人的贡献的一种内容表达 @zh-hans
toolkit label: Person als Visual-effects-Provider von @de
toolkit label: aanbieder visuele effecten-persoon van @nl
toolkit label: curatore degli effetti visivi persona di @it
toolkit label: görsel efekt sağlayıcı kişi @tr
toolkit label: ir vizuālo efektu mākslinieks (persona) @lv
toolkit label: leverandør av visuelle effekter for (person) @no
toolkit label: person, som er leverandør af visuelle effekter af @da
toolkit label: persona proveïdora d’efectes visuals de @ca
toolkit label: personne fournisseuse d’effets visuels de @fr
toolkit label: visuaalefektide tootja (isik) väljenduses @et
toolkit label: visuaalisten tehosteiden tekijä (henkilö) ekspressiossa
toolkit label: visual effects provider person of @en
toolkit label: vizuális effektusokat szolgáltató személye: @hu
toolkit label: παροχέας οπτικών αποτελεσμάτων φυσικό πρόσωπο του @el
toolkit label: شخص مورد مؤثرات مرئية @ar
toolkit label: ……的视觉效果提供者个人 @zh-hans
has subproperty: P50581
lexical alias: visualEffectsProviderPersonOf.en
status: Published
type: Property
domain: C10004
label: er leverandør av visuelle effekter for (person) @no
label: er person, som er leverandør af visuelle effekter af @da
label: est une personne fournisseuse d’effets visuels de @fr
label: görsel efektler sağlayan kişidir @tr
label: ir vizuālo efektu mākslinieks (persona) @lv
label: is aanbieder visuele effecten-persoon van @nl
label: is visual effects provider person of @en
label: ist Person als Visual-effects-Provider von @de
label: visuaalefektide tootja (isik) väljenduses @et
label: vizuális effektusokat szolgáltató személye a következőnek: @hu
label: è curatore degli effetti visivi persona di @it
label: és persona proveïdora d’efectes visuals de @ca
label: είναι παροχέας οπτικών αποτελεσμάτων φυσικό πρόσωπο του @el
label: هو شخص مورد مؤثرات مرئية لـ @ar
label: 是……的视觉效果提供者个人 @zh-hans
sub property of: visuaalisten tehosteiden tekijä (toimija) ekspressiossa
sub property of: esitykseen osallinen henkilö ekspressiossa
definition: Bir kişiyi, bir kişinin post prodüksiyon görsel efektleri tasarlama ve oluşturma katkısını içeren bir anlatımla ilişkilendirir. @tr
definition: Correla una persona a un'espressione che comprende un contributo di una persona nella progettazione e creazione di effetti visivi in post-produzione. @it
definition: Hozzákapcsol egy személyt egy kifejezési formához, amely magában foglalja egy személy közreműködését utómunkálati vizuális effektusok tervezésében és létrehozásában. @hu
definition: Liittää henkilön ekspressioon, jossa henkilö on osallisena liikkuvan kuvan teoksen ekspression tekemisessä suunnittelemalla ja luomalla visuaaliset tehosteet jälkituotantovaiheessa.
definition: Met une personne en relation avec une expression qui intègre une contribution de la part d’une personne consistant à concevoir et à créer des effets visuels en postproduction. @fr
definition: Relaciona una persona amb una expressió que inclou una contribució d’una persona en el disseny i la creació dels efectes visuals de postproducció. @ca
definition: Relateert een persoon aan een expressie die omvat een bijdrage door een persoon door ontwerpen en creëren van post-productie visuele effecten. @nl
definition: Relaterer en person til et udtryk, som omfatter en persons bidrag ved at designe og skabe visuelle effekter efter produktionen. @da
definition: Relaterer en person til et uttrykk som inkluderer et bidrag fra en person i form av å utforme og skape visuelle effekter i etterproduksjon. @no
definition: Relates a person to an expression that includes a contribution by a person of designing and creating post-production visual effects. @en
definition: Sasaista personu ar izteiksmi, kas ietver personas ieguldījumu, izstrādājot un radot kustīga attēla pēcapstrādes vizuālos efektus. @lv
definition: Seostab isiku väljendusega, millesse isik on andnud panuse, kavandades ja luues järelproduktsiooni ajal visuaalseid efekte. @et
definition: Setzt eine Person in Beziehung zu einer Expression, zu der eine Person beiträgt, indem sie in der Postproduktion visuelle Effekte entwirft und erstellt. @de
definition: يربط شخصا بتعبيرة تتضمن إسهام شخص في تصميم وإنشاء مؤثرات مرئية لما بعد الإنتاج. @ar
definition: 将一个个人与包括设计并创作制作后视觉效果的一个个人的贡献的一种内容表达关联起来。 @zh-hans

puvustaja (henkilö) ekspressiossa
has element type: 2
toolkit definition: An expression that includes a contribution by a person of designing costumes for a moving image production or for a musical or dramatic presentation or entertainment. @en
toolkit definition: Een expressie die omvat een bijdrage door een persoon door ontwerpen van kostuums voor een bewegend beeld-productie of voor een muzikale of dramatische presentatie of vermaak. @nl
toolkit definition: Egy kifejezési forma, amely magában foglalja egy személy közreműködését jelmezek tervezésében mozgókép-produkciókhoz, zenei vagy drámai előadásokhoz vagy szórakoztató műsorokhoz. @hu
toolkit definition: Eine Expression, zu der eine Person beiträgt, indem sie die Kostüme für eine Bewegtbildproduktion oder für eine musikalische oder dramatische Darbietung oder Aufführung entwirft. @de
toolkit definition: Ekspressio, jonka tekemisessä henkilö on osallisena suunnittelemalla elokuvatuotannon tai musiikki- tai näytelmäesityksen puvustuksen.
toolkit definition: Espressione che comprende un contributo di una persona nella progettazione di costumi per una produzione di immagini in movimento o per una presentazione o spettacolo musicale o drammatico. @it
toolkit definition: Et uttrykk som inkluderer et bidrag fra en person i form av å utforme kostymene for en produksjon med levende bilder eller en musikalsk eller dramatisk forestilling eller form for underholdning. @no
toolkit definition: Expression qui intègre une contribution de la part d’une personne consistant à concevoir des costumes pour une production d’images animées ou bien pour une présentation ou un spectacle musical ou dramatique. @fr
toolkit definition: Expressió que inclou una contribució d’una persona amb el disseny del vestuari en el cas d’una producció d’imatge en moviment o una representació o un espectacle musical o dramàtic. @ca
toolkit definition: Hareketli bir görüntü prodüksiyonu veya müzikal ya da dramatik bir sunum veya eğlence için kostüm tasarlayan bir kişinin katkısını içeren bir anlatım. @tr
toolkit definition: Izteiksme, kas ietver personas ieguldījumu, izstrādājot tērpu dizainu filmai, muzikālam vai dramatiskam uzvedumam, vai sarīkojumam. @lv
toolkit definition: Udtryk, som omfatter en persons bidrag ved at designe kostumer til en levende billedproduktion eller til en musikalsk eller dramatisk præsentation eller underholdning. @da
toolkit definition: Väljendus, millesse isik on andnud panuse, kujundades kostüüme filmi tootmise, muusika- või draamaetenduse või meelelahutusürituse jaoks. @et
toolkit definition: تعبيرة تتضمن إسهام شخص لتصميم الأزياء في تصميم أزياء لإنتاج فيلم؛ أو لعرض موسيقي أو درامي أو ترفيهي. @ar
toolkit definition: 包括为动态图像制作或者为音乐或戏剧呈现或娱乐设计服装的一个个人的贡献的一种内容表达 @zh-hans
toolkit label: Person als Kostümbildnerin/Kostümbildner von @de
toolkit label: costume designer person of @en
toolkit label: costumista persona di @it
toolkit label: ir kostīmu mākslinieks (persona) @lv
toolkit label: jelmeztervező személye: @hu
toolkit label: kostuumontwerper-persoon van @nl
toolkit label: kostymedesigner for (person) @no
toolkit label: kostüm tasarımcısı @tr
toolkit label: kostüümikunstnik (isik) väljenduses @et
toolkit label: person, som er kostumedesigner af @da
toolkit label: persona dissenyadora de vestuari de @ca
toolkit label: personne conceptrice de costumes de @fr
toolkit label: puvustaja (henkilö) ekspressiossa
toolkit label: ενδυματολόγος φυσικό πρόσωπο του @el
toolkit label: شخص مصمم أزياء @ar
toolkit label: ……的服装设计者个人 @zh-hans
has subproperty: P50582
lexical alias: costumeDesignerPersonOf.en
status: Published
type: Property
domain: C10004
label: er kostymedesigner for (person) @no
label: er person, som er kostumedesigner af @da
label: est une personne conceptrice de costumes de @fr
label: ir kostīmu mākslinieks (persona) @lv
label: is costume designer person of @en
label: is kostuumontwerper-persoon van @nl
label: ist Person als Kostümbildnerin/Kostümbildner von @de
label: jelmeztervező személye a következőnek: @hu
label: kostüm tasarımcısı kişisidir @tr
label: kostüümikunstnik (isik) väljenduses @et
label: è costumista persona di @it
label: és persona dissenyadora de vestuari de @ca
label: είναι ενδυματολόγος φυσικό πρόσωπο του @el
label: هو شخص مصمم أزياء لـ @ar
label: 是……的服装设计者个人 @zh-hans
sub property of: puvustaja (toimija) ekspressiossa
sub property of: esitykseen osallinen henkilö ekspressiossa
definition: Bir kişiyi, hareketli bir görüntü prodüksiyonu veya müzikal ya da dramatik bir sunum veya gösteri için kostüm tasarlayan bir kişinin katkısını içeren bir anlatımla ilişkilendirir. @tr
definition: Correla una persona a un'espressione che comprende un contributo di una persona nella progettazione di costumi per una produzione di immagini in movimento o per una presentazione o spettacolo musicale o drammatico. @it
definition: Hozzákapcsol egy személyt egy kifejezési formához, amely magában foglalja egy személy közreműködését jelmezek tervezésében mozgókép-produkciókhoz, zenei vagy drámai előadásokhoz vagy szórakoztató műsorokhoz. @hu
definition: Liittää henkilön ekspressioon, jonka tekemisessä henkilö on osallisena suunnittelemalla elokuvatuotannon tai musiikki- tai näytelmäesityksen puvustuksen.
definition: Met une personne en relation avec une expression qui intègre une contribution de la part d’une personne consistant à concevoir des costumes pour une production d’images animées ou bien pour une présentation ou un spectacle musical ou dramatique. @fr
definition: Relaciona una persona amb una expressió que inclou una contribució d’una persona amb el disseny del vestuari en el cas d’una producció d’imatge en moviment o una representació o un espectacle musical o dramàtic. @ca
definition: Relateert een persoon aan een expressie die omvat een bijdrage door een persoon door ontwerpen van kostuums voor een bewegend beeld-productie of voor een muzikale of dramatische presentatie of vermaak. @nl
definition: Relaterer en person til et udtryk, som omfatter en persons bidrag ved at designe kostumer til en levende billedproduktion eller til en musikalsk eller dramatisk præsentation eller underholdning. @da
definition: Relaterer en person til et uttrykk som inkluderer et bidrag fra en person i form av å utforme kostymene for en produksjon med levende bilder eller en musikalsk eller dramatisk forestilling eller form for underholdning. @no
definition: Relates a person to an expression that includes a contribution by a person of designing costumes for a moving image production or for a musical or dramatic presentation or entertainment. @en
definition: Sasaista personu ar izteiksmi, kas ietver personas ieguldījumu, izstrādājot tērpu dizainu filmai, muzikālam vai dramatiskam uzvedumam, vai sarīkojumam. @lv
definition: Seostab isiku väljendusega, millesse isik on andnud panuse, kujundades kostüüme filmi tootmise, muusika- või draamaetenduse või meelelahutusürituse jaoks. @et
definition: Setzt eine Person in Beziehung zu einer Expression, zu der eine Person beiträgt, indem sie die Kostüme für eine Bewegtbildproduktion oder für eine musikalische oder dramatische Darbietung oder Aufführung entwirft. @de
definition: يربط شخصا بتعبيرة تتضمن إسهام شخص في تصميم أزياء لإنتاج فيلم؛ أو لعرض موسيقي أو درامي أو ترفيهي. @ar
definition: 将一个个人与包括为动态图像制作或者为音乐或戏剧呈现或娱乐设计服装的一个个人的贡献的一种内容表达关联起来。 @zh-hans

lavastussuunnittelija (henkilö) ekspressiossa
has element type: 2
toolkit definition: An expression that includes a contribution by a person of designing the overall visual appearance of a moving image production. @en
toolkit definition: Een expressie die omvat een bijdrage door een persoon door ontwerpen van het totale visuele uiterlijk van een bewegend beeld-productie. @nl
toolkit definition: Egy kifejezési forma, amely magában foglalja egy tervező személy közreműködését mozgókép-produkció általános vizuális megjelenésében. @hu
toolkit definition: Eine Expression, zu der eine Person beiträgt, indem sie für die Gestaltung des gesamten visuellen Erscheinungsbilds einer Bewegtbildproduktion verantwortlich ist. @de
toolkit definition: Ekspressio, johon henkilö osallistuu suunnittelemalla liikkuvan kuvan tuotannon visuaalisen kokonaisilmeen.
toolkit definition: Espressione che comprende un contributo di una persona nella progettazione dell'aspetto visivo complessivo di una produzione di immagini in movimento. @it
toolkit definition: Et uttrykk som inkluderer et bidrag fra en person i form av å utforme det generelle visuelle uttrykket til en produksjon med levende bilder. @no
toolkit definition: Expression qui intègre une contribution de la part d’une personne consistant à concevoir l’aspect visuel global d’une production d’images animées. @fr
toolkit definition: Expressió que inclou una contribució d’una persona dissenyant l’aparença visual general d’una producció d’imatge en moviment. @ca
toolkit definition: Hareketli bir görüntü prodüksiyonunun genel görsel görünümünün tasarlanmasında bir kişinin katkısını içeren bir anlatım. @tr
toolkit definition: Izteiksme, kas ietver personas ieguldījumu, izstrādājot kustīga attēla vispārējo vizuālo izskatu. @lv
toolkit definition: Udtryk, som omfatter en persons bidrag ved at designe en levende billedproduktions overordnede visuelle udtryk. @da
toolkit definition: Väljendus, millesse isik on andnud panuse, kujundades liikuvast pildist koosneva produktsiooni visuaalse üldilme. @et
toolkit definition: تعبيرة تتضمن إسهام شخص لتصميم المظهر المرئي العام لإنتاج صور متحركة. @ar
toolkit definition: 包括设计动态图像制作整体视觉效果的一个个人的贡献的一种内容表达 @zh-hans
toolkit label: Person als Szenenbildnerin/Szenenbildner von @de
toolkit label: designer di produzione persona di @it
toolkit label: ir filmas scenogrāfs (persona) @lv
toolkit label: kunstnik-lavastaja (isik) väljenduses @et
toolkit label: lavastussuunnittelija (henkilö) ekspressiossa
toolkit label: látványtervező személye: @hu
toolkit label: person, som er produktionsdesigner af @da
toolkit label: persona dissenyadora de producció de @ca
toolkit label: personne chef décoratrice de @fr
toolkit label: productieontwerper-persoon van @nl
toolkit label: production designer person of @en
toolkit label: produksjonsdesigner for (person) @no
toolkit label: Üretim tasarımcısı kişisi @tr
toolkit label: σχεδιαστής παραγωγής φυσικό πρόσωπο του @el
toolkit label: شخص مصمم إنتاج @ar
toolkit label: ……的制作设计者个人 @zh-hans
has subproperty: P50583
lexical alias: productionDesignerPersonOf.en
status: Published
type: Property
domain: C10004
label: er person, som er produktionsdesigner af @da
label: er produksjonsdesigner for (person) @no
label: est une personne chef décoratrice de @fr
label: ir filmas scenogrāfs (persona) @lv
label: is productieontwerper-persoon van @nl
label: is production designer person of @en
label: ist Person als Szenenbildnerin/Szenenbildner von @de
label: kunstnik-lavastaja (isik) väljenduses @et
label: látványtervező személye a következőnek: @hu
label: yapım tasarımcısı kişisidir @tr
label: è designer di produzione persona di @it
label: és persona dissenyadora de producció de @ca
label: είναι σχεδιαστής παραγωγής φυσικό πρόσωπο του @el
label: هو شخص مصمم إنتاج لـ @ar
label: 是……的制作设计者个人 @zh-hans
sub property of: lavastussuunnittelija (toimija) ekspressiossa
sub property of: esitykseen osallinen henkilö ekspressiossa
definition: Bir kişiyi, bir hareketli görüntü prodüksiyonunun genel görsel görünümünün tasarlanmasında bir kişinin katkısını içeren bir anlatımla ilişkilendirir @tr
definition: Correla una persona a un'espressione che comprende un contributo di una persona nella progettazione dell'aspetto visivo complessivo di una produzione di immagini in movimento. @it
definition: Hozzákapcsol egy személyt egy kifejezési formához, amely magában foglalja egy tervező személy közreműködését mozgókép-produkció általános vizuális megjelenésében. @hu
definition: Liittää henkilön ekspressioon, johon henkilö osallistuu suunnittelemalla liikkuvan kuvan tuotannon visuaalisen kokonaisilmeen.
definition: Met une personne en relation avec une expression qui intègre une contribution de la part d’une personne consistant à concevoir l’aspect visuel global d’une production d’images animées. @fr
definition: Relaciona una persona amb una expressió que inclou una contribució d’una persona dissenyant l’aparença visual general d’una producció d’imatge en moviment. @ca
definition: Relateert een persoon aan een expressie die omvat een bijdrage door een persoon door ontwerpen van het totale visuele uiterlijk van een bewegend beeld-productie. @nl
definition: Relaterer en person til et udtryk, som omfatter en persons bidrag ved at designe en levende billedproduktions overordnede visuelle udtryk. @da
definition: Relaterer en person til et uttrykk som inkluderer et bidrag fra en person i form av å utforme det generelle visuelle uttrykket til en produksjon med levende bilder. @no
definition: Relates a person to an expression that includes a contribution by a person of designing the overall visual appearance of a moving image production. @en
definition: Sasaista personu ar izteiksmi, kas ietver personas ieguldījumu, izstrādājot kustīga attēla vispārējo vizuālo izskatu. @lv
definition: Seostab isiku väljendusega, millesse isik on andnud panuse, kujundades liikuvast pildist koosneva produktsiooni visuaalse üldilme. @et
definition: Setzt eine Person in Beziehung zu einer Expression, zu der eine Person beiträgt, indem sie für die Gestaltung des gesamten visuellen Erscheinungsbilds einer Bewegtbildproduktion verantwortlich ist. @de
definition: يربط شخصا بتعبيرة تتضمن إسهام شخص لتصميم المظهر المرئي العام لإنتاج صور متحركة. @ar
definition: 将一个个人与包括设计动态图像制作整体视觉效果的一个个人的贡献的一种内容表达关联起来。 @zh-hans

tekstaaja (henkilö) ekspressiossa
has element type: 2
toolkit definition: An expression that includes a contribution by a person of drawing text and graphic sound effects for a comic book, graphic novel, etc. @en
toolkit definition: Bir çizgi roman için metin ve grafik ses efektleri çizen bir kişinin katkısını içeren bir anlatım. @tr
toolkit definition: Een expressie die omvat een bijdrage door een persoon door tekenen van tekst en grafische geluidseffecten voor een comic, stripboek etc. @nl
toolkit definition: Egy kifejezési forma, amely magában foglalja egy személy közreműködését képregény, képregényalbum stb. szövegének és grafikai hangeffektusainak rajzolásában. @hu
toolkit definition: Eine Expression, zu der eine Person beiträgt, indem sie für ein Comicbuch, eine Graphic Novel und so weiter Text und grafische Toneffekte zeichnet. @de
toolkit definition: Ekspressio, jossa henkilö on osallisena sarjakuvan, sarjakuvaromaanin tms. ekspression tekemisessä piirtämällä tekstin ja graafiset äänitehosteet.
toolkit definition: Espressione che comprende un contributo di una persona nel disegno di testo ed effetti sonori grafici per un fumetto, graphic novel, etc. @it
toolkit definition: Et uttrykk som inkluderer et bidrag fra en person i form av å tegne tekst of grafiske lydeffekter for en tegneserie, grafisk roman etc. @no
toolkit definition: Expression qui intègre une contribution de la part d’une personne consistant à dessiner le texte et les effets sonores graphiques pour une bande dessinée, un roman graphique, etc. @fr
toolkit definition: Expressió que inclou una contribució d’una persona en el dibuix de text i d’efectes sonors gràfics d’un còmic, una novel·la gràfica, etc. @ca
toolkit definition: Izteiksme, kas ietver personas ieguldījumu, zīmējot tekstu un skaņu efektus grafiskā formā komiksu grāmatai, grafiskam romānam u.tml. @lv
toolkit definition: Udtryk, som omfatter en persons bidrag ved at tegne tekst og grafiske lydeffekter til en tegneserie, graphic novel etc. @da
toolkit definition: Väljendus, millesse isik on andnud panuse, joonistades teksti ja graafilisi helijäljendusi koomiksi, graafilise romaani vms jaoks. @et
toolkit definition: تعبيرة تتضمن إسهام شخص في رسم النص والمؤثرات الصوتية لرسومات قصة مصورة أو رواية مصورة، إلخ. @ar
toolkit definition: 包括一个为漫画书、图解小说等绘制文字和图案声音效果的一个个人的贡献的一种内容表达 @zh-hans
toolkit label: Hat sanatı yapan kişi @tr
toolkit label: Person als Letterer von @de
toolkit label: betűrajzoló személye: @hu
toolkit label: ir komiksa teksta rakstītājs (persona) @lv
toolkit label: letteraar-persoon van @nl
toolkit label: letterer for (person) @no
toolkit label: letterer person of @en
toolkit label: letterista persona di @it
toolkit label: person, som er bogstavtegner af @da
toolkit label: persona retolista de @ca
toolkit label: personne lettreuse de @fr
toolkit label: tekstaaja (henkilö) ekspressiossa
toolkit label: tekstijoonistaja (isik) väljenduses @et
toolkit label: σχεδιαστής γραμμάτων επιγραφών φυσικό πρόσωπο του @el
toolkit label: شخص رسّام حروف @ar
toolkit label: ……的字母图案画者个人 @zh-hans
has subproperty: P50584
lexical alias: lettererPersonOf.en
status: Published
type: Property
domain: C10004
label: betűrajzoló személye a következőnek: @hu
label: er letterer for (person) @no
label: er person, som er bogstavtegner af @da
label: est une personne lettreuse de @fr
label: ir komiksa teksta rakstītājs (persona) @lv
label: is letteraar-persoon van @nl
label: is letterer person of @en
label: ist Person als Letterer von @de
label: tekstijoonistaja (isik) väljenduses @et
label: yazı tasarımcısı kişisidir @tr
label: è letterista persona di @it
label: és persona retolista de @ca
label: είναι σχεδιαστής γραμμάτων επιγραφών φυσικό πρόσωπο του @el
label: هو شخص رسّام حروف لـ @ar
label: 是……的字母图案画者个人 @zh-hans
sub property of: tekstaaja (toimija) ekspressiossa
sub property of: yhdistymään osallinen henkilö ekspressiossa
definition: Bir kişiyi, bir çizgi roman, grafik roman vb. için metin ve grafik ses efektleri çizen bir kişinin katkısını içeren bir anlatımla ilişkilendirir. @tr
definition: Correla una persona a un'espressione che comprende un contributo di una persona nel disegno di testo ed effetti sonori grafici per un fumetto, graphic novel, etc. @it
definition: Hozzákapcsol egy személyt egy kifejezési formához, amely magában foglalja egy személy közreműködését képregény, képregényalbum stb. szövegének és grafikai hangeffektusainak rajzolásában. @hu
definition: Liittää henkilön ekspressioon, jossa henkilö on osallisena sarjakuvan, sarjakuvaromaanin tms. ekspression tekemisessä piirtämällä tekstin ja graafiset äänitehosteet.
definition: Met une personne en relation avec une expression qui intègre une contribution de la part d’une personne consistant à dessiner le texte et les effets sonores graphiques pour une bande dessinée, un roman graphique, etc. @fr
definition: Relaciona una persona amb una expressió que inclou una contribució d’una persona en el dibuix de text i d’efectes sonors gràfics d’un còmic, una novel·la gràfica, etc. @ca
definition: Relateert een persoon aan een expressie die omvat een bijdrage door een persoon door tekenen van tekst en grafische geluidseffecten voor een comic, stripboek etc. @nl
definition: Relaterer en person til et udtryk, som omfatter en persons bidrag ved at tegne tekst og grafiske lydeffekter til en tegneserie, graphic novel etc. @da
definition: Relaterer en person til et uttrykk som inkluderer et bidrag fra en person i form av å tegne tekst of grafiske lydeffekter for en tegneserie, grafisk roman etc. @no
definition: Relates a person to an expression that includes a contribution by a person of drawing text and graphic sound effects for a comic book, graphic novel, etc. @en
definition: Sasaista personu ar izteiksmi, kas ietver personas ieguldījumu, zīmējot tekstu un skaņu efektus grafiskā formā komiksu grāmatai, grafiskam romānam u.tml. @lv
definition: Seostab isiku väljendusega, millesse isik on andnud panuse, joonistades teksti ja graafilisi helijäljendusi koomiksi, graafilise romaani vms jaoks. @et
definition: Setzt eine Person in Beziehung zu einer Expression, zu der eine Person beiträgt, indem sie für ein Comicbuch, eine Graphic Novel und so weiter Text und grafische Toneffekte zeichnet. @de
definition: يربط شخصا بتعبيرة تتضمن إسهام شخص في رسم النص والمؤثرات الصوتية لرسومات قصة مصورة أو رواية مصورة، إلخ. @ar
definition: 将一个个人与包括一个为漫画书、图解小说等绘制文字和图案声音效果的一个个人的贡献的一种内容表达关联起来。 @zh-hans

kääntäjä (henkilö) ekspressiossa
has element type: 2
toolkit definition: An expression that includes a contribution by a person of expressing the linguistic content of the work in a different language. @en
toolkit definition: Een expressie die omvat een bijdrage door een persoon van uitdrukken van de taalkundige content van het werk in een andere taal. @nl
toolkit definition: Egy kifejezési forma, amely magában foglalja egy személy közreműködését egy mű nyelvi tartalmának más nyelven történő kifejezésével. @hu
toolkit definition: Eine Expression, zu der eine Person beiträgt, indem sie den sprachlichen Inhalt des Werks in einer anderen Sprache ausdrückt. @de
toolkit definition: Ekspressio, jonka tekemisessä henkilö on osallisena ilmaisemalla teoksen kielellisen sisällön toisella kielellä.
toolkit definition: Eserin dilsel içeriğini farklı bir dilde ifade eden bir kişinin katkısını içeren bir anlatım. @tr
toolkit definition: Espressione che comprende un contributo di una persona nell'esprimere il contenuto linguistico dell'opera in una lingua differente. @it
toolkit definition: Et uttrykk som inkluderer et bidrag fra en person i form av å uttrykke det språklige innholdet av et verk på et annet språk. @no
toolkit definition: Expression qui intègre une contribution de la part d’une personne consistant à exprimer le contenu linguistique de l’œuvre dans une langue différente. @fr
toolkit definition: Expressió que inclou una contribució d’una persona expressant el contingut lingüístic de l’obra en una llengua diferent. @ca
toolkit definition: Izteiksme, kas ietver personas ieguldījumu, izsakot darba saturu valodā, kas atšķiras no sākotnējās darba valodas. @lv
toolkit definition: Udtryk, som omfatter en persons bidrag ved at udtrykke værkets sproglige indhold på et andet sprog. @da
toolkit definition: Väljendus, millesse isik on andnud panuse, väljendades teose keelesisu teises keeles. @et
toolkit definition: تعبيرة تتضمن إسهام شخص في التعبير عن المحتوى اللغوي لعمل بلغة مختلفة. @ar
toolkit definition: 包括用另一种语言表达作品语言内容的一个个人的贡献的一种内容表达 @zh-hans
toolkit label: Person als Übersetzerin/Übersetzer von @de
toolkit label: fordító személye: @hu
toolkit label: ir tulkotājs (persona) @lv
toolkit label: kääntäjä (henkilö) ekspressiossa
toolkit label: oversetter for (person) @no
toolkit label: person, som er oversætter af @da
toolkit label: persona traductora de @ca
toolkit label: personne traductrice de @fr
toolkit label: tercüman kişi @tr
toolkit label: traduttore persona di @it
toolkit label: translator person of @en
toolkit label: tõlkija (isik) väljenduses @et
toolkit label: vertaler-persoon van @nl
toolkit label: μεταφραστής φυσικό πρόσωπο του @el
toolkit label: شخص مترجم @ar
toolkit label: ……的译者个人 @zh-hans
has subproperty: P50585
lexical alias: translatorPersonOf.en
status: Published
type: Property
domain: C10004
label: er oversetter for (person) @no
label: er person, som er oversætter af @da
label: est une personne traductrice de @fr
label: fordító személye a következőnek: @hu
label: ir tulkotājs (persona) @lv
label: is translator person of @en
label: is vertaler-persoon van @nl
label: ist Person als Übersetzerin/Übersetzer von @de
label: tõlkija (isik) väljenduses @et
label: çeviri yapan kişidir @tr
label: è traduttore persona di @it
label: és persona traductora de @ca
label: είναι μεταφραστής φυσικό πρόσωπο του @el
label: هو شخص مترجم لـ @ar
label: 是……的译者个人 @zh-hans
sub property of: kääntäjä (toimija) ekspressiossa
sub property of: ekspression tekijä (henkilö) ekspressiossa
definition: Bir kişiyi, bir kişinin eserin dilsel içeriğini farklı bir dilde ifade etme katkısını içeren bir anlatımla ilişkilendirir. @tr
definition: Correla una persona a un'espressione che comprende un contributo di una persona nell'esprimere il contenuto linguistico dell'opera in una lingua differente. @it
definition: Hozzákapcsol egy személyt egy kifejezési formához, amely magában foglalja egy személy közreműködését egy mű nyelvi tartalmának más nyelven történő kifejezésével. @hu
definition: Liittää henkilön ekspressioon, jonka tekemisessä henkilö on osallisena ilmaisemalla teoksen kielellisen sisällön toisella kielellä.
definition: Met une personne en relation avec une expression qui intègre une contribution de la part d’une personne consistant à exprimer le contenu linguistique de l’œuvre dans une langue différente. @fr
definition: Relaciona una persona amb una expressió que inclou una contribució d’una persona expressant el contingut lingüístic de l’obra en una llengua diferent. @ca
definition: Relateert een persoon aan een expressie die omvat een bijdrage door een persoon van uitdrukken van de taalkundige content van het werk in een andere taal. @nl
definition: Relaterer en person til et udtryk, som omfatter en persons bidrag ved at udtrykke værkets sproglige indhold på et andet sprog. @da
definition: Relaterer en person til et uttrykk som inkluderer et bidrag fra en person i form av å uttrykke det språklige innholdet av et verk på et annet språk. @no
definition: Relates a person to an expression that includes a contribution by a person of expressing the linguistic content of the work in a different language. @en
definition: Sasaista personu ar izteiksmi, kas ietver personas ieguldījumu, izsakot darba saturu valodā, kas atšķiras no sākotnējās darba valodas. @lv
definition: Seostab isiku väljendusega, millesse isik on andnud panuse, väljendades teose keelesisu teises keeles. @et
definition: Setzt eine Person in Beziehung zu einer Expression, zu der eine Person beiträgt, indem sie den sprachlichen Inhalt des Werks in einer anderen Sprache ausdrückt. @de
definition: يربط شخصا بتعبيرة تتضمن إسهام شخص في التعبير عن المحتوى اللغوي لعمل بلغة مختلفة. @ar
definition: 将一个个人与包括用另一种语言表达作品语言内容的一个个人的贡献的一种内容表达关联起来。 @zh-hans
scope note: A translator may also translate linguistic content between forms of the same language from different time periods. @en
scope note: Bir çevirmen, aynı dilin farklı zaman dilimlerindeki biçimleri arasında da dilsel içerik çevirisi yapabilir. @tr
scope note: Darunter fallen Übersetzungen sprachlichen Inhalts aus Formen derselben Sprache aus verschiedenen Zeitperioden. @de
scope note: Een vertaler kan ook taalkundige content vertalen tussen vormen van dezelfde taal uit verschillende tijdperiodes. @nl
scope note: Egy fordító ugyanannak a nyelvnek a különböző időszakokból származó formái közötti nyelvi tartalmat is fordíthatja. @hu
scope note: En oversetter kan også oversette språklig innhold mellom ulike former av det samme språket fra ulike tidsperioder. @no
scope note: En oversætter kan også oversætte sprogligt indhold mellem former af samme sprog fra forskellige tidsperioder. @da
scope note: Kääntäjä voi myös kääntää kielisisältöä saman kielen eri aikakausien kielimuotojen välillä.
scope note: Tulkotājs var tulkot saturu no senākas valodas formas mūsdienu valodas formā vienas valodas ietvaros. @lv
scope note: Tõlkija võib keelesisu tõlkida ka sama keele eri ajaperioodidel kasutatud vormide vahel. @et

näyttämöohjaaja (henkilö) ekspressiossa
has element type: 2
toolkit definition: An expression that includes a contribution by a person of general management and supervision of a stage performance. @en
toolkit definition: Bir sahne performansının genel yönetim ve denetimine bir kişinin katkısını içeren bir anlatım. @tr
toolkit definition: Een expressie die omvat een bijdrage door een persoon door algeheel beheer en toezicht van een toneeluitvoering. @nl
toolkit definition: Egy kifejezési forma, amely magában foglalja egy személy közreműködését egy színpadi előadás általános menedzselésében és felügyeletében. @hu
toolkit definition: Eine Expression einer Bühnendarbietung, zu der eine Person durch die allgemeine Betreuung und Leitung beiträgt. @de
toolkit definition: Ekspressio, jonka tekemisessä henkilö on osallisena johtamalla ja valvomalla näyttämöesitystä.
toolkit definition: Espressione che comprende un contributo di una persona per la gestione e supervisione generale di un'interpretazione teatrale. @it
toolkit definition: Et uttrykk som inkluderer et bidrag fra en person i form av generell ledelse og tilsyn med en sceneforestilling. @no
toolkit definition: Expression qui intègre une contribution de la part d’une personne consistant à assurer la gestion et la supervision générales d’une prestation scénique. @fr
toolkit definition: Expressió que inclou una contribució d’una persona en la gestió general i la supervisió d’una representació escènica. @ca
toolkit definition: Izteiksme, kas ietver personas ieguldījumu, vispārēji vadot un uzraugot uzvedumu. @lv
toolkit definition: Udtryk, som omfatter en persons bidrag gennem den generelle ledelse af- og tilsyn med en sceneoptræden. @da
toolkit definition: Väljendus, millesse isik on andnud panuse lavateose esituse üldise juhtimise ja juhendamisega. @et
toolkit definition: تعبيرة تتضمن إسهام شخص في الإدارة العامة لأداء مسرحي والإشراف عليه. @ar
toolkit definition: 包括一个个人对舞台表演总体管理和监督的贡献的一种内容表达 @zh-hans
toolkit label: Person als Bühnenregisseurin/Bühnenregisseur von @de
toolkit label: ir teātra režisors (persona) @lv
toolkit label: lavastaja (isik) väljenduses @et
toolkit label: näyttämöohjaaja (henkilö) ekspressiossa
toolkit label: person, som er sceneinstruktør af @da
toolkit label: persona directora d’escena de @ca
toolkit label: personne metteuse en scène de @fr
toolkit label: regista teatrale persona di @it
toolkit label: sahne yönetmeni kişi @tr
toolkit label: sceneregissør for (person) @no
toolkit label: stage director person of @en
toolkit label: színpadi rendező személye: @hu
toolkit label: toneelregisseur-persoon van @nl
toolkit label: διευθυντής σκηνής φυσικό πρόσωπο του @el
toolkit label: شخص مدير المسرح @ar
toolkit label: ……的舞台导演行为者 @zh-hans
has subproperty: P50586
lexical alias: stageDirectorPersonOf.en
status: Published
type: Property
domain: C10004
label: Sahne yönetmen kişisidir @tr
label: er person, som er sceneinstruktør af @da
label: er sceneregissør for (person) @no
label: est une personne metteuse en scène de @fr
label: ir teātra režisors (persona) @lv
label: is stage director person of @en
label: is toneelregisseur-persoon van @nl
label: ist Person als Bühnenregisseurin/Bühnenregisseur von @de
label: lavastaja (isik) väljenduses @et
label: színpadi rendező személye a következőnek: @hu
label: è regista teatrale persona di @it
label: és persona directora d’escena de @ca
label: είναι διευθυντής σκηνής φυσικό πρόσωπο του @el
label: هو شخص مدير مسرح لـ @ar
label: 是……的舞台导演行为者 @zh-hans
sub property of: näyttämöohjaaja (toimija) ekspressiossa
sub property of: esitykseen osallinen henkilö ekspressiossa
definition: Bir kişiyi, bir sahne performansının genel yönetim ve denetiminde bir kişinin katkısını içeren bir anlatımla ilişkilendirir. @tr
definition: Correla una persona a un'espressione che comprende un contributo di una persona per la gestione e supervisione generale di un'interpretazione teatrale. @it
definition: Hozzákapcsol egy személyt egy kifejezési formához, amely magában foglalja egy személy közreműködését egy színpadi előadás általános menedzselésében és felügyeletében. @hu
definition: Liittää henkilön ekspressioon, jonka tekemisessä henkilö on osallisena johtamalla ja valvomalla näyttämöesitystä.
definition: Met une personne en relation avec une expression qui intègre une contribution de la part d’une personne consistant à assurer la gestion et la supervision générales d’une prestation scénique. @fr
definition: Relaciona una persona amb una expressió que inclou una contribució d’una persona en la gestió general i la supervisió d’una representació escènica. @ca
definition: Relateert een persoon aan een expressie die omvat een bijdrage door een persoon door algeheel beheer en toezicht van een toneeluitvoering. @nl
definition: Relaterer en person til et udtryk, som omfatter en persons bidrag gennem den generelle ledelse af- og tilsyn med en sceneoptræden. @da
definition: Relaterer en person til et uttrykk som inkluderer et bidrag fra en person i form av generell ledelse og tilsyn med en sceneforestilling. @no
definition: Relates a person to an expression that includes a contribution by a person of general management and supervision of a stage performance. @en
definition: Sasaista personu ar izteiksmi, kas ietver personas ieguldījumu, vispārēji vadot un uzraugot uzvedumu. @lv
definition: Seostab isiku väljendusega, millesse isik on andnud panuse lavateose esituse üldise juhtimise ja juhendamisega. @et
definition: Setzt eine Person in Beziehung zu einer Expression einer Bühnendarbietung, zu der eine Person durch die allgemeine Betreuung und Leitung beiträgt. @de
definition: يربط شخصا بتعبيرة تتضمن إسهام شخص في الإدارة العامة لأداء مسرحي والإشراف عليه. @ar
definition: 将一个个人与包括一个个人对舞台表演总体管理和监督的贡献的一种内容表达关联起来。 @zh-hans

animaattori (henkilö) ekspressiossa
has element type: 2
toolkit definition: An expression that includes a contribution by a person of giving apparent movement to inanimate objects or drawings. @en
toolkit definition: Cansız nesnelere veya çizimlere görünür hareket veren bir kişinin katkısını içeren bir anlatım. @tr
toolkit definition: Een expressie die omvat een bijdrage door een persoon door het geven van schijnbare beweging aan levenloze objecten of tekeningen. @nl
toolkit definition: Egy kifejezési forma, amely magában foglalja egy személy közreműködését élettelen tárgyak vagy rajzok látszólagos mozgatásában. @hu
toolkit definition: Eine Expression, zu der eine Person beiträgt, indem sie unbelebte Objekte oder Zeichnungen in scheinbare Bewegung versetzt. @de
toolkit definition: Ekspressio, jonka tekemisessä henkilö on osallisena tuottamalla näennäistä liikettä elottomiin esineisiin tai piirroksiin.
toolkit definition: Espressione che comprende un contributo di una persona nel dare movimento apparente a oggetti inanimati o disegni. @it
toolkit definition: Et uttrykk som inkluderer et bidrag fra en person i form av å gi tilsynelatende bevegelse til tegninger eller figurer. @no
toolkit definition: Expression qui intègre une contribution de la part d’une personne consistant à donner l’illusion du mouvement à des objets inanimés ou à des dessins. @fr
toolkit definition: Expressió que inclou una contribució d’una persona donant l’aparença de moviment a objectes o dibuixos inanimats. @ca
toolkit definition: Izteiksme, kas ietver personas ieguldījumu, pieškirot šķietamu kustību nekustīgiem objektiem vai zīmējumiem. @lv
toolkit definition: Udtryk, som omfatter en persons bidrag ved at give en illusion af bevægelse til livløse objekter eller tegninger. @da
toolkit definition: Väljendus, millesse isik on andnud panuse, pannes näiliselt liikuma elutud esemed või joonistused. @et
toolkit definition: تعبيرة تتضمن إسهام شخص لجعل كائنات أو رسومات جامدة تتحرك حركة واضحة. @ar
toolkit definition: 包括一个个人对给予无生命对象或绘画以貌似运动之贡献的一种内容表达 @zh-hans
toolkit label: Person als Trickfilmzeichnerin/Trickfilmzeichner von @de
toolkit label: [σχεδιαστής] κινουμένων σχεδίων φυσικό πρόσωπο του @el
toolkit label: animaator (isik) väljenduses @et
toolkit label: animaattori (henkilö) ekspressiossa
toolkit label: animator person of @en
toolkit label: animator-persoon van @nl
toolkit label: animatore persona di @it
toolkit label: animatör kişi @tr
toolkit label: animatør for (person) @no
toolkit label: animátor személye: @hu
toolkit label: ir animators (persona) @lv
toolkit label: person, som er animator af @da
toolkit label: persona animadora de @ca
toolkit label: personne animatrice de @fr
toolkit label: شخص فنان رسوم متحركة @ar
toolkit label: ……的动画师个人 @zh-hans
has subproperty: P50587
lexical alias: animatorPersonOf.en
status: Published
type: Property
domain: C10004
label: animaator (isik) väljenduses @et
label: animatör kişisidir @tr
label: animátor személye a következőnek: @hu
label: er animatør for (person) @no
label: er person, som er animator af @da
label: est une personne animatrice de @fr
label: ir animators (persona) @lv
label: is animator person of @en
label: is animator-persoon van @nl
label: ist Person als Trickfilmzeichnerin/Trickfilmzeichner von @de
label: è animatore persona di @it
label: és persona animadora de @ca
label: είναι [σχεδιαστής] κινουμένων σχεδίων φυσικό πρόσωπο του @el
label: هو شخص فنان رسوم متحركة لـ @ar
label: 是……的动画师个人 @zh-hans
sub property of: animaattori (toimija) ekspressiossa
sub property of: esitykseen osallinen henkilö ekspressiossa
definition: Bir kişiyi, bir kişinin cansız nesnelere veya çizimlere görünür hareket verme katkısını içeren bir anlatımla ilişkilendirir. @tr
definition: Correla una persona a un'espressione che comprende un contributo di una persona nel dare movimento apparente a oggetti inanimati o disegni. @it
definition: Hozzákapcsol egy személyt egy kifejezési formához, amely magában foglalja egy személy közreműködését élettelen tárgyak vagy rajzok látszólagos mozgatásában. @hu
definition: Liittää henkilön ekspressioon, jonka tekemisessä henkilö on osallisena tuottamalla näennäistä liikettä elottomiin esineisiin tai piirroksiin.
definition: Met une personne en relation avec une expression qui intègre une contribution de la part d’une personne consistant à donner l’illusion du mouvement à des objets inanimés ou à des dessins. @fr
definition: Relaciona una persona amb una expressió que inclou una contribució d’una persona donant l’aparença de moviment a objectes o dibuixos inanimats. @ca
definition: Relateert een persoon aan een expressie die omvat een bijdrage door een persoon door het geven van schijnbare beweging aan levenloze objecten of tekeningen. @nl
definition: Relaterer en person til et udtryk, som omfatter en persons bidrag ved at give en illusion af bevægelse til livløse objekter eller tegninger. @da
definition: Relaterer en person til et uttrykk som inkluderer et bidrag fra en person i form av å gi tilsynelatende bevegelse til tegninger eller figurer. @no
definition: Relates a person to an expression that includes a contribution by a person of giving apparent movement to inanimate objects or drawings. @en
definition: Sasaista personu ar izteiksmi, kas ietver personas ieguldījumu, pieškirot šķietamu kustību nekustīgiem objektiem vai zīmējumiem. @lv
definition: Seostab isiku väljendusega, millesse isik on andnud panuse, pannes näiliselt liikuma elutud esemed või joonistused. @et
definition: Setzt eine Person in Beziehung zu einer Expression, zu der eine Person beiträgt, indem sie unbelebte Objekte oder Zeichnungen in scheinbare Bewegung versetzt. @de
definition: يربط شخصا بتعبيرة تتضمن إسهام شخص لجعل كائنات أو رسومات جامدة تتحرك حركة واضحة. @ar
definition: 将一个个人与包括一个个人对给予无生命对象或绘画以貌似运动之贡献的一种内容表达关联起来。 @zh-hans

ekspression haastattelija (henkilö) ekspressiossa
has element type: 2
toolkit definition: An expression that includes a contribution by a person of interviewing, reporting, or some other kind of gathering of information. @en
toolkit definition: Een expressie die omvat een bijdrage door een persoon door ondervragen, rapporteren of een andere vorm van informatie verzamelen. @nl
toolkit definition: Egy kifejezési forma, amely magában foglalja egy személy közreműködését interjúban, riportban vagy más információgyűjtő minőségben. @hu
toolkit definition: Eine Expression, zu der eine Person beiträgt, indem sie als Interviewerin/Interviewer, Reporterin/Reporter, Meinungsforscherin/Meinungsforscher oder andere Person Informationen zusammenträgt. @de
toolkit definition: Ekspressio, jonka tekemisessä henkilö on osallisena toimimalla haastattelijana, toimittajana tai jonain muuna tietoja keräävänä toimijana.
toolkit definition: Espressione che comprende un contributo di una persona nell'intervistare, riferire notizie o altro tipo di raccolta di informazioni. @it
toolkit definition: Et uttrykk som inkluderer et bidrag fra en person i form av intervjuer, rapportering eller en annen form for innsamling av informasjon. @no
toolkit definition: Expression qui intègre une contribution de la part d’une personne consistant à réaliser un entretien, un reportage ou un autre type de collecte d’informations. @fr
toolkit definition: Expressió que inclou una contribució d’una persona entrevistant, informant o recopilant informació d’alguna altra manera. @ca
toolkit definition: Izteiksme, kas ietver personas ieguldījumu, darbojoties kā intervētājs, reportieris, aptaujas organizētājs vai kāds cits informācijas apkopotājs. @lv
toolkit definition: Röportaj, raporlama veya başka bir tür bilgi toplayan bir kişinin katkısını içeren bir anlatım. @tr
toolkit definition: Udtryk, som omfatter en persons bidrag ved at interviewe, rapportere eller en anden form for indsamling af information. @da
toolkit definition: Väljendus, millesse isik on andnud panuse, intervjueerides, tehes reportaaži või kogudes muul viisil infot. @et
toolkit definition: تعبيرة تتضمن إسهام شخص في إجراء مقابلات أو إعداد تقارير أو جمع المعلومات بطريقة أخرى. @ar
toolkit definition: 包括一个采访、报道或其他某种信息收集的一个个人的贡献的一种内容表达 @zh-hans
toolkit label: Person als Interviewerin/Interviewer einer Expression von @de
toolkit label: anlatımının görüşmeci kişisidir @tr
toolkit label: ekspression haastattelija (henkilö) ekspressiossa
toolkit label: interjúkészítő személye a következő kifejezési formának: @hu
toolkit label: interviewer person of expression of @en
toolkit label: interviewer-persoon van expressie van @nl
toolkit label: intervistatore persona di espressione di @it
toolkit label: intervjueerija (isik) väljenduses @et
toolkit label: intervjuer for uttrykk for (person) @no
toolkit label: ir intervētājs (persona) izteiksmē @lv
toolkit label: person, som er interviewer for udtryk af @da
toolkit label: persona entrevistadora d’una expressió de @ca
toolkit label: personne intervieweuse d’une expression de @fr
toolkit label: εσυνεντευκτής φυσικό πρόσωπο της έκφρασης του @el
toolkit label: شخص محاور في تعبيرة @ar
toolkit label: ……的内容表达的采访者个人 @zh-hans
has subproperty: P50588
lexical alias: interviewerPersonOfExpressionOf.en
status: Published
type: Property
domain: C10004
label: anlatımının görüşmeci kişisidir @tr
label: er intervjuer for uttrykk for (person) @no
label: er person, som er interviewer for udtryk af @da
label: est une personne intervieweuse d’une expression de @fr
label: interjúkészítő személye a következő kifejezési formának: @hu
label: intervjueerija (isik) väljenduses @et
label: ir intervētājs (persona) izteiksmē @lv
label: is interviewer person of expression of @en
label: is interviewer-persoon van expressie van @nl
label: ist Person als Interviewerin/Interviewer einer Expression von @de
label: è intervistatore persona di espressione di @it
label: és persona entrevistadora d’una expressió de @ca
label: είναι συνεντευκτής φυσικό πρόσωπο της έκφρασης του @el
label: هو شخص محاور في تعبيرة لـ @ar
label: 是……的内容表达的采访者个人 @zh-hans
sub property of: ekspression haastattelija (toimija) ekspressiossa
sub property of: esitykseen osallinen henkilö ekspressiossa
definition: Bir kişiyi, bir kişinin görüşme, raporlama veya başka türde bilgi toplama katkısını içeren bir anlatımla ilişkilendirir. @tr
definition: Correla una persona a un'espressione che comprende un contributo di una persona nell'intervistare, riferire notizie o altro tipo di raccolta di informazioni. @it
definition: Hozzákapcsol egy személyt egy kifejezési formához, amely magában foglalja egy személy közreműködését interjúban, riportban vagy más információgyűjtő minőségben. @hu
definition: Liittää henkilön ekspressioon, jonka tekemisessä henkilö on osallisena toimimalla haastattelijana, toimittajana tai jonain muuna tietoja keräävänä toimijana.
definition: Met une personne en relation avec une expression qui intègre une contribution de la part d’une personne consistant à réaliser un entretien, un reportage ou un autre type de collecte d’informations. @fr
definition: Relaciona una persona amb una expressió que inclou una contribució d’una persona entrevistant, informant o recopilant informació d’alguna altra manera. @ca
definition: Relateert een persoon aan een expressie die omvat een bijdrage door een persoon door ondervragen, rapporteren of een andere vorm van informatie verzamelen. @nl
definition: Relaterer en person til et udtryk, som omfatter en persons bidrag ved at interviewe, rapportere eller en anden form for indsamling af information. @da
definition: Relaterer en person til et uttrykk som inkluderer et bidrag fra en person i form av intervjuer, rapportering eller en annen form for innsamling av informasjon. @no
definition: Relates a person to an expression that includes a contribution by a person of interviewing, reporting, or some other kind of gathering of information. @en
definition: Sasaista personu ar izteiksmi, kas ietver personas ieguldījumu, darbojoties kā intervētājs, reportieris, aptaujas organizētājs vai kāds cits informācijas apkopotājs. @lv
definition: Seostab isiku väljendusega, millesse isik on andnud panuse, intervjueerides, tehes reportaaži või kogudes muul viisil infot. @et
definition: Setzt eine Person in Beziehung zu einer Expression, zu der eine Person beiträgt, indem sie als Interviewerin/Interviewer, Reporterin/Reporter, Meinungsforscherin/Meinungsforscher oder andere Person Informationen zusammenträgt. @de
definition: يربط شخصا بتعبيرة تتضمن إسهام شخص في إجراء مقابلات أو في إعداد تقارير أو جمع المعلومات بطريقة أخرى. @ar
definition: 将一个个人与包括一个采访、报道或其他某种信息收集的一个个人的贡献的一种内容表达关联起来。 @zh-hans

kuoronjohtaja (henkilö) ekspressiossa
has element type: 2
toolkit definition: An expression that includes a contribution by a person of leading a choral performing group in a musical or dramatic presentation. @en
toolkit definition: Een expressie die omvat een bijdrage door een persoon door leiden van een optredende koorgroep in een muzikale of dramatische presentatie. @nl
toolkit definition: Egy kifejezési forma, amely magában foglalja egy zenei vagy drámai bemutatóban énekkari előadó csoportot vezető személy közreműködését. @hu
toolkit definition: Eine Expression, zu der eine Person beiträgt, indem sie einen Chor in einer musikalischen oder dramatischen Darbietung leitet. @de
toolkit definition: Ekspressio, jonka tekemisessä henkilö on osallisena johtamalla kuoroa musiikki- tai näytelmäesityksessä.
toolkit definition: Espressione che comprende un contributo di una persona nella direzione di un gruppo di esecuzione corale in una presentazione musicale o drammatica. @it
toolkit definition: Et uttrykk som inkluderer et bidrag fra en person i form av ledelse av et kor i en musikalsk eller dramatisk forestilling. @no
toolkit definition: Expression qui intègre une contribution de la part d’une personne consistant à diriger un groupe de choristes dans une présentation musicale ou dramatique. @fr
toolkit definition: Expressió que inclou una contribució d’una persona dirigint una coral en una representació musical o dramàtica. @ca
toolkit definition: Izteiksme, kas ietver personas ieguldījumu, diriģējot izpildītājmākslinieku grupu mūzikas vai dramatiskā uzvedumā. @lv
toolkit definition: Müzikal veya dramatik bir sunumda bir koro performans grubuna liderlik eden bir kişinin katkısını içeren bir anlatım. @tr
toolkit definition: Udtryk, som omfatter en persons bidrag ved at lede et optrædende kor i en musikalsk eller dramatisk præsentation. @da
toolkit definition: Väljendus, millesse isik on andnud panuse, juhatades koori muusika- või draamaetenduses @et
toolkit definition: تعبيرة تتضمن إسهام شخص في قيادة فريق كورال في عرض موسيقي أو درامي. @ar
toolkit definition: 包括在音乐或戏剧呈现中领导一个合唱表演团体的一个个人的贡献的一种内容表达 @zh-hans
toolkit label: Person als Chorleiterin/Chorleiter von @de
toolkit label: choral conductor person of @en
toolkit label: direttore di coro persona di @it
toolkit label: ir kordiriģents (persona) @lv
toolkit label: koordirigent-persoon van @nl
toolkit label: koorijuht (isik) väljenduses @et
toolkit label: kordirigent for (person) @no
toolkit label: koro şefi @tr
toolkit label: kuoronjohtaja (henkilö) ekspressiossa
toolkit label: kórusvezető személye: @hu
toolkit label: person, som er kordirigent af @da
toolkit label: persona directora de cor de @ca
toolkit label: personne chef de chœur de @fr
toolkit label: διευθυντής χορωδίας φυσικό πρόσωπο του @el
toolkit label: شخص قائد كورال @ar
toolkit label: ……的合唱指挥个人 @zh-hans
has subproperty: P50589
lexical alias: choralConductorPersonOf.en
status: Published
type: Property
domain: C10004
label: er kordirigent for (person) @no
label: er person, som er kordirigent af @da
label: est une personne chef de chœur de @fr
label: ir kordiriģents (persona) @lv
label: is choral conductor person of @en
label: is koordirigent-persoon van @nl
label: ist Person als Chorleiterin/Chorleiter von @de
label: koorijuht (isik) väljenduses @et
label: koro şefi kişisidir @tr
label: kórusvezető személye a következőnek: @hu
label: è direttore di coro persona di @it
label: és persona directora de cor de @ca
label: είναι διευθυντής χορωδίας φυσικό πρόσωπο του @el
label: هو شخص قائد كورال لـ @ar
label: 是……的合唱指挥个人 @zh-hans
sub property of: kuoronjohtaja (toimija) ekspressiossa
sub property of: johtaja (henkilö) ekspressiossa
definition: Bir kişiyi, müzikal veya dramatik bir sunumda bir koro icra grubuna liderlik eden bir kişinin katkısını içeren bir anlatımla ilişkilendirir. @tr
definition: Correla una persona a un'espressione che comprende un contributo di una persona nella direzione di un gruppo di esecuzione corale in una presentazione musicale o drammatica. @it
definition: Hozzákapcsol egy személyt egy kifejezési formához, amely magában foglalja egy zenei vagy drámai bemutatóban énekkari előadó csoportot vezető személy közreműködését. @hu
definition: Liittää henkilön ekspressioon, jonka tekemisessä henkilö on osallisena johtamalla kuoroa musiikki- tai näytelmäesityksessä.
definition: Met une personne en relation avec une expression qui intègre une contribution de la part d’une personne consistant à diriger un groupe de choristes dans une présentation musicale ou dramatique. @fr
definition: Relaciona una persona amb una expressió que inclou una contribució d’una persona dirigint una coral en una representació musical o dramàtica. @ca
definition: Relateert een persoon aan een expressie die omvat een bijdrage door een persoon door leiden van een optredende koorgroep in een muzikale of dramatische presentatie. @nl
definition: Relaterer en person til et udtryk, som omfatter en persons bidrag ved at lede et optrædende kor i en musikalsk eller dramatisk præsentation. @da
definition: Relaterer en person til et uttrykk som inkluderer et bidrag fra en person i form av ledelse av et kor i en musikalsk eller dramatisk forestilling. @no
definition: Relates a person to an expression that includes a contribution by a person of leading a choral performing group in a musical or dramatic presentation. @en
definition: Sasaista personu ar izteiksmi, kas ietver personas ieguldījumu, diriģējot izpildītājmākslinieku grupu mūzikas vai dramatiskā uzvedumā. @lv
definition: Seostab isiku väljendusega, millesse isik on andnud panuse, juhatades koori muusika- või draamaetenduses @et
definition: Setzt eine Person in Beziehung zu einer Expression, zu der eine Person beiträgt, indem sie einen Chor in einer musikalischen oder dramatischen Darbietung leitet. @de
definition: يربط شخصا بتعبيرة تتضمن إسهام شخص في قيادة فريق كورال في عرض موسيقي أو درامي. @ar
definition: 将一个个人与包括在音乐或戏剧呈现中领导一个合唱表演团体的一个个人的贡献的一种内容表达关联起来。 @zh-hans

juontaja (henkilö) ekspressiossa
has element type: 2
toolkit definition: An expression that includes a contribution by a person of leading a program, often broadcast, that includes other performers. @en
toolkit definition: Een expressie die omvat een bijdrage van een persoon door het leiden van een programma, vaak uitgezonden, dat omvat andere uitvoerders. @nl
toolkit definition: Egy kifejezési forma, amely magában foglalja egy személy közreműködését egy program, gyakran sugárzott műsor, vezetésében, amelyen más előadók vesznek részt. @hu
toolkit definition: Eine Expression, zu der eine Person beiträgt, indem sie ein Veranstaltung (meist eine Sendung) leitet, an der auch andere Ausführende teilnehmen. @de
toolkit definition: Ekspressio, jonka tekemiseen henkilö osallistuu juontamalla (useimmiten lähetettyä) ohjelmaa, johon osallistuu muita esiintyjiä.
toolkit definition: Espressione che comprende un contributo di una persona nella conduzione di un programma, spesso una trasmissione, che comprende altri ospiti, artisti e altri agenti. @it
toolkit definition: Et uttrykk som inkluderer et bidrag fra en person i form av ledelse av et program, ofte kringkastet, som inkluderer andre gjester, utøvere eller andre agenter. @no
toolkit definition: Expression qui intègre une contribution de la part d’une personne consistant à diriger une activité, souvent diffusée à la radio, à la télévision, etc., qui fait appel à d’autres interprètes. @fr
toolkit definition: Expressió que inclou una contribució d’una persona que és un intèrpret dirigint un programa, sovint emès, que inclou altres intèrprets. @ca
toolkit definition: Genellikle yayınlanan ve diğer sanatçıları da içeren bir programa liderlik eden bir kişinin katkısını içeren bir anlatım. @tr
toolkit definition: Izteiksme, kas ietver personas ieguldījumu, vadot programmu (parasti apraidi), kas ietver citu viesu, izpildītāju, citu aģentu piedalīšanos. @lv
toolkit definition: Udtryk, som omfatter en persons bidrag ved at lede et program, ofte transmitteret, som omfatter optrædende. @da
toolkit definition: Väljendus, millesse isik on andnud panuse, juhtides saadet (sageli ringhäälingus), kus osalevad külalised, esitajad ja teised tegijad. @et
toolkit definition: تعبيرة تتضمن إسهام شخص في إدارة برنامج، غالبًا مُذاع، ويستضيف ضيوفا وفنانين ووكلاء آخرين. @ar
toolkit definition: 包括有主导节目（经常是广播节目）的一个个人并包括其他表演者的贡献的一种内容表达 @zh-hans
toolkit label: Person als Gastgeberin/Gastgeber von @de
toolkit label: gastgever-persoon van @nl
toolkit label: host person of @en
toolkit label: házigazda személye: @hu
toolkit label: ir programmas vadītājs (persona) @lv
toolkit label: juontaja (henkilö) ekspressiossa
toolkit label: ospite persona di @it
toolkit label: person, som er vært af @da
toolkit label: persona amfitriona de @ca
toolkit label: personne hôtesse de @fr
toolkit label: saatejuht (isik) väljenduses @et
toolkit label: sunucu kişisidir @tr
toolkit label: vert for (person) @no
toolkit label: ξενιστής φυσικό πρόσωπο του @el
toolkit label: شخص مضيف @ar
toolkit label: ……的主持人个人 @zh-hans
has subproperty: P50590
lexical alias: hostPersonOf.en
status: Published
type: Property
domain: C10004
label: er person, som er vært af @da
label: er vert for (person) @no
label: est une personne hôtesse de @fr
label: házigazda személye a következőnek: @hu
label: ir programmas vadītājs (persona) @lv
label: is gastgever-persoon van @nl
label: is host person of @en
label: ist Person als Gastgeberin/Gastgeber von @de
label: saatejuht (isik) väljenduses @et
label: sunucu kişisidir @tr
label: è ospite persona di @it
label: és persona amfitriona de @ca
label: είναι ξενιστής φυσικό πρόσωπο του @el
label: هو شخص مضيف لـ @ar
label: 是……的主持人个人 @zh-hans
sub property of: juontaja (toimija) ekspressiossa
sub property of: esittäjä (henkilö) ekspressiossa
definition: Bir kişiyi, yayınlanan ve diğer sanatçıları içeren bir programa, liderlik eden bir kişinin katkısını içeren bir anlatımla ilişkilendirir. @tr
definition: Correla una persona a un'espressione che comprende un contributo di una persona nella conduzione di un programma, spesso una trasmissione, che comprende altri ospiti, artisti e altri agenti. @it
definition: Hozzákapcsol egy személyt egy kifejezési formához, amely magában foglalja egy személy közreműködését egy program, gyakran sugárzott műsor, vezetésében, amelyen más előadók vesznek részt. @hu
definition: Liittää henkilön ekspressioon, jonka tekemiseen henkilö osallistuu juontamalla (useimmiten lähetettyä) ohjelmaa, johon osallistuu muita esiintyjiä.
definition: Met une personne en relation avec une expression qui intègre une contribution de la part d’une personne consistant à diriger une activité, souvent diffusée à la radio, à la télévision, etc., qui fait appel à d’autres interprètes. @fr
definition: Relaciona una persona amb una expressió que inclou una contribució d’una persona que és un intèrpret dirigint un programa, sovint emès, que inclou altres intèrprets. @ca
definition: Relateert een persoon aan een expressie die omvat een bijdrage van een persoon door het leiden van een programma, vaak uitgezonden, dat omvat andere uitvoerders. @nl
definition: Relaterer en person til et udtryk, som omfatter en persons bidrag ved at lede et program, ofte transmitteret, som omfatter andre optrædende. @da
definition: Relaterer en person til et uttrykk som inkluderer et bidrag fra en person i form av ledelse av et program, ofte kringkastet, som inkluderer andre gjester, utøvere eller andre agenter. @no
definition: Relates a person to an expression that includes a contribution by a person of leading a program, often broadcast, that includes other performers. @en
definition: Sasaista personu ar izteiksmi, kas ietver personas ieguldījumu, vadot programmu (parasti apraidi), kas ietver citu viesu, izpildītāju, citu aģentu piedalīšanos. @lv
definition: Seostab isiku väljendusega, millesse isik on andnud panuse, juhtides saadet (sageli ringhäälingus), kus osalevad külalised, esitajad ja teised tegijad. @et
definition: Setzt eine Person in Beziehung zu einer Expression, zu der eine Person beiträgt, indem sie eine Veranstaltung (meist eine Sendung) leitet, an der auch andere Ausführende teilnehmen. @de
definition: يربط شخصا بتعبيرة تتضمن إسهام شخص في إدارة برنامج، غالبا مُذاع، يستضيف ضيوفا وفنانين ووكلاء آخرين. @ar
definition: 将一个个人与包括有主导节目（经常是广播节目）的一个个人并包括其他表演者的贡献的一种内容表达关联起来。 @zh-hans

moderoija (henkilö) ekspressiossa
has element type: 2
toolkit definition: An expression that includes a contribution by a person of leading a program, often broadcast, where topics are discussed, usually with participation of experts in fields related to the discussion. @en
toolkit definition: Een expressie die omvat een bijdrage van een persoon door leiden van een programma, vaak uitgezonden, waar onderwerpen worden bediscussieerd, vaak met deelname van experts op gebieden gerelateerd aan de discussie. @nl
toolkit definition: Egy kifejezési forma, amely magában foglalja egy személy közreműködését egy program, gyakran sugárzott műsor, vezetésében, amelyen témákat vitatnak meg, rendszerint a beszélgetés témájában jártas szakértők részvételével. @hu
toolkit definition: Eine Expression, zu der eine Person beiträgt, indem sie eine Veranstaltung (meist eine Sendung) leitet, in der Themen üblicherweise mit Expertinnen/Experten diskutiert werden. @de
toolkit definition: Ekspressio, jonka tekemisessä henkilö on osallisena juontamalla (useimmiten lähetettyä) ohjelmaa, jossa keskustellaan eri aiheista tavallisesti keskusteluun liittyvien aiheiden asiantuntijoiden kanssa.
toolkit definition: Espressione che comprende un contributo di una persona nella conduzione di un programma, spesso una trasmissione, in cui si discutono argomenti, solitamente con la partecipazione di esperti in campi relativi alla discussione. @it
toolkit definition: Et uttrykk som inkluderer et bidrag fra en person i form av ledelse av et program, ofte kringkastet, hvor temaer blir diskutert vanligvis med deltakere som er eksperter på feltene som er knyttet til diskusjonen. @no
toolkit definition: Expression qui intègre une contribution de la part d’une personne consistant à diriger une activité, souvent diffusée à la radio, à la télévision, etc., où des sujets sont discutés, habituellement avec la participation d’experts dans les domaines reliés à la discussion. @fr
toolkit definition: Expressió que inclou una contribució d’una persona dirigint un programa, sovint emès, on es discuteixen temes, habitualment amb la participació d’experts en els camps relacionats amb la discussió. @ca
toolkit definition: Genellikle tartışma ile ilgili alanlarda uzmanların katılımıyla konuların tartışıldığı, genellikle yayınlanan bir programa liderlik eden bir kişinin katkısını içeren bir anlatım. @tr
toolkit definition: Izteiksme, kas ietver personas ieguldījumu, vadot programmu (parasti apraidi), kurā tiek apspriestas tēmas ar ekspertu piedalīšanos. @lv
toolkit definition: Udtryk, som omfatter en persons bidrag ved at lede et program, ofte transmitteret, hvor emner diskuteres, normalt med deltagelse af fagfolk indenfor felter, som er relateret til diskussionen. @da
toolkit definition: Väljendus, millesse isik on andnud panuse, juhtides saadet (sageli ringhäälingus), kus arutatakse mingeid teemasid ja kus tavaliselt osalevad arutatava teemavaldkonna asjatundjad. @et
toolkit definition: تعبيرة تتضمن إسهام شخص في إدارة برنامج، غالبا ما يجري بثه، ومناقشة موضوعات بمشاركة خبراء في المجالات المتعلقة بموضوع النقاش. @ar
toolkit definition: 包括有主导节目（经常是广播节目，其中讨论话题，通常有讨论相关领域专家参与）的一个个人的贡献的一种内容表达 @zh-hans
toolkit label: Moderatör kişisi @tr
toolkit label: Person als Moderatorin/Moderator von @de
toolkit label: ir moderators (persona) @lv
toolkit label: moderator person of @en
toolkit label: moderator-persoon van @nl
toolkit label: moderatore persona di @it
toolkit label: moderoija (henkilö) ekspressiossa
toolkit label: moderátor személye: @hu
toolkit label: ordstyrer for (person) @no
toolkit label: person, som er ordstyrer af @da
toolkit label: persona moderadora de @ca
toolkit label: personne modératrice de @fr
toolkit label: väitlusjuht (isik) väljenduses @et
toolkit label: συντονιστής φυσικό πρόσωπο του @el
toolkit label: شخص مدير نقاش لـ @ar
toolkit label: ……的谈话类节目主持人个人 @zh-hans
has subproperty: P50591
lexical alias: moderatorPersonOf.en
status: Published
type: Property
domain: C10004
label: er ordstyrer for (person) @no
label: er person, som er ordstyrer af @da
label: est une personne modératrice de @fr
label: ir moderators (persona) @lv
label: is moderator person of @en
label: is moderator-persoon van @nl
label: ist Person als Moderatorin/Moderator von @de
label: moderatör kişisidir @tr
label: moderátor személye a következőnek: @hu
label: väitlusjuht (isik) väljenduses @et
label: è moderatore persona di @it
label: és persona moderadora de @ca
label: είναι συντονιστής φυσικό πρόσωπο του @el
label: هو شخص مدير مناقشة لـ @ar
label: 是……的谈话类节目主持人个人 @zh-hans
sub property of: moderoija (toimija) ekspressiossa
sub property of: esittäjä (henkilö) ekspressiossa
definition: Bir kişiyi, tartışmayla ilgili alanlardaki uzmanların katılımıyla konuların tartışıldığı, genellikle yayınlanan bir programa liderlik eden bir kişinin katkısını içeren bir anlatımla ilişkilendirir. @tr
definition: Correla una persona a un'espressione che comprende un contributo di una persona nella conduzione di un programma, spesso una trasmissione, in cui si discutono argomenti, solitamente con la partecipazione di esperti in campi relativi alla discussione. @it
definition: Hozzákapcsol egy személyt egy kifejezési formához, amely magában foglalja egy személy közreműködését egy program, gyakran sugárzott műsor, vezetésében, amelyen témákat vitatnak meg, rendszerint a beszélgetés témájában jártas szakértők részvételével. @hu
definition: Liittää henkilön ekspressioon, jonka tekemisessä henkilö on osallisena juontamalla (useimmiten lähetettyä) ohjelmaa, jossa keskustellaan eri aiheista tavallisesti keskusteluun liittyvien aiheiden asiantuntijoiden kanssa.
definition: Met une personne en relation avec une expression qui intègre une contribution de la part d’une personne consistant à diriger une activité, souvent diffusée à la radio, à la télévision, etc., où des sujets sont discutés, habituellement avec la participation d’experts dans les domaines reliés à la discussion. @fr
definition: Relaciona una persona amb una expressió que inclou una contribució d’una persona dirigint un programa, sovint emès, on es discuteixen temes, habitualment amb la participació d’experts en els camps relacionats amb la discussió. @ca
definition: Relateert een persoon aan een expressie die omvat een bijdrage van een persoon door leiden van een programma, vaak uitgezonden, waar onderwerpen worden bediscussieerd, vaak met deelname van experts op gebieden gerelateerd aan de discussie. @nl
definition: Relaterer en person til et udtryk, som omfatter en persons bidrag ved at lede et program, ofte transmitteret, hvor emner diskuteres, normalt med deltagelse af fagfolk indenfor felter, som er relateret til diskussionen. @da
definition: Relaterer en person til et uttrykk som inkluderer et bidrag fra en person i form av ledelse av et program, ofte kringkastet, hvor temaer blir diskutert vanligvis med deltakere som er eksperter på feltene som er knyttet til diskusjonen. @no
definition: Relates a person to an expression that includes a contribution by a person of leading a program, often broadcast, where topics are discussed, usually with participation of experts in fields related to the discussion. @en
definition: Sasaista personu ar izteiksmi, kas ietver personas ieguldījumu, vadot programmu (parasti apraidi), kurā tiek apspriestas tēmas ar ekspertu piedalīšanos. @lv
definition: Seostab isiku väljendusega, millesse isik on andnud panuse, juhtides saadet (sageli ringhäälingus), kus arutatakse mingeid teemasid ja kus tavaliselt osalevad arutatava teemavaldkonna asjatundjad. @et
definition: Setzt eine Person in Beziehung zu einer Expression, zu der eine Person beiträgt, indem sie eine Veranstaltung (meist eine Sendung) leitet, in der Themen üblicherweise mit Expertinnen/Experten diskutiert werden. @de
definition: يربط شخصا بتعبيرة تتضمن إسهام شخص بإدارة برنامج، غالبا ما يجري بثه، ومناقشة موضوعات بمشاركة خبراء في المجالات المتعلقة بموضوع النقاش. @ar
definition: 将一个个人与包括有主导节目（经常是广播节目，其中讨论话题，通常有讨论相关领域专家参与）的一个个人的贡献的一种内容表达关联起来。 @zh-hans

johtaja (henkilö) ekspressiossa
has element type: 2
toolkit definition: An expression that includes a contribution by a person of leading a performing group in a musical or dramatic presentation. @en
toolkit definition: Een expressie die omvat een bijdrage van een persoon door het leiden van een uitvoerende groep in een muziek- of dramapresentatie. @nl
toolkit definition: Egy kifejezési forma, amely magában foglalja egy zenei vagy drámai bemutatóban, előadói csoportot vezető személy közreműködését. @hu
toolkit definition: Eine Expression, zu der eine Person beiträgt, indem sie ein aufführendes Ensemble in einer musikalischen oder dramatischen Darbietung leitet. @de
toolkit definition: Ekspressio, jonka tekemisessä henkilö on osallisena johtamalla esiintyjäryhmän esiintymistä musiikki- tai näytelmäesityksessä.
toolkit definition: Espressione che comprende un contributo di una persona nella conduzione di un gruppo che si esibisce in una presentazione musicale o drammatica. @it
toolkit definition: Et uttrykk som inkluderer et bidrag fra en person i form av ledelse av en gruppe med utøvere i en musikalsk eller dramatisk forestilling. @no
toolkit definition: Expression qui intègre une contribution de la part d’une personne consistant à diriger un groupe d’interprètes dans une présentation musicale ou dramatique. @fr
toolkit definition: Expressió que inclou una contribució d’una persona dirigint un grup d’intèrprets en una representació musical o dramàtica. @ca
toolkit definition: Izteiksme, kas ietver personas ieguldījumu, vadot izpildītāju grupu muzikālā vai dramatiskā uzvedumā. @lv
toolkit definition: Müzikal veya dramatik bir sunumda bir performans grubuna liderlik eden bir kişinin katkısını içeren bir anlatım. @tr
toolkit definition: Udtryk, som omfatter en persons bidrag ved at lede en udøvende gruppe i en musikalsk eller dramatisk præsentation. @da
toolkit definition: Väljendus, millesse isik on andnud panuse, juhatades muusika- või draamaetenduse esitusrühma. @et
toolkit definition: تعبيرة تتضمن إسهام شخص في قيادة فرقة عزف في عرض موسيقي أو درامي. @ar
toolkit definition: 包括领导音乐或戏剧呈现的表演团体的一个个人的贡献的一种内容表达 @zh-hans
toolkit label: Person als Dirigentin/Dirigent von @de
toolkit label: conductor person of @en
toolkit label: direttore persona di @it
toolkit label: dirigent (isik) väljenduses @et
toolkit label: dirigent for (person) @no
toolkit label: dirigent-persoon van @nl
toolkit label: ir diriģents (persona) @lv
toolkit label: johtaja (henkilö) ekspressiossa
toolkit label: karmester személye: @hu
toolkit label: orkestra şefi @tr
toolkit label: person, som er dirigent af @da
toolkit label: persona directora d’orquestra de @ca
toolkit label: personne chef musicale de @fr
toolkit label: διευθυντής ορχήστρας φυσικό πρόσωπο του @el
toolkit label: شخص قائد فرقة موسيقية @ar
toolkit label: ……的指挥个人 @zh-hans
has subproperty: kapellimestari (henkilö) ekspressiossa
has subproperty: kuoronjohtaja (henkilö) ekspressiossa
has subproperty: P50592
lexical alias: conductorPersonOf.en
status: Published
type: Property
domain: C10004
label: dirigent (isik) väljenduses @et
label: er dirigent for (person) @no
label: er person, som er dirigent af @da
label: est une personne chef musicale de @fr
label: ir diriģents (persona) @lv
label: is conductor person of @en
label: is dirigent-persoon van @nl
label: ist Person als Dirigentin/Dirigent von @de
label: karmester személye a következőnek: @hu
label: orekstra şefi kişisidir @tr
label: è direttore persona di @it
label: és persona directora d’orquestra de @ca
label: είναι διευθυντής ορχήστρας φυσικό πρόσωπο του @el
label: هو شخص قائد فرقة موسيقية لـ @ar
label: 是……的指挥个人 @zh-hans
sub property of: johtaja (toimija) ekspressiossa
sub property of: esittäjä (henkilö) ekspressiossa
definition: Bir kişiyi, müzikal veya dramatik bir sunumda bir gösteri grubuna liderlik eden bir kişinin katkısını içeren bir anlatımla ilişkilendirir. @tr
definition: Correla una persona a un'espressione che comprende un contributo di una persona nella conduzione di un gruppo che si esibisce in una presentazione musicale o drammatica. @it
definition: Hozzákapcsol egy személyt egy kifejezési formához, amely magában foglalja egy zenei vagy drámai bemutatóban, előadói csoportot vezető személy közreműködését. @hu
definition: Liittää henkilön ekspressioon, jonka tekemisessä henkilö on osallisena johtamalla esiintyjäryhmän esiintymistä musiikki- tai näytelmäesityksessä.
definition: Met une personne en relation avec une expression qui intègre une contribution de la part d’une personne consistant à diriger un groupe d’interprètes dans une présentation musicale ou dramatique. @fr
definition: Relaciona una persona amb una expressió que inclou una contribució d’una persona dirigint un grup d’intèrprets en una representació musical o dramàtica. @ca
definition: Relateert een persoon aan een expressie die omvat een bijdrage van een persoon door het leiden van een uitvoerende groep in een muziek- of dramapresentatie. @nl
definition: Relaterer en person til et udtryk, som omfatter en persons bidrag ved at lede en udøvende gruppe i en musikalsk eller dramatisk præsentation. @da
definition: Relaterer en person til et uttrykk som inkluderer et bidrag fra en person i form av ledelse av en gruppe med utøvere i en musikalsk eller dramatisk forestilling. @no
definition: Relates a person to an expression that includes a contribution by a person of leading a performing group in a musical or dramatic presentation. @en
definition: Sasaista personu ar izteiksmi, kas ietver personas ieguldījumu, vadot izpildītāju grupu muzikālā vai dramatiskā uzvedumā. @lv
definition: Seostab isiku väljendusega, millesse isik on andnud panuse, juhatades muusika- või draamaetenduse esitusrühma. @et
definition: Setzt eine Person in Beziehung zu einer Expression, zu der eine Person beiträgt, indem sie ein aufführendes Ensemble in einer musikalischen oder dramatischen Darbietung leitet. @de
definition: يربط شخصا بتعبيرة تتضمن إسهام شخص في قيادة فرقة عزف في عرض موسيقي أو درامي. @ar
definition: 将一个个人与包括领导音乐或戏剧呈现的表演团体的一个个人的贡献的一种内容表达关联起来。 @zh-hans

tarkastaja (henkilö) ekspressiossa
has element type: 2
toolkit definition: An expression that includes a contribution by a person of making changes to the content of another expression. @en
toolkit definition: Başka bir ifadenin içeriğinde değişiklik yapan bir kişinin katkısını içeren bir anlatım. @tr
toolkit definition: Een expressie die omvat een bijdrage door een persoon door wijzigingen te maken in de content van een andere expressie. @nl
toolkit definition: Egy kifejezési forma, amely magában foglalja egy személy közreműködését egy másik kifejezési forma tartalmának megváltoztatásában. @hu
toolkit definition: Eine Expression, zu der eine Person beiträgt, indem sie am Inhalt einer anderen Expression Veränderungen vornimmt. @de
toolkit definition: Ekspressio, jonka tekemisessä henkilö on osallisena tekemällä muutoksia toisen ekspression sisältöön.
toolkit definition: Espressione che comprende un contributo di una persona nell'apportare modifiche al contenuto di un'altra espressione. @it
toolkit definition: Et uttrykk som inkluderer et bidrag fra en person i form av å gjøre endringer i innholdet av et annet uttrykk. @no
toolkit definition: Expression qui intègre une contribution de la part d’une personne consistant à apporter des modifications au contenu d’une autre expression. @fr
toolkit definition: Expressió que inclou una contribució d’una persona fent canvis en el contingut d’una altra expressió. @ca
toolkit definition: Izteiksme, kas ietver personas ieguldījumu, veicot izmaiņas citas izteiksmes saturā. @lv
toolkit definition: Udtryk, som omfatter en persons bidrag ved at foretage ændringer i indholdet af et andet udtryk. @da
toolkit definition: Väljendus, millesse isik on andnud panuse, tehes muudatusi teise väljenduse sisusse. @et
toolkit definition: تعبيرة تتضمن إسهام شخص لإجراء تغييرات على محتوى تعبيرة أخرى. @ar
toolkit definition: 包括对另一种内容表达的内容作改动的一个个人的贡献的一种内容表达 @zh-hans
toolkit label: Person als Überarbeiterin/Überarbeiter von @de
toolkit label: gözden geçiren kişi @tr
toolkit label: herziener-persoon van @nl
toolkit label: ir korektors (persona) @lv
toolkit label: omarbeider av (person) @no
toolkit label: person, som er omarbejder af @da
toolkit label: persona revisora de @ca
toolkit label: personne réviseuse de @fr
toolkit label: redigeerija (isik) väljenduses @et
toolkit label: reviser person of @en
toolkit label: revisore persona di @it
toolkit label: tarkastaja (henkilö) ekspressiossa
toolkit label: átdolgozó személye a következőnek: @hu
toolkit label: αναθεωρητής φυσικό πρόσωπο του @el
toolkit label: شخص مراجع @ar
toolkit label: ……的修订者个人 @zh-hans
has subproperty: ekspression entisöijä (henkilö) ekspressiossa
has subproperty: sensori (henkilö) ekspressiossa
has subproperty: sovittaja (henkilö) ekspressiossa
has subproperty: lyhentäjä (henkilö) ekspressiossa
has subproperty: transkriboija (henkilö) ekspressiossa
has subproperty: P50593
lexical alias: reviserPersonOf.en
status: Published
type: Property
domain: C10004
label: er omarbeider av (person) @no
label: er person, som er omarbejder af @da
label: est une personne réviseuse de @fr
label: gözden geçiren kişidir @tr
label: ir korektors (persona) @lv
label: is herziener-persoon van @nl
label: is reviser person of @en
label: ist Person als Überarbeiterin/Überarbeiter von @de
label: redigeerija (isik) väljenduses @et
label: átdolgozó személye a következőnek: @hu
label: è revisore persona di @it
label: és persona revisora de @ca
label: είναι αναθεωρητής φυσικό πρόσωπο του @el
label: هو شخص مراجع لـ @ar
label: 是……的修订者个人 @zh-hans
sub property of: tarkastaja (toimija) ekspressiossa
sub property of: ekspression tekijä (henkilö) ekspressiossa
definition: Bir kişiyi, bir kişinin başka bir ifadenin içeriğinde değişiklik yapma katkısını içeren bir anlatımla ilişkilendirir. @tr
definition: Correla una persona a un'espressione che comprende un contributo di una persona nell'apportare modifiche al contenuto di un'altra espressione. @it
definition: Hozzákapcsol egy személyt egy kifejezési formához, amely magában foglalja egy személy közreműködését egy másik kifejezési forma tartalmának megváltoztatásában. @hu
definition: Liittää henkilön ekspressioon, jossa henkilö on osallisena ekspression tekemisessä tekemällä muutoksia toisen ekspression sisältöön.
definition: Met une personne en relation avec une expression qui intègre une contribution de la part d’une personne consistant à apporter des modifications au contenu d’une autre expression. @fr
definition: Relaciona una persona amb una expressió que inclou una contribució d’una persona fent canvis en el contingut d’una altra expressió. @ca
definition: Relateert een persoon aan een expressie die omvat een bijdrage door een persoon door wijzigingen te maken in de content van een andere expressie. @nl
definition: Relaterer en person til et udtryk, som omfatter en persons bidrag ved at foretage ændringer i indholdet af et andet udtryk. @da
definition: Relaterer en person til et uttrykk som inkluderer et bidrag fra en person i form av å gjøre endringer i innholdet av et annet uttrykk. @no
definition: Relates a person to an expression that includes a contribution by a person of making changes to the content of another expression. @en
definition: Sasaista personu ar izteiksmi, kas ietver personas ieguldījumu, veicot izmaiņas citas izteiksmes saturā. @lv
definition: Seostab isiku väljendusega, millesse isik on andnud panuse, tehes muudatusi teise väljenduse sisusse. @et
definition: Setzt eine Person in Beziehung zu einer Expression, zu der eine Person beiträgt, indem sie am Inhalt einer anderen Expression Veränderungen vornimmt. @de
definition: يربط شخصا بتعبيرة تتضمن إسهام شخص لإجراء تغييرات على محتوى تعبيرة أخرى. @ar
definition: 将一个个人与包括对另一种内容表达的内容作改动的一个个人的贡献的一种内容表达关联起来。 @zh-hans

piirtäjä (henkilö) ekspressiossa
has element type: 2
toolkit definition: An expression that includes a contribution by a person of making detailed plans or drawings for buildings, ships, aircraft, machines, objects, etc. @en
toolkit definition: Binalar, gemiler, uçaklar, makineler, nesneler vb. için ayrıntılı planlar veya çizimler yapan bir kişinin katkısını içeren bir anlatım. @tr
toolkit definition: Een expressie die omvat een bijdrage door een persoon door het maken van gedetailleerde plattegronden of tekeningen voor gebouwen, schepen, luchtvaartuigen, machines, voorwerpen etc. @nl
toolkit definition: Egy kifejezési forma, amely magában foglalja egy személy közreműködését épületek, hajók, repülőgépek, gépek, objektumok, stb. részletes terveinek vagy rajzainak elkészítésében. @hu
toolkit definition: Eine Expression, zu der eine Person beiträgt, indem sie detaillierte Pläne oder Zeichnungen für Gebäude, Schiffe, Flugzeuge, Maschinen, Objekte oder ähnliches erstellt. @de
toolkit definition: Ekspressio, jonka tekemisessä henkilö on osallisena tuottamalla tarkkoja suunnitelmia tai piirroksia rakennuksista, laivoista, lentokoneista, laitteista, esineistä tms.
toolkit definition: Espressione che comprende un contributo di una persona nel fare progetti o disegni dettagliati per edifici, navi, aerei, macchine, oggetti, etc. @it
toolkit definition: Et uttrykk som inkluderer et bidrag fra en person i form av å lage detaljerte plantegninger for bygninger, skip, fly, maskiner, gjenstander, etc. @no
toolkit definition: Expression qui intègre une contribution de la part d’une personne consistant à effectuer des plans ou des dessins détaillés pour des bâtiments, des navires, des avions, des machines, des objets, etc. @fr
toolkit definition: Expressió que inclou una contribució d’una persona elaborant plànols o dibuixos detallats d’edificis, de vaixells, d’avions, de màquines, d’objectes, etc. @ca
toolkit definition: Izteiksme, kas ietver personas ieguldījumu, izstrādājot ēku, kuģu, lidmašīnu, mašīnu, objektu utt. detalizētus plānus vai rasējumus. @lv
toolkit definition: Udtryk, som omfatter en persons bidrag ved at lave detaljerede planer eller tegninger til bygninger, skibe, luftfartøj, maskiner, objekter etc. @da
toolkit definition: Väljendus, millesse isik on andnud panuse, tehes täpseid plaane või jooniseid ehitistele, laevadele, lennukitele, masinatele vm objektidele. @et
toolkit definition: تعبيرة تتضمن إسهام شخص في وضع خطط أو رسومات مفصلة للمباني والسفن والطائرات والآلات والأشياء، إلخ. @ar
toolkit definition: 包括为建筑物、船舶、飞行器、机械装置、物体等制作详细平面图或绘制草图的一个个人的贡献的一种内容表达 @zh-hans
toolkit label: Person als Technische Zeichnerin/Technischer Zeichner von @de
toolkit label: disegnatore industriale persona di @it
toolkit label: draftsman person of @en
toolkit label: ir rasētājs (persona) @lv
toolkit label: joonestaja (isik) väljenduses @et
toolkit label: műszaki rajzoló személye: @hu
toolkit label: person, som er teknisk tegner af @da
toolkit label: persona delineant de @ca
toolkit label: personne dessinatrice industrielle de @fr
toolkit label: piirtäjä (henkilö) ekspressiossa
toolkit label: tasarımcı @tr
toolkit label: technisch tekenaar-persoon van @nl
toolkit label: teknisk tegner for (person) @no
toolkit label: σχεδιαστής φυσικό πρόσωπο του @el
toolkit label: شخص رسام هندسي @ar
toolkit label: ……的绘图者个人 @zh-hans
has subproperty: P50594
lexical alias: draftsmanPersonOf.en
status: Published
type: Property
domain: C10004
label: er person, som er teknisk tegner af @da
label: er teknisk tegner for (person) @no
label: est une personne dessinatrice industrielle de @fr
label: ir rasētājs (persona) @lv
label: is draftsman person of @en
label: is technisch tekenaar-persoon van @nl
label: ist Person als Technische Zeichnerin/Technischer Zeichner von @de
label: joonestaja (isik) väljenduses @et
label: műszaki rajzoló személye a következőnek: @hu
label: teknik ressam kişisidir @tr
label: è disegnatore industriale persona di @it
label: és persona delineant de @ca
label: είναι σχεδιαστής φυσικό πρόσωπο του @el
label: هو شخص رسام هندسي لـ @ar
label: 是……的绘图者个人 @zh-hans
sub property of: piirtäjä (toimija) ekspressiossa
sub property of: yhdistymään osallinen henkilö ekspressiossa
definition: Bir kişiyi, binalar, gemiler, uçaklar, makineler, nesneler vb. için ayrıntılı planlar veya çizimler yapan bir kişinin katkısını içeren bir anlatımla ilişkilendirir. @tr
definition: Correla una persona a un'espressione che comprende un contributo di una persona nel fare progetti o disegni dettagliati per edifici, navi, aerei, macchine, oggetti, etc. @it
definition: Hozzákapcsol egy személyt egy kifejezési formához, amely magában foglalja egy személy közreműködését épületek, hajók, repülőgépek, gépek, objektumok, stb. részletes terveinek vagy rajzainak elkészítésében. @hu
definition: Liittää henkilön ekspressioon, jonka tekemisessä henkilö on osallisena tuottamalla tarkkoja suunnitelmia tai piirroksia rakennuksista, laivoista, lentokoneista, laitteista, esineistä tms.
definition: Met une personne en relation avec une expression qui intègre une contribution de la part d’une personne consistant à effectuer des plans ou des dessins détaillés pour des bâtiments, des navires, des avions, des machines, des objets, etc. @fr
definition: Relaciona una persona amb una expressió que inclou una contribució d’una persona elaborant plànols o dibuixos detallats d’edificis, de vaixells, d’avions, de màquines, d’objectes, etc. @ca
definition: Relateert een persoon aan een expressie die omvat een bijdrage door een persoon door het maken van gedetailleerde plattegronden of tekeningen voor gebouwen, schepen, luchtvaartuigen, machines, voorwerpen etc. @nl
definition: Relaterer en person til et udtryk, som omfatter en persons bidrag ved at lave detaljerede planer eller tegninger til bygninger, skibe, luftfartøj, maskiner, objekter etc. @da
definition: Relaterer en person til et uttrykk som inkluderer et bidrag fra en person i form av å lage detaljerte plantegninger for bygninger, skip, fly, maskiner, gjenstander, etc. @no
definition: Relates a person to an expression that includes a contribution by a person of making detailed plans or drawings for buildings, ships, aircraft, machines, objects, etc. @en
definition: Sasaista personu ar izteiksmi, kas ietver personas ieguldījumu, izstrādājot ēku, kuģu, lidmašīnu, mašīnu, objektu utt. detalizētus plānus vai rasējumus. @lv
definition: Seostab isiku väljendusega, millesse isik on andnud panuse, tehes täpseid plaane või jooniseid ehitistele, laevadele, lennukitele, masinatele vm objektidele. @et
definition: Setzt eine Person in Beziehung zu einer Expression, zu der eine Person beiträgt, indem sie detaillierte Pläne oder Zeichnungen für Gebäude, Schiffe, Flugzeuge, Maschinen, Objekte oder ähnliches erstellt. @de
definition: يربط شخصا بتعبيرة تتضمن إسهام شخص في وضع خطط أو رسومات مفصلة للمباني والسفن والطائرات والآلات والأشياء، إلخ. @ar
definition: 将一个个人与包括为建筑物、船舶、飞行器、机械装置、物体等制作详细平面图或绘制草图的一个个人的贡献的一种内容表达关联起来。 @zh-hans

ääniteknikko (henkilö) ekspressiossa
has element type: 2
toolkit definition: An expression that includes a contribution by a person of managing the technical aspects of sound during the processes of recording, mixing, and reproduction. @en
toolkit definition: Een expressie die omvat een bijdrage door een persoon door beheren van de technische aspecten van geluid gedurende de procedures van opname, mixen en reproductie. @nl
toolkit definition: Egy kifejezési forma, amely magában foglalja egy személy közreműködését a hang technikai vonatkozásainak kezelésében a rögzítés, a keverés és a sokszorosítás folyamatában. @hu
toolkit definition: Eine Expression, zu der eine Person beiträgt, indem sie die technischen Aspekte für den Ton während der Aufnahme, des Misch-Verfahrens und der Vervielfältigung handhabt. @de
toolkit definition: Ekspressio, jossa henkilö on osallisena ekspression tekemisessä huolehtimalla äänen teknisistä näkökohdista äänitys-, miksaus- ja äänentoistoprosessien aikana.
toolkit definition: Espressione che comprende un contributo di una persona nella gestione degli aspetti tecnici del suono durante i processi di registrazione, missaggio e riproduzione. @it
toolkit definition: Et uttrykk som inkluderer et bidrag fra en person i form av å styre de tekniske aspektene ved lyd under innspilling, miksing og gjengivelse. @no
toolkit definition: Expression qui intègre une contribution de la part d’une personne consistant à gérer les aspects techniques du son durant les processus d’enregistrement, de mixage et de reproduction. @fr
toolkit definition: Expressió que inclou una contribució d’una persona gestionant els aspectes tècnics del so durant els processos d’enregistrament, mescla i reproducció. @ca
toolkit definition: Izteiksme, kas ietver personas ieguldījumu, pārvaldot skaņas tehnisko aspektu ierakstīšanas, miksēšanas un pavairošanas laikā. @lv
toolkit definition: Kayıt, miksaj ve reprodüksiyon süreçlerinde sesin teknik yönlerini yöneten bir kişinin katkısını içeren bir anlatım. @tr
toolkit definition: Udtryk, som omfatter en persons bidrag ved at håndtere de tekniske lydaspekter under indspilning, mixning og reproduktion. @da
toolkit definition: Väljendus, millesse isik on andnud panuse, tegeldes heli tehniliste aspektidega salvestamise, miksimise ja taasesituse protsesside ajal. @et
toolkit definition: تعبيرة تتضمن إسهام شخص في إدارة الجوانب الفنية للصوت أثناء عمليات التسجيل والمزج والاستنساخ. @ar
toolkit definition: 包括声音的录制、合成和复制过程技术方面管理的一个个人的贡献的一种内容表达 @zh-hans
toolkit label: Person als Tontechnikerin/Tontechniker von @de
toolkit label: audio engineer person of @en
toolkit label: geluidstechnicus-persoon van @nl
toolkit label: hangmester személye: @hu
toolkit label: heliinsener (isik) väljenduses @et
toolkit label: ingegnere del suono persona di @it
toolkit label: ir skaņu inženieris (persona) @lv
toolkit label: lydtekniker for (person) @no
toolkit label: person, som er lydtekniker af @da
toolkit label: persona enginyera d’àudio de @ca
toolkit label: personne ingénieure du son de @fr
toolkit label: ses mühendisi @tr
toolkit label: ääniteknikko (henkilö) ekspressiossa
toolkit label: μηχανικός ήχου φυσικό πρόσωπο του @el
toolkit label: شخص مهندس صوت @ar
toolkit label: ……的音频工程师个人 @zh-hans
has subproperty: miksaaja (henkilö) ekspressiossa
has subproperty: äänittäjä (henkilö) ekspressiossa
has subproperty: P50595
lexical alias: audioEngineerPersonOf.en
status: Published
type: Property
domain: C10004
label: er lydtekniker for (person) @no
label: er person, som er lydtekniker af @da
label: est une personne ingénieure du son de @fr
label: hangmester személye a következőnek: @hu
label: heliinsener (isik) väljenduses @et
label: ir skaņu inženieris (persona) @lv
label: is audio engineer person of @en
label: is geluidstechnicus-persoon van @nl
label: ist Person als Tontechnikerin/Tontechniker von @de
label: ses mühendisi kişisidir @tr
label: è ingegnere del suono persona di @it
label: és persona enginyera d’àudio de @ca
label: είναι μηχανικός ήχου φυσικό πρόσωπο του @el
label: هو شخص مهندس صوت لـ @ar
label: 是……的音频工程师个人 @zh-hans
sub property of: ääniteknikko (toimija) ekspressiossa
sub property of: esitykseen osallinen henkilö ekspressiossa
definition: Bir kişiyi, kayıt, miksaj ve çoğaltma süreçlerinde sesin teknik yönlerini yöneten bir kişinin katkısını içeren bir anlatımla ilişkilendirir. @tr
definition: Correla una persona a un'espressione che comprende un contributo di una persona nella gestione degli aspetti tecnici del suono durante i processi di registrazione, missaggio e riproduzione. @it
definition: Hozzákapcsol egy személyt egy kifejezési formához, amely magában foglalja egy személy közreműködését a hang technikai vonatkozásainak kezelésében a rögzítés, a keverés és a sokszorosítás folyamatában. @hu
definition: Liittää henkilön ekspressioon, jossa henkilö on osallisena ekspression tekemisessä huolehtimalla äänen teknisistä näkökohdista äänitys-, miksaus- ja äänentoistoprosessien aikana.
definition: Met une personne en relation avec une expression qui intègre une contribution de la part d’une personne consistant à gérer les aspects techniques du son durant les processus d’enregistrement, de mixage et de reproduction. @fr
definition: Relaciona una persona amb una expressió que inclou una contribució d’una persona gestionant els aspectes tècnics del so durant els processos d’enregistrament, mescla i reproducció. @ca
definition: Relateert een persoon aan een expressie die omvat een bijdrage door een persoon door beheren van de technische aspecten van geluid gedurende de procedures van opname, mixen en reproductie. @nl
definition: Relaterer en person til et udtryk, som omfatter en persons bidrag ved at håndtere de tekniske lydaspekter under indspilning, mixning og reproduktion. @da
definition: Relaterer en person til et uttrykk som inkluderer et bidrag fra en person i form av å styre de tekniske aspektene ved lyd under innspilling, miksing og gjengivelse. @no
definition: Relates a person to an expression that includes a contribution by a person of managing the technical aspects of sound during the processes of recording, mixing, and reproduction. @en
definition: Sasaista personu ar izteiksmi, kas ietver personas ieguldījumu, pārvaldot skaņas tehnisko aspektu ierakstīšanas, miksēšanas un pavairošanas laikā. @lv
definition: Seostab isiku väljendusega, millesse isik on andnud panuse, tegeldes heli tehniliste aspektidega salvestamise, miksimise ja taasesituse protsesside ajal. @et
definition: Setzt eine Person in Beziehung zu einer Expression, zu der eine Person beiträgt, indem sie die technischen Aspekte für den Ton während der Aufnahme, des Misch-Verfahrens und der Vervielfältigung handhabt. @de
definition: يربط شخصا بتعبيرة تتضمن إسهام شخص في إدارة الجوانب الفنية للصوت أثناء عمليات التسجيل، والمزج، والاستنساخ. @ar
definition: 将一个个人与包括声音的录制、合成和复制过程技术方面管理的一个个人的贡献的一种内容表达关联起来。 @zh-hans

nukettaja (henkilö) ekspressiossa
has element type: 2
toolkit definition: An expression that includes a contribution by a person of manipulating, controlling, or directing puppets or marionettes in a moving image production or a musical or dramatic presentation or entertainment. @en
toolkit definition: Een expressie die omvat een bijdrage van een persoon in het manipuleren, sturen of regisseren van poppen of marionetten in een bewegend beeld-productie of in een muziek- of dramapresentatie of vermaak. @nl
toolkit definition: Egy kifejezési forma, amely magában foglalja egy személy közreműködését bábok vagy marionettfigurák manipulálásában, vezérlésében vagy irányításában egy mozgókép-produkcióban, zenei vagy drámai bemutatóban vagy szórakoztató műsorban. @hu
toolkit definition: Eine Expression, zu der eine Person beiträgt, indem sie Puppen oder Marionetten in einer Bewegtbildproduktion oder einer musikalischen oder dramatischen Darbietung oder Aufführung bewegt, kontrolliert oder lenkt. @de
toolkit definition: Ekspressio, jonka tekemisessä henkilö on osallisena käsittelemällä, kontrolloimalla tai ohjaamalla nukkeja tai marionetteja elokuvatuotannossa tai musiikki- tai näytelmäesityksessä.
toolkit definition: Espressione che comprende un contributo di una persona nella manipolazione, controllo o direzione di burattini o marionette in una produzione di immagini in movimento o una presentazione o spettacolo musicale o drammatico. @it
toolkit definition: Et uttrykk som inkluderer et bidrag fra en person i form av å manipulere, kontrollere eller styre dukker eller marionetter i en produksjon med levende bilder eller en musikalsk eller dramatisk forestilling eller underholdning. @no
toolkit definition: Expression qui intègre une contribution de la part d’une personne consistant à manipuler, à contrôler ou à diriger des marionnettes dans une production d’images animées ou bien dans une présentation ou un spectacle musical ou dramatique. @fr
toolkit definition: Expressió que inclou una contribució d’una persona manipulant, controlant o dirigint titelles o marionetes en una producció d’imatge en moviment o en una representació o un espectacle musical o dramàtic. @ca
toolkit definition: Hareketli bir görüntü üretiminde veya müzikal veya dramatik bir sunumda veya eğlencede kuklaları manipüle eden, kontrol eden veya yöneten bir kişinin katkısını içeren bir anlatım. @tr
toolkit definition: Izteiksme, kas ietver personas ieguldījumu, manipulējot, kontrolējot vai vadot lelles vai marionetes, radot kustīgu attēlu vai muzikālu, vai dramatisku prezentāciju vai izklaidei. @lv
toolkit definition: Udtryk, som omfatter en persons bidrag ved at manipulere, styre eller føre dukker eller marionetter i en levende billedproduktion eller en musikalsk eller dramatisk præsentation eller underholdning. @da
toolkit definition: Väljendus, millesse isik on andnud panuse, käsitsedes, kontrollides või juhtides nukke või marionette filmi tootmisel, muusika- või draamaetenduses või meelelahutusüritusel. @et
toolkit definition: تعبيرة تتضمن إسهام شخص باللعب بالعرائس أو الدمى المتحركة أو التحكم فيها، أو توجيهها في إنتاج لصور متحركة أو في عرض موسيقي أو درامي أو ترفيهي. @ar
toolkit definition: 包括有在动态图像制作或者音乐或戏剧呈现或娱乐中操纵、控制、指引木偶的一个个人的贡献的一种内容表达 @zh-hans
toolkit label: Kuklacı @tr
toolkit label: Person als Puppenspielerin/Puppenspieler von @de
toolkit label: bábjátékos személye: @hu
toolkit label: dukkefører for (person) @no
toolkit label: ir leļļu teātra aktieris (persona) @lv
toolkit label: marionettista persona di @it
toolkit label: nukettaja (henkilö) ekspressiossa
toolkit label: nukujuht (isik) väljenduses @et
toolkit label: person, som er dukkefører af @da
toolkit label: persona titellaire de @ca
toolkit label: personne marionnettiste de @fr
toolkit label: poppenspeler-persoon van @nl
toolkit label: puppeteer person of @en
toolkit label: κουκλοπαίκτης φυσικό πρόσωπο του @el
toolkit label: شخص محرك عرائس @ar
toolkit label: ……的木偶表演者个人 @zh-hans
has subproperty: P50596
lexical alias: puppeteerPersonOf.en
status: Published
type: Property
domain: C10004
label: bábjátékos személye a következőnek: @hu
label: er dukkefører for (person) @no
label: er person, som er dukkefører af @da
label: est une personne marionnettiste de @fr
label: ir leļļu teātra aktieris (persona) @lv
label: is poppenspeler-persoon van @nl
label: is puppeteer person of @en
label: ist Person als Puppenspielerin/Puppenspieler von @de
label: kuklacı kişisidir @tr
label: nukujuht (isik) väljenduses @et
label: è marionettista persona di @it
label: és persona titellaire de @ca
label: είναι κουκλοπαίκτης φυσικό πρόσωπο του @el
label: هو شخص محرك عرائس لـ @ar
label: 是……的木偶表演者个人 @zh-hans
sub property of: nukettaja (toimija) ekspressiossa
sub property of: esittäjä (henkilö) ekspressiossa
definition: Bir kişiyi, hareketli bir görüntü üretiminde müzikal veya dramatik bir sunumda, eğlencede kuklaları veya kuklaları manipüle etme, kontrol etme veya yönetme katkısını içeren bir anlatımla ilişkilendirir. @tr
definition: Correla una persona a un'espressione che comprende un contributo di una persona nella manipolazione, controllo o direzione di burattini o marionette in una produzione di immagini in movimento o una presentazione o spettacolo musicale o drammatico. @it
definition: Hozzákapcsol egy személyt egy kifejezési formához, amely magában foglalja egy személy közreműködését bábok vagy marionettfigurák manipulálásában, vezérlésében vagy irányításában egy mozgókép-produkcióban, zenei vagy drámai bemutatóban vagy szórakoztató műsorban. @hu
definition: Liittää henkilön ekspressioon, jonka tekemisessä henkilö on osallisena käsittelemällä, kontrolloimalla tai ohjaamalla nukkeja tai marionetteja elokuvatuotannossa tai musiikki- tai näytelmäesityksessä.
definition: Met une personne en relation avec une expression qui intègre une contribution de la part d’une personne consistant à manipuler, à contrôler ou à diriger des marionnettes dans une production d’images animées ou bien dans une présentation ou un spectacle musical ou dramatique. @fr
definition: Relaciona una persona amb una expressió que inclou una contribució d’una persona manipulant, controlant o dirigint titelles o marionetes en una producció d’imatge en moviment o en una representació o un espectacle musical o dramàtic. @ca
definition: Relateert een persoon aan een expressie die omvat een bijdrage van een persoon in het manipuleren, sturen of regisseren van poppen of marionetten in een bewegend beeld-productie of in een muziek- of dramapresentatie of vermaak. @nl
definition: Relaterer en person til et udtryk, som omfatter en persons bidrag ved at manipulere, styre eller føre dukker eller marionetter i en levende billedproduktion eller en musikalsk eller dramatisk præsentation eller underholdning. @da
definition: Relaterer en person til et uttrykk som inkluderer et bidrag fra en person i form av å manipulere, kontrollere eller styre dukker eller marionetter i en produksjon med levende bilder eller en musikalsk eller dramatisk forestilling eller underholdning. @no
definition: Relates a person to an expression that includes a contribution by a person of manipulating, controlling, or directing puppets or marionettes in a moving image production or a musical or dramatic presentation or entertainment @en
definition: Sasaista personu ar izteiksmi, kas ietver personas ieguldījumu, manipulējot, kontrolējot vai vadot lelles vai marionetes, radot kustīgu attēlu vai muzikālu, vai dramatisku prezentāciju vai izklaidei. @lv
definition: Seostab isiku väljendusega, millesse isik on andnud panuse, käsitsedes, kontrollides või juhtides nukke või marionette filmi tootmisel, muusika- või draamaetenduses või meelelahutusüritusel. @et
definition: Setzt eine Person in Beziehung zu einer Expression, zu der eine Person beiträgt, indem sie Puppen oder Marionetten in einer Bewegtbildproduktion oder einer musikalischen oder dramatischen Darbietung oder Aufführung bewegt, kontrolliert oder lenkt. @de
definition: يربط شخصا بتعبيرة تتضمن إسهام شخص باللعب بالعرائس أو الدمى المتحركة أو التحكم فيها، أو توجيهها في إنتاج لصور متحركة أو في عرض موسيقي أو درامي أو ترفيهي. @ar
definition: 将一个个人与包括有在动态图像制作或者音乐或戏剧呈现或娱乐中操纵、控制、指引木偶的一个个人的贡献的一种内容表达关联起来。 @zh-hans

miksaaja (henkilö) ekspressiossa
has element type: 2
toolkit definition: An expression that includes a contribution by a person of manipulating, mixing and assembling the multiple tracks of an audio recording. @en
toolkit definition: Bir ses kaydının birden çok parçasını manipüle eden, karıştıran ve bir araya getiren bir kişinin katkısını içeren bir anlatım. @tr
toolkit definition: Een expressie die omvat een bijdrage door een persoon door manipuleren, mixen en samenstellen van meerdere sporen van een geluidsopname. @nl
toolkit definition: Egy kifejezési forma, amely magában foglalja egy személy közreműködését egy hangfelvétel sávjainak manipulálásában, keverésében és összeállításában. @hu
toolkit definition: Eine Expression, zu der eine Person beiträgt, indem sie mehrere Tonspuren einer Aufnahme bearbeitet, mischt und zusammenlegt. @de
toolkit definition: Ekspressio, jossa henkilö on osallisena ekspression äänisisällön tekemisessä käsittelemällä, miksaamalla ja yhdistelemällä useampia äänitteen raitoja.
toolkit definition: Espressione che comprende un contributo di una persona nella manipolazione, missaggio e assemblaggio delle tracce multiple di una registrazione audio. @it
toolkit definition: Et uttrykk som inkluderer et bidrag fra en person i form av å manipulere, mikse og sette sammen de ulike sporene i et lydopptak. @no
toolkit definition: Expression qui intègre une contribution de la part d’une personne consistant à manipuler, à mixer et à assembler les différentes pistes d’un enregistrement audio. @fr
toolkit definition: Expressió que inclou una contribució d’una persona en la manipulació, la mescla i el muntatge de les diverses pistes d’un enregistrament àudio. @ca
toolkit definition: Izteiksme, kas ietver personas ieguldījumu, miksējot un montējot audio ieraksta vairākus celiņus. @lv
toolkit definition: Udtryk, som omfatter en persons bidrag ved at manipulere, mixe og samle de forskellige lydspor på en optagelse. @da
toolkit definition: Väljendus, millesse isik on andnud panuse, töödeldes, miksides ja monteerides mitmerealise salvestise heliradasid. @et
toolkit definition: تعبيرة تتضمن إسهام شخص في معالجة المسارات المتعددة لتسجيل صوتي ومزجها وتجميعها. @ar
toolkit definition: 包括操纵、合成和聚集一个录音的多个音轨的一个个人的贡献的一种内容表达 @zh-hans
toolkit label: Person als Mischtontechnikerin/Mischtontechniker von @de
toolkit label: Ses mühendisi kişisi @tr
toolkit label: hangkeverő személye: @hu
toolkit label: ingegnere del missaggio persona di @it
toolkit label: ir skaņu miksētājs (persona) @lv
toolkit label: miksaaja (henkilö) ekspressiossa
toolkit label: miksetekniker for (person) @no
toolkit label: miksimisinsener (isik) väljenduses @et
toolkit label: mixing engineer person of @en
toolkit label: mixtechnicus-persoon van @nl
toolkit label: person, som er mixingtekniker af @da
toolkit label: persona enginyera de remescla de @ca
toolkit label: personne mixeuse de son de @fr
toolkit label: μηχανικός μείξης φυσικό πρόσωπο του @el
toolkit label: شخص مهندس مكساج @ar
toolkit label: ……的合成工程师个人 @zh-hans
has subproperty: P50597
lexical alias: mixingEngineerPersonOf.en
status: Published
type: Property
domain: C10004
label: er miksetekniker for (person) @no
label: er person, som er mixingtekniker af @da
label: est une personne mixeuse de son de @fr
label: hangkeverő személye a következőnek: @hu
label: ir skaņu miksētājs (persona) @lv
label: is mixing engineer person of @en
label: is mixtechnicus-persoon van @nl
label: ist Person als Mischtontechnikerin/Mischtontechniker von @de
label: miksimisinsener (isik) väljenduses @et
label: ses miksaj mühendisi kişisidir @tr
label: è ingegnere del missaggio persona di @it
label: és persona enginyera de remescla de @ca
label: είναι μηχανικός μείξης φυσικό πρόσωπο του @el
label: هو شخص مهندس مكساج لـ @ar
label: 是……的合成工程师个人 @zh-hans
sub property of: miksaaja (toimija) ekspressiossa
sub property of: ääniteknikko (henkilö) ekspressiossa
definition: Bir kişiyi, bir ses kaydının birden çok izini manipüle etme, karıştırma ve birleştirme konusunda bir kişinin katkısını içeren bir anlatımla ilişkilendirir. @tr
definition: Correla una persona a un'espressione che comprende un contributo di una persona nella manipolazione, missaggio e assemblaggio delle tracce multiple di una registrazione audio. @it
definition: Hozzákapcsol egy személyt egy kifejezési formához, amely magában foglalja egy személy közreműködését egy hangfelvétel sávjainak manipulálásában, keverésében és összeállításában. @hu
definition: Liittää henkilön ekspressioon, jossa henkilö on osallisena ekspression äänisisällön tekemisessä käsittelemällä, miksaamalla ja yhdistelemällä useampia äänitteen raitoja.
definition: Met une personne en relation avec une expression qui intègre une contribution de la part d’une personne consistant à manipuler, à mixer et à assembler les différentes pistes d’un enregistrement audio. @fr
definition: Relaciona una persona amb una expressió que inclou una contribució d’una persona en la manipulació, la mescla i el muntatge de les diverses pistes d’un enregistrament àudio. @ca
definition: Relateert een persoon aan een expressie die omvat een bijdrage door een persoon door manipuleren, mixen en samenstellen van meerdere sporen van een geluidsopname. @nl
definition: Relaterer en person til et udtryk, som omfatter en persons bidrag ved at manipulere, mixe og samle de forskellige lydspor på en optagelse. @da
definition: Relaterer en person til et uttrykk som inkluderer et bidrag fra en person i form av å manipulere, mikse og sette sammen de ulike sporene i et lydopptak. @no
definition: Relates a person to an expression that includes a contribution by a person of manipulating, mixing and assembling the multiple tracks of an audio recording. @en
definition: Sasaista personu ar izteiksmi, kas ietver personas ieguldījumu, miksējot un montējot audio ieraksta vairākus celiņus. @lv
definition: Seostab isiku väljendusega, millesse isik on andnud panuse, töödeldes, miksides ja monteerides mitmerealise salvestise heliradasid. @et
definition: Setzt eine Person in Beziehung zu einer Expression, zu der eine Person beiträgt, indem sie für das Aufzeichnen des Protokolls einer Sitzung verantwortlich ist. @de
definition: يربط شخصا بتعبيرة تتضمن إسهام شخص في معالجة المسارات المتعددة لتسجيل صوتي ومزجها وتجميعها. @ar
definition: 将一个个人与包括操纵、合成和聚集一个录音的多个音轨的一个个人的贡献的一种内容表达关联起来。 @zh-hans
scope note: Darunter fallen keine Nachbearbeitungen, die die Art und den Inhalt des Originalwerks substantiell verändern, so dass ein neues Werk entsteht, sowie das Mischen und Zusammenlegen von mehreren Einzelspuren einer Aufnahme. @de
scope note: Ei hõlma remiksimist, mis muudab oluliselt originaalteose olemust ja sisu, nii et tekib uus teos, ega mitmerealise salvestise heliradade miksimist ja monteerimist. @et
scope note: Ei koske uudelleenmiksauksia, jotka olennaisesti muuttavat alkuperäisen teoksen luonnetta ja sisältöä, mikä johtaa uuteen teokseen.
scope note: Neietver remiksēšanas darbību, kas maina sākotnējā darba būtību un saturu, kā rezultātā tiek radīts jauns darbs, kā arī neietver vairāku ieraksta celiņu miksēšanu un montēšanu. @lv
scope note: Nem tartoznak ide azok az új forrást eredményező újrakeverési tevékenységek, amelyek jelentősen megváltoztatják az eredeti forrás jellegét és tartalmát, sem a felvétel több sávjának keverése és összeállítása. @hu
scope note: Orijinal eserin doğasını ve içeriğini önemli ölçüde değiştirerek yeni bir eserle sonuçlanan yeniden karıştırma faaliyetleri hariç tutulur. @tr
scope note: Remiksaktiviteter som i betydelig grad endrer originalverkets særpreg og innhold og som resulterer i et nytt verk, er ikke inkludert. @no
scope note: Remixhandelingen die de aard en content van de oorspronkelijke resource substantieel wijzigen, resulterend in een nieuwe resource, en mixen en samenstellen van meerdere sporen van een opname zijn uitgesloten. @nl
scope note: Remixing activities that substantially change the nature and content of the original work, resulting in a new work, are excluded. @en
scope note: Remixing-aktiviteter, som væsentligt forandrer originalressourcens karakter og indhold og derved resulterer i en nyt ressource, samt mixing og sammensætning af de forskellige spor på en optagelse, er ikke omfattet. @da

DJ (henkilö) ekspressiossa
has element type: 2
toolkit definition: An expression that includes a contribution by a person of mixing recorded tracks together during a live performance or in a recording studio to appear as one continuous track. @en
toolkit definition: Bir canlı performans sırasında veya bir kayıt stüdyosunda kaydedilmiş parçaları tek bir sürekli parça olarak görünecek şekilde bir araya getiren bir kişinin katkısını içeren bir anlatım. @tr
toolkit definition: Een expressie die omvat een bijdrage door een persoon door het samenmixen van geluidssporen gedurende een live optreden of in een opnamestudio om als één doorlopend spoor te lijken. @nl
toolkit definition: Egy kIfejezési forma, amely magában foglalja egy személy közreműködését felvett hangsávok élő előadás közben vagy egy hangstúdióban történő keverésében, hogy azok egy folyamatos műsorszámként jelenjenek meg. @hu
toolkit definition: Eine Expression, zu der eine Person beiträgt, indem sie während eines Live-Auftritts oder in einem Aufnahme-Studio aufgenommene Einzelspuren (Kanäle) zu einem scheinbar ununterbrochen durchgehenden Klangerlebnis zusammen mischt @de
toolkit definition: Ekspressio, jossa henkilö on osallisena ekspression tekemisessä miksaamalla ääniraitoja yhteen yhtäjaksoiseksi raidaksi live-esityksessä tai äänitysstudiossa.
toolkit definition: Espressione che comprende un contributo di una persona nel missaggio di tracce registrate durante un'esibizione dal vivo o in uno studio di registrazione in modo che appaiano come una traccia continua. @it
toolkit definition: Et uttrykk av et verk som innlemmer et bidrag av miksing av innspilte spor i løpet av en liveopptreden eller i et studio for å framstilles som ett kontinuerlig spor. @no
toolkit definition: Expression qui intègre une contribution de la part d’une personne consistant à mixer ensemble des pistes enregistrées, durant une prestation en direct ou dans un studio d’enregistrement, pour donner l’impression d’une seule piste continue. @fr
toolkit definition: Expressió que inclou una contribució d’una persona mesclant pistes enregistrades conjuntament durant una actuació en directe o en un estudi de gravació perquè sembli una pista continua. @ca
toolkit definition: Izteiksme, kas ietver personas ieguldījumu, miksējot ierakstītus mūzikas celiņus dzīvās uzstāšanās laikā vai ierakstu studijā, lai radītu vienu nepārtrauktu ierakstu. @lv
toolkit definition: Udtryk, som omfatter en persons bidrag ved at mixe indspillede spor sammen under en live-optræden eller i et indspilningsstudie, så de fremstår som et uafbrudt spor. @da
toolkit definition: Väljendus, millesse isik on andnud panuse, miksides salvestatud lugusid kokku üheks jätkuvaks looks, tehes seda elavas esituses või salvestusstuudios. @et
toolkit definition: تعبيرة تتضمن إسهام شخص في مزج ألحان مسجلة أثناء أدائها مباشرة أو أثناء تسجيلها في استوديو لتبدو كمقطوعة واحدة مستمرة. @ar
toolkit definition: 包括在现场表演中或在录音工作室中混合已录制音轨使其出现为一个连续的音轨的一个个人的贡献的一种内容表达 @zh-hans
toolkit label: DJ @tr
toolkit label: DJ (henkilö) ekspressiossa
toolkit label: DJ (isik) väljenduses @et
toolkit label: DJ for (person) @no
toolkit label: DJ person of @en
toolkit label: DJ persona di @it
toolkit label: DJ személye: @hu
toolkit label: DJ φυσικό πρόσωπο του @el
toolkit label: Person als DJane/DJ von @de
toolkit label: deejay-persoon van @nl
toolkit label: ir dīdžejs (persona) @lv
toolkit label: person, som er dj af @da
toolkit label: persona discjòquei de @ca
toolkit label: personne disque-jockey de @fr
toolkit label: شخص منسق دي جي @ar
toolkit label: ……的打碟者个人 @zh-hans
has subproperty: P50598
lexical alias: djPersonOf.en
status: Published
type: Property
domain: C10004
label: DJ (isik) väljenduses @et
label: DJ kişisidir @tr
label: DJ személye a következőnek: @hu
label: er DJ for (person) @no
label: er person, som er dj af @da
label: est une personne disque-jockey de @fr
label: ir dīdžejs (persona) @lv
label: is DJ person of @en
label: is deejay-persoon van @nl
label: ist Person als DJane/DJ von @de
label: è DJ persona di @it
label: és persona discjòquei de @ca
label: είναι DJ φυσικό πρόσωπο του @el
label: هو شخص منسق دي جي لـ @ar
label: 是……的打碟者个人 @zh-hans
sub property of: DJ (toimija) ekspressiossa
sub property of: esitykseen osallinen henkilö ekspressiossa
alternative label: personne DJ de @fr
alternative label: personne disc-jockey de @fr
definition: Bir kişiyi, kişinin canlı bir performans sırasında veya bir kayıt stüdyosunda kaydedilmiş parçaları bir araya getirerek tek bir sürekli parça olarak görünmesi için yaptığı katkıyı içeren bir anlatımla ilişkilendirir. @tr
definition: Correla una persona a un'espressione che comprende un contributo di una persona nel missaggio di tracce registrate durante un'esibizione dal vivo o in uno studio di registrazione in modo che appaiano come una traccia continua. @it
definition: Hozzákapcsol egy személyt egy kifejezési formához, amely magában foglalja egy személy közreműködését felvett hangsávok élő előadás közben vagy egy hangstúdióban történő keverésében, hogy azok egy folyamatos műsorszámként jelenjenek meg. @hu
definition: Liittää henkilön ekspressioon, jossa henkilö on osallisena ekspression tekemisessä miksaamalla ääniraitoja yhteen yhtäjaksoiseksi raidaksi live-esityksessä tai äänitysstudiossa.
definition: Met une personne en relation avec une expression qui intègre une contribution de la part d’une personne consistant à mixer ensemble des pistes enregistrées, durant une prestation en direct ou dans un studio d’enregistrement, pour donner l’impression d’une seule piste continue. @fr
definition: Relaciona una persona amb una expressió que inclou una contribució d’una persona mesclant pistes enregistrades conjuntament durant una actuació en directe o en un estudi de gravació perquè sembli una pista continua. @ca
definition: Relateert een persoon aan een expressie die omvat een bijdrage door een persoon door het samenmixen van geluidssporen gedurende een live optreden of in een opnamestudio om als één doorlopend spoor te lijken. @nl
definition: Relaterer en person til et udtryk, som omfatter en persons bidrag ved at mixe indspillede spor sammen under en live-optræden eller i et indspilningsstudie, så de fremstår som et uafbrudt spor. @da
definition: Relaterer en person til et uttrykk av et verk som innlemmer et bidrag av miksing av innspilte spor i løpet av en liveopptreden eller i et studio for å framstilles som ett kontinuerlig spor. @no
definition: Relates a person to an expression that includes a contribution by a person of mixing recorded tracks together during a live performance or in a recording studio to appear as one continuous track. @en
definition: Sasaista personu ar izteiksmi, kas ietver personas ieguldījumu, miksējot ierakstītus mūzikas celiņus dzīvās uzstāšanās laikā vai ierakstu studijā, lai radītu vienu nepārtrauktu ierakstu. @lv
definition: Seostab isiku väljendusega, millesse isik on andnud panuse, miksides salvestatud lugusid kokku üheks jätkuvaks looks, tehes seda elavas esituses või salvestusstuudios. @et
definition: Setzt eine Person in Beziehung zu einer Expression, zu der eine Person beiträgt, indem sie während eines Live-Auftritts oder in einem Aufnahme-Studio aufgenommene Einzelspuren (Kanäle) zu einem scheinbar ununterbrochen durchgehenden Klangerlebnis zusammen mischt. @de
definition: يربط شخصا بتعبيرة تتضمن إسهام شخص في مزج ألحان مسجلة أثناء أدائها مباشرة أو أثناء تسجيلها في استوديو لتبدو كمقطوعة واحدة مستمرة. @ar
definition: 将一个个人与包括在现场表演中或在录音工作室中混合已录制音轨使其出现为一个连续的音轨的一个个人的贡献的一种内容表达关联起来。 @zh-hans
scope note: Darunter fallen keine Nachbearbeitungen, die die Art und den Inhalt des Originalwerks substantiell verändert, so dass ein neues Werk entsteht, sowie das Mischen und Zusammenlegen von mehreren Einzelspuren einer Aufnahme. @de
scope note: Ei koske uudelleenmiksauksia, jotka olennaisesti muuttavat alkuperäisen teoksen luonnetta ja sisältöä, mikä johtaa uuteen teokseen, eikä äänitteen useampien raitojen miksaamista ja yhdistelyä.
scope note: Espressione di un'opera che incorpora un contributo nel missaggio di tracce registrate durante un'esibizione dal vivo o in uno studio di registrazione in modo che appaiano come una traccia continua. @it
scope note: Et uttrykk av et verk som innlemmer et bidrag av miksing av innspilte spor i løpet av en liveopptreden eller i et studio for å framstilles som ett kontinuerlig spor. @no
scope note: Neietver miksēšanas darbības, kas būtiski maina oriģināldarba būtību un saturu, radot jaunu darbu, kā arī ieraksta vairāku celiņu miksēšanu un montāžu. @lv
scope note: Nem tartoznak ide azok az új művet eredményező újrakeverési tevékenységek, amelyek jelentősen megváltoztatják az eredeti mű jellegét és tartalmát, sem a felvétel több sávjának keverése és összeállítása. @hu
scope note: Orijinal bir eserin niteliğini ve içeriğini büyük ölçüde değiştirerek yeni bir eser ortaya çıkaran remiks faaliyetleri ve bir kaydın birden fazla parçasının karıştırılması ve birleştirilmesi hariçtir. @tr
scope note: Remixhandelingen die de aard en content van een oorspronkelijk werk substantieel wijzigen, resulterend in een nieuw werk, en mixen en samenstellen van meerdere sporen van een geluidsopname, zijn uitgesloten. @nl

lavastaja (henkilö) ekspressiossa
has element type: 2
toolkit definition: An expression that includes a contribution by a person of overseeing artists and craftspeople who build sets for moving image productions. @en
toolkit definition: Een expressie die omvat een bijdrage door een persoon door toezicht houden op kunstenaars en ambachtslieden die decors bouwen voor bewegend beeld-producties. @nl
toolkit definition: Egy kifejezési forma, amely magában foglalja egy személy közreműködését, aki mozgókép-produkciókhoz díszletépítő művészeket és mesterembereket felügyel. @hu
toolkit definition: Eine Expression, zu der eine Person beiträgt, indem sie Künstlerinnen/Künstler und Kunsthandwerkerinnen/Kunsthandwerker betreut, die Sets für Bewegtbildproduktionen aufbauen. @de
toolkit definition: Ekspressio, jonka tekemisessä henkilö on osallisena valvomalla taiteilijoita ja käsityöläisiä, jotka rakentavat lavasteita elokuvatuotantoihin.
toolkit definition: Espressione che comprende un contributo di una persona nella supervisione di artisti e artigiani che costruiscono scenografie per produzioni di immagini in movimento. @it
toolkit definition: Et uttrykk som inkluderer et bidrag fra en person i form av å lede kunstnerne og håndverkerne som bygger kulissene for spillefilmproduksjoner. @no
toolkit definition: Expression qui intègre une contribution de la part d’une personne consistant à superviser les artistes et les artisans qui construisent les décors pour des productions d’images animées. @fr
toolkit definition: Expressió que inclou una contribució d’una persona supervisant els artistes i els artesans que construeixen els decorats de les produccions d’imatge en moviment. @ca
toolkit definition: Hareketli görüntü prodüksiyonları için setler inşa eden sanatçılar ve zanaatkarlardan oluşan bir kişinin katkısını içeren bir anlatım. @tr
toolkit definition: Izteiksme, kas ietver personas ieguldījumu, uzraugot māksliniekus un meistarus, kuri darbojas kustīgu attēlu veidošanā. @lv
toolkit definition: Udtryk, som omfatter en persons bidrag ved at føre tilsyn med kunstnere og håndværkere, som bygger kulisser til levende billedproduktioner. @da
toolkit definition: Väljendus, millesse isik on andnud panuse, juhendades kunstnikke ja oskustöölisi, kes valmistavad filmi tootmise jaoks dekoratsioonid ja rekvisiidid. @et
toolkit definition: تعبيرة تتضمن إسهام شخص بالإشراف على الفنيين والحرفيين الذين يبنون مواقع لإنتاج الأفلام. @ar
toolkit definition: 包括监督为动态图像制作建造布景的艺术家和艺人的一个个人的贡献的一种内容表达 @zh-hans
toolkit label: Person als Art Director von @de
toolkit label: art director person of @en
toolkit label: artdirector-persoon van @nl
toolkit label: direttore artistico persona di @it
toolkit label: filmikunstnik (isik) väljenduses @et
toolkit label: ir galvenais mākslinieks (persona) @lv
toolkit label: lavastaja (henkilö) ekspressiossa
toolkit label: művészeti vezető személye a következő: @hu
toolkit label: person, som er artdirector af @da
toolkit label: persona directora artística de @ca
toolkit label: personne directrice artistique de @fr
toolkit label: sanat yönetmeni @tr
toolkit label: scenograf for (person) @no
toolkit label: καλλιτεχνικός διευθυντής φυσικό πρόσωπο του @el
toolkit label: شخص مخرج فني @ar
toolkit label: ……的艺术总监个人 @zh-hans
has subproperty: P50599
lexical alias: artDirectorPersonOf.en
status: Published
type: Property
domain: C10004
label: er person, som er artdirector af @da
label: er scenograf for (person) @no
label: est une personne directrice artistique de @fr
label: filmikunstnik (isik) väljenduses @et
label: ir galvenais mākslinieks (persona) @lv
label: is art director person of @en
label: is artdirector-persoon van @nl
label: ist Person als Art Director von @de
label: művészeti vezető személye a következő: @hu
label: sanat yönetmeni kişisidir @tr
label: è direttore artistico persona di @it
label: és persona directora artística de @ca
label: είναι καλλιτεχνικός διευθυντής φυσικό πρόσωπο του @el
label: هو شخص مخرج فني لـ @ar
label: 是……的艺术总监个人 @zh-hans
sub property of: lavastaja (toimija) ekspressiossa
sub property of: esitykseen osallinen henkilö ekspressiossa
definition: Bir kişiyi, hareketli görüntü prodüksiyonları için setler inşa eden sanatçıları ve zanaatkarları denetleyen bir kişinin katkısını içeren bir anlatımla ilişkilendirir. @tr
definition: Correla una persona a un'espressione che comprende un contributo di una persona nella supervisione di artisti e artigiani che costruiscono scenografie per produzioni di immagini in movimento. @it
definition: Hozzákapcsol egy személyt egy kifejezési formához, amely magában foglalja egy személy közreműködését, aki mozgókép-produkciókhoz díszletépítő művészeket és mesterembereket felügyel. @hu
definition: Liittää henkilön ekspressioon, jonka tekemisessä henkilö on osallisena valvomalla taiteilijoita ja käsityöläisiä, jotka rakentavat lavasteita elokuvatuotantoihin.
definition: Met une personne en relation avec une expression qui intègre une contribution de la part d’une personne consistant à superviser les artistes et les artisans qui construisent les décors pour des productions d’images animées. @fr
definition: Relaciona una persona amb una expressió que inclou una contribució d’una persona supervisant els artistes i els artesans que construeixen els decorats de les produccions d’imatge en moviment. @ca
definition: Relateert een persoon aan een expressie die omvat een bijdrage door een persoon door toezicht houden op kunstenaars en ambachtslieden die decors bouwen voor bewegend beeld-producties. @nl
definition: Relaterer en person til et udtryk, som omfatter en persons bidrag ved at føre tilsyn med kunstnere og håndværkere, som bygger kulisser til levende billedproduktioner. @da
definition: Relaterer en person til et uttrykk som inkluderer et bidrag fra en person i form av å lede kunstnerne og håndverkerne som bygger kulissene for spillefilmproduksjoner. @no
definition: Relates a person to an expression that includes a contribution by a person of overseeing artists and craftspeople who build sets for moving image productions. @en
definition: Sasaista personu ar izteiksmi, kas ietver personas ieguldījumu, uzraugot māksliniekus un meistarus, kuri darbojas kustīgu attēlu veidošanā. @lv
definition: Seostab isiku väljendusega, millesse isik on andnud panuse, juhendades kunstnikke ja oskustöölisi, kes valmistavad filmi tootmise jaoks dekoratsioonid ja rekvisiidid. @et
definition: Setzt eine Person in Beziehung zu einer Expression, zu der eine Person beiträgt, indem sie Künstlerinnen/Künstler und Kunsthandwerkerinnen/Kunsthandwerker betreut, die Sets für Bewegtbildproduktionen aufbauen. @de
definition: يربط شخصا بتعبيرة تتضمن إسهام شخص بالإشراف على الفنيين والحرفيين الذين يبنون مواقع لإنتاج الأفلام. @ar
definition: 将一个个人与包括监督为动态图像制作建造布景的艺术家和艺人的一个个人的贡献的一种内容表达关联起来。 @zh-hans

panelisti (henkilö) ekspressiossa
has element type: 2
toolkit definition: An expression that includes a contribution by a person of participating in a program, often broadcast, where topics are discussed, usually with participation of experts in fields related to the discussion. @en
toolkit definition: Een expressie die omvat een bijdrage van een persoon door deelname aan een programma, vaak uitgezonden, waar onderwerpen worden bediscussieerd, vaak met deelname van experts op gebieden gerelateerd aan de discussie. @nl
toolkit definition: Egy kifejezési forma, amely magában foglalja egy személy közreműködését egy programban, gyakran sugárzott műsorban, való részvételével, amelyen témákat vitatnak meg, rendszerint a beszélgetés témájában jártas szakértők részvételével. @hu
toolkit definition: Eine Expression, zu der eine Person beiträgt, indem sie an einer Veranstaltung (meist in einer Sendung) teilnimmt, in der Themen üblicherweise mit Expertinnen/Experten diskutiert werden. @de
toolkit definition: Ekspressio, jonka tekemisessä henkilö on osallisena panelistina (useimmiten lähetetyssä) ohjelmassa, jossa keskustellaan eri aiheista tavallisesti keskusteluun liittyvien aiheiden asiantuntijoiden kanssa.
toolkit definition: Espressione che comprende un contributo di una persona nella partecipazione in un programma, spesso una trasmissione, in cui si discutono argomenti, solitamente con la partecipazione di esperti in campi relativi alla discussione. @it
toolkit definition: Et uttrykk som inkluderer et bidrag fra en person i form av å delta i et program, gjerne kringkastet, der emner diskuteres, som regel med eksperter innen områder knyttet til diskusjonen, som deltakere. @no
toolkit definition: Expression qui intègre une contribution de la part d’une personne consistant à participer à une activité, souvent diffusée à la radio, à la télévision, etc., où des sujets sont discutés, habituellement avec la participation d’experts dans les domaines reliés à la discussion. @fr
toolkit definition: Expressió que inclou una contribució d’una persona participant en un programa, sovint emès, on es discuteixen temes, habitualment amb la participació d’experts en els camps relacionats amb la discussió. @ca
toolkit definition: Genellikle yayınlanan, konuların tartışıldığı, genellikle tartışmayla ilgili alanlardaki uzmanların katılımıyla bir programa katılan bir kişinin katkısını içeren bir anlatım. @tr
toolkit definition: Izteiksme, kas ietver personas ieguldījumu, piedaloties programmā (parasti apraidē), kurā tiek apspriestas tēmas ar ekspertu līdzdalību. @lv
toolkit definition: Udtryk, som omfatter en persons bidrag ved at deltage i et program, ofte transmitteret, hvor emner diskuteres, normat med deltagelse af fagfolk indenfor felter, som er relateret til diskussionen. @da
toolkit definition: Väljendus, millesse isik on andnud panuse, osaledes saates (sageli ringhäälingus), kus arutatakse mingeid teemasid ja kus tavaliselt osalevad arutatava teemavaldkonna asjatundjad. @et
toolkit definition: تعبيرة تتضمن إسهام شخص بالمشاركة في برنامج، غالبا ما يجري بثه، ومناقشة موضوعات بمشاركة خبراء في المجالات المتعلقة بموضوع النقاش. @ar
toolkit definition: 包括有参与节目（经常是广播节目，其中讨论话题，通常有讨论相关领域专家参与）的一个个人的贡献的一种内容表达 @zh-hans
toolkit label: Person als Diskussionsteilnehmerin/Diskussionsteilnehmer von @de
toolkit label: arutelust osavõtja (isik) väljenduses @et
toolkit label: ir diskusijas dalībnieks (persona) @lv
toolkit label: panel katılımcı kişisi @tr
toolkit label: paneldeltaker for (person) @no
toolkit label: panelist person of @en
toolkit label: panelisti (henkilö) ekspressiossa
toolkit label: panellid-persoon van @nl
toolkit label: partecipante al panel persona di @it
toolkit label: person, som er paneldeltager af @da
toolkit label: persona panelista de @ca
toolkit label: personne panéliste de @fr
toolkit label: vitafórumtag személye: @hu
toolkit label: μέλος λογομήγυρης φυσικό πρόσωπο του @el
toolkit label: شخص مشارك في برنامج @ar
toolkit label: ……的访谈嘉宾个人 @zh-hans
has subproperty: P50600
lexical alias: panelistPersonOf.en
status: Published
type: Property
domain: C10004
label: arutelust osavõtja (isik) väljenduses @et
label: er paneldeltaker for (person) @no
label: er person, som er paneldeltager af @da
label: est une personne panéliste de @fr
label: ir diskusijas dalībnieks (persona) @lv
label: is panelist person of @en
label: is panellid-persoon van @nl
label: ist Person als Diskussionsteilnehmerin/Diskussionsteilnehmer von @de
label: panelist kişisidir @tr
label: vitafórumtag személye a következőnek: @hu
label: è partecipante al panel persona di @it
label: és persona panelista de @ca
label: είναι μέλος λογομήγυρης φυσικό πρόσωπο του @el
label: هو شخص مشارك في برنامج لـ @ar
label: 是……的访谈嘉宾个人 @zh-hans
sub property of: panelisti (toimija) ekspressiossa
sub property of: esittäjä (henkilö) ekspressiossa
definition: Bir kişiyi, genellikle tartışmayla ilgili alanlardaki uzmanların katılımıyla, konuların tartışıldığı genellikle yayınlanan bir programa katılma katkısını içeren bir anlatımla ilişkilendirir. @tr
definition: Correla una persona a un'espressione che comprende un contributo di una persona nella partecipazione in un programma, spesso una trasmissione, in cui si discutono argomenti, solitamente con la partecipazione di esperti in campi relativi alla discussione. @it
definition: Hozzákapcsol egy személyt egy kifejezési formához, amely magában foglalja egy személy közreműködését egy programban, gyakran sugárzott műsorban, való részvételével, amelyen témákat vitatnak meg, rendszerint a beszélgetés témájában jártas szakértők részvételével. @hu
definition: Liittää henkilön ekspressioon, jonka tekemisessä henkilö on osallisena panelistina (useimmiten lähetetyssä) ohjelmassa, jossa keskustellaan eri aiheista tavallisesti keskusteluun liittyvien aiheiden asiantuntijoiden kanssa.
definition: Met une personne en relation avec une expression qui intègre une contribution de la part d’une personne consistant à participer à une activité, souvent diffusée à la radio, à la télévision, etc., où des sujets sont discutés, habituellement avec la participation d’experts dans les domaines reliés à la discussion. @fr
definition: Relaciona una persona amb una expressió que inclou una contribució d’una persona participant en un programa, sovint emès, on es discuteixen temes, habitualment amb la participació d’experts en els camps relacionats amb la discussió. @ca
definition: Relateert een persoon aan een expressie die omvat een bijdrage van een persoon door deelname aan een programma, vaak uitgezonden, waar onderwerpen worden bediscussieerd, vaak met deelname van experts op gebieden gerelateerd aan de discussie. @nl
definition: Relaterer en person til et udtryk, som omfatter en persons bidrag ved at deltage i et program, ofte transmitteret, hvor emner diskuteres, normat med deltagelse af fagfolk indenfor felter, som er relateret til diskussionen. @da
definition: Relaterer en person til et uttrykk som inkluderer et bidrag fra en person i form av å delta i et program, gjerne kringkastet, der emner diskuteres, som regel med eksperter innen områder knyttet til diskusjonen, som deltakere. @no
definition: Relates a person to an expression that includes a contribution by a person of participating in a program, often broadcast, where topics are discussed, usually with participation of experts in fields related to the discussion. @en
definition: Sasaista personu ar izteiksmi, kas ietver personas ieguldījumu, piedaloties programmā (parasti apraidē), kurā tiek apspriestas tēmas ar ekspertu līdzdalību. @lv
definition: Seostab isiku väljendusega, millesse isik on andnud panuse, osaledes saates (sageli ringhäälingus), kus arutatakse mingeid teemasid ja kus tavaliselt osalevad arutatava teemavaldkonna asjatundjad. @et
definition: Setzt eine Person in Beziehung zu einer Expression, zu der eine Person beiträgt, indem sie an einer Veranstaltung (meist in einer Sendung) teilnimmt, in der Themen üblicherweise mit Expertinnen/Experten diskutiert werden. @de
definition: يربط شخصا بتعبيرة تتضمن إسهام شخص بالمشاركة في برنامج، غالبا ما يجري بثه، ومناقشة موضوعات بمشاركة خبراء في المجالات المتعلقة بموضوع النقاش. @ar
definition: 将一个个人与包括有参与节目（经常是广播节目，其中讨论话题，通常有讨论相关领域专家参与）的一个个人的贡献的一种内容表达关联起来。 @zh-hans

tarinankertoja (henkilö) ekspressiossa
has element type: 2
toolkit definition: An expression that includes a contribution by a person of relaying a story with dramatic or theatrical interpretation. @en
toolkit definition: Dramatik veya teatral bir yorumla bir hikayeyi aktaran bir kişinin katkısını içeren bir anlatım. @tr
toolkit definition: Een expressie die omvat een bijdrage door een persoon die een uitvoerder is door het doorvertellen van een oorspronkelijk verhaal met dramatische of theatrale vertolking. @nl
toolkit definition: Egy kifejezési forma, amely magában foglalja egy személy közreműködését egy történet dramatizált vagy színházi interpretációjában. @hu
toolkit definition: Eine Expression, zu der eine Ausführende/ein Ausführender (Person) beiträgt, indem sie/er eine Geschichte mit dramatischer oder theatralischer Interpretation wiedergibt. @de
toolkit definition: Ekspressio, jonka tekemiseen henkilö osallistuu välittämällä tarinan draamallisella tai teatraalisella tulkinnalla.
toolkit definition: Espressione che comprende un contributo di una persona in un'esibizione che riporta una storia originale con un'interpretazione drammatica o teatrale. @it
toolkit definition: Et uttrykk som inkluderer et bidrag fra en person i form av å lese forfatterens originalhistorie med innlevelse eller dramatisk tolkning. @no
toolkit definition: Expression qui intègre une contribution de la part d’une personne consistant à raconter une histoire au moyen d’une interprétation dramatique ou théâtrale. @fr
toolkit definition: Expressió que inclou una contribució d’una persona explicant un conte amb una interpretació dramàtica o teatral. @ca
toolkit definition: Izteiksme, kas ietver personas ieguldījumu, pasniedzot radītāja oriģinālo stāstu ar dramatisku vai teatrālu interpretāciju. @lv
toolkit definition: Udtryk, som omfatter et bidrag af en person, som er optrædende, ved at give en oprindelig historie dramatisk eller teatralsk fortolkning. @da
toolkit definition: Väljendus, millesse isik on andnud panuse, esitades originaallugu draama- või teatritõlgenduses. @et
toolkit definition: تعبيرة تتضمن إسهام شخص بنقل قصة أصلية ووصفها بصورة درامية أو مسرحية. @ar
toolkit definition: 包括有用戏剧化解释转达故事的一个个人的贡献的一种内容表达 @zh-hans
toolkit label: Person als Geschichtenerzählerin/Geschichtenerzähler von @de
toolkit label: hikaye anlatıcı kişi @tr
toolkit label: historieforteller for (person) @no
toolkit label: ir stāstnieks (persona) @lv
toolkit label: jutuvestja (isik) väljenduses @et
toolkit label: person, som er historiefortæller af @da
toolkit label: persona rondallaire de @ca
toolkit label: personne conteuse de @fr
toolkit label: storyteller person of @en
toolkit label: storyteller persona di @it
toolkit label: tarinankertoja (henkilö) ekspressiossa
toolkit label: történetmesélő személye: @hu
toolkit label: verhalenverteller-persoon van @nl
toolkit label: αφηγητής ιστοριών φυσικό πρόσωπο του @el
toolkit label: شخص راوي قصص @ar
toolkit label: ……是说书人个人 @zh-hans
has subproperty: P50601
lexical alias: storytellerPersonOf.en
status: Published
type: Property
domain: C10004
label: er historieforteller for (person) @no
label: er person, som er historiefortæller af @da
label: est une personne conteuse de @fr
label: hikaye anlatıcısı kişisidir @tr
label: ir stāstnieks (persona) @lv
label: is storyteller person of @en
label: is verhalenverteller-persoon van @nl
label: ist Person als Geschichtenerzählerin/Geschichtenerzähler von @de
label: jutuvestja (isik) väljenduses @et
label: történetmesélő személye a következőnek: @hu
label: è storyteller persona di @it
label: és persona rondallaire de @ca
label: είναι αφηγητής ιστοριών φυσικό πρόσωπο του @el
label: هو شخص راوي قصص لـ @ar
label: 是……的说书人个人 @zh-hans
sub property of: tarinankertoja (toimija) ekspressiossa
sub property of: esittäjä (henkilö) ekspressiossa
definition: Bir kişiyi, dramatik veya teatral yorumlama ile bir hikayeyi aktarmaya katkısını içeren bir anlatımla ilişkilendirir. @tr
definition: Correla una persona a un'espressione che comprende un contributo di una persona in un'esibizione che riporta una storia originale con un'interpretazione drammatica o teatrale. @it
definition: Hozzákapcsol egy személyt egy kifejezési formához, amely magában foglalja egy személy közreműködését egy történet dramatizált vagy színházi interpretációjában. @hu
definition: Liittää henkilön ekspressioon, jonka tekemiseen henkilö osallistuu välittämällä tarinan draamallisella tai teatraalisella tulkinnalla.
definition: Met une personne en relation avec une expression qui intègre une contribution de la part d’une personne consistant à raconter une histoire au moyen d’une interprétation dramatique ou théâtrale. @fr
definition: Relaciona una persona amb una expressió que inclou una contribució d’una persona explicant un conte amb una interpretació dramàtica o teatral. @ca
definition: Relateert een persoon aan een expressie die omvat een bijdrage door een persoon die een uitvoerder is door het doorvertellen van een oorspronkelijk verhaal met dramatische of theatrale vertolking. @nl
definition: Relaterer en person til et udtryk, som omfatter bidrag af en person, som er optrædende, ved at give en oprindelig historie dramatisk eller teatralsk fortolkning. @da
definition: Relaterer en person til et uttrykk som inkluderer et bidrag fra en person i form av å lese forfatterens originalhistorie med innlevelse eller dramatisk tolkning. @no
definition: Relates a person to an expression that includes a contribution by a person of relaying a story with dramatic or theatrical interpretation. @en
definition: Sasaista personu ar izteiksmi, kas ietver personas ieguldījumu, pasniedzot radītāja oriģinālo stāstu ar dramatisku vai teatrālu interpretāciju. @lv
definition: Seostab isiku väljendusega, millesse isik on andnud panuse, esitades originaallugu draama- või teatritõlgenduses. @et
definition: Setzt eine Person in Beziehung zu einer Expression, zu der eine Ausführende/ein Ausführender (Person) beiträgt, indem sie/er eine Geschichte mit dramatischer oder theatralischer Interpretation wiedergibt. @de
definition: يربط شخصا بتعبيرة تتضمن إسهام شخص بنقل قصة أصلية ووصفها بصورة درامية أو مسرحية. @ar
definition: 将一个个人与包括有用戏剧化解释转达故事的一个个人的贡献的一种内容表达关联起来。 @zh-hans

laulaja (henkilö) ekspressiossa
has element type: 2
toolkit definition: An expression that includes a contribution by a person who uses their voice, with or without instrumental accompaniment, to produce music. @en
toolkit definition: Een expressie die omvat een bijdrage door een persoon die is een uitvoerder van stem, met of zonder instrumentale begeleiding, om muziek te produceren. @nl
toolkit definition: Egy kifejezési forma, amely magában foglalja egy személy közreműködését zenei produktum hanggal történő előadásában hangszeres kísérettel vagy anélkül. @hu
toolkit definition: Eine Expression, zu der eine Ausführende/ein Ausführender (Person) beiträgt, indem sie/er durch ihre/seine Singstimme, mit oder ohne instrumentale Begleitung, Musik erzeugt. @de
toolkit definition: Ekspressio, jonka tekemisessä henkilö, joka esiintyy lauluäänellä (soitinsäestyksellä tai ilman), on osallisena tuottaakseen musiikkia.
toolkit definition: Espressione che comprende un contributo di una persona in un'esecuzione vocale, corredata o meno da accompagnamento strumentale, per produrre musica. @it
toolkit definition: Et uttrykk som inkluderer et bidrag fra en person i form av å stemmen sin, med eller uten akkompagnement fra instrumenter, til å lage musikk. @no
toolkit definition: Expression qui intègre une contribution de la part d’une personne qui utilise sa voix, avec ou sans accompagnement instrumental, pour produire de la musique. @fr
toolkit definition: Expressió que inclou una contribució d’una persona que usa la seva veu, amb acompanyament instrumental o sense, per produir música. @ca
toolkit definition: Izteiksme, kas ietver personas ieguldījumu, izmantojot balsi, ar vai bez instrumentāla pavadījuma, lai radītu mūziku. @lv
toolkit definition: Müzik üretmek için enstrüman eşliğinde veya enstrümansız olarak sesini kullanan bir kişinin katkısını içeren bir anlatım. @tr
toolkit definition: Udtryk, som omfatter en persons bidrag ved at bruge sin stemme, med eller uden instrumentalledsagelse, til at skabe musik. @da
toolkit definition: Väljendus, millesse isik on andnud panuse, kasutades muusika tegemiseks oma häält, kas instrumentaalsaatega või ilma. @et
toolkit definition: تعبيرة تتضمن إسهام شخص بأداء صوتي، بمصاحبة أو دون مصاحبة آلة موسيقية، لإنتاج أغنية. @ar
toolkit definition: 包括有用其人声（不管是否有乐器伴奏）产生音乐的一个个人的贡献的一种内容表达 @zh-hans
toolkit label: Person als Sängerin/Sänger von @de
toolkit label: cantante persona di @it
toolkit label: ir dziedātājs (persona) @lv
toolkit label: laulaja (henkilö) ekspressiossa
toolkit label: laulja (isik) väljenduses @et
toolkit label: person, som er sanger af @da
toolkit label: persona cantant de @ca
toolkit label: personne chanteuse de @fr
toolkit label: sanger for (person) @no
toolkit label: singer person of @en
toolkit label: zanger-persoon van @nl
toolkit label: énekes személye: @hu
toolkit label: şarkıcı kişi @tr
toolkit label: τραγουδιστής φυσικό πρόσωπο του @el
toolkit label: شخص مغنّ @ar
toolkit label: ……的演唱者个人 @zh-hans
has subproperty: P50602
lexical alias: singerPersonOf.en
status: Published
type: Property
domain: C10004
label: er person, som er sanger af @da
label: er sanger for (person) @no
label: est une personne chanteuse de @fr
label: ir dziedātājs (persona) @lv
label: is singer person of @en
label: is zanger-persoon van @nl
label: ist Person als Sängerin/Sänger von @de
label: laulja (isik) väljenduses @et
label: è cantante persona di @it
label: énekes személye a következőnek: @hu
label: és persona cantant de @ca
label: şarkıcı kişidir @tr
label: είναι τραγουδιστής φυσικό πρόσωπο του @el
label: هو شخص مغنّ لـ @ar
label: 是……的演唱者个人 @zh-hans
sub property of: laulaja (toimija) ekspressiossa
sub property of: esittäjä (henkilö) ekspressiossa
definition: Bir kişiyi, müzik üretmek için enstrümantal eşlik olsun veya olmasın, sesini kullanma katkısını içeren bir anlatımla ilişkilendirir. @tr
definition: Correla una persona a un'espressione che comprende un contributo di una persona in un'esecuzione vocale, corredata o meno da accompagnamento strumentale, per produrre musica. @it
definition: Hozzákapcsol egy személyt egy kifejezési formához, amely magában foglalja egy személy közreműködését zenei produktum hanggal történő előadásában hangszeres kísérettel vagy anélkül. @hu
definition: Liittää henkilön ekspressioon, jonka tekemisessä henkilö, joka esiintyy lauluäänellä (soitinsäestyksellä tai ilman), on osallisena tuottaakseen musiikkia.
definition: Met une personne en relation avec une expression qui intègre une contribution de la part d’une personne qui utilise sa voix, avec ou sans accompagnement instrumental, pour produire de la musique. @fr
definition: Relaciona una persona amb una expressió que inclou una contribució d’una persona que usa la seva veu, amb acompanyament instrumental o sense, per produir música. @ca
definition: Relateert een persoon aan een expressie die omvat een bijdrage door een persoon die is een uitvoerder van stem, met of zonder instrumentale begeleiding, om muziek te produceren. @nl
definition: Relaterer en person til et udtryk, som omfatter en persons bidrag ved at bruge sin stemme, med eller uden instrumentalledsagelse, til at skabe musik. @da
definition: Relaterer en person til et uttrykk som inkluderer et bidrag fra en person i form av å stemmen sin, med eller uten akkompagnement fra instrumenter, til å lage musikk. @no
definition: Relates a person to an expression that includes a contribution by a person who uses their voice, with or without instrumental accompaniment, to produce music. @en
definition: Sasaista personu ar izteiksmi, kas ietver personas ieguldījumu, izmantojot balsi, ar vai bez instrumentāla pavadījuma, lai radītu mūziku. @lv
definition: Seostab isiku väljendusega, millesse isik on andnud panuse, kasutades muusika tegemiseks oma häält, kas instrumentaalsaatega või ilma. @et
definition: Setzt eine Person in Beziehung zu einer Expression, zu der eine Ausführende/ein Ausführender (Person) beiträgt, indem sie/er durch ihre/seine Singstimme, mit oder ohne instrumentale Begleitung, Musik erzeugt. @de
definition: يربط شخصا بتعبيرة تتضمن إسهام شخص بأداء صوتي، بمصاحبة أو دون مصاحبة آلة موسيقية، لإنتاج أغنية. @ar
definition: 将一个个人与包括有用其人声（不管是否有乐器伴奏）产生音乐的一个个人的贡献的一种内容表达关联起来。 @zh-hans
scope note: A performance of a singer may or may not include actual words. @en
scope note: Bir şarkıcının performansı gerçek sözleri içerebilir veya içermebilir. @tr
scope note: Die Darbietung einer Sängerin/eines Sängers kann richtige Worte enthalten oder nicht. @de
scope note: Dziedātāja sniegumā var būt vai nebūt teksts. @lv
scope note: Een uitvoering door een zanger kan wel of niet echte woorden omvatten. @nl
scope note: Egy énekes előadása tartalmazhat vagy nem tartalmazhat tényleges szavakat. @hu
scope note: En sangers optræden kan omfatte egentlige ord, men gør det ikke nødvendigvis. @da
scope note: Laulajan esitys voi sisältää tai olla sisältämättä todellisia sanoja.
scope note: Laulja esitus võib sisaldada või mitte sisaldada tegelikult olemasolevaid sõnu. @et
scope note: Sangerens framføring kan være med eller uten ord. @no

esittäjä (henkilö) ekspressiossa
has element type: 2
toolkit definition: An expression that includes a contribution by a person of performing music, acting, dancing, speaking, etc. @en
toolkit definition: Een expressie die omvat een bijdrage door een persoon door uitvoering van muziek, acteren, dansen, spreken etc. @nl
toolkit definition: Egy kifejezési forma, amely magában foglalja egy személy közreműködését zene, színjátszás, tánc, élőbeszéd, stb. előadásában. @hu
toolkit definition: Eine Expression, zu der eine Person beiträgt, indem sie Musik aufführt, schauspielt, tanzt oder spricht und so weiter. @de
toolkit definition: Ekspressio, jonka tekemisessä henkilö on osallisena esittämällä musiikkia, näyttelemällä, tanssimalla, puhumalla tms.
toolkit definition: Espressione che comprende un contributo di una persona nell'esecuzione di musica, recitazione, danza, parlato, etc. @it
toolkit definition: Et uttrykk som inkluderer et bidrag fra en person i form av framføring av musikk, skuespill, dans, tale etc. @no
toolkit definition: Expression qui intègre une contribution de la part d’une personne consistant à exécuter de la musique, à jouer, à danser, à parler, etc. @fr
toolkit definition: Expressió que inclou una contribució d’una persona executant la música, actuant, dansant, parlant, etc. @ca
toolkit definition: Izteiksme, kas ietver personas ieguldījumu, izpildot mūziku, tēlojumu, deju, runu u.tml. @lv
toolkit definition: Müzik icra etme, oyunculuk, dans etme, konuşma vb. bir kişinin katkısını içeren bir anlatım. @tr
toolkit definition: Udtryk, som omfatter en persons bidrag ved at opføre musik, spille skuespil, danse, tale etc. @da
toolkit definition: Väljendus, millesse isik on andnud panuse, esitades muusikat, näideldes, tantsides, kõneldes vms. @et
toolkit definition: تعبيرة تتضمن إسهام شخص في أداء موسيقى، تمثيل، رقص، حوار، إلخ. @ar
toolkit definition: 包括演奏音乐、扮演、舞蹈、说话等的一个个人的贡献的一种内容表达 @zh-hans
toolkit label: Person als Ausführende/Ausführender von @de
toolkit label: Sanat icra eden kişi @tr
toolkit label: előadó személye: @hu
toolkit label: esitaja (isik) väljenduses @et
toolkit label: esittäjä (henkilö) ekspressiossa
toolkit label: interprete persona di @it
toolkit label: ir izpildītājs (persona) @lv
toolkit label: performer person of @en
toolkit label: person, som er udøver af @da
toolkit label: persona intèrpret de @ca
toolkit label: personne interprète de @fr
toolkit label: uitvoerder-persoon van @nl
toolkit label: utøver for (person) @no
toolkit label: εκτελεστής φυσικό πρόσωπο του @el
toolkit label: شخص مؤدِ @ar
toolkit label: ……的表演者个人 @zh-hans
has subproperty: näyttelijä (henkilö) ekspressiossa
has subproperty: esittelijä (henkilö) ekspressiossa
has subproperty: tanssija (henkilö) ekspressiossa
has subproperty: juontaja (henkilö) ekspressiossa
has subproperty: moderoija (henkilö) ekspressiossa
has subproperty: johtaja (henkilö) ekspressiossa
has subproperty: nukettaja (henkilö) ekspressiossa
has subproperty: panelisti (henkilö) ekspressiossa
has subproperty: tarinankertoja (henkilö) ekspressiossa
has subproperty: laulaja (henkilö) ekspressiossa
has subproperty: soittaja (henkilö) ekspressiossa
has subproperty: kommentaattori (henkilö) ekspressiossa
has subproperty: kertoja (henkilö) ekspressiossa
has subproperty: puhuja (henkilö) ekspressiossa
has subproperty: opettaja (henkilö) ekspressiossa
has subproperty: P50603
lexical alias: performerPersonOf.en
status: Published
type: Property
domain: C10004
label: előadó személye a következőnek: @hu
label: er person, som er udøver af @da
label: er utøver for (person) @no
label: esitaja (isik) väljenduses @et
label: est une personne interprète de @fr
label: ir izpildītājs (persona) @lv
label: is performer person of @en
label: is uitvoerder-persoon van @nl
label: ist Person als Ausführende/Ausführender von @de
label: sanatçı kişisidir @tr
label: è interprete persona di @it
label: és persona intèrpret de @ca
label: είναι εκτελεστής φυσικό πρόσωπο του @el
label: هو شخص مؤدٍ لـ @ar
label: 是……的表演者个人 @zh-hans
sub property of: esittäjä (toimija) ekspressiossa
sub property of: esitykseen osallinen henkilö ekspressiossa
definition: Bir kişiyi, müzik yapma, oyunculuk, dans, konuşma vb. icra etme katkısını içeren bir anlatımla ilişkilendirir. @tr
definition: Correla una persona a un'espressione che comprende un contributo di una persona nell'esecuzione di musica, recitazione, danza, parlato, etc. @it
definition: Hozzákapcsol egy személyhez egy kifejezési formához, amely magában foglalja egy személy közreműködését zene, színjátszás, tánc, élőbeszéd, stb. előadásában. @hu
definition: Liittää henkilön ekspressioon, jonka tekemisessä henkilö on osallisena esittämällä musiikkia, näyttelemällä, tanssimalla, puhumalla tms.
definition: Met une personne en relation avec une expression qui intègre une contribution de la part d’une personne consistant à exécuter de la musique, à jouer, à danser, à parler, etc. @fr
definition: Relaciona una persona amb una expressió que inclou una contribució d’una persona executant la música, actuant, dansant, parlant, etc. @ca
definition: Relateert een persoon aan een expressie die omvat een bijdrage door een persoon door uitvoering van muziek, acteren, dansen, spreken etc. @nl
definition: Relaterer en person til et udtryk, som omfatter en persons bidrag ved at opføre musik, spille skuespil, danse, tale etc. @da
definition: Relaterer en person til et uttrykk som inkluderer et bidrag fra en person i form av framføring av musikk, skuespill, dans, tale etc. @no
definition: Relates a person to an expression that includes a contribution by a person of performing music, acting, dancing, speaking, etc. @en

soittaja (henkilö) ekspressiossa
has element type: 2
toolkit definition: An expression that includes a contribution by a person of playing a musical instrument. @en
toolkit definition: Bir müzik aleti çalan bir kişinin katkısını içeren bir anlatım. @tr
toolkit definition: Een expressie die omvat een bijdrage door een persoon van het spelen van een muziekinstrument. @nl
toolkit definition: Egy kifejezési forma, amely magában foglalja egy hangszeren játszó személy közreműködését. @hu
toolkit definition: Eine Expression, zu der eine Person beiträgt, indem sie ein Musikinstrument spielt. @de
toolkit definition: Ekspressio, jonka tekemisessä henkilö on osallisena soittamalla soitinta.
toolkit definition: Espressione che comprende un contributo di una persona nel suonare uno strumento musicale. @it
toolkit definition: Et uttrykk som inkluderer et bidrag fra en person i form av å spille et musikkinstrument. @no
toolkit definition: Expression qui intègre une contribution de la part d’une personne consistant à jouer d’un instrument de musique. @fr
toolkit definition: Expressió que inclou una contribució d’una persona tocant un instrument musical. @ca
toolkit definition: Izteiksme, kas ietver personas ieguldījumu, spēlējot mūzikas instrumentu. @lv
toolkit definition: Udtryk, som omfatter en persons bidrag ved at spille et musikinstrument. @da
toolkit definition: Väljendus, millesse isik on andnud panuse, mängides muusikainstrumenti. @et
toolkit definition: تعبيرة تتضمن إسهام شخص في العزف على آلة موسيقية. @ar
toolkit definition: 包括有演奏乐器的一个个人的贡献的一种内容表达 @zh-hans
toolkit label: Person als Instrumentalmusikerin/Instrumentalmusiker von @de
toolkit label: enstrümentalist kişisidir @tr
toolkit label: instrumentalist (isik) väljenduses @et
toolkit label: instrumentalist for (person) @no
toolkit label: instrumentalist person of @en
toolkit label: instrumentalist-persoon van @nl
toolkit label: ir instrumentālists (persona) @lv
toolkit label: person, som er instrumentalist af @da
toolkit label: persona instrumentista de @ca
toolkit label: personne instrumentiste de @fr
toolkit label: soittaja (henkilö) ekspressiossa
toolkit label: strumentista persona di @it
toolkit label: zenész személye: @hu
toolkit label: εκτελεστής [μουσικού οργάνου] φυσικό πρόσωπο του @el
toolkit label: شخص عازف @ar
toolkit label: ……的乐器演奏者个人 @zh-hans
has subproperty: P50604
lexical alias: instrumentalistPersonOf.en
status: Published
type: Property
domain: C10004
label: enstrümentalist kişisidir @tr
label: er instrumentalist for (person) @no
label: er person, som er instrumentalist af @da
label: est une personne instrumentiste de @fr
label: instrumentalist (isik) väljenduses @et
label: ir instrumentālists (persona) @lv
label: is instrumentalist person of @en
label: is instrumentalist-persoon van @nl
label: ist Person als Instrumentalmusikerin/Instrumentalmusiker von @de
label: zenész személye a következőnek: @hu
label: è strumentista persona di @it
label: és persona instrumentista de @ca
label: είναι εκτελεστής [μουσικού οργάνου] φυσικό πρόσωπο του @el
label: هو شخص عازف لـ @ar
label: 是……的乐器演奏者个人 @zh-hans
sub property of: soittaja (toimija) ekspressiossa
sub property of: esittäjä (henkilö) ekspressiossa
definition: Bir kişiyi, bir kişinin müzik aleti çalmasına yaptığı katkıyı içeren bir anlatımla ilişkilendirir. @tr
definition: Correla una persona a un'espressione che comprende un contributo di una persona nel suonare uno strumento musicale. @it
definition: Hozzákapcsol egy személyt egy kifejezési formához, amely magában foglalja egy hangszeren játszó személy közreműködését. @hu
definition: Liittää henkilön ekspressioon, jonka tekemisessä henkilö on osallisena soittamalla soitinta.
definition: Met une personne en relation avec une expression qui intègre une contribution de la part d’une personne consistant à jouer d’un instrument de musique. @fr
definition: Relaciona una persona amb una expressió que inclou una contribució d’una persona tocant un instrument musical. @ca
definition: Relateert een persoon aan een expressie die omvat een bijdrage door een persoon van het spelen van een muziekinstrument. @nl
definition: Relaterer en person til et udtryk, som omfatter en persons bidrag ved at spille et musikinstrument. @da
definition: Relaterer en person til et uttrykk som inkluderer et bidrag fra en person i form av å spille et musikkinstrument. @no
definition: Relates a person to an expression that includes a contribution by a person of playing a musical instrument. @en
definition: Sasaista personu ar izteiksmi, kas ietver personas ieguldījumu, spēlējot mūzikas instrumentu. @lv
definition: Seostab isiku väljendusega, millesse isik on andnud panuse, mängides muusikainstrumenti. @et
definition: Setzt eine Person in Beziehung zu einer Expression, zu der eine Person beiträgt, indem sie ein Musikinstrument spielt. @de
definition: يربط شخصا بتعبيرة تتضمن إسهام شخص في العزف على آلة موسيقية. @ar
definition: 将一个个人与包括有演奏乐器的一个个人的贡献的一种内容表达关联起来。 @zh-hans

tuomioistuimen kirjuri (henkilö) ekspressiossa
has element type: 2
toolkit definition: An expression that includes a contribution by a person of preparing an opinion of a court for publication. @en
toolkit definition: Bir mahkemenin yayınlamak üzere görüşünü hazırlayan bir kişinin katkısını içeren bir anlatım. @tr
toolkit definition: Een expressie die omvat een bijdrage door een persoon door voorbereiden van een oordeel van een rechtbank voor publicatie. @nl
toolkit definition: Egy kifejezési forma, amely magában foglalja egy személy közreműködését egy bíróság ítéleteinek közlésre való előkészítésében. @hu
toolkit definition: Eine Expression, zu der eine Person beiträgt, indem sie die Urteilsbegründung zur Veröffentlichung vorbereitet. @de
toolkit definition: Ekspressio, jonka tekemisessä henkilö on osallisena valmistelemalla tuomioistuimen lausunnon julkaistavaksi.
toolkit definition: Espressione che comprende un contributo di una persona nella preparazione di un giudizio di un tribunale per la pubblicazione. @it
toolkit definition: Et uttrykk som inkluderer et bidrag fra en person i form av å klargjøre en domstols kjennelser for utgivelse. @no
toolkit definition: Expression qui intègre une contribution de la part d’une personne consistant à préparer une opinion d’un tribunal aux fins de publication. @fr
toolkit definition: Expressió que inclou una contribució d’una persona preparant una opinió d’un tribunal per a la seva publicació. @ca
toolkit definition: Izteiksme, kas ietver personas ieguldījumu, sagatavojot tiesas atzinumu publicēšanai. @lv
toolkit definition: Udtryk, som omfatter en persons bidrag ved at klargøre en domstols afgørelser til publicering. @da
toolkit definition: Väljendus, millesse isik on andnud panuse, valmistades avaldamiseks ette kohtu seisukohad. @et
toolkit definition: تعبيرة تتضمن إسهام شخص في إعداد رأي محكمة للنشر. @ar
toolkit definition: 包括准备用于公布的法院意见的一个个人的贡献的一种内容表达 @zh-hans
toolkit label: Person als Gerichtsstenografin/Gerichtsstenograf von @de
toolkit label: bírósági jegyzőkönyvvezető személye: @hu
toolkit label: court reporter person of @en
toolkit label: ir tiesas sekretārs (persona) @lv
toolkit label: kohtureporter (isik) väljenduses @et
toolkit label: person, som er retsstenograf af @da
toolkit label: persona relatora d’un tribunal de @ca
toolkit label: personne rapporteuse judiciaire de @fr
toolkit label: protokollfører for (person) @no
toolkit label: rechtbankverslaggever-persoon van @nl
toolkit label: stenografo del tribunale persona di @it
toolkit label: tuomioistuimen kirjuri (henkilö) ekspressiossa
toolkit label: yazman @tr
toolkit label: στενογράφος φυσικό πρόσωπο του @el
toolkit label: شخص كاتب محكمة @ar
toolkit label: ……的法院书记官个人 @zh-hans
has subproperty: P50605
lexical alias: courtReporterPersonOf.en
status: Published
type: Property
domain: C10004
label: bírósági jegyzőkönyvvezető személye a következőnek: @hu
label: er person, som er retsstenograf af @da
label: er protokollfører for (person) @no
label: est une personne rapporteuse judiciaire de @fr
label: ir tiesas sekretārs (persona) @lv
label: is court reporter person of @en
label: is rechtbankverslaggever-persoon van @nl
label: ist Person als Gerichtsstenografin/Gerichtsstenograf von @de
label: kohtureporter (isik) väljenduses @et
label: yazman kişisidir @tr
label: è stenografo del tribunale persona di @it
label: és persona relatora d’un tribunal de @ca
label: είναι στενογράφος φυσικό πρόσωπο του @el
label: هو شخص كاتب محكمة لـ @ar
label: 是……的法院书记官个人 @zh-hans
sub property of: tuomioistuimen kirjuri (toimija) ekspressiossa
sub property of: yhdistymään osallinen henkilö ekspressiossa
definition: Bir kişiyi, bir mahkeme görüşünü yayınlanmak üzere hazırlamaya bir kişinin katkısını içeren bir anlatımla ilişkilendirir. @tr
definition: Correla una persona a un'espressione che comprende un contributo di una persona nella preparazione di un giudizio di un tribunale per la pubblicazione. @it
definition: Hozzákapcsol egy személyt egy kifejezési formához, amely magában foglalja egy személy közreműködését egy bíróság ítéleteinek közlésre való előkészítésében. @hu
definition: Liittää henkilön ekspressioon, jonka tekemisessä henkilö on osallisena valmistelemalla tuomioistuimen lausunnon julkaistavaksi.
definition: Met une personne en relation avec une expression qui intègre une contribution de la part d’une personne consistant à préparer une opinion d’un tribunal aux fins de publication. @fr
definition: Relaciona una persona amb una expressió que inclou una contribució d’una persona preparant una opinió d’un tribunal per a la seva publicació. @ca
definition: Relateert een persoon aan een expressie die omvat een bijdrage door een persoon door voorbereiden van een oordeel van een rechtbank voor publicatie. @nl
definition: Relaterer en person til et udtryk, som omfatter en persons bidrag ved at klargøre en domstols afgørelser til publicering. @da
definition: Relaterer en person til et uttrykk som inkluderer et bidrag fra en person i form av å klargjøre en domstols kjennelser for utgivelse. @no
definition: Relates a person to an expression that includes a contribution by a person of preparing the opinions of a court for publication. @en
definition: Sasaista personu ar izteiksmi, kas ietver personas ieguldījumu, sagatavojot tiesas atzinumu publicēšanai. @lv
definition: Seostab isiku väljendusega, millesse isik on andnud panuse, valmistades avaldamiseks ette kohtu seisukohad. @et
definition: Setzt eine Person in Beziehung zu einer Expression, zu der eine Person beiträgt, indem sie die Urteilsbegründung zur Veröffentlichung vorbereitet. @de
definition: يربط شخصا بتعبيرة تتضمن إسهام شخص في إعداد رأي محكمة للنشر. @ar
definition: 将一个个人与包括准备用于公布的法院意见的一个个人的贡献的一种内容表达关联起来。 @zh-hans

kommentaattori (henkilö) ekspressiossa
has element type: 2
toolkit definition: An expression that includes a contribution by a person of providing interpretation, analysis, or a discussion of the subject matter on a recording, film, or other audiovisual medium. @en
toolkit definition: Bir kayıtta, filmde veya diğer görsel-işitsel ortamda konuya ilişkin yorum, analiz veya tartışma sağlayan bir kişinin katkısını içeren bir anlatım. @tr
toolkit definition: Een expressie die omvat een bijdrage door een persoon door het verlenen van uitleg, analyse of een discussie over het onderwerp op een opname, film of ander audiovisueel medium. @nl
toolkit definition: Egy kifejezési forma, amely magában foglalja egy személy közreműködését tolmácsolásban, elemzésben vagy a téma megvitatásában egy felvételen, filmen vagy más audiovizuális médiumon. @hu
toolkit definition: Eine Expression, zu der eine Person beiträgt, indem sie in einer Aufnahme, in einem Film oder in einem anderen audiovisuellen Medium eine Interpretation, eine Analyse oder eine Diskussion des Themas präsentiert. @de
toolkit definition: Ekspressio, jonka tekemisessä henkilö on osallisena tulkitsemalla tai analysoimalla äänitteen, elokuvan tai muun audiovisuaalisen aineiston aihetta tai keskustelemalla siitä.
toolkit definition: Espressione che comprende un contributo di una persona nel fornire interpretazione, analisi o discussione dell'argomento di una registrazione, film o altro mezzo audiovisivo. @it
toolkit definition: Et uttrykk som inkluderer et bidrag fra en person i form av å tilføre tolkning, analyse eller drøfting av temaet for et opptak, en film eller et annet audiovisuelt medium. @no
toolkit definition: Expression qui intègre une contribution de la part d’une personne consistant à fournir une interprétation, une analyse ou une explication du sujet sur un enregistrement, un film ou un autre support audiovisuel. @fr
toolkit definition: Expressió que inclou una contribució d’una persona proporcionant l’opinió, l’anàlisi o una explicació del tema d’un enregistrament, una pel·lícula o de qualsevol altre suport audiovisual. @ca
toolkit definition: Izteiksme, kas ietver personas ieguldījumu, sniedzot interpretāciju, analīzi vai diskusiju par tēmu ierakstā, filmā vai citā audiovizuālā vidē. @lv
toolkit definition: Udtryk, som omfatter en persons bidrag ved at stå for fortolkning, analyse eller diskussion af det emne, som behandles i en optagelse, film eller andet audiovisuelt medium. @da
toolkit definition: Väljendus, millesse isik on andnud panuse, tõlgendades või analüüsides salvestuse, filmi või muu audiovisuaalse meediumi ainestikku või arutledes selle üle. @et
toolkit definition: تعبيرة تتضمن إسهام شخص في تقديم تفسير للموضوع، أو تحليله، أو مناقشته في تسجيل أو في فيلم، أو أي وسيط سمعي بصري آخر. @ar
toolkit definition: 包括有提供关于录像、电影或其他视听媒介中的主要内容之解释、分析或讨论的一个个人的贡献的一种内容表达 @zh-hans
toolkit label: Person als Kommentatorin/Kommentator von @de
toolkit label: commentator person of @en
toolkit label: commentator-persoon van @nl
toolkit label: commentatore persona di @it
toolkit label: ir komentators (persona) @lv
toolkit label: kommentaator (isik) väljenduses @et
toolkit label: kommentaattori (henkilö) ekspressiossa
toolkit label: kommentator for (person) @no
toolkit label: kommentátor személye: @hu
toolkit label: person, som er kommentator af @da
toolkit label: persona comentarista de @ca
toolkit label: personne commentatrice de @fr
toolkit label: yorumcu @tr
toolkit label: σχολιαστής φυσικό πρόσωπο του @el
toolkit label: شخص مُعلِق @ar
toolkit label: ……的解说员个人 @zh-hans
has subproperty: P50606
lexical alias: commentatorPersonOf.en
status: Published
type: Property
domain: C10004
label: er kommentator for (person) @no
label: er person, som er kommentator af @da
label: est une personne commentatrice de @fr
label: ir komentators (persona) @lv
label: is commentator person of @en
label: is commentator-persoon van @nl
label: ist Person als Kommentatorin/Kommentator von @de
label: kommentaator (isik) väljenduses @et
label: kommentátor személye a következőnek: @hu
label: yorumcu kişisidir @tr
label: è commentatore persona di @it
label: és persona comentarista de @ca
label: είναι σχολιαστής φυσικό πρόσωπο του @el
label: هو شخص معلق لـ @ar
label: 是……的解说员个人 @zh-hans
sub property of: kommentaattori (toimija) ekspressiossa
sub property of: esittäjä (henkilö) ekspressiossa
definition: Bir kişiyi, bir kayıt, film veya başka bir görsel-işitsel ortamda konuyla ilgili yorum, analiz veya tartışma sağlayan bir kişinin katkısını içeren bir anlatımla ilişkilendirir. @tr
definition: Correla una persona a un'espressione che comprende un contributo di una persona nel fornire interpretazione, analisi o discussione dell'argomento di una registrazione, film o altro mezzo audiovisivo. @it
definition: Hozzákapcsol egy személyt egy kifejezési formához, amely magában foglalja egy személy közreműködését tolmácsolásban, elemzésben vagy a téma megvitatásában egy felvételen, filmen vagy más audiovizuális médiumon. @hu
definition: Liittää henkilön ekspressioon, jonka tekemisessä henkilö on osallisena tulkitsemalla tai analysoimalla äänitteen, elokuvan tai muun audiovisuaalisen aineiston aihetta tai keskustelemalla siitä.
definition: Met une personne en relation avec une expression qui intègre une contribution de la part d’une personne consistant à fournir une interprétation, une analyse ou une explication du sujet sur un enregistrement, un film ou un autre support audiovisuel. @fr
definition: Relaciona una persona amb una expressió que inclou una contribució d’una persona proporcionant l’opinió, l’anàlisi o una explicació del tema d’un enregistrament, una pel·lícula o de qualsevol altre suport audiovisual. @ca
definition: Relateert een persoon aan een expressie die omvat een bijdrage door een persoon door het verlenen van uitleg, analyse of een discussie over het onderwerp op een opname, film of ander audiovisueel medium. @nl
definition: Relaterer en person til et udtryk, som omfatter en persons bidrag ved at stå for fortolkning, analyse eller diskussion af det emne, som behandles i en optagelse, film eller andet audiovisuelt medium. @da
definition: Relaterer en person til et uttrykk som inkluderer et bidrag fra en person i form av å tilføre tolkning, analyse eller drøfting av temaet for et opptak, en film eller et annet audiovisuelt medium. @no
definition: Relates a person to an expression that includes a contribution by a person of providing interpretation, analysis, or a discussion of the subject matter on a recording, film, or other audiovisual medium. @en
definition: Sasaista personu ar izteiksmi, kas ietver personas ieguldījumu, sniedzot interpretāciju, analīzi vai diskusiju par tēmu ierakstā, filmā vai citā audiovizuālā vidē. @lv
definition: Seostab isiku väljendusega, millesse isik on andnud panuse, tõlgendades või analüüsides salvestuse, filmi või muu audiovisuaalse meediumi ainestikku või arutledes selle üle. @et
definition: Setzt eine Person in Beziehung zu einer Expression, zu der eine Person beiträgt, indem sie in einer Aufnahme, in einem Film oder in einem anderen audiovisuellen Medium eine Interpretation, eine Analyse oder eine Diskussion des Themas präsentiert. @de
definition: يربط شخصا بتعبيرة تتضمن إسهام شخص في تقديم تفسير للموضوع، أو تحليله، أو مناقشته في تسجيل أو في فيلم، أو أي وسيط سمعي بصري آخر. @ar
definition: 将一个个人与包括有提供关于录像、电影或其他视听媒介中的主要内容之解释、分析或讨论的一个个人的贡献的一种内容表达关联起来。 @zh-hans

ääninäyttelijä (henkilö) ekspressiossa
has element type: 2
toolkit definition: An expression that includes a contribution by a person of providing the voice for characters in radio and audio productions and for animated characters in moving image works, as well as voice-overs in radio and television commercials, dubbed expressions, etc. @en
toolkit definition: Een expressie die omvat een bijdrage door een persoon in het leveren van een stem aan personages in radio- en geluidsproducties en aan animatiepersonages in bewegend beeld-werken, alsook voice-overs in radio- en televisiereclames, nagesynchroniseerde expressies etc. @nl
toolkit definition: Egy kifejezési forma, amely magában foglalja egy személy közreműködését azzal, hogy rádió- és audió-produkciók szereplőinek, mozgóképművek animált karaktereinek adja hangját, valamint rádiós és televíziós reklámokban, szinkronizált kifejezési formákban stb. hangalámondást szolgáltat. @hu
toolkit definition: Eine Expression, zu der eine Person beiträgt, indem sie ihre Stimme Charakteren in Hörfunk- und Audioproduktionen und animierten Charakteren in Bewegtbildwerken leiht und Begleitkommentare in Hörfunk- oder Fernsehwerbung, untertitelten Expressionen und so weiter zur Verfügung stellt. @de
toolkit definition: Ekspressio, jossa henkilö on osallisena ekspression tekemisessä antamalla äänen hahmoille radio- ja äänituotannoissa ja animoiduille hahmoille elokuvateoksissa sekä esiintymällä radio- ja TV-mainoksissa, dubatuissa ekspressioissa tms.
toolkit definition: Espressione che comprende un contributo di una persona nel fornire la voce a personaggi in produzioni radiofoniche e audio e a personaggi animati in immagini in movimento e a voci narranti in spot radiofonici e televisivi, espressioni doppiate, etc. @it
toolkit definition: Et uttrykk som inkluderer et bidrag fra en person i form av å gi stemme til rollefigurer i radio- og lydproduksjoner og for animerte rollefigurer i filmverk, levere fortellerstemme til radio- og fjernsynsreklamer, dubbede ressurser, etc. @no
toolkit definition: Expression qui intègre une contribution de la part d’une personne consistant à prêter sa voix à des personnages dans des productions radiophoniques et audio et à des personnages animés dans des œuvres d’images animées, de même qu’à prêter sa voix hors champ dans des messages publicitaires à la radio et à la télévision, du doublage, etc. @fr
toolkit definition: Expressió que inclou una contribució d’una persona prestant la seva veu als personatges de les produccions radiofòniques i d’àudio i als personatges animats de les obres d’imatge en moviment, així com les veus en off en els anuncis publicitaris de ràdio i televisió, les expressions doblades, etc. @ca
toolkit definition: Izteiksme, kas ietver personas ieguldījumu, ierunājot tēlus radio un audio uzvedumos un animācijas filmās, kā arī nodrošinot aizkadra balsi radio un televīzijas reklāmās, dublētajās izteiksmēs u.tml. @lv
toolkit definition: Radyo ve ses yapımlarındaki karakterlerin ve hareketli görüntü işlerindeki animasyon karakterlerinin yanı sıra radyo ve televizyon reklamlarındaki seslendirmeler, dublajlı ifadeler vb. için bir kişinin katkısını içeren bir anlatım. @tr
toolkit definition: Udtryk, som omfatter en persons bidrag ved at lægge stemme til figurer i radio- og audioproduktioner og til animerede figurer i levende billedværker, og tillige ved at indtale voice-overs i radio- og tv-reklamer, eftersynkroniserede udtryk etc. @da
toolkit definition: Väljendus, millesse isik on andnud panuse, andes hääle raadio- ja audioproduktsiooni tegelastele ning liikuvast pildist koosnevate teoste animategelastele, samuti esinedes häälega raadio- ja telereklaamis, dubleeritud väljendustes vms. @et
toolkit definition: تعبيرة تتضمن إسهام شخص بالتمثيل الصوتي لشخصيات في إنتاج إذاعي وسمعي، وشخصيات كرتونية في أعمال الصور المتحركة، إضافة إلى التعليق الصوتي في إعلانات الإذاعة والتليفزيون، والتعبيرات المدبلجة، إلخ. @ar
toolkit definition: 包括为在广播和音频制作中的角色和为动态图像作品中的动画角色提供人声以及为广播和电视广告提供画外音、配音等的一个个人的贡献的一种内容表达 @zh-hans
toolkit label: Person als Sprecherin/Sprecher einer Rolle von @de
toolkit label: doppiatore persona di @it
toolkit label: hääle esitaja (isik) väljenduses @et
toolkit label: ir balss aktieris (persona) @lv
toolkit label: person, som er dubber af @da
toolkit label: persona actriu de veu de @ca
toolkit label: personne actrice vocale de @fr
toolkit label: seslendirme sanatçısı kişisi @tr
toolkit label: stemacteur-persoon van @nl
toolkit label: stemmeskuespiller for (person) @no
toolkit label: szinkronszínész személye: @hu
toolkit label: voice actor person of @en
toolkit label: ääninäyttelijä (henkilö) ekspressiossa
toolkit label: ηθοποιός φωνής φυσικό πρόσωπο του @el
toolkit label: شخص ممثل صوتي @ar
toolkit label: ……的声音演员个人 @zh-hans
has subproperty: P50607
lexical alias: voiceActorPersonOf.en
status: Published
type: Property
domain: C10004
label: Seslendirme sanatçısıdır @tr
label: er person, som er dubber af @da
label: er stemmeskuespiller for (person) @no
label: est une personne actrice vocale de @fr
label: hääle esitaja (isik) väljenduses @et
label: ir balss aktieris (persona) @lv
label: is stemacteur-persoon van @nl
label: is voice actor person of @en
label: ist Person als Sprecherin/Sprecher einer Rolle von @de
label: szinkronszínész személye a következőnek: @hu
label: è doppiatore persona di @it
label: és persona actriu de veu de @ca
label: είναι ηθοποιός φωνής φυσικό πρόσωπο του @el
label: هو شخص ممثل صوتي لـ @ar
label: 是……的声音演员个人 @zh-hans
sub property of: ääninäyttelijä (toimija) ekspressiossa
sub property of: näyttelijä (henkilö) ekspressiossa
alternative label: Person als Synchronsprecherin/Synchronsprecher von @de
definition: Bir kişiyi, radyo ve ses yapımlarındaki karakterlerin ve hareketli görüntü eserlerindeki animasyon karakterlerinin yanı sıra radyo ve televizyon reklamlarındaki seslendirmeler, dublajlı ifadeler vb. için bir kişinin katkısını içeren bir anlatımla ilişkilendirir. @tr
definition: Correla una persona a un'espressione che comprende un contributo di una persona nel fornire la voce a personaggi in produzioni radiofoniche e audio e a personaggi animati in immagini in movimento e a voci narranti in spot radiofonici e televisivi, espressioni doppiate, etc. @it
definition: Hozzákapcsol egy személyt egy kifejezési formához, amely magában foglalja egy személy közreműködését azzal, hogy rádió- és audió-produkciók szereplőinek, mozgóképművek animált karaktereinek adja hangját, valamint rádiós és televíziós reklámokban, szinkronizált kifejezési formákban stb. hangalámondást szolgáltat. @hu
definition: Liittää henkilön ekspressioon, jossa henkilö on osallisena ekspression tekemisessä antamalla äänen hahmoille radio- ja äänituotannoissa ja animoiduille hahmoille elokuvateoksissa sekä esiintymällä radio- ja TV-mainoksissa, dubatuissa ekspressioissa tms.
definition: Met une personne en relation avec une expression qui intègre une contribution de la part d’une personne consistant à prêter sa voix à des personnages dans des productions radiophoniques et audio et à des personnages animés dans des œuvres d’images animées, de même qu’à prêter sa voix hors champ dans des messages publicitaires à la radio et à la télévision, du doublage, etc. @fr
definition: Relaciona una persona amb una expressió que inclou una contribució d’una persona prestant la seva veu als personatges de les produccions radiofòniques i d’àudio i als personatges animats de les obres d’imatge en moviment, així com les veus en off en els anuncis publicitaris de ràdio i televisió, les expressions doblades, etc. @ca
definition: Relateert een persoon aan een expressie die omvat een bijdrage door een persoon in het leveren van een stem aan personages in radio- en geluidsproducties en aan animatiepersonages in bewegend beeld-werken, alsook voice-overs in radio- en televisiereclames, nagesynchroniseerde expressies etc. @nl
definition: Relaterer en person til et udtryk, som omfatter en persons bidrag ved at lægge stemme til figurer i radio- og audioproduktioner og til animerede figurer i levende billedværker, og tillige ved at indtale voice-overs i radio- og tv-reklamer, eftersynkroniserede udtryk etc. @da
definition: Relaterer en person til et uttrykk som inkluderer et bidrag fra en person i form av å gi stemme til rollefigurer i radio- og lydproduksjoner og for animerte rollefigurer i filmverk, levere fortellerstemme til radio- og fjernsynsreklamer, dubbede ressurser, etc. @no
definition: Relates a person to an expression that includes a contribution by a person of providing the voice for characters in radio and audio productions and for animated characters in moving image works, as well as voice-overs in radio and television commercials, dubbed expressions, etc. @en
definition: Sasaista personu ar izteiksmi, kas ietver personas ieguldījumu, ierunājot tēlus radio un audio uzvedumos un animācijas filmās, kā arī nodrošinot aizkadra balsi radio un televīzijas reklāmās, dublētajās izteiksmēs u.tml. @lv
definition: Seostab isiku väljendusega, millesse isik on andnud panuse, andes hääle raadio- ja audioproduktsiooni tegelastele ning liikuvast pildist koosnevate teoste animategelastele, samuti esinedes häälega raadio- ja telereklaamis, dubleeritud väljendustes vms. @et
definition: Setzt eine Person in Beziehung zu einer Expression, zu der eine Person beiträgt, indem sie ihre Stimme Charakteren in Hörfunk- und Audioproduktionen und animierten Charakteren in Bewegtbildwerken leiht und Begleitkommentare in Hörfunk- oder Fernsehwerbung, untertitelten Expressionen und so weiter zur Verfügung stellt. @de
definition: يربط شخصا بتعبيرة تتضمن إسهام شخص بالتمثيل الصوتي لشخصيات في إنتاج إذاعي وسمعي، وشخصيات كرتونية في أعمال الصور المتحركة، إضافة إلى التعليق الصوتي في إعلانات الإذاعة والتليفزيون، والتعبيرات المدبلجة، إلخ. @ar
definition: 将一个个人与包括为在广播和音频制作中的角色和为动态图像作品中的动画角色提供人声以及为广播和电视广告提供画外音、配音等的一个个人的贡献的一种内容表达关联起来。 @zh-hans

kertoja (henkilö) ekspressiossa
has element type: 2
toolkit definition: An expression that includes a contribution by a person of reading aloud or giving an account of an act, occurrence, or other event. @en
toolkit definition: Een expressie die omvat een bijdrage door een persoon door hardop lezen of verslag geven van een daad, voorval of andere gebeurtenis. @nl
toolkit definition: Egy kifejezési forma, amely magában foglalja egy személy közreműködését egy cselekményről, történésről vagy más eseményről szóló beszámoló hangos felolvasásában. @hu
toolkit definition: Eine Expression, zu der eine Person beiträgt, indem sie eine Handlung, ein Geschehnis oder ein anderes Ereignis laut vorliest oder schildert. @de
toolkit definition: Ekspressio, jonka tekemisessä henkilö on osallisena lukemalla ääneen tai kertomalla toiminnasta, tapahtumasta, tapahtumien kulusta tms.
toolkit definition: Espressione che comprende un contributo di una persona nella lettura ad alta voce o racconto di un fatto, avvenimento o altro evento. @it
toolkit definition: Et uttrykk som inkluderer et bidrag fra en person i form av å lese høyt eller fortelle om en handling, hendelse eller annen begivenhet. @no
toolkit definition: Expression qui intègre une contribution de la part d’une personne consistant à lire à voix haute ou à rendre compte d’une action, d’une situation ou d’un autre événement. @fr
toolkit definition: Expressió que inclou una contribució d’una persona llegint en veu alta o explicant una acció, una situació o qualsevol altre esdeveniment. @ca
toolkit definition: Izteiksme, kas ietver personas ieguldījumu, skaļi nolasot tekstu vai sniedzot ziņojumu par kādu darbību, notikumu, notikumu gaitu u.tml. @lv
toolkit definition: Udtryk, som omfatter en persons bidrag ved at læse højt eller berette om en handling, en hændelse, et begivenhedsforløb etc. @da
toolkit definition: Väljendus, millesse isik on andnud panuse, valjusti lugedes või jutustades mingist tegevusest, juhtumist, sündmuste käigust vms. @et
toolkit definition: Yüksek sesle okuma veya bir eylem, olay veya başka bir olayın hesabını veren bir kişinin katkısını içeren bir anlatım. @tr
toolkit definition: تعبيرة تتضمن إسهام شخصبالقراءة بصوت مرتفع أو بسرد فصل من مسرحية، أو واقعة، أو حدث آخر. @ar
toolkit definition: 包括有朗读或描述行为、事情或其他事件的一个个人的贡献的一种内容表达 @zh-hans
toolkit label: Anlatan @tr
toolkit label: Person als Erzählerin/Erzähler von @de
toolkit label: forteller for (person) @no
toolkit label: ir teicējs (persona) @lv
toolkit label: jutustaja (isik) väljenduses @et
toolkit label: kertoja (henkilö) ekspressiossa
toolkit label: narrator person of @en
toolkit label: narratore persona di @it
toolkit label: narrátor személye: @hu
toolkit label: person, som er fortæller af @da
toolkit label: persona narradora de @ca
toolkit label: personne narratrice de @fr
toolkit label: verteller-persoon van @nl
toolkit label: αφηγητής φυσικό πρόσωπο του @el
toolkit label: شخص راوِ @ar
toolkit label: ……的旁白者个人 @zh-hans
has subproperty: P50608
lexical alias: narratorPersonOf.en
status: Published
type: Property
domain: C10004
label: anlatıcı kişisidir @tr
label: er forteller for (person) @no
label: er person, som er fortæller af @da
label: est une personne narratrice de @fr
label: ir teicējs (persona) @lv
label: is narrator person of @en
label: is verteller-persoon van @nl
label: ist Person als Erzählerin/Erzähler von @de
label: jutustaja (isik) väljenduses @et
label: narrátor személye a következőnek: @hu
label: è narratore persona di @it
label: és persona narradora de @ca
label: είναι αφηγητής φυσικό πρόσωπο του @el
label: هو شخص راوٍ لـ @ar
label: 是……的旁白者个人 @zh-hans
sub property of: kertoja (toimija) ekspressiossa
sub property of: esittäjä (henkilö) ekspressiossa
definition: Bir kişiyi, bir eylemi, olayı veya başka bir olayı yüksek sesle okuma veya açıklama yapma katkısını içeren bir anlatımla ilişkilendirir. @tr
definition: Correla una persona a un'espressione che comprende un contributo di una persona nella lettura ad alta voce o racconto di un fatto, avvenimento o altro evento. @it
definition: Hozzákapcsol egy személyt egy kifejezési formához, amely magában foglalja egy személy közreműködését egy cselekményről, történésről vagy más eseményről szóló beszámoló hangos felolvasásában. @hu
definition: Liittää henkilön ekspressioon, jonka tekemisessä henkilö on osallisena lukemalla ääneen tai kertomalla toiminnasta, tapahtumasta, tapahtumien kulusta tms.
definition: Met une personne en relation avec une expression qui intègre une contribution de la part d’une personne consistant à lire à voix haute ou à rendre compte d’une action, d’une situation ou d’un autre événement. @fr
definition: Relaciona una persona amb una expressió que inclou una contribució d’una persona llegint en veu alta o explicant una acció, una situació o qualsevol altre esdeveniment. @ca
definition: Relateert een persoon aan een expressie die omvat een bijdrage door een persoon door hardop lezen of verslag geven van een daad, voorval of andere gebeurtenis. @nl
definition: Relaterer en person til et udtryk, som omfatter en persons bidrag ved at læse højt eller berette om en handling, en hændelse, et begivenhedsforløb etc. @da
definition: Relaterer en person til et uttrykk som inkluderer et bidrag fra en person i form av å lese høyt eller fortelle om en handling, hendelse eller annen begivenhet. @no
definition: Relates a person to an expression that includes a contribution by a person of reading aloud or giving an account of an act, occurrence, or other event. @en
definition: Sasaista personu ar izteiksmi, kas ietver personas ieguldījumu, skaļi nolasot tekstu vai sniedzot ziņojumu par kādu darbību, notikumu, notikumu gaitu u.tml. @lv
definition: Seostab isiku väljendusega, millesse isik on andnud panuse, valjusti lugedes või jutustades mingist tegevusest, juhtumist, sündmuste käigust vms. @et
definition: Setzt eine Person in Beziehung zu einer Expression, zu der eine Person beiträgt, indem sie eine Handlung, ein Geschehnis oder ein anderes Ereignis laut vorliest oder schildert. @de
definition: يربط شخصا بتعبيرة تتضمن إسهام شخص بالقراءة بصوت مرتفع أو بسرد فصل من مسرحية، أو واقعة، أو حدث آخر. @ar
definition: 将一个个人与包括有朗读或描述行为、事情或其他事件的一个个人的贡献的一种内容表达关联起来。 @zh-hans

pöytäkirjan laatija (henkilö) ekspressiossa
has element type: 2
toolkit definition: An expression that includes a contribution by a person of recording the minutes of a meeting. @en
toolkit definition: Een expressie die omvat een bijdrage door een persoon door vastleggen van de notulen van een bijeenkomst. @nl
toolkit definition: Egy kifejezési forma, amely magában foglalja egy személy közreműködését egy értekezlet jegyzőkönyvének rögzítésében. @hu
toolkit definition: Eine Expression, zu der eine Person beiträgt, indem sie für das Aufzeichnen des Protokolls einer Sitzung verantwortlich ist. @de
toolkit definition: Ekspressio, jossa henkilö on osallisena kokouksen pöytäkirjan laatimisessa.
toolkit definition: Espressione che comprende un contributo di una persona nel registrare i verbali di una riunione. @it
toolkit definition: Et uttrykk som inkluderer et bidrag fra en person i form av å ta møtereferater. @no
toolkit definition: Expression qui intègre une contribution de la part d’une personne consistant à rédiger le procès-verbal d’une réunion. @fr
toolkit definition: Expressió que inclou una contribució d’una persona en l’enregistrament de les notes d’una reunió. @ca
toolkit definition: Izteiksme, kas ietver personas ieguldījumu, rakstot sanāksmes protokolu. @lv
toolkit definition: Toplantı tutanaklarını kaydeden bir kişinin katkısını içeren bir anlatım. @tr
toolkit definition: Udtryk, som omfatter en persons bidrag ved at tage referat ved et møde. @da
toolkit definition: Väljendus, millesse isik on andnud panuse kohtumist protokollides. @et
toolkit definition: تعبيرة تتضمن إسهام شخص في تسجيل محاضر الاجتماع. @ar
toolkit definition: 包括写会议记录的一个个人的贡献的一种内容表达 @zh-hans
toolkit label: Person als Protokollantin/Protokollant von @de
toolkit label: Zabıt Katibi @tr
toolkit label: ir protokolists (persona) @lv
toolkit label: jegyzőkönyvvezető személye: @hu
toolkit label: minute taker person of @en
toolkit label: notulist-persoon van @nl
toolkit label: person, som er referent af @da
toolkit label: persona responsable de notes de @ca
toolkit label: personne procès-verbaliste de @fr
toolkit label: protokollija (isik) väljenduses @et
toolkit label: pöytäkirjan laatija (henkilö) ekspressiossa
toolkit label: referent for (person) @no
toolkit label: verbalizzatore persona di @it
toolkit label: πρακτικογράφος φυσικό πρόσωπο του @el
toolkit label: شخص مقرر محضر الاجتماع @ar
toolkit label: ……的会议记录者个人 @zh-hans
has subproperty: P50609
lexical alias: minuteTakerPersonOf.en
status: Published
type: Property
domain: C10004
label: er person, som er referent af @da
label: er referent for (person) @no
label: est une personne procès-verbaliste de @fr
label: ir protokolists (persona) @lv
label: is minute taker person of @en
label: is notulist-persoon van @nl
label: ist Person als Protokollantin/Protokollant von @de
label: jegyzőkönyvvezető személye a következőnek: @hu
label: protokollija (isik) väljenduses @et
label: zabıt katibi kişisidir @tr
label: è verbalizzatore persona di @it
label: és persona responsable de notes de @ca
label: είναι πρακτικογράφος φυσικό πρόσωπο του @el
label: هو شخص مدون لمحضر اجتماع لـ @ar
label: 是……的会议记录者个人 @zh-hans
sub property of: pöytäkirjan laatija (toimija) ekspressiossa
sub property of: yhdistymään osallinen henkilö ekspressiossa
definition: Bir kişiyi, toplantı tutanaklarının kaydedilmesine bir kişinin katkısını içeren bir anlatımla ilişkilendirir. @tr
definition: Correla una persona a un'espressione che comprende un contributo di una persona nel manipolare, mixare e assemblare le tracce multiple di una registrazione audio. @it
definition: Hozzákapcsol egy személyt egy kifejezési formához, amely magában foglalja egy személy közreműködését egy értekezlet jegyzőkönyvének rögzítésében. @hu
definition: Liittää henkilön ekspressioon, jossa henkilö on osallisena kokouksen pöytäkirjan laatimisessa.
definition: Met une personne en relation avec une expression qui intègre une contribution de la part d’une personne consistant à rédiger le procès-verbal d’une réunion. @fr
definition: Relaciona una persona amb una expressió que inclou una contribució d’una persona en l’enregistrament de les notes d’una reunió. @ca
definition: Relateert een persoon aan een expressie die omvat een bijdrage door een persoon door vastleggen van de notulen van een bijeenkomst. @nl
definition: Relaterer en person til et udtryk, som omfatter en persons bidrag ved at tage referat ved et møde. @da
definition: Relaterer en person til et uttrykk som inkluderer et bidrag fra en person i form av å ta møtereferater. @no
definition: Relates a person to an expression that includes a contribution by a person of recording the minutes of a meeting. @en
definition: Sasaista personu ar izteiksmi, kas ietver personas ieguldījumu, rakstot sanāksmes protokolu. @lv
definition: Seostab isiku väljendusega, millesse isik on andnud panuse kohtumist protokollides. @et
definition: Setzt eine Person in Beziehung zu einer Expression, zu der eine Person beiträgt, indem sie für das Aufzeichnen des Protokolls einer Sitzung verantwortlich ist. @de
definition: يربط شخصا بتعبيرة تتضمن إسهام شخص في تسجيل محاضر الاجتماع. @ar
definition: 将一个个人与包括写会议记录的一个个人的贡献的一种内容表达关联起来。 @zh-hans

ohjelmistokehittäjä (henkilö) ekspressiossa
has element type: 2
toolkit definition: An expression that includes a contribution by a person of researching, designing, implementing, or testing software. @en
toolkit definition: Een expressie die omvat een bijdrage door een persoon door onderzoeken, ontwerpen, toepassen of testen van software. @nl
toolkit definition: Egy kifejezési forma, amely magában foglalja egy személy közreműködését szoftver kutatásában, tervezésében, implementálásában vagy tesztelésében. @hu
toolkit definition: Eine Expression, zu der eine Person beiträgt, indem sie Software untersucht, konzipiert, implementiert oder testet. @de
toolkit definition: Ekspressio, jossa henkilö on osallisena ekspression tekemisessä tutkimalla, suunnittelemalla, toteuttamalla tai testaamalla ohjelmistoa.
toolkit definition: Espressione che comprende un contributo di una persona nella ricerca, progettazione, implementazione o test di un software. @it
toolkit definition: Et uttrykk som inkluderer et bidrag fra en person i form av å undersøke, designe, implementere eller teste programvare. @no
toolkit definition: Expression qui intègre une contribution de la part d’une personne consistant à effectuer des travaux de recherche, de conception, de mise en œuvre ou de mise à l’essai d’un logiciel. @fr
toolkit definition: Expressió que inclou una contribució d’una persona en la recerca, el disseny, la posada en marxa o l’examen de programari. @ca
toolkit definition: Izteiksme, kas ietver personas ieguldījumu, pētot, izstrādājot, ieviešot vai testējot programmatūru. @lv
toolkit definition: Udtryk, som omfatter en persons bidrag ved at researche, designe, implementere eller teste software. @da
toolkit definition: Väljendus, millesse isik on andnud panuse, uurides, kavandades, juurutades või testides tarkvara. @et
toolkit definition: Yazılım araştırma, tasarlama, uygulama veya test etmede bir kişinin katkısını içeren bir anlatım. @tr
toolkit definition: تعبيرة تتضمن إسهام شخص في البحث عن برمجية، أو تصميمها، أو تنفيذها، أو اختبارها. @ar
toolkit definition: 包括研究、设计、实施或测试软件的一个个人的贡献的一种内容表达 @zh-hans
toolkit label: Person als Softwareentwicklerin/Softwareentwickler von @de
toolkit label: ir programmatūras izstrādātājs (persona) @lv
toolkit label: ohjelmistokehittäjä (henkilö) ekspressiossa
toolkit label: person, som er softwareudvikler af @da
toolkit label: persona desenvolupadora de programari de @ca
toolkit label: personne développeuse de logiciel de @fr
toolkit label: programvareutvikler for (person) @no
toolkit label: software developer person of @en
toolkit label: softwareontwikkelaar-persoon van @nl
toolkit label: sviluppatore software persona di @it
toolkit label: szoftverfejlesztő személye: @hu
toolkit label: tarkvaraarendaja (isik) väljenduses @et
toolkit label: yazılım geliştirici kişi @tr
toolkit label: εκπονητής λογισμικού φυσικό πρόσωπο του @el
toolkit label: شخص مطور برمجيات @ar
toolkit label: ……的软件开发者个人 @zh-hans
has subproperty: P50610
lexical alias: softwareDeveloperPersonOf.en
status: Published
type: Property
domain: C10004
label: Yazılımcısıdır @tr
label: er person, som er softwareudvikler af @da
label: er programvareutvikler for (person) @no
label: est une personne développeuse de logiciel de @fr
label: ir programmatūras izstrādātājs (persona) @lv
label: is software developer person of @en
label: is softwareontwikkelaar-persoon van @nl
label: ist Person als Softwareentwicklerin/Softwareentwickler von @de
label: szoftverfejlesztő személye a következőnek: @hu
label: tarkvaraarendaja (isik) väljenduses @et
label: è sviluppatore software persona di @it
label: és persona desenvolupadora de programari de @ca
label: είναι εκπονητής λογισμικού φυσικό πρόσωπο του @el
label: هو شخص مطور برمجيات لـ @ar
label: 是……的软件开发者个人 @zh-hans
sub property of: ohjelmistokehittäjä (toimija) ekspressiossa
sub property of: yhdistymään osallinen henkilö ekspressiossa
definition: Bir kişiyi, yazılım araştırma, tasarlama, uygulama veya test etme konusunda bir kişinin katkısını içeren bir anlatımla ilişkilendirir. @tr
definition: Correla una persona a un'espressione che comprende un contributo di una persona nella ricerca, progettazione, implementazione o test di un software. @it
definition: Hozzákapcsol egy személyt egy kifejezési formához, amely magában foglalja egy személy közreműködését szoftver kutatásában, tervezésében, implementálásában vagy tesztelésében. @hu
definition: Liittää henkilön ekspressioon, jossa henkilö on osallisena ekspression tekemisessä tutkimalla, suunnittelemalla, toteuttamalla tai testaamalla ohjelmistoa.
definition: Met une personne en relation avec une expression qui intègre une contribution de la part d’une personne consistant à effectuer des travaux de recherche, de conception, de mise en œuvre ou de mise à l’essai d’un logiciel. @fr
definition: Relaciona una persona amb una expressió que inclou una contribució d’una persona en la recerca, el disseny, la posada en marxa o l’examen de programari. @ca
definition: Relateert een persoon aan een expressie die omvat een bijdrage door een persoon door onderzoeken, ontwerpen, toepassen of testen van software. @nl
definition: Relaterer en person til et udtryk, som omfatter en persons bidrag ved at researche, designe, implementere eller teste software. @da
definition: Relaterer en person til et uttrykk som inkluderer et bidrag fra en person i form av å undersøke, designe, implementere eller teste programvare. @no
definition: Relates a person to an expression that includes a contribution by a person of researching, designing, implementing, or testing software. @en
definition: Sasaista personu ar izteiksmi, kas ietver personas ieguldījumu, pētot, izstrādājot, ieviešot vai testējot programmatūru. @lv
definition: Seostab isiku väljendusega, millesse isik on andnud panuse, uurides, kavandades, juurutades või testides tarkvara. @et
definition: Setzt eine Person in Beziehung zu einer Expression, zu der eine Person beiträgt, indem sie Software untersucht, konzipiert, implementiert oder testet. @de
definition: يربط شخصا بتعبيرة تتضمن إسهام شخص في البحث عن برمجية، أو تصميمها، أو تنفيذها، أو اختبارها. @ar
definition: 将一个个人与包括研究、设计、实施或测试软件的一个个人的贡献的一种内容表达关联起来。 @zh-hans

dubbausohjaaja (henkilö) ekspressiossa
has element type: 2
toolkit definition: An expression that includes a contribution by a person of responsibility for the general management and supervision of the process of adding new dialogue or other sounds to complete a soundtrack. @en
toolkit definition: Bir film müziğini tamamlamak için yeni diyalog veya diğer sesleri ekleme sürecinin genel yönetimi ve denetiminden sorumlu bir kişinin katkısını içeren bir anlatım. @tr
toolkit definition: Een expressie die omvat een bijdrage door een persoon door algeheel beheer en toezicht van het proces van toevoegen van nieuwe dialoog of andere geluiden om een geluidsspoor te completeren. @nl
toolkit definition: Egy kifejezési forma, amely magában foglalja egy személy közreműködését új párbeszéd vagy más hangok hozzáadási folyamatának általános irányításában és felügyeletében egy hangsáv befejezése, teljessé tétele céljából. @hu
toolkit definition: Eine Expression, zu der eine Person beiträgt, indem sie für das allgemeine Management und die Leitung beim Hinzufügen von neuem Dialog oder anderen Geräuschen verantwortlich ist, um die Tonspur zu vervollständigen. @de
toolkit definition: Ekspressio, jossa henkilö on osallisena uuden dialogin tai muiden äänien lisäämisprosessin yleisessä johtamisessa ja valvonnassa ekspression ääniraidan täydentämiseksi.
toolkit definition: Espressione che comprende un contributo di una persona di responsabilità per la gestione e supervisione generale del processo di aggiunta di nuovi dialoghi o altri suoni per completare una colonna sonora. @it
toolkit definition: Et uttrykk som inkluderer et bidrag fra en person i form av generell ledelse og tilsyn med prosessen med å legge til ny dialog eller andre lyder for å fullføre et lydspor. @no
toolkit definition: Expression qui intègre une contribution de la part d’une personne consistant à être responsable de la gestion et de la supervision générales du processus visant à ajouter de nouveaux dialogues ou d’autres sons pour compléter une piste sonore. @fr
toolkit definition: Expressió que inclou una contribució d’una persona en la responsabilitat de la gestió general i la supervisió del procés d’afegir nou diàleg o altres sons per completar una banda sonora. @ca
toolkit definition: Izteiksme, kas ietver personas ieguldījumu, atbildot par vispārējo vadību un uzraudzību pār jaunu dialogu vai citu skaņu pievienošanu pabeigtam izteiksmes skaņu celiņam. @lv
toolkit definition: Udtryk, som omfatter en persons bidrag ved at have ansvar for den generelle ledelse af- og tilsyn med processen at tilføje ny dialog eller andre lyde for at fuldstændiggøre et soundtrack. @da
toolkit definition: Väljendus, millesse isik on andnud panuse, vastutades väljenduse heliriba täiendamisel uue dialoogi või muude helide lisamise üldise juhtimise ja juhendamise eest. @et
toolkit definition: تعبيرة تتضمن إسهام شخص بتحمله مسئولية الإدارة العامة والإشراف على عملية إضافة حوار جديد أو أصوات أخرى لإكمال مقطع صوتي. @ar
toolkit definition: 包括总体管理和监督增加对话或其他声音以完成音轨的一个责任的一个个人的贡献的一种内容表达 @zh-hans
toolkit label: Person als Synchronregisseurin/Synchronregisseur von @de
toolkit label: direttore del doppiaggio persona di @it
toolkit label: dubbausohjaaja (henkilö) ekspressiossa
toolkit label: dubbing director person of @en
toolkit label: dublaaži režissöör (isik) väljenduses @et
toolkit label: dublaj yönetmeni @tr
toolkit label: ir dublāžas režisors (persona) @lv
toolkit label: person, som er dubbinginstruktør af @da
toolkit label: persona directora de doblatge de @ca
toolkit label: personne directrice de doublage de @fr
toolkit label: stemmeregissør for (person) @no
toolkit label: stemregisseur-persoon van @nl
toolkit label: szinkronrendező személye: @hu
toolkit label: διευθυντής μεταγλώττισης φυσικό πρόσωπο του @el
toolkit label: شخص مخرج دبلجة @ar
toolkit label: ……的混声导演个人 @zh-hans
has subproperty: P50611
lexical alias: dubbingDirectorPersonOf.en
status: Published
type: Property
domain: C10004
label: dublaaži režissöör (isik) väljenduses @et
label: dublaj yönetmeni kişisidir @tr
label: er person, som er dubbinginstruktør af @da
label: er stemmeregissør for (person) @no
label: est une personne directrice de doublage de @fr
label: ir dublāžas režisors (persona) @lv
label: is dubbing director person of @en
label: is stemregisseur-persoon van @nl
label: ist Person als Synchronregisseurin/Synchronregisseur von @de
label: szinkronrendező személye a következőnek: @hu
label: è direttore del doppiaggio persona di @it
label: és persona directora de doblatge de @ca
label: είναι διευθυντής μεταγλώττισης φυσικό πρόσωπο του @el
label: هو شخص مخرج الدبلجة لـ @ar
label: 是……的混声导演个人 @zh-hans
sub property of: dubbausohjaaja (toimija) ekspressiossa
sub property of: esitykseen osallinen henkilö ekspressiossa
definition: Bir kişiyi, bir film müziğini tamamlamak için yeni diyalog veya diğer seslerin eklenmesi sürecinin genel yönetimi ve denetiminden sorumlu bir kişinin katkısını içeren bir anlatımla ilişkilendirir. @tr
definition: Correla una persona a un'espressione che comprende un contributo di una persona di responsabilità per la gestione e supervisione generale del processo di aggiunta di nuovi dialoghi o altri suoni per completare una colonna sonora. @it
definition: Hozzákapcsol egy személyt egy kifejezési formához, amely magában foglalja egy személy közreműködését új párbeszéd vagy más hangok hozzáadási folyamatának általános irányításában és felügyeletében egy hangsáv befejezése, teljessé tétele céljából. @hu
definition: Liittää henkilön ekspressioon, jossa henkilö on osallisena uuden dialogin tai muiden äänien lisäämisprosessin yleisessä johtamisessa ja valvonnassa ekspression ääniraidan täydentämiseksi.
definition: Met une personne en relation avec une expression qui intègre une contribution de la part d’une personne consistant à être responsable de la gestion et de la supervision générales du processus visant à ajouter de nouveaux dialogues ou d’autres sons pour compléter une piste sonore. @fr
definition: Relaciona una persona amb una expressió que inclou una contribució d’una persona en la responsabilitat de la gestió general i la supervisió del procés d’afegir nou diàleg o altres sons per completar una banda sonora. @ca
definition: Relateert een persoon aan een expressie die omvat een bijdrage door een persoon door algeheel beheer en toezicht van het proces van toevoegen van nieuwe dialoog of andere geluiden om een geluidsspoor te completeren. @nl
definition: Relaterer en person til et udtryk, som omfatter en persons bidrag ved at have ansvar for den generelle ledelse af- og tilsyn med processen at tilføje ny dialog eller andre lyde for at fuldstændiggøre et soundtrack. @da
definition: Relaterer en person til et uttrykk som inkluderer et bidrag fra en person i form av generell ledelse og tilsyn med prosessen med å legge til ny dialog eller andre lyder for å fullføre et lydspor. @no
definition: Relates a person to an expression that includes a contribution by a person of responsibility for the general management and supervision of the process of adding new dialogue or other sounds to complete a soundtrack. @en
definition: Sasaista personu ar izteiksmi, kas ietver personas ieguldījumu, atbildot par vispārējo vadību un uzraudzību pār jaunu dialogu vai citu skaņu pievienošanu pabeigtam izteiksmes skaņu celiņam. @lv
definition: Seostab isiku väljendusega, millesse isik on andnud panuse, vastutades väljenduse heliriba täiendamisel uue dialoogi või muude helide lisamise üldise juhtimise ja juhendamise eest. @et
definition: Setzt eine Person in Beziehung zu einer Expression, zu der eine Person beiträgt, indem sie für das allgemeine Management und die Leitung beim Hinzufügen von neuem Dialog oder anderen Geräuschen verantwortlich ist, um die Tonspur zu vervollständigen. @de
definition: يربط شخصا بتعبيرة تتضمن إسهام شخص بتحمل مسئولية الإدارة العامة والإشراف على عملية إضافة حوار جديد أو أصوات أخرى لإكمال مقطع صوتي. @ar
definition: 将一个个人与包括总体管理和监督增加对话或其他声音以完成音轨的一个责任的一个个人的贡献的一种内容表达关联起来。 @zh-hans

ekspression entisöijä (henkilö) ekspressiossa
has element type: 2
toolkit definition: An expression that includes a contribution by a person of restoring or combining expressions, which may be damaged or fragmentary, to create a new expression. @en
toolkit definition: Een expressie die omvat een bijdrage door een persoon door herstellen of combineren van expressies, die beschadigd of fragmentarisch kunnen zijn, met de bedoeling een nieuwe expressie te vormen. @nl
toolkit definition: Egy kifejezési forma, amely magában foglalja egy személy közreműködését sérült vagy töredékes kifejezési formák helyreállításában vagy kombinálásában, amivel új kifejezési formát hoz létre. @hu
toolkit definition: Eine Expression, zu der eine Person beiträgt, indem sie durch die Wiederherstellung oder Zusammenführung früherer Expressionen, die beschädigt oder unvollständig sein können, eine neue Expression erstellt. @de
toolkit definition: Ekspressio, jonka tekemisessä henkilö on osallisena restauroimalla tai yhdistelemällä aikaisempia ekspressioita, jotka voivat olla vaurioituneita tai fragmentaarisia, uuden ekspression luomiseksi.
toolkit definition: Espressione che comprende il contributo di una persona nel restauro o combinazione di espressioni, che possono essere danneggiate o frammentarie, per creare una nuova espressione. @it
toolkit definition: Et uttrykk som inkluderer et bidrag fra en person i form av å gjenopprette eller kombinere tidligere uttrykk, som kan være skadede eller fragmentariske, for å skape et nytt uttrykk. @no
toolkit definition: Expression qui intègre une contribution de la part d’une personne consistant à restaurer ou à combiner des expressions, qui peuvent être endommagées ou fragmentaires, pour créer une nouvelle expression. @fr
toolkit definition: Expressió que inclou una contribució d’una persona restaurant o combinant expressions, que poden estar danyades o fragmentades, per crear una expressió nova. @ca
toolkit definition: Izteiksme, kas ietver personas ieguldījumu, atjaunojot vai apvienojot izteiksmes, kuras bijušas bojātas vai fragmentāras, lai izveidotu jaunu izteiksmi. @lv
toolkit definition: Udtryk, som omfatter en persons bidrag ved at restaurere eller kombinere tidligere udtryk, som kan være beskadigede eller fragmenterede, til at skabe et nyt udtryk. @da
toolkit definition: Väljendus, millesse isik on andnud panuse, taastades või kombineerides varasemaid väljendusi, mis võivad olla kahjustatud või fragmentaarsed, uue väljenduse loomiseks. @et
toolkit definition: Yeni bir anlatım oluşturmak için, tahrip olmuş veya parçalı olabilen anlatımları restore etme veya birleştirmeyle görevli bir kişinin katkısını içeren bir anlatım. @tr
toolkit definition: تعبيرة تتضمن إسهام شخص في ترميم، أو جمع التعبيرات التالفة أو المجزأة لإنشاء تعبيرة جديدة. @ar
toolkit definition: 包括修复或组合可能被损毁或不完整的内容表达以创建一个新的内容表达的一个个人的贡献的一种内容表达 @zh-hans
toolkit label: anlatımın restoraston uzmanı kişisi @tr
toolkit label: ekspression entisöijä (henkilö) ekspressiossa
toolkit label: ir restaurators (persona) izteiksmei @lv
toolkit label: ist Person als Restauratorin/Restaurator einer Expression von @de
toolkit label: konservator for uttrykk for (person) @no
toolkit label: person, som er konservator af udtryk af @da
toolkit label: persona restauradora d’una expressió de @ca
toolkit label: personne restauratrice d’une expression de @fr
toolkit label: rekonstrueerija (isik) väljenduses @et
toolkit label: restaurator-persoon van expressie van @nl
toolkit label: restauratore persona di espressione di @it
toolkit label: restaurátor személye a következő kifejezési formának: @hu
toolkit label: restorationist person of expression of @en
toolkit label: εσυντηρητής φυσικό πρόσωπο της έκφρασης του @el
toolkit label: شخص أخصائي ترميم تعبيرة . @ar
toolkit label: ……的内容表达的修复者个人 @zh-hans
has subproperty: P50612
lexical alias: restorationistPersonOfExpressionOf.en
status: Published
type: Property
domain: C10004
label: anlatımının restorasyon uzmanı kişisidir @tr
label: er konservator for uttrykk for (person) @no
label: er person, som er konservator af udtryk af @da
label: est une personne restauratrice d’une expression de @fr
label: ir restaurators (persona) izteiksmei @lv
label: is restaurator-persoon van expressie van @nl
label: is restorationist person of expression of @en
label: ist Person als Restauratorin/Restaurator einer Expression von @de
label: rekonstrueerija (isik) väljenduses @et
label: restaurátor személye a következő kifejezési formának: @hu
label: è restauratore persona di espressione di @it
label: és persona restauradora d’una expressió de @ca
label: είναι συντηρητής φυσικό πρόσωπο της έκφρασης του @el
label: هو شخص أخصائي ترميم تعبيرة لـ @ar
label: 是……的内容表达的修复者个人 @zh-hans
sub property of: ekspression entisöijä (toimija) ekspressiossa
sub property of: tarkastaja (henkilö) ekspressiossa
definition: Bir kişiyi, yeni bir anlatım oluşturmak için zarar görmüş veya parçalanmış olabilecek anlatımları geri yükleme veya birleştirme konusunda bir kişinin katkısını içeren bir anlatımla ilişkilendirir. @tr
definition: Correla una persona a un'espressione che comprende il contributo di una persona nel restauro o combinazione di espressioni, che possono essere danneggiate o frammentarie, per creare una nuova espressione. @it
definition: Hozzákapcsol egy személyt egy kifejezési formához, amely magában foglalja egy személy közreműködését sérült vagy töredékes kifejezési formák helyreállításában vagy kombinálásában, amivel új kifejezési formát hoz létre. @hu
definition: Liittää henkilön ekspressioon, jonka tekemisessä henkilö on osallisena restauroimalla tai yhdistelemällä aikaisempia ekspressioita, jotka voivat olla vaurioituneita tai fragmentaarisia, uuden ekspression luomiseksi.
definition: Met une personne en relation avec une expression qui intègre une contribution de la part d’une personne consistant à restaurer ou à combiner des expressions, qui peuvent être endommagées ou fragmentaires, pour créer une nouvelle expression. @fr
definition: Relaciona una persona amb una expressió que inclou una contribució d’una persona restaurant o combinant expressions, que poden estar danyades o fragmentades, per crear una expressió nova. @ca
definition: Relateert een persoon aan een expressie die omvat een bijdrage door een persoon door herstellen of combineren van expressies, die beschadigd of fragmentarisch kunnen zijn, met de bedoeling een nieuwe expressie te vormen. @nl
definition: Relaterer en person til et udtryk, som omfatter en persons bidrag ved at restaurere eller kombinere tidligere udtryk, som kan være beskadigede eller fragmenterede, til at skabe et nyt udtryk. @da
definition: Relaterer en person til et uttrykk som inkluderer et bidrag fra en person i form av å gjenopprette eller kombinere tidligere uttrykk, som kan være skadede eller fragmentariske, for å skape et nytt uttrykk. @no
definition: Relates a person to an expression that includes a contribution by a person of restoring or combining expressions, which may be damaged or fragmentary, to create a new expression. @en
definition: Sasaista personu ar izteiksmi, kas ietver personas ieguldījumu, atjaunojot vai apvienojot izteiksmes, kuras bijušas bojātas vai fragmentāras, lai izveidotu jaunu izteiksmi. @lv
definition: Seostab isiku väljendusega, millesse isik on andnud panuse, taastades või kombineerides varasemaid väljendusi, mis võivad olla kahjustatud või fragmentaarsed, uue väljenduse loomiseks. @et
definition: Setzt eine Person in Beziehung zu einer Expression, zu der eine Person beiträgt, indem sie durch die Wiederherstellung oder Zusammenführung früherer Expressionen, die beschädigt oder unvollständig sein können, eine neue Expression erstellt. @de
definition: يربط شخصا بتعبيرة تتضمن إسهام شخص في ترميم، أو جمع التعبيرات التالفة أو المجزأة لإنشاء تعبيرة جديدة. @ar
definition: 将一个个人与包括修复或组合可能被损毁或不完整的内容表达以创建一个新的内容表达的一个个人的贡献的一种内容表达关联起来。 @zh-hans

sensori (henkilö) ekspressiossa
has element type: 2
toolkit definition: Ahlaki, politik, askeri veya diğer alanlarda sakıncalı görülen içeriğin temzilenmesi amaçlı bir başka anlatım içeriğini revize etmek, fakat yapıyı ve genel içeriği önemli ölçüde değiştirmeden bırakmakla görevli bir kişinin katkısını içeren bir anlatım. @tr
toolkit definition: An expression that includes a contribution by a person of revising the content of another expression for the purpose of suppressing content that is deemed objectionable on moral, political, military, or other grounds, but leaving the nature and general content substantially unchanged. @en
toolkit definition: Een expressie die omvat een bijdrage door een persoon door het herzien van content van een andere expressie met de bedoeling content die gezien wordt als bezwaarlijk op morele, politieke, militaire of andere gronden te onderdrukken, maar de aard en algemene content grotendeels intact te laten. @nl
toolkit definition: Egy kifejezési forma, amely magában foglalja egy személy közreműködését egy másik kifejezési forma tartalmának a felülvizsgálatában, morális, politikai, katonai vagy egyéb alapon kifogásolható részek kiküszöbölése céljából, ugyanakkor a jellegzetességeket és a tartalmat lényegében változatlanul hagyja. @hu
toolkit definition: Eine Expression, zu der eine Person beiträgt, indem sie den Inhalt einer anderen Expression überarbeitet, um Teile zu unterdrücken, die aus moralischen, politischen, militärischen oder aus anderen Gründen unerwünscht sind, ohne den Charakter und den Inhalt des Originalwerks substantiell zu verändern. @de
toolkit definition: Ekspressio, jossa henkilö on osallisena tarkastamalla toisen ekspression sisältöä kiistanalaisen sisällön salaamiseksi moraalisin, poliittisin, sotilaallisin tai muin perustein, mutta jättäen alkuperäisen teoksen luonteen ja yleisen sisällön olennaisilta osiltaan muuttumattomaksi..
toolkit definition: Espressione che comprende un contributo di una persona nella revisione del contenuto di un'altra espressione allo scopo di eliminare contenuto ritenuto opinabile per ragioni morali, politiche, militari o di altra natura, ma lasciando sostanzialmente immutati la natura e il contenuto generale. @it
toolkit definition: Et uttrykk som inkluderer et bidrag fra en person i form av å redigere innholdet av et annet uttrykk i den hensikt å fjerne deler som upassende av moralske, politiske, militære eller andre årsaker, men som lar originalverkets særpreg og innhold forbli hovedsakelig uendret. @no
toolkit definition: Expression qui intègre une contribution de la part d’une personne consistant à réviser le contenu d’une autre expression dans le but de supprimer le contenu jugé inadmissible pour des motifs moraux, politiques, militaires ou autres tout en conservant la nature et le contenu sensiblement inchangés. @fr
toolkit definition: Expressió que inclou una contribució d’una persona revisant el contingut d’una altra expressió amb el propòsit de suprimir el contingut considerat objectable per motius ètics, polítics, militars o altres motius, però deixant la natura i el contingut general sense canvis substancials. @ca
toolkit definition: Izteiksme, kas ietver personas ieguldījumu, pārskatot citas izteiksmes saturu ar mērķi, lai izslēgtu saturu, kas tiek uzskatīts par nepieņemamu morālu, politisku, militāru vai citu iemeslu dēļ, bet tā būtību un vispārējo saturu būtiski nemaina. @lv
toolkit definition: Udtryk, som omfatter en persons bidrag ved at revidere indholdet af et andet indtryk med henblik på at undertrykke indhold, som anses for at være moralsk, politisk, militært eller af anden årsag stødende, men som i alt væsentligt lader originalværkets karakter og indhold være uændret. @da
toolkit definition: Väljendus, millesse isik on andnud panuse, revideerides teise väljenduse sisu eesmärgiga välja jätta sisu, mida peetakse moraalsetel, poliitilistel, militaarsetel või muudel põhjustel ebasoovitavaks, kuid jättes allikväljenduse olemuse ja üldise sisu põhiliselt muutmata. @et
toolkit definition: تعبيرة تتضمن إسهام شخص في مراجعة محتوى تعبيرة أخرى بغرض حجب محتوى قد يكون موضع اعتراض لأسباب أخلاقية أو سياسية أو عسكرية أو لاعتبارات أخرى، دون أن يُحدث تغييرا جوهريا في طابعه أو في مضمونه العام. @ar
toolkit definition: 包括修订另一种内容表达的内容以禁止视为不符合道德、政治、军事或其他背景的内容但却保持性质和总体内容不变的一个个人的贡献的内容表达 @zh-hans
toolkit label: Person als Zensorin/Zensor von @de
toolkit label: censor person of @en
toolkit label: censor-persoon van @nl
toolkit label: censore persona di @it
toolkit label: cenzor személye: @hu
toolkit label: ir cenzors (persona) @lv
toolkit label: person, som er censor af @da
toolkit label: persona censora de @ca
toolkit label: personne censeure de @fr
toolkit label: sansürcü kişi @tr
toolkit label: sensor for (person) @no
toolkit label: sensori (henkilö) ekspressiossa
toolkit label: tsensor (isik) väljenduses @et
toolkit label: λογοκριτής φυσικό πρόσωπο του @el
toolkit label: شخص مراقب @ar
toolkit label: ……的审查者个人 @zh-hans
has subproperty: P50613
lexical alias: censorPersonOf.en
status: Published
type: Property
domain: C10004
label: cenzor személye a következőnek: @hu
label: er person, som er censor af @da
label: er sensor for (person) @no
label: est une personne censeure de @fr
label: ir cenzors (persona) @lv
label: is censor person of @en
label: is censor-persoon van @nl
label: ist Person als Zensorin/Zensor von @de
label: sansürcü kişisidir @tr
label: tsensor (isik) väljenduses @et
label: è censore persona di @it
label: és persona censora de @ca
label: είναι λογοκριτής φυσικό πρόσωπο του @el
label: هو شخص رقيب لـ @ar
label: ……的审查者个人 @zh-hans
sub property of: sensori (toimija) ekspressiossa
sub property of: tarkastaja (henkilö) ekspressiossa
definition: Bir kişiyi, ahlaki, siyasi, askeri veya diğer gerekçelerle sakıncalı olduğu düşünülen, bununla birlikte niteliği ve genel içeriği temelde değişmeden bırakılan içeriği gizlemek amacıyla bir başka içeriğin gözden geçirilmesine yönelik bir kişinin katkısını içeren anlatımla ilişkilendirir. @tr
definition: Correla una persona a un'espressione che comprende un contributo di una persona nella revisione del contenuto di un'altra espressione allo scopo di eliminare contenuto ritenuto opinabile per ragioni morali, politiche, militari o di altra natura, ma lasciando sostanzialmente immutati la natura e il contenuto generale. @it
definition: Hozzákapcsol egy személyt egy kifejezési formához, amely magában foglalja egy személy közreműködését egy másik kifejezési forma tartalmának a felülvizsgálatában, morális, politikai, katonai vagy egyéb alapon kifogásolható részek kiküszöbölése céljából, ugyanakkor a jellegzetességeket és a tartalmat lényegében változatlanul hagyja. @hu
definition: Liittää henkilön ekspressioon, jossa henkilö on osallisena tarkastamalla toisen ekspression sisältöä kiistanalaisen sisällön salaamiseksi moraalisin, poliittisin, sotilaallisin tai muin perustein, mutta jättäen alkuperäisen teoksen luonteen ja yleisen sisällön olennaisilta osiltaan muuttumattomaksi..
definition: Met une personne en relation avec une expression qui intègre une contribution de la part d’une personne consistant à réviser le contenu d’une autre expression dans le but de supprimer le contenu jugé inadmissible pour des motifs moraux, politiques, militaires ou autres tout en conservant la nature et le contenu sensiblement inchangés. @fr
definition: Relaciona una persona amb una expressió que inclou una contribució d’una persona revisant el contingut d’una altra expressió amb el propòsit de suprimir el contingut considerat objectable per motius ètics, polítics, militars o altres motius, però deixant la natura i el contingut general sense canvis substancials. @ca
definition: Relateert een persoon aan een expressie die omvat een bijdrage door een persoon door het herzien van content van een andere expressie met de bedoeling content die gezien wordt als bezwaarlijk op morele, politieke, militaire of andere gronden te onderdrukken, maar de aard en algemene content grotendeels intact te laten. @nl
definition: Relaterer en person til et udtryk, som omfatter en persons bidrag ved at revidere indholdet af et andet indtryk med henblik på at undertrykke indhold, som anses for at være moralsk, politisk, militært eller af anden årsag stødende, men som i alt væsentligt lader originalværkets karakter og indhold være uændret. @da
definition: Relaterer en person til et uttrykk som inkluderer et bidrag fra en person i form av å redigere innholdet av et annet uttrykk i den hensikt å fjerne deler som upassende av moralske, politiske, militære eller andre årsaker, men som lar originalverkets særpreg og innhold forbli hovedsakelig uendret. @no
definition: Relates a person to an expression that includes a contribution by a person of revising the content of another expression for the purpose of suppressing content that is deemed objectionable on moral, political, military, or other grounds, but leaving the nature and general content substantially unchanged. @en
definition: Sasaista personu ar izteiksmi, kas ietver personas ieguldījumu, pārskatot citas izteiksmes saturu ar mērķi, lai izslēgtu saturu, kas tiek uzskatīts par nepieņemamu morālu, politisku, militāru vai citu iemeslu dēļ, bet tā būtību un vispārējo saturu būtiski nemaina. @lv
definition: Seostab isiku väljendusega, millesse isik on andnud panuse, revideerides teise väljenduse sisu eesmärgiga välja jätta sisu, mida peetakse moraalsetel, poliitilistel, militaarsetel või muudel põhjustel ebasoovitavaks, kuid jättes allikväljenduse olemuse ja üldise sisu põhiliselt muutmata. @et
definition: Setzt eine Person in Beziehung zu einer Expression, zu der eine Person beiträgt, indem sie den Inhalt einer anderen Expression überarbeitet, um Teile zu unterdrücken, die aus moralischen, politischen, militärischen oder aus anderen Gründen unerwünscht sind, ohne den Charakter und den Inhalt des Originalwerks substantiell zu verändern. @de
definition: يربط شخصا بتعبيرة تتضمن إسهام شخص في مراجعة محتوى تعبيرة أخرى بغرض حجب محتوى قد يكون موضع اعتراض لأسباب أخلاقية أو سياسية أو عسكرية أو لاعتبارات أخرى، دون أن يُحدث تغييرا جوهريا في طابعه أو في مضمونه العام . @ar
definition: 将一个个人与包括修订另一种内容表达的内容以禁止视为不符合道德、政治、军事或其他背景的内容但却保持性质和总体内容不变的一个个人的贡献的内容表达关联起来。 @zh-hans

sovittaja (henkilö) ekspressiossa
has element type: 2
toolkit definition: An expression that includes a contribution by a person of rewriting a musical composition for a medium of performance different from that for which the work was originally intended. @en
toolkit definition: Bir performans ortamı bestesini, çalışmanın orijinal amacından farklı olarak yeniden yazmakla görevli bir kişinin katkısını içeren bir anlatım. @tr
toolkit definition: Een expressie die omvat een bijdrage door een persoon door herschrijven van een muzikale compositie voor een uitvoeringsmedium anders dan waarvoor het werk oorspronkelijk bedoeld was. @nl
toolkit definition: Egy kifejezési forma, amely magában foglalja egy személy közreműködését zenei kompozíció olyan előadásmédiumra átírásával, amely különbözik a műnek eredetileg szánt médiumtól. @hu
toolkit definition: Eine Expression, zu der eine Person beiträgt, indem sie eine Komposition für eine bestimmte Besetzung umschreibt, die sich von der Originalbesetzung unterscheidet, für die das Werk ursprünglich konzipiert war. @de
toolkit definition: Ekspressio, jonka tekemisessä henkilö on osallisena muokkaamalla sävellyksen alkuperäisteoksesta poikkeavalle esityskokoonpanolle.
toolkit definition: Espressione che comprende un contributo di una persona nella riscrittura di una composizione musicale per un mezzo di esecuzione diverso da quello per cui l'opera era stata originariamente concepita. @it
toolkit definition: Et uttrykk som inkluderer et bidrag fra en person i form av å omskrive en komposisjon for en annen besetning enn verket opprinnelig var ment for. @no
toolkit definition: Expression qui intègre une contribution de la part d’une personne consistant à réécrire une composition musicale pour une distribution d’exécution différente de celle à laquelle l’œuvre était destinée à l’origine. @fr
toolkit definition: Expressió que inclou una contribució d’una persona de reescriure una composició musical per a un repartiment d’execució diferent d’aquell per al qual l’obra va ser concebuda originalment. @ca
toolkit definition: Izteiksme, kas ietver personas ieguldījumu, pārrakstot mūzikas kompozīciju izpildījumam, kas atšķirīgs no tā, kas sākotnēji bija paredzēts. @lv
toolkit definition: Udtryk, som omfatter en persons bidrag ved at omskrive en komposition til en anden besætning end den, værket oprindeligt var beregnet til. @da
toolkit definition: Väljendus, millesse isik on andnud panuse, arranžeerides kompositsiooni esituskoosseisule, mis erineb sellest, millele teos oli algselt mõeldud. @et
toolkit definition: تعبيرة تتضمن إسهام شخص في إعادة كتابة لحن موسيقي لوسيط أداء يختلف عن الوسيط الذي كان العمل مقررا له أصلاً. @ar
toolkit definition: 包括一个改写音乐作曲用于不同于其最初意图的一个表演媒介的一个个人的贡献的一种内容表达 @zh-hans
toolkit label: Person als Arrangeurin/Arrangeur von @de
toolkit label: arranger person of music of @en
toolkit label: arrangeur-persoon van muziek van @nl
toolkit label: arrangiatore persona di musica di @it
toolkit label: arrangør av musikk for (person) @no
toolkit label: ir aranžētājs (persona) @lv
toolkit label: muusika seadja (isik) väljenduses @et
toolkit label: müzik aranjörü @tr
toolkit label: person, som er musikarrangør af @da
toolkit label: persona arranjadora de música de @ca
toolkit label: personne arrangeuse de musique de @fr
toolkit label: sovittaja (henkilö) ekspressiossa
toolkit label: zenei hangszerelő személye: @hu
toolkit label: διασκευαστής φυσικό πρόσωπο της μουσικής του @el
toolkit label: شخص موزع موسيقى @ar
toolkit label: ……的音乐改编者个人 @zh-hans
has subproperty: P50614
lexical alias: arrangerPersonOfMusicOf.en
status: Published
type: Property
domain: C10004
label: er arrangør av musikk for (person) @no
label: er person, som er musikarrangør af @da
label: est une personne arrangeuse de musique de @fr
label: ir aranžētājs (persona) @lv
label: is arranger person of music of @en
label: is arrangeur-persoon van muziek van @nl
label: ist Person als Arrangeurin/Arrangeur von @de
label: muusika seadja (isik) väljenduses @et
label: müziğinin aranjör kişisidir @tr
label: zenei hangszerelő személye a következőnek: @hu
label: è arrangiatore persona di musica di @it
label: és persona arranjadora de música de @ca
label: είναι διασκευαστής φυσικό πρόσωπο της μουσικής του @el
label: هو شخص موزع موسيقى لـ @ar
label: 是……的音乐改编者个人 @zh-hans
sub property of: sovittaja (toimija) ekspressiossa
sub property of: tarkastaja (henkilö) ekspressiossa
definition: Bir kişiyi, eserin orijinal olarak amaçlandığından farklı bir icra için bir müzik bestesinin bir kişi tarafından yeniden yazılmasına katkısını içeren anlatımla ilişkilendirir. @tr
definition: Correla una persona a un'espressione che comprende un contributo di una persona nella riscrittura di una composizione musicale per un mezzo di esecuzione diverso da quello per cui l'opera era stata originariamente concepita. @it
definition: Hozzákapcsol egy személyt egy kifejezési formához, amely magában foglalja egy személy közreműködését zenei kompozíció olyan előadásmédiumra átírásával, amely különbözik a műnek eredetileg szánt médiumtól. @hu
definition: Liittää henkilön ekspressioon, jonka tekemisessä henkilö on osallisena muokkaamalla sävellyksen alkuperäisteoksesta poikkeavalle esityskokoonpanolle.
definition: Met une personne en relation avec une expression qui intègre une contribution de la part d’une personne consistant à réécrire une composition musicale pour une distribution d’exécution différente de celle à laquelle l’œuvre était destinée à l’origine. @fr
definition: Relaciona una persona amb una expressió que inclou una contribució d’una persona de reescriure una composició musical per a un repartiment d’execució diferent d’aquell per al qual l’obra va ser concebuda originalment. @ca
definition: Relateert een persoon aan een expressie die omvat een bijdrage door een persoon door herschrijven van een muzikale compositie voor een uitvoeringsmedium anders dan waarvoor het werk oorspronkelijk bedoeld was. @nl
definition: Relaterer en person til et udtryk, som omfatter en persons bidrag ved at omskrive en komposition til en anden besætning end den, værket oprindeligt var beregnet til. @da
definition: Relaterer en person til et uttrykk som inkluderer et bidrag fra en person i form av å omskrive en komposisjon for en annen besetning enn verket opprinnelig var ment for. @no
definition: Relates a person to an expression that includes a contribution by a person of rewriting a musical composition for a medium of performance different from that for which the work was originally intended. @en
definition: Sasaista personu ar izteiksmi, kas ietver personas ieguldījumu, pārrakstot mūzikas kompozīciju izpildījumam, kas atšķirīgs no tā, kas sākotnēji bija paredzēts. @lv
definition: Seostab isiku väljendusega, millesse isik on andnud panuse, arranžeerides kompositsiooni esituskoosseisule, mis erineb sellest, millele teos oli algselt mõeldud. @et
definition: Setzt eine Person in Beziehung zu einer Expression, zu der eine Person beiträgt, indem sie eine Komposition für eine bestimmte Besetzung umschreibt, die sich von der Originalbesetzung unterscheidet, für die das Werk ursprünglich konzipiert war. @de
definition: يربط وكيلا بتعبيرة تتضمن إسهام وكيل في إعادة كتابة لحن موسيقي لوسيط أداء يختلف عن الوسيط الذي كان العمل مقررا له أصلاً. @ar
definition: 将一个个人与包括一个改写音乐作曲用于不同于其最初意图的一个表演媒介的一个个人的贡献的一种内容表达关联起来。 @zh-hans
scope note: An arranger of music may also modify the work for the same medium of performance, etc., keeping the musical substance of the original composition essentially unchanged. @en
scope note: Bir müzik aranjörü, orijinal bestenin müzikal içeriğini temelde değiştirmeden, eseri aynı performans ortamı vb. için değiştirebilir. @tr
scope note: Een arrangeur van muziek kan het werk ook bewerken voor hetzelfde uitvoeringsmedium etc., waarbij de muzikale inhoud van de originele compositie in essentie onveranderd gehouden wordt. @nl
scope note: Egy zenei hangszerelő módosíthatja a művet a mű elrendezéséhez egyező előadásmédiumra, stb., amikor alapvetően változatlanul megtartja az eredeti kompozíció zenei lényegét. @hu
scope note: Eine Arrangeurin/Ein Arrangeur kann das Werk auch für die gleiche Besetzung verändern und so weiter, solange die musikalische Substanz der Originalkomposition im Wesentlichen unverändert bleibt. @de
scope note: En arrangør av musikk kan også endre verket for samme besetning etc. der originalkomposisjonens musikalske substans forblir hovedsakelig uendret. @no
scope note: En musikarrangør kan også modificere værket for samme besætning etc. og derved i alt væsentligt bevare den originale kompositions musikalske substans uændret. @da
scope note: Muusika seadja võib teose seada ka samale esituskoosseisule, muutmata olemuslikult algse kompositsiooni muusikalist sisu. @et
scope note: Mūzikas aranžētājs var arī pārveidot darbu tam pašam izpildījumam, u. tml. saglabājot oriģinālās kompozīcijas muzikālo būtību nemainīgu. @lv
scope note: Sovittaja voi myös muokata teosta samalle esityskokoonpanolle tms. säilyttäen alkuperäisen sävellyksen musiikillisen sisällön olennaisilta osin muuttumattomana.

lyhentäjä (henkilö) ekspressiossa
has element type: 2
toolkit definition: An expression that includes a contribution by a person of shortening an expression of another work without changing the general meaning or manner of presentation. @en
toolkit definition: Diğer bir çalışmanın anlatımını, genel anlamı veya sunum biçimini değiştirmeden kısaltmakla görevli bir kişinin katkısını içeren bir anlatım. @tr
toolkit definition: Een expressie die omvat een bijdrage door een persoon door inkorten van een expressie of ander werk zonder de algemene betekenis of manier van uiteenzetting te wijzigen. @nl
toolkit definition: Egy kifejezési forma, amely magában foglalja egy személy közreműködését egy másik mű kifejezési formájának lerövidítésével úgy, hogy a prezentáció általános jelentése vagy módja nem változik. @hu
toolkit definition: Eine Expression, zu der eine Person beiträgt, indem sie eine Expression eines anderen Werks kürzt, ohne dabei die allgemeine Bedeutung oder Art der Darstellung zu verändern. @de
toolkit definition: Ekspressio, jonka tekemisessä henkilö on osallisena lyhentämällä toisen teoksen ekspressiota muuttamatta esityksen yleistä sisältöä tai tyyliä.
toolkit definition: Espressione che comprende un contributo di una persona nell'abbreviazione di un'espressione di un'altra opera senza modificare il significato generale o la modalità di presentazione. @it
toolkit definition: Et uttrykk som inkluderer et bidrag fra en person i form av å forkorte et uttrykk av et relatert verk uten å endre meningen eller presentasjonsformen. @no
toolkit definition: Expression qui intègre une contribution de la part d’une personne consistant à raccourcir une expression d’une autre œuvre sans en changer le sens général ou le mode de présentation. @fr
toolkit definition: Expressió que inclou una contribució d’una persona escurçant una expressió d’una altra obra sense canviar-ne el significat general o la forma de presentació. @ca
toolkit definition: Izteiksme, kas ietver personas ieguldījumu, saīsinot cita darba izteiksmi, nemainot darba nozīmi vai pasniegšanas veidu. @lv
toolkit definition: Udtryk, som omfatter en persons bidrag ved at forkorte udtrykket af et andet værk, uden at ændre den overordnede betydning eller præsentationsmåde. @da
toolkit definition: Väljendus, millesse isik on andnud panuse, lühendades teise teose väljendust, muutmata üldist tähendust ja esitusviisi. @et
toolkit definition: تعبيرة تتضمن إسهام شخص في تلخيص تعبيرة لعمل آخر دون تغيير المعنى العام أو طريقة العرض. @ar
toolkit definition: 包括缩短另一种作品的一种内容表达而不改变其总体意义或呈现方式的一个个人的贡献的一种内容表达 @zh-hans
toolkit label: Person als Kürzende/Kürzender von @de
toolkit label: abridger person of @en
toolkit label: compendiatore persona di @it
toolkit label: forkorter for (person) @no
toolkit label: inkorter-persoon van @nl
toolkit label: ir saīsinātājs (persona) @lv
toolkit label: lyhentäjä (henkilö) ekspressiossa
toolkit label: lühendaja (isik) väljenduses @et
toolkit label: person, som er forkorter af @da
toolkit label: persona abreujadora de @ca
toolkit label: personne abréviatrice de @fr
toolkit label: rövidítő személye: @hu
toolkit label: özetleyen kişi @tr
toolkit label: συντμητής φυσικό πρόσωπο του @el
toolkit label: شخص مُلخص @ar
toolkit label: ……是缩编者个人 @zh-hans
has subproperty: P50615
lexical alias: abridgerPersonOf.en
status: Published
type: Property
domain: C10004
label: er forkorter for (person) @no
label: er person, som er forkorter af @da
label: est une personne abréviatrice de @fr
label: ir saīsinātājs (persona) @lv
label: is abridger person of @en
label: is inkorter-persoon van @nl
label: ist Person als Kürzende/Kürzender von @de
label: lühendaja (isik) väljenduses @et
label: rövidítő személye a következőnek: @hu
label: è compendiatore persona di @it
label: és persona abreujadora de @ca
label: özetleyen kişisidir @tr
label: είναι συντμητής φυσικό πρόσωπο του @el
label: هو شخص مُلخّص لـ @ar
label: 是……的缩编者个人 @zh-hans
sub property of: lyhentäjä (toimija) ekspressiossa
sub property of: tarkastaja (henkilö) ekspressiossa
definition: Bir kişiyi, bir eserin genel anlamını veya anlatım biçimini değiştirmeksizin başka bir eserin anlatımının kısaltılmasına kişinin katkısını içeren anlatımla ilişkilendirir. @tr
definition: Correla una persona a un'espressione che comprende un contributo di una persona nell'abbreviazione di un'espressione di un'altra opera senza modificare il significato generale o la modalità di presentazione. @it
definition: Hozzákapcsol egy személyt egy kifejezési formához, amely magában foglalja egy személy közreműködését egy másik mű kifejezési formájának lerövidítésével úgy, hogy a prezentáció általános jelentése vagy módja nem változik. @hu
definition: Liittää henkilön ekspressioon, jonka tekemisessä henkilö on osallisena lyhentämällä toisen teoksen ekspressiota muuttamatta esityksen yleistä sisältöä tai tyyliä.
definition: Met une personne en relation avec une expression qui intègre une contribution de la part d’une personne consistant à raccourcir une expression d’une autre œuvre sans en changer le sens général ou le mode de présentation. @fr
definition: Relaciona una persona amb una expressió que inclou una contribució d’una persona escurçant una expressió d’una altra obra sense canviar-ne el significat general o la forma de presentació. @ca
definition: Relateert een persoon aan een expressie die omvat een bijdrage door een persoon door inkorten van een expressie of ander werk zonder de algemene betekenis of manier van uiteenzetting te wijzigen. @nl
definition: Relaterer en person til et udtryk, som omfatter en persons bidrag ved at forkorte udtrykket af et andet værk, uden at ændre den overordnede betydning eller præsentationsmåde. @da
definition: Relaterer en person til et uttrykk som inkluderer et bidrag fra en person i form av å forkorte et uttrykk av et relatert verk uten å endre meningen eller presentasjonsformen. @no
definition: Relates a person to an expression that includes a contribution by a person of shortening an expression of another work without changing the general meaning or manner of presentation. @en
definition: Sasaista personu ar izteiksmi, kas ietver personas ieguldījumu, saīsinot cita darba izteiksmi, nemainot darba nozīmi vai pasniegšanas veidu. @lv
definition: Seostab isiku väljendusega, millesse isik on andnud panuse, lühendades teise teose väljendust, muutmata üldist tähendust ja esitusviisi. @et
definition: Setzt eine Person in Beziehung zu einer Expression, zu der eine Person beiträgt, indem sie eine Expression eines anderen Werks kürzt, ohne dabei die allgemeine Bedeutung oder Art der Darstellung zu verändern. @de
definition: يربط شخصا بتعبيرة تتضمن إسهام شخص في تلخيص تعبيرة لعمل آخر دون تغيير المعنى العام أو طريقة العرض. @ar
definition: 将一个个人与包括缩短另一种作品的一种内容表达而不改变其总体意义或呈现方式的一个个人的贡献的一种内容表达关联起来。 @zh-hans

puhuja (henkilö) ekspressiossa
has element type: 2
toolkit definition: An expression that includes a contribution by a person of speaking words, such as a lecture, speech, etc. @en
toolkit definition: Bir ders, konuşma vb… alanlarda konuşan bir kişinin katkısını içeren bir anlatım. @tr
toolkit definition: Een expressie die omvat een bijdrage door een persoon van woorden spreken, zoals een lezing, speech etc. @nl
toolkit definition: Egy kifejezési forma, amely magában foglalja egy személy élőszóbeli közreműködését, például előadásként, beszédként stb. @hu
toolkit definition: Eine Expression, zu der eine Person beiträgt, indem sie Worte, wie zum Beispiel einen Vortrag, eine Rede oder ähnliches, spricht. @de
toolkit definition: Ekspressio, jonka tekemisessä henkilö on osallisena puhumalla, kuten luennoimalla tai pitämällä puheen tms.
toolkit definition: Espressione che comprende un contributo di una persona nell'esposizione di parole, come una conferenza, discorso, etc. @it
toolkit definition: Et uttrykk som inkluderer et bidrag fra en person i form av å uttale ord, for eksempel en forelesning, tale, etc. @no
toolkit definition: Expression qui intègre une contribution de la part d’une personne consistant à énoncer des paroles, telles qu’un exposé, un discours, etc. @fr
toolkit definition: Expressió que inclou una contribució d’una persona pronunciant paraules, com ara una conferència, un discurs, etc. @ca
toolkit definition: Izteiksme, kas ietver personas ieguldījumu, uzstājoties, piemēram, ar lekciju, runu u.tml. @lv
toolkit definition: Udtryk, som omfatter en persons bidrag ved at fremføre ord, såsom en forelæsning, tale etc. @da
toolkit definition: Väljendus, millesse isik on andnud panuse kõneldes, nt loengut või kõnet pidades. @et
toolkit definition: تعبيرة تتضمن إسهام شخص بالتحدث بكلمات، كما في محاضرة أو خطبة، إلخ. @ar
toolkit definition: 包括有诸如讲座和演讲之类讲话的一个个人的贡献的一种内容表达 @zh-hans
toolkit label: Person als Rednerin/Redner von @de
toolkit label: ir orators (persona) @lv
toolkit label: konuşmacı kişi @tr
toolkit label: kõneleja (isik) väljenduses @et
toolkit label: oratore persona di @it
toolkit label: person, som er forelæser/taler af @da
toolkit label: persona oradora de @ca
toolkit label: personne oratrice de @fr
toolkit label: puhuja (henkilö) ekspressiossa
toolkit label: speaker person of @en
toolkit label: spreker-persoon van @nl
toolkit label: taler for (person) @no
toolkit label: élőszavas előadó személye: @hu
toolkit label: ομιλητής φυσικό πρόσωπο του @el
toolkit label: شخص متحدث @ar
toolkit label: ……的演说者个人 @zh-hans
has subproperty: P50616
lexical alias: speakerPersonOf.en
status: Published
type: Property
domain: C10004
label: er person, som er forelæser/taler af @da
label: er taler for (person) @no
label: est une personne oratrice de @fr
label: ir orators (persona) @lv
label: is speaker person of @en
label: is spreker-persoon van @nl
label: ist Person als Rednerin/Redner von @de
label: konuşmacısıdır @tr
label: kõneleja (isik) väljenduses @et
label: è oratore persona di @it
label: élőszavas előadó személye a következőnek: @hu
label: és persona oradora de @ca
label: είναι ομιλητής φυσικό πρόσωπο του @el
label: هو شخص متحدث لـ @ar
label: 是……的演说者个人 @zh-hans
sub property of: puhuja (toimija) ekspressiossa
sub property of: esittäjä (henkilö) ekspressiossa
definition: Bir kişiyi, kişinin bir konferans, konuşma vb. gibi konuşan katkısını içeren anlatımla ilişkilendirir. @tr
definition: Correla una persona a un'espressione che comprende un contributo di una persona nell'esposizione di parole, come una conferenza, discorso, etc. @it
definition: Hozzákapcsol egy személyt egy kifejezési formához, amely magában foglalja egy személy élőszóbeli közreműködését, például előadásként, beszédként stb. @hu
definition: Liittää henkilön ekspressioon, jonka tekemisessä henkilö on osallisena puhumalla, kuten luennoimalla tai pitämällä puheen tms.
definition: Met une personne en relation avec une expression qui intègre une contribution de la part d’une personne consistant à énoncer des paroles, telles qu’un exposé, un discours, etc. @fr
definition: Relaciona una persona amb una expressió que inclou una contribució d’una persona pronunciant paraules, com ara una conferència, un discurs, etc. @ca
definition: Relateert een persoon aan een expressie die omvat een bijdrage door een persoon van woorden spreken, zoals een lezing, speech etc. @nl
definition: Relaterer en person til et udtryk, som omfatter en persons bidrag ved at fremføre ord, såsom en forelæsning, tale etc. @da
definition: Relaterer en person til et uttrykk som inkluderer et bidrag fra en person i form av å uttale ord, for eksempel en forelesning, tale, etc. @no
definition: Relates a person to an expression that includes a contribution by a person of speaking words, such as a lecture, speech, etc. @en
definition: Sasaista personu ar izteiksmi, kas ietver personas ieguldījumu, uzstājoties, piemēram, ar lekciju, runu u.tml. @lv
definition: Seostab isiku väljendusega, millesse isik on andnud panuse kõneldes, nt loengut või kõnet pidades. @et
definition: Setzt eine Person in Beziehung zu einer Expression, zu der eine Person beiträgt, indem sie Worte, wie zum Beispiel einen Vortrag, eine Rede oder ähnliches, spricht. @de
definition: يربط شخصا بتعبيرة تتضمن إسهام شخص بالتحدث بكلمات، كما في محاضرة أو خطبة، إلخ. @ar
definition: 将一个个人与包括有诸如讲座和演讲之类讲话的一个个人的贡献的一种内容表达关联起来。 @zh-hans

äänittäjä (henkilö) ekspressiossa
has element type: 2
toolkit definition: An expression that includes a contribution by a person of supervising the technical aspects of the audio content of a recording session. @en
toolkit definition: Bir kayıt seansının ses içeriğinin teknik yönlerini denetleyen bir kişinin katkısını içeren bir anlatım. @tr
toolkit definition: Een expressie die omvat een bijdrage door een persoon door toezicht houden op de technische aspecten van de geluidscontent van een opnamesessie. @nl
toolkit definition: Egy kifejezési forma, amely magában foglalja egy személy közreműködését a hangtartalom rögzítését szolgáló munkamenet műszaki aspektusainak felügyeletében. @hu
toolkit definition: Eine Expression, zu der eine Person beiträgt, indem sie die technischen Aspekte des Audio-Inhalts einer Aufnahme überwacht. @de
toolkit definition: Ekspressio, jonka äänisisällön tekemiseen henkilö osallistuu valvomalla äänityksen teknistä toteutusta.
toolkit definition: Espressione che comprende un contributo di una persona nella supervisione degli aspetti tecnici del contenuto audio di una sessione di registrazione. @it
toolkit definition: Et uttrykk som inkluderer et bidrag fra en person i form av å lede de tekniske aspektene av lydinnholdet under en innspilling. @no
toolkit definition: Expression qui intègre une contribution de la part d’une personne consistant à superviser les aspects techniques du contenu audio d’une séance d’enregistrement. @fr
toolkit definition: Expressió que inclou una contribució d’una persona supervisant els aspectes tècnics del contingut àudio d’una sessió d’enregistrament. @ca
toolkit definition: Izteiksme, kas ietver personas ieguldījumu, uzraugot audio satura tehniskos parametrus ieraksta laikā. @lv
toolkit definition: Udtryk, som omfatter en persons bidrag ved at føre tilsyn med de tekniske aspekter af lydindholdet til en lyd- eller videooptagelse. @da
toolkit definition: Väljendus, millesse isik on andnud panuse, juhendades helisisu salvestamise tehnilisi aspekte. @et
toolkit definition: تعبيرة تتضمن إسهام شخص بالإشراف على الجوانب الفنية لمحتوى صوتي لجلسة تسجيل. @ar
toolkit definition: 包括监督一个录制过程中的音频内容的技术方面的一个个人的贡献的一种内容表达 @zh-hans
toolkit label: Person als Aufnahmetechnikerin/Aufnahmetechniker von @de
toolkit label: hangrögzítő személye: @hu
toolkit label: ingegnere della registrazione persona di @it
toolkit label: innspillingstekniker for (person) @no
toolkit label: ir ierakstu inženieris (persona) @lv
toolkit label: kayıt mühendisi @tr
toolkit label: opnametechnicus-persoon van @nl
toolkit label: person, som er indspilningstekniker af @da
toolkit label: persona enginyera de so de @ca
toolkit label: personne preneuse de son de @fr
toolkit label: recording engineer person of @en
toolkit label: salvestusinsener (isik) väljenduses @et
toolkit label: äänittäjä (henkilö) ekspressiossa
toolkit label: μηχανικός ηχογράφησης φυσικό πρόσωπο του @el
toolkit label: شخص مهندس تسجيل @ar
toolkit label: ……的录制工程师个人 @zh-hans
has subproperty: P50617
lexical alias: recordingEngineerPersonOf.en
status: Published
type: Property
domain: C10004
label: er innspillingstekniker for (person) @no
label: er person, som er indspilningstekniker af @da
label: est une personne preneuse de son de @fr
label: hangrögzítő személye a következőnek: @hu
label: ir ierakstu inženieris (persona) @lv
label: is opnametechnicus-persoon van @nl
label: is recording engineer person of @en
label: ist Person als Aufnahmetechnikerin/Aufnahmetechniker von @de
label: salvestusinsener (isik) väljenduses @et
label: ses kayıt mühendisi kişisidir @tr
label: è ingegnere della registrazione persona di @it
label: és persona enginyera de so de @ca
label: είναι μηχανικός ηχογράφησης φυσικό πρόσωπο του @el
label: هو شخص مهندس تسجيل لـ @ar
label: 是……的录制工程师个人 @zh-hans
sub property of: äänittäjä (toimija) ekspressiossa
sub property of: ääniteknikko (henkilö) ekspressiossa
definition: Bir kişiyi, kişinin bir ses kaydı içeriğinin teknik yönlerini denetleyen katkısını içeren anlatımla ilişkilendirir. @tr
definition: Correla una persona a un'espressione che comprende un contributo di una persona nella supervisione degli aspetti tecnici del contenuto audio di una sessione di registrazione. @it
definition: Hozzákapcsol egy személyt egy kifejezési formához, amely magában foglalja egy személy közreműködését a hangtartalom rögzítését szolgáló munkamenet műszaki aspektusainak felügyeletében. @hu
definition: Liittää henkilön ekspressioon, jonka äänisisällön tekemiseen henkilö osallistuu valvomalla äänityksen teknistä toteutusta.
definition: Met une personne en relation avec une expression qui intègre une contribution de la part d’une personne consistant à superviser les aspects techniques du contenu audio d’une séance d’enregistrement. @fr
definition: Relaciona una persona amb una expressió que inclou una contribució d’una persona supervisant els aspectes tècnics del contingut àudio d’una sessió d’enregistrament. @ca
definition: Relateert een persoon aan een expressie die omvat een bijdrage door een persoon door toezicht houden op de technische aspecten van de geluidscontent van een opnamesessie. @nl
definition: Relaterer en person til et udtryk, som omfatter en persons bidrag ved at føre tilsyn med de tekniske aspekter af lydindholdet til en lyd- eller videooptagelse. @da
definition: Relaterer en person til et uttrykk som inkluderer et bidrag fra en person i form av å lede de tekniske aspektene av lydinnholdet under en innspilling. @no
definition: Relates a person to an expression that includes a contribution by a person of supervising the technical aspects of the audio content of a recording session. @en
definition: Sasaista personu ar izteiksmi, kas ietver personas ieguldījumu, uzraugot audio satura tehniskos parametrus ieraksta laikā. @lv
definition: Seostab isiku väljendusega, millesse isik on andnud panuse, juhendades helisisu salvestamise tehnilisi aspekte. @et
definition: Setzt eine Person in Beziehung zu einer Expression, zu der eine Person beiträgt, indem sie die technischen Aspekte des Audio-Inhalts einer Aufnahme überwacht. @de
definition: يربط شخصا بتعبيرة تتضمن إسهام شخص بالإشراف على الجوانب الفنية لمحتوى صوتي لجلسة تسجيل. @ar
definition: 将一个个人与包括监督一个录制过程中的音频内容的技术方面的一个个人的贡献的一种内容表达关联起来。 @zh-hans

liikkuvaan kuvaan osallistuja (henkilö) ekspressiossa
has element type: 2
toolkit definition: An expression that includes a contribution by a person of taking an active role as a participant. @en
toolkit definition: Een expressie die omvat een bijdrage door een persoon door een actieve rol te nemen als deelnemer. @nl
toolkit definition: Egy kifejezési forma, amely magában foglalja egy résztvevőként aktív szerepet vállaló személy közreműködését. @hu
toolkit definition: Eine Expression, zu der eine Person beiträgt, indem sie eine aktive Rolle als Teilnehmerin/Teilnehmer einnimmt. @de
toolkit definition: Ekspressio, jossa henkilö on osallisena ei-fiktiivisen liikkuvan kuvan teoksen ekspression tekemisessä ottamalla aktiivisen roolin osallistujana.
toolkit definition: Espressione che comprende un contributo di una persona nell'assunzione di un ruolo attivo come partecipante. @it
toolkit definition: Et uttrykk som inkluderer et bidrag fra en person i form av å ha en aktiv rolle som deltaker. @no
toolkit definition: Expression qui intègre une contribution de la part d’une personne consistant à jouer un rôle actif comme participant. @fr
toolkit definition: Expressió que inclou una contribució d’una persona tenint un paper actiu com a participant. @ca
toolkit definition: Izteiksme, kas ietver personas ieguldījumu, aktīvi piedaloties kā dalībnieks. @lv
toolkit definition: Katılımcı olarak aktif bir rol alan bir kişinin katkısını içeren bir anlatım. @tr
toolkit definition: Udtryk, som omfatter en persons bidrag ved at påtage sig en aktiv rolle som deltager. @da
toolkit definition: Väljendus, millesse isik on andnud panuse, olles osalejana aktiivses rollis. @et
toolkit definition: تعبيرة تتضمن إسهام شخص في القيام بدور نشط كمشارك. @ar
toolkit definition: 包括一个积极参与者的一个个人的贡献的一种内容表达 @zh-hans
toolkit label: Ekran katılımcı kişisi @tr
toolkit label: Person als On-Screen-Teilnehmerin/On-Screen-Teilnehmer von @de
toolkit label: deelnemer in beeld-persoon van @nl
toolkit label: deltaker i program for (person) @no
toolkit label: ekraanil osaleja (isik) väljenduses @et
toolkit label: ir ekrānā redzamais dalībnieks (persona) @lv
toolkit label: képernyőn megjelenő résztvevő személye: @hu
toolkit label: liikkuvaan kuvaan osallistuja (henkilö) ekspressiossa
toolkit label: onscreen participant person of @en
toolkit label: partecipante video persona di @it
toolkit label: person, som er programmedvirkende af @da
toolkit label: persona participant en pantalla de @ca
toolkit label: personne participante à l’écran de @fr
toolkit label: οθονικός συμμετέχων φυσικό πρόσωπο του @el
toolkit label: شخص مشارك على الشاشة @ar
toolkit label: ……的屏幕参与者个人 @zh-hans
has subproperty: P50618
lexical alias: onscreenParticipantPersonOf.en
status: Published
type: Property
domain: C10004
label: ekraanil osaleja (isik) väljenduses @et
label: ekran katılımcısı kişisidir @tr
label: er deltaker i program for (person) @no
label: er person, som er programmedvirkende af @da
label: est une personne participante à l’écran de @fr
label: ir ekrānā redzamais dalībnieks (persona) @lv
label: is deelnemer in beeld-persoon van @nl
label: is onscreen participant person of @en
label: ist Person als On-Screen-Teilnehmerin/On-Screen-Teilnehmer von @de
label: képernyőn megjelenő résztvevő személye a következőnek: @hu
label: è partecipante video persona di @it
label: és persona participant en pantalla de @ca
label: είναι οθονικός συμμετέχων φυσικό πρόσωπο του @el
label: هو شخص مشارك على الشاشة لـ @ar
label: 是……的屏幕参与者个人 @zh-hans
sub property of: liikkuvaan kuvaan osallistuja (toimija) ekspressiossa
sub property of: esitykseen osallinen henkilö ekspressiossa
definition: Bir kişiyi, katılımcı olarak aktif rol alan kişinin katkısını içeren anlatımla ilişkilendirir. @tr
definition: Correla una persona a un'espressione che comprende un contributo di una persona nell'assunzione di un ruolo attivo come partecipante. @it
definition: Hozzákapcsol egy személyt egy kifejezési formához, amely magában foglalja egy résztvevőként aktív szerepet vállaló személy közreműködését. @hu
definition: Liittää henkilön ekspressioon, jossa henkilö on osallisena ei-fiktiivisen liikkuvan kuvan teoksen ekspression tekemisessä ottamalla aktiivisen roolin osallistujana.
definition: Met une personne en relation avec une expression qui intègre une contribution de la part d’une personne consistant à jouer un rôle actif comme participant. @fr
definition: Relaciona una persona amb una expressió que inclou una contribució d’una persona tenint un paper actiu com a participant. @ca
definition: Relateert een persoon aan een expressie die omvat een bijdrage door een persoon door een actieve rol te nemen als deelnemer. @nl
definition: Relaterer en person til et udtryk, som omfatter en persons bidrag ved at påtage sig en aktiv rolle som deltager. @da
definition: Relaterer en person til et uttrykk som inkluderer et bidrag fra en person i form av å ha en aktiv rolle som deltaker. @no
definition: Relates a person to an expression that includes a contribution by a person of taking an active role as a participant. @en
definition: Sasaista personu ar izteiksmi, kas ietver personas ieguldījumu, aktīvi piedaloties kā dalībnieks. @lv
definition: Seostab isiku väljendusega, millesse isik on andnud panuse, olles osalejana aktiivses rollis. @et
definition: Setzt eine Person in Beziehung zu einer Expression, zu der eine Person beiträgt, indem sie eine aktive Rolle als Teilnehmerin/Teilnehmer einnimmt. @de
definition: يربط شخصا بتعبيرة تتضمن إسهام شخص في القيام بدور نشط كمشارك . @ar
definition: 将一个个人与包括一个积极参与者的一个个人的贡献的一种内容表达关联起来。 @zh-hans

opettaja (henkilö) ekspressiossa
has element type: 2
toolkit definition: An expression that includes a contribution by a person of teaching or providing a demonstration. @en
toolkit definition: Bir gösteriyi öğreten ya da temin eden bir kişinin katkısını içeren bir anlatım. @tr
toolkit definition: Een expressie die omvat een bijdrage door een persoon door onderwijzen of verschaffen van een demonstratie. @nl
toolkit definition: Egy kifejezési forma, amely magában foglalja egy tanító vagy szemléltetést tartó személy közreműködését. @hu
toolkit definition: Eine Expression, zu der eine Person beiträgt, indem sie unterrichtet oder etwas demonstriert. @de
toolkit definition: Ekspressio, jonka tekemisessä henkilö on osallisena opettamalla tai esittelemällä.
toolkit definition: Espressione che comprende un contributo di una persona nell'insegnamento o offerta di una dimostrazione. @it
toolkit definition: Et uttrykk som inkluderer et bidrag fra en person i form av å gi instruksjoner eller en demonstrasjon. @no
toolkit definition: Expression qui intègre une contribution de la part d’une personne consistant à enseigner ou à faire une démonstration. @fr
toolkit definition: Expressió que inclou una contribució d’una persona ensenyant o proporcionant una demostració. @ca
toolkit definition: Izteiksme, kas ietver personas ieguldījumu, mācot vai demonstrējot. @lv
toolkit definition: Udtryk, som omfatter en persons bidrag ved at undervise eller ved at give en demonstration. @da
toolkit definition: Väljendus, millesse isik on andnud panuse, õpetades või ette näidates. @et
toolkit definition: تعبيرة تتضمن إسهام شخص للتدريس أو تقديم عرض توضيحي. @ar
toolkit definition: 包括有教学或提供演示的一个个人的贡献的一种内容表达 @zh-hans
toolkit label: Person als Ausbilderin/Ausbilder von @de
toolkit label: eğitmen kişisidir @tr
toolkit label: instructeur-persoon van @nl
toolkit label: instructor person of @en
toolkit label: instruktor (isik) väljenduses @et
toolkit label: instruktør for (person) @no
toolkit label: ir instruktors (persona) @lv
toolkit label: istruttore persona di @it
toolkit label: oktató személye: @hu
toolkit label: opettaja (henkilö) ekspressiossa
toolkit label: person, som er instruktør af @da
toolkit label: persona instructora de @ca
toolkit label: personne enseignante de @fr
toolkit label: εκπαιδευτής φυσικό πρόσωπο του @el
toolkit label: شخص محاضر @ar
toolkit label: ……的教师个人 @zh-hans
has subproperty: P50619
lexical alias: instructorPersonOf.en
status: Published
type: Property
domain: C10004
label: er instruktør for (person) @no
label: er person, som er instruktør af @da
label: est une personne enseignante de @fr
label: eğitmen kişisidir @tr
label: instruktor (isik) väljenduses @et
label: ir instruktors (persona) @lv
label: is instructeur-persoon van @nl
label: is instructor person of @en
label: ist Person als Ausbilderin/Ausbilder von @de
label: oktató személye a következőnek: @hu
label: è istruttore persona di @it
label: és persona instructora de @ca
label: είναι εκπαιδευτής φυσικό πρόσωπο του @el
label: هو شخص محاضر لـ @ar
label: 是……的教师个人 @zh-hans
sub property of: opettaja (toimija) ekspressiossa
sub property of: esittäjä (henkilö) ekspressiossa
definition: Bir kişiyi, kişinin öğretme veya bir gösteri yapılmasıyla ilgili katkısını içeren anlatımla ilişkilendirir. @tr
definition: Correla una persona a un'espressione che comprende un contributo di una persona nell'insegnamento o offerta di una dimostrazione. @it
definition: Hozzákapcsol egy személyt egy kifejezési formához, amely magában foglalja egy tanító vagy szemléltetést tartó személy közreműködését. @hu
definition: Liittää henkilön ekspressioon, jonka tekemisessä henkilö on osallisena opettamalla tai esittelemällä.
definition: Met une personne en relation avec une expression qui intègre une contribution de la part d’une personne consistant à enseigner ou à faire une démonstration. @fr
definition: Relaciona una persona amb una expressió que inclou una contribució d’una persona ensenyant o proporcionant una demostració. @ca
definition: Relateert een persoon aan een expressie die omvat een bijdrage door een persoon door onderwijzen of verschaffen van een demonstratie. @nl
definition: Relaterer en person til et udtryk, som omfatter en persons bidrag ved at undervise eller ved at give en demonstration. @da
definition: Relaterer en person til et uttrykk som inkluderer et bidrag fra en person i form av å gi instruksjoner eller en demonstrasjon. @no
definition: Relates a person to an expression that includes a contribution by a person of teaching or providing a demonstration. @en
definition: Sasaista personu ar izteiksmi, kas ietver personas ieguldījumu, mācot vai demonstrējot. @lv
definition: Seostab isiku väljendusega, millesse isik on andnud panuse, õpetades või ette näidates. @et
definition: Setzt eine Person in Beziehung zu einer Expression, zu der eine Person beiträgt, indem sie unterrichtet oder etwas demonstriert. @de
definition: يربط شخصا بتعبيرة تتضمن إسهام شخص التدريس أو تقديم عرض توضيحي @ar
definition: 将一个个人与包括有教学或提供演示的一个个人的贡献的一种内容表达关联起来。 @zh-hans

taltioija (henkilö) ekspressiossa
has element type: 2
toolkit definition: An expression that includes a contribution by a person of using a recording device to capture sound or video during a recording session, including field recordings of natural sounds, folkloric events, music, or other performances. @en
toolkit definition: Doğal seslerin, folklorik olayların, müziğin veya diğer performansların saha kayıtları dahil olmak üzere, bir kayıt seansı sırasında ses veya video yakalamak için bir kayıt cihazı kullanan bir kişinin katkısını içeren bir anlatım. @tr
toolkit definition: Een expressie die omvat een bijdrage door een persoon door gebruik van een opnameapparaat om geluid of beeld vast te leggen gedurende een opnamesessie. @nl
toolkit definition: Egy kifejezési forma, amely magában foglalja egy személy közreműködését hang vagy videó rögzítését szolgáló felvevő eszköz használatában egy felvétel során, beleértve természetes hangokat, folklór eseményeket, zenét vagy más előadásokat is. @hu
toolkit definition: Eine Expression, zu der eine Person beiträgt, indem sie mit einem Aufnamegerät Ton oder Video aufnimmt. Darunter fallen Field Recordings natürlicher Geräusche, folkloristische Events, Musik oder ähnliches. @de
toolkit definition: Ekspressio, jonka tekemisessä henkilö on osallisena käyttämällä tallennuslaitetta äänen tai videon taltioimiseen tallennustilanteessa, mukaan lukien luonnonäänten, folklorististen tapahtumien, musiikin tms. kenttätallennukset.
toolkit definition: Espressione che comprende un contributo di una persona nell'utilizzo di un dispositivo di registrazione per acquisire suono o video durante una sessione di registrazione, incluse registrazioni sul campo di suoni naturali, eventi folkloristici, musica o altre esibizioni. @it
toolkit definition: Et uttrykk som inkluderer et bidrag fra en person i form av å bruke en opptaksenhet til å ta opp lyd eller video under en opptaksøkt, inkludert feltopptak av naturlyder, arrangementer knyttet til folkeminne, musikk eller andre framføringer. @no
toolkit definition: Expression qui intègre une contribution de la part d’une personne consistant à utiliser un appareil d’enregistrement pour capter le son ou la vidéo durant une séance d’enregistrement, y compris les enregistrements de terrain de sons naturels, de prestations folkloriques, de musique ou d’autres prestations. @fr
toolkit definition: Expressió que inclou una contribució d’una persona usant un mecanisme d’enregistrament per capturar so o vídeo durant una sessió d’enregistrament, inclosos els enregistraments de camp de sons naturals, d’esdeveniments folklòrics, de música o d’altres actuacions. @ca
toolkit definition: Izteiksme, kas ietver personas ieguldījumu, izmantojot ierakstu ierīces, lai iegūtu skaņas vai video ierakstus, tai skaitā dabas skaņu, brīvdabas pasākumu, dzīvās mūzikas u.tml. ierakstus. @lv
toolkit definition: Udtryk, som omfatter en persons bidrag ved at anvende et optageudstyr til at fange lyd eller video under en optagelse, inkl. feltoptagelser af naturlige lyde, folkloristiske begivenheder, musik eller andre optrædener. @da
toolkit definition: Väljendus, millesse isik on andnud panuse, jäädvustades salvestamise ajal salvestusseadmega heli või videopilti, kaasa arvatud loodushäälte, rahvaluule, muusika jms salvestamine välitöödel. @et
toolkit definition: تعبيرة تتضمن إسهام شخص في استخدام جهاز تسجيل لالتقاط الصوت أو الفيديو أثناء جلسة تسجيل، بما في ذلك التسجيلات الخارجية للأصوات الطبيعية أو الفعاليات الفولكلورية أو الموسيقى أو العروض الأخرى. @ar
toolkit definition: 包括通过采用录制设备在录制期间摄录声音或视频（包括自然声音、民俗活动、音乐或其他表演的现场录制）的一个个人的贡献的一种内容表达 @zh-hans
toolkit label: Person als Tonmeisterin/Tonmeister von @de
toolkit label: fonico persona di @it
toolkit label: ir ierakstu operators (persona) @lv
toolkit label: kayıtçısı @tr
toolkit label: operaator (isik) väljenduses @et
toolkit label: opnamemaker-persoon van @nl
toolkit label: person, som er tonemester af @da
toolkit label: persona operadora d’enregistrament de @ca
toolkit label: personne opératrice d’enregistrement de @fr
toolkit label: recordist for (person) @no
toolkit label: recordist person of @en
toolkit label: rögzítő személye: @hu
toolkit label: taltioija (henkilö) ekspressiossa
toolkit label: είναι καταγραφέας φυσικό πρόσωπο του @el
toolkit label: شخص فني تسجيل @ar
toolkit label: ……的录制者个人 @zh-hans
has subproperty: P50620
lexical alias: recordistPersonOf.en
status: Published
type: Property
domain: C10004
label: er person, som er tonemester af @da
label: er recordist for (person) @no
label: est une personne opératrice d’enregistrement de @fr
label: ir ierakstu operators (persona) @lv
label: is opnamemaker-persoon van @nl
label: is recordist person of @en
label: ist Person als Tonmeisterin/Tonmeister von @de
label: operaator (isik) väljenduses @et
label: rögzítő személye a következőnek: @hu
label: ses kayıt teknisyeni kişisidir @tr
label: è fonico persona di @it
label: és persona operadora d’enregistrament de @ca
label: είναι καταγραφέας φυσικό πρόσωπο του @el
label: هو شخص فني تسجيل لـ @ar
label: 是……的录制者个人 @zh-hans
sub property of: taltioija (toimija) ekspressiossa
sub property of: esitykseen osallinen henkilö ekspressiossa
definition: Bir kişiyi, doğal seslerin, folklorik etkinliklerin, müziğin veya diğer performansların saha kayıtları da dahil olmak üzere, bir kayıt süresince ses veya video kaydetmek için bir kayıt cihazı kullanan bir kişinin katkısını içeren bir anlatımla ilişkilendirir. @tr
definition: Correla una persona a un'espressione che comprende un contributo di una persona nell'utilizzo di un dispositivo di registrazione per acquisire suono o video durante una sessione di registrazione, incluse registrazioni sul campo di suoni naturali, eventi folkloristici, musica o altre esibizioni. @it
definition: Hozzákapcsol egy személyt egy kifejezési formához, amely magában foglalja egy személy közreműködését hang vagy videó rögzítését szolgáló felvevő eszköz használatában egy felvétel során, beleértve természetes hangokat, folklór eseményeket, zenét vagy más előadásokat is. @hu
definition: Liittää henkilön ekspressioon, jonka tekemisessä henkilö on osallisena käyttämällä tallennuslaitetta äänen tai videon taltioimiseen tallennustilanteessa, mukaan lukien luonnonäänten, folklorististen tapahtumien, musiikin tms. kenttätallennukset.
definition: Met une personne en relation avec une expression qui intègre une contribution de la part d’une personne consistant à utiliser un appareil d’enregistrement pour capter le son ou la vidéo durant une séance d’enregistrement, y compris les enregistrements de terrain de sons naturels, de prestations folkloriques, de musique ou d’autres prestations. @fr
definition: Relaciona una persona amb una expressió que inclou una contribució d’una persona usant un mecanisme d’enregistrament per capturar so o vídeo durant una sessió d’enregistrament, inclosos els enregistraments de camp de sons naturals, d’esdeveniments folklòrics, de música o d’altres actuacions. @ca
definition: Relateert een persoon aan een expressie die omvat een bijdrage door een persoon door gebruik van een opnameapparaat om geluid of beeld vast te leggen gedurende een opnamesessie. @nl
definition: Relaterer en person til et udtryk, som omfatter en persons bidrag ved at anvende et optageudstyr til at fange lyd eller video under en optagelse, inkl. feltoptagelser af naturlige lyde, folkloristiske begivenheder, musik eller andre optrædener. @da
definition: Relaterer en person til et uttrykk som inkluderer et bidrag fra en person i form av å bruke en opptaksenhet til å ta opp lyd eller video under en opptaksøkt, inkludert feltopptak av naturlyder, arrangementer knyttet til folkeminne, musikk eller andre framføringer. @no
definition: Relates a person to an expression that includes a contribution by a person of using a recording device to capture sound or video during a recording session, including field recordings of natural sounds, folkloric events, music, or other performances. @en
definition: Sasaista personu ar izteiksmi, kas ietver personas ieguldījumu, izmantojot ierakstu ierīces, lai iegūtu skaņas vai video ierakstus, tai skaitā dabas skaņu, brīvdabas pasākumu, dzīvās mūzikas u.tml. ierakstus. @lv
definition: Seostab isiku väljendusega, millesse isik on andnud panuse, jäädvustades salvestamise ajal salvestusseadmega heli või videopilti, kaasa arvatud loodushäälte, rahvaluule, muusika jms salvestamine välitöödel. @et
definition: Setzt eine Person in Beziehung zu einer Expression, zu der eine Person beiträgt, indem sie mit einem Aufnamegerät Ton oder Video aufnimmt. Darunter fallen Field Recordings natürlicher Geräusche, folkloristische Events, Musik oder ähnliches. @de
definition: يربط شخصا بتعبيرة تتضمن إسهام شخص في استخدام جهاز تسجيل لالتقاط الصوت أو الفيديو أثناء جلسة تسجيل، بما في ذلك التسجيلات الخارجية للأصوات الطبيعية أو الفعاليات الفولكلورية أو الموسيقى أو العروض الأخرى. @ar
definition: 将一个个人与包括通过采用录制设备在录制期间摄录声音或视频（包括自然声音、民俗活动、音乐或其他表演的现场录制）的一个个人的贡献的一种内容表达关联起来。 @zh-hans

musiikkiohjelmoija (henkilö) ekspressiossa
has element type: 2
toolkit definition: An expression that includes a contribution by a person of using electronic audio devices or computer software to generate sounds. @en
toolkit definition: Een expressie die omvat een bijdrage door een actor door gebruik van elektronische geluidsapparatuur of computersoftware om geluiden te genereren. @nl
toolkit definition: Egy kifejezési forma, amely magában foglalja egy személy közreműködését hangok generálásában elektronikus audioeszközök vagy számítógépes szoftver használatával. @hu
toolkit definition: Eine Expression, zu der eine Person beiträgt, indem sie durch das Einsetzen elektronischer Audio-Geräte oder von Computerprogrammen Klangeffekte erzeugt. @de
toolkit definition: Ekspressio, jossa henkilö on osallisena musiikkiteoksen ekspression tekemisessä tuottamalla ääniä sähköisillä äänilaitteilla tai tietokoneohjelmilla.
toolkit definition: Espressione che comprende un contributo di una persona nell'utilizzo di dispositivi audio elettronici o software per generare suoni. @it
toolkit definition: Et uttrykk som inkluderer et bidrag fra en person i form av å bruke elektroniske lydenheter eller programvare til å lage lyder. @no
toolkit definition: Expression qui intègre une contribution de la part d’une personne consistant à utiliser des appareils audio électroniques ou un logiciel pour générer des sons. @fr
toolkit definition: Expressió que inclou una contribució d’una persona usant mecanismes electrònics àudio o programari d’ordinador per generar sons. @ca
toolkit definition: Izteiksme, kas ietver personas ieguldījumu, izmantojot elektroniskas audioierīces un/vai datora programmatūru, lai radītu skaņu. @lv
toolkit definition: Ses üretmek için elektronik ses cihazları veya bilgisayar yazılımları kullanan bir kişinin katkısını içeren bir anlatım. @tr
toolkit definition: Udtryk, som omfatter en persons bidrag ved at bruge elektronisk lydapparatur eller computersoftware til at generere lyd. @da
toolkit definition: Väljendus, millesse isik on andnud panuse, tekitades helisid elektrooniliste audioseadmete või arvutitarkvara abil. @et
toolkit definition: تعبيرة تتضمن إسهام شخص في استخدام أجهزة الصوت الإلكترونية أو برمجيات الحاسب لتوليد أصوات. @ar
toolkit definition: 包括使用电子音频设备或计算机软件产生声音的一个个人的贡献的一种内容表达 @zh-hans
toolkit label: Person als Musik-Programmiererin/Musik-Programmierer von @de
toolkit label: ir mūzikas programmētājs (persona) @lv
toolkit label: music programmer person of @en
toolkit label: music programmer-persoon van @nl
toolkit label: musiikkiohjelmoija (henkilö) ekspressiossa
toolkit label: musikkprogrammerer for (person) @no
toolkit label: muusikaprogrammeerija (isik) väljenduses @et
toolkit label: müzik programcı kişisi @tr
toolkit label: person, som er musikprogrammør af @da
toolkit label: persona programadora de música de @ca
toolkit label: personne programmeuse musicale de @fr
toolkit label: programmatore musicale persona di @it
toolkit label: zeneprogramozó személye: @hu
toolkit label: μουσικός προγραμματιστής φυσικό πρόσωπο του @el
toolkit label: شخص مبرمج موسيقى @ar
toolkit label: ……的音乐编程者个人 @zh-hans
has subproperty: P50621
lexical alias: musicProgrammerPersonOf.en
status: Published
type: Property
domain: C10004
label: er musikkprogrammerer for (person) @no
label: er person, som er musikprogrammør af @da
label: est une personne programmeuse musicale de @fr
label: ir mūzikas programmētājs (persona) @lv
label: is music programmer person of @en
label: is music programmer-persoon van @nl
label: ist Person als Musik-Programmiererin/Musik-Programmierer von @de
label: muusikaprogrammeerija (isik) väljenduses @et
label: müzik programcısı kişisidir @tr
label: zeneprogramozó személye a következőnek: @hu
label: è programmatore musicale persona di @it
label: és persona programadora de música de @ca
label: είναι μουσικός προγραμματιστής φυσικό πρόσωπο του @el
label: هو شخص مبرمج موسيقى لـ @ar
label: 是……的音乐编程者个人 @zh-hans
sub property of: musiikkiohjelmoija (toimija) ekspressiossa
sub property of: esitykseen osallinen henkilö ekspressiossa
definition: Bir kişiyi, kişinin ses üretmek için elektronik ses cihazları veya bilgisayar yazılımı kullanan katkısını içeren anlatımla ilişkilendirir. @tr
definition: Correla una persona a un'espressione che comprende un contributo di una persona nell'utilizzo di dispositivi audio elettronici o software per generare suoni. @it
definition: Hozzákapcsol egy személyt egy kifejezési formához, amely magában foglalja egy személy közreműködését hangok generálásában elektronikus audioeszközök vagy számítógépes szoftver használatával. @hu
definition: Liittää henkilön ekspressioon, jossa henkilö on osallisena musiikkiteoksen ekspression tekemisessä tuottamalla ääniä sähköisillä äänilaitteilla tai tietokoneohjelmilla.
definition: Met une personne en relation avec une expression qui intègre une contribution de la part d’une personne consistant à utiliser des appareils audio électroniques ou un logiciel pour générer des sons. @fr
definition: Relaciona una persona amb una expressió que inclou una contribució d’una persona usant mecanismes electrònics àudio o programari d’ordinador per generar sons. @ca
definition: Relateert een persoon aan een expressie die omvat een bijdrage door een actor door gebruik van elektronische geluidsapparatuur of computersoftware om geluiden te genereren. @nl
definition: Relaterer en person til et udtryk, som omfatter en persons bidrag ved at bruge elektronisk lydapparatur eller computersoftware til at generere lyd. @da
definition: Relaterer en person til et uttrykk som inkluderer et bidrag fra en person i form av å bruke elektroniske lydenheter eller programvare til å lage lyder. @no
definition: Relates a person to an expression that includes a contribution by a person of using electronic audio devices or computer software to generate sounds. @en
definition: Sasaista personu ar izteiksmi, kas ietver personas ieguldījumu, izmantojot elektroniskas audioierīces un/vai datora programmatūru, lai radītu skaņu. @lv
definition: Seostab isiku väljendusega, millesse isik on andnud panuse, tekitades helisid elektrooniliste audioseadmete või arvutitarkvara abil. @et
definition: Setzt eine Person in Beziehung zu einer Expression, zu der eine Person beiträgt, indem sie durch das Einsetzen elektronischer Audio-Geräte oder von Computerprogrammen Klangeffekte erzeugt. @de
definition: يربط شخصا بتعبيرة تتضمن إسهام شخص في استخدام أجهزة الصوت الإلكترونية أو برمجيات الحاسب لتوليد أصوات. @ar
definition: 将一个个人与包括使用电子音频设备或计算机软件产生声音的一个个人的贡献的一种内容表达关联起来。 @zh-hans
scope note: Darunter fällt nicht das Schaffen eines neuen Musikwerks. @de
scope note: De creatie van een nieuw muziekwerk is uitgesloten @nl
scope note: Det å skape et nytt musikalsk verk er ikke inkludert. @no
scope note: Egy új zenemű létrehozása nem tartozik ide. @hu
scope note: Ei hõlma uue muusikateose loomist. @et
scope note: Ei koske uuden musiikkiteoksen luomista.
scope note: La création d’une nouvelle œuvre musicale est exclue. @fr
scope note: Neietver jauna mūzikas darba radīšanu. @lv
scope note: Skabelsen af et nyt musikværk er ikke omfattet. @da
scope note: S’exclou la creació d’una obra musical nova. @ca

transkriboija (henkilö) ekspressiossa
has element type: 2
toolkit definition: An expression that includes a contribution by a person of writing down or notating previously unwritten or unnotated content, or by changing it from one system of notation to another. @en
toolkit definition: Daha önce yazılmamış veya not edilmemiş içeriği not eden ya da bir notasyon sisteminden diğerine değiştiren bir kişinin katkısını içeren bir anlatım. @tr
toolkit definition: Een expressie die omvat een bijdrage door een persoon door opschrijven of noteren van voorheen ongeschreven of niet-genoteerde content, of door het te wijzigen van een notatiesysteen naar een ander. @nl
toolkit definition: Egy kifejezési forma, amely magában foglalja egy személy közreműködését korábban le nem írt vagy le nem jegyzett tartalom leírásában vagy lejegyzésében, vagy egyik jelölési rendszerről a másikra történő átvitelében. @hu
toolkit definition: Eine Expression, zu der eine Person beiträgt, indem sie ungeschriebenen und nicht notierten Inhalt niederschreibt oder ihn von einem Notationssystem in ein anderes überträgt. @de
toolkit definition: Ekspressio, jonka tekemisessä henkilö on osallisena kirjoittamalla muistiin tai nuotintamalla aiemmin kirjoittamattoman tai nuotintamattoman sisällön tai muuttamalla sen nuotinnusjärjestelmästä toiseen.
toolkit definition: Espressione che comprende un contributo di una persona nella trascrizione o annotazione di contenuti precedentemente non scritti o non annotati, o nella trasformazione da un sistema di notazione a un altro. @it
toolkit definition: Et uttrykk som inkluderer et bidrag fra en person i form av å skrive ned eller notere tidligere uskrevet eller unotert innhold, eller ved å endre det fra ett notasjonssystem til et annet. @no
toolkit definition: Expression qui intègre une contribution de la part d’une personne consistant à écrire ou à noter un contenu auparavant non écrit ou non noté, ou bien à le transposer d’un système de notation à un autre. @fr
toolkit definition: Expressió que inclou una contribució d’una persona escrivint o notant un contingut que no estava escrit o notat, o canviant-lo d’un sistema de notació a un altre. @ca
toolkit definition: Izteiksme, kas ietver personas ieguldījumu, pierakstot iepriekš nepierakstītu mutvārdu vai mūzikas saturu, vai pārrakstot to citādā pierakstā. @lv
toolkit definition: Udtryk, som omfatter en persons bidrag ved at nedskrive eller notere uskrevet eller ikke-noteret indhold, eller ved at ændre det fra et notationssystem til et andet. @da
toolkit definition: Väljendus, millesse isik on andnud panuse, kirjutades üles või noodistades üleskirjutamata või noodistamata sisu või teisendades seda ühest märkimissüsteemist teise. @et
toolkit definition: تعبيرة تتضمن إسهام شخص في كتابة أو تدوين محتوى لم تسبق كتابته أو تدوينه، أو في تغييره من نظام تدوين إلى آخر. @ar
toolkit definition: 包括写下或记谱之前未写下或未记谱的内容或者将其从一种记谱体系改成另一种记谱体系的一个个人的贡献的内容表达 @zh-hans
toolkit label: Person als Transkribiererin/Transkribierer von @de
toolkit label: avskriver for (person) @no
toolkit label: ir transkribētājs (persona) @lv
toolkit label: person, som er transskribent af @da
toolkit label: persona transcriptora de @ca
toolkit label: personne transcriptrice de @fr
toolkit label: transcribeerder-persoon van @nl
toolkit label: transcriber person of @en
toolkit label: transkribeerija (isik) väljenduses @et
toolkit label: transkriboija (henkilö) ekspressiossa
toolkit label: trascrittore persona di @it
toolkit label: yazıya aktaran kişi @tr
toolkit label: átíró személye: @hu
toolkit label: μεταγραφέας φυσικό πρόσωπο του @el
toolkit label: شخص ناسخ @ar
toolkit label: ……的转写者个人 @zh-hans
has subproperty: P50622
lexical alias: transcriberPersonOf.en
status: Published
type: Property
domain: C10004
label: er avskriver for (person) @no
label: er person, som er transskribent af @da
label: est une personne transcriptrice de @fr
label: ir transkribētājs (persona) @lv
label: is transcribeerder-persoon van @nl
label: is transcriber person of @en
label: ist Person als Transkribiererin/Transkribierer von @de
label: transkribeerija (isik) väljenduses @et
label: transkriptörüdür @tr
label: átíró személye a következőnek: @hu
label: è trascrittore persona di @it
label: és persona transcriptora de @ca
label: είναι μεταγραφέας φυσικό πρόσωπο του @el
label: هوشخص ناسخ لـ @ar
label: 是……的转写者个人 @zh-hans
sub property of: transkriboija (toimija) ekspressiossa
sub property of: tarkastaja (henkilö) ekspressiossa
definition: Bir kişiyi, kişinin daha önce yazılmamış veya kaydedilmemiş içeriği yazarak veya kaydederek ya da bir notasyon sisteminden diğerine dönüştürerek yaptığı katkıyı içeren anlatımla ilişkilendirir. @tr
definition: Correla una persona a un'espressione che comprende un contributo di una persona nella trascrizione o annotazione di contenuti precedentemente non scritti o non annotati, o nella trasformazione da un sistema di notazione a un altro. @it
definition: Hozzákapcsol egy személyt egy kifejezési formához, amely magában foglalja egy személy közreműködését korábban le nem írt vagy le nem jegyzett tartalom leírásában vagy lejegyzésében, vagy egyik jelölési rendszerről a másikra történő átvitelében. @hu
definition: Liittää henkilön ekspressioon, jonka tekemisessä henkilö on osallisena kirjoittamalla muistiin tai nuotintamalla aiemmin kirjoittamattoman tai nuotintamattoman sisällön tai muuttamalla sen nuotinnusjärjestelmästä toiseen.
definition: Met une personne en relation avec une expression qui intègre une contribution de la part d’une personne consistant à écrire ou à noter un contenu auparavant non écrit ou non noté, ou bien à le transposer d’un système de notation à un autre. @fr
definition: Relaciona una persona amb una expressió que inclou una contribució d’una persona escrivint o notant un contingut que no estava escrit o notat, o canviant-lo d’un sistema de notació a un altre. @ca
definition: Relateert een persoon aan een expressie die omvat een bijdrage door een persoon door opschrijven of noteren van voorheen ongeschreven of niet-genoteerde content, of door het te wijzigen van een notatiesysteen naar een ander. @nl
definition: Relaterer en person til et udtryk, som omfatter en persons bidrag ved at nedskrive eller notere uskrevet eller ikke-noteret indhold, eller ved at ændre det fra et notationssystem til et andet. @da
definition: Relaterer en person til et uttrykk som inkluderer et bidrag fra en person i form av å skrive ned eller notere tidligere uskrevet eller unotert innhold, eller ved å endre det fra ett notasjonssystem til et annet. @no
definition: Relates a person to an expression that includes a contribution by a person of writing down or notating previously unwritten or unnotated content, or by changing it from one system of notation to another. @en
definition: Sasaista personu ar izteiksmi, kas ietver personas ieguldījumu, pierakstot iepriekš nepierakstītu mutvārdu vai mūzikas saturu, vai pārrakstot to citādā pierakstā. @lv
definition: Seostab isiku väljendusega, millesse isik on andnud panuse, kirjutades üles või noodistades üleskirjutamata või noodistamata sisu või teisendades seda ühest märkimissüsteemist teise. @et
definition: Setzt eine Person in Beziehung zu einer Expression, zu der eine Person beiträgt, indem sie ungeschriebenen und nicht notierten Inhalt niederschreibt oder ihn von einem Notationssystem in ein anderes überträgt. @de
definition: يربط شخصا بتعبيرة تتضمن إسهام شخص في كتابة أو تدوين محتوى لم تسبق كتابته أو تدوينه، أو في تغييره من نظام تدوين إلى آخر. @ar
definition: 将一个个人与包括写下或记谱之前未写下或未记谱的内容或者将其从一种记谱体系改成另一种记谱体系的一个个人的贡献的内容表达关联起来。 @zh-hans

esitykseen osallinen henkilö ekspressiossa
has element type: 2
toolkit definition: An expression that includes a contribution by a person to a performance. @en
toolkit definition: Bir kişinin bir performansa katkısını içeren bir anlatım. @tr
toolkit definition: Een expressie die omvat een bijdrage door een persoon aan een uitvoering. @nl
toolkit definition: Egy kifejezési forma, amely magában foglalja egy személy közreműködését egy előadásban. @hu
toolkit definition: Eine Expression, bei der eine Person zu eine Darbietung beiträgt. @de
toolkit definition: Ekspressio, jossa henkilö on osallisena sellaisen ekspression tekemisessä, joka on esitys.
toolkit definition: Espressione che comprende un contributo di una persona a un'esibizione. @it
toolkit definition: Et uttrykk som inkluderer et bidrag fra en person til en framføring. @no
toolkit definition: Expression qui intègre une contribution de la part d’une personne à une prestation. @fr
toolkit definition: Expressió que inclou una contribució d’una persona a una interpretació. @ca
toolkit definition: Izteiksme, kas ietver personas ieguldījumu uzvedumā. @lv
toolkit definition: Udtryk, som omfatter en persons bidrag til en optræden. @da
toolkit definition: Väljendus, millesse isik on andnud panuse, osaledes esituse loomisel. @et
toolkit definition: تعبيرة تتضمن إسهام شخص في أداء. @ar
toolkit definition: 包括一个个人对一个表演之贡献的一种内容表达 @zh-hans
toolkit label: Person als Beiträgerin/Beiträger zu einer Darbietung von @de
toolkit label: bidragsyter til framføring for (person) @no
toolkit label: bijdrager-persoon aan uitvoering van @nl
toolkit label: contributor person to performance of @en
toolkit label: contributore persona di performance di @it
toolkit label: esituse kaastööline (isik) väljenduses @et
toolkit label: esitykseen osallinen henkilö ekspressiossa
toolkit label: ir uzveduma līdzradītājs (persona) @lv
toolkit label: közreműködő személye a következő előadásnak: @hu
toolkit label: performansa katkıda bulunan kişi @tr
toolkit label: person, som er bidragsyder til optræden af @da
toolkit label: persona contribuïdora a una interpretació de @ca
toolkit label: personne contributrice à une prestation de @fr
toolkit label: συντελεστής φυσικό πρόσωπο σε εκτέλεση του @el
toolkit label: شخص مساهم في أداء @ar
toolkit label: ……的表演的贡献者个人 @zh-hans
has subproperty: maskeeraaja (henkilö) ekspressiossa
has subproperty: leikkaaja (henkilö) ekspressiossa
has subproperty: ekspression haastateltava (henkilö) ekspressiossa
has subproperty: musiikillinen johtaja (henkilö) ekspressiossa
has subproperty: äänisuunnittelija (henkilö) ekspressiossa
has subproperty: valosuunnittelija (henkilö) ekspressiossa
has subproperty: erikoistehosteiden tekijä (henkilö) ekspressiossa
has subproperty: visuaalisten tehosteiden tekijä (henkilö) ekspressiossa
has subproperty: puvustaja (henkilö) ekspressiossa
has subproperty: lavastussuunnittelija (henkilö) ekspressiossa
has subproperty: näyttämöohjaaja (henkilö) ekspressiossa
has subproperty: animaattori (henkilö) ekspressiossa
has subproperty: ekspression haastattelija (henkilö) ekspressiossa
has subproperty: ääniteknikko (henkilö) ekspressiossa
has subproperty: DJ (henkilö) ekspressiossa
has subproperty: lavastaja (henkilö) ekspressiossa
has subproperty: esittäjä (henkilö) ekspressiossa
has subproperty: dubbausohjaaja (henkilö) ekspressiossa
has subproperty: liikkuvaan kuvaan osallistuja (henkilö) ekspressiossa
has subproperty: taltioija (henkilö) ekspressiossa
has subproperty: musiikkiohjelmoija (henkilö) ekspressiossa
has subproperty: P50623
lexical alias: contributorPersonToPerformanceOf.en
status: Published
type: Property
domain: C10004
label: er bidragsyter til framføring for (person) @no
label: er person, som er bidragsyder til optræden af @da
label: esituse kaastööline (isik) väljenduses @et
label: est une personne contributrice à une prestation de @fr
label: ir uzveduma līdzradītājs (persona) @lv
label: is bijdrager-persoon aan uitvoering van @nl
label: is contributor person to performance of @en
label: ist Person als Beiträgerin/Beiträger zu einer Darbietung von @de
label: közreműködő személye a következő előadásnak: @hu
label: performansına katkıda bulunan kişidir @tr
label: è contributore persona di esibizione di @it
label: és persona contribuïdora a una interpretació de @ca
label: είναι συντελεστής φυσικό πρόσωπο σε εκτέλεση του @el
label: هو شخص مساهم في أداء لـ @ar
label: 是……的表演的贡献者个人 @zh-hans
sub property of: esitykseen osallinen toimija ekspressiossa
sub property of: yhdistymään osallinen henkilö ekspressiossa
definition: Bir kişiyi, kişinin bir performansa katkısını içeren anlatımla ilişkilendirir. @tr
definition: Correla una persona a un'espressione che comprende un contributo di una persona a un'esibizione. @it
definition: Hozzákapcsol egy személyt egy kifejezési formához, amely magában foglalja egy személy közreműködését egy előadásban. @hu
definition: Liittää henkilön ekspressioon, jossa henkilö on osallisena sellaisen ekspression tekemisessä, joka on esitys.

yhdistymään osallinen henkilö ekspressiossa
has element type: 2
toolkit definition: An expression that includes a contribution by a person to a seamless mix of kinds of content. @en
toolkit definition: Een expressie die omvat een bijdrage door een persoon aan een naadloze mix van soorten content. @nl
toolkit definition: Egy kifejezési forma, amely magában foglalja egy személy közreműködését a tartalom fajtáinak szabad keverésében. @hu
toolkit definition: Eine Expression, bei der eine Person zu einer nahtlosen Mischung von Inhalten beiträgt. @de
toolkit definition: Ekspressio, jossa henkilö on osallisena sellaisen ekspression tekemisessä, joka on saumaton yhdistelmä erilaisia sisältöjä.
toolkit definition: Espressione che comprende un contributo di una persona a una varietà di tipi di contenuto senza soluzione di continuità. @it
toolkit definition: Et uttrykk som inkluderer et bidrag fra en person til en sømløs blanding av forskjellig innhold. @no
toolkit definition: Expression qui intègre une contribution de la part d’une personne à un mélange intégré de différents genres de contenu. @fr
toolkit definition: Expressió que inclou una contribució d’una persona a una mescla sense continuïtat de classes de contingut. @ca
toolkit definition: Farklı türde içeriklerin kusursuz karışımını sağlayan bir kişinin katkısını içeren bir anlatım.​ @tr
toolkit definition: Izteiksme, kas ietver personas ieguldījumu dažādu satura veidu vienlaidu sajaukumā. @lv
toolkit definition: Udtryk, som omfatter en persons bidrag til en glat kombinering af forskellige slags af indhold. @da
toolkit definition: Väljendus, millesse isik on andnud panuse, osaledes sellise väljenduse loomisel, mis on eri liiki sisu lahutamatu segu. @et
toolkit definition: تعبيرة تتضمن إسهام شخص في مزج سلس لأنواع من المحتوى. @ar
toolkit definition: 包括将各种内容无缝融合的一个个人的贡献的一种内容表达 @zh-hans
toolkit label: Person als Beiträgerin/Beiträger zu einer Verschmelzung von @de
toolkit label: bidragsyter til sammenslutning for (person) @no
toolkit label: bijdrager-persoon aan amalgamering van @nl
toolkit label: birleşmeye katkıda bulunan kişi @tr
toolkit label: contributor person to amalgamation of @en
toolkit label: contributore persona di fusione di @it
toolkit label: ir amalgamāta līdzradītājs (persona) @lv
toolkit label: közreműködő személye a következő vegyes tartalomnak: @hu
toolkit label: person, som er bidragsyder til sammensmeltning af @da
toolkit label: persona contribuïdora a una amalgama de @ca
toolkit label: personne contributrice à un amalgame de @fr
toolkit label: sulami kaastööline (isik) väljenduses @et
toolkit label: yhdistymään osallinen henkilö ekspressiossa
toolkit label: συντελεστής φυσικό πρόσωπο σε μείξη του (?) @el
toolkit label: شخص مساهم في مزج @ar
toolkit label: ……的融合体的贡献者个人 @zh-hans
has subproperty: toimittaja (henkilö) ekspressiossa
has subproperty: värittäjä (henkilö) ekspressiossa
has subproperty: tekstaaja (henkilö) ekspressiossa
has subproperty: piirtäjä (henkilö) ekspressiossa
has subproperty: tuomioistuimen kirjuri (henkilö) ekspressiossa
has subproperty: pöytäkirjan laatija (henkilö) ekspressiossa
has subproperty: ohjelmistokehittäjä (henkilö) ekspressiossa
has subproperty: esitykseen osallinen henkilö ekspressiossa
has subproperty: P50624
lexical alias: contributorPersonToAmalgamationOf.en
status: Published
type: Property
domain: C10004
label: birleşimine katkıda bulunan kişidir @tr
label: er bidragsyter til sammenslutning for (person) @no
label: er person, som er bidragsyder til sammensmeltning af @da
label: est une personne contributrice à un amalgame de @fr
label: ir amalgamāta līdzradītājs (persona) @lv
label: is bijdrager-persoon aan amalgamering van @nl
label: is contributor person to amalgamation of @en
label: ist Person als Beiträgerin/Beiträger zu einer Verschmelzung von @de
label: közreműködő személye a következő vegyes tartalomnak: @hu
label: sulami kaastööline (isik) väljenduses @et
label: è contributore persona di fusione di @it
label: és persona contribuïdora a una amalgama de @ca
label: είναι συντελεστής φυσικό πρόσωπο σε μείξη του (?) @el
label: هو شخص مساهم في دمج لـ @ar
label: 是……的融合体的贡献者个人 @zh-hans
sub property of: yhdistymään osallinen toimija ekspressiossa
sub property of: ekspression tekijä (henkilö) ekspressiossa
definition: Bir kişiyi, kişinin içerik türlerinin kusursuz bir şekilde birleşmesine yaptığı katkıyı içeren anlatımla ilişkilendirir. @tr
definition: Correla una persona a un'espressione che comprende un contributo di una persona a una varietà di tipi di contenuto senza soluzione di continuità. @it
definition: Hozzákapcsol egy személyt egy kifejezési formához, amely magában foglalja egy személy közreműködését a tartalom fajtáinak szabad keverésében. @hu
definition: Liittää henkilön ekspressioon, jossa henkilö on osallisena sellaisen ekspression tekemisessä, joka on saumaton yhdistelmä erilaisia sisältöjä.
definition: Met une personne en relation avec une expression qui intègre une contribution de la part d’une personne à un mélange intégré de différents genres de contenu. @fr
definition: Relaciona una persona amb una expressió que inclou una contribució d’una persona a una mescla sense continuïtat de classes de contingut. @ca
definition: Relateert een persoon aan een expressie die omvat een bijdrage door een persoon aan een naadloze mix van soorten content. @nl
definition: Relaterer en person til et udtryk, som omfatter en persons bidrag til en glat kombinering af forskellige slags af indhold. @da
definition: Relaterer en person til et uttrykk som inkluderer et bidrag fra en person til en sømløs blanding av forskjellig innhold. @no
definition: Relates a person to an expression that includes a contribution by a person to a seamless mix of kinds of content. @en
definition: Sasaista personu ar izteiksmi, kas ietver personas ieguldījumu dažādu satura veidu vienlaidu sajaukumā. @lv
definition: Seostab isiku väljendusega, millesse isik on andnud panuse, osaledes eri liiki sisu lahutamatu segu loomisel. @et
definition: Setzt eine Person in Beziehung zu einer Expression, bei der eine Person zu einer nahtlosen Mischung von Inhalten beiträgt. @de
definition: يربط شخصا بتعبيرة تتضمن إسهام شخص في مزج سلس لأنواع من المحتوى. @ar
definition: 将一个个人与包括将各种内容无缝融合的一个个人的贡献的一种内容表达关联起来。 @zh-hans

ekspression tekijä (henkilö) ekspressiossa
has element type: 2
toolkit definition: An expression that involves a responsibility of a person for creation or contribution. @en
toolkit definition: Bir kişinin yaratma veya katkıda bulunma sorumluluğunu içeren bir anlatım. @tr
toolkit definition: Een expressie die met zich meebrengt een verantwoordelijkheid van een persoon voor creatie of bijdrage. @nl
toolkit definition: Egy kifejezési forma, amelyhez hozzátartozik egy személy felelőssége a létrehozásért vagy a közreműködésért. @hu
toolkit definition: Eine Expression, bei der eine Person für die Erstellung oder Mitwirkung verantwortlich ist. @de
toolkit definition: Ekspressio, jossa henkilön vastuulla on luoda ekspressio tai osallistua sen tekemiseen.
toolkit definition: Espressione che implica una responsabilità di una persona per la creazione o contributo. @it
toolkit definition: Et uttrykk som involverer et ansvar for en person i form av skapelse eller bidrag. @no
toolkit definition: Expression qui comporte une responsabilité de la part d’une personne en ce qui concerne la création ou la contribution. @fr
toolkit definition: Expressió que implica una responsabilitat d’una persona en la creació o contribució. @ca
toolkit definition: Izteiksme, kas ietver personas atbildību par radīšanu vai ieguldījumu. @lv
toolkit definition: Udtryk, som involverer en persons ansvar for skabelse eller bidrag. @da
toolkit definition: Väljendus, mis sisaldab isiku vastutust väljenduse loomise või sellesse antud panuse eest. @et
toolkit definition: تعبيرة تنطوي على مسئولية شخص عن الإبداع أو الإسهام . @ar
toolkit definition: 涉及创作或贡献的一个个人的责任的一种内容表达 @zh-hans
toolkit label: Person als Mitwirkende/Mitwirkender von @de
toolkit label: anlatımın yaratıcısı @tr
toolkit label: creator person of expression of @en
toolkit label: creatore persona di espressione di @it
toolkit label: ekspression tekijä (henkilö) ekspressiossa
toolkit label: ir radītājs (persona) izteiksmei @lv
toolkit label: létrehozó személye a következő kifejezési formának: @hu
toolkit label: maker-persoon van expressie van @nl
toolkit label: person, som er ophav til udtryk af @da
toolkit label: persona creadora d’una expressió de @ca
toolkit label: personne créatrice d’une expression de @fr
toolkit label: skaper av uttrykk for (person) @no
toolkit label: väljenduse looja (isik) väljenduses @et
toolkit label: δημιουργός φυσικό πρόσωπο της έκφρασης του @el
toolkit label: شخص منشئ تعبيرة @ar
toolkit label: ……的内容表达的创作者个人 @zh-hans
has subproperty: kääntäjä (henkilö) ekspressiossa
has subproperty: tarkastaja (henkilö) ekspressiossa
has subproperty: yhdistymään osallinen henkilö ekspressiossa
has subproperty: esittämisestä vastaava henkilö ekspressiossa
has subproperty: P50625
lexical alias: creatorPersonOfExpressionOf.en
status: Published
type: Property
domain: C10004
label: anlatımının yaratıcı kişisidir @tr
label: er person, som er ophav til udtryk af @da
label: er skaper av uttrykk for (person) @no
label: est une personne créatrice d’une expression de @fr
label: ir radītājs (persona) izteiksmei @lv
label: is creator person of expression of @en
label: is maker-persoon van expressie van @nl
label: ist Person als Mitwirkende/Mitwirkender von @de
label: létrehozó személye a következő kifejezési formának: @hu
label: väljenduse looja (isik) väljenduses @et
label: è creatore persona di espressione di @it
label: és persona creadora d’una expressió de @ca
label: είναι δημιουργός φυσικό πρόσωπο της έκφρασης του @el
label: هو شخص منشئ تعبيرة لـ @ar
label: 是……的内容表达的创作者个人 @zh-hans
sub property of: ekspression tekijä (toimija) ekspressiossa
sub property of: henkilöön liittyvä ekspressio
definition: Bir kişiyi, kişinin üretim veya katkısından dolayı sorumluluğunu içeren anlatımla ilişkilendirir. @tr
definition: Correla una persona a un'espressione che implica una responsabilità di una persona per la creazione o contributo. @it
definition: Hozzákapcsol egy személyt egy kifejezési formához, amelyhez hozzátartozik egy személy felelőssége a létrehozásért vagy a közreműködésért. @hu
definition: Liittää henkilön ekspressioon, jossa henkilön vastuulla on luoda ekspressio tai osallistua sen tekemiseen.
definition: Met une personne en relation avec une expression qui comporte une responsabilité de la part d’une personne en ce qui concerne la création ou la contribution. @fr
definition: Relaciona una persona amb una expressió que implica una responsabilitat d’una persona en la creació o contribució. @ca
definition: Relateert een persoon aan een expressie die met zich meebrengt een verantwoordelijkheid van een persoon voor creatie of bijdrage. @nl
definition: Relaterer en person til et udtryk, som involverer en persons ansvar for skabelse eller bidrag. @da
definition: Relaterer en person til et uttrykk som involverer et ansvar for en person i form av skapelse eller bidrag. @no
definition: Relates a person to an expression that involves a responsibility of a person for creation or contribution. @en
definition: Sasaista personu ar izteiksmi, kas ietver personas atbildību par radīšanu vai ieguldījumu. @lv
definition: Seostab isiku väljendusega, mis sisaldab isiku vastutust väljenduse loomise või sellesse antud panuse eest. @et
definition: Setzt eine Person in Beziehung zu einer Expression, bei der eine Person für die Erstellung oder Mitwirkung verantwortlich ist. @de
definition: يربط شخصا بتعبيرة تنطوي على مسئولية شخص عن الإبداع أو الإسهام . @ar
definition: 将一个个人与涉及创作或贡献的一个个人的责任的一种内容表达关联起来。 @zh-hans
scope note: Darunter fallen Herausgeberinnen/Herausgeber, Übersetzerinnen/Übersetzer, Musikarrangeurinnen/Musikarrangeure, Ausführende und so weiter. @de
scope note: Editors, translators, arrangers of music, performers, etc., are included. @en
scope note: Editörler, çevirmenler, müzik aranjörleri, icracılar vb. dahildir. @tr
scope note: Ekspression tekijöihin kuuluvat toimittajat, kääntäjät, musiikin sovittajat, esittäjät tms.
scope note: Hõlmab toimetajaid, tõlkijaid, muusika seadjaid, esitajaid jne. @et
scope note: Inclou editors literaris, traductors, arranjadors de música, intèrprets, etc. @ca

esittämisestä vastaava henkilö ekspressiossa
has element type: 2
toolkit definition: An expression that is embodied in a manifestation that includes a statement of an "X presents:" credit for a person who is probably associated with production, finance, or distribution of an expression of a moving image work in some way. @en
toolkit definition: Bir hareketli bir görüntünün üretimi, finansmanı veya dağıtımıyla bir şekilde bağlantılı olan bir kişiyle yönlendirme yapan "X sunar:" açıklamasını içeren bir gösterimde somutlaşan bir anlatım. @tr
toolkit definition: Een expressie die is verwezenlijkt in een manifestatie die omvat een vermelding van een "X presenteert:" creditatie voor een persoon die waarschijnlijk op één of andere manier geassocieerd is met productie, financiën of distributie van een expressie van een bewegend beeldwerk. @nl
toolkit definition: Egy megjelenési formában megtestesülő kifejezési forma, amelynek „az X bemutatja:” stáblistaeleme arra a személyre vonatkozik, aki valószínűleg valamilyen módon egy mozgóképmű kifejezési formájának előállításához, finanszírozásához vagy terjesztéséhez kapcsolódik. @hu
toolkit definition: Eine Expression, die in einer Manifestation verkörpert ist, die die Angabe X präsentiert: für eine Person enthält, die wahrscheinlich irgendwie mit der Produktion, Finanzierung oder dem Vertrieb einer Expression eines Bewegtbildwerks in Verbindung steht. @de
toolkit definition: Ekspressio, joka sisältyy manifestaatioon, jonka alku- tai lopputekstit sisältävät merkinnän "X esittää:" henkilöstä, joka liittyy todennäköisesti liikkuvan kuvan teoksen ekspression tuotantoon, rahoitukseen tai jakeluun jollakin tavoin.
toolkit definition: Espressione con un riconoscimento "X presenta" in una manifestazione di un'immagine in movimento per una persona che è probabilmente associata in qualche modo alla produzione, finanziamento o distribuzione. @it
toolkit definition: Et uttrykk som har en tekst som "X presenterer" i en manifestasjon av levende bilder for en person som sannsynligvis på en eller annen måte er knyttet til produksjon, finansiering eller distribusjon. @no
toolkit definition: Expression matérialisée dans une manifestation dont le générique inclut, sous la forme « X présente », une personne qui est probablement associée d’une façon quelconque à la production, au financement ou à la distribution d’une expression d’une œuvre d’images animées. @fr
toolkit definition: Expressió que està materialitzada en una manifestació que inclou una menció de crèdits en una forma "X presenta:" per a una persona que està probablement associada d’alguna manera amb la producció, el finançament o la distribució d’una expressió d’una obra d’imatge en moviment. @ca
toolkit definition: Izteiksme ar fāzi titros “X piedāvā”: personass manifestāciju kustīgu attēlu materiāliem un kura, iespējams, ir saistīta ar izgatavošanu, finansēm vai izplatīšanu. @lv
toolkit definition: Udtryk, der er indeholdt i en manifestation, som indeholder ophavsangivelsen "X præsenterer:" for en person, som sandsynligvis er knyttet til produktion, finansiering eller distribution på en eller anden måde. @da
toolkit definition: Väljendus, mille teostamisel osalenud isikut on nimetatud filmi kehastuse tiitrites vormis "X esitleb". Isik on tõenäoliselt mingil viisil seotud filmi tootmise, rahastamise või levitamisega. @et
toolkit definition: تعبيرة ما مع "X presents:&quot&؛ ائتمان في تجسيدة صور متحركة لشخص ربما يرتبط بالإنتاج أو التمويل أو التوزيع بطريقة أو بأخرى. @ar
toolkit definition: 被具体化在一种载体表现（包括一个动态图像作品的一种内容表达的摄制人员名单中以“某某 出品”（X presents）的方式被提及的且与该片的制作、财务或发行等有某些联系的一个个人）中的一种内容表达 @zh-hans
toolkit label: Person als Präsentatorin/Präsentator von @de
toolkit label: Sunum yapan kişi @tr
toolkit label: bemutató személye: @hu
toolkit label: esitleja (isik) väljenduses @et
toolkit label: esittämisestä vastaava henkilö ekspressiossa
toolkit label: ir piedāvātājs (persona) @lv
toolkit label: person som presenterer for @no
toolkit label: person, som er præsentator af @da
toolkit label: persona presentadora de @ca
toolkit label: personne présentatrice de @fr
toolkit label: presentatore persona di @it
toolkit label: presenter person of @en
toolkit label: presenterende persoon van @nl
toolkit label: παρουσιαστής φυσικό πρόσωπο του @el
toolkit label: شخص مقدم @ar
toolkit label: ……的出品人个人 @zh-hans
has subproperty: P50626
lexical alias: presenterPersonOf.en
status: Published
type: Property
domain: C10004
label: bemutató személye a következőnek: @hu
label: er person som presenterer for @no
label: er person, som er præsentator af @da
label: esitleja (isik) väljenduses @et
label: est une personne présentatrice de @fr
label: ir piedāvātājs (persona) @lv
label: is presenter person of @en
label: is presenterende persoon van @nl
label: ist Person als Präsentatorin/Präsentator von @de
label: sunucu kişisidir @tr
label: è presentatore persona di @it
label: és persona presentadora de @ca
label: είναι παρουσιαστής φυσικό πρόσωπο του @el
label: هو شخص مقدم برامج لـ @ar
label: 是……的出品人个人 @zh-hans
sub property of: esittämisestä vastaava toimija ekspressiossa
sub property of: ekspression tekijä (henkilö) ekspressiossa
definition: Bir kişiyi, "X takdim eder" ibaresini de verilen hareketli görüntü çalışmasının bir gösteriminin yapımı, finansmanı veya dağıtımı ile ilişkili olması muhtemel bir kişiye verilen atıfı içeren bir anlatımla ilişkilendirir. @tr
definition: Correla una persona a un'espressione con un riconoscimento "X presenta" in una manifestazione di un'immagine in movimento per una persona che è probabilmente associata in qualche modo alla produzione, finanziamento o distribuzione. @it
definition: Hozzákapcsol egy személyt egy megjelenési formában megtestesülő kifejezési formához, amelynek „az X bemutatja:” stáblistaeleme arra a személyre vonatkozik, aki valószínűleg valamilyen módon egy mozgóképmű kifejezési formájának előállításához, finanszírozásához vagy terjesztéséhez kapcsolódik. @hu
definition: Liittää henkilö ekspressioon, joka sisältyy manifestaatioon, jonka alku- tai lopputekstit sisältävät merkinnän "X esittää:" henkilöstä, joka liittyy todennäköisesti liikkuvan kuvan teoksen ekspression tuotantoon, rahoitukseen tai jakeluun jollakin tavoin.
definition: Met une personne en relation avec une expression matérialisée dans une manifestation dont le générique inclut, sous la forme « X présente », une personne qui est probablement associée d’une façon quelconque à la production, au financement ou à la distribution d’une expression d’une œuvre d’images animées. @fr
definition: Relaciona una persona amb una expressió que està materialitzada en una manifestació que inclou una menció de crèdits en una forma "X presenta:" per a una persona que està probablement associada d’alguna manera amb la producció, el finançament o la distribució d’una expressió d’una obra d’imatge en moviment. @ca
definition: Relateert een persoon aan een expressie die is verwezenlijkt in een manifestatie die omvat een vermelding van een "X presenteert:" creditatie voor een persoon die waarschijnlijk op één of andere manier geassocieerd is met productie, financiën of distributie van een expressie van een bewegend beeldwerk. @nl
definition: Relaterer en person til et udtryk, der er indeholdt i en manifestation, som indeholder ophavsangivelsen "X præsenterer:" for en person, som sandsynligvis er knyttet til produktion, finansiering eller distribution på en eller anden måde af et levende billedværk. @da
definition: Relaterer en person til et uttrykk som har en tekst som "X presenterer" i en manifestasjon av levende bilder for en person som sannsynligvis på en eller annen måte er knyttet til produksjon, finansiering eller distribusjon. @no
definition: Relates a person to an expression that is embodied in a manifestation that includes a statement of an "X presents:" credit for a person who is probably associated with production, finance, or distribution of an expression of a moving image work in some way. @en
definition: Sasaista personu ar izteiksmi ar fāzi titros “X piedāvā”: personass manifestāciju kustīgu attēlu materiāliem un kura, iespējams, ir saistīta ar izgatavošanu, finansēm vai izplatīšanu. @lv
definition: Seostab isiku väljendusega, mille teostamisel osalenud isikut on nimetatud filmi kehastuse tiitrites vormis "X esitleb". Isik on tõenäoliselt mingil viisil seotud filmi tootmise, rahastamise või levitamisega. @et
definition: Setzt eine Person in Beziehung zu einer Expression, die in einer Manifestation verkörpert ist, die die Angabe X präsentiert: für eine Person enthält, die wahrscheinlich irgendwie mit der Produktion, Finanzierung oder dem Vertrieb einer Expression eines Bewegtbildwerks in Verbindung steht. @de
definition: يربط وكيلا بتعبيرة ذات اعتمادات "X presents:&quot&؛ في تجسيدة لصور متحركة لوكيل ربما يكون مرتبطا بطريقة ما بالإنتاج أو بالتمويل أو التوزيع. @ar
definition: 将一个个人与被具体化在一种载体表现（包括一个动态图像作品的一种内容表达的摄制人员名单中以“某某 出品”（X presents）的方式被提及的且与该片的制作、财务或发行等有某些联系的一个个人）中的一种内容表达关联起来。 @zh-hans

kappaleen omistuksen kohde (henkilö) kappaleessa
has element type: 2
toolkit definition: An item that acknowledges the inspiration or support of a person. @en
toolkit definition: Bir kişinin ilhamını veya desteğini kabul eden bir kopya. @tr
toolkit definition: Een item dat erkent de inspiratie of steun van een persoon. @nl
toolkit definition: Egy példány, amely méltatja egy személy ösztönzését vagy támogatását. @hu
toolkit definition: Ein Exemplar, das einer Person gewidmet ist. @de
toolkit definition: Eksemplar, millega avaldatakse tänu isiku innustuse või toetuse eest. @et
toolkit definition: Eksemplar, som anerkender inspirationen eller støtten fra en person. @da
toolkit definition: Et eksemplar som anerkjenner inpirasjonen eller støttet fra en person. @no
toolkit definition: Item che attesta l'ispirazione o il supporto di una persona. @it
toolkit definition: Item qui reconnaît l’inspiration ou le soutien d’une personne. @fr
toolkit definition: Kappale, joka on omistettu henkilölle.
toolkit definition: Vienība, kas ir veltījums personai. @lv
toolkit definition: Ítem que reconeix la inspiració i el suport d’una persona. @ca
toolkit definition: مفردة تقر بالإلهام أو الدعم من شخص. @ar
toolkit definition: 对一个个人的启发或支持表示感谢的一个单件 @zh-hans
toolkit label: Person als Widmungsempfängerin/Widmungsempfänger eines Exemplars von @de
toolkit label: dedicatario persona di item di @it
toolkit label: dedicatee person of item of @en
toolkit label: dedikált személye a következő példánynak: @hu
toolkit label: eksemplari pühenduse saaja (isik) eksemplaris @et
toolkit label: kappaleen omistuksen kohde (henkilö) kappaleessa
toolkit label: kopyanın adandığı kişi @tr
toolkit label: opgedragene-persoon van item van @nl
toolkit label: person, som er tilegnet i eksemplar af @da
toolkit label: persona dedicatària d’un ítem de @ca
toolkit label: personai veltītā vienība @lv
toolkit label: personne dédicataire d’un item de @fr
toolkit label: tilegnet person for eksemplar for @no
toolkit label: αποδέκτης αφιέρωσης φυσικό πρόσωπο του αντιτύπου του @el
toolkit label: شخص مُهدى إليه مفردة @ar
toolkit label: ……的单件的被题献者个人 @zh-hans
has subproperty: P50627
lexical alias: dedicateePersonOfItemOf.en
status: Published
type: Property
domain: C10004
label: dedikált személye a következő példánynak: @hu
label: eksemplari pühenduse saaja (isik) eksemplaris @et
label: er person, som er tilegnet i eksemplar af @da
label: er tilegnet person for eksemplar for @no
label: est une personne dédicataire d’un item de @fr
label: is dedicatee person of item of @en
label: is opgedragene-persoon van item van @nl
label: ist Person als Widmungsempfängerin/Widmungsempfänger eines Exemplars von @de
label: kopyasının ithaf edilen kişisidir @tr
label: personai veltītā vienība @lv
label: è dedicatario persona di item di @it
label: és persona dedicatària d’un ítem de @ca
label: είναι αποδέκτης αφιέρωσης φυσικό πρόσωπο του αντιτύπου του @el
label: هو شخص مُهدى إليه مفردة لـ @ar
label: 是……的单件的被题献者个人 @zh-hans
sub property of: kappaleen omistuksen kohde (toimija) kappaleessa
sub property of: henkilöön liittyvä kappale
definition: Bir kişiyi, kişinin esin kaynağı olduğu veya desteklediği bir kopyayla ilişkilendirir. @tr
definition: Correla una persona a un item che attesta l'ispirazione o il supporto di una persona. @it
definition: Hozzákapcsol egy személyt egy példányhoz, amely méltatja egy személy ösztönzését vagy támogatását. @hu
definition: Liittää henkilön kappaleeseen, joka on omistettu henkilölle.
definition: Met une personne en relation avec un item qui reconnaît l’inspiration ou le soutien d’une personne. @fr
definition: Relaciona una persona amb un ítem que reconeix la inspiració i el suport d’una persona. @ca
definition: Relateert een persoon aan een item dat erkent de inspiratie of steun van een persoon. @nl
definition: Relaterer en person til et eksemplar som anerkjenner inpirasjonen eller støttet fra en person. @no
definition: Relaterer en person til et eksemplar, som anerkender inspirationen eller støtten fra en person. @da
definition: Relates a person to an item that acknowledges the inspiration or support of a person. @en
definition: Sasaista personu ar vienību, kas ir veltījums personai. @lv
definition: Seostab isiku eksemplariga, millega avaldatakse tänu isiku innustuse või toetuse eest. @et
definition: Setzt eine Person in Beziehung zu einem Exemplar, das einer Person gewidmet ist. @de
definition: يربط شخصا بمفردة تقر بالإلهام أو الدعم من شخص. @ar
definition: 将一个个人与对一个个人的启发或支持表示感谢的一个单件关联起来。 @zh-hans

sitoja (henkilö) kappaleessa
has element type: 2
toolkit definition: An item that involves a responsibility of a person for binding. @en
toolkit definition: Ciltleme için bir kişinin sorumluluğunu içeren bir kopya. @tr
toolkit definition: Een item dat met zich meebrengt een verantwoordelijkheid van een persoon voor het binden. @nl
toolkit definition: Egy példány, amelyhez hozzátartozik egy személy felelőssége a kötésért. @hu
toolkit definition: Ein Exemplar, bei dem eine Person für das Binden verantwortlich ist. @de
toolkit definition: Eksemplar, mis sisaldab isiku vastutust köitmise eest. @et
toolkit definition: Eksemplar, som involverer en persons ansvar for indbinding. @da
toolkit definition: Et eksemplar som involverer et ansvar for en person i form av innbinding. @no
toolkit definition: Item che implica una responsabilità di una persona nella rilegatura. @it
toolkit definition: Item qui comporte une responsabilité de la part d’une personne en ce qui concerne la reliure. @fr
toolkit definition: Kappale, jonka sitomisesta henkilö on vastuussa.
toolkit definition: Vienība, kas ietver personas atbildību par iesiešanu. @lv
toolkit definition: Ítem que implica una responsabilitat d’una persona en l’enquadernació. @ca
toolkit definition: مفردة تنطوي على مسئولية شخص عن التجليد. @ar
toolkit definition: 涉及一个装订个人的责任的一个单件 @zh-hans
toolkit label: Person als Buchbinderin/Buchbinder von @de
toolkit label: binder person of @en
toolkit label: binder-persoon van @nl
toolkit label: bokbinder for (person) @no
toolkit label: ciltleyici @tr
toolkit label: ir iesējējs (persona) @lv
toolkit label: köitja (isik) eksemplarile @et
toolkit label: könyvkötő személye: @hu
toolkit label: person, som er bogbinder af @da
toolkit label: persona enquadernadora de @ca
toolkit label: personne relieuse de @fr
toolkit label: rilegatore persona di @it
toolkit label: sitoja (henkilö) kappaleessa
toolkit label: βιβλιοδέτης φυσικό πρόσωπο του @el
toolkit label: شخص مسئول عن تجليد @ar
toolkit label: ……的装订者个人 @zh-hans
has subproperty: P50628
lexical alias: binderPersonOf.en
status: Published
type: Property
domain: C10004
label: ciltleyici kişisidir @tr
label: er bokbinder for (person) @no
label: er person, som er bogbinder af @da
label: est une personne relieuse de @fr
label: ir iesējējs (persona) @lv
label: is binder person of @en
label: is binder-persoon van @nl
label: ist Person als Buchbinderin/Buchbinder von @de
label: köitja (isik) eksemplarile @et
label: könyvkötő személye a következőnek: @hu
label: è rilegatore persona di @it
label: és persona enquadernadora de @ca
label: είναι βιβλιοδέτης φυσικό πρόσωπο του @el
label: هو شخص مسئول عن تجليد @ar
label: 是……的装订者个人 @zh-hans
sub property of: sitoja (toimija) kappaleessa
sub property of: henkilöön liittyvä kappale
definition: Bir kişiyi, kişinin bağlayıcılık sorumluluğunu barındıran kopyayla ilişkilendirir. @tr
definition: Correla una persona a un item che implica una responsabilità di una persona nella rilegatura. @it
definition: Hozzákapcsol egy személyt egy példányhoz, amelyhez hozzátartozik egy személy felelőssége a kötésért. @hu
definition: Liittää henkilön kappaleeseen, jonka sitomisesta henkilö on vastuussa.
definition: Met une personne en relation avec un item qui comporte une responsabilité de la part d’une personne en ce qui concerne la reliure. @fr
definition: Relaciona una persona amb un ítem que implica una responsabilitat d’una persona en l’enquadernació. @ca
definition: Relateert een persoon aan een item dat met zich meebrengt een verantwoordelijkheid van een persoon voor het binden. @nl
definition: Relaterer en person til et eksemplar som involverer et ansvar for en person i form av innbinding. @no
definition: Relaterer en person til et eksemplar, som involverer en persons ansvar for indbinding. @da
definition: Relates a person to an item that involves a responsibility of a person for binding. @en
definition: Sasaista personu ar vienību, kas ietver personas atbildību par iesiešanu. @lv
definition: Seostab isiku eksemplariga, mis sisaldab isiku vastutust köitmise eest. @et
definition: Setzt eine Person in Beziehung zu einem Exemplar, bei dem eine Person für das Binden verantwortlich ist. @de
definition: يربط شخصا بمفردة تنطوي على مسئولية شخص عن التجليد. @ar
definition: 将一个个人与涉及一个装订个人的责任的一个单件关联起来。 @zh-hans

kappaleen entisöijä (henkilö) kappaleessa
has element type: 2
toolkit definition: An item that involves a responsibility of a person for compensation of degradation by bringing it back to a state as close as possible to its original condition using a set of technical, editorial, and intellectual procedures. @en
toolkit definition: Bir takım teknik, editoryal ve entelektüel prosedürler kullanarak orijinal durumuna mümkün olduğunca yakın bir duruma geri getirerek bozulmanın telafisi için bir kişinin sorumluluğunu içeren bir kopya. @tr
toolkit definition: Een item dat met zich meebrengt een verantwoordelijkheid van een persoon voor compensatie van verval door het terug te brengen in een staat zo dicht mogelijk bij de oorspronkelijke conditie gebruikmakend van een verzameling van technische, redactionele en intellectuele procedures. @nl
toolkit definition: Egy példány, amelyhez hozzátartozik egy személy felelőssége technikai, szerkesztői és intellektuális eljárások alkalmazásáért, amivel ellensúlyozza a példány romlását, hogy az eredeti állapotához a lehető legközelebb állítsa azt vissza. @hu
toolkit definition: Ein Exemplar, bei dem eine Person für die technischen, redaktionellen und intellektuellen Verfahren verantwortlich ist, die darauf abzielen, die Zersetzung eines Exemplars auszugleichen, indem es in einen Zustand zurückversetzt wird, der seiner ursprünglichen Beschaffenheit möglichst nahe kommt. @de
toolkit definition: Eksemplar, mis sisaldab isiku vastutust rea tehniliste, toimetuslike ja intellektuaalsete toimingute eest, mille eesmärk on taastada kahjustatud eksemplari seisund võimalikult originaalseisundi lähedaseks. @et
toolkit definition: Eksemplar, som involverer en persons ansvar for kompensation for nedslidning ved at føre det tilbage til en tilstand, som er så tæt så muligt på sin oprindelige tilstand vha. en række af tekniske, redaktionsmæssige og intellektuelle procedurer. @da
toolkit definition: Et eksemplar som involverer et ansvar for en person i form av å kompensere for nedbrytningen av et eksemplar ved å restaurere det til en tilstand som er så lik originaltilstanden som mulig ved hjelp av et sett av tekniske, redaksjonelle og intellektuelle prosedyrer. @no
toolkit definition: Item che implica una responsabilità di una persona nel compensare una degradazione riportandolo a uno stato il più possibile vicino alla sua condizione originale usando un insieme di procedure tecniche, editoriali e intellettuali. @it
toolkit definition: Item qui comporte une responsabilité de la part d’une personne consistant à compenser sa dégradation en le ramenant à un état aussi près que possible de sa condition originelle au moyen d’un ensemble de procédures techniques, éditoriales et intellectuelles. @fr
toolkit definition: Kappale, jossa henkilö on vastuussa teknisistä, toimituksellisista ja tiedollisista toimenpiteistä joiden tarkoitus on palauttaa huonokuntoinen kappale mahdollisimman lähelle sen alkuperäistä kuntoa.
toolkit definition: Vienība, kas ietver personas atbildību par vienības bojāejas novēršanu, atgriežot to stāvoklī pēc iespējas tuvāk sākotnējam, izmantojot tehnisko, redakcionālo un intelektuālo procedūru kopumu. @lv
toolkit definition: Ítem que implica una responsabilitat d’una persona per la compensació de la seva degradació retornant-lo a un estat que s’aproximi al màxim a la seva condició original usant un conjunt de procediments tècnics, editorials i intel·lectuals. @ca
toolkit definition: مفردة تنطوي على مسئولية شخص عن التعويض عن تدهور حالتها عن طريق إعادتها إلى حالتها الأصلية قدر المستطاع باستخدام مجموعة من الإجراءات الفنية والتحريرية والمتعلقة بالملكية الفكرية. @ar
toolkit definition: 涉及为弥补单件的损毁而担负一系列技术、编辑和智力操作、使之尽可能恢复到原始状态的一个个人的责任的一个单件 @zh-hans
toolkit label: Person als Restauratorin/Restaurator eines Exemplars von @de
toolkit label: ir restaurators (persona) vienībai @lv
toolkit label: kappaleen entisöijä (henkilö) kappaleessa
toolkit label: konservator for eksemplar for (person) @no
toolkit label: kopyanın restoraston uzmanı kişisi @tr
toolkit label: person, som er konservator af eksemplar af @da
toolkit label: persona restauradora d’un ítem de @ca
toolkit label: personne restauratrice d’un item de @fr
toolkit label: restaurator-persoon van item van @nl
toolkit label: restauratore persona di item di @it
toolkit label: restaureerija (isik) eksemplarile @et
toolkit label: restaurátor személye a következő példánynak: @hu
toolkit label: restorationist person of item of @en
toolkit label: συντηρητής φυσικό πρόσωπο του αντιτύπου του @el
toolkit label: شخص أخصائي ترميم مفردة @ar
toolkit label: ……的单件的修复者个人 @zh-hans
has subproperty: P50629
lexical alias: restorationistPersonOfItemOf.en
status: Published
type: Property
domain: C10004
label: er konservator for eksemplar for (person) @no
label: er person, som er konservator af eksemplar af @da
label: est une personne restauratrice d’un item de @fr
label: ir restaurators (persona) vienībai @lv
label: is restaurator-persoon van item van @nl
label: is restorationist person of item of @en
label: ist Person als Restauratorin/Restaurator eines Exemplars von @de
label: kopyasının restorasyon uzmanı kişisidir @tr
label: restaureerija (isik) eksemplarile @et
label: restaurátor személye a következő példánynak: @hu
label: è restauratore persona di item di @it
label: és persona restauradora d’un ítem de @ca
label: είναι συντηρητής φυσικό πρόσωπο του αντιτύπου του @el
label: هو شخص أخصائي ترميم مفردة لـ @ar
label: 是……的单件的修复者个人 @zh-hans
sub property of: kappaleen entisöijä (toimija) kappaleessa
sub property of: henkilöön liittyvä kappale
definition: Bir kişiyi, bir dizi teknik, editoryal ve fikri işlemleri kullanarak orijinal durumuna en yakın haline getirerek bozulmayı telafi etme sorumluluğunu içeren bir kopyayla ilişkilendirir. @tr
definition: Correla una persona a un item che implica una responsabilità di una persona nel compensare una degradazione riportandolo a uno stato il più possibile vicino alla sua condizione originale usando un insieme di procedure tecniche, editoriali e intellettuali. @it
definition: Hozzákapcsol egy személyt egy példányhoz, amelyhez hozzátartozik egy személy felelőssége technikai, szerkesztői és intellektuális eljárások alkalmazásáért, amivel ellensúlyozza a példány romlását, hogy az eredeti állapotához a lehető legközelebb állítsa azt vissza. @hu
definition: Liittää henkilön kappaleeseen, jossa henkilö on vastuussa teknisistä, toimituksellisista ja tiedollisista toimenpiteistä joiden tarkoitus on palauttaa huonokuntoinen kappale mahdollisimman lähelle sen alkuperäistä kuntoa.
definition: Met une personne en relation avec un item qui comporte une responsabilité de la part d’une personne consistant à compenser sa dégradation en le ramenant à un état aussi près que possible de sa condition originelle au moyen d’un ensemble de procédures techniques, éditoriales et intellectuelles. @fr
definition: Relaciona una persona amb un ítem que implica una responsabilitat d’una persona per la compensació de la seva degradació retornant-lo a un estat que s’aproximi al màxim a la seva condició original usant un conjunt de procediments tècnics, editorials i intel·lectuals. @ca
definition: Relateert een persoon aan een item dat met zich meebrengt een verantwoordelijkheid van een persoon voor compensatie van verval door het terug te brengen in een staat zo dicht mogelijk bij de oorspronkelijke conditie gebruikmakend van een verzameling van technische, redactionele en intellectuele procedures. @nl
definition: Relaterer en person til et eksemplar som involverer et ansvar for en person i form av å kompensere for nedbrytningen av et eksemplar ved å restaurere det til en tilstand som er så lik originaltilstanden som mulig ved hjelp av et sett av tekniske, redaksjonelle og intellektuelle prosedyrer. @no
definition: Relaterer en person til et eksemplar, som involverer en persons ansvar for kompensation for nedslidning ved at føre det tilbage til en tilstand, som er så tæt så muligt på sin oprindelige tilstand vha. en række af tekniske, redaktionsmæssige og intellektuelle procedurer. @da
definition: Relates a person to an item that involves a responsibility by a person for compensation of degradation by bringing it back to a state as close as possible to its original condition using a set of technical, editorial, and intellectual procedures. @en
definition: Sasaista personu ar vienību, kas ietver personas atbildību par vienības bojāejas novēršanu, atgriežot to stāvoklī pēc iespējas tuvāk sākotnējam, izmantojot tehnisko, redakcionālo un intelektuālo procedūru kopumu. @lv
definition: Seostab isiku eksemplariga, mis sisaldab isiku vastutust rea tehniliste, toimetuslike ja intellektuaalsete toimingute eest, mille eesmärk on taastada kahjustatud eksemplari seisund võimalikult originaalseisundi lähedaseks. @et
definition: Setzt eine Person in Beziehung zu einem Exemplar, bei dem eine Person für die technischen, redaktionellen und intellektuellen Verfahren verantwortlich ist, die darauf abzielen, die Zersetzung eines Exemplars auszugleichen, indem es in einen Zustand zurückversetzt wird, der seiner ursprünglichen Beschaffenheit möglichst nahe kommt. @de
definition: يربط شخصا بمفردة تنطوي على مسئولية شخص عن التعويض عن تدهور حالتها عن طريق إعادتها إلى حالتها الأصلية قدر المستطاع باستخدام مجموعة من الإجراءات الفنية والتحريرية والمتعلقة بالملكية الفكرية. @ar
definition: 将一个个人与涉及为弥补单件的损毁而担负一系列技术、编辑和智力操作、使之尽可能恢复到原始状态的一个个人的责任的一个单件关联起来。 @zh-hans

kuraattori (henkilö) kappaleessa
has element type: 2
toolkit definition: An item that involves a responsibility of a person for conceiving or managing the aggregation of an item in an exhibition or collection. (Deprecated) @en
toolkit definition: Een item dat met zich meebrengt een verantwoordelijkheid van een persoon voor het bedenken of beheren van het aggregeren van een item in een tentoonstelling of collectie. @nl
toolkit definition: Egy példány, amelyhez hozzátartozik egy személy felelőssége egy példány kiállítás vagy gyűjtemény keretében történő összegyűjtésének elgondolásáért vagy kezeléséért. @hu
toolkit definition: Ein Exemplar, bei dem eine Person die Aggregation eines Exemplars in einer Ausstellung oder Sammlung konzipiert oder organisiert. @de
toolkit definition: Eksemplar, mis sisaldab isiku vastutust eksemplari näituse või koguga liitmise kavandamise või korraldamise eest. @et
toolkit definition: Eksemplar, som involverer en persons ansvar for at udtænke eller administrere samlingen af et eksemplar til en udstilling eller samling. @da
toolkit definition: Et eksemplar som involverer et ansvar for en person i form av å ha idéen til eller håndtere innsamlingen av et eksemplar i en utstilling eller samling. @no
toolkit definition: Item che implica una responsabilità di una persona nella concezione o gestione dell'aggregazione di un item a una mostra o collezione. @it
toolkit definition: Item qui comporte une responsabilité de la part d’une personne consistant à concevoir ou à gérer l’agrégation d’un item dans une exposition ou une collection de ressources. @fr
toolkit definition: Kappale, jonka näyttelyyn tai kokoelmaan kuuluvan kappaleaggregaation aikaasaamisessa tai hallinnoimisessa henkilö on osallisena.
toolkit definition: Vienība, kas ietver personas atbildību par tās iekļaušanu izstādē vai kolekcijā . @lv
toolkit definition: Ítem que implica una responsabilitat d’una persona de concebre o gestionar l’agregació d’un ítem en una exposició o una col·lecció. @ca
toolkit definition: مفردة تنطوي على مسئولية شخص عن تصور أو إدارة التجميع لمفردة في معرض أو في مجموعة. @ar
toolkit label: Person als Kuratorin/Kurator von @de
toolkit label: curator person of (Deprecated) @en
toolkit label: curator-persoon van @nl
toolkit label: curatore persona di @it
toolkit label: ir kurators (persona) @lv
toolkit label: kuraator (isik) eksemplarile @et
toolkit label: kuraattori (henkilö) kappaleessa
toolkit label: kurator for (person) @no
toolkit label: kurátor személye: @hu
toolkit label: person, som er kurator af @da
toolkit label: persona conservadora de @ca
toolkit label: personne conservatrice de @fr
toolkit label: έφορος φυσικό πρόσωπο του @el
toolkit label: شخص أمين معرض @ar
has subproperty: kokoelman muodostaja (henkilö) kappaleessa
has subproperty: kokoelman luetteloija (henkilö) kappaleessa
has subproperty: P50630
lexical alias: curatorPersonOf.en
status: Deprecated
type: Property
domain: C10004
label: er kurator for (person) @no
label: er person, som er kurator af @da
label: est une personne conservatrice de @fr
label: ir kurators (persona) @lv
label: is curator person of (Deprecated) @en
label: is curator-persoon van @nl
label: ist Person als Kuratorin/Kurator von @de
label: kuraator (isik) eksemplarile @et
label: kurátor személye a következőnek: @hu
label: è curatore persona di @it
label: és persona conservadora de @ca
label: είναι έφορος φυσικό πρόσωπο του @el
label: هو شخص أمين معرض لـ @ar
sub property of: kuraattori (toimija) kappaleelle
sub property of: henkilöön liittyvä kappale
definition: Correla una persona a un item che implica una responsabilità di una persona nella concezione o gestione dell'aggregazione di un item a una mostra o collezione. @it
definition: Hozzákapcsol egy személyt egy példányhoz, amelyhez hozzátartozik egy személy felelőssége egy példány kiállítás vagy gyűjtemény keretében történő összegyűjtésének elgondolásáért vagy kezeléséért. @hu
definition: Liittää henkilön kappaleeseen, jonka näyttelyyn tai kokoelmaan kuuluvan kappaleaggregaation aikaasaamisessa tai hallinnoimisessa henkilö on osallisena.
definition: Met une personne en relation avec un item qui comporte une responsabilité de la part d’une personne consistant à concevoir ou à gérer l’agrégation d’un item dans une exposition ou une collection de ressources. @fr
definition: Relaciona una persona amb un ítem que implica una responsabilitat d’una persona de concebre o gestionar l’agregació d’un ítem en una exposició o una col·lecció. @ca
definition: Relateert een persoon aan een item dat met zich meebrengt een verantwoordelijkheid van een persoon voor het bedenken of beheren van het aggregeren van een item in een tentoonstelling of collectie. @nl
definition: Relaterer en person til et eksemplar som involverer et ansvar for en person i form av å ha idéen til eller håndtere innsamlingen av et eksemplar i en utstilling eller samling. @no
definition: Relaterer en person til et eksemplar, som involverer en persons ansvar for at udtænke eller administrere samlingen af et eksemplar til en udstilling eller samling. @da
definition: Relates a person to an item that involves a responsibility of a person for conceiving or managing the aggregation of an item in an exhibition or collection. (Deprecated) @en
definition: Sasaista personu ar vienību, kas ietver personas atbildību par tās iekļaušanu izstādē vai kolekcijā . @lv
definition: Seostab isiku eksemplariga, mis sisaldab isiku vastutust eksemplari näituse või koguga liitmise kavandamise või korraldamise eest. @et
definition: Setzt eine Person in Beziehung zu einem Exemplar, bei dem eine Person die Aggregation eines Exemplars in einer Ausstellung oder Sammlung konzipiert oder organisiert. @de
definition: يربط شخصا بمفردة تنطوي على مسئولية وكيل فهم أو إدارة تجميع مفردة في معرض أو في مجموعة. @ar

nykyinen omistaja (henkilö) kappaleessa
has element type: 2
toolkit definition: An item that involves a responsibility of a person for current legal possession. @en
toolkit definition: Een item dat met zich meebrengt een verantwoordelijkheid van een persoon betreffende huidig wettelijk bezit. @nl
toolkit definition: Egy példány, amelyhez hozzátartozik egy személy jelenlegi tulajdonjog iránti felelőssége. @hu
toolkit definition: Ein Exemplar, das sich derzeit im rechtmäßigen Besitz einer Person befindet. @de
toolkit definition: Eksemplar, mis kuulub praegu õiguspäraselt isikule. @et
toolkit definition: Eksemplar, som involverer en persons ansvar for lovlig besiddelse p.t. @da
toolkit definition: Et eksemplar som involverer et ansvar for en person i form av å være den nåværende rettmessige eieren. @no
toolkit definition: Item che implica una responsabilità di una persona nel possesso legale attuale. @it
toolkit definition: Item qui comporte une responsabilité de la part d’une personne en ce qui concerne la propriété légale actuelle. @fr
toolkit definition: Kappale, jonka henkilö tällä hetkellä laillisesti omistaa.
toolkit definition: Mevcut yasal mülkiyet için bir kişinin sorumluluğunu içeren bir kopya. @tr
toolkit definition: Vienība, kas ietver personas atbildību par pašreizējo likumīgo īpašumu. @lv
toolkit definition: Ítem que implica una responsabilitat d’una persona en la possessió legal actual. @ca
toolkit definition: مفردة تنطوي على مسئولية شخص عن الملكية القانونية الحالية. @ar
toolkit definition: 涉及一个当前法定所有权的一个个人的责任的一个单件 @zh-hans
toolkit label: Person als gegenwärtige Eigentümerin/gegenwärtiger Eigentümer von @de
toolkit label: current owner person of @en
toolkit label: huidige eigenaar-persoon van @nl
toolkit label: ir pašreizējais īpašnieks (persona) @lv
toolkit label: jelenlegi tulajdonos személye: @hu
toolkit label: nykyinen omistaja (henkilö) kappaleessa
toolkit label: nåværende eier av (person) @no
toolkit label: person, som er nuværende ejer af @da
toolkit label: persona propietària actual de @ca
toolkit label: personne propriétaire actuelle de @fr
toolkit label: praegune omanik (isik) eksemplarile @et
toolkit label: proprietario attuale persona di @it
toolkit label: şu anki sahibi olan kişi @tr
toolkit label: τρέχων κάτοχος φυσικό πρόσωπο του @el
toolkit label: شخص مالك حاليا @ar
toolkit label: ……的当前拥有者个人 @zh-hans
has subproperty: tallettaja (henkilö) kappaleessa
has subproperty: P50631
lexical alias: currentOwnerPersonOf.en
status: Published
type: Property
domain: C10004
label: er nåværende eier av (person) @no
label: er person, som er nuværende ejer af @da
label: est une personne propriétaire actuelle de @fr
label: ir pašreizējais īpašnieks (persona) @lv
label: is current owner person of @en
label: is huidige eigenaar-persoon van @nl
label: ist Person als gegenwärtige Eigentümerin/gegenwärtiger Eigentümer von @de
label: jelenlegi tulajdonos személye a következőnek: @hu
label: mevcut sahip kişisidir @tr
label: praegune omanik (isik) eksemplarile @et
label: è proprietario attuale persona di @it
label: és persona propietària actual de @ca
label: είναι τρέχων κάτοχος φυσικό πρόσωπο του @el
label: هو شخص مالك حاليا لـ @ar
label: 是……的当前拥有者个人 @zh-hans
sub property of: nykyinen omistaja (toimija) kappaleessa
sub property of: omistaja (henkilö) kappaleessa
definition: Bir kişiyi, kişinin mevcut yasal mülkiyet sorumluluğunu içeren bir kopyayla ilişkilendirir. @tr
definition: Correla una persona a un item che implica una responsabilità di una persona nel possesso legale attuale. @it
definition: Hozzákapcsol egy személyt egy példányhoz, amelyhez hozzátartozik egy személy jelenlegi tulajdonjog iránti felelőssége. @hu
definition: Liittää henkilön kappaleeseen, jonka henkilö tällä hetkellä laillisesti omistaa.
definition: Met une personne en relation avec un item qui comporte une responsabilité de la part d’une personne en ce qui concerne la propriété légale actuelle. @fr
definition: Relaciona una persona amb un ítem que implica una responsabilitat d’una persona en la possessió legal actual. @ca
definition: Relateert een persoon aan een item dat met zich meebrengt een verantwoordelijkheid van een persoon betreffende huidig wettelijk bezit. @nl
definition: Relaterer en person til et eksemplar som involverer et ansvar for en person i form av å være den nåværende rettmessige eieren. @no
definition: Relaterer en person til et eksemplar, som involverer en persons ansvar for lovlig besiddelse p.t. @da
definition: Relates a person to an item that involves a responsibility of a person for current legal possession. @en
definition: Sasaista personu ar vienību, kas ietver personas atbildību par pašreizējo likumīgo īpašumu. @lv
definition: Seostab isiku eksemplariga, mis kuulub praegu õiguspäraselt isikule. @et
definition: Setzt eine Person in Beziehung zu einem Exemplar, das sich derzeit im rechtmäßigen Besitz einer Person befindet. @de
definition: يربط شخصا بمفردة تنطوي على مسئولية شخص عن الملكية القانونية الحالية. @ar
definition: 将一个个人与涉及一个当前法定所有权的一个个人的责任的一个单件关联起来。 @zh-hans

aiempi omistaja (henkilö) kappaleessa
has element type: 2
toolkit definition: An item that involves a responsibility of a person for former legal possession. @en
toolkit definition: Een item dat met zich meebrengt een verantwoordelijkheid van een persoon betreffende voormalig wettelijk bezit. @nl
toolkit definition: Egy példány, amelyhez hozzátartozik egy személy korábbi tulajdonjog iránti felelőssége. @hu
toolkit definition: Ein Exemplar, das früher im rechtmäßigen Besitz einer Person war. @de
toolkit definition: Eksemplar, mis kuulus varem õiguspäraselt isikule. @et
toolkit definition: Eksemplar, som involverer en persons ansvar for tidligere at have haft lovlig besiddelse. @da
toolkit definition: Eski yasal mülkiyet için bir kişinin sorumluluğunu içeren bir kopya. @tr
toolkit definition: Et eksemplar som involverer et ansvar for en person i form av å være en tidligere rettmessig eier. @no
toolkit definition: Item che implica una responsabilità di una persona nel possesso legale precedente. @it
toolkit definition: Item qui comporte une responsabilité de la part d’une personne en ce qui concerne la propriété légale antérieure. @fr
toolkit definition: Kappale, jonka henkilö on aiemmin laillisesti omistanut.
toolkit definition: Vienība, kas ietver personas atbildību par bijušo likumīgo īpašumu. @lv
toolkit definition: Ítem que implica una responsabilitat d’una persona en la possessió legal anterior. @ca
toolkit definition: مفردة تنطوي على مسئولية شخص عن الملكية القانونية السابقة. @ar
toolkit definition: 涉及先前法定所有权的一个个人的责任的一个单件 @zh-hans
toolkit label: Person als frühere Eigentümerin/früherer Eigentümer von @de
toolkit label: aiempi omistaja (henkilö) kappaleessa
toolkit label: ancienne personne propriétaire de @fr
toolkit label: endine omanik (isik) eksemplarile @et
toolkit label: former owner person of @en
toolkit label: ir agrākais īpašnieks (persona) @lv
toolkit label: korábbi tulajdonos személye: @hu
toolkit label: person, som er tidligere ejer af @da
toolkit label: persona propietària anterior de @ca
toolkit label: proprietario precedente persona di @it
toolkit label: tidligere eier av (person) @no
toolkit label: voormalige eigenaar-persoon van @nl
toolkit label: önceki sahibi olan kişi @tr
toolkit label: προηγούμενος κάτοχος φυσικό πρόσωπο του @el
toolkit label: شخص مالك سابقا @ar
toolkit label: ……的先前拥有者个人 @zh-hans
has subproperty: lahjoittaja (henkilö) kappaleelle
has subproperty: myyjä (henkilö) kappaleelle
has subproperty: P50632
lexical alias: formerOwnerPersonOf.en
status: Published
type: Property
domain: C10004
label: endine omanik (isik) eksemplarile @et
label: er person, som er tidligere ejer af @da
label: er tidligere eier av (person) @no
label: eski sahip kişisidir @tr
label: est une ancienne personne propriétaire de @fr
label: ir agrākais īpašnieks (persona) @lv
label: is former owner person of @en
label: is voormalige eigenaar-persoon van @nl
label: ist Person als frühere Eigentümerin/früherer Eigentümer von @de
label: korábbi tulajdonos személye a következőnek: @hu
label: è proprietario precedente persona di @it
label: és persona propietària anterior de @ca
label: είναι προηγούμενος κάτοχος φυσικό πρόσωπο του @el
label: هو شخص مالك سابقا لـ @ar
label: 是……的先前拥有者个人 @zh-hans
sub property of: entinen omistaja (toimija) kappaleessa
sub property of: omistaja (henkilö) kappaleessa
definition: Bir kişiyi, kişinin eski yasal mülkiyeti için sorumluluğunu içeren bir kopyayla ilişkilendirir. @tr
definition: Correla una persona a un item che implica una responsabilità di una persona nel possesso legale precedente. @it
definition: Hozzákapcsol egy személyt egy példányhoz, amelyhez hozzátartozik egy személy korábbi tulajdonjog iránti felelőssége. @hu
definition: Liittää henkilön kappaleeseen, jonka henkilö on aiemmin laillisesti omistanut.
definition: Met une personne en relation avec un item qui comporte une responsabilité de la part d’une personne en ce qui concerne la propriété légale antérieure. @fr
definition: Relaciona una persona amb un ítem que implica una responsabilitat d’una persona en la possessió legal anterior. @ca
definition: Relateert een persoon aan een item dat met zich meebrengt een verantwoordelijkheid van een persoon betreffende voormalig wettelijk bezit. @nl
definition: Relaterer en person til et eksemplar som involverer et ansvar for en person i form av å være en tidligere rettmessig eier. @no
definition: Relaterer en person til et eksemplar, som involverer en persons ansvar for tidligere at have haft lovlig besiddelse. @da
definition: Relates a person to an item that involves a responsibility of a person for former legal possession. @en
definition: Sasaista personu ar vienību, kas ietver personas atbildību par bijušo likumīgo īpašumu. @lv
definition: Seostab isiku eksemplariga, mis kuulus varem õiguspäraselt isikule. @et
definition: Setzt eine Person in Beziehung zu einem Exemplar, das früher im rechtmäßigen Besitz einer Person war. @de
definition: يربط شخصا بمفردة تنطوي على مسئولية شخص عن الملكية القانونية السابقة. @ar
definition: 将一个个人与涉及先前法定所有权的一个个人的责任的一个单件关联起来。 @zh-hans

säilyttäjä (henkilö) kappaleessa
has element type: 2
toolkit definition: An item that involves a responsibility of a person for legal custody. @en
toolkit definition: Een item dat met zich meebrengt een verantwoordelijkheid van een persoon voor wettelijke bewaring. @nl
toolkit definition: Egy példány, amelyhez hozzátartozik egy személy megőrzés iránti felelőssége. @hu
toolkit definition: Ein Exemplar, das sich in der rechtmäßigen Verwahrung einer Person befindet. @de
toolkit definition: Eksemplar, mis on isiku õiguspärasel vastutaval hoiul. @et
toolkit definition: Eksemplar, som involverer en persons ansvar for lovlig forvaring. @da
toolkit definition: Et eksemplar som involverer et ansvar for en person i form av lovlig forvaring. @no
toolkit definition: Item che implica una responsabilità di una persona per la custodia legale. @it
toolkit definition: Item qui comporte une responsabilité de la part d’une personne en ce qui concerne la garde légale. @fr
toolkit definition: Kappale, joka on laillisesti henkilön säilytyksessä.
toolkit definition: Vienība, kas ietver personas atbildību par likumīgu pārvaldību. @lv
toolkit definition: Yasal velayet için bir kişinin sorumluluğunu içeren bir kopya. @tr
toolkit definition: Ítem que implica una responsabilitat d’una persona en la custòdia legal. @ca
toolkit definition: مفردة تنطوي على مسئولية شخص عن الوصاية القانونية. @ar
toolkit definition: 涉及合法保管的一个个人的责任的一个单件 @zh-hans
toolkit label: Person als Verwahrerin/Verwahrer von @de
toolkit label: bewaarder-persoon van @nl
toolkit label: custodian person of @en
toolkit label: depositario persona di @it
toolkit label: ir pārvaldītājs (persona) @lv
toolkit label: koruyucu @tr
toolkit label: letétkezelő személye: @hu
toolkit label: oppbevarer av (person) @no
toolkit label: person, som er forvalter af @da
toolkit label: persona dipositària de @ca
toolkit label: personne dépositaire de @fr
toolkit label: säilyttäjä (henkilö) kappaleessa
toolkit label: vastutav hoidja (isik) eksemplarile @et
toolkit label: φύλακας φυσικό πρόσωπο του @el
toolkit label: شخص وصي على @ar
toolkit label: ……的保管者个人 @zh-hans
has subproperty: P50633
lexical alias: custodianPersonOf.en
status: Published
type: Property
domain: C10004
label: er oppbevarer av (person) @no
label: er person, som er forvalter af @da
label: est une personne dépositaire de @fr
label: ir pārvaldītājs (persona) @lv
label: is bewaarder-persoon van @nl
label: is custodian person of @en
label: ist Person als Verwahrerin/Verwahrer von @de
label: letétkezelő személye a következőnek: @hu
label: vastutav hoidja (isik) eksemplarile @et
label: velayet sahibidir @tr
label: è depositario persona di @it
label: és persona dipositària de @ca
label: είναι φύλακας φυσικό πρόσωπο του @el
label: هو شخص وصي على @ar
label: 是……的保管者个人 @zh-hans
sub property of: säilyttäjä (toimija) kappaleessa
sub property of: henkilöön liittyvä kappale
definition: Bir kişiyi, kişinin yasal velayet sorumluluğunu içeren bir kopyayla ilişkilendirir. @tr
definition: Correla una persona a un item che implica una responsabilità di una persona per la custodia legale. @it
definition: Hozzákapcsol egy személyt egy példányhoz, amelyhez hozzátartozik egy személy megőrzés iránti felelőssége. @hu
definition: Liittää henkilön kappaleeseen, joka on laillisesti henkilön säilytyksessä.
definition: Met une personne en relation avec un item qui comporte une responsabilité de la part d’une personne en ce qui concerne la garde légale. @fr
definition: Relaciona una persona amb un ítem que implica una responsabilitat d’una persona en la custòdia legal. @ca
definition: Relateert een persoon aan een item dat met zich meebrengt een verantwoordelijkheid van een persoon voor wettelijke bewaring. @nl
definition: Relaterer en person til et eksemplar som involverer et ansvar for en person i form av lovlig forvaring. @no
definition: Relaterer en person til et eksemplar, som involverer en persons ansvar for lovlig forvaring. @da
definition: Relates a person to an item that involves a responsibility of a person for legal custody. @en
definition: Sasaista personu ar vienību, kas ietver personas atbildību par likumīgu pārvaldību. @lv
definition: Seostab isiku eksemplariga, mis on isiku õiguspärasel vastutaval hoiul. @et
definition: Setzt eine Person in Beziehung zu einem Exemplar, das sich in der rechtmäßigen Verwahrung einer Person befindet. @de
definition: يربط شخصا بمفردة تنطوي على مسئولية شخص عن الوصاية القانونية. @ar
definition: 将一个个人与涉及合法保管的一个个人的责任的一个单件关联起来。 @zh-hans

omistaja (henkilö) kappaleessa
has element type: 2
toolkit definition: An item that involves a responsibility of a person for legal possession. @en
toolkit definition: Een item dat met zich meebrengt een verantwoordelijkheid van een persoon voor wettelijk bezit. @nl
toolkit definition: Egy példány, amelyhez hozzátartozik egy személy tulajdonjog iránti felelőssége. @hu
toolkit definition: Ein Exemplar, das im rechtmäßigen Besitz einer Person ist. @de
toolkit definition: Eksemplar, mis kuulub või on kuulunud õiguspäraselt isikule. @et
toolkit definition: Eksemplar, som involverer en persons ansvar for lovlig besiddelse. @da
toolkit definition: Et eksemplar som involverer et ansvar for en person i form av å være den rettmessige eieren. @no
toolkit definition: Item che implica una responsabilità di una persona nel possesso legale. @it
toolkit definition: Item qui comporte une responsabilité de la part d’une personne en ce qui concerne la propriété légale. @fr
toolkit definition: Kappale, joka on laillisesti henkilön omistuksessa.
toolkit definition: Vienība, kas ietver personas atbildību par likumīgu īpašumu. @lv
toolkit definition: Yasal mülkiyet için bir kişinin sorumluluğunu içeren bir kopya. @tr
toolkit definition: Ítem que implica una responsabilitat d’una persona en la possessió legal actual o anterior. @ca
toolkit definition: مفردة تنطوي على مسئولية شخص عن الملكية القانونية. @ar
toolkit definition: 涉及法定所有权的一个个人的责任的一个单件 @zh-hans
toolkit label: Person als Eigentümerin/Eigentümer von @de
toolkit label: eier av (person) @no
toolkit label: eigenaar-persoon van @nl
toolkit label: ir īpašnieks (persona) @lv
toolkit label: omanik (isik) eksemplarile @et
toolkit label: omistaja (henkilö) kappaleessa
toolkit label: owner person of @en
toolkit label: person, som er ejer af @da
toolkit label: persona propietària de @ca
toolkit label: personne propriétaire de @fr
toolkit label: proprietario persona di @it
toolkit label: sahibi @tr
toolkit label: tulajdonos személye: @hu
toolkit label: κάτοχος φυσικό πρόσωπο του @el
toolkit label: شخص مالك @ar
toolkit label: ……的拥有者个人 @zh-hans
has subproperty: nykyinen omistaja (henkilö) kappaleessa
has subproperty: aiempi omistaja (henkilö) kappaleessa
has subproperty: P50634
lexical alias: ownerPersonOf.en
status: Published
type: Property
domain: C10004
label: er eier av (person) @no
label: er person, som er ejer af @da
label: est une personne propriétaire de @fr
label: ir īpašnieks (persona) @lv
label: is eigenaar-persoon van @nl
label: is owner person of @en
label: ist Person als Eigentümerin/Eigentümer von @de
label: omanik (isik) eksemplarile @et
label: sahip kişisidir @tr
label: tulajdonos személye a következőnek: @hu
label: è proprietario persona di @it
label: és persona propietària de @ca
label: είναι κάτοχος φυσικό πρόσωπο του @el
label: هو شخص مالك لـ @ar
label: 是……的拥有者个人 @zh-hans
sub property of: omistaja (toimija) kappaleessa
sub property of: henkilöön liittyvä kappale
definition: Bir kişiyi, kişinin yasal mülkiyet sorumluluğunu içeren bir kopyayla ilişkilendirir. @tr
definition: Correla una persona a un item che implica una responsabilità di una persona nel possesso legale. @it
definition: Hozzákapcsol egy személyt egy példányhoz, amelyhez hozzátartozik egy személy tulajdonjog iránti felelőssége. @hu
definition: Liittää henkilön kappaleeseen, joka on laillisesti henkilön omistuksessa.
definition: Met une personne en relation avec un item qui comporte une responsabilité de la part d’une personne en ce qui concerne la propriété légale. @fr
definition: Relaciona una persona amb un ítem que implica una responsabilitat d’una persona en la possessió legal actual o anterior. @ca
definition: Relateert een persoon aan een item dat met zich meebrengt een verantwoordelijkheid van een persoon voor wettelijk bezit. @nl
definition: Relaterer en person til et eksemplar som involverer et ansvar for en person i form av å være den rettmessige eieren. @no
definition: Relaterer en person til et eksemplar, som involverer en persons ansvar for lovlig besiddelse. @da
definition: Relates a person to an item that involves a responsibility of a person for legal possession. @en
definition: Sasaista personu ar vienību, kas ietver personas atbildību par likumīgu īpašumu. @lv
definition: Seostab isiku eksemplariga, mis kuulub või on kuulunud õiguspäraselt isikule. @et
definition: Setzt eine Person in Beziehung zu einem Exemplar, das im rechtmäßigen Besitz einer Person ist. @de
definition: يربط شخصا بمفردة تنطوي على مسئولية شخص عن الملكية القانونية. @ar
definition: 将一个个人与涉及法定所有权的一个个人的责任的一个单件关联起来。 @zh-hans

kokoelman muodostaja (henkilö) kappaleessa
has element type: 2
toolkit definition: An item that is brought together by a person with items from various sources that are arranged, described, or catalogued as a collection. (Deprecated) @en
toolkit definition: Een item dat samengebracht is door een persoon met items van diverse bronnen die gearrangeerd, beschreven of gecatalogiseerd zijn als een verzameling. @nl
toolkit definition: Egy példány, amelyet egy személy különböző forrásokból származó, gyűjteményként rendezett, leírt és katalogizált példányokkal fog össze. @hu
toolkit definition: Ein Exemplar, das von einer Person mit Materialien aus unterschiedlichen Quellen zusammengetragen wird, die dann als Sammlung geordnet, beschrieben oder katalogisiert werden. @de
toolkit definition: Eksemplar, mille isik on kokku pannud teiste eri allikatest kogutud eksemplaridega, mis on korrastatud, kirjeldatud ja kataloogitud koguna. @et
toolkit definition: Eksemplar, som er sammenført af en person med eksemplarer fra forskellige kilder, som er arrangeret, beskrevet og katalogiseret som en samling. @da
toolkit definition: Et eksemplar som av en person er satt sammen med eksemplarer fra ulike kilder og som er arrangert, beskrevet eller katalogisert som en samling. @no
toolkit definition: Item messo insieme da una persona con item da varie fonti che sono organizzati, descritti e catalogati come una collezione. @it
toolkit definition: Item qui est regroupé par une personne avec des items de diverses sources qui sont arrangés, décrits ou catalogués comme une collection de ressources. @fr
toolkit definition: Kappale, jonka henkilö on koonnut osaksi järjestettyä, kuvailtua tai luetteloitua kokoelmaa yhdessä muiden eri lähteistä olevien kappaleiden kanssa.
toolkit definition: Vienība, ko persona apkopojusi kopā ar citām vienībām no dažādiem avotiem, kas ir sakārtotas, aprakstītas un kataloģizētas kā kolekcija. @lv
toolkit definition: Ítem que és aplegat per una persona amb ítems de diverses fonts que s’arrangen, es descriuen o es cataloguen com una col·lecció. @ca
toolkit definition: مفردة جمعها شخص مع مفردات من مصادر مختلفة رُتبت وُوصفت وفُهرست كمجموعة. @ar
toolkit label: Person als Sammlerin/Sammler von @de
toolkit label: collector person of (Deprecated) @en
toolkit label: collezionista persona di @it
toolkit label: ir kolekcionārs (persona) @lv
toolkit label: kogu moodustaja (isik) eksemplarile @et
toolkit label: kokoelman muodostaja (henkilö) kappaleessa
toolkit label: kollektor személye: @hu
toolkit label: person, som er samler af @da
toolkit label: persona col·leccionista de @ca
toolkit label: personne collectionneuse de @fr
toolkit label: samler av (person) @no
toolkit label: verzamelaar-persoon van @nl
toolkit label: συλλέκτης φυσικό πρόσωπο του @el
toolkit label: شخص جامع @ar
has subproperty: P50635
lexical alias: collectorPersonof.en
status: Deprecated
type: Property
domain: C10004
label: er person, som er samler af @da
label: er samler av (person) @no
label: est une personne collectionneuse de @fr
label: ir kolekcionārs (persona) @lv
label: is collector person of (Deprecated) @en
label: is verzamelaar-persoon van @nl
label: ist Person als Sammlerin/Sammler von @de
label: kogu moodustaja (isik) eksemplarile @et
label: kollektor személye a következőnek: @hu
label: è collezionista persona di @it
label: és persona col·leccionista de @ca
label: είναι συλλέκτης φυσικό πρόσωπο του @el
label: هو شخص جامع لـ @ar
sub property of: kokoelman muodostaja (toimija) kappaleessa
sub property of: kuraattori (henkilö) kappaleessa
definition: Correla una persona a un item messo insieme da una persona con item da varie fonti che sono organizzati, descritti e catalogati come una collezione. @it
definition: Hozzákapcsol egy személyt egy példányhoz, amelyet egy személy különböző forrásokból származó, gyűjteményként rendezett, leírt és katalogizált példányokkal fog össze. @hu
definition: Liittää henkilön kappaleeseen, jonka henkilö on koonnut järjestetyksi, kuvailluksi tai luetteloiduksi kokoelmaksi eri lähteistä olevista kappaleista.
definition: Met une personne en relation avec un item qui est regroupé par une personne avec des items de diverses sources qui sont arrangés, décrits ou catalogués comme une collection de ressources. @fr
definition: Relaciona una persona amb un ítem que és aplegat per una persona amb ítems de diverses fonts que s’arrangen, es descriuen o es cataloguen com una col·lecció. @ca
definition: Relateert een persoon aan een item dat samengebracht is door een persoon met items van diverse bronnen die gearrangeerd, beschreven of gecatalogiseerd zijn als een verzameling. @nl
definition: Relaterer en person til et eksemplar som av en person er satt sammen med eksemplarer fra ulike kilder og som er arrangert, beskrevet eller katalogisert som en samling. @no
definition: Relaterer en person til et eksemplar, som er sammenført af en person med eksemplarer fra forskellige kilder, som er arrangeret, beskrevet og katalogiseret som en samling. @da
definition: Relates a person to an item that is brought together by a person with items from various sources that are arranged, described, or catalogued as a collection. (Deprecated) @en
definition: Sasaista personu ar vienību, ko persona apkopojusi kopā ar citām vienībām no dažādiem avotiem, kas ir sakārtotas, aprakstītas un kataloģizētas kā kolekcija. @lv
definition: Seostab isiku eksemplariga, mille isik on kokku pannud teiste eri allikatest kogutud eksemplaridega, mis on korrastatud, kirjeldatud ja kataloogitud koguna. @et
definition: Setzt eine Person in Beziehung zu einem Exemplar, das von einer Person mit Materialien aus unterschiedlichen Quellen zusammengetragen wird, die dann als Sammlung geordnet, beschrieben oder katalogisiert werden. @de
definition: يربط شخصا بمفردة جمعها وكيل مع مفردات من مصادر مختلفة رُتبت وُوصفت وفُهرست كمجموعة. @ar

muokkaaja (henkilö) kappaleessa
has element type: 2
toolkit definition: An item that is changed by a person without creating a new manifestation. @en
toolkit definition: Een item dat veranderd is door een persoon zonder een nieuwe manifestatie te creëren. @nl
toolkit definition: Egy példány, amelyet egy személy új megjelenési forma létrehozása nélkül változtat meg. @hu
toolkit definition: Ein Exemplar, das von einer Person verändert wird, ohne eine neue Manifestation zu erstellen. @de
toolkit definition: Eksemplar, mida isik on muutnud, loomata uut kehastust. @et
toolkit definition: Eksemplar, som ændres af en person uden at skabe en ny manifestation. @da
toolkit definition: Et eksemplar som er endret av en person uten at det skapes en ny manifestasjon. @no
toolkit definition: Item auquel une personne apporte des modifications sans créer une nouvelle manifestation. @fr
toolkit definition: Item modificato da una persona senza creare una nuova manifestazione. @it
toolkit definition: Kappale, johon henkilö tekee muutoksia luomatta uutta manifestaatiota.
toolkit definition: Vienība, ko persona mainījusi, neradot jaunu manifestāciju. @lv
toolkit definition: Yeni bir gösterim oluşturmadan bir kişi tarafından değiştirilen bir kopya. @tr
toolkit definition: Ítem que és canviat per una persona sense crear una nova manifestació. @ca
toolkit definition: مفردة تم تغييرها من قبل شخص دون إنشاء تجسيدة جديدة. @ar
toolkit definition: 被一个个人修改而不创建一个新载体表现的一个单件 @zh-hans
toolkit label: Dönüştüren kişi @tr
toolkit label: Person als Bearbeiterin/Bearbeiter eines Exemplars von @de
toolkit label: aanpasser-persoon van @nl
toolkit label: ir modificētājs (persona) @lv
toolkit label: modificatore persona di @it
toolkit label: modifier person of @en
toolkit label: muokkaaja (henkilö) kappaleessa
toolkit label: muutja (isik) eksemplaris @et
toolkit label: módosító személye: @hu
toolkit label: person, som er tilpasser af @da
toolkit label: persona modificadora de @ca
toolkit label: personne modificatrice de @fr
toolkit label: tilpasser av (person) @no
toolkit label: τροποποιητής φυσικό πρόσωπο του @el
toolkit label: شخص مُعدل @ar
toolkit label: ……的修改者个人 @zh-hans
has subproperty: omistuskirjoituksen kirjoittaja kappaleessa
has subproperty: lisähuomautusten kirjoittaja kappaleessa
has subproperty: nimikirjoituksen kirjoittaja kappaleessa
has subproperty: P50636
lexical alias: modifierPersonOf.en
status: Published
type: Property
domain: C10004
label: düzenleyici kişisidir @tr
label: er person, som er tilpasser af @da
label: er tilpasser av (person) @no
label: est une personne modificatrice de @fr
label: ir modificētājs (persona) @lv
label: is aanpasser-persoon van @nl
label: is modifier person of @en
label: ist Person als Bearbeiterin/Bearbeiter eines Exemplars von @de
label: muutja (isik) eksemplaris @et
label: módosító személye a következőnek: @hu
label: è modificatore persona di @it
label: és persona modificadora de @ca
label: είναι τροποποιητής φυσικό πρόσωπο του @el
label: هو شخص مُعدل لـ @ar
label: 是……的修改者个人 @zh-hans
sub property of: henkilöön liittyvä kappale
sub property of: muokkaaja (toimija) kappaleessa
definition: Bir kişiyi, yeni bir gösterim oluşturmadan kişi tarafından dönüştürülen kopyayla ilişkilendirir. @tr
definition: Correla una persona a un item modificato da una persona senza creare una nuova manifestazione. @it
definition: Hozzákapcsol egy személyt egy példányhoz, amelyet egy személy új megjelenési forma létrehozása nélkül változtat meg. @hu
definition: Liittää henkilön kappaleeseen, johon henkilö tekee muutoksia luomatta uutta manifestaatiota.
definition: Met une personne en relation avec un item auquel une personne apporte des modifications sans créer une nouvelle manifestation. @fr
definition: Relaciona una persona amb un ítem que és canviat per una persona sense crear una nova manifestació. @ca
definition: Relateert een persoon aan een item dat veranderd is door een persoon zonder een nieuwe manifestatie te creëren. @nl
definition: Relaterer en person til et eksemplar som er endret av en person uten at det skapes en ny manifestasjon. @no
definition: Relaterer en person til et eksemplar, som ændres af en person uden at skabe en ny manifestation. @da
definition: Relates a person to an item that is changed by a person without creating a new manifestation. @en
definition: Sasaista personu ar vienību, ko persona mainījusi, neradot jaunu manifestāciju. @lv
definition: Seostab isiku eksemplariga, mida isik on muutnud, loomata uut kehastust. @et
definition: Setzt eine Person in Beziehung zu einem Exemplar, das von einer Person verändert wird, ohne eine neue Manifestation zu erstellen. @de
definition: يربط شخصا بمفردة تم تغييرها من قبل شخص دون إنشاء تجسيدة جديدة. @ar
definition: 将一个个人与被一个个人修改而不创建一个新载体表现的一个单件关联起来。 @zh-hans

illuminoinnin tekijä (henkilö) kappaleessa
has element type: 2
toolkit definition: An item that is decorated by a person using precious metals or colour, often with elaborate designs and motifs. @en
toolkit definition: Değerli metaller veya renkler kullanılarak, genellikle özenle hazırlanmış desenler ve motiflerle bir kişi tarafından süslenen bir kopya. @tr
toolkit definition: Een item dat is versierd door een persoon met gebruikmaking van edelmetalen of kleur, vaak met uitgebreide patronen en motieven. @nl
toolkit definition: Egy példány, amelyet egy személy nemesfémeket vagy színeket használva díszít, gyakran kidolgozott rajzokkal és motívumokkal. @hu
toolkit definition: Ein Exemplar, das von einer Person durch Edelmetalle und Farben, häufig mit kunstvollen Mustern und Motiven, (aus-)gestaltet wird. @de
toolkit definition: Eksemplar, mille isik on kaunistanud väärismetallide ja värvidega, kasutades sageli keerulisi kujundeid ja motiive. @et
toolkit definition: Eksemplar, som er udsmykket af en person med ædelmetal eller farve, ofte med detaljerige mønstre og motiver. @da
toolkit definition: Et eksemplar som er dekorert av person ved hjelp av edle metaller eller farger, gjerne med intrikate former og motiver. @no
toolkit definition: Item decorato da una persona utilizzando metalli preziosi o colore, spesso con disegni e motivi elaborati. @it
toolkit definition: Item qui est orné par une personne avec des métaux précieux ou de la couleur, souvent avec des dessins et des motifs élaborés. @fr
toolkit definition: Kappale, jonka henkilö koristelee usein yksityiskohtaisin kuvioin tai motiivein käyttäen jalometalleja tai värejä.
toolkit definition: Vienība, ko persona izgreznojusi, izmantojot krāsu un/vai dārgmetālus, bieži ar izsmalcinātiem un filigrāniem zīmējumiem, burtiem un motīviem. @lv
toolkit definition: Ítem que és decorat per una persona usant metalls preciosos o amb color, sovint amb dissenys i motius elaborats. @ca
toolkit definition: مفردة يزينها شخص بمعادن ثمينة أو بألوان، غالبًا بتصاميم وزخارف منمقة. @ar
toolkit definition: 被用贵重的金属或色彩（通常有精心的设计和图案）的一个个人进行装饰的一个单件 @zh-hans
toolkit label: Person als Illuminatorin/Illuminator von @de
toolkit label: illuminator for (person) @no
toolkit label: illuminator person of @en
toolkit label: illumineerija (isik) eksemplaris @et
toolkit label: illuminoinnin tekijä (henkilö) kappaleessa
toolkit label: illuminátor személye: @hu
toolkit label: ir iluminātors (persona) @lv
toolkit label: miniatore persona di @it
toolkit label: person, som er illuminator af @da
toolkit label: persona il·luminadora de @ca
toolkit label: personne enlumineuse de @fr
toolkit label: tezhip sanatçısı kişisidir @tr
toolkit label: verluchter-persoon van @nl
toolkit label: φωτιστής φυσικό πρόσωπο του @el
toolkit label: شخص مزخرف @ar
toolkit label: ……的彩饰者个人 @zh-hans
has subproperty: P50637
lexical alias: illuminatorPersonOf.en
status: Published
type: Property
domain: C10004
label: er illuminator for (person) @no
label: er person, som er illuminator af @da
label: est une personne enlumineuse de @fr
label: illumineerija (isik) eksemplaris @et
label: illuminátor személye a következőnek: @hu
label: ir iluminātors (persona) @lv
label: is illuminator person of @en
label: is verluchter-persoon van @nl
label: ist Person als Illuminatorin/Illuminator von @de
label: tezhip sanatçısı kişisidir @tr
label: è miniatore persona di @it
label: és persona il·luminadora de @ca
label: είναι φωτιστής φυσικό πρόσωπο του @el
label: هو شخص مزخرف لـ @ar
label: 是……的彩饰者个人 @zh-hans
sub property of: illuminoinnin tekijä (toimija) kappaleessa
sub property of: henkilöön liittyvä kappale
definition: Bir kişiyi, kişi tarafından değerli metaller veya renk kullanılarak, çoğunlukla detaylı tasarımlar ve motiflerle süslenmiş bir kopyayla ilişkilendirir. @tr
definition: Correla una persona a un item decorato da una persona utilizzando metalli preziosi o colore, spesso con disegni e motivi elaborati. @it
definition: Hozzákapcsol egy személyt egy példányhoz, amelyet egy személy nemesfémeket vagy színeket használva díszít, gyakran kidolgozott rajzokkal és motívumokkal. @hu
definition: Liittää henkilön kappaleeseen, jonka henkilö koristelee usein yksityiskohtaisin kuvioin tai motiivein käyttäen jalometalleja tai värejä.
definition: Met une personne en relation avec un item qui est orné par une personne avec des métaux précieux ou de la couleur, souvent avec des dessins et des motifs élaborés. @fr
definition: Relaciona una persona amb un ítem que és decorat per una persona usant metalls preciosos o amb color, sovint amb dissenys i motius elaborats. @ca
definition: Relateert een persoon aan een item dat is versierd door een persoon met gebruikmaking van edelmetalen of kleur, vaak met uitgebreide patronen en motieven. @nl
definition: Relaterer en person til et eksemplar som er dekorert av person ved hjelp av edle metaller eller farger, gjerne med intrikate former og motiver. @no
definition: Relaterer en person til et eksemplar, som er udsmykket af en person med ædelmetal eller farve, ofte med detaljerige mønstre og motiver. @da
definition: Relates a person to an item that is decorated by a person using precious metals or colour, often with elaborate designs and motifs. @en
definition: Sasaista personu ar vienību, ko persona izgreznojusi, izmantojot krāsu un/vai dārgmetālus, bieži ar izsmalcinātiem un filigrāniem zīmējumiem, burtiem un motīviem. @lv
definition: Seostab isiku eksemplariga, mille isik on kaunistanud väärismetallide ja värvidega, kasutades sageli keerulisi kujundeid ja motiive. @et
definition: Setzt eine Person in Beziehung zu einem Exemplar, das von einer Person durch Edelmetalle und Farben, häufig mit kunstvollen Mustern und Motiven, (aus-)gestaltet wird. @de
definition: يربط شخصا بمفردة يزينها شخص بمعادن ثمينة أو بألوان، غالبًا بتصاميم وزخارف منمقة. @ar
definition: 将一个个人与被用贵重的金属或色彩（通常有精心的设计和图案）的一个个人进行装饰的一个单件关联起来。 @zh-hans

tallettaja (henkilö) kappaleessa
has element type: 2
toolkit definition: An item that is deposited by a person into the custody of another agent without transferring ownership. @en
toolkit definition: Bir kişi tarafından mülkiyeti devretmeden başka bir temsilci gözetimine bırakılan bir kopya. @tr
toolkit definition: Een item dat door een persoon in bewaring is gegeven bij een andere actor zonder overdracht van eigenaarschap. @nl
toolkit definition: Egy példány, amelyet egy személy egy másik ágens felügyelete alá helyez anélkül, hogy a tulajdonjogot átruházná. @hu
toolkit definition: Ein Exemplar, das von einer Person in die Obhut eines anderen Akteurs gegeben wird, ohne das Eigentumsrecht zu übertragen. @de
toolkit definition: Eksemplar, mille isik on deponeerinud teise tegija vastutavale hoiule ilma omandiõiguse üleminekuta. @et
toolkit definition: Eksemplar, som er deponeret i forvaring af en person hos en anden agent, men uden at overgive ejerskab. @da
toolkit definition: Et eksemplar som er deponert av en person til forvaring hos en annen agent uten at eierskapet blir overført. @no
toolkit definition: Item depositato da una persona in custodia di un altro agente senza trasferire la proprietà. @it
toolkit definition: Item qui est déposé par une personne sous la garde d’un autre agent sans que sa propriété ne soit transférée. @fr
toolkit definition: Kappale, jonka henkilö on luovuttanut toisen toimijan haltuun siirtämättä omistajuutta.
toolkit definition: Vienība, ko persona deponējusi cita aģenta uzglabāšanā, vienlaikus saglabājot deponenta īpašumtiesības. @lv
toolkit definition: Ítem que és dipositat per una persona sota la custòdia d’un altre agent sense transferir-li la propietat. @ca
toolkit definition: مفردة تم إيداعها بمعرفة شخص في عهدة وكيل آخر دون نقل الملكية. @ar
toolkit definition: 被一个个人储存归另一个行为者保管而不转移所有权的一个单件 @zh-hans
toolkit label: Person als Leihgeberin/Leihgeber von @de
toolkit label: bruikleen-persoon van @nl
toolkit label: deponeerija (isik) eksemplarile @et
toolkit label: deponent for (person) @no
toolkit label: depositante persona di @it
toolkit label: depositor person of @en
toolkit label: ir deponētājs (persona) @lv
toolkit label: letétbe helyező személye: @hu
toolkit label: mevduatçı @tr
toolkit label: person, som er udlåner af @da
toolkit label: persona dipositadora de @ca
toolkit label: personne déposante de @fr
toolkit label: tallettaja (henkilö) kappaleessa
toolkit label: καταθέτης φυσικό πρόσωπο του @el
toolkit label: شخص مودع @ar
toolkit label: ……的托存者行为者 @zh-hans
has subproperty: P50638
lexical alias: depositorPersonOf.en
status: Published
type: Property
domain: C10004
label: deponeerija (isik) eksemplarile @et
label: er deponent for (person) @no
label: er person, som er udlåner af @da
label: est une personne déposante de @fr
label: ir deponētājs (persona) @lv
label: is bruikleen-persoon van @nl
label: is depositor person of @en
label: ist Person als Leihgeberin/Leihgeber von @de
label: letétbe helyező személye a következőnek: @hu
label: mevduatçı kişisidir @tr
label: è depositante persona di @it
label: és persona dipositadora de @ca
label: είναι καταθέτης φυσικό πρόσωπο του @el
label: هو شخص مودع لـ @ar
label: 是……的托存者行为者 @zh-hans
sub property of: tallettaja (toimija) kappaleessa
sub property of: nykyinen omistaja (henkilö) kappaleessa
definition: Bir kişiyi, mülkiyeti devretmeksizin kişi tarafından başka bir temsilcinin gözetimine bırakılan kopyayla ilişkilendirir. @tr
definition: Correla una persona a un item depositato da una persona in custodia di un altro agente senza trasferire la proprietà. @it
definition: Hozzákapcsol egy személyt egy példányhoz, amelyet a személy egy másik ágens felügyelete alá helyez anélkül, hogy a tulajdonjogot átruházná. @hu
definition: Liittää henkilön kappaleeseen, jonka henkilö on luovuttanut toisen toimijan haltuun siirtämättä omistajuutta.
definition: Met une personne en relation avec un item qui est déposé par une personne sous la garde d’un autre agent sans que sa propriété ne soit transférée. @fr
definition: Relaciona una persona amb un ítem que és dipositat per una persona sota la custòdia d’un altre agent sense transferir-li la propietat. @ca
definition: Relateert een persoon aan een item dat door een persoon in bewaring is gegeven bij een andere actor zonder overdracht van eigenaarschap. @nl
definition: Relaterer en person til et eksemplar som er deponert av en person til forvaring hos en annen agent uten at eierskapet blir overført. @no
definition: Relaterer en person til et eksemplar, som er deponeret i forvaring af en person hos en anden agent, men uden at overgive ejerskab. @da
definition: Relates a person to an item that is deposited by a person into the custody of another agent without transferring ownership. @en
definition: Sasaista personu ar vienību, ko persona deponējusi cita aģenta uzglabāšanā, vienlaikus saglabājot deponenta īpašumtiesības. @lv
definition: Seostab isiku eksemplariga, mille isik on deponeerinud teise tegija vastutavale hoiule ilma omandiõiguse üleminekuta. @et
definition: Setzt eine Person in Beziehung zu einem Exemplar, das von einer Person in die Obhut eines anderen Akteurs gegeben wird, ohne das Eigentumsrecht zu übertragen. @de
definition: يربط شخصا بمفردة تم إيداعها بمعرفة شخص في عهدة وكيل آخر دون نقل الملكية. @ar
definition: 将一个个人与被一个个人储存归另一个行为者保管而不转移所有权的一个单件关联起来。 @zh-hans

lahjoittaja (henkilö) kappaleelle
has element type: 2
toolkit definition: An item that is donated to another owner who is a person. @en
toolkit definition: Bir kişi olan başka bir mülk sahibine bağışlanan bir kopya. @tr
toolkit definition: Een item dat is gedoneerd aan een andere eigenaar die een persoon is. @nl
toolkit definition: Egy példány, amelyet egy másik tulajdonos személynek adományoznak. @hu
toolkit definition: Ein Exemplar, das einer anderen Eigentümerin/einem anderen Eigentümer (Person) überlassen wird. @de
toolkit definition: Eksemplar, mille isik on kinkinud teisele omanikule. @et
toolkit definition: Eksemplar, som er doneret til en anden ejer, som er en person. @da
toolkit definition: Et eksemplar som er gitt til en annen eier som er en person. @no
toolkit definition: Item donato a un altro proprietario che è una persona. @it
toolkit definition: Item qui est offert en don à un autre propriétaire qui est une personne. @fr
toolkit definition: Kappale, jonka henkilö on lahjoittanut toiselle omistajalle.
toolkit definition: Vienība, ko persona ziedojusi citam īpašniekam. @lv
toolkit definition: Ítem que es dona a un altre propietari que és una persona. @ca
toolkit definition: مفردة يتم التبرع بها إلى مالك آخر شخص. @ar
toolkit definition: 被捐赠给作为个人的另一个拥有者的一个单件 @zh-hans
toolkit label: Person als Stifterin/Stifter von @de
toolkit label: adományozó személye: @hu
toolkit label: annetaja (isik) eksemplarile @et
toolkit label: bağışçı @tr
toolkit label: donatore persona di @it
toolkit label: donor person of @en
toolkit label: giver av (person) @no
toolkit label: ir ziedotājs (persona) @lv
toolkit label: lahjoittaja (henkilö) kappaleelle
toolkit label: person, som er donor af @da
toolkit label: persona donant de @ca
toolkit label: personne donatrice de @fr
toolkit label: schenker-persoon van @nl
toolkit label: δωρητής φυσικό πρόσωπο του @el
toolkit label: شخص متبرع @ar
toolkit label: ……的捐赠者个人 @zh-hans
has subproperty: P50639
lexical alias: donorPersonOf.en
status: Published
type: Property
domain: C10004
label: adományozó személye a következőnek: @hu
label: annetaja (isik) eksemplarile @et
label: bağışçı kişisidir @tr
label: er giver av (person) @no
label: er person, som er donor af @da
label: est une personne donatrice de @fr
label: ir ziedotājs (persona) @lv
label: is donor person of @en
label: is schenker-persoon van @nl
label: ist Person als Stifterin/Stifter von @de
label: è donatore persona di @it
label: és persona donant de @ca
label: είναι δωρητής φυσικό πρόσωπο του @el
label: هو شخص متبرع بـ @ar
label: 是……的捐赠者个人 @zh-hans
sub property of: lahjoittaja (toimija) kappaleelle
sub property of: aiempi omistaja (henkilö) kappaleessa
definition: Bir kişiyi, başka bir şahıs olan sahibine bağışlanmış bir kopyayla ilişkilendirir. @tr
definition: Correla una persona a un item donato a un altro proprietario che è una persona. @it
definition: Hozzákapcsol egy személyt egy példányhoz, amelyet egy másik tulajdonos személynek adományoznak. @hu
definition: Liittää henkilön kappaleeseen, jonka henkilö on lahjoittanut toiselle omistajalle.
definition: Met une personne en relation avec un item qui est offert en don à un autre propriétaire qui est une personne. @fr
definition: Relaciona una persona amb un ítem que es dona a un altre propietari que és una persona. @ca
definition: Relateert een persoon aan een item dat is geschonken aan een andere eigenaar die een persoon is. @nl
definition: Relaterer en person til et eksemplar som er gitt til en annen eier som er en person. @no
definition: Relaterer en person til et eksemplar, som er doneret til en anden ejer, som er en person. @da
definition: Relates a person to an item that is donated to another owner who is a person. @en
definition: Sasaista personu ar vienību, ko persona ziedojusi citam īpašniekam. @lv
definition: Seostab isiku eksemplariga, mille isik on kinkinud teisele omanikule. @et
definition: Setzt eine Person in Beziehung zu einem Exemplar, das einer anderen Eigentümerin/einem anderen Eigentümer (Person) überlassen wird. @de
definition: يربط شخصا بمفردة يتم التبرع بها إلى مالك آخر شخص. @ar
definition: 将一个个人与被捐赠给作为个人的另一个拥有者的一个单件关联起来。 @zh-hans

kokoelman luetteloija (henkilö) kappaleessa
has element type: 2
toolkit definition: An item that is listed or inventoried by a person in an aggregate work such as a collection of items or works. (Deprecated) @en
toolkit definition: Een item dat vermeld of geïnventariseerd is door een persoon in een aggregaatwerk zoals een collectie van items of werken. @nl
toolkit definition: Egy példány, amelyet egy személy felsorol vagy leltárba vesz egy aggregáló műben, mint például példányok vagy művek gyűjteményében. @hu
toolkit definition: Ein Exemplar, das von einer Person als aggregiertes Werk verzeichnet oder inventarisiert wird, wie zum Beispiel eine Sammlung von Exemplaren oder Werken. @de
toolkit definition: Eksemplar, mille isik on loetlenud või inventeerinud liitumit moodustavate eksemplaride või teoste kogu jaoks. @et
toolkit definition: Eksemplar, som er listet eller opstillet af en person i et samlingsværk, såsom en samling af eksemplarer eller værker. @da
toolkit definition: Et eksemplar som av en person er oppført i lister eller oversikter i et aggregert verk som for eksempel en samling av eksemplarer eller verk. @no
toolkit definition: Item elencato o inventariato da una persona in un'opera aggregata come una raccolta di item o opere. @it
toolkit definition: Item qui est listé ou inventorié par une personne dans une œuvre agrégative telle qu’une collection d’items ou d’œuvres. @fr
toolkit definition: Kappale, jonka henkilö on luetteloinut tai inventoinut osaksi aggregaattiteosta, kuten kappaleista tai teoksista koostuvaa kokoelmaa.
toolkit definition: Vienība, ko persona uzskaitījusi vai inventarizējusi apkopotā darbā, piemēram, vienību vai darbu kolekcijā. @lv
toolkit definition: Ítem que és llistat o inventariat per una persona en una obra agregada, com ara una col·lecció d’ítems o d’obres. @ca
toolkit definition: مفردة مدرجة في القائمة أو تم جردها من قِبل شخص ما في عمل تجميعي مثل مجموعة من المفردات أو الأعمال. @ar
toolkit label: Person als Registrarin/Registrar von @de
toolkit label: collectieregistrator-persoon van @nl
toolkit label: collection registrar person of (Deprecated) @en
toolkit label: conservatore della raccolta persona di @it
toolkit label: gyűjtemény-nyilvántartó személye: @hu
toolkit label: ir kolekcijas reģistrētājs (persona) @lv
toolkit label: kogu registreerija (isik) eksemplarile @et
toolkit label: kokoelman luetteloija (henkilö) kappaleessa
toolkit label: person, som er samlingsregistrator af @da
toolkit label: persona conservadora de col·leccions de recursos de @ca
toolkit label: personne catalogueuse d’une collection de ressources de @fr
toolkit label: samlingsregistrator for (person) @no
toolkit label: καταχωρητής συλλογής φυσικό πρόσωπο του @el
toolkit label: شخص مسجل مجموعة @ar
has subproperty: P50640
lexical alias: collectionRegistrarPersonOf.en
status: Deprecated
type: Property
domain: C10004
label: er person, som er samlingsregistrator af @da
label: er samlingsregistrator for (person) @no
label: est une personne catalogueuse d’une collection de ressources de @fr
label: gyűjtemény-nyilvántartó személye a következőnek: @hu
label: ir kolekcijas reģistrētājs (persona) @lv
label: is collectieregistrator-persoon van @nl
label: is collection registrar person of (Deprecated) @en
label: ist Person als Registrarin/Registrar von @de
label: kogu registreerija (isik) eksemplarile @et
label: è conservatore della raccolta persona di @it
label: és persona conservadora de col·leccions de recursos de @ca
label: είναι καταχωρητής συλλογής φυσικό πρόσωπο του @el
label: هو شخص مسجل مجموعة لـ @ar
sub property of: kokoelman luetteloija (toimija) kappaleessa
sub property of: kuraattori (henkilö) kappaleessa
alternative label: personne conservatrice d’une collection de ressources de @fr
definition: Correla una persona a un item elencato o inventariato da una persona in un'opera aggregata come una raccolta di item o opere. @it
definition: Hozzákapcsol egy személyt egy példányhoz, amelyet egy személy felsorol vagy leltárba vesz egy aggregáló műben, mint például példányok vagy művek gyűjteményében. @hu
definition: Liittää henkilön kappaleeseen, jonka henkilö on luetteloinut tai inventoinut osaksi aggregaattiteosta, kuten kappaleista tai teoksista koostuvaa kokoelmaa.
definition: Met une personne en relation avec un item qui est listé ou inventorié par une personne dans une œuvre agrégative telle qu’une collection d’items ou d’œuvres. @fr
definition: Relaciona una persona amb un ítem que és llistat o inventariat per una persona en una obra agregada, com ara una col·lecció d’ítems o d’obres. @ca
definition: Relateert een persoon aan een item dat vermeld of geïnventariseerd is door een persoon in een aggregaatwerk zoals een collectie van items of werken. @nl
definition: Relaterer en person til et eksemplar som av en person er oppført i lister eller oversikter i et aggregert verk som for eksempel en samling av eksemplarer eller verk. @no
definition: Relaterer en person til et eksemplar, som er listet eller opstillet af en person i et samlingsværk, såsom en samling af eksemplarer eller værker. @da
definition: Relates a person to an item that is listed or inventoried by a person in an aggregate work such as a collection of items or works. (Deprecated) @en
definition: Sasaista personu ar vienību, ko persona uzskaitījusi vai inventarizējusi apkopotā darbā, piemēram, vienību vai darbu kolekcijā. @lv
definition: Seostab isiku eksemplariga, mille isik on loetlenud või inventeerinud liitumit moodustavate eksemplaride või teoste kogu jaoks. @et
definition: Setzt eine Person in Beziehung zu einem Exemplar, das von einer Person als aggregiertes Werk verzeichnet oder inventarisiert wird, wie zum Beispiel eine Sammlung von Exemplaren oder Werken. @de
definition: يربط شخصا بمفردة مدرجة في قائمة أو جردها شخص في عمل تجميعي مثل مجموعة من المفردات أو الأعمال. @ar

myyjä (henkilö) kappaleelle
has element type: 2
toolkit definition: An item that is sold to another owner who is a person. @en
toolkit definition: Bir kişi olan başka bir mülk sahibine satılan bir kopya. @tr
toolkit definition: Een item dat is verkocht aan een andere eigenaar die een persoon is. @nl
toolkit definition: Egy példány, amelyet egy másik tulajdonos személynek adnak el. @hu
toolkit definition: Ein Exemplar, das an eine andere Eigentümerin/einen anderen Eigentümer (Person) verkauft wird. @de
toolkit definition: Eksemplar, mille isik on müünud teisele omanikule. @et
toolkit definition: Eksemplar, som er solgt til en anden ejer, som er en person. @da
toolkit definition: Et eksemplar som er solgt til en annen eier som er en person. @no
toolkit definition: Item qui est vendu à un autre propriétaire qui est une personne. @fr
toolkit definition: Item venduto a un altro proprietario che è una persona. @it
toolkit definition: Kappale, jonka henkilö on myynyt toiselle henkilölle.
toolkit definition: Vienība, ko persona pārdod citam īpašniekam. @lv
toolkit definition: Ítem que es ven a un altre propietari que és una persona. @ca
toolkit definition: مفردة تم بيعها إلى مالك آخر شخص. @ar
toolkit definition: 被出售给作为个人的另一个拥有者的单件 @zh-hans
toolkit label: Person als Verkäuferin/Verkäufer von @de
toolkit label: ir pārdevējs (persona) @lv
toolkit label: myyjä (henkilö) kappaleelle
toolkit label: müüja (isik) eksemplarile @et
toolkit label: person, som er sælger af @da
toolkit label: persona venedora de @ca
toolkit label: personne vendeuse de @fr
toolkit label: satıcı kişi @tr
toolkit label: selger av (person) @no
toolkit label: seller person of @en
toolkit label: venditore persona di @it
toolkit label: verkoper-persoon van @nl
toolkit label: értékesítő személye: @hu
toolkit label: πωλητής φυσικό πρόσωπο του @el
toolkit label: شخص بائع @ar
toolkit label: ……的出售者个人 @zh-hans
has subproperty: P50641
lexical alias: sellerPersonOf.en
status: Published
type: Property
domain: C10004
label: er person, som er sælger af @da
label: er selger av (person) @no
label: est une personne vendeuse de @fr
label: ir pārdevējs (persona) @lv
label: is seller person of @en
label: is verkoper-persoon van @nl
label: ist Person als Verkäuferin/Verkäufer von @de
label: müüja (isik) eksemplarile @et
label: satıcısıdır @tr
label: è venditore persona di @it
label: értékesítő személye a következőnek: @hu
label: és persona venedora de @ca
label: είναι πωλητής φυσικό πρόσωπο του @el
label: هو شخص بائع لـ @ar
label: 是……的出售者个人 @zh-hans
sub property of: myyjä (toimija) kappaleelle
sub property of: aiempi omistaja (henkilö) kappaleessa
definition: Bir kişiyi, başka bir şahıs olan sahibine satılan kopyayla ilişkilendirir. @tr
definition: Correla una persona a un item venduto a un altro proprietario che è una persona. @it
definition: Hozzákapcsol egy személyt egy példányhoz, amelyet egy másik tulajdonos személynek adnak el. @hu
definition: Liittää henkilön kappaleeseen, jonka henkilö on myynyt toiselle henkilölle.
definition: Met une personne en relation avec un item qui est vendu à un autre propriétaire qui est une personne. @fr
definition: Relaciona una persona amb un ítem que es ven a un altre propietari que és una persona. @ca
definition: Relateert een persoon aan een item dat is verkocht aan een andere eigenaar die een persoon is. @nl
definition: Relaterer en person til et eksemplar som er solgt til en annen eier som er en person. @no
definition: Relaterer en person til et eksemplar, som er solgt til en anden ejer, som er en person. @da
definition: Relates a person to an item that is sold to another owner who is a person. @en
definition: Sasaista personu ar vienību, ko persona pārdod citam īpašniekam. @lv
definition: Seostab isiku eksemplariga, mille isik on müünud teisele omanikule. @et
definition: Setzt eine Person in Beziehung zu einem Exemplar, das an eine andere Eigentümerin/einen anderen Eigentümer (Person) verkauft wird. @de
definition: يربط شخصا بمفردة تم بيعها إلى مالك آخر شخص. @ar
definition: 将一个个人与被出售给作为个人的另一个拥有者的单件关联起来。 @zh-hans

kappaleella kunnioitettu henkilö kappaleessa
has element type: 2
toolkit definition: An item that marks the esteem of and respect for a person. @en
toolkit definition: Bir kişinin itibarını ve ona duyulan saygıyı gösteren bir kopya. @tr
toolkit definition: Een item dat toont de waardering en respect voor een persoon. @nl
toolkit definition: Egy példány, amely jelzi egy személy megbecsülését és tiszteletét. @hu
toolkit definition: Ein Exemplar, das eine Person ehrt. @de
toolkit definition: Eksemplar, mis märgib lugupidamist ja austust isiku vastu. @et
toolkit definition: Eksemplar, som markerer en hædring af en person. @da
toolkit definition: Et eksemplar som markerer aktelse og repekt for en person. @no
toolkit definition: Item che esprime la stima e il rispetto per una persona. @it
toolkit definition: Item qui marque l’estime et le respect pour une personne. @fr
toolkit definition: Kappale, joka osoittaa arvostusta ja kunnioitusta henkilölle.
toolkit definition: Vienība, ar kuru godināta persona. @lv
toolkit definition: Ítem que marca l’estima i el respecte per una persona. @ca
toolkit definition: مفردة تدل على تقدير واحترام شخص. @ar
toolkit definition: 表示对一个个人尊重或尊敬的一个单件 @zh-hans
toolkit label: Person als Gefeierte/Gefeierter eines Exemplars von @de
toolkit label: austusavalduse saaja (isik) eksemplaris @et
toolkit label: geëerde persoon van item van @nl
toolkit label: honouree person of item of @en
toolkit label: kappaleella kunnioitettu henkilö kappaleessa
toolkit label: kopyasının onurlandırılan kişisidir @tr
toolkit label: méltatott személye a következő példánynak: @hu
toolkit label: onorato persona di item di @it
toolkit label: person beæret av eksemplar av @no
toolkit label: person, som beæres af eksemplar af @da
toolkit label: persona homenatjada d’un ítem de @ca
toolkit label: personne honorée d’un item de @fr
toolkit label: personu godinošā vienība @lv
toolkit label: τιμώμενο φυσικό πρόσωπο του αντιτύπου του @el
toolkit label: شخص مكرم عن مفردة @ar
toolkit label: ……的单件的被纪念者个人 @zh-hans
has subproperty: P50642
lexical alias: honoureePersonOfItemOf.en
status: Published
type: Property
domain: C10004
label: Person als Gefeierte/Gefeierter eines Exemplars von @de
label: austusavalduse saaja (isik) eksemplaris @et
label: er person beæret av eksemplar av @no
label: er person, som beæres af eksemplar af @da
label: est une personne honorée d’un item de @fr
label: is geëerde persoon van item van @nl
label: is honouree person of item of @en
label: kopyasının onurlandırılan kişisidir @tr
label: méltatott személye a következő példánynak: @hu
label: personu godinošā vienība @lv
label: è onorato persona di item di @it
label: és persona homenatjada d’un ítem de @ca
label: είναι τιμώμενο φυσικό πρόσωπο του αντιτύπου του @el
label: هو شخص مكرم بمفردة @ar
label: 是……的单件的被纪念者个人 @zh-hans
sub property of: kappaleella kunnioitettu toimija kappaleessa
sub property of: henkilöön liittyvä kappale
alternative label: honoree person of item of @en
alternative label: kunnioitettu henkilö kappaleessa
alternative label: onorato persona di item di @it
alternative label: person, som er hædersperson i eksemplar af @da
alternative label: persona homenajeada del item de @es
alternative label: τιμώμενο φυσικό πρόσωπο του αντιτύπου του @el
alternative label: شخص مكرم عن مفردة @ar
alternative label: ……的单件的被纪念者个人 @zh-hans
definition: Bir kişiyi, bir kişinin saygınlığını ve saygısını gösteren bir kopyayla ilişkilendirir. @tr
definition: Correla una persona a un item che esprime la stima e il rispetto per una persona. @it
definition: Hozzákapcsol egy személyt egy példányhoz, amely jelzi egy személy megbecsülését és tiszteletét. @hu
definition: Liittää henkilön kappaleeseen, joka osoittaa arvostusta ja kunnioitusta henkilölle.
definition: Met une personne en relation avec un item qui marque l’estime et le respect pour une personne. @fr
definition: Relaciona una persona amb un ítem que marca l’estima i el respecte per una persona. @ca
definition: Relateert een persoon aan een item dat toont de waardering en respect voor een persoon. @nl
definition: Relaterer en person til et eksemplar som markerer aktelse og repekt for en person. @no
definition: Relaterer en person til et eksemplar, som markerer en hædring af en person. @da
definition: Relates a person to an item that marks the esteem of and respect for a person. @en
definition: Sasaista personu ar vienību, ar kuru godināta persona. @lv
definition: Seostab isiku eksemplariga, mis märgib lugupidamist ja austust isiku vastu. @et
definition: Setzt eine Person in Beziehung zu einem Exemplar, das eine Person ehrt. @de
definition: يربط شخصا بمفردة تدل على تقدير واحترام شخص. @ar
definition: 将一个个人与表示对一个个人尊重或尊敬的一个单件关联起来。 @zh-hans

koreografi (yhteistoimija) teoksessa
has element type: 2
toolkit definition: A work that involves a responsibility of a collective agent for creating a choreographic work. @en
toolkit definition: Bir koreografik eser yaratmak için kolektif bir temsilcinin sorumluluğunu içeren bir eser @tr
toolkit definition: Een werk dat met zich meebrengt een verantwoordelijkheid van een collectieve actor voor het creëren van een choreografisch werk. @nl
toolkit definition: Egy mű, amelyhez hozzátartozik egy kollektív ágens felelőssége egy koreografikus mű létrehozásáért. @hu
toolkit definition: Ein Werk, bei dem ein gemeinschaftlicher Akteur für die Schaffung eines choreografischen Werks verantwortlich ist. @de
toolkit definition: Et koreografisk verk som involverer et ansvar for en kollektiv agent i form av koreografi. @no
toolkit definition: Horeogrāfisks darbs, kas ietver grupas atbildību par horeogrāfiju. @lv
toolkit definition: Koreograafiline teos, mis sisaldab kollektiivi vastutust koreograafia eest. @et
toolkit definition: Obra que implica una responsabilitat d’un agent col·lectiu en la creació d’una obra coreogràfica. @ca
toolkit definition: Opera coreografica che implica una responsabilità di un agente collettivo per la coreografia. @it
toolkit definition: Teos, joka on koreografinen teos, jonka luomisesta yhteistoimija on vastuussa.
toolkit definition: Værk, som involverer en kollektiv agents ansvar for at skabe et koreografisk værk. @da
toolkit definition: Œuvre qui comporte une responsabilité de la part d’un agent collectif consistant à créer une œuvre chorégraphique. @fr
toolkit definition: عمل راقص يترتب عليه مسئولية وكيل جماعي عن وضع الألحان الراقصة. @ar
toolkit definition: 涉及创作编舞作品的一个集体行为者的责任的一种作品 @zh-hans
toolkit label: Gemeinschaftlicher Akteur als Choreografin/Choreograf von @de
toolkit label: agent collectif chorégraphe de @fr
toolkit label: agent col·lectiu coreògraf de @ca
toolkit label: choreograaf-collectieve actor van @nl
toolkit label: choreographer collective agent of @en
toolkit label: coreografo agente collettivo di @it
toolkit label: ir horeogrāfs (grupa) @lv
toolkit label: kollektiv agent, som er koreograf af @da
toolkit label: koreograaf (kollektiiv) teoses @et
toolkit label: koreograf for (kollektiv agent) @no
toolkit label: koreograf kolektif temsilcisi @tr
toolkit label: koreografi (yhteistoimija) teoksessa
toolkit label: koreográfus kollektív ágense: @hu
toolkit label: χορογράφος συλλογικός φορέας του @el
toolkit label: وكيل جماعي مُصمم رقصات @ar
toolkit label: ……的编舞者集体行为者 @zh-hans
has subproperty: koreografi (yhteisö) teoksessa
has subproperty: koreografi (suku) teoksessa
has subproperty: P50643
lexical alias: choreographerCollectiveAgentOf.en
status: Published
type: Property
domain: C10011
label: er kollektiv agent, som er koreograf af @da
label: er koreograf for (kollektiv agent) @no
label: est un agent collectif chorégraphe de @fr
label: ir horeogrāfs (grupa) @lv
label: is choreograaf-collectieve actor van @nl
label: is choreographer collective agent of @en
label: ist gemeinschaftlicher Akteur als Choreografin/Choreograf von @de
label: koreograaf (kollektiiv) teoses @et
label: koreograf kolektif temsilcisidir @tr
label: koreográfus kollektív ágense a következőnek: @hu
label: è coreografo agente collettivo di @it
label: és agent col·lectiu coreògraf de @ca
label: είναι χορογράφος συλλογικός φορέας του @el
label: هو وكيل جماعي مُصمم رقصات لـ @ar
label: 是……的编舞者集体行为者 @zh-hans
sub property of: koreografi (toimija) teoksessa
sub property of: teoksen tekijä (yhteistoimija) teoksessa
definition: Bir temsilciyi, kolektif bir temsilcinin koreografik bir eser oluşturma sorumluluğunu içeren bir eserle ilişkilendirir. @tr
definition: Correla un agente collettivo a un'opera coreografica che implica una responsabilità di un agente collettivo per la coreografia. @it
definition: Hozzákapcsol egy ágenst egy műhöz, amelyhez hozzátartozik egy kollektív ágens felelőssége egy koreografikus mű létrehozásáért. @hu
definition: Liittää toimijan teokseen, joka on koreografinen teos, jonka luomisesta yhteistoimija on vastuussa.
definition: Met un agent collectif en relation avec une œuvre qui comporte une responsabilité de la part d’un agent collectif consistant à créer une œuvre chorégraphique. @fr
definition: Relaciona un agent col·lectiu amb una obra que implica una responsabilitat d’un agent col·lectiu en la creació d’una obra coreogràfica. @ca
definition: Relateert een collectieve actor aan een werk dat met zich meebrengt een verantwoordelijkheid van een collectieve actor voor het creëren van een choreografisch werk. @nl
definition: Relaterer en kollektiv agent til et koreografisk verk som involverer et ansvar for en kollektiv agent i form av koreografi. @no
definition: Relaterer en kollektiv agent til et værk, som involverer en kollektiv agents ansvar for at skabe et koreografisk værk. @da
definition: Relates a collective agent to a work that involves a responsibility of a collective agent for creating a choreographic work. @en
definition: Sasaista aģentu ar horeogrāfijas darbu, kas ietver grupas atbildību par horeogrāfiju. @lv
definition: Seostab kollektiivi koreograafilise teosega, mis sisaldab kollektiivi vastutust koreograafia eest. @et
definition: Setzt einen gemeinschaftlichen Akteur in Beziehung zu einem Werk, bei dem ein gemeinschaftlicher Akteur für die Schaffung eines choreografischen Werks verantwortlich ist. @de
definition: يربط وكيلا جماعيا بعمل راقص يترتب عليه مسئولية وكيل جماعي عن وضع الألحان الراقصة. @ar
definition: 将一个集体行为者与涉及创作编舞作品的一个集体行为者的责任的一种作品关联起来。 @zh-hans

lähetyksestä vastaava yhteistoimija manifestaatiossa
has element type: 2
toolkit definition: A manifestation that involves a responsibility of a collective agent for broadcasting to an audience via radio, television, webcast, etc. @en
toolkit definition: Bir kitleye radyo, televizyon, web yayını vb. yoluyla yayın yapmak için kolektif bir temsilcinin sorumluluğunu içeren bir gösterim. @tr
toolkit definition: Een manifestatie die met zich meebrengt een verantwoordelijkheid van een collectieve actor voor uitzending naar een publiek via radio, televisie, webcast etc. @nl
toolkit definition: Egy megjelenési forma, amelyhez hozzátartozik egy kollektív ágens felelőssége műsorszórásért, amely a közönség felé rádión, televízión, webes közvetítésen stb. keresztül történik. @hu
toolkit definition: Eine Manifestation, bei der ein gemeinschaftlicher Akteur für die Ausstrahlung über Hörfunk, Fernsehen oder Webcast und so weiter verantwortlich ist. @de
toolkit definition: En manifestasjon som involverer et ansvar for en kollektiv agent i form av kringkasting til et publikum via radio, fjernsyn, webkast etc. @no
toolkit definition: Kehastus, mis sisaldab kollektiivi vastutust avalikkusele levitamise eest raadio, televisiooni, veebi vms kaudu. @et
toolkit definition: Manifestaatio, jossa yhteistoimija on vastuussaa radio-, televisio-, suoratoisto- tms. lähetyksen toteuttamisesta yleisölle.
toolkit definition: Manifestació que implica una responsabilitat d’un agent col·lectiu en la difusió a uns destinataris mitjançant la ràdio, la televisió, el web, etc. @ca
toolkit definition: Manifestation qui comporte une responsabilité de la part d’un agent collectif en ce qui concerne la diffusion à un public par la radio, la télévision, la webdiffusion, etc. @fr
toolkit definition: Manifestation, som involverer en kollektiv agents ansvar for at transmittere til et publikum via radio, tv, webcast etc. @da
toolkit definition: Manifestazione che implica una responsabilità di un agente collettivo nella trasmissione a un pubblico via radio, televisione, web, etc. @it
toolkit definition: Manifestācija, kas ietver grupas atbildību par pārraidi, izmantojot radio, televīziju, tīmekļa apraidi u.tml. @lv
toolkit definition: تجسيدة تنطوي على مسئولية وكيل جماعي عن البث إلى جمهور عبر الإذاعة والتلفزيون والإنترنت، الخ. @ar
toolkit definition: 涉及一个通过广播、电视、网路直播等向听众播音的一个集体行为者的责任的一种载体表现 @zh-hans
toolkit label: Gemeinschaftlicher Akteur als Sender von @de
toolkit label: agent collectif diffuseur audiovisuel de @fr
toolkit label: agent col·lectiu difusor audiovisual de @ca
toolkit label: broadcaster collective agent of @en
toolkit label: emittente agente collettivo di @it
toolkit label: ir raidorganizācija (grupa) @lv
toolkit label: kollektiv agent, som er broadcaster af @da
toolkit label: kringkaster av (kollektiv agent) @no
toolkit label: leviedastaja (kollektiiv) kehastuses @et
toolkit label: lähetyksestä vastaava yhteistoimija manifestaatiossa
toolkit label: műsorszolgáltató kollektív ágense: @hu
toolkit label: uitzender-collectieve actor van @nl
toolkit label: yayıncı kolektif temsilcisi @tr
toolkit label: ευρυεκπομπέας συλλογικός φορέας του @el
toolkit label: وكيل جماعي مذيع @ar
toolkit label: ……的广播者集体行为者 @zh-hans
has subproperty: lähetyksestä vastaava yhteisö manifestaatiossa
has subproperty: lähetyksestä vastaava suku manifestaatiossa
has subproperty: P50644
lexical alias: broadcasterCollectiveAgentOf.en
status: Published
type: Property
domain: C10011
label: er kollektiv agent, som er broadcaster af @da
label: er kringkaster av (kollektiv agent) @no
label: est un agent collectif diffuseur audiovisuel de @fr
label: ir raidorganizācija (grupa) @lv
label: is broadcaster collective agent of @en
label: is uitzender-collectieve actor van @nl
label: ist gemeinschaftlicher Akteur als Sender von @de
label: leviedastaja (kollektiiv) kehastuses @et
label: műsorszolgáltató kollektív ágense a következőnek: @hu
label: yayıncı kolektif temsilcisidir @tr
label: è emittente agente collettivo di @it
label: és agent col·lectiu difusor audiovisual de @ca
label: είναι ευρυεκπομπέας συλλογικός φορέας του @el
label: هو وكيل جماعي مذيع لـ @ar
label: 是……的广播者集体行为者 @zh-hans
sub property of: lähetyksestä vastaava toimija manifestaatiossa
sub property of: kustantaja (yhteistoimija) manifestaatiossa
definition: Correla un agente collettivo a una manifestazione che implica una responsabilità di un agente collettivo nella trasmissione a un pubblico via radio, televisione, web, etc. @it
definition: Hozzákapcsol egy kollektív ágenst egy megjelenési formához, amelyhez hozzátartozik egy kollektív ágens felelőssége műsorszórásért, amely a közönség felé rádión, televízión, webes közvetítésen stb. keresztül történik. @hu
definition: Kolektif bir temsilciyi, radyo, televizyon, web yayını vb. yoluyla bir izleyici kitlesine yayın yapma sorumluluğunu içeren bir gösterimle ilişkilendirir. @tr
definition: Liittää yhteistoimijan manifestaatioon, jossa yhteistoimija on vastuussaa radio-, televisio-, suoratoisto- tms. lähetyksen toteuttamisesta yleisölle.
definition: Met un agent collectif en relation avec une manifestation qui comporte une responsabilité de la part d’un agent collectif en ce qui concerne la diffusion à un public par la radio, la télévision, la webdiffusion, etc. @fr
definition: Relaciona un agent col·lectiu amb una manifestació que implica una responsabilitat d’un agent col·lectiu en la difusió a uns destinataris mitjançant la ràdio, la televisió, el web, etc. @ca
definition: Relateert een collectieve actor aan een manifestatie die met zich meebrengt een verantwoordelijkheid van een collectieve actor voor uitzending naar een publiek via radio, televisie, webcast etc. @nl
definition: Relaterer en kollektiv agent til en manifestasjon som involverer et ansvar for en kollektiv agent i form av kringkasting til et publikum via radio, fjernsyn, webkast etc. @no
definition: Relaterer en kollektiv agent til en manifestation, som involverer en kollektiv agents ansvar for at transmittere til et publikum via radio, tv, webcast etc. @da
definition: Relates a collective agent to a manifestation that involves a responsibility of a collective agent for broadcasting to an audience via radio, television, webcast, etc. @en
definition: Sasaista grupu ar manifestāciju, kas ietver grupas atbildību par pārraidi, izmantojot radio, televīziju, tīmekļa apraidi u.tml. @lv
definition: Seostab kollektiivi kehastusega, mis sisaldab kollektiivi vastutust avalikkusele levitamise eest raadio, televisiooni, veebi vms kaudu. @et
definition: Setzt einen gemeinschaftlichen Akteur in Beziehung zu einer Manifestation, bei der ein gemeinschaftlicher Akteur für die Ausstrahlung über Hörfunk, Fernsehen oder Webcast und so weiter verantwortlich ist. @de
definition: يربط وكيلا جماعيا بتجسيدة تنطوي على مسئولية وكيل جماعي عن البث إلى جمهور عبر الإذاعة والتلفزيون والإنترنت، الخ. @ar
definition: 将一个集体行为者与涉及一个通过广播、电视、网路直播等向听众播音的一个集体行为者的责任的一种载体表现关联起来。 @zh-hans

manifestaation tekijä (yhteistoimija) manifestaatiossa
has element type: 2
toolkit definition: A manifestation that involves a responsibility of a collective agent for creation. @en
toolkit definition: Een manifestatie die met zich meebrengt een verantwoordelijkheid van een collectieve actor voor creatie. @nl
toolkit definition: Egy megjelenési forma, amelyhez hozzátartozik egy kollektív ágens felelőssége a létrehozásért. @hu
toolkit definition: Eine Manifestation, bei der ein gemeinschaftlicher Akteur für die Erstellung verantwortlich ist. @de
toolkit definition: En manifestasjon som involverer et ansvar for en kollektiv agent i form av skapelse. @no
toolkit definition: Kehastus, mis sisaldab kollektiivi vastutust kehastuse loomise eest. @et
toolkit definition: Manifestaatio, jonka luomisesta yhteistoimija on vastuussa.
toolkit definition: Manifestació que implica una responsabilitat d’un agent col·lectiu en la creació. @ca
toolkit definition: Manifestation qui comporte une responsabilité de la part d’un agent collectif en ce qui concerne la création. @fr
toolkit definition: Manifestation, som involverer en kollektiv agents ansvar for skabelse. @da
toolkit definition: Manifestazione che implica una responsabilità di un agente collettivo per la creazione. @it
toolkit definition: Manifestācija, kas ietver grupas atbildību par radīšanu. @lv
toolkit definition: Yaratmak için kolektif bir temsilcinin sorumluluğunu içeren bir gösterim. @tr
toolkit definition: تجسيدة تنطوي على مسئولية وكيل جماعي عن الإنشاء. @ar
toolkit definition: 涉及一个集体行为者的创作责任的一种载体表现 @zh-hans
toolkit label: Gemeinschaftlicher Akteur als Mitwirkende/Mitwirkender an einer Manifestation von @de
toolkit label: agent collectif créateur d’une manifestation de @fr
toolkit label: agent col·lectiu creador d’una manifestació de @ca
toolkit label: creator collective agent of manifestation of @en
toolkit label: creatore agente collettivo di manifestazione di @it
toolkit label: gösterimin yaratıcı kolektif temsilcisi @tr
toolkit label: ir radītājs (grupa) manifestācijai @lv
toolkit label: kehastuse teostaja (kollektiiv) kehastuses @et
toolkit label: kollektiv agent, som er ophav til manifestation af @da
toolkit label: létrehozó kollektív ágense a következő megjelenési formának: @hu
toolkit label: maker-collectieve actor van manifestatie van @nl
toolkit label: manifestaation tekijä (yhteistoimija) manifestaatiossa
toolkit label: skaper av manifestasjon for (kollektiv agent) @no
toolkit label: δημιουργός συλλογικός φορέας της εκδήλωσης του @el
toolkit label: وكيل جماعي منشئ تجسيدة @ar
toolkit label: ……的载体表现的创建者集体行为者 @zh-hans
has subproperty: julkaisemattoman manifestaation tuottaja (yhteistoimja) manifestaatiossa
has subproperty: kuvalaatan valmistaja (yhteistoimija) manifestaatiossa
has subproperty: valaja (yhteistoimija) manifestaatiossa
has subproperty: painolaatan valmistaja (yhteistoimija) manifestaatiossa
has subproperty: kustantaja (yhteistoimija) manifestaatiossa
has subproperty: graafinen suunnittelija (yhteistoimija) manifestaatiossa
has subproperty: manifestaation tekijä (yhteisö) manifestaatiossa
has subproperty: manifestaation tekijä (suku) manifestaatiossa
has subproperty: P50645
lexical alias: creatorCollectiveAgentOfManifestationOf.en
status: Published
type: Property
domain: C10011
label: er kollektiv agent, som er ophav til manifestation af @da
label: er skaper av manifestasjon for (kollektiv agent) @no
label: est un agent collectif créateur d’une manifestation de @fr
label: gösteriminin yaratıcı kolektif temsilcisidir @tr
label: ir radītājs (grupa) manifestācijai @lv
label: is creator collective agent of manifestation of @en
label: is maker-collectieve actor van manifestatie van @nl
label: ist gemeinschaftlicher Akteur als Mitwirkende/Mitwirkender an einer Manifestation von @de
label: kehastuse teostaja (kollektiiv) kehastuses @et
label: létrehozó kollektív ágense a következő megjelenési formának: @hu
label: è creatore agente collettivo di manifestazione di @it
label: és agent col·lectiu creador d’una manifestació de @ca
label: είναι δημιουργός συλλογικός φορέας της εκδήλωσης του @el
label: هو وكيل جماعي منشئ تجسيدة لـ @ar
label: 是……的载体表现的创建者集体行为者 @zh-hans
sub property of: yhteistoimijaan liittyvä manifestaatio
sub property of: manifestaation tekijä (toimija) manifestaatiossa
definition: Correla un agente collettivo a una manifestazione che implica una responsabilità di un agente collettivo per la creazione. @it
definition: Hozzákapcsol egy kollektív ágenst egy megjelenési formához, amelyhez hozzátartozik egy kollektív ágens felelőssége a létrehozásért. @hu
definition: Kolektif bir temsilciyi, kolektif bir temsilcinin yaratma sorumluluğunu içeren bir gösterimle ilişkilendirir. @tr
definition: Liittää yhteistoimijan manifestaatioon, jonka luomisesta yhteistoimija on vastuussa.
definition: Met un agent collectif en relation avec une manifestation qui comporte une responsabilité de la part d’un agent collectif en ce qui concerne la création. @fr
definition: Relaciona un agent col·lectiu amb una manifestació que implica una responsabilitat d’un agent col·lectiu en la creació. @ca
definition: Relateert een collectieve actor aan een manifestatie die met zich meebrengt een verantwoordelijkheid van een collectieve actor voor creatie. @nl
definition: Relaterer en kollektiv agent til en manifestasjon som involverer et ansvar for en kollektiv agent i form av skapelse. @no
definition: Relaterer en kollektiv agent til en manifestation, som involverer en kollektiv agents ansvar for skabelse. @da
definition: Relates a collective agent to a manifestation that involves a responsibility of a collective agent for creation. @en
definition: Sasaista grupu ar manifestāciju, kas ietver grupas atbildību par radīšanu. @lv
definition: Seostab kollektiivi kehastusega, mis sisaldab kollektiivi vastutust kehastuse loomise eest. @et
definition: Setzt einen gemeinschaftlichen Akteur in Beziehung zu einem Werk, bei dem ein gemeinschaftlicher Akteur für die Choreografie verantwortlich ist. @de
definition: يربط وكيلا جماعيا بتجسيدة تنطوي على مسئولية وكيل جماعي عن إنشائها. @ar
definition: 将一个集体行为者与涉及一个集体行为者的创作责任的一种载体表现关联起来。 @zh-hans
scope note: A creator of manifestation includes a manufacturer, producer, and publisher. @en
scope note: Darunter fallen Hersteller, Produzentinnen/Produzenten und Verlage. @de

kaivertaja (yhteistoimija) manifestaatiossa
has element type: 2
toolkit definition: A manifestation that involves a responsibility of a collective agent for cutting letters, figures, etc., on a surface such as a wooden or metal plate used for printing. @en
toolkit definition: Baskı için kullanılan ahşap veya metal bir plaka gibi bir yüzey üzerine harfleri, şekilleri vb. kesmek için kolektif bir temsilcinin sorumluluğunu içeren bir gösterim. @tr
toolkit definition: Een manifestatie die met zich meebrengt een verantwoordelijkheid van een collectieve actor voor het snijden van letters, figuren etc., in een ondergrond zoals een houten of metalen plaat gebruikt voor het drukken. @nl
toolkit definition: Egy megjelenési forma, amelyhez hozzátartozik egy kollektív ágens felelőssége betűknek, számoknak stb. nyomtatáshoz használt fa- vagy fémlemez felületére történő metszéséért. @hu
toolkit definition: Eine Manifestation, bei der ein gemeinschaftlicher Akteur für das Schneiden von Buchstaben, figürlichen Darstellungen oder andere Zeichen in eine Oberfläche, wie zum Beispiel eine Holz- oder Metallplatte, die zum Drucken benutzt wird, verantwortlich ist. @de
toolkit definition: En manifestasjon som involverer et ansvar for en kollektiv agent i form av å skjære ut bokstaver, figurer, etc. i en overflate som en tre- eller metallplate som brukes til trykking. @no
toolkit definition: Kehastus, mis sisaldab kollektiivi vastutust tähtede, kujundite jms lõikamise eest trükkimiseks kasutatava puidust, metallist või muust materjalist plaadi pinnale. @et
toolkit definition: Manifestaatio, jossa yhteistoimija on vastuussa manifestaation valmistamisesta kaivertamalla kirjaimia, kuvioita tms. painamisessa käytettävälle pinnalle, kuten puu- tai metallipinnalle.
toolkit definition: Manifestació que implica una responsabilitat d’un agent col·lectiu en la gravació de lletres, figures, etc., sobre una superfície com ara una planxa de fusta o de metall usada en la impressió. @ca
toolkit definition: Manifestation qui comporte une responsabilité de la part d’un agent collectif consistant à graver des lettres, des figures, etc. sur une surface telle qu’une plaque de bois ou de métal utilisée pour l’impression. @fr
toolkit definition: Manifestation, som involverer en kollektiv agents ansvar for at udskære bogstaver, figurer etc. på en overflade såsom en træ- eller metalplade, som anvendes til trykning. @da
toolkit definition: Manifestazione che implica una responsabilità di un agente collettivo per l'incisione di lettere, figure, etc., su una superficie come una lastra di legno o metallo utilizzata per la stampa. @it
toolkit definition: Manifestācija, kas ietver grupas atbildību par burtu, zīmju u.tml. iegriešanu uz drukāšanai izmantojama materiāla virsmas (piemēram, uz koka vai metāla plāksnes). @lv
toolkit definition: تجسيدة تنطوي على مسئولية وكيل جماعي عن رص الحروف والأشكال، الخ، على سطح مثل لوح خشبي أو معدني يستخدم للطباعة. @ar
toolkit definition: 涉及通过在木版或金属版等表面上雕刻字母、图形等以用于印刷的一个集体行为者的责任的一种载体表现 @zh-hans
toolkit label: Gemeinschaftlicher Akteur als Stecherin/Stecher von @de
toolkit label: agent collectif graveur de @fr
toolkit label: agent col·lectiu gravador de @ca
toolkit label: engraver collective agent of @en
toolkit label: graveerija (kollektiiv) kehastuses @et
toolkit label: graveur-collectieve actor van @nl
toolkit label: gravør for (kollektiv agent) @no
toolkit label: gravür sanatçısı kolektif temsilcisi @tr
toolkit label: incisore agente collettivo di @it
toolkit label: ir gravieris (grupa) @lv
toolkit label: kaivertaja (yhteistoimija) manifestaatiossa
toolkit label: kollektiv agent, som er gravør af @da
toolkit label: vésnök kollektív ágense: @hu
toolkit label: χαράκτης συλλογικός φορέας του @el
toolkit label: وكيل جماعي نقاش @ar
toolkit label: ……的雕版者集体行为者 @zh-hans
has subproperty: kaivertaja (yhteisö) manifestaatiossa
has subproperty: kaivertaja (suku) manifestaatiossa
has subproperty: P50646
lexical alias: engraverCollectiveAgentOf.en
status: Published
type: Property
domain: C10011
label: er gravør for (kollektiv agent) @no
label: er kollektiv agent, som er gravør af @da
label: est un agent collectif graveur de @fr
label: graveerija (kollektiiv) kehastuses @et
label: gravür sanatçısı kolektif temsilcisidir @tr
label: ir gravieris (grupa) @lv
label: is engraver collective agent of @en
label: is graveur-collectieve actor van @nl
label: ist gemeinschaftlicher Akteur als Stecherin/Stecher von @de
label: vésnök kollektív ágense a következőnek: @hu
label: è incisore agente collettivo di @it
label: és agent col·lectiu gravador de @ca
label: είναι χαράκτης συλλογικός φορέας του @el
label: هو وكيل جماعي نقّاش لـ @ar
label: 是……的雕版者集体行为者 @zh-hans
sub property of: kaivertaja (toimija) manifestaatiossa
sub property of: kuvalaatan valmistaja (yhteistoimija) manifestaatiossa
definition: Correla un agente collettivo a una manifestazione che implica una responsabilità di un agente collettivo per l'incisione di lettere, figure, etc., su una superficie come una lastra di legno o metallo utilizzata per la stampa. @it
definition: Hozzákapcsol egy kollektív ágenst egy megjelenési formához, amelyhez hozzátartozik egy kollektív ágens felelőssége betűknek, számoknak stb. nyomtatáshoz használt fa- vagy fémlemez felületére történő metszéséért. @hu
definition: Kolektif bir temsilciyi, baskı için kullanılan ahşap veya metal bir plaka gibi bir yüzey üzerinde harfleri, şekilleri vb. kesmek için kolektif bir temsilcinin sorumluluğunu içeren bir gösterimle ilişkilendirir. @tr
definition: Liittää yhteistoimijan manifestaatioon, jossa yhteistoimija on vastuussa manifestaation valmistamisesta kaivertamalla kirjaimia, kuvioita tms. painamisessa käytettävälle pinnalle, kuten puu- tai metallipinnalle.
definition: Met un agent collectif en relation avec une manifestation qui comporte une responsabilité de la part d’un agent collectif consistant à graver des lettres, des figures, etc. sur une surface telle qu’une plaque de bois ou de métal utilisée pour l’impression. @fr
definition: Relaciona un agent col·lectiu amb una manifestació que implica una responsabilitat d’un agent col·lectiu en la gravació de lletres, figures, etc., sobre una superfície com ara una planxa de fusta o de metall usada en la impressió. @ca
definition: Relateert een collectieve actor aan een manifestatie die met zich meebrengt een verantwoordelijkheid van een collectieve actor voor het snijden van letters, figuren etc., in een ondergrond zoals een houten of metalen plaat gebruikt voor het drukken. @nl
definition: Relaterer en kollektiv agent til en manifestasjon som involverer et ansvar for en kollektiv agent i form av å skjære ut bokstaver, figurer, etc. i en overflate som en tre- eller metallplate som brukes til trykking. @no
definition: Relaterer en kollektiv agent til en manifestation, som involverer en kollektiv agents ansvar for at udskære bogstaver, figurer etc. på en overflade såsom en træ- eller metalplade, som anvendes til trykning. @da
definition: Relates a collective agent to a manifestation that involves a responsibility of a collective agent for cutting letters, figures, etc., on a surface such as a wooden or metal plate used for printing. @en
definition: Sasaista grupu ar manifestāciju, kas ietver grupas atbildību par burtu, zīmju u.tml. iegriešanu uz drukāšanai izmantojama materiāla virsmas (piemēram, uz koka vai metāla plāksnes). @lv
definition: Seostab kollektiivi kehastusega, mis sisaldab kollektiivi vastutust tähtede, kujundite jms lõikamise eest trükkimiseks kasutatava puidust, metallist või muust materjalist plaadi pinnale. @et
definition: Setzt einen gemeinschaftlichen Akteur in Beziehung zu einer Manifestation, bei der ein gemeinschaftlicher Akteur für das Schneiden von Buchstaben, figürlichen Darstellungen oder andere Zeichen in eine Oberfläche, wie zum Beispiel eine Holz- oder Metallplatte, die zum Drucken benutzt wird, verantwortlich ist. @de
definition: يربط وكيلا جماعيا بتجسيدة تنطوي على مسئولية وكيل جماعي عن رص الحروف والأشكال، الخ، على سطح مثل لوح خشبي أو معدني يستخدم للطباعة. @ar
definition: 将一个集体行为者与涉及通过在木版或金属版等表面上雕刻字母、图形等以用于印刷的一个集体行为者的责任的一种载体表现关联起来。 @zh-hans

elokuvan jakelija (yhteistoimija) manifestaatiossa
has element type: 2
toolkit definition: A manifestation that involves a responsibility of a collective agent for distribution of a moving image to theaters or other channels. @en
toolkit definition: Een manifestatie die met zich meebrengt een verantwoordelijkheid van een collectieve actor voor distributie van een bewegend beeld naar theaters of andere kanalen. @nl
toolkit definition: Egy megjelenési forma, amelyhez hozzátartozik egy kollektív ágens felelőssége mozgókép filmszínházak vagy más csatornák útján történő terjesztéséért. @hu
toolkit definition: Ein Manifestation, bei der ein gemeinschaftlicher Akteur für den Vertrieb eines Bewegtbilds an Kinos oder andere Vertriebskanäle verantwortlich ist. @de
toolkit definition: En manifestasjon som involverer et ansvar for en kollektiv agent i form av distribusjon av levende bilder til kinoer eller andre kanaler. @no
toolkit definition: Hareketli bir görüntünün sinemalara veya diğer kanallara dağıtılması için kolektif bir temsilcinin sorumluluğunu içeren bir gösterim. @tr
toolkit definition: Kehastus, mis sisaldab kollektiivi vastutust filmi levitamise eest kinodesse või muudesse levikanalitesse. @et
toolkit definition: Manifestaatio, jonka jakelusta elokuvateattereille tai muille jakelukanaville yhteistoimija on vastuussa.
toolkit definition: Manifestació que implica una responsabilitat d’un agent col·lectiu en la distribució d’una imatge en moviment a cinemes o a altres canals de distribució. @ca
toolkit definition: Manifestation qui comporte une responsabilité de la part d’un agent collectif en ce qui concerne la distribution d’images animées aux salles de cinéma ou aux autres réseaux de distribution. @fr
toolkit definition: Manifestation, som involverer en kollektiv agents ansvar for distribution af et levende billede til biografer eller andre distributionskanaler. @da
toolkit definition: Manifestazione che implica una responsabilità di un agente collettivo nella distribuzione di un'immagine in movimento a teatri o altri canali. @it
toolkit definition: Manifestācija, kas ietver grupas atbildību par filmas izplatīšanu kinoteātriem vai caur citiem izplatīšanas kanāliem. @lv
toolkit definition: تجسيدة تنطوي على مسئولية وكيل جماعي عن توزيع فيلم على قاعات العرض أو عبر قنوات أخرى. @ar
toolkit definition: 涉及向剧院或其他渠道发行动态图像的一个集体行为者的责任的一种载体表现 @zh-hans
toolkit label: Gemeinschaftlicher Akteur als Filmvertrieb von @de
toolkit label: agent collectif distributeur de cinéma de @fr
toolkit label: agent col·lectiu distribuïdor de pel·lícules de @ca
toolkit label: distributore cinematografico agente collettivo di @it
toolkit label: elokuvan jakelija (yhteistoimija) manifestaatiossa
toolkit label: film dağıtıcısı kolektif temsilcisi @tr
toolkit label: film distributor collective agent of @en
toolkit label: filmdistributeur-collectieve actor van @nl
toolkit label: filmdistributør for (kollektiv agent) @no
toolkit label: filmilevitaja (kollektiiv) kehastuses @et
toolkit label: filmterjesztő kollektív ágense: @hu
toolkit label: ir filmas izplatītājs (grupa) @lv
toolkit label: kollektiv agent, som er filmdistributør af @da
toolkit label: διανομέας ταινίας συλλογικός φορέας του @el
toolkit label: وكيل جماعي موزع أفلام @ar
toolkit label: ……的电影发行者集体行为者 @zh-hans
has subproperty: elokuvan jakelija (yhteisö) manifestaatiossa
has subproperty: elokuvan jakelijja (suku) manifestaatiossa
has subproperty: P50647
lexical alias: filmDistributorCollectiveAgentOf.en
status: Published
type: Property
domain: C10011
label: er filmdistributør for (kollektiv agent) @no
label: er kollektiv agent, som er filmdistributør af @da
label: est un agent collectif distributeur de cinéma de @fr
label: film dağıtımcısı kolektif temsilcisidir @tr
label: filmilevitaja (kollektiiv) kehastuses @et
label: filmterjesztő kollektív ágense a következőnek: @hu
label: ir filmas izplatītājs (grupa) @lv
label: is film distributor collective agent of @en
label: is filmdistributeur-collectieve actor van @nl
label: ist gemeinschaftlicher Akteur als Filmvertrieb von @de
label: è distributore cinematografico agente collettivo di @it
label: és agent col·lectiu distribuïdor de pel·lícules de @ca
label: είναι διανομέας ταινίας συλλογικός φορέας του @el
label: هو وكيل جماعي موزع أفلام لـ @ar
label: 是……的电影发行者集体行为者 @zh-hans
sub property of: elokuvan jakelija (toimija) manifestaatiossa
sub property of: jakelija (yhteistoimija) manifestaatiossa
alternative label: agent collectif distributeur de film de @fr
definition: Correla un agente collettivo a una manifestazione che implica una responsabilità di un agente collettivo nella distribuzione di un'immagine in movimento a teatri o altri canali. @it
definition: Hozzákapcsol egy kollektív ágenst egy megjelenési formához, amelyhez hozzátartozik egy kollektív ágens felelőssége mozgókép filmszínházak vagy más csatornák útján történő terjesztéséért. @hu
definition: Kolektif bir temsilciyi, hareketli bir görüntünün tiyatrolara veya diğer kanallara dağıtılması için kolektif bir temsilcinin sorumluluğunu içeren bir gösterimle ilişkilendirir. @tr
definition: Liittää yhteistoimijan manifestaatioon, jonka jakelusta elokuvateattereille tai muille jakelukanaville yhteistoimija on vastuussa.
definition: Met un agent collectif en relation avec une manifestation qui comporte une responsabilité de la part d’un agent collectif en ce qui concerne la distribution d’images animées aux salles de cinéma ou aux autres réseaux de distribution. @fr
definition: Relaciona un agent col·lectiu amb una manifestació que implica una responsabilitat d’un agent col·lectiu en la distribució d’una imatge en moviment a cinemes o a altres canals de distribució. @ca
definition: Relateert een collectieve actor aan een manifestatie die met zich meebrengt een verantwoordelijkheid van een collectieve actor voor distributie van een bewegend beeld naar theaters of andere kanalen. @nl
definition: Relaterer en kollektiv agent til en manifestasjon som involverer et ansvar for en kollektiv agent i form av distribusjon av levende bilder til kinoer eller andre kanaler. @no
definition: Relaterer en kollektiv agent til en manifestation, som involverer en kollektiv agents ansvar for distribution af et levende billede til biografer eller andre distributionskanaler. @da
definition: Relates a collective agent to a manifestation that involves a responsibility of a collective agent for distribution of a moving image to theaters or other channels. @en
definition: Sasaista grupu ar manifestāciju, kas ietver grupas atbildību par filmas izplatīšanu kinoteātriem vai caur citiem izplatīšanas kanāliem. @lv
definition: Seostab kollektiivi kehastusega, mis sisaldab kollektiivi vastutust filmi levitamise eest kinodesse või muudesse levikanalitesse. @et
definition: Setzt einen gemeinschaftlichen Akteur in Beziehung zu einer Manifestation, bei der ein gemeinschaftlicher Akteur für den Vertrieb eines Bewegtbilds an Kinos oder andere Vertriebskanäle verantwortlich ist. @de
definition: يربط وكيلا جماعيا بتجسيدة تنطوي على مسئولية وكيل جماعي عن توزيع فيلم على قاعات العرض أو عبر قنوات أخرى. @ar
definition: 将一个集体行为者与涉及向剧院或其他渠道发行动态图像的一个集体行为者的责任的一种载体表现关联起来。 @zh-hans

jakelija (yhteistoimija) manifestaatiossa
has element type: 2
toolkit definition: A manifestation that involves a responsibility of a collective agent for distribution. @en
toolkit definition: Dağıtım için kolektif bir temsilcinin sorumluluğunu içeren bir gösterim. @tr
toolkit definition: Een manifestatie die met zich meebrengt een verantwoordelijkheid van een collectieve actor voor distributie. @nl
toolkit definition: Egy megjelenési forma, amelyhez hozzátartozik egy kollektív ágens felelőssége a terjesztésért. @hu
toolkit definition: Eine Manifestation, bei der ein gemeinschaftlicher Akteur für den Vertrieb verantwortlich ist. @de
toolkit definition: En manifestasjon som involverer et ansvar for en kollektiv agent i form av distribusjon. @no
toolkit definition: Kehastus, mis sisaldab kollektiivi vastutust levitamise eest. @et
toolkit definition: Manifestaatio, jonka jakelusta yhteistoimija on vastuussa.
toolkit definition: Manifestació que implica una responsabilitat d’un agent col·lectiu en la distribució. @ca
toolkit definition: Manifestation qui comporte une responsabilité de la part d’un agent collectif en ce qui concerne la diffusion ou la distribution. @fr
toolkit definition: Manifestation, som involverer en kollektiv agents ansvar for distribution. @da
toolkit definition: Manifestazione che implica una responsabilità di un agente collettivo nella distribuzione. @it
toolkit definition: Manifestācija, kas ietver grupas atbildību par izplatīšanu. @lv
toolkit definition: تجسيدة تنطوي على مسئولية وكيل جماعي عن التوزيع. @ar
toolkit definition: 涉及发行的一个集体行为者的责任的一种载体表现 @zh-hans
toolkit label: Gemeinschaftlicher Akteur als Vertrieb von @de
toolkit label: agent collectif diffuseur ou distributeur de @fr
toolkit label: agent col·lectiu distribuïdor de @ca
toolkit label: dağıtıcı kolektif temsilci @tr
toolkit label: distributeur-collectieve actor van @nl
toolkit label: distributor collective agent of @en
toolkit label: distributore agente collettivo di @it
toolkit label: distributør for (kollektiv agent) @no
toolkit label: ir izplatītājs (grupa) @lv
toolkit label: jakelija (yhteistoimija) manifestaatiossa
toolkit label: kollektiv agent, som er distributør af @da
toolkit label: levitaja (kollektiiv) kehastuses @et
toolkit label: terjesztő kollektív ágense: @hu
toolkit label: διανομέας συλλογικός φορέας του @el
toolkit label: وكيل جماعي موزع @ar
toolkit label: ……的发行者集体行为者 @zh-hans
has subproperty: elokuvan jakelija (yhteistoimija) manifestaatiossa
has subproperty: jakelija (yhteisö) manifestaatiossa
has subproperty: jakelija (suku) manifestaatiossa
has subproperty: P50648
lexical alias: distributorCollectiveAgentOf.en
status: Published
type: Property
domain: C10011
label: dağıtımcı kolektif temsilcisidir @tr
label: er distributør for (kollektiv agent) @no
label: er kollektiv agent, som er distributør af @da
label: est un agent collectif diffuseur ou distributeur de @fr
label: ir izplatītājs (grupa) @lv
label: is distributeur-collectieve actor van @nl
label: is distributor collective agent of @en
label: ist gemeinschaftlicher Akteur als Vertrieb von @de
label: levitaja (kollektiiv) kehastuses @et
label: terjesztő kollektív ágense a következőnek: @hu
label: è distributore agente collettivo di @it
label: és agent col·lectiu distribuïdor de @ca
label: είναι διανομέας συλλογικός φορέας του @el
label: هو وكيل جماعي موزع لـ @ar
label: 是……的发行者集体行为者 @zh-hans
sub property of: jakelija (toimija) manifestaatiossa
sub property of: yhteistoimijaan liittyvä manifestaatio
definition: Correla un agente collettivo a una manifestazione che implica una responsabilità di un agente collettivo nella distribuzione. @it
definition: Hozzákapcsol egy kollektív ágenst egy megjelenési formához, amelyhez hozzátartozik egy kollektív ágens felelőssége a terjesztésért. @hu
definition: Kolektif bir temsilciyi, dağıtım için kolektif bir temsilcinin sorumluluğunu içeren bir gösterimle ilişkilendirir. @tr
definition: Liittää yhteistoimijan manifestaatioon, jonka jakelusta yhteistoimija on vastuussa.
definition: Met un agent collectif en relation avec une manifestation qui comporte une responsabilité de la part d’un agent collectif en ce qui concerne la diffusion ou la distribution. @fr
definition: Relaciona un agent col·lectiu amb una manifestació que implica una responsabilitat d’un agent col·lectiu en la distribució. @ca
definition: Relateert een collectieve actor aan een manifestatie die met zich meebrengt een verantwoordelijkheid van een collectieve actor voor distributie. @nl
definition: Relaterer en kollektiv agent til en manifestasjon som involverer et ansvar for en kollektiv agent i form av distribusjon. @no
definition: Relaterer en kollektiv agent til en manifestation, som involverer en kollektiv agents ansvar for distribution. @da
definition: Relates a collective agent to a manifestation that involves a responsibility of a collective agent for distribution. @en
definition: Sasaista grupu ar manifestāciju, kas ietver grupas atbildību par izplatīšanu. @lv
definition: Seostab kollektiivi kehastusega, mis sisaldab kollektiivi vastutust levitamise eest. @et
definition: Setzt einen gemeinschaftlichen Akteur in Beziehung zu einer Manifestation, bei der ein gemeinschaftlicher Akteur für den Vertrieb verantwortlich ist. @de
definition: يربط وكيلا جماعيا بتجسيدة تنطوي على مسئولية وكيل جماعي عن التوزيع. @ar
definition: 将一个集体行为者与涉及发行的一个集体行为者的责任的一种载体表现关联起来。 @zh-hans

pistekirjoituksen tekijä (yhteistoimija) manifestaatiossa
has element type: 2
toolkit definition: A manifestation that involves a responsibility of a collective agent for embossing braille cells using a stylus, special embossing printer, or other device. @en
toolkit definition: Een manifestatie die met zich meebrengt een verantwoordelijkheid van een collectieve actor voor het pregen van braille cellen met gebruikmaking van een stylus, speciale preegdrukmachine of ander instrument. @nl
toolkit definition: Egy megjelenési forma, amelyhez hozzátartozik egy kollektív ágens felelőssége braille-cellák dombornyomásáért íróvessző, speciális dombornyomtató vagy más eszköz használatával. @hu
toolkit definition: Eine Manifestation, bei der ein gemeinschaftlicher Akteur für das Prägen von Braillezeichen verantwortlich ist, indem er einen Griffel, einen speziellen Brailledrucker oder ein anderes Gerät verwendet. @de
toolkit definition: En manifestasjon som involverer et ansvar for en kollektiv agent i form av å prege brailleceller ved hjelp av pren, punktskriftmaskin eller annen innretning. @no
toolkit definition: Kalem, özel kabartma yazıcı veya başka bir cihaz kullanarak braille hücrelerini kabartmak için kolektif bir temsilcinin sorumluluğunu içeren bir gösterim. @tr
toolkit definition: Kehastus, mis sisaldab kollektiivi vastutust spetsiaalse kirjutusvahendi, punktkirjaprinteri või muu seadmega punktkirjamärkide tegemise eest. @et
toolkit definition: Manifestaatio, jonka tekemisestä yhteistoimija on vastuussa tuottamalla pistekirjoitusmerkkejä piirtimen, erityistulostimen tai muun laitteen avulla.
toolkit definition: Manifestació que implica una responsabilitat d’un agent col·lectiu en el repujat de punts braille amb un punxó, una impressora especial d’estampar o un altre mecanisme. @ca
toolkit definition: Manifestation qui comporte une responsabilité de la part d’un agent collectif consistant à embosser des cellules braille au moyen d’un poinçon, d’une imprimante spéciale ou d’un autre appareil. @fr
toolkit definition: Manifestation, som involverer en kollektiv agents ansvar for at præge punktskriftsceller vha. en stift, særlig prægeprinter eller anden anordning. @da
toolkit definition: Manifestazione che implica una responsabililtà di un agente collettivo per lo sbalzo di punti braille utilizzando uno stilo, una speciale stampante a sbalzo o altro dispositivo. @it
toolkit definition: Manifestācija, kas ietver grupas atbildību par Braila raksta matricas iespiešanu, izmantojot irbuli, īpaša ciļņa iespieduma printeri vai citu ierīci. @lv
toolkit definition: تجسيدة تنطوي على مسئولية وكيل جماعي عن نقش خلايا برايل باستخدام قلم أو طابعة خاصة للنقش أو أي أداة أخرى. @ar
toolkit definition: 涉及通过使用刻写针、专门的压纹机或其他设备压印布莱叶盲文的一个集体行为者的责任的一种载体表现 @zh-hans
toolkit label: Braille-dombornyomó kollektív ágense: @hu
toolkit label: Gemeinschaftlicher Akteur als Brailleschriftprägerin/Brailleschriftpräger von @de
toolkit label: agent collectif producteur braille de @fr
toolkit label: agent col·lectiu estampador braille de @ca
toolkit label: braille embosser collective agent of @en
toolkit label: braille kabartmacısı kolektif temsilcisi @tr
toolkit label: brailleerder-collectieve actor van @nl
toolkit label: ir iespiedējs Braila rakstā (grupa) @lv
toolkit label: kollektiv agent, som er punktskriftspræger af @da
toolkit label: pistekirjoituksen tekijä (yhteistoimija) manifestaatiossa
toolkit label: punktkirja kirjutaja (kollektiiv) kehastuses @et
toolkit label: punktskriftspreger for (kollektiv agent) @no
toolkit label: stampatore braille agente collettivo di @it
toolkit label: μπράιγ τυπογράφος συλλογικός φορέας του @el
toolkit label: وكيل جماعي نقاش حروف بطريقة برايل @ar
toolkit label: ……的布莱叶盲文点字制作者集体行为者 @zh-hans
has subproperty: pistekirjoituksen tekijä (yhteisö) manifestaatiossa
has subproperty: pistekirjoituksen tekijä (suku) manifestaatiossa
has subproperty: P50649
lexical alias: brailleEmbosserCollectiveAgentOf.en
status: Published
type: Property
domain: C10011
label: Braille-dombornyomó kollektív ágense a következőnek: @hu
label: braille kabartmacısı kolektif temsilcisidir @tr
label: er kollektiv agent, som er punktskriftspræger af @da
label: er punktskriftspreger for (kollektiv agent) @no
label: est un agent collectif producteur braille de @fr
label: ir iespiedējs Braila rakstā (grupa) @lv
label: is braille embosser collective agent of @en
label: is brailleerder-collectieve actor van @nl
label: ist gemeinschaftlicher Akteur als Brailleschriftprägerin/Brailleschriftpräger von @de
label: punktkirja kirjutaja (kollektiiv) kehastuses @et
label: è stampatore braille agente collettivo di @it
label: és agent col·lectiu estampador braille de @ca
label: είναι μπράιγ τυπογράφος συλλογικός φορέας του @el
label: هو وكيل جماعي نقاش حروف بطريقة برايل لـ @ar
label: 是……的布莱叶盲文点字制作者集体行为者 @zh-hans
sub property of: pistekirjoituksen tekijä (toimija) manifestaatiossa
sub property of: valmistaja (yhteistoimija) manifestaatiossa
definition: Correla un agente collettivo a una manifestazione che implica una responsabililtà di un agente collettivo per lo sbalzo di punti braille utilizzando uno stilo, una speciale stampante a sbalzo o altro dispositivo. @it
definition: Hozzákapcsol egy kollektív ágenst egy megjelenési formához, amelyhez hozzátartozik egy kollektív ágens felelőssége braille-cellák dombornyomásáért íróvessző, speciális dombornyomtató vagy más eszköz használatával. @hu
definition: Kolektif bir temsilciyi bir kalem, özel kabartma yazıcısı veya başka bir cihaz kullanarak braille hücrelerini kabartmak için kolektif bir temsilcinin sorumluluğunu içeren bir gösterimle ilişkilendirir. @tr
definition: Liittää yhteistoimijan manifestaatioon, jonka tekemisestä yhteistoimija on vastuussa tuottamalla pistekirjoitusmerkkejä piirtimen, erityistulostimen tai muun laitteen avulla.
definition: Met un agent collectif en relation avec une manifestation qui comporte une responsabilité de la part d’un agent collectif consistant à embosser des cellules braille au moyen d’un poinçon, d’une imprimante spéciale ou d’un autre appareil. @fr
definition: Relaciona un agent col·lectiu amb una manifestació que implica una responsabilitat d’un agent col·lectiu en el repujat de punts braille amb un punxó, una impressora especial d’estampar o un altre mecanisme. @ca
definition: Relateert een collectieve actor aan een manifestatie die met zich meebrengt een verantwoordelijkheid van een collectieve actor voor het pregen van braille cellen met gebruikmaking van een stylus, speciale preegdrukmachine of ander instrument. @nl
definition: Relaterer en kollektiv agent til en manifestasjon som involverer et ansvar for en kollektiv agent i form av å prege brailleceller ved hjelp av pren, punktskriftmaskin eller annen innretning. @no
definition: Relaterer en kollektiv agent til en manifestation, som involverer en kollektiv agents ansvar for at præge punktskriftsceller vha. en stift, særlig prægeprinter eller anden anordning. @da
definition: Relates a collective agent to a manifestation that involves a responsibility of a collective agent for embossing braille cells using a stylus, special embossing printer, or other device. @en
definition: Sasaista grupu ar manifestāciju, kas ietver grupas atbildību par Braila raksta matricas iespiešanu, izmantojot irbuli, īpaša ciļņa iespieduma printeri vai citu ierīci. @lv
definition: Seostab kollektiivi kehastusega, mis sisaldab kollektiivi vastutust spetsiaalse kirjutusvahendi, punktkirjaprinteri või muu seadmega punktkirjamärkide tegemise eest. @et
definition: Setzt einen gemeinschaftlichen Akteur in Beziehung zu einer Manifestation, bei der ein gemeinschaftlicher Akteur für das Prägen von Braillezeichen verantwortlich ist, indem er einen Griffel, einen speziellen Brailledrucker oder ein anderes Gerät verwendet. @de
definition: يربط وكيلا جماعيا بتجسيدة تنطوي على مسئولية وكيل جماعي عن نقش خلايا برايل باستخدام قلم أو طابعة خاصة للنقش أو أي أداة أخرى. @ar
definition: 将一个集体行为者与涉及通过使用刻写针、专门的压纹机或其他设备压印布莱叶盲文的一个集体行为者的责任的一种载体表现关联起来。 @zh-hans

julkaisemattoman manifestaation tuottaja (yhteistoimja) manifestaatiossa
has element type: 2
toolkit definition: A manifestation that involves a responsibility of a collective agent for inscribing, fabrication, construction, etc. @en
toolkit definition: Een manifestatie die met zich meebrengt een verantwoordelijkheid van een collectieve actor voor afschrijven, fabriceren, construeren etc. @nl
toolkit definition: Egy megjelenési forma, amelyhez hozzátartozik egy kollektív ágens íráshoz, összeállításhoz, készítéshez stb. fűződő felelőssége. @hu
toolkit definition: Eine Manifestation, bei der ein gemeinschaftlicher Akteur für das Gravieren, Fabrizieren, Konstruieren oder eine andere Herstellungsmethode verantwortlich ist. @de
toolkit definition: En manifestasjon som involverer et ansvar for en kollektiv agent i form av inskripsjon, fabrikasjon, konstruksjon etc. @no
toolkit definition: Julkaisematon manifestaatio, jossa yhteistoimija on vastuussa kaiverruksesta, valmistuksesta, kokoonpanosta tms.
toolkit definition: Kehastus, mis sisaldab kollektiivi vastutust inskribeerimise, tootmise, ehitamise vms eest. @et
toolkit definition: Manifestació que implica una responsabilitat d’un agent col·lectiu en la inscripció, fabricació, construcció, etc. @ca
toolkit definition: Manifestation qui comporte une responsabilité de la part d’un agent collectif en ce qui concerne la scription, la fabrication, la construction, etc. @fr
toolkit definition: Manifestation, som involverer en kollektiv agents ansvar for indskrift, fremstilling, konstruktion etc. @da
toolkit definition: Manifestazione che implica una responsabilità di un agente collettivo per la scrittura, fabbricazione, costruzione, etc. @it
toolkit definition: Manifestācija, kas ietver grupas atbildību par pierakstīšanu, izgatavošanu, radīšanu u.tml. @lv
toolkit definition: Yazma, üretim, yapım vb. için kolektif bir temsilcinin sorumluluğunu içeren bir gösterim. @tr
toolkit definition: تجسيدة تنطوي على مسئولية وكيل جماعي عن الكتابة أو التصنيع أو البنية، إلخ. @ar
toolkit definition: 涉及镌刻、制造、构建等的一个集体行为者的责任的一种载体表现 @zh-hans
toolkit label: Gemeinschaftlicher Akteur als Erzeugerin/Erzeuger einer unveröffentlichten Manifestation von @de
toolkit label: Yayınlanmamış gösterimin yapımcı kolektif temsilcisi @tr
toolkit label: agent collectif producteur d’une manifestation non publiée de @fr
toolkit label: agent col·lectiu productor d’una manifestació no publicada de @ca
toolkit label: avaldamata kehastuse tootja (kollektiiv) kehastuses @et
toolkit label: előállító kollektív ágense a következő kiadatlan megjelenési formának: @hu
toolkit label: ir nepublicētas manifestācijas izgatavotājs (grupa) @lv
toolkit label: julkaisemattoman manifestaation tuottaja (yhteistoimja) manifestaatiossa
toolkit label: kollektiv agent, som er producer af upubliceret manifestation af @da
toolkit label: producer collective agent of unpublished manifestation of @en
toolkit label: productie-collectieve actor van ongepubliceerde manifestatie van @nl
toolkit label: produsent av upublisert manifestasjon for (kollektiv agent) @no
toolkit label: produttore agente collettivo di manifestazione non pubblicata di @it
toolkit label: παραγωγός συλλογικός φορέας αδημοσίευτης εκδήλωσης @el
toolkit label: وكيل جماعي منتج تجسيدة غير منشورة @ar
toolkit label: ……的非出版载体表现的制作者集体行为者 @zh-hans
has subproperty: julkaisemattoman manifestaation tuottaja (yhteistoimija) manifestaatiossa
has subproperty: julkaisemattoman manifestaation tuottaja (suku) manifestaatiossa
has subproperty: P50650
lexical alias: producerCollectiveAgentOfUnpublishedManifestationOf.en
status: Published
type: Property
domain: C10011
label: avaldamata kehastuse tootja (kollektiiv) kehastuses @et
label: előállító kollektív ágense a következő kiadatlan megjelenési formának: @hu
label: er kollektiv agent, som er producer af upubliceret manifestation af @da
label: er produsent av upublisert manifestasjon for (kollektiv agent) @no
label: est un agent collectif producteur d’une manifestation non publiée de @fr
label: ir nepublicētas manifestācijas izgatavotājs (grupa) @lv
label: is producent-collectieve actor van ongepubliceerde manifestatie van @nl
label: is producer collective agent of unpublished manifestation of @en
label: ist gemeinschaftlicher Akteur als Erzeugerin/Erzeuger einer unveröffentlichten Manifestation von @de
label: yayınlanmamış gösteriminin yapımcı kolektif temsilcisidir @tr
label: è produttore agente collettivo di manifestazione non pubblicata di @it
label: és agent col·lectiu productor d’una manifestació no publicada de @ca
label: είναι παραγωγός συλλογικός φορέας αδημοσίευτης εκδήλωσης @el
label: هو وكيل جماعي منتج تجسيدة غير منشورة لـ @ar
label: 是……的非出版载体表现的制作者集体行为者 @zh-hans
sub property of: julkaisemattoman manifestaation tuottaja (toimija) manifestaatiossa
sub property of: manifestaation tekijä (yhteistoimija) manifestaatiossa
definition: Bir kolektif temsilciyi yazım, üretim, yapım için kolektif temsilcinin sorumluluğunu içeren gösterimle ilişkilendirir. @tr
definition: Correla un agente collettivo a una manifestazione che implica una responsabilità di un agente collettivo per la scrittura, fabbricazione, costruzione, etc. @it
definition: Hozzákapcsol egy kollektív ágenst egy megjelenési formához, amelyhez hozzátartozik egy kollektív ágens íráshoz, összeállításhoz, készítéshez stb. fűződő felelőssége. @hu
definition: Liittää yhteistoimijan julkaisemattomaan manifestaatioon, jossa yhteistoimija on vastuussa kaiverruksesta, valmistuksesta, kokoonpanosta tms.
definition: Met un agent collectif en relation avec une manifestation qui comporte une responsabilité de la part d’un agent collectif en ce qui concerne la scription, la fabrication, la construction, etc. @fr
definition: Relaciona un agent col·lectiu amb una manifestació que implica una responsabilitat d’un agent col·lectiu en la inscripció, fabricació, construcció, etc. @ca
definition: Relateert een collectieve actor aan een manifestatie die met zich meebrengt een verantwoordelijkheid van een collectieve actor voor afschrijven, fabriceren, construeren etc. @nl
definition: Relaterer en kollektiv agent til en manifestasjon som involverer et ansvar for en kollektiv agent i form av inskripsjon, fabrikasjon, konstruksjon etc. @no
definition: Relaterer en kollektiv agent til en manifestation, som involverer en kollektiv agents ansvar for indskrift, fremstilling, konstruktion etc. @da
definition: Relates a collective agent to a manifestation that involves a responsibility of a collective agent for inscribing, fabrication, construction, or other method of producing. @en
definition: Sasaista grupu ar manifestāciju, kas ietver grupas atbildību par pierakstīšanu, izgatavošanu, radīšanu u.tml. @lv
definition: Seostab kollektiivi kehastusega, mis sisaldab kollektiivi vastutust inskribeerimise, tootmise, ehitamise vms eest. @et
definition: Setzt einen gemeinschaftlicher Akteur in Beziehung zu einer Manifestation, bei der ein gemeinschaftlicher Akteur für das Gravieren, Fabrizieren, Konstruieren oder eine andere Herstellungsmethode verantwortlich ist. @de
definition: يربط وكيلا جماعيا بتجسيدة تنطوي على مسئولية وكيل جماعي عن الكتابة أو التصنيع أو البنية، إلخ. @ar
definition: 将一个集体行为者与涉及镌刻、制造、构建等的一个集体行为者的责任的一种载体表现关联起来。 @zh-hans

kuvalaatan valmistaja (yhteistoimija) manifestaatiossa
has element type: 2
toolkit definition: A manifestation that involves a responsibility of a collective agent for making a relief, intaglio, or planographic printing surface. @en
toolkit definition: Bir kabartma, oyma veya planografik baskı yüzeyi yapmak için kolektif bir temsilcinin sorumluluğunu içeren bir gösterim. @tr
toolkit definition: Een manifestatie die met zich meebrengt een verantwoordelijkheid van een collectieve actor voor het maken van een relief, intaglio of vlakdruk oppervlak. @nl
toolkit definition: Egy megjelenési forma, amelyhez hozzátartozik egy kollektív ágens felelőssége egy relief, egy mélynyomásos vagy síknyomásos felület készítéséért. @hu
toolkit definition: Eine Manifestation, bei der ein gemeinschaftlicher Akteur für die Herstellung einer Hochdruck-, Tiefdruck- oder Flachdruckoberfläche verantwortlich ist. @de
toolkit definition: En manifestasjon som involverer et ansvar for en kollektiv agent i form av å lage en overflate for relieff-, intaglio- eller plantrykk. @no
toolkit definition: Kehastus, mis sisaldab kollektiivi vastutust kõrgtrüki, sügavtrüki või lametrüki teel tõmmiste tegemise eest. @et
toolkit definition: Manifestaatio, jossa yhteistoimija on vastuussa kohokuvan, syväpainon tai laakapainon painopinnan valmistamisesta.
toolkit definition: Manifestació que implica una responsabilitat d’un agent col·lectiu en la fabricació d’una superfície d’impressió en relleu, gravada en profunditat o planogràfica. @ca
toolkit definition: Manifestation qui comporte une responsabilité de la part d’un agent collectif consistant à préparer un élément d’impression en relief, en creux ou planographique. @fr
toolkit definition: Manifestation, som involverer en kollektiv agents ansvar for at lave en relief-, dybtryks- eller fladtryksoverflade. @da
toolkit definition: Manifestazione che implica una responsabilità di un agente collettivo per la realizzazione di una superficie a rilievo, intaglio o stampa planografica. @it
toolkit definition: Manifestācija, kas ietver grupas atbildību par reljefa, dobspiedes vai gludspieduma drukāšanas virsmas izveidi. @lv
toolkit definition: تجسيدة تنطوي على مسئولية وكيل جماعي عن إعداد سطح لطباعة بارزة، أو غائرة، أو مستوية. @ar
toolkit definition: 涉及制作浮雕、凹版或平版印刷表面的一个集体行为者的责任的一种载体表现 @zh-hans
toolkit label: Gemeinschaftlicher Akteur als Druckgrafikerin/Druckgrafiker von @de
toolkit label: Grafiker kolektif temsilcisi @tr
toolkit label: agent collectif graveur d’estampe de @fr
toolkit label: agent col·lectiu gravador d’estampes de @ca
toolkit label: graafika trükkija (kollektiiv) kehastuses @et
toolkit label: grafiker for (kollektiv agent) @no
toolkit label: incisore agente collettivo di @it
toolkit label: ir gravīru meistars (grupa) @lv
toolkit label: kollektiv agent, som er grafiker af @da
toolkit label: kuvalaatan valmistaja (yhteistoimija) manifestaatiossa
toolkit label: nyomtatványkészítő kollektív ágense: @hu
toolkit label: prentmaker-collectieve actor van @nl
toolkit label: printmaker collective agent of @en
toolkit label: χαράκτης συλλογικός φορέας του @el
toolkit label: وكيل جماعي طبّاع @ar
toolkit label: ……的印版制作者集体行为者 @zh-hans
has subproperty: kaivertaja (yhteistoimija) manifestaatiossa
has subproperty: litografi (yhteistoimija) manifestaatiossa
has subproperty: etsaaja (yhteistoimija) manifestaatiossa
has subproperty: kollotypian valmistaja (yhteistoimija) manifestaatiossa
has subproperty: kuvalaatan valmistaja (yhteisö) manifestaatiossa
has subproperty: kuvalaatan valmistaja (suku) manifestaatiossa
has subproperty: P50651
lexical alias: printmakerCollectiveAgentOf.en
status: Published
type: Property
domain: C10011
label: baskı sanatçısı kolektif temsilcisidir @tr
label: er grafiker for (kollektiv agent) @no
label: er kollektiv agent, som er grafiker af @da
label: est un agent collectif graveur d’estampe de @fr
label: graafika trükkija (kollektiiv) kehastuses @et
label: ir gravīru meistars (grupa) @lv
label: is prentmaker-collectieve actor van @nl
label: is printmaker collective agent of @en
label: ist gemeinschaftlicher Akteur als Druckgrafikerin/Druckgrafiker von @de
label: nyomtatványkészítő kollektív ágense a következőnek: @hu
label: è incisore agente collettivo di @it
label: és agent col·lectiu gravador d’estampes de @ca
label: είναι χαράκτης συλλογικός φορέας του @el
label: هو وكيل جماعي طبّاع لـ @ar
label: 是……的印版制作者集体行为者 @zh-hans
sub property of: kuvalaatan valmistaja (toimija) manifestaatiossa
sub property of: manifestaation tekijä (yhteistoimija) manifestaatiossa
definition: Correla un agente collettivo a una manifestazione che implica una responsabilità di un agente collettivo per la realizzazione di una superficie a rilievo, intaglio o stampa planografica. @it
definition: Hozzákapcsol egy kollektív ágenst egy megjelenési formához, amelyhez hozzátartozik egy kollektív ágens felelőssége egy relief, egy mélynyomásos vagy síknyomásos felület készítéséért. @hu
definition: Kolektif bir temsilciyi, bir kabartma, oyma veya planografik baskı yüzeyi yapma sorumluluğunu içeren bir gösterimle ilişkilendirir. @tr
definition: Liittää yhteistoimijan manifestaatioon, jossa yhteistoimija on vastuussa kohokuvan, syväpainon tai laakapainon painopinnan valmistamisesta.
definition: Met un agent collectif en relation avec une manifestation qui comporte une responsabilité de la part d’un agent collectif consistant à préparer un élément d’impression en relief, en creux ou planographique. @fr
definition: Relaciona un agent col·lectiu amb una manifestació que implica una responsabilitat d’un agent col·lectiu en la fabricació d’una superfície d’impressió en relleu, gravada en profunditat o planogràfica. @ca
definition: Relateert een collectieve actor aan een manifestatie die met zich meebrengt een verantwoordelijkheid van een collectieve actor voor het maken van een relief, intaglio of vlakdruk oppervlak. @nl
definition: Relaterer en kollektiv agent til en manifestasjon som involverer et ansvar for en kollektiv agent i form av å lage en overflate for relieff-, intaglio- eller plantrykk. @no
definition: Relaterer en kollektiv agent til en manifestation, som involverer en kollektiv agents ansvar for at lave en relief-, dybtryks- eller fladtryksoverflade. @da
definition: Relates a collective agent to a manifestation that involves a responsibility of a collective agent for making a relief, intaglio, or planographic printing surface. @en
definition: Sasaista grupu ar manifestāciju, kas ietver grupas atbildību par reljefa, dobspiedes vai gludspieduma drukāšanas virsmas izveidi. @lv
definition: Seostab kollektiivi kehastusega, mis sisaldab kollektiivi vastutust kõrgtrüki, sügavtrüki või lametrüki teel tõmmiste tegemise eest. @et
definition: Setzt einen gemeinschaftlichen Akteur in Beziehung zu einer Manifestation, bei der ein gemeinschaftlicher Akteur für die Herstellung einer Hochdruck-, Tiefdruck- oder Flachdruckoberfläche verantwortlich ist. @de
definition: يربط وكيلا جماعيا بتجسيدة تنطوي على مسئولية وكيل جماعي عن إعداد سطح لطباعة بارزة، أو غائرة، أو مستوية. @ar
definition: 将一个集体行为者与涉及制作浮雕、凹版或平版印刷表面的一个集体行为者的责任的一种载体表现关联起来。 @zh-hans

painaja (yhteistoimija) manifestaatiossa
has element type: 2
toolkit definition: A manifestation that involves a responsibility of a collective agent for manufacturing a printed manifestation that embodies text, notated music, cartographic content, notated movement, or still image content using a device that transfers ink or a similar medium to a surface. @en
toolkit definition: Basılı metin, notalı müzik veya daktilo ya da plakalardan diğer içerikleri üretmek için kolektif bir temsilcinin sorumluluğunu içeren bir gösterim. @tr
toolkit definition: Een manifestatie die met zich meebrengt een verantwoordelijkheid van een collectieve actor voor het vervaardigen van gedrukte tekst, bladmuziek of andere content vanaf zetsel of platen. @nl
toolkit definition: Egy megjelenési forma, amelyhez hozzátartozik egy kollektív ágens felelőssége nyomtatott szöveg, zenei lejegyzés vagy egyéb tartalom nyomdai szedésből vagy lemezekből történő gyártásáért. @hu
toolkit definition: Eine Manifestation, bei der ein gemeinschaftlicher Akteur für die Herstellung von gedrucktem Text, Noten oder anderem Inhalt durch Drucktypen oder Druckformen verantwortlich ist. @de
toolkit definition: En manifestasjon som involverer et ansvar for en kollektiv agent i form av framstilling av trykt tekst, nedskrevet musikk eller annet innhold fra typer eller plater. @no
toolkit definition: Kehastus, mis sisaldab kollektiivi vastutust trükilaolt või -plaadilt teksti, nootide vm sisu trükkimise eest. @et
toolkit definition: Manifestaatio, jossa yhteistoimija on vastuussa painolaatalta tai -levyltä painetun tekstin, nuottiaineiston tai muun sisällön valmistamisesta.
toolkit definition: Manifestation qui comporte une responsabilité de la part d’un agent collectif consistant à fabriquer une manifestation imprimée matérialisant du texte, de la musique notée, un contenu cartographique, du mouvement noté ou un contenu visuel fixe à l’aide d’un dispositif qui transfère de l’encre ou un médium semblable sur une surface. @fr
toolkit definition: Manifestation, som involverer en kollektiv agents ansvar for fremstillingen af trykt tekst, noteret musik etc. fra typer eller plader. @da
toolkit definition: Manifestazione che implica una responsabilità di un agente collettivo per la produzione di testo, musica notata o altro contenuto a stampa a partire da caratteri o lastre. @it
toolkit definition: Manifestācija, kas ietver grupas atbildību par iespiesta teksta, nošu vai cita veida satura izgatavošanu no burtu salikuma vai plāksnēm. @lv
toolkit definition: Una manifestació que implica una responsabilitat d’un agent col·lectiu en la fabricació d’una manifestació impresa que materialitza text, música notada, contingut cartogràfic, moviment notat o contingut d’imatge fixa usant un mecanisme que transfereix tinta o un mitjà similar a una superfície. @ca
toolkit definition: تجسيدة تنطوي على مسئولية وكيل جماعي عن إنتاج نص مطبوع أو موسيقى مدونة أو محتوى من نوع أو من لوحات آخرى. @ar
toolkit definition: 涉及用活字或平版印刷文字、乐谱或其他内容的一个集体行为者的责任的一种载体表现 @zh-hans
toolkit label: Gemeinschaftlicher Akteur als Druckerin/Drucker von @de
toolkit label: Yazıcı kolektif temsilcisi @tr
toolkit label: agent collectif imprimeur de @fr
toolkit label: agent col·lectiu impressor de @ca
toolkit label: drukker-collectieve actor van @nl
toolkit label: ir iespiedējs (grupa) @lv
toolkit label: kollektiv agent, som er trykker af @da
toolkit label: nyomdász kollektív ágense: @hu
toolkit label: painaja (yhteistoimija) manifestaatiossa
toolkit label: printer collective agent of @en
toolkit label: stampatore agente collettivo di @it
toolkit label: trykker for (kollektiv agent) @no
toolkit label: trükkija (kollektiiv) kehastuses @et
toolkit label: τυπογράφος συλλογικός φορέας του @el
toolkit label: وكيل جماعي فني طباعة @ar
toolkit label: ……的印刷者集体行为者 @zh-hans
has subproperty: painaja (yhteisö) manifestaatiossa
has subproperty: painaja (suku) manifestaatiossa
has subproperty: P50652
lexical alias: printerCollectiveAgentOf.en
status: Published
type: Property
domain: C10011
label: er kollektiv agent, som er trykker af @da
label: er trykker for (kollektiv agent) @no
label: est un agent collectif imprimeur de @fr
label: ir iespiedējs (grupa) @lv
label: is drukker-collectieve actor van @nl
label: is printer collective agent of @en
label: ist gemeinschaftlicher Akteur als Druckerin/Drucker von @de
label: matbaacı kolektif temsilcisidir @tr
label: nyomdász kollektív ágense a következőnek: @hu
label: trükkija (kollektiiv) kehastuses @et
label: è stampatore agente collettivo di @it
label: és agent col·lectiu impressor de @ca
label: είναι τυπογράφος συλλογικός φορέας του @el
label: هو وكيل جماعي فني طباعة لـ @ar
label: 是……的印刷者集体行为者 @zh-hans
sub property of: painaja (toimija) manifestaatiossa
sub property of: valmistaja (yhteistoimija) manifestaatiossa
definition: Correla un agente collettivo a una manifestazione che implica una responsabilità di un agente collettivo per la produzione di testo, musica notata o altro contenuto a stampa a partire da caratteri o lastre. @it
definition: Hozzákapcsol egy kollektív ágenst egy megjelenési formához, amelyhez hozzátartozik egy kollektív ágens felelőssége nyomtatott szöveg, zenei lejegyzés vagy egyéb tartalom nyomdai szedésből vagy lemezekből történő gyártásáért. @hu
definition: Kolektif bir temsilciyi, yazı tipi veya plakalardan basılı metin, müzik notası veya diğer içerikleri üretmek için kolektif bir temsilcinin sorumluluğunu içeren bir gösterimle ilişkilendirir. @tr
definition: Liittää yhteistoimijan manifestaatioon, jossa yhteistoimija on vastuussa painolaatalta tai -levyltä painetun tekstin, nuottiaineiston tai muun sisällön valmistamisesta.
definition: Met un agent collectif en relation avec une manifestation qui comporte une responsabilité de la part d’un agent collectif consistant à fabriquer une manifestation imprimée matérialisant du texte, de la musique notée, un contenu cartographique, du mouvement noté ou un contenu visuel fixe à l’aide d’un dispositif qui transfère de l’encre ou un médium semblable sur une surface. @fr
definition: Relaciona un agent col·lectiu amb una manifestació que implica una responsabilitat d’un agent col·lectiu en la fabricació d’una manifestació impresa que materialitza text, música notada, contingut cartogràfic, moviment notat o contingut d’imatge fixa usant un mecanisme que transfereix tinta o un mitjà similar a una superfície. @ca
definition: Relateert een collectieve actor aan een manifestatie die met zich meebrengt een verantwoordelijkheid van een collectieve actor voor het vervaardigen van gedrukte tekst, bladmuziek of andere content vanaf zetsel of platen. @nl
definition: Relaterer en kollektiv agent til en manifestasjon som involverer et ansvar for en kollektiv agent i form av framstilling av trykt tekst, nedskrevet musikk eller annet innhold fra typer eller plater. @no
definition: Relaterer en kollektiv agent til en manifestation, som involverer en kollektiv agents ansvar for fremstillingen af trykt tekst, noteret musik etc. fra typer eller plader. @da
definition: Relates a collective agent to a manifestation that involves a responsibility of a collective agent for manufacturing a printed manifestation that embodies text, notated music, cartographic content, notated movement, or still image content using a device that transfers ink or a similar medium to a surface. @en
definition: Sasaista grupu ar manifestāciju, kas ietver grupas atbildību par iespiesta teksta, nošu vai cita veida satura izgatavošanu no burtu salikuma vai plāksnēm. @lv
definition: Seostab kollektiivi kehastusega, mis sisaldab kollektiivi vastutust trükilaolt või -plaadilt teksti, nootide vm sisu trükkimise eest. @et
definition: Setzt einen gemeinschaftlichen Akteur in Beziehung zu einer Manifestation, bei der ein gemeinschaftlicher Akteur für die Herstellung von gedrucktem Text, Noten oder anderem Inhalt durch Drucktypen oder Druckformen verantwortlich ist. @de
definition: يربط وكيلا جماعيا بتجسيدة تنطوي على مسئولية وكيل جماعي عن إنتاج نص مطبوع أو موسيقى مدونة أو محتوى من نوع أو من لوحات آخرى. @ar
definition: 将一个集体行为者与涉及用活字或平版印刷文字、乐谱或其他内容的一个集体行为者的责任的一种载体表现关联起来。 @zh-hans
scope note: Comprend la fabrication d’un livre, d’un journal, d’un magazine, d’un placard ou d’une partition. @fr
scope note: Inclou la fabricació d’un llibre, un diari, un magazín, un full solt o una partitura. @ca
scope note: Includes the manufacture of a book, newspaper, magazine, broadside, or score. @en

valaja (yhteistoimija) manifestaatiossa
has element type: 2
toolkit definition: A manifestation that involves a responsibility of a collective agent for pouring a liquid or molten substance into a mold and leaving it to solidify to take the shape of the mold. @en
toolkit definition: Een manifestatie die met zich meebrengt een verantwoordelijkheid van een collectieve actor voor het gieten van een vloeistof of gesmolten substantie in een mal en het laten stollen om de vorm van de mal aan te laten nemen. @nl
toolkit definition: Egy megjelenési forma, amelyhez hozzátartozik egy kollektív ágens felelőssége folyékony vagy olvasztott anyag öntőformába öntéséért, hogy az ott megszilárduljon és fölvegye az öntőforma formáját. @hu
toolkit definition: Eine Manifestation, bei der ein gemeinschaftlicher Akteur dafür verantwortlich ist, eine Flüssigkeit oder eine geschmolzene Substanz in eine Form zu gießen, die in der Gießform verbleibt, bis sie ausgehärtet ist. @de
toolkit definition: En manifestasjon som involverer et ansvar for en kollektiv agent i form av framstilling av trykt tekst, nedskrevet musikk eller annet innhold fra typer eller plater. @no
toolkit definition: Kehastus, mis sisaldab kollektiivi vastutust vedela või sulatatud materjali valuvormi valamise ja valuvormi kuju võtmiseks tahkuda laskmise eest. @et
toolkit definition: Manifestaatio, jonka valmistamisesta yhteistoimija on vastuussa muovaamalla sulatettua tai nestemäistä ainetta muotin avulla.
toolkit definition: Manifestació que implica una responsabilitat d’un agent col·lectiu en l’abocament d’un líquid o una substància fosa en un motlle tot deixant que se solidifiqui perquè prengui la forma del motlle. @ca
toolkit definition: Manifestation qui comporte une responsabilité de la part d’un agent collectif consistant à verser un liquide ou une substance fondue dans un moule et à laisser ce liquide ou cette substance se solidifier pour prendre la forme du moule. @fr
toolkit definition: Manifestation, som involverer en kollektiv agents ansvar for at hælde en væske eller et varmt, flydende stof i en form og lade det størkne, så det tager facon efter formen. @da
toolkit definition: Manifestazione che implica una responsabilità di un agente collettivo nel versare un liquido o sostanza fusa in uno stampo e lasciarlo solidificare per assumere la forma dello stampo. @it
toolkit definition: Manifestācija, kas ietver grupas atbildību par šķidruma vai izkausētas vielas ieliešanu veidnē un atstāšanu sacietēt, lai tā saglabātu formu. @lv
toolkit definition: Sıvı veya erimiş bir maddeyi bir kalıba dökmek ve kalıbın şeklini almak üzere katılaşmaya bırakmak için kolektif bir temsilcinin sorumluluğunu içeren bir gösterim. @tr
toolkit definition: تجسيدة تنطوي على مسئولية وكيل جماعي عن صب مادة سائلة أو مذابة في قالب وتركه ليتصلب ليأخذ شكل القالب. @ar
toolkit definition: 涉及将液体或融化的物质倒入模具中使其按模具固化成型的一个集体行为者的责任的一种载体表现 @zh-hans
toolkit label: Gemeinschaftlicher Akteur als Formgießerin/Formgießer von @de
toolkit label: agent collectif fondeur de @fr
toolkit label: agent col·lectiu emmotllador de @ca
toolkit label: caster collective agent of @en
toolkit label: dökümcü kolektif temsilcisi @tr
toolkit label: fonditore agente collettivo di @it
toolkit label: gieter-collectieve actor van @nl
toolkit label: ir atliešanas meistars (grupa) @lv
toolkit label: kollektiv agent, som er støber af @da
toolkit label: støper av (kollektiv agent) @no
toolkit label: valaja (kollektiiv) kehastuses @et
toolkit label: valaja (yhteistoimija) manifestaatiossa
toolkit label: öntvénykészítő kollektív ágense: @hu
toolkit label: χυτευτής συλλογικός φορέας του @el
toolkit label: وكيل جماعى عامل صب @ar
toolkit label: ……的铸造者集体行为者 @zh-hans
has subproperty: valaja (yhteisö) manifestaatiossa
has subproperty: valaja (suku) manifestaatiossa
has subproperty: P50653
lexical alias: casterCollectiveAgentOf.en
status: Published
type: Property
domain: C10011
label: dökümcü kolektif temsilcisidir @tr
label: er kollektiv agent, som er støber af @da
label: er støper av (kollektiv agent) @no
label: est un agent collectif fondeur de @fr
label: ir atliešanas meistars (grupa) @lv
label: is caster collective agent of @en
label: is gieter-collectieve actor van @nl
label: ist gemeinschaftlicher Akteur als Formgießerin/Formgießer von @de
label: valaja (kollektiiv) kehastuses @et
label: è fonditore agente collettivo di @it
label: és agent col·lectiu emmotllador de @ca
label: öntvénykészítő kollektív ágense a következőnek: @hu
label: είναι χυτευτής συλλογικός φορέας του @el
label: هو وكيل جماعى عامل صب لـ @ar
label: 是……的铸造者集体行为者 @zh-hans
sub property of: valaja (toimija) manifestaatiossa
sub property of: manifestaation tekijä (yhteistoimija) manifestaatiossa
definition: Correla un agente collettivo a una manifestazione che implica una responsabilità di un agente collettivo nel versare un liquido o sostanza fusa in uno stampo e lasciarlo solidificare per assumere la forma dello stampo. @it
definition: Hozzákapcsol egy kollektív ágenst egy megjelenési formához, amelyhez hozzátartozik egy kollektív ágens felelőssége folyékony vagy olvasztott anyag öntőformába öntéséért, hogy az ott megszilárduljon és fölvegye az öntőforma formáját. @hu
definition: Kolektif bir temsilciyi, sıvı veya erimiş bir maddeyi bir kalıba dökme ve kalıbın şeklini alması için katılaşmaya bırakma sorumluluğunu içeren bir gösterimle ilişkilendirir. @tr
definition: Liittää yhteistoimijan manifestaatioon, jonka valmistamisesta yhteistoimija on vastuussa muovaamalla sulatettua tai nestemäistä ainetta muotin avulla.
definition: Met un agent collectif en relation avec une manifestation qui comporte une responsabilité de la part d’un agent collectif consistant à verser un liquide ou une substance fondue dans un moule et à laisser ce liquide ou cette substance se solidifier pour prendre la forme du moule. @fr
definition: Relaciona un agent col·lectiu amb una manifestació que implica una responsabilitat d’un agent col·lectiu en l’abocament d’un líquid o una substància fosa en un motlle tot deixant que se solidifiqui perquè prengui la forma del motlle. @ca
definition: Relateert een collectieve actor aan een manifestatie die met zich meebrengt een verantwoordelijkheid van een collectieve actor voor het gieten van een vloeistof of gesmolten substantie in een mal en het laten stollen om de vorm van de mal aan te laten nemen. @nl
definition: Relaterer en kollektiv agent til en manifestasjon som involverer et ansvar for en kollektiv agent i form av framstilling av trykt tekst, nedskrevet musikk eller annet innhold fra typer eller plater. @no
definition: Relaterer en kollektiv agent til en manifestation, som involverer en kollektiv agents ansvar for at hælde en væske eller et varmt, flydende stof i en form og lade det størkne, så det tager facon efter formen. @da
definition: Relates a collective agent to a manifestation that involves a responsibility of a collective agent for pouring a liquid or molten substance into a mold and leaving it to solidify to take the shape of the mold. @en
definition: Sasaista grupu ar manifestāciju, kas ietver grupas atbildību par šķidruma vai izkausētas vielas ieliešanu veidnē un atstāšanu sacietēt, lai tā saglabātu formu. @lv
definition: Seostab kollektiivi kehastusega, mis sisaldab kollektiivi vastutust vedela või sulatatud materjali valuvormi valamise ja valuvormi kuju võtmiseks tahkuda laskmise eest. @et
definition: Setzt einen gemeinschaftlichen Akteur in Beziehung zu einer Manifestation, bei der ein gemeinschaftlicher Akteur dafür verantwortlich ist, eine Flüssigkeit oder eine geschmolzene Substanz in eine Form zu gießen, die in der Gießform verbleibt, bis sie ausgehärtet ist. @de
definition: يربط وكيلا جماعيا بتجسيدة تنطوي على مسئولية وكيل جماعي عن صب مادة سائلة أو مذابة في قالب وتركه ليتصلب ليأخذ شكل القالب. @ar
definition: 将一个集体行为者与涉及将液体或融化的物质倒入模具中使其按模具固化成型的一个集体行为者的责任的一种载体表现关联起来。 @zh-hans

litografi (yhteistoimija) manifestaatiossa
has element type: 2
toolkit definition: A manifestation that involves a responsibility of a collective agent for preparing a stone or plate for lithographic printing. @en
toolkit definition: Een manifestatie die met zich meebrengt een verantwoordelijkheid van een collectieve actor voor het prepareren van een steen of plaat voor lithografisch drukken. @nl
toolkit definition: Egy megjelenési forma, amelyhez hozzátartozik egy kollektív ágens felelőssége egy kő vagy lemez litográfiai nyomtatáshoz történő előkészítéséért. @hu
toolkit definition: Eine Manifestation, bei der ein gemeinschaftlicher Akteur für die Vorbereitung eines Steins oder einer Platte für lithografischen Druck verantwortlich ist. @de
toolkit definition: En manifestasjon som involverer et ansvar for en kollektiv agent i form av å klargjøre en stein eller plate for litografisk trykk. @no
toolkit definition: Kehastus, mis sisaldab kollektiivi vastutust kivi või plaadi litograafiliste tõmmiste jaoks ettevalmistamise eest. @et
toolkit definition: Litografik baskı için bir taş veya plaka hazırlamak için kolektif bir temsilcinin sorumluluğunu içeren bir gösterim. @tr
toolkit definition: Manifestaatio, jossa yhteistoimija on vastuussa litografiassa käytetyn kivilaatan tai muun painolaatan valmistamisesta.
toolkit definition: Manifestació que implica una responsabilitat d’un agent col·lectiu en la preparació d’una pedra o una planxa per a la impressió litogràfica. @ca
toolkit definition: Manifestation qui comporte une responsabilité de la part d’un agent collectif consistant à préparer une pierre ou une plaque pour l’impression lithographique. @fr
toolkit definition: Manifestation, som involverer en kollektiv agents ansvar for at klargøre en sten eller plade til litografisk trykning. @da
toolkit definition: Manifestazione che implica una responsabilità di un agente collettivo nel preparare una pietra o lastra per la stampa litografica. @it
toolkit definition: Manifestācija, kas ietver grupas atbildību par akmens vai iespiedplates sagatavošanu drukāšanai litogrāfijas tehnikā. @lv
toolkit definition: تجسيدة تنطوي على مسئولية وكيل جماعي عن تجهيز حجر أو لوح للطباعة الحجرية. @ar
toolkit definition: 涉及制作用于平版印刷的石头或平版的一个集体行为者的责任的一种载体表现 @zh-hans
toolkit label: Gemeinschaftlicher Akteur als Lithografin/Lithograf von @de
toolkit label: Taş basmacı kolektif temsilcisi @tr
toolkit label: agent collectif lithographe de @fr
toolkit label: agent col·lectiu litògraf de @ca
toolkit label: ir litogrāfs (grupa) @lv
toolkit label: kollektiv agent, som er litograf af @da
toolkit label: kőnyomatkészítő kollektív ágense: @hu
toolkit label: lithograaf-collectieve actor van @nl
toolkit label: lithographer collective agent of @en
toolkit label: litograaf (kollektiiv) kehastuses @et
toolkit label: litograf for (kollektiv agent) @no
toolkit label: litografi (yhteistoimija) manifestaatiossa
toolkit label: litografo agente collettivo di @it
toolkit label: λιθογράφος συλλογικός φορέας του @el
toolkit label: وكيل جماعي طبّاع على الحجر @ar
toolkit label: ……的平版制作者集体行为者 @zh-hans
has subproperty: litografi (yhteisö) manifestaatiossa
has subproperty: litografi (suku) manifestaatiossa
has subproperty: P50654
lexical alias: lithographerCollectiveAgentOf.en
status: Published
type: Property
domain: C10011
label: er kollektiv agent, som er litograf af @da
label: er litograf for (kollektiv agent) @no
label: est un agent collectif lithographe de @fr
label: ir litogrāfs (grupa) @lv
label: is lithograaf-collectieve actor van @nl
label: is lithographer collective agent of @en
label: ist gemeinschaftlicher Akteur als Lithografin/Lithograf von @de
label: kőnyomatkészítő kollektív ágense a következőnek: @hu
label: litograaf (kollektiiv) kehastuses @et
label: taş baskı sanatçısı kolektif temsilcisidir @tr
label: è litografo agente collettivo di @it
label: és agent col·lectiu litògraf de @ca
label: είναι λιθογράφος συλλογικός φορέας του @el
label: هو وكيل جماعي طبّاع على الحجر لـ @ar
label: 是……的平版制作者集体行为者 @zh-hans
sub property of: litografi (toimija) manifestaatiossa
sub property of: kuvalaatan valmistaja (yhteistoimija) manifestaatiossa
definition: Correla un agente collettivo a una manifestazione che implica una responsabilità di un agente collettivo nel preparare una pietra o lastra per la stampa litografica. @it
definition: Hozzákapcsol egy kollektív ágenst egy megjelenési formához, amelyhez hozzátartozik egy kollektív ágens felelőssége egy kő vagy lemez litográfiai nyomtatáshoz történő előkészítéséért. @hu
definition: Kolektif bir temsilciyi, litografik baskı için bir taş veya plaka hazırlama sorumluluğunu içeren bir gösterimle ilişkilendirir. @tr
definition: Liittää yhteistoimijan manifestaatioon, jossa yhteistoimija on vastuussa litografiassa käytetyn kivilaatan tai muun painolaatan valmistamisesta.
definition: Met un agent collectif en relation avec une manifestation qui comporte une responsabilité de la part d’un agent collectif consistant à préparer une pierre ou une plaque pour l’impression lithographique. @fr
definition: Relaciona un agent col·lectiu amb una manifestació que implica una responsabilitat d’un agent col·lectiu en la preparació d’una pedra o una planxa per a la impressió litogràfica. @ca
definition: Relateert een collectieve actor aan een manifestatie die met zich meebrengt een verantwoordelijkheid van een collectieve actor voor het prepareren van een steen of plaat voor lithografisch drukken. @nl
definition: Relaterer en kollektiv agent til en manifestasjon som involverer et ansvar for en kollektiv agent i form av å klargjøre en stein eller plate for litografisk trykk. @no
definition: Relaterer en kollektiv agent til en manifestation, som involverer en kollektiv agents ansvar for at klargøre en sten eller plade til litografisk trykning. @da
definition: Relates a collective agent to a manifestation that involves a responsibility of a collective agent for preparing a stone or plate for lithographic printing. @en
definition: Sasaista grupu ar manifestāciju, kas ietver grupas atbildību par akmens vai iespiedplates sagatavošanu drukāšanai litogrāfijas tehnikā. @lv
definition: Seostab kollektiivi kehastusega, mis sisaldab kollektiivi vastutust kivi või plaadi litograafiliste tõmmiste jaoks ettevalmistamise eest. @et
definition: Setzt einen gemeinschaftlichen Akteur in Beziehung zu einer Manifestation, bei der ein gemeinschaftlicher Akteur für die Vorbereitung eines Steins oder einer Platte für lithografischen Druck verantwortlich ist. @de
definition: يربط وكيلا جماعيا بتجسيدة تنطوي على مسئولية وكيل جماعي عن تجهيز حجر أو لوح للطباعة الحجرية. @ar
definition: 将一个集体行为者与涉及制作用于平版印刷的石头或平版的一个集体行为者的责任的一种载体表现关联起来。 @zh-hans
scope note: A lithographer includes a graphic artist creating a design directly on the surface from which printing will be done. @en
scope note: A litográfus egy grafikusművész, aki közvetlenül azon a felületen készít tervet, amelyről a nyomtatás történik. @hu
scope note: Bir taş baskı sanatçısı, baskının yapılacağı yüzey üzerinde doğrudan bir tasarım yaratan bir grafik sanatçısını da içerir. @tr
scope note: Darunter fallen Grafikerinnen/Grafiker, die ein Muster direkt auf der Oberfläche erstellen, von der aus gedruckt werden soll. @de
scope note: Een lithograaf omvat een grafisch kunstenaar die een ontwerp creëert direct op het oppervlak vanaf welke het drukken gedaan zal worden. @nl
scope note: En litograf inkluderer en grafiker som skaper et design direkte på overflaten som trykkingen vil bli gjort. @no
scope note: En litograf omfatter en grafiker, som skaber et design direkte på overfladen, hvorfra trykning vil blive udført. @da
scope note: Litograaf hõlmab ka graafikut, kes loob kujutise otse pinnale, millelt toimub trükkimine. @et

painolaatan valmistaja (yhteistoimija) manifestaatiossa
has element type: 2
toolkit definition: A manifestation that involves a responsibility of a collective agent for preparing plates used in the making of printed images or text. @en
toolkit definition: Basılı resimlerin veya metinlerin yapımında kullanılan kalıpların hazırlanması için kolektif bir temsilcinin sorumluluğunu içeren bir gösterim. @tr
toolkit definition: Een manifestatie die met zich meebrengt een verantwoordelijkheid van een collectieve actor voor het prepareren van platen gebruikt in de productie van gedrukte beelden of tekst. @nl
toolkit definition: Egy megjelenési forma, amelyhez hozzátartozik egy kollektív ágens felelőssége nyomólemezek előkészítéséért nyomtatott képek vagy szövegek előállításához. @hu
toolkit definition: Eine Manifestation, bei der ein gemeinschaftlicher Akteur für die Anfertigung von Druckformen für die Produktion von gedruckten Bildern oder gedrucktem Text verantwortlich ist. @de
toolkit definition: En manifestasjon som involverer et ansvar for en kollektiv agent i form av klargjøring av trykkplater som brukes ved produksjon av trykte bilder eller tekst. @no
toolkit definition: Kehastus, mis sisaldab kollektiivi vastutust piltide või teksti trükkimiseks mõeldud plaatide ettevalmistamise eest. @et
toolkit definition: Manifestaatio, jossa yhteistoimija on vastuussa painettujen kuvien tai tekstin tuottamisessa käytettyjen painolaattojen tai -levyjen valmistuksesta.
toolkit definition: Manifestació que implica una responsabilitat d’un agent col·lectiu en la preparació de les planxes usades en l’elaboració d’imatges impreses o text imprès. @ca
toolkit definition: Manifestation qui comporte une responsabilité de la part d’un agent collectif consistant à préparer les planches utilisées pour la réalisation d’images ou de textes imprimés. @fr
toolkit definition: Manifestation, som involverer en kollektiv agents ansvar for at forberede plader, som anvendes til fremstilling af trykte billeder eller tekst. @da
toolkit definition: Manifestazione che implica una responsabilità di un agente collettivo per la preparazione di lastre utilizzate nella produzione di immagini o testi a stampa. @it
toolkit definition: Manifestācija, kas ietver grupas atbildību par plākšņu sagatavošanu, ko izmanto iespiestu attēlu vai teksta izgatavošanā. @lv
toolkit definition: تجسيدة تنطوي على مسئولية وكيل جماعي عن تجهيز الأسطح المستخدمة في إنتاج صور أو نص مطبوع. @ar
toolkit definition: 涉及准备用于制作图像和/或文字印刷平版的一个集体行为者的责任的一种载体表现 @zh-hans
toolkit label: Gemeinschaftlicher Akteur als Druckformherstellerin/Druckformhersteller von @de
toolkit label: Plaka yapıcı kolektif temsilcisi @tr
toolkit label: agent collectif clicheur de @fr
toolkit label: agent col·lectiu gravador de planxes de @ca
toolkit label: ir presformas izgatavotājs (grupa) @lv
toolkit label: kollektiv agent, som er plademager af @da
toolkit label: nyomólemez-készítő kollektív ágense: @hu
toolkit label: painolaatan valmistaja (yhteistoimija) manifestaatiossa
toolkit label: plaatmaker-collectieve actor van @nl
toolkit label: platemaker collective agent of @en
toolkit label: preparatore di lastre agente collettivo di @it
toolkit label: trykkplatemaker for (kollektiv agent) @no
toolkit label: trükiplaadi valmistaja (kollektiiv) kehastuses @et
toolkit label: κατασκευαστής εκτυπωτικής πλάκας συλλογικός φορέας του @el
toolkit label: وكيل جماعي مُحضرلسطح طباعي @ar
toolkit label: ……的制版者集体行为者 @zh-hans
has subproperty: painolaatan valmistaja (yhteisö) manifestaatiossa
has subproperty: painolaatan valmistaja (suku) manifestaatiossa
has subproperty: P50655
lexical alias: platemakerCollectiveAgentOf.en
status: Published
type: Property
domain: C10011
label: er kollektiv agent, som er plademager af @da
label: er trykkplatemaker for (kollektiv agent) @no
label: est un agent collectif clicheur de @fr
label: ir presformas izgatavotājs (grupa) @lv
label: is plaatmaker-collectieve actor van @nl
label: is platemaker collective agent of @en
label: ist gemeinschaftlicher Akteur als Druckformherstellerin/Druckformhersteller von @de
label: levhacı kolektif temsilcisidir @tr
label: nyomólemez-készítő kollektív ágense a következőnek: @hu
label: trükiplaadi valmistaja (kollektiiv) kehastuses @et
label: è preparatore di lastre agente collettivo di @it
label: és agent col·lectiu gravador de planxes de @ca
label: είναι κατασκευαστής εκτυπωτικής πλάκας συλλογικός φορέας του @el
label: هو وكيل جماعي مُحضر لسطح طباعي لـ @ar
label: 是……的制版者集体行为者 @zh-hans
sub property of: painolaatan valmistaja (toimittaja) manifestaatiossa
sub property of: manifestaation tekijä (yhteistoimija) manifestaatiossa
definition: Correla un agente collettivo a una manifestazione che implica una responsabilità di un agente collettivo per la preparazione di lastre utilizzate nella produzione di immagini o testi a stampa. @it
definition: Hozzákapcsol egy kollektív ágenst egy megjelenési formához, amelyhez hozzátartozik egy kollektív ágens felelőssége nyomólemezek előkészítéséért nyomtatott képek vagy szövegek előállításához. @hu
definition: Kolektif bir temsilcinin, basılı görüntülerin veya metinlerin yapımında kullanılan kalıpların hazırlanmasına yönelik sorumluluğunu içeren bir gösterimle ilişkilendirir. @tr
definition: Liittää yhteistoimijan manifestaatioon, jossa yhteistoimija on vastuussa painettujen kuvien tai tekstin tuottamisessa käytettyjen painolaattojen tai -levyjen valmistuksesta.
definition: Met un agent collectif en relation avec une manifestation qui comporte une responsabilité de la part d’un agent collectif consistant à préparer les planches utilisées pour la réalisation d’images ou de textes imprimés. @fr
definition: Relaciona un agent col·lectiu amb una manifestació que implica una responsabilitat d’un agent col·lectiu en la preparació de les planxes usades en l’elaboració d’imatges impreses o text imprès. @ca
definition: Relateert een collectieve actor aan een manifestatie die met zich meebrengt een verantwoordelijkheid van een collectieve actor voor het prepareren van platen gebruikt in de productie van gedrukte beelden of tekst. @nl
definition: Relaterer en kollektiv agent til en manifestasjon som involverer et ansvar for en kollektiv agent i form av klargjøring av trykkplater som brukes ved produksjon av trykte bilder eller tekst. @no
definition: Relaterer en kollektiv agent til en manifestation, som involverer en kollektiv agents ansvar for at forberede plader, som anvendes til fremstilling af trykte billeder eller tekst. @da
definition: Relates a collective agent to a manifestation that involves a responsibility of a collective agent for preparing plates used in the making of printed images or text. @en
definition: Sasaista grupu ar manifestāciju, kas ietver grupas atbildību par plākšņu sagatavošanu, ko izmanto iespiestu attēlu vai teksta izgatavošanā. @lv
definition: Seostab kollektiivi kehastusega, mis sisaldab kollektiivi vastutust piltide või teksti trükkimiseks mõeldud plaatide ettevalmistamise eest. @et
definition: Setzt einen gemeinschaftlichen Akteur in Beziehung zu einer Manifestation, bei der ein gemeinschaftlicher Akteur für die Anfertigung von Druckformen für die Produktion von gedruckten Bildern oder gedrucktem Text verantwortlich ist. @de
definition: يربط وكيلا جماعيا بتجسيدة تنطوي على مسئولية وكيل جماعي عن تجهيز الأسطح المستخدمة في إنتاج صور أو نص مطبوع. @ar
definition: 将一个集体行为者与涉及准备用于制作图像和/或文字印刷平版的一个集体行为者的责任的一种载体表现关联起来。 @zh-hans

valmistaja (yhteistoimija) manifestaatiossa
has element type: 2
toolkit definition: A manifestation that involves a responsibility of a collective agent for printing, duplicating, casting, etc. @en
toolkit definition: Basım, çoğaltma, döküm vb. için kolektif bir temsilcinin sorumluluğunu içeren bir gösterim. @tr
toolkit definition: Een manifestatie die met zich meebrengt een verantwoordelijkheid van een collectieve actor voor drukken, vermenigvuldigen, gieten etc. @nl
toolkit definition: Egy megjelenési forma, amelyhez hozzátartozik egy kollektív ágens felelőssége nyomtatásért, sokszorosításért, öntésért, stb. @hu
toolkit definition: Eine Manifestation, bei der ein gemeinschaftlicher Akteur für den Druck, die Vervielfältigung, den Guss und so weiter verantwortlich ist. @de
toolkit definition: En manifestasjon som involverer et ansvar for en kollektiv agent i form av trykking, mangfoldiggjøring, kasting etc. @no
toolkit definition: Kehastus, mis sisaldab kollektiivi vastutust trükkimise, paljundamise, valamise vms eest. @et
toolkit definition: Manifestaatio, jonka painamisesta, monistamisesta, kirjasinten valamisesta tms. yhteistoimija on vastuussa.
toolkit definition: Manifestació que implica una responsabilitat d’un agent col·lectiu en la impressió, la reproducció, el modelat, etc. @ca
toolkit definition: Manifestation qui comporte une responsabilité de la part d’un agent collectif en ce qui concerne l’impression, la reproduction, le moulage, etc. @fr
toolkit definition: Manifestation, som involverer en kollektiv agents ansvar for trykning, duplikering, støbning etc. @da
toolkit definition: Manifestazione che implica una responsabilità di un agente collettivo per la stampa, duplicazione, fusione, etc. @it
toolkit definition: Manifestācija, kas ietver grupas atbildību par iespiešanu, pavairošanu u.tml. @lv
toolkit definition: تجسيدة تنطوي على مسئولية وكيل جماعي عن الطباعة أو النسخ أو الصب أو ما إلى ذلك. @ar
toolkit definition: 涉及印刷、复制、铸造等的一个集体行为者的责任的一种载体表现 @zh-hans
toolkit label: Gemeinschaftlicher Akteur als Herstellerin/Hersteller von @de
toolkit label: agent collectif fabricant de @fr
toolkit label: agent col·lectiu fabricant de @ca
toolkit label: gyártó kollektív ágense a következő: @hu
toolkit label: ir ražotājs (grupa) @lv
toolkit label: kollektiv agent, som er producent af @da
toolkit label: manifattura agente collettivo di @it
toolkit label: manufacturer collective agent of @en
toolkit label: tilvirker av (kollektiv agent) @no
toolkit label: valmistaja (kollektiiv) kehastuses @et
toolkit label: valmistaja (yhteistoimija) manifestaatiossa
toolkit label: vervaardiger-collectieve actor van @nl
toolkit label: İmalatçı kolektif temsilcisi @tr
toolkit label: κατασκευαστής συλλογικός φορέας του @el
toolkit label: وكيل جماعي مُصنع @ar
toolkit label: ……的生产者集体行为者 @zh-hans
has subproperty: pistekirjoituksen tekijä (yhteistoimija) manifestaatiossa
has subproperty: painaja (yhteistoimija) manifestaatiossa
has subproperty: valmistaja (yhteisö) manifestaatiossa
has subproperty: valmistaja (suku) manifestaatiossa
has subproperty: P50656
lexical alias: manufacturerCollectiveAgentOf.en
status: Published
type: Property
domain: C10011
label: er kollektiv agent, som er producent af @da
label: er tilvirker av (kollektiv agent) @no
label: est un agent collectif fabricant de @fr
label: gyártó kollektív ágense a következő: @hu
label: ir ražotājs (grupa) @lv
label: is manufacturer collective agent of @en
label: is vervaardiger-collectieve actor van @nl
label: ist gemeinschaftlicher Akteur als Herstellerin/Hersteller von @de
label: valmistaja (kollektiiv) kehastuses @et
label: è manifattura agente collettivo di @it
label: és agent col·lectiu fabricant de @ca
label: üretici kolektif temsilcisidir @tr
label: είναι κατασκευαστής συλλογικός φορέας του @el
label: هو وكيل جماعي مُصنّع لـ @ar
label: 是……的生产者集体行为者 @zh-hans
sub property of: valmistaja (toimija) manifestaatiossa
sub property of: yhteistoimijaan liittyvä manifestaatio
definition: Correla un agente collettivo a una manifestazione di un agente collettivo che implica una responsabilità per la stampa, duplicazione, fusione, etc. @it
definition: Hozzákapcsol egy kollektív ágenst egy megjelenési formához, amelyhez hozzátartozik egy kollektív ágens felelőssége nyomtatásért, sokszorosításért, öntésért, stb. @hu
definition: Kolektif bir temsilciyi, kolektif bir temsilcinin baskı, çoğaltma, döküm vb. sorumluğunu içeren bir gösterimle ilişkilendirir. @tr
definition: Liittää yhteistoimijan manifestaatioon, jonka painamisesta, monistamisesta, kirjasinten valamisesta tms. yhteistoimija on vastuussa.
definition: Met un agent collectif en relation avec une manifestation qui comporte une responsabilité de la part d’un agent collectif en ce qui concerne l’impression, la reproduction, le moulage, etc. @fr
definition: Relaciona un agent col·lectiu amb una manifestació d’un agent col·lectiu que implica una responsabilitat en la impressió, la reproducció, el modelat, etc. @ca
definition: Relateert een collectieve actor aan een manifestatie die met zich meebrengt een verantwoordelijkheid van een collectieve actor voor drukken, vermenigvuldigen, gieten etc. @nl
definition: Relaterer en kollektiv agent til en manifestasjon som involverer et ansvar for en kollektiv agent i form av trykking, mangfoldiggjøring, kasting etc. @no
definition: Relaterer en kollektiv agent til en manifestation, som involverer en kollektiv agents ansvar for trykning, duplikering, støbning etc. @da
definition: Relates a collective agent to a manifestation by a collective agent that involves a responsibility for printing, duplicating, casting, etc. @en
definition: Sasaista grupu ar manifestāciju, kas ietver grupas atbildību par iespiešanu, pavairošanu u.tml. @lv
definition: Seostab kollektiivi kehastusega, mis sisaldab kollektiivi vastutust trükkimise, paljundamise, valamise vms eest. @et
definition: Setzt einen gemeinschaftlichen Akteur in Beziehung zu einer Manifestation, bei der ein gemeinschaftlicher Akteur für den Druck, die Vervielfältigung, den Guss und so weiter verantwortlich ist. @de
definition: يربط وكيلا جماعيا بتجسيدة من جانب وكيل جماعي مسئول عن الطباعة أو النسخ أو الصب، الخ. @ar
definition: 将一个集体行为者与涉及印刷、复制、铸造等的一个集体行为者的责任的一种载体表现关联起来。 @zh-hans

paperinvalmistaja (yhteistoimija) manifestaatiossa
has element type: 2
toolkit definition: A manifestation that involves a responsibility of a collective agent for making paper. @en
toolkit definition: Een manifestatie die met zich meebrengt een verantwoordelijkheid van een collectieve actor voor productie van papier. @nl
toolkit definition: Egy megjelenési forma, amelyhez hozzátartozik egy kollektív ágens felelőssége a papír előállításáért. @hu
toolkit definition: Eine Manifestation, bei der ein gemeinschaftlicher Akteur für die Produktion von Papier verantwortlich ist. @de
toolkit definition: En manifestasjon som involverer et ansvar for en kollektiv agent i form av å produsere papir. @no
toolkit definition: Kehastus, mis sisaldab kollektiivi vastutust paberi tootmise eest. @et
toolkit definition: Kâğıt yapmak için kolektif bir temsilcinin sorumluluğunu içeren bir gösterim. @tr
toolkit definition: Manifestaatio, jossa käytettävän paperin valmistamisesta yhteistoimija on vastuussa.
toolkit definition: Manifestació que implica una responsabilitat d’un agent col·lectiu en l’elaboració del paper. @ca
toolkit definition: Manifestation qui comporte une responsabilité de la part d’un agent collectif consistant à confectionner du papier. @fr
toolkit definition: Manifestation, som involverer en kollektiv agents ansvar for at producere papir. @da
toolkit definition: Manifestazione che implica una responsabilità di un agente collettivo per la produzione di carta. @it
toolkit definition: Manifestācija, kas ietver grupas atbildību par papīra izgatavošanu. @lv
toolkit definition: تجسيدة تنطوي على مسئولية وكيل جماعي عن إنتاج الورق. @ar
toolkit definition: 涉及一个造纸的一个集体行为者的责任的一种载体表现 @zh-hans
toolkit label: Gemeinschaftlicher Akteur als Papiermacherin/Papiermacher von @de
toolkit label: Kağıt üretici kolektif temsilcisi @tr
toolkit label: agent collectif papetier de @fr
toolkit label: agent col·lectiu paperer de @ca
toolkit label: cartaio agente collettivo di @it
toolkit label: ir papīra izgatavotājs (grupa) @lv
toolkit label: kollektiv agent, som er papirproducent af @da
toolkit label: paberivalmistaja (kollektiiv) kehastuses @et
toolkit label: paperinvalmistaja (yhteistoimija) manifestaatiossa
toolkit label: papermaker collective agent of @en
toolkit label: papiermaker-collectieve actor van @nl
toolkit label: papirprodusent for (kollektiv agent) @no
toolkit label: papírgyártó kollektív ágense: @hu
toolkit label: χαρτοποιός συλλογικός φορέας του @el
toolkit label: وكيل جماعي صانع الورق @ar
toolkit label: ……的造纸者集体行为者 @zh-hans
has subproperty: paperinvalmistaja (yhteisö) manifestaatiossa
has subproperty: paperinvalmistaja (suku) manifestaatiossa
has subproperty: P50657
lexical alias: papermakerCollectiveAgentOf.en
status: Published
type: Property
domain: C10011
label: er kollektiv agent, som er papirproducent af @da
label: er papirprodusent for (kollektiv agent) @no
label: est un agent collectif papetier de @fr
label: ir papīra izgatavotājs (grupa) @lv
label: is papermaker collective agent of @en
label: is papiermaker-collectieve actor van @nl
label: ist gemeinschaftlicher Akteur als Papiermacherin/Papiermacher von @de
label: kağıt üreticisi kolektif temsilcisidir @tr
label: paberivalmistaja (kollektiiv) kehastuses @et
label: papírgyártó kollektív ágense a következőnek: @hu
label: è cartaio agente collettivo di @it
label: és agent col·lectiu paperer de @ca
label: είναι χαρτοποιός συλλογικός φορέας του @el
label: هو وكيل جماعي صانع الورق لـ @ar
label: 是……的造纸者集体行为者 @zh-hans
sub property of: paperinvalmistaja (toimija) manifestaatiossa
sub property of: yhteistoimijaan liittyvä manifestaatio
definition: Correla un agente collettivo a una manifestazione che implica una responsabilità di un agente collettivo per la produzione di carta. @it
definition: Hozzákapcsol egy kollektív ágenst egy megjelenési formához, amelyhez hozzátartozik egy kollektív ágens felelőssége a papír előállításáért. @hu
definition: Kolektif bir temsilciyi, kağıt yapmak için kolektif bir temsilcinin sorumluluğunu içeren bir gösterimle ilişkilendirir. @tr
definition: Liittää yhteistoimijan manifestaatioon, jossa käytettävän paperin valmistamisesta yhteistoimija on vastuussa.
definition: Met un agent collectif en relation avec une manifestation qui comporte une responsabilité de la part d’un agent collectif consistant à confectionner du papier. @fr
definition: Relaciona un agent col·lectiu amb una manifestació que implica una responsabilitat d’un agent col·lectiu en l’elaboració del paper. @ca
definition: Relateert een collectieve actor aan een manifestatie die met zich meebrengt een verantwoordelijkheid van een collectieve actor voor productie van papier. @nl
definition: Relaterer en kollektiv agent til en manifestasjon som involverer et ansvar for en kollektiv agent i form av å produsere papir. @no
definition: Relaterer en kollektiv agent til en manifestation, som involverer en kollektiv agents ansvar for at producere papir. @da
definition: Relates a collective agent to a manifestation that involves a responsibility of a collective agent for making paper. @en
definition: Sasaista grupu ar manifestāciju, kas ietver grupas atbildību par papīra izgatavošanu. @lv
definition: Seostab kollektiivi kehastusega, mis sisaldab kollektiivi vastutust paberi tootmise eest. @et
definition: Setzt einen gemeinschaftlichen Akteur in Beziehung zu einer Manifestation, bei der ein gemeinschaftlicher Akteur für die Produktion von Papier verantwortlich ist. @de
definition: يربط وكيلا جماعيا بتجسيدة تنطوي على مسئولية وكيل جماعي عن إنتاج الورق. @ar
definition: 将一个集体行为者与涉及一个造纸的一个集体行为者的责任的一种载体表现关联起来。 @zh-hans

kustantaja (yhteistoimija) manifestaatiossa
has element type: 2
toolkit definition: A manifestation that involves a responsibility of a collective agent for publishing, releasing, or issuing. @en
toolkit definition: Een manifestatie die met zich meebrengt een verantwoordelijkheid van een collectieve actor voor uitgeven, uitbrengen of uitvaardigen. @nl
toolkit definition: Egy megjelenési forma, amelyhez hozzátartozik egy kollektív ágens felelőssége közzétételért, kiadásért vagy kibocsátásért. @hu
toolkit definition: Eine Manifestation, bei der ein gemeinschaftlicher Akteur für das Veröffentlichen, die Freigabe oder die Herausgabe verantwortlich ist. @de
toolkit definition: En manifestasjon som involverer et ansvar for en kollektiv agent i form av publisering, tilgjengeliggjøring eller utgivelse. @no
toolkit definition: Kehastus, mis sisaldab kollektiivi vastutust avaldamise, väljalaskmise või väljaandmise eest. @et
toolkit definition: Manifestaatio, jonka kustantamisesta, julkaisemisesta tai ilmestymisestä yhteistoimija on vastuussa.
toolkit definition: Manifestació que implica una responsabilitat d’un agent col·lectiu en la publicació, la posada en circulació o l’emissió. @ca
toolkit definition: Manifestation qui comporte une responsabilité de la part d’un agent collectif en ce qui concerne la publication, la mise à disposition ou l’édition. @fr
toolkit definition: Manifestation, som involverer en kollektiv agents ansvar for publicering, frigivelse eller udgivelse. @da
toolkit definition: Manifestazione che implica una responsabilità di un agente collettivo per la pubblicazione, distribuzione o emissione. @it
toolkit definition: Manifestācija, kas ietver grupas atbildību par publicēšanu, izlaišanu vai izdošanu. @lv
toolkit definition: Yayıncılık veya ihraç için kolektif temsilcinin sorumluluğunu içeren gösterim. @tr
toolkit definition: تجسيدة تنطوي على مسئولية وكيل جماعي عن النشر، التحرير، أو الإصدار. @ar
toolkit definition: 涉及出版、发布或发行的一个集体行为者的责任的一种载体表现 @zh-hans
toolkit label: Gemeinschaftlicher Akteur als Verlag von @de
toolkit label: Yayımcı kolektif temsilcisi @tr
toolkit label: agent collectif éditeur de @fr
toolkit label: agent col·lectiu editor de @ca
toolkit label: editore agente collettivo di @it
toolkit label: ir izdevējs (grupa) @lv
toolkit label: kiadó kollektív ágense a következő: @hu
toolkit label: kirjastaja (kollektiiv) kehastuses @et
toolkit label: kollektiv agent, som er udgiver af @da
toolkit label: kustantaja (yhteistoimija) manifestaatiossa
toolkit label: publisher collective agent of @en
toolkit label: uitgever-collectieve actor van @nl
toolkit label: utgiver av (kollektiv agent) @no
toolkit label: εκδότης συλλογικός φορέας του @el
toolkit label: وكيل جماعي ناشر @ar
toolkit label: ……的出版者集体行为者 @zh-hans
has subproperty: lähetyksestä vastaava yhteistoimija manifestaatiossa
has subproperty: kustantaja (yhteisö) manifestaatiossa
has subproperty: kustantaja (suku) manifestaatiossa
has subproperty: P50658
lexical alias: publisherCollectiveAgentOf.en
status: Published
type: Property
domain: C10011
label: er kollektiv agent, som er udgiver af @da
label: er utgiver av (kollektiv agent) @no
label: est un agent collectif éditeur de @fr
label: ir izdevējs (grupa) @lv
label: is publisher collective agent of @en
label: is uitgever-collectieve actor van @nl
label: ist gemeinschaftlicher Akteur als Verlag von @de
label: kiadó kollektív ágense a következő: @hu
label: kirjastaja (kollektiiv) kehastuses @et
label: yayıncı kolektif temsilcisidir @tr
label: è editore agente collettivo di @it
label: és agent col·lectiu editor de @ca
label: είναι εκδότης συλλογικός φορέας του @el
label: هو وكيل جماعي ناشر لـ @ar
label: 是……的出版者集体行为者 @zh-hans
sub property of: kustantaja (toimija) manifestaatiossa
sub property of: manifestaation tekijä (yhteistoimija) manifestaatiossa
definition: Correla un agente collettivo a una manifestazione che implica una responsabilità di un agente collettivo per la pubblicazione, distribuzione o emissione. @it
definition: Hozzákapcsol egy kollektív ágenst egy megjelenési formához, amelyhez hozzátartozik egy kollektív ágens felelőssége közzétételért, kiadásért vagy kibocsátásért. @hu
definition: Kolektif bir temsilciyi, bir kolektif temsilcinin yayıncılık, satış, ya da ihraç etme sorumluluğunu içeren bir gösterimle ilişkilendirir. @tr
definition: Liittää yhteistoimijan manifestaatioon, jonka kustantamisesta, julkaisemisesta tai ilmestymisestä yhteistoimija on vastuussa.
definition: Met un agent collectif en relation avec une manifestation qui comporte une responsabilité de la part d’un agent collectif en ce qui concerne la publication, la mise à disposition ou l’édition. @fr
definition: Relaciona un agent col·lectiu amb una manifestació que implica una responsabilitat d’un agent col·lectiu en la publicació, la posada en circulació o l’emissió. @ca
definition: Relateert een collectieve actor aan een manifestatie die met zich meebrengt een verantwoordelijkheid van een collectieve actor voor uitgeven, uitbrengen of uitvaardigen. @nl
definition: Relaterer en kollektiv agent til en manifestasjon som involverer et ansvar for en kollektiv agent i form av publisering, tilgjengeliggjøring eller utgivelse. @no
definition: Relaterer en kollektiv agent til en manifestation, som involverer en kollektiv agents ansvar for publicering, frigivelse eller udgivelse. @da
definition: Relates a collective agent to a manifestation that involves a responsibility of a collective agent for publishing, releasing, or issuing. @en
definition: Sasaista grupu ar manifestāciju, kas ietver grupas atbildību par publicēšanu, izlaišanu vai izdošanu. @lv
definition: Seostab kollektiivi kehastusega, mis sisaldab kollektiivi vastutust avaldamise, väljalaskmise või väljaandmise eest. @et
definition: Setzt einen gemeinschaftlichen Akteur in Beziehung zu einer Manifestation, bei der ein gemeinschaftlicher Akteur für das Veröffentlichen, die Freigabe oder die Herausgabe verantwortlich ist. @de
definition: يربط وكيلا جماعيا بتجسيدة تنطوي على مسئولية وكيل جماعي عن النشر، التحرير، أو الإصدار. @ar
definition: 将一个集体行为者与涉及出版、发布或发行的一个集体行为者的责任的一种载体表现关联起来。 @zh-hans

etsaaja (yhteistoimija) manifestaatiossa
has element type: 2
toolkit definition: A manifestation that involves a responsibility of a collective agent for subjecting metal, glass, or some other surface used for printing, to acid or another corrosive substance. @en
toolkit definition: Een manifestatie die met zich meebrengt een verantwoordelijkheid van een collectieve actor voor het onderwerpen van metaal, glas of een ander oppervlak gebruikt voor drukken, aan zuur of andere bijtende substantie. @nl
toolkit definition: Egy megjelenési forma, amelyhez hozzátartozik egy kollektív ágens felelőssége nyomtatáshoz használt fém-, üveg- vagy valamilyen más felület savnak vagy más maró anyagnak történő alávetéséért. @hu
toolkit definition: Eine Manifestation, bei der ein gemeinschaftlicher Akteur dafür verantwortlich ist, Metall, Glas oder eine andere Oberfläche, die zum Drucken benutzt wird, mit Säure oder einer anderen ätzenden Substanz zu behandeln. @de
toolkit definition: En manifestasjon som involverer et ansvar for en kollektiv agent i form av å utsette metall, glass eller et annet overflatemateriale som brukes til trykking, for syre eller et annet etsende stoff. @no
toolkit definition: Kehastus, mis sisaldab kollektiivi vastutust trükkimiseks kasutatava metallist, klaasist või muust materjalist pinna töötlemise eest happe või muu söövitava ainega. @et
toolkit definition: Manifestaatio, jossa yhteistoimija on vastuussa metallin, lasin tms. pinnan etsaamisesta hapon tai muun syövyttävän aineen avulla.
toolkit definition: Manifestació que implica una responsabilitat d’un agent col·lectiu sotmetent a l’àcid, o a qualsevol altra substància corrosiva, el metall, el vidre o qualsevol altra superfície usada en la impressió. @ca
toolkit definition: Manifestation qui comporte une responsabilité de la part d’un agent collectif consistant à soumettre à l’acide ou à une autre substance corrosive du métal, du verre ou une autre surface utilisée pour l’impression. @fr
toolkit definition: Manifestation, som involverer en kollektiv agents ansvar for at udsætte metal, glas eller en anden overflade, som anvendes til trykning, for syre eller et andet ætsende stof. @da
toolkit definition: Manifestazione che implica una responsabilità di un agente collettivo per l'esposizione di metallo, vetro o altra superficie utilizzata per la stampa, all'acido o altra sostanza corrosiva. @it
toolkit definition: Manifestācija, kas ietver grupas atbildību par metāla, stikla vai citas virsmas pakļaušanu skābei vai citai kodīgai vielai, kas tikusi izmantota drukāšanai. @lv
toolkit definition: Metal, cam veya baskı için kullanılan diğer bazı yüzeyleri asit veya başka bir aşındırıcı maddeye maruz bırakmak için kolektif bir temsilcinin sorumluluğunu içeren bir gösterim. @tr
toolkit definition: تجسيدة تنطوي على مسئولية وكيل جماعيعن غمر معدن أو زجاج أو أي سطح آخر يستخدم للطباعة، في حامض، أو في أي مادة أخرى كاوية. @ar
toolkit definition: 涉及使用酸或其他腐蚀性物质施于用来印刷的金属、玻璃或其他表面上的一个集体行为者的责任的一种载体表现 @zh-hans
toolkit label: Gemeinschaftlicher Akteur als Radiererin/Radierer von @de
toolkit label: acquafortista agente collettivo di @it
toolkit label: agent collectif aquafortiste de @fr
toolkit label: agent col·lectiu aiguafortista de @ca
toolkit label: etcher collective agent of @en
toolkit label: etsaaja (yhteistoimija) manifestaatiossa
toolkit label: etser av (kollektiv agent) @no
toolkit label: etser-collectieve actor van @nl
toolkit label: ir ofortists (grupa) @lv
toolkit label: karckészítő kollektív ágense: @hu
toolkit label: kollektiv agent, som er raderer af @da
toolkit label: oymacı kolektif temsilcisi @tr
toolkit label: söövitaja (kollektiiv) kehastuses @et
toolkit label: οξυγράφος συλλογικός φορέας του @el
toolkit label: وكيل جماعي حَفَّار بالزِنْكُوغْراف (الكليشيهات) @ar
toolkit label: ……的蚀刻者行为者 @zh-hans
has subproperty: etsaaja (yhteisö) manifestaatiossa
has subproperty: etsaaja (suku) manifestaatiossa
has subproperty: P50659
lexical alias: etcherCollectiveAgentOf.en
status: Published
type: Property
domain: C10011
label: er etser av (kollektiv agent) @no
label: er kollektiv agent, som er raderer af @da
label: est un agent collectif aquafortiste de @fr
label: ir ofortists (grupa) @lv
label: is etcher collective agent of @en
label: is etser-collectieve actor van @nl
label: ist gemeinschaftlicher Akteur als Radiererin/Radierer von @de
label: karckészítő kollektív ágense a következőnek: @hu
label: oymacı kolektif temsilcisidir @tr
label: söövitaja (kollektiiv) kehastuses @et
label: è acquafortista agente collettivo di @it
label: és agent col·lectiu aiguafortista de @ca
label: είναι οξυγράφος συλλογικός φορέας του @el
label: هو وكيل جماعي حَفَّارُ بالزِنْكُوغْراف (الكليشيهات) لـ @ar
label: 是……的蚀刻者行为者 @zh-hans
sub property of: etsaaja (toimija) mainifestaatiossa
sub property of: kuvalaatan valmistaja (yhteistoimija) manifestaatiossa
definition: Correla un agente collettivo a una manifestazione che implica una responsabilità di un agente collettivo per l'esposizione di metallo, vetro o altra superficie utilizzata per la stampa, all'acido o altra sostanza corrosiva. @it
definition: Hozzákapcsol egy kollektív ágenst egy megjelenési formához, amelyhez hozzátartozik egy kollektív ágens felelőssége nyomtatáshoz használt fém-, üveg- vagy valamilyen más felület savnak vagy más maró anyagnak történő alávetéséért. @hu
definition: Kolektif bir temsilciyi, baskı için kullanılan metal, cam veya diğer bazı yüzeyleri asit veya başka bir aşındırıcı maddeye maruz bırakması sorumluluğunu içeren gösterimle ilişkilendirir. @tr
definition: Liittää yhteistoimijan manifestaatioon, jossa yhteistoimija on vastuussa metallin, lasin tms. pinnan etsaamisesta hapon tai muun syövyttävän aineen avulla.
definition: Met un agent collectif en relation avec une manifestation qui comporte une responsabilité de la part d’un agent collectif consistant à soumettre à l’acide ou à une autre substance corrosive du métal, du verre ou une autre surface utilisée pour l’impression. @fr
definition: Relaciona un agent col·lectiu amb una manifestació que implica una responsabilitat d’un agent col·lectiu sotmetent a l’àcid, o a qualsevol altra substància corrosiva, el metall, el vidre o qualsevol altra superfície usada en la impressió. @ca
definition: Relateert een collectieve actor aan een manifestatie die met zich meebrengt een verantwoordelijkheid van een collectieve actor voor het onderwerpen van metaal, glas of een ander oppervlak gebruikt voor drukken, aan zuur of andere bijtende substantie. @nl
definition: Relaterer en kollektiv agent til en manifestasjon som involverer et ansvar for en kollektiv agent i form av å utsette metall, glass eller et annet overflatemateriale som brukes til trykking, for syre eller et annet etsende stoff. @no
definition: Relaterer en kollektiv agent til en manifestation, som involverer en kollektiv agents ansvar for at udsætte metal, glas eller en anden overflade, som anvendes til trykning, for syre eller et andet ætsende stof. @da
definition: Relates a collective agent to a manifestation that involves a responsibility of a collective agent for subjecting metal, glass, or some other surface used for printing, to acid or another corrosive substance. @en
definition: Sasaista grupu ar manifestāciju, kas ietver grupas atbildību par metāla, stikla vai citas virsmas pakļaušanu skābei vai citai kodīgai vielai, kas tikusi izmantota drukāšanai. @lv
definition: Seostab kollektiivi kehastusega, mis sisaldab kollektiivi vastutust trükkimiseks kasutatava metallist, klaasist või muust materjalist pinna töötlemise eest happe või muu söövitava ainega. @et
definition: Setzt einen gemeinschaftlichen Akteur in Beziehung zu einer Manifestation, bei der ein gemeinschaftlicher Akteur dafür verantwortlich ist, Metall, Glas oder eine andere Oberfläche, die zum Drucken benutzt wird, mit Säure oder einer anderen ätzenden Substanz zu behandeln. @de
definition: يربط وكيلا جماعيا بتجسيدة تنطوي على مسئولية وكيل جماعي عن غمر معدن أو زجاج أو أي سطح آخر يستخدم للطباعة، في حامض، أو في أي مادة أخرى كاوية. @ar
definition: 将一个集体行为者与涉及使用酸或其他腐蚀性物质施于用来印刷的金属、玻璃或其他表面上的一个集体行为者的责任的一种载体表现关联起来。 @zh-hans

graafinen suunnittelija (yhteistoimija) manifestaatiossa
has element type: 2
toolkit definition: A manifestation that involves a responsibility of a collective agent for the entire graphic design of a book, including arrangement of type and illustration, choice of materials, and process used. @en
toolkit definition: Een manifestatie die met zich meebrengt een verantwoordelijkheid van een collectieve actor voor het complete grafische ontwerp van een boek, inclusief indeling van font en illustratie, keuze van materialen en gebruikte methode. @nl
toolkit definition: Egy megjelenési forma, amelyhez hozzátartozik egy kollektív ágens felelőssége egy könyv teljes grafikai tervezéséért, beleértve a nyomdai betűtípus és az illusztrációk elrendezését, az anyagválasztást és az alkalmazott eljárást. @hu
toolkit definition: Eine Manifestation, bei der ein gemeinschaftlicher Akteur für das gesamte grafische Design eines Buchs, einschließlich Schriftbild, Bildgestaltung, Materialwahl und angewandter Verfahren, verantwortlich ist. @de
toolkit definition: En manifestasjon som involverer et ansvar for en kollektiv agent i form av ansvar for hele den grafiske utformingen av en bok, inkludert oppsett av skrifttype og illustrasjoner, valg av materialer og hvilke prosesser som brukes. @no
toolkit definition: Kehastus, mis sisaldab kollektiivi vastutust raamatu graafilise kujunduse eest, sealhulgas trükiteksti ja illustratsioonide paigutuse, materjalide valiku ja valmistamismenetluste eest. @et
toolkit definition: Manifestaatio, jossa yhteistoimija on vastuussa koko kirjan graafisesta suunnittelusta, taitosta, materiaalien valinnasta ja käytettävistä valmistusmenetelmistä.
toolkit definition: Manifestació que implica una responsabilitat d’un agent col·lectiu en tot el disseny gràfic d’un llibre, inclosa la composició tipogràfica i la il·lustració, la tria dels materials i el procés utilitzat. @ca
toolkit definition: Manifestation qui comporte une responsabilité de la part d’un agent collectif en ce qui concerne toute la conception graphique d’un livre, y compris la composition typographique, l’arrangement des illustrations, le choix des matériaux et le procédé utilisé. @fr
toolkit definition: Manifestation, som involverer en kollektiv agents ansvar for hele det grafiske design af en bog, inkl. opsætning af tekst og illustrationer, materialevalg og anvendt proces. @da
toolkit definition: Manifestazione che implica una responsabilità di un agente collettivo nell'intera progettazione grafica di un libro, inclusa la disposizione dei caratteri e dell'illustrazione, la scelta dei materiali e il processo utilizzato. @it
toolkit definition: Manifestācija, kas ietver grupas atbildību par grāmatas grafisko dizainu, tajā skaitā par izkātojuma veidu un ilustrācijām, materiālu izvēli un izmantoto procesu. @lv
toolkit definition: Şekil ve çizim düzenlemesi, malzeme seçimi ve kullanılan süreç dahil olmak üzere bir kitabın tüm grafik tasarımı için kolektif bir temilcinin sorumluluğunu içeren bir gösterim. @tr
toolkit definition: تجسيدة تنطوي على مسئولية وكيل جماعي عن التصميم الجرافيكي لكتاب بالكامل، ويشمل ذلك تنسيق الحروف، والإيضاحيات، واختيار المواد، والعمليات المستخدمة. @ar
toolkit definition: 涉及一种图书的整体平面设计（包括字体和插图的设计、材料的选取和工艺流程的使用等）的一个集体行为者的责任的一种载体表现 @zh-hans
toolkit label: Gemeinschaftlicher Akteur als Buchgestalterin/Buchgestalter von @de
toolkit label: Kitap tasarımcısı kolektif temsilcisi @tr
toolkit label: agent collectif maquettiste de livre de @fr
toolkit label: agent col·lectiu dissenyador gràfic de @ca
toolkit label: boekontwerper-collectieve actor van @nl
toolkit label: bokdesigner for (kollektiv agent) @no
toolkit label: book designer agente collettivo di @it
toolkit label: book designer collective agent of @en
toolkit label: graafinen suunnittelija (yhteistoimija) manifestaatiossa
toolkit label: ir grāmatas dizainers (grupa) @lv
toolkit label: kollektiv agent, som er bogdesigner af @da
toolkit label: könyvtervező kollektív ágense: @hu
toolkit label: raamatukujundaja (kollektiiv) kehastuses @et
toolkit label: σχεδιαστής βιβλίου συλλογικός φορέας του @el
toolkit label: وكيل جماعي مصمم كتب @ar
toolkit label: ……的图书设计者集体行为者 @zh-hans
has subproperty: graafinen suunnittelija (yhteisö) manifestaatiossa
has subproperty: graafinen suunnittelija (suku) manifestaatiossa
has subproperty: P50660
lexical alias: bookDesignerCollectiveAgentOf.en
status: Published
type: Property
domain: C10011
label: er bokdesigner for (kollektiv agent) @no
label: er kollektiv agent, som er bogdesigner af @da
label: est un agent collectif maquettiste de livre de @fr
label: ir grāmatas dizainers (grupa) @lv
label: is boekontwerper-collectieve actor van @nl
label: is book designer collective agent of @en
label: ist gemeinschaftlicher Akteur als Buchgestalterin/Buchgestalter von @de
label: kitap tasarımcısı kolektif temsilcisidir @tr
label: könyvtervező kollektív ágense a következőnek: @hu
label: raamatukujundaja (kollektiiv) kehastuses @et
label: è book designer agente collettivo di @it
label: és agent col·lectiu dissenyador gràfic de @ca
label: είναι σχεδιαστής βιβλίου συλλογικός φορέας του @el
label: هو وكيل جماعي مصمم كتب لـ @ar
label: 是……的图书设计者集体行为者 @zh-hans
sub property of: graafinen suunnittelija (toimija) manifestaatiossa
sub property of: manifestaation tekijä (yhteistoimija) manifestaatiossa
definition: Correla un agente collettivo a una manifestazione che implica una responsabilità di un agente collettivo nell'intera progettazione grafica di un libro, inclusa la disposizione dei caratteri e dell'illustrazione, la scelta dei materiali e il processo utilizzato. @it
definition: Hozzákapcsol egy kollektív ágenst egy megjelenési formához, amelyhez hozzátartozik egy kollektív ágens felelőssége egy könyv teljes grafikai tervezéséért, beleértve a nyomdai betűtípus és az illusztrációk elrendezését, az anyagválasztást és az alkalmazott eljárást. @hu
definition: Kolektif bir temsilciyi, yazı ve çizim düzenlemesi, malzeme seçimi ve kullanılan süreç dahil olmak üzere bir kitabın tüm grafik tasarımı için kolektif bir temsilcinin sorumluluğunu içeren bir gösterimle ilişkilendirir. @tr
definition: Liittää yhteistoimijan manifestaatioon, jossa yhteistoimija on vastuussa koko kirjan graafisesta suunnittelusta, taitosta, materiaalien valinnasta ja käytettävistä valmistusmenetelmistä.
definition: Met un agent collectif en relation avec une manifestation qui comporte une responsabilité de la part d’un agent collectif en ce qui concerne toute la conception graphique d’un livre, y compris la composition typographique, l’arrangement des illustrations, le choix des matériaux et le procédé utilisé. @fr
definition: Relaciona un agent col·lectiu amb una manifestació que implica una responsabilitat d’un agent col·lectiu en tot el disseny gràfic d’un llibre, inclosa la composició tipogràfica i la il·lustració, la tria dels materials i el procés utilitzat. @ca
definition: Relateert een collectieve actor aan een manifestatie die met zich meebrengt een verantwoordelijkheid van een collectieve actor voor het complete grafische ontwerp van een boek, inclusief indeling van font en illustratie, keuze van materialen en gebruikte methode. @nl
definition: Relaterer en kollektiv agent til en manifestasjon som involverer et ansvar for en kollektiv agent i form av ansvar for hele den grafiske utformingen av en bok, inkludert oppsett av skrifttype og illustrasjoner, valg av materialer og hvilke prosesser som brukes. @no
definition: Relaterer en kollektiv agent til en manifestation, som involverer en kollektiv agents ansvar for hele det grafiske design af en bog, inkl. opsætning af tekst og illustrationer, materialevalg og anvendt proces. @da
definition: Relates a collective agent to a manifestation that involves a responsibility of a collective agent for the entire graphic design of a book, including arrangement of type and illustration, choice of materials, and process used. @en
definition: Sasaista grupu ar manifestāciju, kas ietver grupas atbildību par grāmatas grafisko dizainu, tajā skaitā par izkātojuma veidu un ilustrācijām, materiālu izvēli un izmantoto procesu. @lv
definition: Seostab kollektiivi kehastusega, mis sisaldab kollektiivi vastutust raamatu graafilise kujunduse eest, sealhulgas trükiteksti ja illustratsioonide paigutuse, materjalide valiku ja valmistamismenetluste eest. @et
definition: Setzt einen gemeinschaftlichen Akteur in Beziehung zu einer Manifestation, bei der ein gemeinschaftlicher Akteur für das gesamte grafische Design eines Buchs, einschließlich Schriftbild, Bildgestaltung, Materialwahl und angewandter Verfahren, verantwortlich ist. @de
definition: يربط وكيلا جماعيا بتجسيدة تنطوي على مسئولية وكيل جماعي عن التصميم الجرافيكي لكتاب بالكامل، ويشمل ذلك تنسيق الحروف، والإيضاحيات، واختيار المواد، والعمليات المستخدمة. @ar
definition: 将一个集体行为者与涉及一种图书的整体平面设计（包括字体和插图的设计、材料的选取和工艺流程的使用等）的一个集体行为者的责任的一种载体表现关联起来。 @zh-hans

kollotypian valmistaja (yhteistoimija) manifestaatiossa
has element type: 2
toolkit definition: A manifestation that involves a responsibility of a collective agent for preparing a hardened film of gelatin or other colloid that has ink-receptive and ink-repellent surfaces and that is used to make prints using a photomechanical process. @en
toolkit definition: Een manifestatie die met zich meebrengt een verantwoordelijkheid van een collectieve actor voor het gebruiken van een fotomechanisch proces voor het maken van afdrukken direct vanaf een verharde film van gelatine of ander colloïde dat inktopnemende en inktafstotende oppervlakken heeft. @nl
toolkit definition: Egy megjelenési forma, amelyhez hozzátartozik egy kollektív ágens felelőssége nyomtatványok fotómechanikai eljárással történő közvetlen előállításáért, amihez festékfelvevő és festéktaszító felülettel rendelkező zselatin vagy más kolloid megkeményedett filmjét használja. @hu
toolkit definition: Eine Manifestation, bei der ein gemeinschaftlicher Akteur für die Verwendung eines fotomechanischen Verfahrens zur Herstellung von Abzügen direkt von einem gehärteten Film aus Gelatine oder einem anderen Kolloid, der druckerfarbenaufnehmende und -abweisende Oberflächen aufweist, verantwortlich ist. @de
toolkit definition: En manifestasjon som involverer et ansvar for en kollektiv agent i form av bruk av en fotomekanisk prosess for å lage kopier direkte fra en stivnet film av gelatin eller et annet kolloid som har overflater som er mottagelige for blekk og motstandige mot blekk. @no
toolkit definition: Kehastus, mis sisaldab kollektiivi vastutust fotomehaanilises protsessis tõmmiste tegemise eest otse želatiini või muu kolloidi tahkunud kihilt, mille pind osalt seob värvainet, osalt ei seo. @et
toolkit definition: Manifestaatio, jonka valmistamisesta yhteistoimija on vastuussa tekemällä vedoksia suoraan kovettuneelta gelatiinifilmiltä tai muulta materiaalilta, jossa on mustetta imeviä ja hylkiviä pintoja.
toolkit definition: Manifestació que implica una responsabilitat d’un agent col·lectiu en la preparació d’una pel·lícula endurida de gelatina o d’un altre col·loide que té superfícies que accepten o rebutgen la tinta i que s'usa per fer gravats usant un procés fotomecànic. @ca
toolkit definition: Manifestation qui comporte une responsabilité de la part d’un agent collectif consistant à préparer un film durci de gélatine ou d’un autre colloïde présentant des surfaces réceptives et répulsives à l’encre et servant à réaliser des images imprimées à l’aide d’un procédé photomécanique. @fr
toolkit definition: Manifestation, som involverer en kollektiv agents ansvar for en fotomekanisk proces, hvorved der laves tryk direkte fra et hærdet gelatinelag eller andet kolloid, som har blækmodtagelige og blækafvisende overflader. @da
toolkit definition: Manifestācija, kas ietver grupas atbildību par fotomehānisku procesu, lai izgatavotu izdrukas tieši no plates, kas pārklāta ar gaismjutīga hromželatīna slāni vai citu koloīdu, kuram ir tinti piesaistošas un tinti atgrūdošas virsmas. @lv
toolkit definition: Mürekkep alıcı ve mürekkep itici yüzeylere sahip olan ve fotomekanik bir işlem kullanarak baskı yapmak için kullanılan sertleştirilmiş bir jelatin veya diğer kolloid filmini hazırlamak için kolektif bir temsilcinin sorumluluğunu içeren bir gösterim. @tr
toolkit definition: تجسيدة تنطوي على مسئولية وكيل جماعي عن استخدام عمليات ميكانيكية ضوئية لإنتاج المطبوعات مباشرة من فيلم صلد من الجيلاتين أو غيره من المواد الغروية التي تحتوي على أسطح مستقبلة أو طاردة للحبر. @ar
toolkit definition: 涉及利用一面吸墨而另一面不吸墨的明胶或其他硬胶片进行影印的一个集体行为者的责任的一种载体表现 @zh-hans
toolkit label: Gemeinschaftlicher Akteur als Lichtdruckerin/Lichtdrucker von @de
toolkit label: agent collectif phototypeur de @fr
toolkit label: agent col·lectiu fototipista de @ca
toolkit label: collotyper collective agent of @en
toolkit label: fénynyomatkészítő kollektív ágense: @hu
toolkit label: ir fotogravieris (grupa) @lv
toolkit label: kollektiv agent, som er lystrykker af @da
toolkit label: kollotypian valmistaja (yhteistoimija) manifestaatiossa
toolkit label: kollotüübi valmistaja (kollektiiv) kehastuses @et
toolkit label: lichtdrukker-collectieve actor van @nl
toolkit label: lystrykker for (kollektiv agent) @no
toolkit label: taş baskıcı kolektif temsilcisi @tr
toolkit label: κατασκευαστής κολλοτυπίας συλλογικός φορέας του @el
toolkit label: وكيل جماعي طبّاع صور فوتوغرافية @ar
toolkit label: ……的珂罗版制作者集体行为者 @zh-hans
has subproperty: kollotypian valmistaja (yhteisö) manifestaatiossa
has subproperty: kollotypian valmistaja (suku) manifestaatiossa
has subproperty: P50661
lexical alias: collotyperCollectiveAgentOf.en
status: Published
type: Property
domain: C10011
label: er kollektiv agent, som er lystrykker af @da
label: er lystrykker for (kollektiv agent) @no
label: est un agent collectif phototypeur de @fr
label: fénynyomatkészítő kollektív ágense a következőnek: @hu
label: ir fotogravieris (grupa) @lv
label: is collotyper collective agent of @en
label: is lichtdrukker-collectieve actor van @nl
label: ist gemeinschaftlicher Akteur als Lichtdruckerin/Lichtdrucker von @de
label: kollotüübi valmistaja (kollektiiv) kehastuses @et
label: kolotip baskıcı kolektif temsilcisidir @tr
label: és agent col·lectiu fototipista de @ca
label: είναι κατασκευαστής κολλοτυπίας συλλογικός φορέας του @el
label: هو وكيل جماعي طبّاع صور فوتوغرافية لـ @ar
label: 是……的珂罗版制作者集体行为者 @zh-hans
sub property of: kollotypian valmistaja (toimija) manifestaatiossa
sub property of: kuvalaatan valmistaja (yhteistoimija) manifestaatiossa
alternative label: -
alternative label: agent collectif collotypiste de @fr
alternative label: agente colectivo calotipista de @es
alternative label: collotypist collective agent of @en
alternative label: taş baskı uzmanı kolektif temsilcisi @tr
alternative label: ……的珂罗版制作者集体行为者 @zh-hans
definition: Hozzákapcsol egy kollektív ágenst egy megjelenési formához, amelyhez hozzátartozik egy kollektív ágens felelőssége nyomtatványok fotómechanikai eljárással történő közvetlen előállításáért, amihez festékfelvevő és festéktaszító felülettel rendelkező zselatin vagy más kolloid megkeményedett filmjét használja. @hu
definition: Kolektif bir temsilciyi, mürekkep alıcı ve mürekkep itici yüzeylere sahip ve bir fotomekanik işlem kullanarak baskı yapmak için kullanılan sertleştirilmiş bir jelatin veya diğer kolloid filmini hazırlamak için kolektif bir temsilcinin sorumluluğunu içeren bir gösterimle ilişkilendirir. @tr
definition: Liittää yhteistoimijan manifestaatioon, jonka valmistamisesta yhteistoimija on vastuussa tekemällä vedoksia suoraan kovettuneelta gelatiinifilmiltä tai muulta materiaalilta, jossa on mustetta imeviä ja hylkiviä pintoja.
definition: Met un agent collectif en relation avec une manifestation qui comporte une responsabilité de la part d’un agent collectif consistant à préparer un film durci de gélatine ou d’un autre colloïde présentant des surfaces réceptives et répulsives à l’encre et servant à réaliser des images imprimées à l’aide d’un procédé photomécanique. @fr
definition: Relaciona un agent col·lectiu amb una manifestació que implica una responsabilitat d’un agent col·lectiu en la preparació d’una pel·lícula endurida de gelatina o d’un altre col·loide que té superfícies que accepten o rebutgen la tinta i que s'usa per fer gravats usant un procés fotomecànic. @ca
definition: Relateert een collectieve actor aan een manifestatie die met zich meebrengt een verantwoordelijkheid van een collectieve actor voor het gebruiken van een fotomechanisch proces voor het maken van afdrukken direct vanaf een verharde film van gelatine of ander colloïde dat inktopnemende en inktafstotende oppervlakken heeft. @nl
definition: Relaterer en kollektiv agent til en manifestasjon som involverer et ansvar for en kollektiv agent i form av bruk av en fotomekanisk prosess for å lage kopier direkte fra en stivnet film av gelatin eller et annet kolloid som har overflater som er mottagelige for blekk og motstandige mot blekk. @no
definition: Relaterer en kollektiv agent til en manifestation, som involverer en kollektiv agents ansvar for en fotomekanisk proces, hvorved der laves tryk direkte fra et hærdet gelatinelag eller andet kolloid, som har blækmodtagelige og blækafvisende overflader. @da
definition: Relates a collective agent to a manifestation that involves a responsibility of a collective agent for preparing a hardened film of gelatin or other colloid that has ink-receptive and ink-repellent surfaces and that is used to make prints using a photomechanical process. @en
definition: Sasaista grupu ar manifestāciju, kas ietver grupas atbildību par fotomehānisku procesu, lai izgatavotu izdrukas tieši no plates, kas pārklāta ar gaismjutīga hromželatīna slāni vai citu koloīdu, kuram ir tinti piesaistošas un tinti atgrūdošas virsmas. @lv
definition: Seostab kollektiivi kehastusega, mis sisaldab kollektiivi vastutust fotomehaanilises protsessis tõmmiste tegemise eest otse želatiini või muu kolloidi tahkunud kihilt, mille pind osalt seob värvainet, osalt ei seo. @et
definition: Setzt einen gemeinschaftlichen Akteur in Beziehung zu einer Manifestation, bei der ein gemeinschaftlicher Akteur für die Verwendung eines fotomechanischen Verfahrens zur Herstellung von Abzügen direkt von einem gehärteten Film aus Gelatine oder einem anderen Kolloid, der druckerfarbenaufnehmende und -abweisende Oberflächen aufweist, verantwortlich ist. @de
definition: يربط وكيلا جماعيا بتجسيدة تنطوي على مسئولية وكيل جماعي عن استخدام عمليات ميكانيكية ضوئية لإنتاج المطبوعات مباشرة من فيلم صلد من الجيلاتين أو غيره من المواد الغروية التي تحتوي على أسطح مستقبلة أو طاردة للحبر. @ar
definition: 将一个集体行为者与涉及利用一面吸墨而另一面不吸墨的明胶或其他硬胶片进行影印的一个集体行为者的责任的一种载体表现关联起来。 @zh-hans

kartografiaan osallinen yhteistoimija manifestaatiossa
has element type: 2
toolkit definition: A manifestation that is an aggregate that embodies an expression of a cartographic work that is created by a collective agent. @en
toolkit definition: Een manifestatie die een aggregaat is die een expressie van een cartografisch werk verwezenlijkt dat is gecreëerd door een collectieve actor. @nl
toolkit definition: Egy aggregátum megjelenési forma, amely egy kollektív ágens által létrehozott kartográfiai mű kifejezési formáját testesíti meg. @hu
toolkit definition: Ein Aggregat (Manifestation), das eine Expression eines kartografischen Werks verkörpert, die ein gemeinschaftlicher Akteur erstellt hat. @de
toolkit definition: En manifestasjon som er et aggregat som realiserer et kartografisk verk skapt av en kollektiv agent. @no
toolkit definition: Kehastus, mis on liitum, milles on teostatud kollektiivi loodud kartograafilise teose väljendus. @et
toolkit definition: Kolektif bir temsilci tarafından oluşturulan bir kartografik eserin anlatımını somutlaştıran topluluk olan bir gösterim. @tr
toolkit definition: Manifestaatio, joka on aggregaatti, joka sisältää kartografisen teoksen ekspression, jonka yhteistoimija on luonut.
toolkit definition: Manifestació que és un agregat que materialitza una expressió d’una obra cartogràfica que és creada per un agent col·lectiu. @ca
toolkit definition: Manifestation qui consiste en un agrégat matérialisant une expression d’une œuvre cartographique créée par un agent collectif. @fr
toolkit definition: Manifestation, som er en samling, som rummer et udtryk af et kartografisk værk, som er skabt af en kollektiv agent. @da
toolkit definition: Manifestazione che è un aggregato che materializza un'opera cartografica creata da un agente collettivo. @it
toolkit definition: Manifestācija, kas ir apkopojums, kas ietver grupas radītu kartogrāfijas darbu. @lv
toolkit definition: تجسيدة تمثل تجميعة تجسد عملا رسم خرائطي أنشأه وكيل جماعي. @ar
toolkit definition: 作为一种合集、把一个集体行为者所创作的一种地图作品的内容表达具体化的一种载体表现 @zh-hans
toolkit label: Gemeinschaftlicher Akteur als Beiträgerin/Beiträger von einer Kartografie von @de
toolkit label: agent collectif contributeur de cartographie de @fr
toolkit label: agent col·lectiu contribuïdor de cartografia de @ca
toolkit label: bidragsyter til kartografi for (kollektiv agent) @no
toolkit label: bijdrager-collectieve actor van cartografie van @nl
toolkit label: contributor collective agent of cartography of @en
toolkit label: contributore agente collettivo di cartografia di @it
toolkit label: ir kartogrāfijas līdzradītājs (grupa) @lv
toolkit label: kaastööline kartograafia alal (kollektiiv) kehastuses @et
toolkit label: kartografiaan osallinen yhteistoimija manifestaatiossa
toolkit label: kartografyaya katkıda bulunan kolektif temsilci @tr
toolkit label: kollektiv agent, som er bidragsyder til kartografi af @da
toolkit label: közreműködő kollektív ágense a következő kartográfiának: @hu
toolkit label: συντελεστής συλλογικός φορέας της χαρτογράφησης του @el
toolkit label: وكيل جماعي مساهم في رسم خرائط @ar
toolkit label: ……的地图绘制的贡献者集体行为者 @zh-hans
has subproperty: maanmittari (yhteistoimija) manifestaatiossa
has subproperty: kartografiaan osallinen yhteisö manifestaatiossa
has subproperty: kartografiaan osallinen suku manifestaatiossa
has subproperty: P50662
lexical alias: contributorCollectiveAgentOfCartographyOf.en
status: Published
type: Property
domain: C10011
label: er bidragsyter til kartografi for (kollektiv agent) @no
label: er kollektiv agent, som er bidragsyder til kartografi af @da
label: est un agent collectif contributeur de cartographie de @fr
label: ir kartogrāfijas līdzradītājs (grupa) @lv
label: is bijdrager-collectieve actor van cartografie van @nl
label: is contributor collective agent of cartography of @en
label: ist gemeinschaftlicher Akteur als Beiträgerin/Beiträger von einer Kartografie von @de
label: kaastööline kartograafia alal (kollektiiv) kehastuses @et
label: kartografisinin katkıda bulunan kolektif temsilcisidir @tr
label: közreműködő kollektív ágense a következő kartográfiának: @hu
label: è contributore agente collettivo di cartografia di @it
label: és agent col·lectiu contribuïdor de cartografia de @ca
label: είναι συντελεστής συλλογικός φορέας της χαρτογράφησης του @el
label: هو وكيل جماعي مساهم في رسم خرائط لـ @ar
label: 是……的地图绘制的贡献者集体行为者 @zh-hans
sub property of: kartografiaan osallinen toimija manifestaatiossa
sub property of: aggregaattiin osallinen yhteistoimija manifestaatiossa
definition: Correla un agente collettivo a una manifestazione che è un aggregato che materializza un'opera cartografica creata da un agente collettivo. @it
definition: Hozzákapcsol egy kollektív ágenst egy aggregátum megjelenési formához, amely egy kollektív ágens által létrehozott kartográfiai mű kifejezési formáját testesíti meg. @hu
definition: Kolektif bir temsilciyi, kolektif bir temsilci tarafından oluşturulan bir kartografik çalışmanın anlatımını somutlaştıran bir gösterimle ilişkilendirir. @tr
definition: Liittää yhteistoimijan manifestaatioon, joka on aggregaatti, joka sisältää kartografisen teoksen ekspression, jonka yhteistoimija on luonut.
definition: Met un agent collectif en relation avec une manifestation qui consiste en un agrégat matérialisant une expression d’une œuvre cartographique créée par un agent collectif. @fr
definition: Relaciona un agent col·lectiu amb una manifestació que és un agregat que materialitza una expressió d’una obra cartogràfica que és creada per un agent col·lectiu. @ca
definition: Relateert een collectieve actor aan een manifestatie die een aggregaat is die een expressie van een cartografisch werk verwezenlijkt dat is gecreëerd door een collectieve actor. @nl
definition: Relaterer en kollektiv agent til en manifestasjon som er et aggregat som realiserer et kartografisk verk skapt av en kollektiv agent. @no
definition: Relaterer en kollektiv agent til en manifestation, som er en samling, som rummer et udtryk af et kartografisk værk, som er skabt af en kollektiv agent. @da
definition: Relates a collective agent to a manifestation that is an aggregate that embodies an expression of a cartographic work that is created by a collective agent. @en
definition: Sasaista grupu ar manifestāciju, kas ir apkopojums, kas ietver grupas radītu kartogrāfijas darbu. @lv
definition: Seostab kollektiivi kehastusega, mis on liitum, milles on teostatud kollektiivi loodud kartograafilise teose väljendus. @et
definition: Setzt einen gemeinschaftlichen Akteur in Beziehung zu einem Aggregat (Manifestation), das eine Expression eines kartografischen Werks verkörpert, die ein gemeinschaftlicher Akteur erstellt hat. @de
definition: يربط وكيلا جماعيا بتجسيدة عبارة عن تجميعة تجسد عملا رسم خرائطي أنشأه وكيل جماعي. @ar
definition: 将一个集体行为者与作为一种合集、把一个集体行为者所创作的一种地图作品的内容表达具体化的一种载体表现关联起来。 @zh-hans

koreografiaan osallinen yhteistoimija manifestaatiossa
has element type: 2
toolkit definition: A manifestation that is an aggregate that embodies an expression of a choreographic work that is created by a collective agent. @en
toolkit definition: Een manifestatie die een aggregaat is die een expressie van een choreografisch werk verwezenlijkt dat is gecreëerd door een collectieve actor. @nl
toolkit definition: Egy aggregátum megjelenési forma, amely egy kollektív ágens által létrehozott koreografikus mű kifejezési formáját testesíti meg. @hu
toolkit definition: Ein Aggregat (Manifestation), das eine Expression eines choreografischen Werks verkörpert, die ein gemeinschaftlicher Akteur erstellt hat. @de
toolkit definition: En manifestasjon som er et aggregat som realiserer et koreografisk verk skapt av en kollektiv agent. @no
toolkit definition: Kehastus, mis on liitum, milles on teostatud kollektiivi loodud koreograafilise teose väljendus. @et
toolkit definition: Kolektif bir temsilci tarafından oluşturulan bir koreografik eserin anlatımını somutlaştıran topluluk olan bir gösterim. @tr
toolkit definition: Manifestaatio, joka on aggregaatti, joka sisältää koreografisen teoksen ekspression, jonka yhteistoimija on luonut.
toolkit definition: Manifestació que és un agregat que materialitza expressió d’una obra coreogràfica que és creada per un agent col·lectiu. @ca
toolkit definition: Manifestation qui consiste en un agrégat matérialisant une expression d’une œuvre chorégraphique créée par un agent collectif. @fr
toolkit definition: Manifestation, som er en samling, som rummer et udtryk af et koreografisk værk, som er skabt af en kollektiv agent. @da
toolkit definition: Manifestazione che è un aggregato che materializza un'opera coreografica creata da un agente collettivo. @it
toolkit definition: Manifestācija, kas ir apkopojums, kas ietver grupas radītu horeogrāfijas darbu. @lv
toolkit definition: تجسيدة التي هي عبارة عن تجميعة تجسد عملا راقص أبدعه وكيل جماعي. @ar
toolkit definition: 作为一种合集、把一个集体行为者所创作的一种编舞作品的内容表达具体化的一种载体表现 @zh-hans
toolkit label: Gemeinschaftlicher Akteur als Beiträgerin/Beiträger von einer Choreografie von @de
toolkit label: agent collectif contributeur de chorégraphie de @fr
toolkit label: agent col·lectiu contribuïdor de coreografia de @ca
toolkit label: bidragsyter til koreografi for (kollektiv agent) @no
toolkit label: bijdrager-collectieve actor van choreografie van @nl
toolkit label: contributor collective agent of choreography of @en
toolkit label: contributore agente collettivo di coreografia di @it
toolkit label: ir horeogrāfijas līdzradītājs (grupa) @lv
toolkit label: kaastööline koreograafia alal (kollektiiv) kehastuses @et
toolkit label: kollektiv agent, som er bidragsyder til koreografi af @da
toolkit label: koreografiaan osallinen yhteistoimija manifestaatiossa
toolkit label: koreografiye katkıda bulunan kolektif temsilci @tr
toolkit label: közreműködő kollektív ágense a következő koreográfiának: @hu
toolkit label: συντελεστής συλλογικός φορέας της χορογραφίας του @el
toolkit label: وكيل جماعي مساهم في رقصات @ar
toolkit label: ……的编舞的贡献者集体行为者 @zh-hans
has subproperty: koreografiaan osallinen yhteisö manifestaatiossa
has subproperty: koreografiaan osallinen suku manifestaatiossa
has subproperty: P50663
lexical alias: contributorCollectiveAgentOfChoreographyOf.en
status: Published
type: Property
domain: C10011
label: er bidragsyter til koreografi for (kollektiv agent) @no
label: er kollektiv agent, som er bidragsyder til koreografi af @da
label: est un agent collectif contributeur de chorégraphie de @fr
label: ir horeogrāfijas līdzradītājs (grupa) @lv
label: is bijdrager-collectieve actor van choreografie van @nl
label: is contributor collective agent of choreography of @en
label: ist gemeinschaftlicher Akteur als Beiträgerin/Beiträger von einer Choreografie von @de
label: kaastööline koreograafia alal (kollektiiv) kehastuses @et
label: koreografisinin katkıda bulunan kolektif temsilcisidir @tr
label: közreműködő kollektív ágense a következő koreográfiának: @hu
label: è contributore agente collettivo di coreografia di @it
label: és agent col·lectiu contribuïdor de coreografia de @ca
label: είναι συντελεστής συλλογικός φορέας της χορογραφίας του @el
label: هو وكيل جماعي مساهم في رقصات لـ @ar
label: 是……的编舞的贡献者集体行为者 @zh-hans
sub property of: koreografiaan osallinen toimija manifestaatiossa
sub property of: aggregaattiin osallinen yhteistoimija manifestaatiossa
definition: Correla un agente collettivo a una manifestazione che è un aggregato che materializza un'opera coreografica creata da un agente collettivo. @it
definition: Hozzákapcsol egy kollektív ágenst egy aggregátum megjelenési formához, amely egy kollektív ágens által létrehozott koreografikus mű kifejezési formáját testesíti meg. @hu
definition: Kolektif bir temsilciyi, kolektif bir temsilci tarafından oluşturulan bir koreografik çalışmanın anlatımını somutlaştıran bir gösterimle ilişkilendirir. @tr
definition: Liittää yhteistoimijan manifestaatioon, joka on aggregaatti, joka sisältää koreografisen teoksen ekspression, jonka yhteistoimija on luonut.
definition: Met un agent collectif en relation avec une manifestation qui consiste en un agrégat matérialisant une expression d’une œuvre chorégraphique créée par un agent collectif. @fr
definition: Relaciona un agent col·lectiu amb una manifestació que és un agregat que materialitza expressió d’una obra coreogràfica que és creada per un agent col·lectiu. @ca
definition: Relateert een collectieve actor aan een manifestatie die een aggregaat is die een expressie van een choreografisch werk verwezenlijkt dat is gecreëerd door een collectieve actor. @nl
definition: Relaterer en kollektiv agent til en manifestasjon som er et aggregat som realiserer et koreografisk verk skapt av en kollektiv agent. @no
definition: Relaterer en kollektiv agent til en manifestation, som er en samling, som rummer et udtryk af et koreografisk værk, som er skabt af en kollektiv agent. @da
definition: Relates a collective agent to a manifestation that is an aggregate that embodies an expression of a choreographic work that is created by a collective agent. @en
definition: Sasaista grupu ar manifestāciju, kas ir apkopojums, kas ietver grupas radītu horeogrāfijas darbu. @lv
definition: Seostab kollektiivi kehastusega, mis on liitum, milles on teostatud kollektiivi loodud koreograafilise teose väljendus. @et
definition: Setzt einen gemeinschaftlichen Akteur in Beziehung zu einem Aggregat (Manifestation), das eine Expression eines choreografischen Werks verkörpert, die ein gemeinschaftlicher Akteur erstellt hat. @de
definition: يربط وكيلا جماعيا بتجسيدة عبارة عن تجميعة تجسد عملا راقص أنشأه وكيل جماعي. @ar
definition: 将一个集体行为者与作为一种合集、把一个集体行为者所创作的一种编舞作品的内容表达具体化的一种载体表现关联起来。 @zh-hans

liikkuvaan kuvaan osallinen yhteistoimija
has element type: 2
toolkit definition: A manifestation that is an aggregate that embodies an expression of a moving image work that is created by a collective agent. @en
toolkit definition: Een manifestatie die een aggregaat is die een expressie van een bewegend beeldwerk verwezenlijkt dat is gecreëerd door een collectieve actor. @nl
toolkit definition: Egy aggregátum megjelenési forma, amely egy kollektív ágens által létrehozott mozgóképmű kifejezési formáját testesíti meg. @hu
toolkit definition: Ein Aggregat (Manifestation), das eine Expression eines Bewegtbildwerks verkörpert, die ein gemeinschaftlicher Akteur erstellt hat. @de
toolkit definition: En manifestasjon som er et aggregat som realiserer et verk med levende bilder skapt av en kollektiv agent. @no
toolkit definition: Kehastus, mis on liitum, milles on teostatud kollektiivi loodud liikuvast pildist koosneva teose väljendus. @et
toolkit definition: Kolektif bir temsilci tarafından oluşturulan hareketli bir görüntü eserinin anlatımını somutlaştıran topluluk olan bir gösterim. @tr
toolkit definition: Manifestaatio, joka on aggregaatti, joka sisältää liikkuvan kuvan teoksen ekspression, jonka yhteistoimija on luonut.
toolkit definition: Manifestació que és un agregat que materialitza una obra d’imatge en moviment que és creada per un agent col·lectiu. @ca
toolkit definition: Manifestation qui consiste en un agrégat matérialisant une expression d’une œuvre d’images animées créée par un agent collectif. @fr
toolkit definition: Manifestation, som er en samling, som rummer et udtryk af et værk med levende billeder, som er skabt af en kollektiv agent. @da
toolkit definition: Manifestazione che è un aggregato che materializza un'immagine in movimento creata da un agente collettivo. @it
toolkit definition: Manifestācija, kas ir apkopojums, kas ietver grupas radītu kustīga attēla darbu. @lv
toolkit definition: تجسيدة تمثل تجميعة تجسد عملا صور متحركة أنشأه وكيل جماعي. @ar
toolkit definition: 作为一种合集、把一个集体行为者所创作的一种动态图像作品的内容表达具体化的一种载体表现 @zh-hans
toolkit label: Gemeinschaftlicher Akteur als Beiträgerin/Beiträger von einem Bewegtbild von @de
toolkit label: agent collectif contributeur d’images animées de @fr
toolkit label: agent col·lectiu contribuïdor d’imatge en moviment de @ca
toolkit label: bidragsyter til levende bilder for (kollektiv agent) @no
toolkit label: bijdrager-collectieve actor van bewegend beeld van @nl
toolkit label: contributor collective agent of moving image of @en
toolkit label: contributore agente collettivo di immagine in movimento di @it
toolkit label: hareketli̇ görüntüye katkıda bulunan kolektif temsilci @tr
toolkit label: ir kustīga attēla līdzradītājs (grupa) @lv
toolkit label: kaastööline liikuva pildi alal (kollektiiv) kehastuses @et
toolkit label: kollektiv agent, som er bidragsyder til levende billede af @da
toolkit label: közreműködő kollektív ágense a következő mozgóképnek: @hu
toolkit label: liikkuvaan kuvaan osallinen yhteistoimija
toolkit label: εσυντελεστής συλλογικός φορέας της κινητής εικόνας του @el
toolkit label: وكيل جماعي مساهم في صور متحركة @ar
toolkit label: ……的动态图像的贡献者集体行为者 @zh-hans
has subproperty: liikkuvaan kuvaan osallinen yhteisö manifestaatiossa
has subproperty: liikkuvaan kuvaan osallinen suku manifestaatiossa
has subproperty: P50664
lexical alias: contributorCollectiveAgentOfMovingImageOf.en
status: Published
type: Property
domain: C10011
label: er bidragsyter til levende bilder for (kollektiv agent) @no
label: er kollektiv agent, som er bidragsyder til levende billede af @da
label: est un agent collectif contributeur d’images animées de @fr
label: hareketli görüntüsünün katkıda bulunan kolektif temsilcisidir @tr
label: ir kustīga attēla līdzradītājs (grupa) @lv
label: is bijdrager-collectieve actor van bewegend beeld van @nl
label: is contributor collective agent of moving image of @en
label: ist gemeinschaftlicher Akteur als Beiträgerin/Beiträger von einem Bewegtbild von @de
label: kaastööline liikuva pildi alal (kollektiiv) kehastuses @et
label: közreműködő kollektív ágense a következő mozgóképnek: @hu
label: è contributore agente collettivo di immagine in movimento di @it
label: és agent col·lectiu contribuïdor d’imatge en moviment de @ca
label: είναι συντελεστής συλλογικός φορέας της κινητής εικόνας του @el
label: هو وكيل جماعي مساهم في صور متحركة لـ @ar
label: 是……的动态图像的贡献者集体行为者 @zh-hans
sub property of: liikkuvaan kuvaan osallinen toimija manifestaatiossa
sub property of: aggregaattiin osallinen yhteistoimija manifestaatiossa
definition: Correla un agente collettivo a una manifestazione che è un aggregato che materializza un'immagine in movimento creata da un agente collettivo. @it
definition: Hozzákapcsol egy kollektív ágenst egy aggregátum megjelenési formához, amely egy kollektív ágens által létrehozott mozgóképmű kifejezési formáját testesíti meg. @hu
definition: Kolektif temsilciyi, kolektif bir temsilci tarafından oluşturulan hareketli bir görüntünün anlatımını somutlaştıran bir gösterimle ilişkilendirir. @tr
definition: Liittää yhteistoimijan manifestaatioon, joka on aggregaatti, joka sisältää liikkuvan kuvan teoksen ekspression, jonka yhteistoimija on luonut.
definition: Met un agent collectif en relation avec une manifestation qui consiste en un agrégat matérialisant une expression d’une œuvre d’images animées créée par un agent collectif. @fr
definition: Relaciona un agent col·lectiu amb una manifestació que és un agregat que materialitza una obra d’imatge en moviment que és creada per un agent col·lectiu. @ca
definition: Relateert een collectieve actor aan een manifestatie die een aggregaat is die een expressie van een bewegend beeldwerk verwezenlijkt dat is gecreëerd door een collectieve actor. @nl
definition: Relaterer en kollektiv agent til en manifestasjon som er et aggregat som realiserer et verk med levende bilder skapt av en kollektiv agent. @no
definition: Relaterer en kollektiv agent til en manifestation, som er en samling, som rummer et udtryk af et værk med levende billeder, som er skabt af en kollektiv agent. @da
definition: Relates a collective agent to a manifestation that is an aggregate that embodies an expression of a moving image work that is created by a collective agent. @en
definition: Sasaista grupu ar manifestāciju, kas ir apkopojums, kas ietver grupas radītu kustīga attēla darbu. @lv
definition: Seostab kollektiivi kehastusega, mis on liitum, milles on teostatud kollektiivi loodud liikuvast pildist koosneva teose väljendus. @et
definition: Setzt einen gemeinschaftlichen Akteur in Beziehung zu einem Aggregat (Manifestation), das eine Expression eines Bewegtbildwerks verkörpert, die ein gemeinschaftlicher Akteur erstellt hat. @de
definition: يربط وكيلا جماعيا بتجسيدة عبارة عن تجميعة تجسد عملا صور متحركة أنشأه وكيل جماعي. @ar
definition: 将一个集体行为者与作为一种合集、把一个集体行为者所创作的一种动态图像作品的内容表达具体化的一种载体表现关联起来。 @zh-hans

musiikkiin osallinen yhteistoimija manifestaatiossa
has element type: 2
toolkit definition: A manifestation that is an aggregate that embodies an expression of a musical work that is created by a collective agent. @en
toolkit definition: Een manifestatie die een aggregaat is die een expressie van een muziekwerk verwezenlijkt dat is gecreëerd door een collectieve actor. @nl
toolkit definition: Egy aggregátum megjelenési forma, amely egy kollektív ágens által létrehozott zenemű kifejezési formáját testesíti meg. @hu
toolkit definition: Ein Aggregat (Manifestation), das eine Expression eines Musikwerks verkörpert, die ein gemeinschaftlicher Akteur erstellt hat. @de
toolkit definition: En manifestasjon som er et aggregat som realiserer et musikalsk verk skapt av en kollektiv agent. @no
toolkit definition: Kehastus, mis on liitum, milles on teostatud kollektiivi loodud muusikateose väljendus. @et
toolkit definition: Kolektif bir temsilci tarafından oluşturulan bir müzik eserinin anlatımını somutlaştıran topluluk olan bir gösterim. @tr
toolkit definition: Manifestaatio, joka on aggregaatti, joka sisältää musiikkiteoksen ekspression, jonka yhteistoimija on luonut.
toolkit definition: Manifestació que és un agregat que materialitza una expressió d’una obra musical creada per un agent col·lectiu. @ca
toolkit definition: Manifestation qui consiste en un agrégat matérialisant une expression d’une œuvre musicale créée par un agent collectif. @fr
toolkit definition: Manifestation, som er en samling, som rummer et udtryk af et musikværk, som er skabt af en kollektiv agent. @da
toolkit definition: Manifestazione che è un aggregato che materializza un'opera musicale creata da un agente collettivo. @it
toolkit definition: Manifestācija, kas ir apkopojums, kas ietver grupas radītu mūzikas darbu. @lv
toolkit definition: تجسيدة تمثل تجميعة تجسد عملًا موسيقيًا أنشأه وكيل جماعي. @ar
toolkit definition: 作为一种合集、把一个集体行为者所创作的一种音乐作品的内容表达具体化的一种载体表现 @zh-hans
toolkit label: Gemeinschaftlicher Akteur als Beiträgerin/Beiträger einer Musik von @de
toolkit label: agent collectif contributeur de musique de @fr
toolkit label: agent col·lectiu contribuïdor de música de @ca
toolkit label: bidragsyter til musikk for (kollektiv agent) @no
toolkit label: bijdrager-collectieve actor van muziek van @nl
toolkit label: contributor collective agent of music of @en
toolkit label: contributore agente collettivo di musica di @it
toolkit label: ir mūzikas līdzradītājs (grupa) @lv
toolkit label: kollektiv agent, som er bidragsyder til musik af @da
toolkit label: közreműködő kollektív ágense a következő zenének: @hu
toolkit label: musiikkiin osallinen yhteistoimija manifestaatiossa
toolkit label: muusikaline kaastööline (kollektiiv) kehastuses @et
toolkit label: müzi̇ğe katkıda bulunan kolektif temsi̇lci̇ @tr
toolkit label: συντελεστής συλλογικός φορέας της μουσικής του @el
toolkit label: وكيل جماعي مساهم في موسيقى @ar
toolkit label: ……的音乐的贡献者集体行为者 @zh-hans
has subproperty: musiikkiin osallinen yhteisö manifestaatiossa
has subproperty: musiikkiin osallinen suku manifestaatiossa
has subproperty: P50665
lexical alias: contributorCollectiveAgentOfMusicOf.en
status: Published
type: Property
domain: C10011
label: er bidragsyter til musikk for (kollektiv agent) @no
label: er kollektiv agent, som er bidragsyder til musik af @da
label: est un agent collectif contributeur de musique de @fr
label: ir mūzikas līdzradītājs (grupa) @lv
label: is bijdrager-collectieve actor van muziek van @nl
label: is contributor collective agent of music of @en
label: ist gemeinschaftlicher Akteur als Beiträgerin/Beiträger einer Musik von @de
label: közreműködő kollektív ágense a következő zenének: @hu
label: muusikaline kaastööline (kollektiiv) kehastuses @et
label: müziğinin katkıda bulunan kolektif temsilcisidir @tr
label: è contributore agente collettivo di musica di @it
label: és agent col·lectiu contribuïdor de música de @ca
label: είναι συντελεστής συλλογικός φορέας της μουσικής του @el
label: هو وكيل جماعي مساهم في موسيقى لـ @ar
label: 是……的音乐的贡献者集体行为者 @zh-hans
sub property of: musiikkiin osallinen toimija manifestaatiossa
sub property of: aggregaattiin osallinen yhteistoimija manifestaatiossa
definition: Correla un agente collettivo a una manifestazione che è un aggregato che materializza un'opera musicale creata da un agente collettivo. @it
definition: Hozzákapcsol egy kollektív ágenst egy aggregátum megjelenési formához, amely egy kollektív ágens által létrehozott zenemű kifejezési formáját testesíti meg. @hu
definition: Kolektif temsilciyi, kolektif temsilci tarafından oluşturulan bir müzik eserinin anlatımını somutlaştıran bir gösterimle ilişkilendirir. @tr
definition: Liittää yhteistoimijan manifestaatioon, joka on aggregaatti, joka sisältää musiikkiteoksen ekspression, jonka yhteistoimija on luonut.
definition: Met un agent collectif en relation avec une manifestation qui consiste en un agrégat matérialisant une expression d’une œuvre musicale créée par un agent collectif. @fr
definition: Relaciona un agent col·lectiu amb una manifestació que és un agregat que materialitza una expressió d’una obra musical creada per un agent col·lectiu. @ca
definition: Relateert een collectieve actor aan een manifestatie die een aggregaat is die een expressie van een muziekwerk verwezenlijkt dat is gecreëerd door een collectieve actor. @nl
definition: Relaterer en kollektiv agent til en manifestasjon som er et aggregat som realiserer et musikalsk verk skapt av en kollektiv agent. @no
definition: Relaterer en kollektiv agent til en manifestation, som er en samling, som rummer et udtryk af et musikværk, som er skabt af en kollektiv agent. @da
definition: Relates a collective agent to a manifestation that is an aggregate that embodies an expression of a musical work that is created by a collective agent. @en
definition: Sasaista grupu ar manifestāciju, kas ir apkopojums, kas ietver grupas radītu mūzikas darbu. @lv
definition: Seostab kollektiivi kehastusega, mis on liitum, milles on teostatud kollektiivi loodud muusikateose väljendus. @et
definition: Setzt einen gemeinschaftlichen Akteur in Beziehung zu einem Aggregat (Manifestation), das eine Expression eines Musikwerks verkörpert, die ein gemeinschaftlicher Akteur erstellt hat. @de
definition: يربط وكيلا جماعيا بتجسيدة عبارة عن تجميعة تجسد عملًا موسيقيًا أنشأه وكيل جماعي. @ar
definition: 将一个集体行为者与作为一种合集、把一个集体行为者所创作的一种音乐作品的内容表达具体化的一种载体表现关联起来。 @zh-hans

puheeseen osallinen yhteistoimija manifestaatiossa
has element type: 2
toolkit definition: A manifestation that is an aggregate that embodies an expression of a vocal work that is created by a collective agent. @en
toolkit definition: Een manifestatie die een aggregaat is die een vocaal werk verwezenlijkt dat is gecreëerd door een collectieve actor. @nl
toolkit definition: Egy aggregátum megjelenési forma, amely egy kollektív ágens által létrehozott beszédmű kifejezési formáját testesíti meg. @hu
toolkit definition: Ein Aggregat (Manifestation), das eine Expression eines gesprochenen Werks verkörpert, die ein gemeinschaftlicher Akteur erstellt hat. @de
toolkit definition: En manifestasjon som er et aggregat som realiserer et verk av tale skapt av en kollektiv agent. @no
toolkit definition: Kehastus, mis on liitum, milles on teostatud kollektiivi loodud suulise teose väljendus. @et
toolkit definition: Kolektif temsilci tarafından oluşturulan bir vokal eserin anlatımını somutlaştıran topluluk olan bir gösterim. @tr
toolkit definition: Manifestaatio, joka on aggregaatti, joka sisältää puheteoksen ekspression, jonka yhteistoimija on luonut.
toolkit definition: Manifestació que és un agregat que materialitza una expressió d’una obra vocal que és creada per un agent col·lectiu. @ca
toolkit definition: Manifestation qui consiste en un agrégat matérialisant une expression d’une œuvre vocale créée par un agent collectif. @fr
toolkit definition: Manifestation, som er en samling, som rummer et udtryk af et værk med talte ord, som er skabt af en kollektiv agent. @da
toolkit definition: Manifestazione che è un aggregato che materializza un'opera orale creata da un agente collettivo. @it
toolkit definition: Manifestācija, kas ir apkopojums, kas ietver grupas radītu mutvārdu darbu. @lv
toolkit definition: تجسيدة تمثل تجميعة تجسد عملا كلمة منطوقة أنشأه وكيل جماعي. @ar
toolkit definition: 作为一种合集、把一个集体行为者所创作的一种人声作品的内容表达具体化的一种载体表现 @zh-hans
toolkit label: Gemeinschaftlicher Akteur als Beiträgerin/Beiträger von einer Rede von @de
toolkit label: agent collectif contributeur de contenu vocal de @fr
toolkit label: agent col·lectiu contribuïdor de discurs de @ca
toolkit label: bidragsyter til tale for (kollektiv agent) @no
toolkit label: bijdrager-collectieve actor van spraak van @nl
toolkit label: contributor collective agent of speech of @en
toolkit label: contributore agente collettivo di discorso di @it
toolkit label: ir runas līdzradītājs (grupa) @lv
toolkit label: kollektiv agent, som er bidragsyder til tale af @da
toolkit label: konuşmaya katkıda bulunan kolektif temsilci @tr
toolkit label: kõneloome kaastööline (kollektiiv) kehastuses @et
toolkit label: közreműködő kollektív ágense a következő beszédnek: @hu
toolkit label: puheeseen osallinen yhteistoimija manifestaatiossa
toolkit label: συντελεστής συλλογικός φορέας της ομιλίας του @el
toolkit label: وكيل جماعي مساهم في حديث @ar
toolkit label: ……的讲话的贡献者集体行为者 @zh-hans
has subproperty: puheeseen osallinen yhteisö manifestaatiossa
has subproperty: puheeseen osallinen suku manifestaatiossa
has subproperty: P50666
lexical alias: contributorCollectiveAgentOfSpeechOf.en
status: Published
type: Property
domain: C10011
label: er bidragsyter til tale for (kollektiv agent) @no
label: er kollektiv agent, som er bidragsyder til tale af @da
label: est un agent collectif contributeur de contenu vocal de @fr
label: ir runas līdzradītājs (grupa) @lv
label: is bijdrager-collectieve actor van spraak van @nl
label: is contributor collective agent of speech of @en
label: ist gemeinschaftlicher Akteur als Beiträgerin/Beiträger von einer Rede von @de
label: konuşmasının katkıda bulunan kolektif temsilcisidir @tr
label: kõneloome kaastööline (kollektiiv) kehastuses @et
label: közreműködő kollektív ágense a következő beszédnek: @hu
label: è contributore agente collettivo di discorso di @it
label: és agent col·lectiu contribuïdor de discurs de @ca
label: είναι συντελεστής συλλογικός φορέας της ομιλίας του @el
label: هو وكيل جماعي مساهم في حديث لـ @ar
label: 是……的讲话的贡献者集体行为者 @zh-hans
sub property of: puheeseen osallinen toimija manifestaatiossa
sub property of: aggregaattiin osallinen yhteistoimija manifestaatiossa
definition: Correla un agente collettivo a una manifestazione che è un aggregato che materializza un'opera orale creata da un agente collettivo. @it
definition: Hozzákapcsol egy kollektív ágenst egy aggregátum megjelenési formához, amely egy kollektív ágens által létrehozott beszédmű kifejezési formáját testesíti meg. @hu
definition: Kolektif temsilciyi, kolektif bir temsilci tarafından oluşturulan bir vokal eserin anlatımını somutlaştıran bir gösterimle ilişkilendirir. @tr
definition: Liittää yhteistoimijan manifestaatioon, joka on aggregaatti, joka sisältää puheteoksen ekspression, jonka yhteistoimija on luonut.
definition: Met un agent collectif en relation avec une manifestation qui consiste en un agrégat matérialisant une expression d’une œuvre vocale créée par un agent collectif. @fr
definition: Relaciona un agent col·lectiu amb una manifestació que és un agregat que materialitza una expressió d’una obra vocal que és creada per un agent col·lectiu. @ca
definition: Relateert een collectieve actor aan een manifestatie die een aggregaat is die een vocaal werk verwezenlijkt dat is gecreëerd door een collectieve actor. @nl
definition: Relaterer en kollektiv agent til en manifestasjon som er et aggregat som realiserer et verk av tale skapt av en kollektiv agent. @no
definition: Relaterer en kollektiv agent til en manifestation, som er en samling, som rummer et udtryk af et værk med talte ord, som er skabt af en kollektiv agent. @da
definition: Relates a collective agent to a manifestation that is an aggregate that embodies an expression of a vocal work that is created by a collective agent. @en
definition: Sasaista grupu ar manifestāciju, kas ir apkopojums, kas ietver grupas radītu mutvārdu darbu. @lv
definition: Seostab kollektiivi kehastusega, mis on liitum, milles on teostatud kollektiivi loodud suulise teose väljendus. @et
definition: Setzt einen gemeinschaftlichen Akteur in Beziehung zu einem Aggregat (Manifestation), das eine Expression eines gesprochenen Werks verkörpert, die ein gemeinschaftlicher Akteur erstellt hat. @de
definition: يربط وكيلا جماعيا بتجسيدة عبارة عن تجميعة تجسد عملا كلمة منطوقة أنشأه وكيل جماعي. @ar
definition: 将一个集体行为者与作为一种合集、把一个集体行为者所创作的一种人声作品的内容表达具体化的一种载体表现关联起来。 @zh-hans

stillkuvaan osallinen yhteistoimija manifestaatiossa
has element type: 2
toolkit definition: A manifestation that is an aggregate that embodies an expression of a still image work that is created by a collective agent. @en
toolkit definition: Een manifestatie die een aggregaat is die een expressie van een stilstaand beeldwerk verwezenlijkt dat is gecreëerd door een collectieve actor. @nl
toolkit definition: Egy aggregátum megjelenési forma, amely egy kollektív ágens által létrehozott állóképmű kifejezési formáját testesíti meg. @hu
toolkit definition: Ein Aggregat (Manifestation), das eine Expression eines unbewegten Bildwerks verkörpert, die ein gemeinschaftlicher Akteur erstellt hat. @de
toolkit definition: En manifestasjon som er et aggregat som realiserer et bildeverk skapt av en kollektiv agent. @no
toolkit definition: Kehastus, mis on liitum, milles on teostatud kollektiivi loodud liikumatust pildist koosneva teose väljendus. @et
toolkit definition: Kolektif bir temsilci tarafından oluşturulan hareketsiz bir görüntü eserinin anlatımını somutlaştıran topluluk olan bir gösterim. @tr
toolkit definition: Manifestaatio, joka on aggregaatti, joka sisältää stillkuvateoksen ekspression, jonka yhteistoimija on luonut.
toolkit definition: Manifestació que és un agregat que materialitza una expressió d’una obra d’imatge fixa que és creada per un agent col·lectiu. @ca
toolkit definition: Manifestation qui consiste en un agrégat matérialisant une expression d’une œuvre d’image fixe créée par un agent collectif. @fr
toolkit definition: Manifestation, som er en samling, som rummer et udtryk af et værk med stillbilleder, som er skabt af en kollektiv agent. @da
toolkit definition: Manifestazione che è un aggregato che materializza un'immagine fissa creata da un agente collettivo. @it
toolkit definition: Manifestācija, kas ir apkopojums, kas ietver grupas radītu attēla darbu. @lv
toolkit definition: تجسيدة تمثل تجميعة تجسد عملا بصور ثابتة أنشأه وكيل جماعي. @ar
toolkit definition: 作为一种合集、把一个集体行为者所创作的一种静态图像作品的内容表达具体化的一种载体表现 @zh-hans
toolkit label: Gemeinschaftlicher Akteur als Illustratorin/Illustrator von @de
toolkit label: agent collectif contributeur d’image fixe de @fr
toolkit label: agent col·lectiu contribuïdor d’imatge fixa de @ca
toolkit label: bidragsyter til bilde for (kollektiv agent) @no
toolkit label: bijdrager-collectieve actor van stilstaand beeld van @nl
toolkit label: contributor collective agent of still image of @en
toolkit label: contributore agente collettivo di immagine fissa di @it
toolkit label: hareketsiz görüntüye katkıda bulunan kolektif temsilci @tr
toolkit label: ir attēla līdzradītājs (grupa) @lv
toolkit label: kaastööline liikumatu pildi alal (kollektiiv) kehastuses @et
toolkit label: kollektiv agent, som er bidragsyder til stillbillede af @da
toolkit label: közreműködő kollektív ágense a következő állóképnek: @hu
toolkit label: stillkuvaan osallinen yhteistoimija manifestaatiossa
toolkit label: συντελεστής συλλογικός φορέας της σταθερής εικόνας του @el
toolkit label: وكيل جماعي مساهم في صور ثابتة @ar
toolkit label: ……的静态图像的贡献者集体行为者 @zh-hans
has subproperty: stillkuvaan osallinen yhteisö manifestaatiossa
has subproperty: stillkuvaan osallinen suku manifestaatiossa
has subproperty: P50667
lexical alias: contributorCollectiveAgentOfStillImageOf.en
status: Published
type: Property
domain: C10011
label: durağan görüntüsüne katkıda bulunan kolektif temsilcisidir @tr
label: er bidragsyter til bilde for (kollektiv agent) @no
label: er kollektiv agent, som er bidragsyder til stillbillede af @da
label: est un agent collectif contributeur d’image fixe de @fr
label: ir attēla līdzradītājs (grupa) @lv
label: is bijdrager-collectieve actor van stilstaand beeld van @nl
label: is contributor collective agent of still image of @en
label: ist gemeinschaftlicher Akteur als Illustratorin/Illustrator von @de
label: kaastööline liikumatu pildi alal (kollektiiv) kehastuses @et
label: közreműködő kollektív ágense a következő állóképnek: @hu
label: è contributore agente collettivo di immagine fissa di @it
label: és agent col·lectiu contribuïdor d’imatge fixa de @ca
label: είναι συντελεστής συλλογικός φορέας της σταθερής εικόνας του @el
label: هو وكيل جماعي مساهم في صور ثابتة لـ @ar
label: 是……的静态图像的贡献者集体行为者 @zh-hans
sub property of: stillkuvaan osallinen toimija manifestaatiossa
sub property of: aggregaattiin osallinen yhteistoimija manifestaatiossa
definition: Correla un agente collettivo a una manifestazione che è un aggregato che materializza un'immagine fissa creata da un agente collettivo. @it
definition: Hozzákapcsol egy kollektív ágenst egy aggregátum megjelenési formához, amely egy kollektív ágens által létrehozott állóképmű kifejezési formáját testesíti meg. @hu
definition: Kolektif temsilciyi, kolektif bir temsilci tarafından oluşturulan bir hareketsiz görüntünün anlatımını somutlaştıran bir gösterimle ilişkilendirir. @tr
definition: Liittää yhteistoimijan manifestaatioon, joka on aggregaatti, joka sisältää stillkuvateoksen ekspression, jonka yhteistoimija on luonut.
definition: Met un agent collectif en relation avec une manifestation qui consiste en un agrégat matérialisant une expression d’une œuvre d’image fixe créée par un agent collectif. @fr
definition: Relaciona un agent col·lectiu amb una manifestació que és un agregat que materialitza una expressió d’una obra d’imatge fixa que és creada per un agent col·lectiu. @ca
definition: Relateert een collectieve actor aan een manifestatie die een aggregaat is die een expressie van een stilstaand beeldwerk verwezenlijkt dat is gecreëerd door een collectieve actor. @nl
definition: Relaterer en kollektiv agent til en manifestasjon som er et aggregat som realiserer et bildeverk skapt av en kollektiv agent. @no
definition: Relaterer en kollektiv agent til en manifestation, som er en samling, som rummer et udtryk af et værk med stillbilleder, som er skabt af en kollektiv agent. @da
definition: Relates a collective agent to a manifestation that is an aggregate that embodies an expression of a still image work that is created by a collective agent. @en
definition: Sasaista grupu ar manifestāciju, kas ir apkopojums, kas ietver grupas radītu attēla darbu. @lv
definition: Seostab kollektiivi kehastusega, mis on liitum, milles on teostatud kollektiivi loodud liikumatust pildist koosneva teose väljendus. @et
definition: Setzt einen gemeinschaftlichen Akteur in Beziehung zu einem Aggregat (Manifestation), das eine Expression eines unbewegten Bildwerks verkörpert, die ein gemeinschaftlicher Akteur erstellt hat. @de
definition: يربط وكيلا جماعيا بتجسيدة عبارة عن تجميعة تجسد عملا بصور ثابتة أنشأه وكيل جماعي. @ar
definition: 将一个集体行为者与作为一种合集、把一个集体行为者所创作的一种静态图像作品的内容表达具体化的一种载体表现关联起来。 @zh-hans

tekstiin osallinen yhteistoimija manifestaatiossa
has element type: 2
toolkit definition: A manifestation that is an aggregate that embodies an expression of a textual work that is created by a collective agent. @en
toolkit definition: Een manifestatie die een aggregaat is die een expressie van een tekstwerk verwezenlijkt dat is gecreëerd door een collectieve actor. @nl
toolkit definition: Egy aggregátum megjelenési forma, amely egy kollektív ágens által létrehozott szöveges mű kifejezési formáját testesíti meg. @hu
toolkit definition: Ein Aggregat (Manifestation), das eine Expression eines textlichen Werks verkörpert, die ein gemeinschaftlicher Akteur erstellt hat. @de
toolkit definition: En manifestasjon som er et aggregat som realiserer et tekstlig verk skapt av en kollektiv agent. @no
toolkit definition: Kehastus, mis on liitum, milles on teostatud kollektiivi loodud tekstteose väljendus. @et
toolkit definition: Kolektif bir temsilci tarafından oluşturulan metinsel bir eserin anlatımını somutlaştıran topluluk olan bir gösterim. @tr
toolkit definition: Manifestaatio, joka on aggregaatti, joka sisältää tekstiteoksen ekspression, jonka yhteistoimija on luonut.
toolkit definition: Manifestació que és un agregat que materialitza una obra textual creada per un agent col·lectiu. @ca
toolkit definition: Manifestation qui consiste en un agrégat matérialisant une expression d’une œuvre textuelle créée par un agent collectif. @fr
toolkit definition: Manifestation, som er en samling, som rummer et udtryk af et tekstværk, som er skabt af en kollektiv agent. @da
toolkit definition: Manifestazione che è un aggregato che materializza un'opera testuale creata da un agente collettivo. @it
toolkit definition: Manifestācija, kas ir apkopojums, kas ietver grupas radītu teksta darbu. @lv
toolkit definition: تجسيدة تمثل تجميعة تجسد عملا نصي أنشأه وكيل جماعي. @ar
toolkit definition: 作为一种合集、把一个集体行为者所创作的一种文字作品的内容表达具体化的一种载体表现 @zh-hans
toolkit label: Gemeinschaftlicher Akteur als Beiträgerin/Beiträger von ergänzendem Text von @de
toolkit label: agent collectif contributeur de texte de @fr
toolkit label: agent col·lectiu contribuïdor de text de @ca
toolkit label: bidragsyter til tekst for (kollektiv agent) @no
toolkit label: bijdrager-collectieve actor van tekst van @nl
toolkit label: contributor collective agent of text of @en
toolkit label: contributore agente collettivo di testo di @it
toolkit label: ir teksta līdzradītājs (grupa) @lv
toolkit label: kollektiv agent, som er bidragsyder til tekst af @da
toolkit label: közreműködő kollektív ágense a következő szövegnek: @hu
toolkit label: metne katkıda bulunan kolektif temsilci @tr
toolkit label: tekstiin osallinen yhteistoimija manifestaatiossa
toolkit label: tekstiloome kaastööline (kollektiiv) kehastuses @et
toolkit label: συντελεστής συλλογικός φορέας του κειμένου του @el
toolkit label: وكيل جماعي مساهم في نص @ar
toolkit label: ……的文本的贡献者集体行为者 @zh-hans
has subproperty: tekstiin osallinen yhteisö manifestaatiossa
has subproperty: tekstiin osallinen suku manifestaatiossa
has subproperty: P50668
lexical alias: contributorCollectiveAgentOfTextOf.en
status: Published
type: Property
domain: C10011
label: er bidragsyter til tekst for (kollektiv agent) @no
label: er kollektiv agent, som er bidragsyder til tekst af @da
label: est un agent collectif contributeur de texte de @fr
label: ir teksta līdzradītājs (grupa) @lv
label: is bijdrager-collectieve actor van tekst van @nl
label: is contributor collective agent of text of @en
label: ist gemeinschaftlicher Akteur als Beiträgerin/Beiträger von ergänzendem Text von @de
label: közreműködő kollektív ágense a következő szövegnek: @hu
label: metninin katkıda bulunan kolektif temsilcisidir @tr
label: tekstiloome kaastööline (kollektiiv) kehastuses @et
label: è contributore agente collettivo di testo di @it
label: és agent col·lectiu contribuïdor de text de @ca
label: είναι συντελεστής συλλογικός φορέας του κειμένου του @el
label: هو وكيل جماعي مساهم في نص لـ @ar
label: 是……的文本的贡献者集体行为者 @zh-hans
sub property of: tekstiin osallinen toimija manifestaatiossa
sub property of: aggregaattiin osallinen yhteistoimija manifestaatiossa
definition: Correla un agente collettivo a una manifestazione che è un aggregato che materializza un'opera testuale creata da un agente collettivo. @it
definition: Hozzákapcsol egy kollektív ágenst egy aggregátum megjelenési formához, amely egy kollektív ágens által létrehozott szöveges mű kifejezési formáját testesíti meg. @hu
definition: Kolektif temsilciyi, kolektif bir temsilci tarafından oluşturulan metinsel eserin anlatımını somutlaştıran bir gösterimle ilişkilendirir. @tr
definition: Liittää yhteistoimijan manifestaatioon, joka on aggregaatti, joka sisältää tekstiteoksen ekspression, jonka yhteistoimija on luonut.
definition: Met un agent collectif en relation avec une manifestation qui consiste en un agrégat matérialisant une expression d’une œuvre textuelle créée par un agent collectif. @fr
definition: Relaciona un agent col·lectiu amb una manifestació que és un agregat que materialitza una expressió d’una obra textual creada per un agent col·lectiu. @ca
definition: Relateert een collectieve actor aan een manifestatie die een aggregaat is die een expressie van een tekstwerk verwezenlijkt dat is gecreëerd door een collectieve actor. @nl
definition: Relaterer en kollektiv agent til en manifestasjon som er et aggregat som realiserer et tekstlig verk skapt av en kollektiv agent. @no
definition: Relaterer en kollektiv agent til en manifestation, som er en samling, som rummer et udtryk af et tekstværk, som er skabt af en kollektiv agent. @da
definition: Relates a collective agent to a manifestation that is an aggregate that embodies an expression of a textual work that is created by a collective agent. @en
definition: Sasaista grupu ar manifestāciju, kas ir apkopojums, kas ietver grupas radītu teksta darbu. @lv
definition: Seostab kollektiivi kehastusega, mis on liitum, milles on teostatud kollektiivi loodud tekstteose väljendus. @et
definition: Setzt einen gemeinschaftlichen Akteur in Beziehung zu einem Aggregat (Manifestation), das eine Expression eines textlichen Werks verkörpert, die ein gemeinschaftlicher Akteur erstellt hat. @de
definition: يربط وكيلا جماعيا بتجسيدة عبارة عن تجميعة تجسد عملا نصي أنشأه وكيل جماعي. @ar
definition: 将一个集体行为者与作为一种合集、把一个集体行为者所创作的一种文字作品的内容表达具体化的一种载体表现关联起来。 @zh-hans

esineeseen osallinen yhteistoimija manifestaatiossa
has element type: 2
toolkit definition: A manifestation that is an aggregate that embodies an expression of an object work that is created by a collective agent. @en
toolkit definition: Een manifestatie die een aggregaat is die een expressie van een objectwerk verwezenlijkt dat is gecreëerd door een collectieve actor. @nl
toolkit definition: Egy aggregátum megjelenési forma, amely egy kollektív ágens által létrehozott objektummű kifejezési formáját testesíti meg. @hu
toolkit definition: Ein Aggregat (Manifestation), das eine Expression eines gegenständlichen Werks verkörpert, die ein gemeinschaftlicher Akteur erstellt hat. @de
toolkit definition: En manifestasjon som er et aggregat som realiserer et verk som er en gjenstand skapt av en kollektiv agent. @no
toolkit definition: Kehastus, mis on liitum, milles on teostatud kollektiivi loodud objektteose väljendus. @et
toolkit definition: Kolektif bir temsilci tarafından oluşturulan bir nesne eserinin anlatımını somutlaştıran topluluk olan bir gösterim. @tr
toolkit definition: Manifestaatio, joka on aggregaatti, joka sisältää esineteoksen ekspression, jonka yhteistoimija on luonut.
toolkit definition: Manifestació que és un agregat que materialitza una expressió d’una obra d’objecte que és creada per un agent col·lectiu. @ca
toolkit definition: Manifestation qui consiste en un agrégat matérialisant une expression d’une œuvre objet créée par un agent collectif. @fr
toolkit definition: Manifestation, som er en samling, som rummer et udtryk af et værk med objekt, som er skabt af en kollektiv agent. @da
toolkit definition: Manifestazione che è un aggregato che materializza un oggetto creato da un agente collettivo. @it
toolkit definition: Manifestācija, kas ir apkopojums, kas ietver grupas radītu objekta darbu. @lv
toolkit definition: تجسيدة تمثل تجميعة تجسد عملا كائنا أنشأه وكيل جماعي. @ar
toolkit definition: 作为一种合集、把一个集体行为者所创作的一种物体作品的内容表达具体化的一种载体表现 @zh-hans
toolkit label: Gemeinschaftlicher Akteur als Beiträgerin/Beiträger von einem Gegenstand von @de
toolkit label: agent collectif contributeur d’objet de @fr
toolkit label: agent col·lectiu contribuïdor d’objecte de @ca
toolkit label: bidragsyter til gjenstand for (kollektiv agent) @no
toolkit label: bijdrager-collectieve actor van object van @nl
toolkit label: contributor collective agent of object of @en
toolkit label: contributore agente collettivo di oggetto di @it
toolkit label: esineeseen osallinen yhteistoimija manifestaatiossa
toolkit label: ir objekta līdzradītājs (grupa) @lv
toolkit label: kollektiv agent, som er bidragsyder til objekt af @da
toolkit label: közreműködő kollektív ágense a következő objektumnak: @hu
toolkit label: nesneye katkıda bulunan kolektif temsilci @tr
toolkit label: objektiloome kaastööline (kollektiiv) kehastuses @et
toolkit label: συντελεστής συλλογικός φορέας του αντικειμένου του @el
toolkit label: وكيل جماعي مساهم في كيان @ar
toolkit label: ……的物体的贡献者集体行为者 @zh-hans
has subproperty: esineeseen osallinen yhteisö manifestaatiossa
has subproperty: esineeseen osallinen suku manifestaatiossa
has subproperty: P50669
lexical alias: contributorCollectiveAgentOfObjectOf.en
status: Published
type: Property
domain: C10011
label: er bidragsyter til gjenstand for (kollektiv agent) @no
label: er kollektiv agent, som er bidragsyder til objekt af @da
label: est un agent collectif contributeur d’objet de @fr
label: ir objekta līdzradītājs (grupa) @lv
label: is bijdrager-collectieve actor van object van @nl
label: is contributor collective agent of object of @en
label: ist gemeinschaftlicher Akteur als Beiträgerin/Beiträger von einem Gegenstand von @de
label: közreműködő kollektív ágense a következő objektumnak: @hu
label: nesnesinin katkıda bulunan kolektif temsilcisidir @tr
label: objektiloome kaastööline (kollektiiv) kehastuses @et
label: è contributore agente collettivo di oggetto di @it
label: és agent col·lectiu contribuïdor d’objecte de @ca
label: είναι συντελεστής συλλογικός φορέας του αντικειμένου του @el
label: هو وكيل جماعي مساهم في كيان لـ @ar
label: 是……的物体的贡献者集体行为者 @zh-hans
sub property of: esineeseen osallinen toimija manifestaatiossa
sub property of: aggregaattiin osallinen yhteistoimija manifestaatiossa
definition: Correla un agente collettivo a una manifestazione che è un aggregato che materializza un oggetto creato da un agente collettivo. @it
definition: Hozzákapcsol egy kollektív ágenst egy aggregátum megjelenési formához, amely egy kollektív ágens által létrehozott objektummű kifejezési formáját testesíti meg. @hu
definition: Kolektif temsilciyi, kolektif bir temsilci tarafından oluşturulan bir nesne eserinin ifadesini somutlaştıran bir gösterimle ilişkilendirir. @tr
definition: Liittää yhteistoimijan manifestaatioon, joka on aggregaatti, joka sisältää esineteoksen ekspression, jonka yhteistoimija on luonut.
definition: Met un agent collectif en relation avec une manifestation qui consiste en un agrégat matérialisant une expression d’une œuvre textuelle créée par un agent collectif. @fr
definition: Relaciona un agent col·lectiu amb una manifestació que és un agregat que materialitza una expressió d’una obra d’objecte que és creada per un agent col·lectiu. @ca
definition: Relateert een collectieve actor aan een manifestatie die een aggregaat is die een expressie van een objectwerk verwezenlijkt dat is gecreëerd door een collectieve actor. @nl
definition: Relaterer en kollektiv agent til en manifestasjon som er et aggregat som realiserer et verk som er en gjenstand skapt av en kollektiv agent. @no
definition: Relaterer en kollektiv agent til en manifestation, som er en samling, som rummer et udtryk af et værk med objekt, som er skabt af en kollektiv agent. @da
definition: Relates a collective agent to a manifestation that is an aggregate that embodies an expression of an object work that is created by a collective agent. @en
definition: Sasaista grupu ar manifestāciju, kas ir apkopojums, kas ietver grupas radītu objekta darbu. @lv
definition: Seostab kollektiivi kehastusega, mis on liitum, milles on teostatud kollektiivi loodud objektteose väljendus. @et
definition: Setzt einen gemeinschaftlichen Akteur in Beziehung zu einem Aggregat (Manifestation), das eine Expression eines gegenständlichen Werks verkörpert, die ein gemeinschaftlicher Akteur erstellt hat. @de
definition: يربط وكيلا جماعيا بتجسيدة عبارة عن تجميعة تجسد عملا كائنا أنشأه وكيل جماعي. @ar
definition: 将一个集体行为者与作为一种合集、把一个集体行为者所创作的一种物体作品的内容表达具体化的一种载体表现关联起来。 @zh-hans

digitaaliseen sisältöön osallinen yhteistoimija manifestaatiossa
has element type: 2
toolkit definition: A manifestation that is an aggregate that embodies an expression of computer content created by a collective agent. @en
toolkit definition: Een manifestatie die een aggregaat is die een expressie van computercontent verwezenlijkt die is gecreëerd door een collectieve actor. @nl
toolkit definition: Egy aggregátum megjelenési forma, amely egy kollektív ágens által létrehozott számítógépes tartalom kifejezési formáját testesíti meg. @hu
toolkit definition: Ein Aggregat (Manifestation), das eine Expression von Computer Content verkörpert, die ein gemeinschaftlicher Akteur erstellt hat. @de
toolkit definition: En manifestasjon som er et aggregat som realiserer datamaskininnhold skapt av en kollektiv agent. @no
toolkit definition: Kehastus, mis on liitum, milles on teostatud kollektiivi loodud digisisu väljendus. @et
toolkit definition: Kolektif bir temsilci tarafından oluşturulan bir bilgisayar destekli içeriğin anlatımını somutlaştıran topluluk olan bir gösterim. @tr
toolkit definition: Manifestaatio, joka on aggregaatti, joka sisältää digitaalisen sisällön ekspression, jonka yhteistoimija on luonut.
toolkit definition: Manifestació que és un agregat que materialitza una expressió de contingut informàtic creada per un agent col·lectiu. @ca
toolkit definition: Manifestation qui consiste en un agrégat matérialisant une expression d’un contenu informatique créé par un agent collectif. @fr
toolkit definition: Manifestation, som er en samling, som rummer et udtryk af computerindhold skabt af en kollektiv agent. @da
toolkit definition: Manifestazione che è un aggregato che materializza contenuto informatico creato da un agente collettivo. @it
toolkit definition: Manifestācija, kas ir apkopojums, kas ietver grupas radītu datororientētu saturu. @lv
toolkit definition: تجسيدة تمثل تجميعة تجسد محتوى حاسوبي أنشأه وكيل جماعي. @ar
toolkit definition: 作为一种合集、把一个集体行为者所创作的一种计算机内容的内容表达具体化的一种载体表现 @zh-hans
toolkit label: Gemeinschaftlicher Akteur als Beiträgerin/Beiträger von Computer Content von @de
toolkit label: agent collectif contributeur de contenu informatique de @fr
toolkit label: agent col·lectiu contribuïdor de contingut informàtic de @ca
toolkit label: bidragsyter til datamaskininnhold for (kollektiv agent) @no
toolkit label: bijdrager-collectieve actor van computercontent van @nl
toolkit label: bilgisayar içeriğine katkıda bulunan kolektif temsilci @tr
toolkit label: contributor collective agent of computer content of @en
toolkit label: contributore agente collettivo di contenuto informatico di @it
toolkit label: digisisu kaastööline (kollektiiv) kehastuses @et
toolkit label: digitaaliseen sisältöön osallinen yhteistoimija manifestaatiossa
toolkit label: ir datororientēta satura līdzradītājs (grupa) @lv
toolkit label: kollektiv agent, som er bidragsyder til computerindhold af @da
toolkit label: közreműködő kollektív ágense a következő számítógépes tartalomnak: @hu
toolkit label: συντελεστής συλλογικός φορέας του περιεχομένου του υπολογιστή του @el
toolkit label: وكيل جماعي مساهم في محتوى حاسوبي @ar
toolkit label: ……的计算机内容贡献者集体行为者 @zh-hans
has subproperty: digitaaliseen sisältöön osallinen yhteisö manifestaatiossa
has subproperty: digitaaliseen sisältöön osallinen suku manifestaatiossa
has subproperty: P50670
lexical alias: contributorCollectiveAgentOfComputerContentOf.en
status: Published
type: Property
domain: C10011
label: bilgisayar içeriğinin katkıda bulunan kolektif temsilcisidir @tr
label: digisisu kaastööline (kollektiiv) kehastuses @et
label: er bidragsyter til datamaskininnhold for (kollektiv agent) @no
label: er kollektiv agent, som er bidragsyder til computerindhold af @da
label: est un agent collectif contributeur de contenu informatique de @fr
label: ir datororientēta satura līdzradītājs (grupa) @lv
label: is bijdrager-collectieve actor van computercontent van @nl
label: is contributor collective agent of computer content of @en
label: ist gemeinschaftlicher Akteur als Beiträgerin/Beiträger von Computer Content von @de
label: közreműködő kollektív ágense a következő számítógépes tartalomnak: @hu
label: è contributore agente collettivo di contenuto informatico di @it
label: és agent col·lectiu contribuïdor de contingut informàtic de @ca
label: είναι συντελεστής συλλογικός φορέας του περιεχομένου του υπολογιστή του @el
label: هو وكيل جماعي مساهم في محتوى حاسوبي لـ @ar
label: 是……的计算机内容贡献者集体行为者 @zh-hans
sub property of: digitaaliseen sisältöön osallinen toimija manifestaatiossa
sub property of: aggregaattiin osallinen yhteistoimija manifestaatiossa
definition: Correla un agente collettivo a una manifestazione che è un aggregato che materializza contenuto informatico creato da un agente collettivo. @it
definition: Hozzákapcsol egy kollektív ágenst egy aggregátum megjelenési formához, amely egy kollektív ágens által létrehozott számítógépes tartalom kifejezési formáját testesíti meg. @hu
definition: Kolektif temsilciyi, kolektif bir temsilci tarafından oluşturulan bilgisayar içeriğinin bir anlatımını somutlaştıran bir gösterimle ilişkilendirir. @tr
definition: Liittää yhteistoimijan manifestaatioon, joka on aggregaatti, joka sisältää digitaalisen sisällön ekspression, jonka yhteistoimija on luonut.
definition: Met un agent collectif en relation avec une manifestation qui consiste en un agrégat matérialisant une expression d’un contenu informatique créé par un agent collectif. @fr
definition: Relaciona un agent col·lectiu amb una manifestació que és un agregat que materialitza una expressió de contingut informàtic creada per un agent col·lectiu. @ca
definition: Relateert een collectieve actor aan een manifestatie die een aggregaat is die een expressie van computercontent verwezenlijkt die is gecreëerd door een collectieve actor. @nl
definition: Relaterer en kollektiv agent til en manifestasjon som er et aggregat som realiserer datamaskininnhold skapt av en kollektiv agent. @no
definition: Relaterer en kollektiv agent til en manifestation, som er en samling, som rummer et udtryk af computerindhold skabt af en kollektiv agent. @da
definition: Relates a collective agent to a manifestation that is an aggregate that embodies an expression of computer content created by a collective agent. @en
definition: Sasaista grupu ar manifestāciju, kas ir apkopojums, kas ietver grupas radītu datororientētu saturu. @lv
definition: Seostab kollektiivi kehastusega, mis on liitum, milles on teostatud kollektiivi loodud digisisu väljendus. @et
definition: Setzt einen gemeinschaftlichen Akteur in Beziehung zu einem Aggregat (Manifestation), das eine Expression von Computer Content verkörpert, die ein gemeinschaftlicher Akteur erstellt hat. @de
definition: يربط وكيلا جماعيا بتجسيدة عبارة عن تجميعة تجسد محتوى حاسوبي أنشأه وكيل جماعي. @ar
definition: 将一个集体行为者与作为一种合集、把一个集体行为者所创作的一种计算机内容的内容表达具体化的一种载体表现关联起来。 @zh-hans

maanmittari (yhteistoimija) manifestaatiossa
has element type: 2
toolkit definition: A manifestation that is an aggregate that includes a contribution by a collective agent of providing measurements or dimensional relationships for a geographic area. @en
toolkit definition: Bir coğrafi alan için ölçümler veya boyutsal ilişkiler sağlayan bir kolektif bir temsilcinin katkısını içeren topluluk olan bir gösterim. @tr
toolkit definition: Een manifestatie die een aggregaat is die omvat een bijdrage door een collectieve actor die levert maten of dimensionale verhoudingen voor een geografisch gebied. @nl
toolkit definition: Egy aggregátum megjelenési forma, amely magában foglalja egy kollektív ágens közreműködését egy földrajzi terület mérésében vagy dimenziós összefüggéseinek szolgáltatásában. @hu
toolkit definition: Ein Aggregat (Manifestation), zu dem ein gemeinschaftlicher Akteur beiträgt, indem er Messwerte oder Abmessungsverhältnisse für einen dargestellten geografischen Bereich zur Verfügung stellt. @de
toolkit definition: En manifestasjon som er et aggregat som inkluderer et bidrag fra en kollektiv agent i form av å tilføre målinger eller størrelsesforhold for et geografisk område. @no
toolkit definition: Kehastus, mis on liitum, millesse kollektiiv on andnud panuse, hankides geograafilise piirkonna mõõdud või mõõdusuhted. @et
toolkit definition: Manifestaatio, joka on aggregaatti, jossa yhteistoimija on osallisena kartantekijänä maantieteellisen alueen mittojen tai mittasuhteiden tuottamisessa.
toolkit definition: Manifestació que és un agregat que inclou una contribució d’un agent col·lectiu proporcionant mesuraments o relacions dimensionals d’una àrea geogràfica. @ca
toolkit definition: Manifestation qui consiste en un agrégat qui intègre une contribution par un agent collectif consistant à fournir des mesures ou des relations dimensionnelles pour une aire géographique. @fr
toolkit definition: Manifestation, som er en samling, som omfatter en kollektiv agents bidrag ved at angive målinger eller dimensionelle forhold for et geografisk område. @da
toolkit definition: Manifestazione che è un aggregato che comprende un contributo di un agente collettivo nel fornire misurazioni o rapporti dimensionali per un'area geografica. @it
toolkit definition: Manifestācija, kas ir apkopojums, kas ietver grupas ieguldījumu, nodrošinot ģeogrāfisko apgabalu mērījumus vai dimensiju attiecības. @lv
toolkit definition: تجسيدة تمثل تجميعة تتضمن إسهام وكيل جماعي في قياس الأبعاد أو العلاقات المكانية لمنطقة جغرافية.. @ar
toolkit definition: 作为一种合集、包括为一个地理区域提供测量或尺寸关系的一个集体行为者的贡献的一种载体表现 @zh-hans
toolkit label: Gemeinschaftlicher Akteur als Landvermesserin/Landvermesser von @de
toolkit label: agent collectif arpenteur de @fr
toolkit label: agent col·lectiu agrimensor de @ca
toolkit label: agrimensore agente collettivo di @it
toolkit label: földmérő kollektív ágense: @hu
toolkit label: ir topogrāfs (grupa) @lv
toolkit label: kollektiv agent, som er landinspektør af @da
toolkit label: landmeter-collectieve actor van @nl
toolkit label: landmåler for (kollektiv agent) @no
toolkit label: maamõõtja (kollektiiv) kehastuses @et
toolkit label: maanmittari (yhteistoimija) manifestaatiossa
toolkit label: surveyor collective agent of @en
toolkit label: topograf kolektif temsilcisi @tr
toolkit label: τοπογράφος μηχανικός συλλογικός φορέας του @el
toolkit label: وكيل جماعي مسّاح @ar
toolkit label: ……的测绘者集体行为者 @zh-hans
has subproperty: maanmittari (yhteisö) manifestaatiossa
has subproperty: maanmittari (suku) manifestaatiossa
has subproperty: P50671
lexical alias: surveyorCollectiveAgentOf.en
status: Published
type: Property
domain: C10011
label: Topograf kolektif temsilcisi @tr
label: er kollektiv agent, som er landinspektør af @da
label: er landmåler for (kollektiv agent) @no
label: est un agent collectif arpenteur de @fr
label: földmérő kollektív ágense a következőnek: @hu
label: ir topogrāfs (grupa) @lv
label: is landmeter-collectieve actor van @nl
label: is surveyor collective agent of @en
label: ist gemeinschaftlicher Akteur als Landvermesserin/Landvermesser von @de
label: maamõõtja (kollektiiv) kehastuses @et
label: è agrimensore agente collettivo di @it
label: és agent col·lectiu agrimensor de @ca
label: είναι τοπογράφος μηχανικός συλλογικός φορέας του @el
label: هو وكيل جماعي مسّاح لـ @ar
label: 是……的测绘者集体行为者 @zh-hans
sub property of: maanmittari (toimija) manifestaatiossa
sub property of: kartografiaan osallinen yhteistoimija manifestaatiossa
definition: Correla un agente collettivo a una manifestazione che è un aggregato che comprende un contributo di un agente collettivo nel fornire misurazioni o rapporti dimensionali per un'area geografica. @it
definition: Hozzákapcsol egy kollektív ágenst egy aggregátum megjelenési formához, amely magában foglalja egy kollektív ágens közreműködését egy földrajzi terület mérésében vagy dimenziós összefüggéseinek szolgáltatásában. @hu
definition: Kolektif bir temsilciyi, bir kolektif temsilcinin bir coğrafi alan için ölçümler veya boyutsal ilişkiler sağlama katkısını içeren bir bütünü olan gösterimle ilişkilendirir. @tr
definition: Liittää yhteistoimijan manifestaatioon, joka on aggregaatti, jossa yhteistoimija on osallisena kartantekijänä maantieteellisen alueen mittojen tai mittasuhteiden tuottamisessa.
definition: Met un agent collectif en relation avec une manifestation qui consiste en un agrégat qui intègre une contribution par un agent collectif consistant à fournir des mesures ou des relations dimensionnelles pour une aire géographique. @fr
definition: Relaciona un agent col·lectiu amb una manifestació que és un agregat que inclou una contribució d’un agent col·lectiu proporcionant mesuraments o relacions dimensionals d’una àrea geogràfica. @ca
definition: Relateert een collectieve actor aan een manifestatie die een aggregaat is die omvat een bijdrage door een collectieve actor die levert maten of dimensionale verhoudingen voor een geografisch gebied. @nl
definition: Relaterer en kollektiv agent til en manifestasjon som er et aggregat som inkluderer et bidrag fra en kollektiv agent i form av å tilføre målinger eller størrelsesforhold for et geografisk område. @no
definition: Relaterer en kollektiv agent til en manifestation, som er en samling, som omfatter en kollektiv agents bidrag ved at angive målinger eller dimensionelle forhold for et geografisk område. @da
definition: Relates a collective agent to a manifestation that is an aggregate that includes a contribution by a collective agent of providing measurements or dimensional relationships for a geographic area. @en
definition: Sasaista grupu ar manifestāciju, kas ir apkopojums, kas ietver grupas ieguldījumu, nodrošinot ģeogrāfisko apgabalu mērījumus vai dimensiju attiecības. @lv
definition: Seostab kollektiivi kehastusega, mis on liitum, millesse kollektiiv on andnud panuse, hankides geograafilise piirkonna mõõdud või mõõdusuhted. @et
definition: Setzt einen gemeinschaftlichen Akteur in Beziehung zu einem Aggregat (Manifestation), zu dem ein gemeinschaftlicher Akteur beiträgt, indem er Messwerte oder Abmessungsverhältnisse für einen dargestellten geografischen Bereich zur Verfügung stellt. @de
definition: يربط وكيلا جماعيا بتجسيدة عبارة عن تجميعة تتضمن إسهام وكيل جماعي في قياس الأبعاد أو العلاقات المكانية لمنطقة جغرافية. @ar
definition: 将一个集体行为者与作为一种合集、包括为一个地理区域提供测量或尺寸关系的一个集体行为者的贡献的一种载体表现关联起来。 @zh-hans

aggregaattiin osallinen yhteistoimija manifestaatiossa
has element type: 2
toolkit definition: A manifestation that is an aggregate that embodies an expression of a work that is created by a collective agent. @en
toolkit definition: Een manifestatie die een aggregaat is die een expressie van een werk verwezenlijkt dat is gecreëerd door een collectieve actor. @nl
toolkit definition: Egy aggregátum megjelenési forma, amely egy kollektív ágens által létrehozott mű kifejezési formáját testesíti meg. @hu
toolkit definition: Ein Aggregat (Manifestation), das eine Expression eines Werks verkörpert, die ein gemeinschaftlicher Akteur erstellt hat. @de
toolkit definition: En manifestasjon som er et aggregat som inkluderer et bidrag fra en kollektiv agent. @no
toolkit definition: Kehastus, mis on liitum, milles on teostatud tegija loodud teose väljendus. @et
toolkit definition: Kolektif bir temsilci tarafından oluşturulan bir eserin anlatımını somutlaştıran topluluk olan bir gösterim. @tr
toolkit definition: Manifestaatio, joka on aggregaatti, joka sisältää teoksen ekspression, jonka yhteistoimija on luonut.
toolkit definition: Manifestació que és un agregat que materialitza una expressió d’una obra que és creada per un agent col·lectiu. @ca
toolkit definition: Manifestation qui consiste en un agrégat matérialisant une expression d’une œuvre créée par un agent collectif. @fr
toolkit definition: Manifestation, som er en samling, som omfatter et udtryk af et værk, som er skabt af en kollektiv agent. @da
toolkit definition: Manifestazione che è un aggregato che comprende un contributo di un agente collettivo. @it
toolkit definition: Manifestācija, kas ir apkopojums, kas ietver grupas ieguldījumu/līdzdalību. @lv
toolkit definition: تجسيدة عبارة عن تجميعة تتضمن إسهام وكيل جماعي. @ar
toolkit definition: 作为一种合集、把一个集体行为者所创作的一种作品的内容表达具体化的一种载体表现 @zh-hans
toolkit label: Gemeinschaftlicher Akteur als Beiträgerin/Beiträger zu einem Aggregat von @de
toolkit label: agent collectif contributeur à un agrégat de @fr
toolkit label: agent col·lectiu contribuïdor a un agregat de @ca
toolkit label: aggregaattiin osallinen yhteistoimija manifestaatiossa
toolkit label: bidragsyter til aggregat for (kollektiv agent) @no
toolkit label: bijdrager-collectieve actor aan aggregaat van @nl
toolkit label: contributor collective agent to aggregate of @en
toolkit label: contributore agente collettivo di aggregato di @it
toolkit label: ir apkopojuma līdzradītājs (grupa) @lv
toolkit label: kollektiv agent, som er bidragsyder til samling af @da
toolkit label: közreműködő kollektív ágense a következő aggregátumnak: @hu
toolkit label: liitumi kaastööline (kollektiiv) kehastuses @et
toolkit label: topluluğa katkıda bulunan kolektif temsilci @tr
toolkit label: συντελεστής συλλογικός φορέας της συνάθροισης του @el
toolkit label: وكيل جماعي مساهم في تجميعة @ar
toolkit label: ……的合集的贡献者集体行为者 @zh-hans
has subproperty: kartografiaan osallinen yhteistoimija manifestaatiossa
has subproperty: koreografiaan osallinen yhteistoimija manifestaatiossa
has subproperty: liikkuvaan kuvaan osallinen yhteistoimija
has subproperty: musiikkiin osallinen yhteistoimija manifestaatiossa
has subproperty: puheeseen osallinen yhteistoimija manifestaatiossa
has subproperty: stillkuvaan osallinen yhteistoimija manifestaatiossa
has subproperty: tekstiin osallinen yhteistoimija manifestaatiossa
has subproperty: esineeseen osallinen yhteistoimija manifestaatiossa
has subproperty: digitaaliseen sisältöön osallinen yhteistoimija manifestaatiossa
has subproperty: aggregaattiin osallinen yhteisö manifestaatiossa
has subproperty: aggregaattiin osallinen suku manifestaatiossa
has subproperty: P50672
lexical alias: contributorCollectiveAgentToAggregateOf.en
status: Published
type: Property
domain: C10011
label: er bidragsyter til aggregat for (kollektiv agent) @no
label: er kollektiv agent, som er bidragsyder til samling af @da
label: est un agent collectif contributeur à un agrégat de @fr
label: ir apkopojuma līdzradītājs (grupa) @lv
label: is bijdrager-collectieve actor aan aggregaat van @nl
label: is contributor collective agent to aggregate of @en
label: ist gemeinschaftlicher Akteur als Beiträgerin/Beiträger zu einem Aggregat von @de
label: közreműködő kollektív ágense a következő aggregátumnak: @hu
label: liitumi kaastööline (kollektiiv) kehastuses @et
label: toplanmasına katkıda bulunan kolektif temsilcidir @tr
label: è contributore agente collettivo di aggregato di @it
label: és agent col·lectiu contribuïdor a un agregat de @ca
label: είναι συντελεστής συλλογικός φορέας της συνάθροισης του @el
label: وكيل جماعي مساهم في تجميعة @ar
label: 是……的合集的贡献者集体行为者 @zh-hans
sub property of: yhteistoimijaan liittyvä manifestaatio
sub property of: aggregaattiin osallinen toimija manifestaatiossa
definition: Correla un agente collettivo a una manifestazione che è un aggregato che comprende un contributo di un agente collettivo. @it
definition: Hozzákapcsol egy kollektív ágenst egy aggregátum megjelenési formához, amely egy kollektív ágens által létrehozott mű kifejezési formáját testesíti meg. @hu
definition: Kolektif temsilciyi, kolektif bir temsilci tarafından oluşturulan bir eserin ifadesini somutlaştıran bir bütünü olan ifadeyle ilişkilendirir. @tr
definition: Liittää yhteistoimijan manifestaatioon, joka on aggregaatti, joka sisältää teoksen ekspression, jonka yhteistoimija on luonut.
definition: Met un agent collectif en relation avec une manifestation qui consiste en un agrégat matérialisant une expression d’une œuvre créée par un agent collectif. @fr
definition: Relaciona un agent col·lectiu amb una manifestació que és un agregat que materialitza una expressió d’una obra que és creada per un agent col·lectiu. @ca
definition: Relateert een collectieve actor aan een manifestatie die een aggregaat is die een expressie van een werk verwezenlijkt dat is gecreëerd door een collectieve actor. @nl
definition: Relaterer en kollektiv agent til en manifestasjon som er et aggregat som inkluderer et bidrag fra en kollektiv agent. @no
definition: Relaterer en kollektiv agent til en manifestation, som er en samling,som omfatter et udtryk af et værk, som er skabt af en kollektiv agent. @da
definition: Relates a collective agent to a manifestation that is an aggregate that embodies an expression of a work that is created by a collective agent. @en
definition: Sasaista grupu ar manifestāciju, kas ir apkopojums, kas ietver grupas ieguldījumu/līdzdalību. @lv
definition: Seostab kollektiivi kehastusega, mis on liitum, milles on teostatud tegija loodud teose väljendus. @et
definition: Setzt einen gemeinschaftlichen Akteur in Beziehung zu einem Aggregat (Manifestation), das eine Expression eines Werks verkörpert, die ein gemeinschaftlicher Akteur erstellt hat. @de
definition: يربط وكيلا جماعيا بتجسيدة عبارة عن تجميعة تتضمن إسهام وكيل جماعي. @ar

teoksen säveltäjä (yhteistoimija) musiikkiteoksessa
has element type: 2
toolkit definition: A work that involves a responsibility of a collective agent for creating a musical work. @en
toolkit definition: Bir müzik eseri oluşturmak için kolektif bir temsilcinin sorumluluğunu içeren bir eser. @tr
toolkit definition: Darbs, kas ir mūzikas darbs, kas ietver grupas atbildību par mūzikas radīšanu. @lv
toolkit definition: Een werk dat is een muziekwerk dat met zich meebrengt een verantwoordelijkheid van een collectieve actor voor muziek. @nl
toolkit definition: Egy zenemű, amelyhez hozzátartozik egy kollektív ágens felelőssége a zenéért. @hu
toolkit definition: Ein Musikwerk, bei dem ein gemeinschaftlicher Akteur für die Musik verantwortlich ist. @de
toolkit definition: Et musikalsk verk som involverer et ansvar for en kollektiv agent i form av musikk. @no
toolkit definition: Muusikateos, mis sisaldab kollektiivi vastutust muusika loomise eest. @et
toolkit definition: Obra que implica una responsabilitat d’un agent col·lectiu en la creació d’una obra musical. @ca
toolkit definition: Opera musicale che implica una responsabilità di un agente collettivo per la musica. @it
toolkit definition: Teos, joka on musiikkiteos, jonka luomisesta yhteistoimija on vastuussa.
toolkit definition: Værk, som er et musikværk, som involverer en kollektiv agents ansvar for musik. @da
toolkit definition: Œuvre qui comporte une responsabilité de la part d’un agent collectif consistant à créer une œuvre musicale. @fr
toolkit definition: عمل موسيقي يترتب عليه مسئولية وكيل جماعي عن الموسيقى. @ar
toolkit definition: 涉及创作一种音乐作品的一个集体行为者的责任的一种作品 @zh-hans
toolkit label: Gemeinschaftlicher Akteur als Komponistin/Komponist eines Werks von @de
toolkit label: agent collectif compositeur d’une œuvre de @fr
toolkit label: agent col·lectiu compositor d’una obra de @ca
toolkit label: componist-collectieve actor van werk van @nl
toolkit label: composer collective agent of work of @en
toolkit label: compositore agente collettivo di opera di @it
toolkit label: eserin besteci kolektif temsilcisi @tr
toolkit label: ir komponists (grupa) darbam @lv
toolkit label: kollektiv agent, som er komponist af værk af @da
toolkit label: komponist for verk for (kollektiv agent) @no
toolkit label: teoksen säveltäjä (yhteistoimija) musiikkiteoksessa
toolkit label: teose helilooja (kollektiiv) teoses @et
toolkit label: zeneszerző kollektív ágense a következő műnek: @hu
toolkit label: συνθέτης συλλογικός φορέας του έργου του @el
toolkit label: وكيل جماعي ملحن عمل @ar
toolkit label: ……的作品的作曲者集体行为者 @zh-hans
has subproperty: teoksen säveltäjä (yhteisö) musiikkiteoksessa
has subproperty: teoksen säveltäjä (suku) musiikkiteoksessa
has subproperty: P50673
lexical alias: composerCollectiveAgentOfWorkOf.en
status: Published
type: Property
domain: C10011
label: er kollektiv agent, som er komponist af værk af @da
label: er komponist for verk for (kollektiv agent) @no
label: eserinin besteci kolektif temsilcisidir @tr
label: est un agent collectif compositeur d’une œuvre de @fr
label: ir komponists (grupa) darbam @lv
label: is componist-collectieve actor van werk van @nl
label: is composer collective agent of work of @en
label: ist gemeinschaftlicher Akteur als Komponistin/Komponist eines Werks von @de
label: teose helilooja (kollektiiv) teoses @et
label: zeneszerző kollektív ágense a következő műnek: @hu
label: è compositore agente collettivo di opera di @it
label: és agent col·lectiu compositor d’una obra de @ca
label: είναι συνθέτης συλλογικός φορέας του έργου του @el
label: هو وكيل جماعي ملحن عمل لـ @ar
label: 是……的作品的作曲者集体行为者 @zh-hans
sub property of: teoksen säveltäjä (toimija) musiikkiteoksessa
sub property of: teoksen tekijä (yhteistoimija) teoksessa
definition: Correla un agente collettivo a un'opera musicale che implica una responsabilità di un agente collettivo per la musica. @it
definition: Hozzákapcsol egy kollektív ágenst egy zeneműhöz, amelyhez hozzátartozik egy kollektív ágens felelőssége a zenéért. @hu
definition: Kolektif bir temsilciyi, bir müzik eseri oluşturmak için kolektif bir temsilcinin sorumluluğunu içeren bir eserle ilişkilendirir. @tr
definition: Liittää yhteistoimijan teokseen, joka on musiikkiteos, jonka luomisesta yhteistoimija on vastuussa.
definition: Met un agent collectif en relation avec une œuvre qui comporte une responsabilité de la part d’un agent collectif consistant à créer une œuvre musicale. @fr
definition: Relaciona un agent col·lectiu amb una obra que implica una responsabilitat d’un agent col·lectiu en la creació d’una obra musical. @ca
definition: Relateert een collectieve actor aan een werk dat is een muziekwerk dat met zich meebrengt een verantwoordelijkheid van een collectieve actor voor muziek. @nl
definition: Relaterer en kollektiv agent til et musikalsk verk som involverer et ansvar for en kollektiv agent i form av musikk. @no
definition: Relaterer en kollektiv agent til et værk, som er et musikværk, som involverer en kollektiv agents ansvar for musik. @da
definition: Relates a collective agent to a work that involves a responsibility of a collective agent for creating a musical work. @en
definition: Sasaista grupu ar darbu, kas ir mūzikas darbs, kas ietver grupas atbildību par mūzikas radīšanu. @lv
definition: Seostab kollektiivi muusikateosega, mis sisaldab kollektiivi vastutust muusika loomise eest. @et
definition: Setzt einen gemeinschaftlichen Akteur in Beziehung zu einem Musikwerk, bei dem ein gemeinschaftlicher Akteur für die Musik verantwortlich ist. @de
definition: يربط وكيلا جماعيا بعمل موسيقي يترتب عليه مسئولية وكيل جماعي عن الموسيقى. @ar
definition: 将一个具体行为者与涉及创作一种音乐作品的一个集体行为者的责任的一种作品关联起来。 @zh-hans

vastaanottaja (yhteistoimija) teoksessa
has element type: 2
toolkit definition: A work or a portion of a work that is addressed to a collective agent. @en
toolkit definition: Darbs vai darba daļa, kas adresēta grupai. @lv
toolkit definition: Een werk of een deel van een werk dat is gericht aan een collectieve actor. @nl
toolkit definition: Egy kollektív ágensnek címzett mű, vagy műrészlet. @hu
toolkit definition: Ein Werk oder ein Teil eines Werks, das an einen gemeinschaftlichen Akteur adressiert ist. @de
toolkit definition: Et verk eller en del av et verk som er adressert til en kollektiv agent. @no
toolkit definition: Kolektif bir temsilciye hitap eden bir eser veya eserin bir bölümü. @tr
toolkit definition: Obra o part d’una obra que s’adreça a un agent col·lectiu. @ca
toolkit definition: Opera o porzione di un'opera indirizzata a un agente collettivo. @it
toolkit definition: Teos tai teoksen osa, joka on osoitettu yhteistoimijalle.
toolkit definition: Teos või teose osa, mis on adresseeritud kollektiivile. @et
toolkit definition: Værk eller en del af et værk, som er adresseret til en kollektiv agent. @da
toolkit definition: Œuvre ou portion d’œuvre qui est adressée à un agent collectif. @fr
toolkit definition: عمل أو جزء من عمل موجه إلى وكيل جماعي. @ar
toolkit definition: 要被一个集体行为者接受的一种作品或作品的一部分 @zh-hans
toolkit label: Gemeinschaftlicher Akteur als Adressatin/Adressat von @de
toolkit label: Muhatap kolektif temsilci @tr
toolkit label: addressee collective agent of @en
toolkit label: adressaat (kollektiiv) teoses @et
toolkit label: adressat for (kollektiv agent) @no
toolkit label: agent collectif destinataire de @fr
toolkit label: agent col·lectiu destinatari de @ca
toolkit label: címzett kollektív ágense: @hu
toolkit label: destinatario agente collettivo di @it
toolkit label: geadresseerde collectieve actor van @nl
toolkit label: ir adresāts (grupa) @lv
toolkit label: kollektiv agent, som er adressat af @da
toolkit label: vastaanottaja (yhteistoimija) teoksessa
toolkit label: παραλήπτης συλλογικός φορέας του @el
toolkit label: وكيل جماعي مرسل إليه @ar
toolkit label: ……的接受者集体行为者 @zh-hans
has subproperty: vastaanottaja (yhteisö) teoksessa
has subproperty: vastaanottaja (suku) teoksessa
has subproperty: P50674
lexical alias: addresseeCollectiveAgentOf.en
status: Published
type: Property
domain: C10011
label: adressaat (kollektiiv) teoses @et
label: címzett kollektív ágense a következőnek: @hu
label: er adressat for (kollektiv agent) @no
label: er kollektiv agent, som er adressat af @da
label: est un agent collectif destinataire de @fr
label: ir adresāts (grupa) @lv
label: is addressee collective agent of @en
label: is geadresseerde collectieve actor van @nl
label: ist gemeinschaftlicher Akteur als Adressatin/Adressat von @de
label: muhatap kolektif temsilcisidir @tr
label: è destinatario agente collettivo di @it
label: és agent col·lectiu destinatari de @ca
label: είναι παραλήπτης συλλογικός φορέας του @el
label: هو وكيل جماعي مرسل إليه لـ @ar
label: 是……的接受者集体行为者 @zh-hans
sub property of: vastaanottaja (toimija) teoksessa
sub property of: yhteistoimijaan liittyvä teos
definition: Correla un agente collettivo a un'opera o una porzione di un'opera indirizzata a un agente collettivo. @it
definition: Hozzákapcsol egy kollektív ágenst egy kollektív ágensnek címzett műhöz, vagy műrészlethez. @hu
definition: Kolektif bir temsilciyi, kolektif bir temsilciye hitap eden bir eserle veya eserin bir bölümüyle ilişkilendirir. @tr
definition: Liittää yhteistoimijan teokseen tai teoksen osaan, joka on osoitettu yhteistoimijalle.
definition: Met un agent collectif en relation avec une œuvre ou portion d’œuvre qui est adressée à un agent collectif. @fr
definition: Relaciona un agent col·lectiu amb una obra o part d’una obra que s’adreça a un agent col·lectiu. @ca
definition: Relateert een collectieve actor aan een werk of een deel van een werk dat is gericht aan een collectieve actor. @nl
definition: Relaterer en kollektiv agent til et verk eller en del av et verk som er adressert til en kollektiv agent. @no
definition: Relaterer en kollektiv agent til et værk eller en del af et værk, som er adresseret til en kollektiv agent. @da
definition: Relates a collective agent to a work or a portion of a work that is addressed to a collective agent. @en
definition: Sasaista grupu ar darbu vai darba daļa, kas adresēta grupai. @lv
definition: Seostab kollektiivi teose või teose osaga, mis on adresseeritud kollektiivile. @et
definition: Setzt einen gemeinschaftlichen Akteur in Beziehung zu einem Werk oder einem Teil eines Werks, das an einen gemeinschaftlichen Akteur adressiert ist. @de
definition: يربط وكيلا جماعيا بعمل أو جزء من عمل موجه إلى وكيل جماعي. @ar
definition: 将一个集体行为者与要被一个集体行为者接受的一种作品或作品的一部分关联起来。 @zh-hans

toimituspäällikkö (yhteistoimija) teoksessa
has element type: 2
toolkit definition: A work that involves a legal or intellectual responsibility, but not creative responsibility, of a collective agent for the editorial policy and content of a diachronic work. @en
toolkit definition: Artzamanlı bir eserin yayın politikası ve içeriği için kolektif bir temsilcinin yasal veya entelektüel sorumluluğunu içeren, ancak yaratıcı sorumluluğunu içermeyen bir eser. @tr
toolkit definition: Darbs, kas ietver grupas juridisku vai intelektuālu, bet ne radošu, atbildību par diahroniskā darba izdošanas politiku un saturu. @lv
toolkit definition: Een werk dat met zich meebrengt een wettelijke of intellectuele verantwoordelijkheid, maar niet creatieve verantwoordelijkheid, van een collectieve actor voor redactioneel beleid en content van een diachronisch werk. @nl
toolkit definition: Egy mű, amely magában foglalja egy kollektív ágens jogi vagy szellemi, de nem alkotói felelősségét egy diakronikus mű szerkesztési politikájáért és tartalmáért. @hu
toolkit definition: Ein Werk, bei dem ein gemeinschaftlicher Akteur die rechtliche oder intellektuelle, aber keine kreative, Verantwortung für die redaktionelle Vorgehensweise und den Inhalt eines diachronen Werks trägt. @de
toolkit definition: Et verk som involverer juridisk eller intellektuelt ansvar, bortsett fra kreativt ansvar, for det redaksjonelle innholdet i et diakronisk verk. @no
toolkit definition: Obra que implica una responsabilitat legal o intel·lectual, però no una responsabilitat creativa, d’un agent col·lectiu en la política i el contingut editorial d’una obra diacrònica. @ca
toolkit definition: Opera che implica una responsabilità legale o intellettuale, ma non una responsabilità creativa, di un agente collettivo nella politica editoriale e contenuto di un'opera diacronica. @it
toolkit definition: Teos, jossa yhteistoimija on juridisesti tai tiedollisesti muttei luovasti vastuussa diakronisen teoksen toimituslinjasta ja sisällöstä.
toolkit definition: Teos, mis sisaldab kollektiivi juriidilist või intellektuaalset, kuid mitte loomingulist vastutust diakroonilise teose toimetamispõhimõtete ja sisu eest. @et
toolkit definition: Værk, som involverer en kollektiv agents juridiske eller intellektuelle ansvar, men ikke skabelsesansvar, for et diakronisk værks redaktionelle linje og indhold. @da
toolkit definition: Œuvre qui comporte une responsabilité légale ou intellectuelle, mais non une responsabilité créative, de la part d’un agent collectif en ce qui concerne la politique éditoriale et le contenu d’une œuvre diachronique. @fr
toolkit definition: عمل يترتب عليه تحمل وكيل جماعي المسئولية القانونية أو الفكرية، وليس الإبداعية عن السياسة التحريرية وعن محتوى عمل ممتد زمنيا. @ar
toolkit definition: 涉及一个集体行为者对一种历时作品的编辑政策和内容的法律或知识责任（但非创作责任）的一种作品 @zh-hans
toolkit label: Gemeinschaftlicher Akteur als Chefredakteurin/Chefredakteur von @de
toolkit label: agent collectif directeur de publication de @fr
toolkit label: agent col·lectiu director editorial de @ca
toolkit label: direttore editoriale agente collettivo di @it
toolkit label: editorial director collective agent of @en
toolkit label: főszerkesztő kollektív ágense: @hu
toolkit label: hoofdredacteur-collectieve actor van @nl
toolkit label: ir galvenais redaktors (grupa) @lv
toolkit label: kollektiv agent, som er ansvarshavende redaktør af @da
toolkit label: peatoimetaja (kollektiiv) teoses @et
toolkit label: redaksjonssjef for (kollektiv agent) @no
toolkit label: toimituspäällikkö (yhteistoimija) teoksessa
toolkit label: yayın yönetmeni kolektif temsilcisi @tr
toolkit label: διευθυντής σύνταξης συλλογικός φορέας του @el
toolkit label: وكيل جماعي مدير تحرير @ar
toolkit label: ……的主编集体行为者 @zh-hans
has subproperty: toimituspäällikkö (yhteisö) teoksessa
has subproperty: toimituspäällikkö (suku) teoksessa
has subproperty: P50675
lexical alias: editorialDirectorCollectiveAgentOf.en
status: Published
type: Property
domain: C10011
label: er kollektiv agent, som er ansvarshavende redaktør af @da
label: er redaksjonssjef for (kollektiv agent) @no
label: est un agent collectif directeur de publication de @fr
label: főszerkesztő kollektív ágense a következőnek: @hu
label: ir galvenais redaktors (grupa) @lv
label: is editorial director collective agent of @en
label: is hoofdredacteur-collectieve actor van @nl
label: ist gemeinschaftlicher Akteur als Chefredakteurin/Chefredakteur von @de
label: peatoimetaja (kollektiiv) teoses @et
label: yayın yönetmeni kolektif temsilcisidir @tr
label: è direttore editoriale agente collettivo di @it
label: és agent col·lectiu director editorial de @ca
label: είναι διευθυντής σύνταξης συλλογικός φορέας του @el
label: هو وكيل جماعي مدير تحرير لـ @ar
label: 是……的主编集体行为者 @zh-hans
sub property of: toimituspäällikkö (toimija) teoksessa
sub property of: yhteistoimijaan liittyvä teos
definition: Correla un agente collettivo a un'opera che implica una responsabilità legale o intellettuale, ma non una responsabilità creativa, di un agente collettivo nella politica editoriale e contenuto di un'opera diacronica. @it
definition: Hozzákapcsol egy kollektív ágenst egy műhöz, amely magában foglalja egy kollektív ágens jogi vagy szellemi, de nem alkotói felelősségét egy diakronikus mű szerkesztési politikájáért és tartalmáért. @hu
definition: Kolektif bir temsilciyi, artzamanlı bir eserin yayın politikası ve içeriği için kolektif bir temsilcinin yasal veya entelektüel sorumluluğunu içeren, ancak yaratıcı sorumluluğunu içermeyen bir eserle ilişkilendirir. @tr
definition: Liittää yhteistoimijan teokseen, jossa yhteistoimija on juridisesti tai tiedollisesti muttei luovasti vastuussa diakronisen teoksen toimituslinjasta ja sisällöstä.
definition: Met un agent collectif en relation avec une œuvre qui comporte une responsabilité légale ou intellectuelle, mais non une responsabilité créative, de la part d’un agent collectif en ce qui concerne la politique éditoriale et le contenu d’une œuvre diachronique. @fr
definition: Relaciona un agent col·lectiu amb una obra que implica una responsabilitat legal o intel·lectual, però no una responsabilitat creativa, d’un agent col·lectiu en la política i el contingut editorial d’una obra diacrònica. @ca
definition: Relateert een collectieve actor aan een werk dat met zich meebrengt een wettelijke of intellectuele verantwoordelijkheid, maar niet creatieve verantwoordelijkheid, van een collectieve actor voor redactioneel beleid en content van een diachronisch werk. @nl
definition: Relaterer en kollektiv agent til et verk som involverer juridisk eller intellektuelt ansvar, bortsett fra kreativt ansvar, for det redaksjonelle innholdet i et diakronisk verk. @no
definition: Relaterer en kollektiv agent til et værk, som involverer en kollektiv agents juridiske eller intellektuelle ansvar, men ikke skabelsesansvar, for et diakronisk værks redaktionelle linje og indhold. @da
definition: Relates a collective agent to a work that involves a legal or intellectual responsibility, but not creative responsibility, of a collective agent for the editorial policy and content of a diachronic work. @en
definition: Sasaista grupu ar darbu, kas ietver grupas juridisku vai intelektuālu, bet ne radošu, atbildību par diahroniskā darba izdošanas politiku un saturu. @lv
definition: Seostab kollektiivi teosega, mis sisaldab kollektiivi juriidilist või intellektuaalset, kuid mitte loomingulist vastutust diakroonilise teose toimetamispõhimõtete ja sisu eest. @et
definition: Setzt einen gemeinschaftlichen Akteur in Beziehung zu einem Werk, bei dem ein gemeinschaftlicher Akteur die rechtliche oder intellektuelle, aber keine kreative, Verantwortung für die redaktionelle Vorgehensweise und den Inhalt eines diachronen Werks trägt. @de
definition: يربط وكيلا جماعيا بعمل يترتب عليه تحمل وكيل جماعي المسئولية القانونية أو الفكرية، وليس الإبداعية عن السياسة التحريرية وعن محتوى عمل ممتد زمنيا. @ar
definition: 将一个集体行为者与涉及一个集体行为者对一种历时作品的编辑政策和内容的法律或知识责任（但非创作责任）的一种作品关联起来。 @zh-hans

teoksen kartantekijä (yhteistoimija) teoksessa
has element type: 2
toolkit definition: A work that involves a responsibility of a collective agent for creating a cartographic work. @en
toolkit definition: Darbs, kas ietver grupas atbildību par karti, atlantu, globusu vai citu kartogrāfijas materiālu. @lv
toolkit definition: Een werk dat met zich meebrengt een verantwoordelijkheid van een collectieve actor voor het creëren van een cartografisch werk. @nl
toolkit definition: Egy mű, amelyhez hozzátartozik egy kollektív ágens felelőssége egy kartográfiai mű létrehozásáért. @hu
toolkit definition: Ein Werk, bei dem ein gemeinschaftlicher Akteur für die Schaffung eines kartografischen Werks verantwortlich ist. @de
toolkit definition: Et verk som involverer et ansvar for en kollektiv agent i form av et kartografisk verk. @no
toolkit definition: Kartografik bir eser oluşturmak için kolektif bir temsilcinin sorumluluğunu içeren bir eser. @tr
toolkit definition: Obra que implica una responsabilitat d’un agent col·lectiu en la creació d’una obra cartogràfica. @ca
toolkit definition: Opera che implica una responsabilità di un agente collettivo per un'opera cartografica. @it
toolkit definition: Teos, joka on kartografinen teos, jonka luomisesta yhteistoimija on vastuussa.
toolkit definition: Teos, mis sisaldab kollektiivi vastutust kartograafilise teose eest. @et
toolkit definition: Værk, som involverer en kollektiv agents ansvar for at skabe et kartografisk værk. @da
toolkit definition: Œuvre qui comporte une responsabilité de la part d’un agent collectif consistant à créer une œuvre cartographique. @fr
toolkit definition: عمل يترتب عليه مسئولية وكيل جماعي عن أعمال رسم الخرائط. @ar
toolkit definition: 涉及创作一种地图作品的一个集体行为者的责任的一种作品 @zh-hans
toolkit label: Gemeinschaftlicher Akteur als Kartografin/Kartograf eines Werks von @de
toolkit label: agent collectif cartographe d’une œuvre de @fr
toolkit label: agent col·lectiu cartògraf d’una obra de @ca
toolkit label: cartograaf-collectieve actor van werk van @nl
toolkit label: cartografo agente collettivo di opera di @it
toolkit label: cartographer collective agent of work of @en
toolkit label: eserin kartograf kolektif temsilcisi @tr
toolkit label: ir kartogrāfs (grupa) darbam @lv
toolkit label: kartograf for verk for (kollektiv agent) @no
toolkit label: kollektiv agent, som er kartograf for værk af @da
toolkit label: teoksen kartantekijä (yhteistoimija) teoksessa
toolkit label: teose kartograaf (kollektiiv) teoses @et
toolkit label: térképész kollektív ágense a következő műnek: @hu
toolkit label: χαρτογράφος συλλογικός φορέας του έργου του @el
toolkit label: وكيل جماعي رسام خرائط لعمل @ar
toolkit label: ……的作品的地图绘制者集体行为者 @zh-hans
has subproperty: teoksen kartantekijä (yhteisö) teoksessa
has subproperty: teoksen kartantekijä (suku) teoksessa
has subproperty: P50676
lexical alias: cartographerCollectiveAgentOfWorkOf.en
status: Published
type: Property
domain: C10011
label: er kartograf for verk for (kollektiv agent) @no
label: er kollektiv agent, som er kartograf for værk af @da
label: eserinin kartograf kolektif temsilcisidir @tr
label: est un agent collectif cartographe d’une œuvre de @fr
label: ir kartogrāfs (grupa) darbam @lv
label: is cartograaf-collectieve actor van werk van @nl
label: is cartographer collective agent of work of @en
label: ist gemeinschaftlicher Akteur als Kartografin/Kartograf eines Werks von @de
label: teose kartograaf (kollektiiv) teoses @et
label: térképész kollektív ágense a következő műnek: @hu
label: è cartografo agente collettivo di opera di @it
label: és agent col·lectiu cartògraf d’una obra de @ca
label: είναι χαρτογράφος συλλογικός φορέας του έργου του @el
label: هو وكيل جماعي رسام خرائط لعمل لـ @ar
label: 是……的作品的地图绘制者集体行为者 @zh-hans
sub property of: teoksen kartantekijä (toimija) teoksessa
sub property of: teoksen tekijä (yhteistoimija) teoksessa
definition: Correla un agente collettivo a un'opera che implica una responsabilità di un agente collettivo per un'opera cartografica. @it
definition: Hozzákapcsol egy kollektív ágenst egy műhöz, amelyhez hozzátartozik egy kollektív ágens felelőssége egy kartográfiai mű létrehozásáért. @hu
definition: Kolektif bir temsilciyi, bir kartografik eseri oluşturmak için kolektif bir temsilcinin sorumluluğunu içeren bir eserle ilişkilendirir. @tr
definition: Liittää yhteistoimijan teokseen, joka on kartografinen teos, jonka luomisesta yhteistoimija on vastuussa.
definition: Met un agent collectif en relation avec une œuvre qui comporte une responsabilité de la part d’un agent collectif consistant à créer une œuvre cartographique. @fr
definition: Relaciona un agent col·lectiu amb una obra que implica una responsabilitat d’un agent col·lectiu en la creació d’una obra cartogràfica. @ca
definition: Relateert een collectieve actor aan een werk dat met zich meebrengt een verantwoordelijkheid van een collectieve actor voor het creëren van een cartografisch werk. @nl
definition: Relaterer en kollektiv agent til et verk som involverer et ansvar for en kollektiv agent i form av et kartografisk verk. @no
definition: Relaterer en kollektiv agent til et værk, som involverer en kollektiv agents ansvar for at skabe et kartografisk værk. @da
definition: Relates a collective agent to a work that involves a responsibility of a collective agent for creating a cartographic work. @en
definition: Sasaista grupu ar darbu, kas ietver grupas atbildību par karti, atlantu, globusu vai citu kartogrāfijas materiālu. @lv
definition: Seostab kollektiivi teosega, mis sisaldab kollektiivi vastutust kartograafilise teose eest. @et
definition: Setzt einen gemeinschaftlichen Akteur in Beziehung zu einem Werk, bei dem ein gemeinschaftlicher Akteur für die Schaffung eines kartografischen Werks verantwortlich ist. @de
definition: يربط وكيلا جماعيا بعمل يترتب عليه مسئولية وكيل جماعي عن أعمال رسم الخرائط. @ar
definition: 将一个集体行为者与涉及创作一种地图作品的一个集体行为者的责任的一种作品关联起来。 @zh-hans

keksijä (yhteistoimija) teoksessa
has element type: 2
toolkit definition: A work that involves a responsibility of a collective agent for creating a new device or process. @en
toolkit definition: Darbs, kas ietver grupas atbildību par jaunas ierīces vai procesa radīšanu. @lv
toolkit definition: Een werk dat met zich meebrengt een verantwoordelijkheid van een collectieve actor voor het creëren van een nieuw apparaat of proces. @nl
toolkit definition: Egy mű, amelyhez hozzátartozik egy kollektív ágens felelőssége egy új eszköz vagy eljárás létrehozásáért. @hu
toolkit definition: Ein Werk, bei dem ein gemeinschaftlicher Akteur für die Schaffung ein neues Geräts oder Prozesses verantwortlich ist. @de
toolkit definition: Et verk som involverer et ansvar for en kollektiv agent i form av en ny innretning eller prosess. @no
toolkit definition: Obra que implica una responsabilitat d’un agent col·lectiu en la creació d’un mecanisme o procés nou. @ca
toolkit definition: Opera che implica una responsabilità di un agente collettivo per un nuovo dispositivo o processo. @it
toolkit definition: Teos, jossa yhteistoimija on vastuussa uuden välineen tai menetelmän luomisesta.
toolkit definition: Teos, mis sisaldab kollektiivi vastutust uue seadme või protsessi eest. @et
toolkit definition: Værk, som involverer en kollektiv agents ansvar for at skabe en ny anordning eller proces. @da
toolkit definition: Yeni bir cihaz veya süreç oluşturmak için kolektif bir temsilcinin sorumluluğunu içeren bir eser. @tr
toolkit definition: Œuvre qui comporte une responsabilité de la part d’un agent collectif consistant à créer un nouveau dispositif ou procédé. @fr
toolkit definition: عمل يترتب عليه مسئولية وكيل جماعي عن ابتكار جهاز أو عملية جديدة. @ar
toolkit definition: 涉及创建一个新装置或新过程的一个具体行为者的责任的一种作品 @zh-hans
toolkit label: Gemeinschaftlicher Akteur als Erfinderin/Erfinder von @de
toolkit label: agent collectif inventeur de @fr
toolkit label: agent col·lectiu inventor de @ca
toolkit label: feltaláló kollektív ágense: @hu
toolkit label: inventor collective agent of @en
toolkit label: inventore agente collettivo di @it
toolkit label: ir izgudrotājs (grupa) @lv
toolkit label: keksijä (yhteistoimija) teoksessa
toolkit label: kollektiv agent, som er opfinder af @da
toolkit label: leiutaja (kollektiiv) teoses @et
toolkit label: mucit kolektif temsilcisidir @tr
toolkit label: oppfinner av (kollektiv agent) @no
toolkit label: uitvinder-collectieve actor van @nl
toolkit label: εφευρέτης συλλογικός φορέας του @el
toolkit label: وكيل جماعي مخترع @ar
toolkit label: ……的发明者集体行为者 @zh-hans
has subproperty: keksijä (yhteisö) teoksessa
has subproperty: keksijä (suku) teoksessa
has subproperty: P50677
lexical alias: inventorCollectiveAgentOf.en
status: Published
type: Property
domain: C10011
label: er kollektiv agent, som er opfinder af @da
label: er oppfinner av (kollektiv agent) @no
label: est un agent collectif inventeur de @fr
label: feltaláló kollektív ágense a következőnek: @hu
label: ir izgudrotājs (grupa) @lv
label: is inventor collective agent of @en
label: is uitvinder-collectieve actor van @nl
label: ist gemeinschaftlicher Akteur als Erfinderin/Erfinder von @de
label: leiutaja (kollektiiv) teoses @et
label: mucit kolektif temsilcisidir @tr
label: è inventore agente collettivo di @it
label: és agent col·lectiu inventor de @ca
label: είναι εφευρέτης συλλογικός φορέας του @el
label: هو وكيل جماعي مخترع لـ @ar
label: 是……的发明者集体行为者 @zh-hans
sub property of: keksijä (toimija) teoksessa
sub property of: teoksen tekijä (yhteistoimija) teoksessa
definition: Correla un agente collettivo a un'opera che implica una responsabilità di un agente collettivo per un nuovo dispositivo o processo. @it
definition: Hozzákapcsol egy kollektív ágenst egy műhöz, amelyhez hozzátartozik egy kollektív ágens felelőssége egy új eszköz vagy eljárás létrehozásáért. @hu
definition: Kolektif bir temsilciyi, yeni bir cihaz veya süreç oluşturmak için kolektif bir temsilcinin sorumluluğunu içeren bir eserle ilişkilendirir. @tr
definition: Liittää yhteistoimijan teokseen, jossa yhteistoimija on vastuussa uuden välineen tai menetelmän luomisesta.
definition: Met un agent collectif en relation avec une œuvre qui comporte une responsabilité de la part d’un agent collectif consistant à créer un nouveau dispositif ou procédé. @fr
definition: Relaciona un agent col·lectiu amb una obra que implica una responsabilitat d’un agent col·lectiu en la creació d’un mecanisme o procés nou. @ca
definition: Relateert een collectieve actor aan een werk dat met zich meebrengt een verantwoordelijkheid van een collectieve actor voor het creëren van een nieuw apparaat of proces. @nl
definition: Relaterer en kollektiv agent til et verk som involverer et ansvar for en kollektiv agent i form av en ny innretning eller prosess. @no
definition: Relaterer en kollektiv agent til et værk, som involverer en kollektiv agents ansvar for at skabe en ny anordning eller proces. @da
definition: Relates a collective agent to a work that involves a responsibility of a collective agent for creating a new device or process. @en
definition: Sasaista grupu ar darbu, kas ietver grupas atbildību par jaunas ierīces vai procesa radīšanu. @lv
definition: Seostab kollektiivi teosega, mis sisaldab kollektiivi vastutust uue seadme või protsessi eest. @et
definition: Setzt einen gemeinschaftlicher Akteur in Beziehung zu einem Werk, bei dem ein gemeinschaftlicher Akteur für die Schaffung ein neues Geräts oder Prozesses verantwortlich ist. @de
definition: يربط وكيلا جماعيا بعمل يترتب عليه مسئولية وكيل جماعي عن ابتكار جهاز أو عملية جديدة. @ar
definition: 将一个集体行为者与涉及创建一个新装置或新过程的一个具体行为者的责任的一种作品关联起来。 @zh-hans

teoksen haastattelija (yhteistoimija) teoksessa
has element type: 2
toolkit definition: A work that involves a responsibility of a collective agent for acting as an interviewer, reporter, pollster, or some other kind of collective agent who gathers information. @en
toolkit definition: Darbs, kas ietver grupas atbildību, darbojoties kā intervētājs, reportieris, aptaujas organizētājs vai kāds cits informācijas apkopotājs. @lv
toolkit definition: Een werk dat met zich meebrengt een verantwoordelijkheid van een collectieve actor voor optreden als een interviewer, verslaggever, opiniepeiler of een andere soort collectieve actor die informatie verzamelt. @nl
toolkit definition: Egy mű, amelyhez hozzátartozik egy kollektív ágens felelőssége interjúkészítőként, riporterként, közvélemény-kutatóként, vagy valamilyen más információgyűjtő kollektív ágensként. @hu
toolkit definition: Ein Werk, bei dem ein gemeinschaftlicher Akteur als Interviewerin/Interviewer, Reporterin/Reporter, Meinungsforscherin/Meinungsforscher oder anderer gemeinschaftlicher Akteur Informationen zusammenträgt. @de
toolkit definition: Et verk som involverer et ansvar for en kollektiv agent i form av å fungere som intervjuer, reporter, eller som en annen kollektiv agent som samler inn informasjon. @no
toolkit definition: Görüşmeci, muhabir, anketör veya bilgi toplayan başka tür bir kolektif temsilci olarak hareket etme sorumluluğunu içeren bir eser. @tr
toolkit definition: Obra que implica una responsabilitat d’un agent col·lectiu actuant com un entrevistador, un periodista, un enquestador o qualsevol altre agent col·lectiu que recull la informació. @ca
toolkit definition: Opera che implica una responsabilità di un agente collettivo nell'agire come intervistatore, giornalista, sondaggista o qualche altro tipo di agente collettivo che raccoglie informazioni. @it
toolkit definition: Teos, jonka luomisesta yhteistoimija on vastuussa toimimalla haastattelijana, toimittajana, mielipidetutkijana tai jonkinlaisena muuna tietoja keräävänä yhteistoimijana.
toolkit definition: Teos, mis sisaldab kollektiivi vastutust tegutsemise eest intervjueerija, reporteri, küsitleja või muu infot koguva kollektiivina. @et
toolkit definition: Værk, som involverer en kollektiv agents ansvar for at optræde som interviewer, journalist, meningsmåler eller en anden form for kollektiv agent, som indsamler information. @da
toolkit definition: Œuvre qui comporte une responsabilité de la part d’un agent collectif consistant à agir à titre d’intervieweur, de reporteur, de sondeur ou d’autre type d’agent collectif recueillant de l’information. @fr
toolkit definition: عمل يترتب عليه مسئولية وكيل جماعي عن العمل كمحاور أو كمراسل أو كخبير استطلاعات رأي، أو كوكيل جماعي من نوع آخر يجمع معلومات. @ar
toolkit definition: 涉及担当采访者、记者、民意调查员行为者或其他类型信息搜集的一个集体行为者的责任的一种作品 @zh-hans
toolkit label: Gemeinschaftlicher Akteur als Interviewerin/Interviewer eines Werks von @de
toolkit label: agent collectif intervieweur d’une œuvre de @fr
toolkit label: agent col·lectiu entrevistador d’una obra de @ca
toolkit label: eserinin görüşmeci kolektif temsilcisidir @tr
toolkit label: interjúkészítő kollektív ágense a következő műnek: @hu
toolkit label: interviewer collective agent of work of @en
toolkit label: interviewer-collectieve actor van werk van @nl
toolkit label: intervistatore agente collettivo di opera di @it
toolkit label: intervjueerija (kollektiiv) teoses @et
toolkit label: intervjuer for verk for (kollektiv agent) @no
toolkit label: ir intervētājs (grupa) darbā @lv
toolkit label: kollektiv agent, som er interviewer for værk af @da
toolkit label: teoksen haastattelija (yhteistoimija) teoksessa
toolkit label: συνεντευκτής συλλογικός φορέας του έργου του @el
toolkit label: وكيل جماعي محاور في عمل @ar
toolkit label: ……作品的采访者集体行为者 @zh-hans
has subproperty: teoksen haastattelija (yhteisö) teoksessa
has subproperty: teoksen haastattelija (suku) teoksessa
has subproperty: P50678
lexical alias: interviewerCollectiveAgentOfWorkOf.en
status: Published
type: Property
domain: C10011
label: er intervjuer for verk for (kollektiv agent) @no
label: er kollektiv agent, som er interviewer for værk af @da
label: eserinin görüşmeci kolektif temsilcisidir @tr
label: est un agent collectif intervieweur d’une œuvre de @fr
label: interjúkészítő kollektív ágense a következő műnek: @hu
label: intervjueerija (kollektiiv) teoses @et
label: ir intervētājs (grupa) darbā @lv
label: is interviewer collective agent of work of @en
label: is interviewer-collectieve actor van werk van @nl
label: ist gemeinschaftlicher Akteur als Interviewerin/Interviewer eines Werks von @de
label: è intervistatore agente collettivo di opera di @it
label: és agent col·lectiu entrevistador d’una obra de @ca
label: είναι συνεντευκτής συλλογικός φορέας του έργου του @el
label: هو وكيل جماعي محاور في عمل لـ @ar
label: 是……作品的采访者集体行为者 @zh-hans
sub property of: teoksen haastattelija (toimija) teoksessa
sub property of: teoksen tekijä (yhteistoimija) teoksessa
definition: Correla un agente collettivo a un'opera che implica una responsabilità di un agente collettivo nell'agire come intervistatore, giornalista, sondaggista o qualche altro tipo di agente collettivo che raccoglie informazioni. @it
definition: Hozzákapcsol egy kollektív ágenst egy műhöz, amelyhez hozzátartozik egy kollektív ágens felelőssége interjúkészítőként, riporterként, közvélemény-kutatóként, vagy valamilyen más információgyűjtő kollektív ágensként. @hu
definition: Kolektif bir temsilciyi, kolektif bir temsilcinin mülakatçı, muhabir, anketör veya bilgi toplayan başka bir tür kolektif temsilci olarak hareket etme sorumluluğunu içeren bir eserle ilişkilendirir. @tr
definition: Liittää yhteistoimijan teokseen, jonka luomisesta yhteistoimija on vastuussa toimimalla haastattelijana, toimittajana, mielipidetutkijana tai jonkinlaisena muuna tietoja keräävänä yhteistoimijana.
definition: Met un agent collectif en relation avec une œuvre qui comporte une responsabilité de la part d’un agent collectif consistant à agir à titre d’intervieweur, de reporteur, de sondeur ou d’autre type d’agent collectif recueillant de l’information. @fr
definition: Relaciona un agent col·lectiu amb una obra que implica una responsabilitat d’un agent col·lectiu actuant com un entrevistador, un periodista, un enquestador o qualsevol altre agent col·lectiu que recull la informació. @ca
definition: Relateert een collectieve actor aan een werk dat met zich meebrengt een verantwoordelijkheid van een collectieve actor voor optreden als een interviewer, verslaggever, opiniepeiler of een andere soort collectieve actor die informatie verzamelt. @nl
definition: Relaterer en kollektiv agent til et verk som involverer et ansvar for en kollektiv agent i form av å fungere som intervjuer, reporter, eller som en annen kollektiv agent som samler inn informasjon. @no
definition: Relaterer en kollektiv agent til et værk, som involverer en kollektiv agents ansvar for at optræde som interviewer, journalist, meningsmåler eller en anden form for kollektiv agent, som indsamler information. @da
definition: Relates a collective agent to a work that involves a responsibility by a collective agent for acting as an interviewer, reporter, pollster, or some other kind of collective agent who gathers information. @en
definition: Sasaista grupu ar darbu, kas ietver grupas atbildību, darbojoties kā intervētājs, reportieris, aptaujas organizētājs vai kāds cits informācijas apkopotājs. @lv
definition: Seostab kollektiivi teosega, mis sisaldab kollektiivi vastutust tegutsemise eest intervjueerija, reporteri, küsitleja või muu infot koguva kollektiivina. @et
definition: Setzt einen gemeinschaftlicher Akteur in Beziehung zu einem Werk, bei dem ein gemeinschaftlicher Akteur als Interviewerin/Interviewer, Reporterin/Reporter, Meinungsforscherin/Meinungsforscher oder anderer gemeinschaftlicher Akteur Informationen zusammenträgt. @de
definition: يربط وكيلا جماعيا بعمل ينطوي على تحمله مسئولية العمل كمحاور أو كمراسل أو خبير استطلاعات رأي، أو كوكيل جماعي من نوع آخر يجمع معلومات. @ar
definition: 将一个集体行为者与涉及担当采访者、记者、民意调查员行为者或其他类型信息搜集的一个集体行为者的责任的一种作品关联起来。 @zh-hans

aggregaattori (yhteistoimija) teoksessa
has element type: 2
toolkit definition: A work that involves a responsibility of a collective agent for aggregation by selecting and arranging expressions of other works. @en
toolkit definition: Darbs, kas ietver grupas atbildību par apkopošanu, atlasot un sakārtojot citu darbu izteiksmes. @lv
toolkit definition: Diğer eserlerin ifadelerini seçerek ve düzenleyerek bir araya getirmek için kolektif bir temsilcinin sorumluluğunu içeren bir eser. @tr
toolkit definition: Een werk dat met zich meebrengt een verantwoordelijkheid van een collectieve actor voor aggregeren door middel van selectie en arrangeren van expressies van andere werken. @nl
toolkit definition: Egy mű, amelyhez hozzátartozik egy kollektív ágens felelőssége más művek kifejezési formáinak kiválasztásával és elrendezésével járó aggregálásért. @hu
toolkit definition: Ein Werk, bei dem ein gemeinschaftlicher Akteur für die Aggregation verantwortlich ist, indem er Expressionen von anderen Werken auswählt und zusammenstellt. @de
toolkit definition: Et verk som involverer et ansvar for en kollektiv agent i form av aggregering gjennom å velge ut og arrangere uttrykk av andre verk. @no
toolkit definition: Obra que implica una responsabilitat d’un agent col·lectiu en l’agregació mitjançant la selecció i l’arranjament d’expressions d’altres obres. @ca
toolkit definition: Opera che implica una responsabilità di un agente collettivo nell'aggregazione selezionando e organizzando espressioni di altre opere. @it
toolkit definition: Teos, jossa yhteistoimija on vastuussa aggregoivan teoksen luomisesta valitsemalla ja järjestämällä muiden teosten ekspressioita.
toolkit definition: Teos, mis sisaldab kollektiivi vastutust liitumi loomise eest, valides ja korrastades teiste teoste väljendused. @et
toolkit definition: Værk, som involverer en kollektiv agents ansvar for sammenlægning ved at udvælge og arrangere udtryk af andre værk. @da
toolkit definition: Œuvre qui comporte une responsabilité de la part d’un agent collectif en ce qui concerne l’agrégation par la sélection et l’arrangement d’expressions d’autres œuvres. @fr
toolkit definition: عمل يترتب عليه مسئولية وكيل جماعي عن التجميع عن طريق اختيار وترتيب تعبيرات الأعمال الأخرى. @ar
toolkit definition: 涉及把其他作品的内容表达选择和整理后编制合集的一个集体行为者的责任的一种作品 @zh-hans
toolkit label: Gemeinschaftlicher Akteur als Aggregatorin/Aggregator von @de
toolkit label: Toplayıcı kolektif temsilci @tr
toolkit label: agent collectif agrégateur de @fr
toolkit label: agent col·lectiu agregador de @ca
toolkit label: aggregaattori (yhteistoimija) teoksessa
toolkit label: aggregator av (kollektiv agent) @no
toolkit label: aggregator collective agent of @en
toolkit label: aggregator-collectieve actor van @nl
toolkit label: aggregatore agente collettivo di @it
toolkit label: aggregátor kollektív ágense: @hu
toolkit label: ir apkopotājs (grupa) @lv
toolkit label: kollektiv agent, som er samler af @da
toolkit label: liitja (kollektiiv) teoses @et
toolkit label: συναθροιστής συλλογικός φορέας του ? @el
toolkit label: وكيل جماعي مجمّع @ar
toolkit label: ……的合集编者集体行为者 @zh-hans
has subproperty: kokoaja (yhteistoimija) teoksessa
has subproperty: aggregaattori (yhteisö) teoksessa
has subproperty: aggregaattori (suku) teoksessa
has subproperty: P50679
lexical alias: aggregatorCollectiveAgentOf.en
status: Published
type: Property
domain: C10011
label: aggregátor kollektív ágense a következőnek: @hu
label: er aggregator av (kollektiv agent) @no
label: er kollektiv agent, som er samler af @da
label: est un agent collectif agrégateur de @fr
label: ir apkopotājs (grupa) @lv
label: is aggregator collective agent of @en
label: is aggregator-collectieve actor van @nl
label: ist gemeinschaftlicher Akteur als Aggregatorin/Aggregator von @de
label: liitja (kollektiiv) teoses @et
label: toplayıcı kolektif temsilcisidir @tr
label: è aggregatore agente collettivo di @it
label: és agent col·lectiu agregador de @ca
label: είναι ερανιστής συλλογικός φορέας του ? @el
label: هو وكيل جماعي مجمع لـ @ar
label: 是……的合集编者集体行为者 @zh-hans
sub property of: aggregaattori (toimija) teoksessa
sub property of: teoksen tekijä (yhteistoimija) teoksessa
definition: Correla un agente collettivo a un'opera che implica una responsabilità di un agente collettivo nell'aggregazione selezionando e organizzando espressioni di altre opere. @it
definition: Hozzákapcsol egy kollektív ágenst egy műhöz, amelyhez hozzátartozik egy kollektív ágens felelőssége más művek kifejezési formáinak kiválasztásával és elrendezésével járó aggregálásért. @hu
definition: Kolektif bir temsilciyi, diğer eserlerin ifadelerini seçerek ve düzenleyerek bir araya getirme sorumluluğunu içeren bir eserle ilişkilendirir. @tr
definition: Liittää yhteistoimijan teokseen, jossa yhteistoimija on vastuussa aggregoivan teoksen luomisesta valitsemalla ja järjestämällä muiden teosten ekspressioita.
definition: Met un agent collectif en relation avec une œuvre qui comporte une responsabilité de la part d’un agent collectif en ce qui concerne l’agrégation par la sélection et l’arrangement d’expressions d’autres œuvres. @fr
definition: Relaciona un agent col·lectiu amb una obra que implica una responsabilitat d’un agent col·lectiu en l’agregació mitjançant la selecció i l’arranjament d’expressions d’altres obres. @ca
definition: Relateert een collectieve actor aan een werk dat met zich meebrengt een verantwoordelijkheid van een collectieve actor voor aggregeren door middel van selectie en arrangeren van expressies van andere werken. @nl
definition: Relaterer en kollektiv agent til et verk som involverer et ansvar for en kollektiv agent i form av aggregering gjennom å velge ut og arrangere uttrykk av andre verk. @no
definition: Relaterer en kollektiv agent til et værk, som involverer en kollektiv agents ansvar for sammenlægning ved at udvælge og arrangere udtryk af andre værk. @da
definition: Relates a collective agent to a work that involves a responsibility of a collective agent for aggregation by selecting and arranging expressions of other works. @en
definition: Sasaista grupu ar darbu, kas ietver grupas atbildību par apkopošanu, atlasot un sakārtojot citu darbu izteiksmes. @lv
definition: Seostab kollektiivi teosega, mis sisaldab kollektiivi vastutust liitumi loomise eest, valides ja korrastades teiste teoste väljendused. @et
definition: Setzt einen gemeinschaftlichen Akteur in Beziehung zu einem Werk, bei dem ein gemeinschaftlicher Akteur für die Aggregation verantwortlich ist, indem er Expressionen von anderen Werken auswählt und zusammenstellt. @de
definition: يربط وكيلا جماعيا بعمل يترتب عليه مسئولية وكيل جماعي عن التجميع من خلال اختيار تعبيرات أعمال أخرى وترتيبها. @ar
definition: 将一个集体行为者与涉及把其他作品的内容表达选择和整理后编制合集的一个集体行为者的责任的一种作品关联起来。 @zh-hans

arkkitehti (yhteistoimija) teoksessa
has element type: 2
toolkit definition: A work that involves a responsibility of a collective agent for creating an architectural design, including a pictorial representation intended to show how a building or other structure will look when completed. @en
toolkit definition: Bir binanın veya başka bir yapının tamamlandığında nasıl görüneceğini göstermeyi amaçlayan görsel bir temsil de dâhil olmak üzere, bir mimari tasarım oluşturmak için kolektif bir temsilcinin sorumluluğunu içeren bir eser. @tr
toolkit definition: Darbs, kas ietver grupas atbildību par arhitektūras projekta radīšanu, ieskaitot projekta skici, lai parādītu, kā ēka vai cita struktūra izskatīsies, kad tā tiks pabeigta. @lv
toolkit definition: Een werk dat met zich meebrengt een verantwoordelijkheid van een collectieve actor voor het creëren van een architectonisch ontwerp, omvattende een picturale representatie bedoeld te laten zien hoe een gebouw of andere structuur er na voltooiing uit zal zien. @nl
toolkit definition: Egy mű, amelyhez hozzátartozik egy kollektív ágens felelőssége egy építészeti terv létrehozásáért, beleértve egy képi reprezentációt, amely bemutatja, hogy egy épület vagy más szerkezet hogyan fog kinézni, amikor elkészül. @hu
toolkit definition: Ein Werk, bei dem ein gemeinschaftlicher Akteur für die Schaffung eines architektonischen Entwurfs verantwortlich ist, einschließlich einer bildlichen Darstellung, die zeigt, wie ein Gebäude oder eine andere Konstruktion nach der Fertigstellung aussehen soll. @de
toolkit definition: Et verk som involverer et ansvar for en kollektiv agent i form av arkitektonisk utforming, inkludert en gjengivelse i bildeform som er ment å vise hvordan en bygning eller annen struktur vil se ut når den er ferdig. @no
toolkit definition: Obra que implica una responsabilitat d’un agent col·lectiu en la creació d’un disseny arquitectònic, inclosa una representació il·lustrada concebuda per mostrar com serà un edifici o qualsevol altra estructura una vegada complet. @ca
toolkit definition: Opera che implica una responsabilità di un agente collettivo nella creazione di un progetto architettonico, inclusa una rappresentazione pittorica intesa a mostrare come apparirà un edificio o altra struttura una volta completato. @it
toolkit definition: Teos, jossa yhteistoimija on vastuussa arkkitehtisuunnitelman luomisesta, mukaan lukien kuvaesityksestä, jonka tarkoitus on näyttää, miltä rakennus tai muu rakennelma näyttää valmiina.
toolkit definition: Teos, mis sisaldab kollektiivi vastutust arhitektuurse kujunduse loomise eest, k.a pildiline esitus näitamaks, kuidas ehitis või muu konstruktsioon valmides välja hakkab nägema. @et
toolkit definition: Værk, som involverer en kollektiv agents ansvar for at skabe et arkitektonisk design, inkl. en billedrepræsentation, som skal vise, hvordan en bygning eller anden struktur vil se ud, når den er færdig. @da
toolkit definition: Œuvre qui comporte une responsabilité de la part d’un agent collectif consistant à créer une conception architecturale, y compris une représentation illustrée conçue pour montrer à quoi ressemblera un bâtiment ou une autre structure une fois la construction terminée. @fr
toolkit definition: عمل يترتب عليه مسئولية وكيل جماعي عن إنشاء تصميم معماري، ويشمل ذلك إعداد عرض تصويري يبين كيف سيبدو المبنى أو أي بناء آخر عند اكتماله. @ar
toolkit definition: 涉及建筑设计（包括用于展示建筑或其他结构完成之后外观效果的绘画作品）创作的一个集体行为者的责任的一种作品 @zh-hans
toolkit label: Gemeinschaftlicher Akteur als Architektin/Architekt von @de
toolkit label: agent collectif architecte de @fr
toolkit label: agent col·lectiu arquitecte de @ca
toolkit label: architect collective agent of @en
toolkit label: architect-collectieve actor van @nl
toolkit label: architetto agente collettivo di @it
toolkit label: arhitekt (kollektiiv) teoses @et
toolkit label: arkitekt for (kollektiv agent) @no
toolkit label: arkkitehti (yhteistoimija) teoksessa
toolkit label: ir arhitekts (grupa) @lv
toolkit label: kollektiv agent, som er arkitekt af @da
toolkit label: mimar kolektif temsilci @tr
toolkit label: építész kollektív ágense: @hu
toolkit label: αρχιτέκτονας συλλογικός φορέας του @el
toolkit label: وكيل جماعي مهندس معماري @ar
toolkit label: ……的建筑设计师集体行为者 @zh-hans
has subproperty: RDA:n toimijan ominaisuudet
has subproperty: maisema-arkkitehti (yhteistoimija) teoksessa
has subproperty: arkkitehti (yhteisö) teoksessa
has subproperty: arkkitehti (suku) teoksessa
has subproperty: P50680
lexical alias: architectCollectiveAgentOf.en
status: Published
type: Property
domain: C10011
label: arhitekt (kollektiiv) teoses @et
label: er arkitekt for (kollektiv agent) @no
label: er kollektiv agent, som er arkitekt af @da
label: est un agent collectif architecte de @fr
label: ir arhitekts (grupa) @lv
label: is architect collective agent of @en
label: is architect-collectieve actor van @nl
label: ist gemeinschaftlicher Akteur als Architektin/Architekt von @de
label: mimar kolektif temsilcisidir @tr
label: è architetto agente collettivo di @it
label: építész kollektív ágense a következőnek: @hu
label: és agent col·lectiu arquitecte de @ca
label: είναι αρχιτέκτονας συλλογικός φορέας του @el
label: وكيل جماعي مهندس معماري @ar
label: 是……的建筑设计师集体行为者 @zh-hans
sub property of: arkkitehti (toimija) teoksessa
sub property of: teoksen tekijä (yhteistoimija) teoksessa
definition: Correla un agente collettivo a un'opera che implica una responsabilità di un agente collettivo nella creazione di un progetto architettonico, inclusa una rappresentazione pittorica destinata a mostrare come apparirà un edificio o altra struttura una volta completato. @it
definition: Hozzákapcsol egy kollektív ágenst egy műhöz, amelyhez hozzátartozik egy kollektív ágens felelőssége egy építészeti terv létrehozásáért, beleértve egy képi reprezentációt, amely bemutatja, hogy egy épület vagy más szerkezet hogyan fog kinézni, amikor elkészül. @hu
definition: Kolektif bir temsilciyi, bir binanın veya başka bir yapının tamamlandığında nasıl görüneceğini göstermeyi amaçlayan görsel bir temsil de dâhil olmak üzere, bir mimari tasarım oluşturmak için kolektif bir temsilcinin sorumluluğunu içeren bir eserle ilişkilendirir. @tr
definition: Liittää yhteistoimijan teokseen, jossa yhteistoimija on vastuussa arkkitehtisuunnitelman luomisesta, mukaan lukien kuvaesityksestä, jonka tarkoitus on näyttää, miltä rakennus tai muu rakennelma näyttää valmiina.
definition: Met un agent collectif en relation avec une œuvre qui comporte une responsabilité de la part d’un agent collectif en ce qui concerne une conception architecturale, y compris une représentation illustrée conçue pour montrer à quoi ressemblera un bâtiment ou une autre structure une fois la construction terminée. @fr
definition: Relaciona un agent col·lectiu amb una obra que implica una responsabilitat d’un agent col·lectiu en la creació d’un disseny arquitectònic, inclosa una representació il·lustrada concebuda per mostrar com serà un edifici o qualsevol altra estructura una vegada complet. @ca
definition: Relateert een collectieve actor aan een werk dat met zich meebrengt een verantwoordelijkheid van een collectieve actor voor het creëren van een architectonisch ontwerp, omvattende een picturale representatie bedoeld te laten zien hoe een gebouw of andere structuur er na voltooiing uit zal zien. @nl
definition: Relaterer en kollektiv agent til et verk som involverer et ansvar for en kollektiv agent i form av arkitektonisk utforming, inkludert en gjengivelse i bildeform som er ment å vise hvordan en bygning eller annen struktur vil se ut når den er ferdig. @no
definition: Relaterer en kollektiv agent til et værk, som involverer en kollektiv agents ansvar for at skabe et arkitektonisk design, inkl. en billedrepræsentation, som skal vise, hvordan en bygning eller anden struktur vil se ud, når den er færdig. @da
definition: Relates a collective agent to a work that involves a responsibility of a collective agent for creating an architectural design, including a pictorial representation intended to show how a building or other structure will look when completed. @en
definition: Sasaista grupu ar darbu, kas ietver grupas atbildību par arhitektūras projekta radīšanu, ieskaitot projekta skici, lai parādītu, kā ēka vai cita struktūra izskatīsies, kad tā tiks pabeigta. @lv
definition: Seostab kollektiivi teosega, mis sisaldab kollektiivi vastutust arhitektuurse kujunduse loomise eest, k.a pildiline esitus näitamaks, kuidas ehitis või muu konstruktsioon valmides välja hakkab nägema. @et
definition: Setzt einen gemeinschaftlichen Akteur in Beziehung zu einem Werk, bei dem ein gemeinschaftlicher Akteur für die Schaffung eines architektonischen Entwurfs verantwortlich ist, einschließlich einer bildlichen Darstellung, die zeigt, wie ein Gebäude oder eine andere Konstruktion nach der Fertigstellung aussehen soll. @de
definition: يربط وكيلا جماعيا بعمل يترتب عليه مسئولية وكيل جماعي عن إنشاء تصميم معماري، ويشمل ذلك إعداد عرض تصويري يبين كيف سيبدو المبنى أو أي بناء آخر عند اكتماله. @ar
definition: 将一个集体行为者与涉及建筑设计（包括用于展示建筑或其他结构完成之后外观效果的绘画作品）创作的一个集体行为者的责任的一种作品关联起来。 @zh-hans

elokuvantekijä (yhteistoimija) teoksessa
has element type: 2
toolkit definition: A work that involves a responsibility of a collective agent for creating an independent or personal film. @en
toolkit definition: Bağımsız veya kişisel bir film oluşturmak için kolektif bir temsilcinin sorumluluğunu içeren bir eser. @tr
toolkit definition: Darbs, kas ietver grupas atbildību par neatkarīgas vai privātas filmas veidošanu un izpildi visos aspektos. @lv
toolkit definition: Een werk met zich meebrengt een verantwoordelijkheid van een collectieve actor voor het creëren van een zelfstandige of persoonlijke film. @nl
toolkit definition: Egy mű, amelyhez hozzátartozik egy kollektív ágens felelőssége egy független- vagy magánfilm létrehozásáért. @hu
toolkit definition: Ein Werk, bei dem ein gemeinschaftlicher Akteur für die Schaffung eines unabhängigen oder privaten Films verantwortlich ist. @de
toolkit definition: Et verk som involverer et ansvar for en kollektiv agent for en uavhengig eller personlig film. @no
toolkit definition: Obra que implica una responsabilitat d’un agent col·lectiu en una pel·lícula cinematogràfica independent o personal. @ca
toolkit definition: Opera che implica una responsabilità di un agente collettivo in un film indipendente o personale. @it
toolkit definition: Teos, jossa yhteistoimija on vastuussa riippumattoman tai henkilökohtaisen elokuvan luomisesta.
toolkit definition: Teos, mis sisaldab kollektiivi vastutust sõltumatu või autorifilmi eest. @et
toolkit definition: Værk, som involverer en kollektiv agents ansvar for at skabe en indiefilm eller personlig film. @da
toolkit definition: Œuvre qui comporte une responsabilité de la part d’un agent collectif consistant à créer un film indépendant ou personnel. @fr
toolkit definition: عمل يترتب عليه مسئولية وكيل جماعي عن فيلم مستقل أو شخصي. @ar
toolkit definition: 涉及创作一部独立或个人电影的一个集体行为者的责任的一种作品 @zh-hans
toolkit label: Gemeinschaftlicher Akteur als Filmemacherin/Filmemacher von @de
toolkit label: agent collectif cinéaste de @fr
toolkit label: agent col·lectiu cineasta de @ca
toolkit label: elokuvantekijä (yhteistoimija) teoksessa
toolkit label: film üreticisi kolektif temsilcisi @tr
toolkit label: filmgyártó kollektív ágense: @hu
toolkit label: filmitegija (kollektiiv) teoses @et
toolkit label: filmmaker collective agent of @en
toolkit label: filmmaker-collectieve actor van @nl
toolkit label: filmskaper av (kollektiv agent) @no
toolkit label: ir filmas veidotājs (grupa) @lv
toolkit label: kollektiv agent, som er filmskaber af @da
toolkit label: regista cinematografico agente collettivo di @it
toolkit label: σκηνοθέτης συλλογικός φορέας του @el
toolkit label: وكيل جماعي صانع أفلام @ar
toolkit label: ……的制片人集体行为者 @zh-hans
has subproperty: elokuvantekijä (yhteisö) teoksessa
has subproperty: elokuvantekijä (suku) teoksessa
has subproperty: P50681
lexical alias: filmmakerCollectiveAgentOf.en
status: Published
type: Property
domain: C10011
label: er filmskaper av (kollektiv agent) @no
label: er kollektiv agent, som er filmskaber af @da
label: est un agent collectif cinéaste de @fr
label: film üreticisi kolektif temsilcisidir @tr
label: filmgyártó kollektív ágense a következőnek: @hu
label: filmitegija (kollektiiv) teoses @et
label: ir filmas veidotājs (grupa) @lv
label: is filmmaker collective agent of @en
label: is filmmaker-collectieve actor van @nl
label: ist gemeinschaftlicher Akteur als Filmemacherin/Filmemacher von @de
label: è regista cinematografico agente collettivo di @it
label: és agent col·lectiu cineasta de @ca
label: είναι σκηνοθέτης συλλογικός φορέας του @el
label: هو وكيل جماعي صانع أفلام لـ @ar
label: 是……的制片人集体行为者 @zh-hans
sub property of: elokuvantekijä (toimija) teoksessa
sub property of: teoksen tekijä (yhteistoimija) teoksessa
definition: Correla un agente collettivo a un'opera che implica una responsabilità di un agente collettivo in un film indipendente o personale. @it
definition: Hozzákapcsol egy kollektív ágenst egy műhöz, amelyhez hozzátartozik egy kollektív ágens felelőssége egy független- vagy magánfilm létrehozásáért. @hu
definition: Kolektif bir temsilciyi, bağımsız veya kişisel bir film oluşturmak için kolektif bir temsilcinin sorumluluğunu içeren bir eserle ilişkilendirir. @tr
definition: Liittää yhteistoimijan teokseen, jossa yhteistoimija on vastuussa riippumattoman tai henkilökohtaisen elokuvan luomisesta.
definition: Met un agent collectif en relation avec une œuvre qui comporte une responsabilité de la part d’un agent collectif consistant à créer un film indépendant ou personnel. @fr
definition: Relaciona un agent col·lectiu amb una obra que implica una responsabilitat d’un agent col·lectiu en la creació d’una pel·lícula cinematogràfica independent o personal. @ca
definition: Relateert een collectieve actor aan een werk met zich meebrengt een verantwoordelijkheid van een collectieve actor voor het creëren van een zelfstandige of persoonlijke film. @nl
definition: Relaterer en kollektiv agent til et verk som involverer et ansvar for en kollektiv agent for en uavhengig eller personlig film. @no
definition: Relaterer en kollektiv agent til et værk, som involverer en kollektiv agents ansvar for at skabe en indiefilm eller personlig film. @da
definition: Relates a collective agent to a work that involves a responsibility of a collective agent for creating an independent or personal film. @en
definition: Sasaista grupu ar darbu, kas ietver grupas atbildību par neatkarīgas vai privātas filmas veidošanu un izpildi visos aspektos. @lv
definition: Seostab kollektiivi teosega, mis sisaldab kollektiivi vastutust sõltumatu või autorifilmi eest. @et
definition: Setzt einen gemeinschaftlichen Akteur in Beziehung zu einem Werk, bei dem ein gemeinschaftlicher Akteur für die Schaffung eines unabhängigen oder privaten Films verantwortlich ist. @de
definition: يربط وكيلا جماعيا بعمل يترتب عليه مسئولية وكيل جماعي عن فيلم مستقل أو شخصي. @ar
definition: 将一个行为者与涉及创作一部独立或个人电影的一个集体行为者的责任的一种作品关联起来。 @zh-hans
scope note: A filmmaker is individually responsible for the conception and execution of all aspects of the film. @en
scope note: Bir film yapımcısı, filmin tüm yönlerinin tasarlanmasından ve yürütülmesinden bireysel olarak sorumludur. @tr
scope note: Een filmmaker is zelf verantwoordelijk voor het idee en de uitvoering van alle aspecten van de film. @nl
scope note: Egy filmkészítő egyénileg felelős egy film koncepciójáért és összes aspektusának végrehajtásáért. @hu
scope note: Eine Filmemacherin/Ein Filmemacher ist persönlich für das Konzept und die Ausführung aller Aspekte des Films verantwortlich. @de
scope note: En filmskaper har personlig ansvar for planen med og gjennomføringen av alle aspektene ved filmen. @no
scope note: Filmas veidotājs ir pilnībā atbildīgs par visiem filmas koncepcijas un realizācijas aspektiem. @lv
scope note: Filmitegija vastutab üksinda kõigi filmi aspektide kontseptsiooni ja teostamise eest. @et

maisema-arkkitehti (yhteistoimija) teoksessa
has element type: 2
toolkit definition: A work that involves a responsibility of a collective agent for creating landscapes. @en
toolkit definition: Darbs, kas ietver grupas atbildību par ainavu arhitektūras aspektiem. @lv
toolkit definition: Een werk dat met zich meebrengt een verantwoordelijkheid van een collectieve actor voor het creëren van landschappen. @nl
toolkit definition: Egy mű, amelyhez hozzátartozik egy kollektív ágens felelőssége a tájépítészet építészeti vonatkozásaiért. @hu
toolkit definition: Ein Werk, bei dem ein gemeinschaftlicher Akteur für die Schaffung von Landschaften verantwortlich ist. @de
toolkit definition: Et verk som involverer et ansvar for en kollektiv agent for arkitekoniske aspekter ved landskapsanlegg. @no
toolkit definition: Obra que implica una responsabilitat d’un agent col·lectiu en la creació de paisatges. @ca
toolkit definition: Opera che implica una responsabilità di un agente collettivo per gli aspetti architettonici del paesaggio. @it
toolkit definition: Peyzaj oluşturmak için kolektif bir temsilcinin sorumluluğunu içeren bir çalışma @tr
toolkit definition: Teos, jonka maisemoinnin luomisesta yhteistoimija on vastuussa.
toolkit definition: Teos, mis sisaldab kollektiivi vastutust maastikukujunduse arhitektuursete aspektide eest. @et
toolkit definition: Værk, som involverer en kollektiv agents ansvar for at skabe landskaber. @da
toolkit definition: Œuvre qui comporte une responsabilité de la part d’un agent collectif consistant à créer des paysages. @fr
toolkit definition: عمل يترتب عليه مسئولية وكيل جماعي عن تنسيق المواقع الخارجية. @ar
toolkit definition: 涉及创作景观的一个集体行为者的责任的一种作品 @zh-hans
toolkit label: Gemeinschaftlicher Akteur als Landschaftsarchitektin/Landschaftsarchitekt von @de
toolkit label: Peyzaj mimarı kolektif temsilcisi @tr
toolkit label: agent collectif architecte paysagiste de @fr
toolkit label: agent col·lectiu arquitecte paisatgista de @ca
toolkit label: architetto paesaggista agente collettivo di @it
toolkit label: ir ainavu arhitekts (grupa) @lv
toolkit label: kollektiv agent, som er landskabsarkitekt af @da
toolkit label: landscape architect collective agent of @en
toolkit label: landschapsarchitect-collectieve actor van @nl
toolkit label: landskapsarkitekt for (kollektiv agent) @no
toolkit label: maastikuarhitekt (kollektiiv) teoses @et
toolkit label: maisema-arkkitehti (yhteistoimija) teoksessa
toolkit label: tájépítész kollektív ágense: @hu
toolkit label: αρχιτέκτονας τοπίου συλλογικός φορέας του @el
toolkit label: وكيل جماعي مهندس تنسيق مواقع @ar
toolkit label: ……的景观设计师集体行为者 @zh-hans
has subproperty: maisema-arkkitehti (yhteisö) teoksessa
has subproperty: maisema-arkkitehti (suku) teoksessa
has subproperty: P50682
lexical alias: landscapeArchitectCollectiveAgentOf.en
status: Published
type: Property
domain: C10011
label: er kollektiv agent, som er landskabsarkitekt af @da
label: er landskapsarkitekt for (kollektiv agent) @no
label: est un agent collectif architecte paysagiste de @fr
label: ir ainavu arhitekts (grupa) @lv
label: is landscape architect collective agent of @en
label: is landschapsarchitect-collectieve actor van @nl
label: ist gemeinschaftlicher Akteur als Landschaftsarchitektin/Landschaftsarchitekt von @de
label: maastikuarhitekt (kollektiiv) teoses @et
label: peyzaj mimarı kolektif temsilcisidir @tr
label: tájépítész kollektív ágense a következőnek: @hu
label: è architetto paesaggista agente collettivo di @it
label: és agent col·lectiu arquitecte paisatgista de @ca
label: είναι αρχιτέκτονας τοπίου συλλογικός φορέας του @el
label: هو وكيل جماعي مهندس تنسيق المواقع الخارجية لـ @ar
label: 是……的景观设计师集体行为者 @zh-hans
sub property of: maisema-arkkitehti (toimija) teoksessa
sub property of: arkkitehti (yhteistoimija) teoksessa
definition: Correla un agente collettivo a un'opera che implica una responsabilità di un agente collettivo per gli aspetti architettonici del paesaggio. @it
definition: Hozzákapcsol egy kollektív ágenst egy műhöz, amelyhez hozzátartozik egy kollektív ágens felelőssége a tájépítészet építészeti vonatkozásaiért. @hu
definition: Kolektif bir temsilciyi, kolektif bir temsilcinin peyzaj oluşturma sorumluluğunu içeren bir eserle ilişkilendirir. @tr
definition: Liittää yhteistoimijan teokseen, jonka maisemoinnin luomisesta yhteistoimija on vastuussa.
definition: Met un agent collectif en relation avec une œuvre qui comporte une responsabilité de la part d’un agent collectif consistant à créer des paysages. @fr
definition: Relaciona un agent col·lectiu amb una obra que implica una responsabilitat d’un agent col·lectiu en la creació de paisatges. @ca
definition: Relateert een collectieve actor aan een werk dat met zich meebrengt een verantwoordelijkheid van een collectieve actor voor het creëren van landschappen. @nl
definition: Relaterer en kollektiv agent til et verk som involverer et ansvar for en kollektiv agent for arkitekoniske aspekter ved landskapsanlegg. @no
definition: Relaterer en kollektiv agent til et værk, som involverer en kollektiv agents ansvar for at skabe landskaber. @da
definition: Relates a collective agent to a work that involves a responsibility of a collective agent for creating landscapes. @en
definition: Sasaista grupu ar darbu, kas ietver grupas atbildību par ainavu arhitektūras aspektiem. @lv
definition: Seostab kollektiivi teosega, mis sisaldab kollektiivi vastutust maastikukujunduse arhitektuursete aspektide eest. @et
definition: Setzt einen gemeinschaftlichen Akteur in Beziehung zu einem Werk, bei dem ein gemeinschaftlicher Akteur für die Schaffung von Landschaften verantwortlich ist. @de
definition: يربط وكيلا جماعيا بعمل يترتب عليه مسئولية وكيل جماعي عن الجوانب المعمارية لتنسيق المواقع. @ar
definition: 将一个集体行为者与涉及创作景观的一个集体行为者的责任的一种作品关联起来。 @zh-hans

käsikirjoittaja (yhteistoimija) teoksessa
has element type: 2
toolkit definition: A work that involves a responsibility of a collective agent for authoring a screenplay, script, or scene. @en
toolkit definition: Bir senaryo veya sahne yazmak için kolektif bir temsilcinin sorumluluğunu içeren bir eser. @tr
toolkit definition: Darbs, kas ietver grupas atbildību par scenārija, uzveduma plāna vai ainas radīšanu. @lv
toolkit definition: Een werk dat met zich meebrengt een verantwoordelijkheid van een collectieve actor voor schrijven van een scenario, script of scène. @nl
toolkit definition: Egy mű, amelyhez hozzátartozik egy kollektív ágens felelőssége egy forgatókönyv, szövegkönyv vagy jelenet szerzőségéért. @hu
toolkit definition: Ein Werk, bei dem ein gemeinschaftlicher Akteur für das Verfassen eines Drehbuchs, eines Skripts oder einer Szene verantwortlich ist. @de
toolkit definition: Et verk som involverer et ansvar for en kollektiv agent i form av å være forfatter av et skuespill, et manuskript eller en scene. @no
toolkit definition: Obra que implica una responsabilitat d’un agent col·lectiu en l’autoria d’un guió, un argument o una escena. @ca
toolkit definition: Opera che implica una responsabilità di un agente collettivo come autore di una sceneggiatura, copione o scena. @it
toolkit definition: Teos, jossa yhteistoimija on vastuussa käsikirjoituksen tai kohtauksen kirjoittamisesta.
toolkit definition: Teos, mis sisaldab kollektiivi vastutust stsenaariumi või stseeni kirjutamise eest. @et
toolkit definition: Værk, som involverer en kollektiv agents ansvar for at forfatte en drejebog, et manuskript eller en scene. @da
toolkit definition: Œuvre qui comporte une responsabilité de la part d’un agent collectif consistant à être l’auteur d’un scénario, d’un script ou d’une scène. @fr
toolkit definition: عمل يترتب عليه مسئولية وكيل جماعي عن تأليف نص سينمائي، أو سيناريو، أو مشهد. @ar
toolkit definition: 涉及写作影视剧剧本、脚本或场景的一个集体行为者的责任的一种作品 @zh-hans
toolkit label: Gemeinschaftlicher Akteur als Drehbuchautorin/Drehbuchautor von @de
toolkit label: agent collectif scénariste de @fr
toolkit label: agent col·lectiu guionista de @ca
toolkit label: forgatókönyvíró kollektív ágense: @hu
toolkit label: ir scenārists (grupa) @lv
toolkit label: kollektiv agent, som er manuskriptforfatter af @da
toolkit label: käsikirjoittaja (yhteistoimija) teoksessa
toolkit label: manusforfatter for (kollektiv agent) @no
toolkit label: scenarioschrijver-collectieve actor van @nl
toolkit label: sceneggiatore agente collettivo di @it
toolkit label: screenwriter collective agent of @en
toolkit label: senarist kolektif temsilci @tr
toolkit label: stsenarist (kollektiiv) teoses @et
toolkit label: σεναριογράφος συλλογικός φορέας του @el
toolkit label: وكيل جماعي كاتب سيناريو @ar
toolkit label: ……的影视剧编剧集体行为者 @zh-hans
has subproperty: käsikirjoittaja (yhteisö) teoksessa
has subproperty: käsikirjoittaja (suku) teoksessa
has subproperty: P50683
lexical alias: screenwriterCollectiveAgentOf.en
status: Published
type: Property
domain: C10011
label: Senarist kolektif temsilcisidir @tr
label: er kollektiv agent, som er manuskriptforfatter af @da
label: er manusforfatter for (kollektiv agent) @no
label: est un agent collectif scénariste de @fr
label: forgatókönyvíró kollektív ágense a következőnek: @hu
label: ir scenārists (grupa) @lv
label: is scenarioschrijver-collectieve actor van @nl
label: is screenwriter collective agent of @en
label: ist gemeinschaftlicher Akteur als Drehbuchautorin/Drehbuchautor von @de
label: stsenarist (kollektiiv) teoses @et
label: è sceneggiatore agente collettivo di @it
label: és agent col·lectiu guionista de @ca
label: είναι σεναριογράφος συλλογικός φορέας του @el
label: هو وكيل جماعي كاتب سيناريو لـ @ar
label: 是……的影视剧编剧集体行为者 @zh-hans
sub property of: käsikirjoittaja (toimija) teoksessa
sub property of: kirjoittaja (yhteistoimija) teoksessa
definition: Correla un agente collettivo a un'opera che implica una responsabilità di un agente collettivo come autore di una sceneggiatura, copione o scena. @it
definition: Hozzákapcsol egy kollektív ágenst egy műhöz, amelyhez hozzátartozik egy kollektív ágens felelőssége egy forgatókönyv, szövegkönyv vagy jelenet szerzőségéért. @hu
definition: Kolektif bir temsilciyi, bir senaryo veya sahne yazmak için kolektif bir temsilcinin sorumluluğunu içeren bir eserle ilişkilendirir. @tr
definition: Liittää yhteistoimijan teokseen, jossa yhteistoimija on vastuussa käsikirjoituksen tai kohtauksen kirjoittamisesta.
definition: Met un agent collectif en relation avec une œuvre qui comporte une responsabilité de la part d’un agent collectif consistant à être l’auteur d’un scénario, d’un script ou d’une scène. @fr
definition: Relaciona un agent col·lectiu amb una obra que implica una responsabilitat d’un agent col·lectiu en l’autoria d’un guió, un argument o una escena. @ca
definition: Relateert een collectieve actor aan een werk dat met zich meebrengt een verantwoordelijkheid van een collectieve actor voor schrijven van een scenario, script of scène. @nl
definition: Relaterer en kollektiv agent til et verk som involverer et ansvar for en kollektiv agent i form av å være forfatter av et skuespill, et manuskript eller en scene. @no
definition: Relaterer en kollektiv agent til et værk, som involverer en kollektiv agents ansvar for at forfatte en drejebog, et manuskript eller en scene. @da
definition: Relates a collective agent to a work that involves a responsibility of a collective agent for authoring a screenplay, script, or scene. @en
definition: Sasaista grupu ar darbu, kas ietver grupas atbildību par scenārija, uzveduma plāna vai ainas radīšanu. @lv
definition: Seostab kollektiivi teosega, mis sisaldab kollektiivi vastutust stsenaariumi või stseeni kirjutamise eest. @et
definition: Setzt einen gemeinschaftlichen Akteur in Beziehung zu einem Werk, bei dem ein gemeinschaftlicher Akteur für das Verfassen eines Drehbuchs, eines Skripts oder einer Szene verantwortlich ist. @de
definition: يربط وكيلا جماعيا بعمل يترتب عليه مسئولية وكيل جماعي عن تأليف نص سينمائي، أو سيناريو، أو مشهد. @ar
definition: 将一个集体行为者与涉及写作影视剧剧本、脚本或场景的一个集体行为者的责任的一种作品关联起来。 @zh-hans

sanoittaja (yhteistoimija) teoksessa
has element type: 2
toolkit definition: A work that involves a responsibility of a collective agent for authoring the words of a popular song, including a song from a musical. @en
toolkit definition: Bir müzikalden bir şarkı da dâhil olmak üzere popüler bir şarkının sözlerini yazmak için kolektif bir temsilcinin sorumluluğunu içeren bir eser. @tr
toolkit definition: Darbs, kas ietver grupas atbildību par dziesmas vārdiem, ieskaitot dziesmas no mūzikla. @lv
toolkit definition: Een werk dat met zich meebrengt een verantwoordelijkheid van een collectieve actor voor schrijven van de woorden van een populair lied, inclusief een lied uit een musical. @nl
toolkit definition: Egy mű, amelyhez hozzátartozik egy kollektív ágens felelőssége egy könyűzenei dalszöveg szerzőségéért, musicaldalt is beleértve. @hu
toolkit definition: Ein Werk, bei dem ein gemeinschaftlicher Akteur für das Verfassen des Texts eines populären Lieds, einschließlich eines Lieds aus einem Musical, verantwortlich ist. @de
toolkit definition: Et verk som involverer et ansvar for en kollektiv agent i form av å være forfatter av teksten til en populær sang, inkludert en sang fra en musikal. @no
toolkit definition: Obra que implica una responsabilitat d’un agent col·lectiu en l’autoria d’una cançó popular, inclosa una cançó d’un musical. @ca
toolkit definition: Opera che implica una responsabilità di un agente collettivo come autore delle parole di una canzone, inclusa una canzone di un musical. @it
toolkit definition: Teos, jossa yhteistoimija on vastuussa populaarimusiikkiin kuuluvan laulun (mukaan lukien musikaalilaulun) sanojen kirjoittamisesta.
toolkit definition: Teos, mis sisaldab kollektiivi vastutust levilaulu (k.a laul muusikalist) sõnade kirjutamise eest. @et
toolkit definition: Værk, som involverer en kollektiv agents ansvar for at forfatte ordene til en populær sang, inkl. en sang fra en musical. @da
toolkit definition: Œuvre qui comporte une responsabilité de la part d’un agent collectif consistant à être l’auteur des paroles d’une chanson populaire, y compris une chanson d’une comédie musicale. @fr
toolkit definition: عمل يترتب عليه مسئولية وكيل جماعي عن تأليف كلمات الأغنية الشعبية، بما في ذلك أغنية من مَسرحية موسيقِيّة. @ar
toolkit definition: 涉及流行歌曲（包括音乐剧中的歌曲）歌词的写作的一个集体行为者的责任的一种作品 @zh-hans
toolkit label: Gemeinschaftlicher Akteur als Textdichterin/Textdichter von @de
toolkit label: Söz yazarı kolektif temsilcisi @tr
toolkit label: agent collectif parolier de @fr
toolkit label: agent col·lectiu lletrista de @ca
toolkit label: dalszövegíró kollektív ágense: @hu
toolkit label: ir dziesmas teksta autors (grupa) @lv
toolkit label: kollektiv agent, som er tekstforfatter af @da
toolkit label: liedtekstschrijver-collectieve actor van @nl
toolkit label: lyricist collective agent of @en
toolkit label: paroliere agente collettivo di @it
toolkit label: sangtekstforfatter for (kollektiv agent) @no
toolkit label: sanoittaja (yhteistoimija) teoksessa
toolkit label: sõnade autor (kollektiiv) teoses @et
toolkit label: στιχουργός συλλογικός φορέας του @el
toolkit label: وكيل جماعي كاتب أغاني @ar
toolkit label: ……的作词者集体行为者 @zh-hans
has subproperty: sanoittaja (yhteisö) teoksessa
has subproperty: sanoittaja (suku) teoksessa
has subproperty: P50684
lexical alias: lyricistCollectiveAgentOf.en
status: Published
type: Property
domain: C10011
label: dalszövegíró kollektív ágense a következőnek: @hu
label: er kollektiv agent, som er tekstforfatter af @da
label: er sangtekstforfatter for (kollektiv agent) @no
label: est un agent collectif parolier de @fr
label: ir dziesmas teksta autors (grupa) @lv
label: is liedtekstschrijver-collectieve actor van @nl
label: is lyricist collective agent of @en
label: ist gemeinschaftlicher Akteur als Textdichterin/Textdichter von @de
label: sõnade autor (kollektiiv) teoses @et
label: söz yazarı kolektif temsilcisidir @tr
label: è paroliere agente collettivo di @it
label: és agent col·lectiu lletrista de @ca
label: είναι στιχουργός συλλογικός φορέας του @el
label: هو وكيل جماعي كاتب أغاني لـ @ar
label: 是……的作词者集体行为者 @zh-hans
sub property of: sanoittaja (toimija) teoksessa
sub property of: kirjoittaja (yhteistoimija) teoksessa
definition: Correla un agente collettivo a un'opera che implica una responsabilità di un agente collettivo come autore delle parole di una canzone, inclusa una canzone di un musical. @it
definition: Hozzákapcsol egy kollektív ágenst egy műhöz, amelyhez hozzátartozik egy kollektív ágens felelőssége egy könyűzenei dalszöveg szerzőségéért, musicaldalt is beleértve. @hu
definition: Kolektif bir temsilciyi, bir müzikalden bir şarkı da dâhil olmak üzere popüler bir şarkının sözlerini yazma sorumluluğunu içeren bir eserle ilişkilendirir. @tr
definition: Liittää yhteistoimijan teokseen, jossa yhteistoimija on vastuussa populaarimusiikkiin kuuluvan laulun (mukaan lukien musikaalilaulun) sanojen kirjoittamisesta.
definition: Met un agent collectif en relation avec une œuvre qui comporte une responsabilité de la part d’un agent collectif consistant à être l’auteur des paroles d’une chanson populaire, y compris une chanson d’une comédie musicale. @fr
definition: Relaciona un agent col·lectiu amb una obra que implica una responsabilitat d’un agent col·lectiu en l’autoria d’una cançó popular, inclosa una cançó d’un musical. @ca
definition: Relateert een collectieve actor aan een werk dat met zich meebrengt een verantwoordelijkheid van een collectieve actor voor schrijven van de woorden van een populair lied, inclusief een lied uit een musical. @nl
definition: Relaterer en kollektiv agent til et verk som involverer et ansvar for en kollektiv agent i form av å være forfatter av teksten til en populær sang, inkludert en sang fra en musikal. @no
definition: Relaterer en kollektiv agent til et værk, som involverer en kollektiv agents ansvar for at forfatte ordene til en populær sang, inkl. en sang fra en musical. @da
definition: Relates a collective agent to a work that involves a responsibility of a collective agent for authoring the words of a popular song, including a song from a musical. @en
definition: Sasaista grupu ar darbu, kas ietver grupas atbildību par dziesmas vārdiem, ieskaitot dziesmas no mūzikla. @lv
definition: Seostab kollektiivi teosega, mis sisaldab kollektiivi vastutust levilaulu (k.a laul muusikalist) sõnade kirjutamise eest. @et
definition: Setzt einen gemeinschaftlichen Akteur in Beziehung zu einem Werk, bei dem ein gemeinschaftlicher Akteur für das Verfassen des Texts eines populären Lieds, einschließlich eines Lieds aus einem Musical, verantwortlich ist. @de
definition: يربط وكيلا جماعيا بعمل يترتب عليه مسئولية وكيل جماعي عن تأليف كلمات الأغنية الشعبية، بما في ذلك أغنية من مَسرحية موسيقِيّة. @ar
definition: 将一个集体行为者与涉及流行歌曲（包括音乐剧中的歌曲）歌词的写作的一个集体行为者的责任的一种作品关联起来。 @zh-hans
scope note: At forfatte kun dialogen til en musical er ikke omfattet. @da
scope note: Authoring of only the dialogue from a musical is excluded. @en
scope note: Bir müzikalde yalnızca diyaloglarının yazılması hariçtir. @tr
scope note: Det å bare skrive dialogen fra en musikal, er ikke inkludert. @no
scope note: Ei hõlma üksnes muusikali dialoogide kirjutamist. @et
scope note: Ei kata pelkän musikaalin dialogin kirjoittajaa.
scope note: Le fait d’être l’auteur uniquement des dialogues d’une comédie musicale est exclu. @fr
scope note: Musical párbeszédeinek szerzősége nem tartozik ide. @hu

libretisti (yhteistoimija) teoksessa
has element type: 2
toolkit definition: A work that involves a responsibility of a collective agent for authoring the words of an opera or other musical stage work, or an oratorio. @en
toolkit definition: Bir operanın veya başka bir müzikal sahne eserinin ya da bir oratoryonun sözlerini yazmak için kolektif bir temsilcinin sorumluluğunu içeren bir eser. @tr
toolkit definition: Darbs, kas ietver grupas atbildību par tekstu operai vai citam muzikālam skatuves darbam, vai oratorijai. @lv
toolkit definition: Een werk dat met zich meebrengt een verantwoordelijkheid van een collectieve actor voor schrijven van de woorden van een opera of ander muzikaal podiumwerk of een oratorium. @nl
toolkit definition: Egy mű, amelyhez hozzátartozik egy kollektív ágens felelőssége egy opera vagy más zenés színpadi mű vagy egy oratórium szövegének szerzőségéért. @hu
toolkit definition: Ein Werk, bei dem ein gemeinschaftlicher Akteur für das Verfassen des Texts einer Oper, eines sonstigen Bühnenwerks oder eines Oratoriums verantwortlich ist. @de
toolkit definition: Et verk som involverer et ansvar for en kollektiv agent i form av å være forfatter av ordene i en opera eller annet verk for en musikalsk scene, eller et oriatorium. @no
toolkit definition: Obra que implica una responsabilitat d’un agent col·lectiu en l’autoria de les paraules d’una òpera o una altra obra escènica musical o d’un oratori. @ca
toolkit definition: Opera che implica una responsabilità di un agente collettivo come autore dei testi di un'opera lirica, altra opera musicale da palcoscenico o oratorio. @it
toolkit definition: Teos, jossa yhteistoimija on vastuussa musiikki- tai koreografisen teoksen, kuten oopperan, baletin tai muun musiikillisen näyttämöteoksen tai oratorion sanojen kirjoittamisesta.
toolkit definition: Teos, mis sisaldab kollektiivi vastutust ooperi või muu muusikalise lavateose või oratooriumi sõnade kirjutamise eest. @et
toolkit definition: Værk, som involverer en kollektiv agents ansvar for at forfatte ordene til en opera eller andet musikalsk sceneværk eller et oratorium. @da
toolkit definition: Œuvre qui comporte une responsabilité de la part d’un agent collectif consistant à être l’auteur des paroles d’un opéra ou d’une autre œuvre musicale scénique ou d’un oratorio. @fr
toolkit definition: عمل يترتب عليه مسئولية وكيل جماعي عن تأليف كلمات الأوبرا أو غيرها من أعمال المسرح الموسيقي، أو موسيقى دينية. @ar
toolkit definition: 涉及歌剧或其他舞台音乐作品或者清唱剧的歌词的写作的一个集体行为者的责任的一种作品 @zh-hans
toolkit label: Gemeinschaftlicher Akteur als Librettistin/Librettist von @de
toolkit label: Opera metni yazarı kolektif temsilcisi @tr
toolkit label: agent collectif librettiste de @fr
toolkit label: agent col·lectiu llibretista de @ca
toolkit label: ir libretists (grupa) @lv
toolkit label: kollektiv agent, som er librettist af @da
toolkit label: libretist (kollektiiv) teoses @et
toolkit label: libretisti (yhteistoimija) teoksessa
toolkit label: librettist collective agent of @en
toolkit label: librettist for (kollektiv agent) @no
toolkit label: librettist-collectieve actor van @nl
toolkit label: librettista agente collettivo di @it
toolkit label: librettista kollektív ágense: @hu
toolkit label: λιμπρετίστας συλλογικός φορέας του @el
toolkit label: وكيل جماعي واضع كلمات الأوبرا @ar
toolkit label: ……的台本作者集体行为者 @zh-hans
has subproperty: libretisti (yhteisö) teoksessa
has subproperty: libretisti (suku) teoksessa
has subproperty: P50685
lexical alias: librettistCollectiveAgentOf.en
status: Published
type: Property
domain: C10011
label: er kollektiv agent, som er librettist af @da
label: er librettist for (kollektiv agent) @no
label: est un agent collectif librettiste de @fr
label: ir libretists (grupa) @lv
label: is librettist collective agent of @en
label: is librettist-collectieve actor van @nl
label: ist gemeinschaftlicher Akteur als Librettistin/Librettist von @de
label: libretist (kollektiiv) teoses @et
label: librettista kollektív ágense a következőnek: @hu
label: libretto yazarı kolektif temsilcisidir @tr
label: è librettista agente collettivo di @it
label: és agent col·lectiu llibretista de @ca
label: είναι λιμπρετίστας συλλογικός φορέας του @el
label: هو وكيل جماعي واضع كلمات الأوبرا لـ @ar
label: 是……的台本作者集体行为者 @zh-hans
sub property of: libretisti (toimija) teoksessa
sub property of: kirjoittaja (yhteistoimija) teoksessa
definition: Correla un agente collettivo a un'opera che implica una responsabilità di un agente collettivo come autore dei testi di un'opera lirica, altra opera musicale da palcoscenico o oratorio. @it
definition: Hozzákapcsol egy kollektív ágenst egy műhöz, amelyhez hozzátartozik egy kollektív ágens felelőssége egy opera vagy más zenés színpadi mű vagy egy oratórium szövegének szerzőségéért. @hu
definition: Kolektif bir temsilciyi, bir operanın veya başka bir müzikal sahne eserinin ya da bir oratoryonun sözlerini yazma sorumluluğunu içeren bir eserle ilişkilendirir. @tr
definition: Liittää yhteistoimijan teokseen, jossa yhteistoimija on vastuussa musiikki- tai koreografisen teoksen, kuten oopperan, baletin tai muun musiikillisen näyttämöteoksen tai oratorion sanojen kirjoittamisesta.
definition: Met un agent collectif en relation avec une œuvre qui comporte une responsabilité de la part d’un agent collectif consistant à être l’auteur des paroles d’un opéra ou d’une autre œuvre musicale scénique ou d’un oratorio. @fr
definition: Relaciona un agent col·lectiu amb una obra que implica una responsabilitat d’un agent col·lectiu en l’autoria de les paraules d’una òpera o una altra obra escènica musical o d’un oratori. @ca
definition: Relateert een collectieve actor aan een werk dat met zich meebrengt een verantwoordelijkheid van een collectieve actor voor schrijven van de woorden van een opera of ander muzikaal podiumwerk of een oratorium. @nl
definition: Relaterer en kollektiv agent til et verk som involverer et ansvar for en kollektiv agent i form av å være forfatter av ordene i en opera eller annet verk for en musikalsk scene, eller et oriatorium. @no
definition: Relaterer en kollektiv agent til et værk, som involverer en kollektiv agents ansvar for at forfatte ordene til en opera eller andet musikalsk sceneværk eller et oratorium. @da
definition: Relates a collective agent to a work that involves a responsibility of a collective agent for authoring the words of an opera or other musical stage work, or an oratorio. @en
definition: Sasaista grupu ar darbu, kas ietver grupas atbildību par tekstu operai vai citam muzikālam skatuves darbam, vai oratorijai. @lv
definition: Seostab kollektiivi teosega, mis sisaldab kollektiivi vastutust ooperi või muu muusikalise lavateose või oratooriumi sõnade kirjutamise eest. @et
definition: Setzt einen gemeinschaftlichen Akteur in Beziehung zu einem Werk, bei dem ein gemeinschaftlicher Akteur für das Verfassen des Texts einer Oper, eines sonstigen Bühnenwerks oder eines Oratoriums verantwortlich ist. @de
definition: يربط وكيلا جماعيا بعمل يترتب عليه مسئولية وكيل جماعي عن تأليف كلمات الأوبرا أو غيرها من أعمال المسرح الموسيقي، أو موسيقى دينية. @ar
definition: 将一个集体行为者与涉及歌剧或其他舞台音乐作品或者清唱剧的歌词的写作的一个集体行为者的责任的一种作品关联起来。 @zh-hans

teoksen omistuksen kohde (yhteistoimija) teoksessa
has element type: 2
toolkit definition: A work that involves a responsibility of a collective agent for being commemorated. @en
toolkit definition: Darbs, kas ietver grupas atbildību par tai adresēto veltījumu. @lv
toolkit definition: Een werk dat met zich meebrengt een verantwoordelijkheid van een collectieve actor om herdacht te worden. @nl
toolkit definition: Egy mű, amely magában foglalja egy kollektív ágensnek azt a felelősségét, amiért megemlékeznek róla. @hu
toolkit definition: Ein Werk, das einem gemeinschaftlichen Akteur gewidmet ist. @de
toolkit definition: Et verk som involverer et ansvar for en kollektiv agent i form av å bli hedret. @no
toolkit definition: Kolektif bir temsilcinin anılma sorumluluğunu içeren bir eser. @tr
toolkit definition: Obra que implica una responsabilitat d’un agent col·lectiu de ser commemorat. @ca
toolkit definition: Opera che implica una responsabilità di un agente collettivo per essere commemorato. @it
toolkit definition: Teos, joka on omistettu yhteistoimijalle.
toolkit definition: Teos, mis on kollektiivile pühendatud. @et
toolkit definition: Værk, som involverer en kollektiv agents ansvar for at blive fejret. @da
toolkit definition: Œuvre qui comporte une responsabilité de la part d’un agent collectif consistant à être commémoré. @fr
toolkit definition: عمل يترتب عليه مسئولية وكيل جماعي عن الاحتفال به. @ar
toolkit definition: 涉及被纪念的一个集体行为者的责任的一种作品 @zh-hans
toolkit label: Gemeinschaftlicher Akteur als Widmungsempfängerin/Widmungsempfänger eines Werks von @de
toolkit label: agent collectif dédicataire d’une œuvre de @fr
toolkit label: agent col·lectiu dedicatari d’una obra de @ca
toolkit label: dedicatario agente collettivo di opera di @it
toolkit label: dedicatee collective agent of work of @en
toolkit label: dedikált kollektív ágense a következő műnek: @hu
toolkit label: eserin adandığı kolektif temsilci @tr
toolkit label: ir veltījuma adresāts (grupa) darbā @lv
toolkit label: kollektiv agent som verk er tilegnet til @no
toolkit label: kollektiv agent, som er tilegnet i værk af @da
toolkit label: opgedragene-collectieve actor van werk van @nl
toolkit label: teoksen omistuksen kohde (yhteistoimija) teoksessa
toolkit label: teose pühenduse saaja (kollektiiv) teoses @et
toolkit label: αποδέκτης αφιέρωσης συλλογικός φορέας του έργου του @el
toolkit label: وكيل جماعي مُهدى إليه عمل @ar
toolkit label: ……的作品的被题献者集体行为者 @zh-hans
has subproperty: teoksen omistuksen kohde (yhteisö) teoksessa
has subproperty: teoksen omistuksen kohde (suku) teoksessa
has subproperty: P50686
lexical alias: dedicateeCollectiveAgentOfWorkOf.en
status: Published
type: Property
domain: C10011
label: dedikált kollektív ágense a következő műnek: @hu
label: er kollektiv agent som verk er tilegnet til @no
label: er kollektiv agent, som er tilegnet i værk af @da
label: eserinin ithaf edilen kolektif temsilcisidir @tr
label: est un agent collectif dédicataire d’une œuvre de @fr
label: ir veltījuma adresāts (grupa) darbā @lv
label: is dedicatee collective agent of work of @en
label: is opgedragene-collectieve actor van werk van @nl
label: ist gemeinschaftlicher Akteur als Widmungsempfängerin/Widmungsempfänger eines Werks von @de
label: teose pühenduse saaja (kollektiiv) teoses @et
label: è dedicatario agente collettivo di opera di @it
label: és agent col·lectiu dedicatari d’una obra de @ca
label: είναι αποδέκτης αφιέρωσης συλλογικός φορέας του έργου του @el
label: هو وكيل جماعي مُهدى إليه عمل لـ @ar
label: 是……的作品的被题献者集体行为者 @zh-hans
sub property of: teoksen omistuksen kohde (toimija) teoksessa
sub property of: yhteistoimijaan liittyvä teos
definition: Correla un agente collettivo a un'opera che implica una responsabilità di un agente collettivo per essere commemorato. @it
definition: Hozzákapcsol egy kollektív ágenst egy műhöz, amely magában foglalja egy kollektív ágensnek azt a felelősségét, amiért megemlékeznek róla. @hu
definition: Kolektif bir temsilciyi, kolektif bir temsilcinin belirtme sorumluluğunu içeren bir eserle ilişkilendirir. @tr
definition: Liittää yhteistoimijan teokseen, joka on omistettu yhteistoimijalle.
definition: Met un agent collectif en relation avec une œuvre qui comporte une responsabilité de la part d’un agent collectif consistant à être commémoré. @fr
definition: Relaciona un agent col·lectiu amb una obra que implica una responsabilitat d’un agent col·lectiu de ser commemorat. @ca
definition: Relateert een collectieve actor aan een werk dat met zich meebrengt een verantwoordelijkheid van een collectieve actor om herdacht te worden. @nl
definition: Relaterer en kollektiv agent til et verk som involverer et ansvar for en kollektiv agent i form av å bli hedret. @no
definition: Relaterer en kollektiv agent til et værk, som involverer en kollektiv agents ansvar for at blive fejret. @da
definition: Relates a collective agent to a work that involves a responsibility of a collective agent for being commemorated. @en
definition: Sasaista grupu ar darbu, kas ietver grupas atbildību par tai adresēto veltījumu. @lv
definition: Seostab kollektiivi teosega, mis on kollektiivile pühendatud. @et
definition: Setzt einen gemeinschaftlichen Akteur in Beziehung zu einem Werk, das einem gemeinschaftlichen Akteur gewidmet ist. @de
definition: يربط وكيلا جماعيا بعمل يترتب عليه مسئولية وكيل جماعي عن الاحتفال بذكراه. @ar
definition: 将一个集体行为者与涉及被纪念的一个集体行为者的责任的一种作品关联起来。 @zh-hans

kalligrafi (yhteistoimija) teoksessa
has element type: 2
toolkit definition: A work that involves a responsibility of a collective agent for calligraphy where the focus of interest lies in the aesthetic value of the penmanship or graphic artistry, regardless of whether the same collective agent is also responsible for the inscribed text. @en
toolkit definition: Darbs, kas ietver grupas atbildību par kaligrāfiju, kurā galvenā uzmanība tiek pievērsta mākslinieciskās vai grafiskās meistarības estētiskajai vērtībai, neatkarīgi no tā, vai tā pati grupa ir atbildīgs arī par uzrakstīto tekstu @lv
toolkit definition: Een werk dat met zich meebrengt een verantwoordelijkheid van een collectieve actor voor kalligrafie waar de aandacht primair uitgaat naar de esthetische waarde van de schrijfkunst of grafische kunstenaarschap, ongeacht of dezelfde collectieve actor ook verantwoordelijk is voor de inscriptie. @nl
toolkit definition: Egy mű, amelyhez hozzátartozik egy kollektív ágens szépírással kapcsolatos felelőssége, ahol az érdeklődés középpontjában a kézírás esztétikai értéke vagy a grafika művészisége áll, tekintet nélkül arra, hogy ugyanaz a kollektív ágens a lejegyzett szöveg szerzője is egyben vagy sem. @hu
toolkit definition: Ein Werk, bei dem ein gemeinschaftlicher Akteur für die Kalligrafie verantwortlich ist, bei der der ästhetische Wert der Schreibkunst oder die grafische Kunstfertigkeit im Mittelpunkt des Interesses liegt, unabhängig davon, ob derselbe gemeinschaftliche Akteur auch für den aufgeschriebenen Text verantwortlich ist. @de
toolkit definition: Et verk som involverer et ansvar for en kollektiv agent i form av kalligrafi der fokus er på den estetiske verdien av pennekunsten eller kunstnerisk dyktighet, uavhengig av om den samme kollektiv agenten også er ansvarlig for tekstinnholdet. @no
toolkit definition: Obra que implica una responsabilitat d’un agent col·lectiu en la cal·ligrafia on el centre de l’interès se situa en el valor estètic de la cal·ligrafia o del grafisme, independentment de si el mateix agent col·lectiu és també responsable del text inscrit. @ca
toolkit definition: Opera che implica una responsabilità di un agente collettivo nella calligrafia dove il focus dell'interesse risiede nel valore estetico della scrittura o della perizia grafica, a prescindere che lo stesso agente collettivo sia responsabile anche del testo scritto. @it
toolkit definition: Teos, jossa yhteistoimija on vastuussa kalligrafiasta, jossa pääpaino on käsin kirjoittamisen tai graafisen taiteen esteettisissä arvoissa, riippumatta siitä, onko sama toimija myös vastuussa kirjoitetusta tekstistä.
toolkit definition: Teos, mis sisaldab kollektiivi vastutust ilukirja eest. Ilukirja põhirõhk on kirjakunsti või graafilise kunstnikutöö esteetilisel väärtusel, olenemata sellest, kas sama kollektiiv on vastutav ka kirjutatud teksti eest. @et
toolkit definition: Værk, som involverer en kollektiv agents ansvar for kalligrafi, hvor fokus ligger på den æstetiske værdi af skrivekunsten eller den kunstneriske grafiske dygtighed, uagtet om den samme kollektiv agent også har forfattet den indskrevne tekst. @da
toolkit definition: Yazılı metinden aynı kolektif temsilcinin sorumlu olup olmadığına bakılmaksızın, ilgi odağının kaligraflık veya grafik sanatının estetik değerinde olan kaligrafi için kolektif bir temsilcinin sorumluluğunu içeren bir eser. @tr
toolkit definition: Œuvre qui comporte une responsabilité de la part d’un agent collectif en ce qui concerne la calligraphie où l’accent est mis sur la valeur esthétique de la calligraphie ou du graphisme, peu importe que le même agent collectif soit aussi responsable du texte calligraphié. @fr
toolkit definition: عمل يترتب عليه مسئولية وكيل جماعي عن الخِطاطة، حيث ينصب الاهتمام على القيمة الجمالية لفن الخط أو الرسم، بغض النظر عما إذا كان الوكيل الجماعي نفسه مسئولا أيضًا عن النص المكتوب. @ar
toolkit definition: 涉及书法（其中兴趣重点是书法或图形艺术的美学价值，不管同一行为者是否负责题写文字）的一个集体行为者的责任的一种作品 @zh-hans
toolkit label: Gemeinschaftlicher Akteur als Kalligrafin/Kalligraf von @de
toolkit label: agent collectif calligraphe de @fr
toolkit label: agent col·lectiu cal·lígraf de @ca
toolkit label: calligrafo agente collettivo di @it
toolkit label: calligrapher collective agent of @en
toolkit label: ir kaligrāfs (grupa) @lv
toolkit label: kaligraf kolektif temsilcisi @tr
toolkit label: kalligraaf (kollektiiv) teoses @et
toolkit label: kalligraaf-collectieve actor van @nl
toolkit label: kalligraf for (kollektiv agent) @no
toolkit label: kalligrafi (yhteistoimija) teoksessa
toolkit label: kalligráfus kollektív ágense: @hu
toolkit label: kollektiv agent, som er kalligraf af @da
toolkit label: καλλιγράφος συλλογικός φορέας του @el
toolkit label: وكيل جماعي خطاط @ar
toolkit label: ……的书法者集体行为者 @zh-hans
has subproperty: kalligrafi (yhteisö) teoksessa
has subproperty: kalligrafi (suku) teoksessa
has subproperty: P50687
lexical alias: calligrapherCollectiveAgentOf.en
status: Published
type: Property
domain: C10011
label: er kalligraf for (kollektiv agent) @no
label: er kollektiv agent, som er kalligraf af @da
label: est un agent collectif calligraphe de @fr
label: ir kaligrāfs (grupa) @lv
label: is calligrapher collective agent of @en
label: is kalligraaf-collectieve actor van @nl
label: ist gemeinschaftlicher Akteur als Kalligrafin/Kalligraf von @de
label: kaligraf kolektif temsilcisidir @tr
label: kalligraaf (kollektiiv) teoses @et
label: kalligráfus kollektív ágense a következőnek: @hu
label: è calligrafo agente collettivo di @it
label: és agent col·lectiu cal·lígraf de @ca
label: είναι καλλιγράφος συλλογικός φορέας του @el
label: هو وكيل جماعي خطاط لـ @ar
label: 是……的书法者集体行为者 @zh-hans
sub property of: kalligrafi (toimija) teoksessa
sub property of: taiteilija (yhteistoimija) teoksessa
definition: Correla un agente collettivo a un'opera che implica una responsabilità di un agente collettivo nella calligrafia dove l'interesse risiede nel valore estetico della scrittura o della perizia grafica, a prescindere che lo stesso agente collettivo sia responsabile anche del testo scritto. @it
definition: Hozzákapcsol egy kollektív ágenst egy műhöz, amelyhez hozzátartozik egy kollektív ágens szépírással kapcsolatos felelőssége, ahol az érdeklődés középpontjában a kézírás esztétikai értéke vagy a grafika művészisége áll, tekintet nélkül arra, hogy ugyanaz a kollektív ágens a lejegyzett szöveg szerzője is egyben vagy sem. @hu
definition: Kolektif bir temsilciyi, aynı kolektif temsilcinin yazılı metinden sorumlu olup olmadığına bakılmaksızın, ilgi odağının el yazısının veya grafik sanatının estetik değerinde yattığı kaligrafi için kolektif temsilcinin sorumluluğunu içeren bir eserle ilişkilendirir. @tr
definition: Liittää yhteistoimijan teokseen, jossa yhteistoimija on vastuussa kalligrafiasta, jossa pääpaino on käsin kirjoittamisen tai graafisen taiteen esteettisissä arvoissa, riippumatta siitä, onko sama toimija myös vastuussa kirjoitetusta tekstistä.
definition: Met un agent collectif en relation avec une œuvre qui comporte une responsabilité de la part d’un agent collectif en ce qui concerne la calligraphie où l’accent est mis sur la valeur esthétique de la calligraphie ou du graphisme, peu importe que le même agent collectif soit aussi responsable du texte calligraphié. @fr
definition: Relaciona un agent col·lectiu amb una obra que implica una responsabilitat d’un agent col·lectiu en la cal·ligrafia on el centre de l’interès se situa en el valor estètic de la cal·ligrafia o del grafisme, independentment de si el mateix agent col·lectiu és també responsable del text inscrit. @ca
definition: Relateert een collectieve actor aan een werk dat met zich meebrengt een verantwoordelijkheid van een collectieve actor voor kalligrafie waar de aandacht primair uitgaat naar de esthetische waarde van de schrijfkunst of grafische kunstenaarschap, ongeacht of dezelfde collectieve actor ook verantwoordelijk is voor de inscriptie. @nl
definition: Relaterer en kollektiv agent til et verk som involverer et ansvar for en kollektiv agent i form av kalligrafi der fokus er på den estetiske verdien av pennekunsten eller kunstnerisk dyktighet, uavhengig av om den samme kollektiv agenten også er ansvarlig for tekstinnholdet. @no
definition: Relaterer en kollektiv agent til et værk, som involverer en kollektiv agents ansvar for kalligrafi, hvor fokus ligger på den æstetiske værdi af skrivekunsten eller den kunstneriske grafiske dygtighed, uagtet om den samme kollektiv agent også har forfattet den indskrevne tekst. @da
definition: Relates a collective agent to a work that involves a responsibility of a collective agent for calligraphy where the focus of interest lies in the aesthetic value of the penmanship or graphic artistry, regardless of whether the same collective agent is also responsible for the inscribed text. @en
definition: Sasaista grupu ar darbu, kas ietver grupas atbildību par kaligrāfiju, kurā galvenā uzmanība tiek pievērsta mākslinieciskās vai grafiskās meistarības estētiskajai vērtībai, neatkarīgi no tā, vai tā pati grupa ir atbildīgs arī par uzrakstīto tekstu. @lv
definition: Seostab kollektiivi teosega, mis sisaldab kollektiivi vastutust ilukirja eest. Ilukirja põhirõhk on kirjakunsti või graafilise kunstnikutöö esteetilisel väärtusel, olenemata sellest, kas sama kollektiiv on vastutav ka kirjutatud teksti eest. @et
definition: Setzt einen gemeinschaftlichen Akteur in Beziehung zu einem Werk, bei dem ein gemeinschaftlicher Akteur für die Kalligrafie verantwortlich ist, bei der der ästhetische Wert der Schreibkunst oder die grafische Kunstfertigkeit im Mittelpunkt des Interesses liegt, unabhängig davon, ob derselbe gemeinschaftliche Akteur auch für den aufgeschriebenen Text verantwortlich ist. @de
definition: يربط وكيلا جماعيا بعمل يترتب عليه مسئولية وكيل جماعي عن الخطاطة، حيث ينصب الاهتمام على القيمة الجمالية لفن الخط أو الرسم، بغض النظر عن مسئولية هذا الوكيل الجماعي أيضًا عن النص المكتوب. @ar
definition: 将一个集体行为者与涉及书法（其中兴趣重点是书法或图形艺术的美学价值，不管同一行为者是否负责题写文字）的一个集体行为者的责任的一种作品关联起来。 @zh-hans

kuvaaja (yhteistoimija) teoksessa
has element type: 2
toolkit definition: A work that involves a responsibility of a collective agent for capturing images, either electronically or on film or video stock, and often selecting and arranging the lighting. @en
toolkit definition: Darbs, kas ietver grupas atbildību par attēlu uzņemšanu elektroniski vai uz filmas, vai video un bieži izvēlas, un izvieto apgaismojumu. @lv
toolkit definition: Een werk dat met zich meebrengt een verantwoordelijkheid van een collectieve actor voor het vastleggen van beelden, elektronisch of op film- of videomateriaal, en vaak het selecteren en arrangeren van de belichting. @nl
toolkit definition: Egy mű, amelyhez hozzátartozik egy kollektív ágens felelőssége képek elektronikusan, filmen vagy videoállományon történő rögzítéséért, gyakran a világítás kiválasztásáért és elrendezéséért is. @hu
toolkit definition: Ein Werk, bei dem ein gemeinschaftlicher Akteur für die Aufzeichnung von Bildern, entweder elektronisch oder auf Film- oder Videomaterial, verantwortlich ist und häufig die Belichtung auswählt und arrangiert. @de
toolkit definition: Elektronik olarak veya film veya video stoku üzerinde görüntüleri yakalamak ve genellikle aydınlatmayı seçmek ve düzenlemekle görevli kolektif temsilcinin sorumluluğunu içeren bir eser. @tr
toolkit definition: Et verk som involverer et ansvar for en kollektiv agent i form av å ta bilder, enten elektronisk eller på film eller video, og som ofte velger og arrangerer lyssetting. @no
toolkit definition: Obra que implica una responsabilitat d’un agent col·lectiu en la captura d’imatges, ja sigui electrònicament o sobre pel·lícula o vídeo, i que sovint selecciona i organitza la il·luminació. @ca
toolkit definition: Opera che implica una responsabilità di un agente collettivo per l'acquisizione di immagini, elettronicamente o su pellicola o video, e spesso nella scelta e organizzazione dell'illuminazione. @it
toolkit definition: Teos, jossa yhteistoimija on vastuussa kuvien tallentamisesta joko sähköisesti tai filmille tai videolle, usein myös valaistuksen valitsemisesta ja järjestämisestä.
toolkit definition: Teos, mis sisaldab kollektiivi vastutust pildi jäädvustamise eest kas elektrooniliselt või filmi- või videolindile ning sageli valgustuse valimise ja ülesseadmise eest. @et
toolkit definition: Værk, som involverer en kollektiv agents ansvar for at optage billeder, enten elektronisk eller på film eller video, og ofte også for at udvælge og arrangere lyssætningen. @da
toolkit definition: Œuvre qui comporte une responsabilité de la part d’un agent collectif consistant à capter des images, de manière électronique ou bien sur film ou vidéo, et qui, souvent, choisit et dispose l’éclairage. @fr
toolkit definition: عمل يترتب عليه مسئولية وكيل جماعي عن التقاط الصور، إما إلكترونيًا أو في فيلم أو في مقاطع فيديو، وغالبا ما يكون مسئولا عن اختيار الإضاءة وتوزيعها. @ar
toolkit definition: 涉及通过电子、胶片或视频存储方式摄录影像、且经常负责灯光的选择和布置的一个集体行为者的责任的一种作品 @zh-hans
toolkit label: Gemeinschaftlicher Akteur als Kamerafrau/Kameramann von @de
toolkit label: agent collectif directeur de la photographie de @fr
toolkit label: agent col·lectiu director de fotografia de @ca
toolkit label: cameraregisseur-collectieve actor van @nl
toolkit label: director collective agent of photography of @en
toolkit label: direttore agente collettivo della fotografia di @it
toolkit label: filmfotograf for (kollektiv agent) @no
toolkit label: görüntü yönetmeni kolektif temsilcisi @tr
toolkit label: ir kinooperators (grupa) @lv
toolkit label: kollektiv agent, som er filmfotograf af @da
toolkit label: kuvaaja (yhteistoimija) teoksessa
toolkit label: operaator-lavastaja (kollektiiv) teoses @et
toolkit label: operatőr kollektív ágense: @hu
toolkit label: διευθυντής φωτογραφίας συλλογικός φορέας του @el
toolkit label: وكيل جماعي مدير التصوير لـ @ar
toolkit label: ……的摄影指导集体行为者 @zh-hans
has subproperty: kuvaaja (yhteisö) teoksessa
has subproperty: kuvaaja (suku) teoksessa
has subproperty: P50688
lexical alias: directorCollectiveAgentOfPhotographyOf.en
status: Published
type: Property
domain: C10011
label: er filmfotograf for (kollektiv agent) @no
label: er kollektiv agent, som er filmfotograf af @da
label: est un agent collectif directeur de la photographie de @fr
label: görüntü yönetmeni kolektif temsilcisidir @tr
label: ir kinooperators (grupa) @lv
label: is cameraregisseur-collectieve actor van @nl
label: is director collective agent of photography of @en
label: ist gemeinschaftlicher Akteur als Kamerafrau/Kameramann von @de
label: operaator-lavastaja (kollektiiv) teoses @et
label: operatőr kollektív ágense a következőnek: @hu
label: è direttore agente collettivo della fotografia di @it
label: és agent col·lectiu director de fotografia de @ca
label: είναι διευθυντής φωτογραφίας συλλογικός φορέας του @el
label: هو وكيل جماعي مدير التصوير لـ @ar
label: 是……的摄影指导集体行为者 @zh-hans
sub property of: kuvaaja (toimija) teoksessa
sub property of: yhteistoimijaan liittyvä teos
definition: Correla un agente collettivo a un'opera che implica una responsabilità di un agente collettivo per l'acquisizione di immagini, elettronicamente o su pellicola o video, e spesso nella scelta e organizzazione dell'illuminazione. @it
definition: Hozzákapcsol egy kollektív ágenst egy műhöz, amelyhez hozzátartozik egy kollektív ágens felelőssége képek elektronikusan, filmen vagy videoállományon történő rögzítéséért, gyakran a világítás kiválasztásáért és elrendezéséért is. @hu
definition: Kolektif bir temsilciyi, elektronik olarak veya film ya da video stoğunda görüntüleri yakalama, genellikle aydınlatma gibi koşulları belirlemek ve düzenlemekle görevli kolektif temsilcinin sorumluluğunu içeren bir eseri ilişkilendirir. @tr
definition: Liittää yhteistoimijan teokseen, jossa yhteistoimija on vastuussa kuvien tallentamisesta joko sähköisesti tai filmille tai videolle, usein myös valaistuksen valitsemisesta ja järjestämisestä.
definition: Met un agent collectif en relation avec une œuvre qui comporte une responsabilité de la part d’un agent collectif consistant à capter des images, de manière électronique ou bien sur film ou vidéo, et qui, souvent, choisit et dispose l’éclairage. @fr
definition: Relaciona un agent col·lectiu amb una obra que implica una responsabilitat d’un agent col·lectiu en la captura d’imatges, ja sigui electrònicament o sobre pel·lícula o vídeo, i que sovint selecciona i organitza la il·luminació. @ca
definition: Relateert een collectieve actor aan een werk dat met zich meebrengt een verantwoordelijkheid van een collectieve actor voor het vastleggen van beelden, elektronisch of op film- of videomateriaal, en vaak het selecteren en arrangeren van de belichting. @nl
definition: Relaterer en kollektiv agent til et verk som involverer et ansvar for en kollektiv agent i form av å ta bilder, enten elektronisk eller på film eller video, og som ofte velger og arrangerer lyssetting. @no
definition: Relaterer en kollektiv agent til et værk, som involverer en kollektiv agents ansvar for at optage billeder, enten elektronisk eller på film eller video, og ofte også for at udvælge og arrangere lyssætningen. @da
definition: Relates a collective agent to a work that involves a responsibility of a collective agent for capturing images, either electronically or on film or video stock, and often selecting and arranging the lighting. @en
definition: Sasaista grupu ar darbu, kas ietver grupas atbildību par attēlu uzņemšanu elektroniski vai uz filmas, vai video un bieži izvēlas, un izvieto apgaismojumu. @lv
definition: Seostab kollektiivi teosega, mis sisaldab kollektiivi vastutust pildi jäädvustamise eest kas elektrooniliselt või filmi- või videolindile ning sageli valgustuse valimise ja ülesseadmise eest. @et
definition: Setzt einen gemeinschaftlichen Akteur in Beziehung zu einem Werk, bei dem ein gemeinschaftlicher Akteur für die Aufzeichnung von Bildern, entweder elektronisch oder auf Film- oder Videomaterial, verantwortlich ist und häufig die Belichtung auswählt und arrangiert. @de
definition: يربط وكيلا جماعيا بعمل يترتب عليه مسئولية وكيل جماعي عن التقاط الصور، إما إلكترونيًا أو في فيلم أو في مقاطع فيديو، وغالبا ما يكون مسئولا عن اختيار الإضاءة وتوزيعها. @ar
definition: 将一个集体行为者与涉及通过电子、胶片或视频存储方式摄录影像、且经常负责灯光的选择和布置的一个集体行为者的责任的一种作品关联起来。 @zh-hans
scope note: A director of photography for a movie is also called a chief cinematographer. @en
scope note: Bir filmin görüntü yönetmeni aynı zamanda, baş sinematograf olarak adlandırılır. @tr
scope note: Een cameraregisseur bij een film wordt ook director of photography of hoofdcinematograaf genoemd. @nl
scope note: Egy film operatőrét vezető operatőrnek is nevezik. @hu
scope note: Eine Kamerafrau/Ein Kameramann für einen Film wird auch als "Bildregisseurin/Bildregisseur" bezeichnet. @de
scope note: Elokuvan kuvaajaa kutsutaan myös elokuvaajaksi.
scope note: Filmfotografen for en film kalles også sjefsfotograf. @no
scope note: Filmfotografen på en film kaldes også for en cheffotograf. @da

toimeksiantaja (yhteistoimija) teoksessa
has element type: 2
toolkit definition: A work that involves a responsibility of a collective agent for commissioning a work. @en
toolkit definition: Bir eserin görevlendirilmesi için kolektif temsilcinin sorumluluğunu içeren bir eser. @tr
toolkit definition: Darbs, kas ietver grupas atbildību par darba pasūtīšanu. @lv
toolkit definition: Een werk dat met zich meebrengt een verantwoordelijkheid van een collectieve actor voor opdracht geven tot een werk. @nl
toolkit definition: Egy mű, amelyhez hozzátartozik egy kollektív ágens felelőssége egy mű megrendeléséért. @hu
toolkit definition: Ein Werk, bei dem ein gemeinschaftlicher Akteur dafür verantwortlich ist, ein Werk in Auftrag zu geben. @de
toolkit definition: Et verk som involverer et ansvar for en kollektiv agent i form av å bestille et verk. @no
toolkit definition: Obra que implica una responsabilitat d’un agent col·lectiu d’encarregar una obra. @ca
toolkit definition: Opera che implica una responsabilità di un agente collettivo nella committenza di un'opera. @it
toolkit definition: Teos, jossa yhteistoimija on vastuussa teoksen teettämisestä.
toolkit definition: Teos, mis sisaldab kollektiivi vastutust teose tellimise eest. @et
toolkit definition: Værk, som involverer en kollektiv agents ansvar for at bestille et værk. @da
toolkit definition: Œuvre qui comporte une responsabilité de la part d’un agent collectif consistant à commander une œuvre. @fr
toolkit definition: عمل ينطوي على مسئولية وكيل جماعي عن إصدار التكليف بعمل. @ar
toolkit definition: 涉及委托一种作品的一个集体行为者的责任的一种作品 @zh-hans
toolkit label: Gemeinschaftlicher Akteur als Auftraggeberin/Auftraggeber von @de
toolkit label: agent collectif commanditaire de @fr
toolkit label: agent col·lectiu comitent de @ca
toolkit label: commissioning collective agent of @en
toolkit label: ente committente agente collettivo di @it
toolkit label: görevlendiren kolektif temsilci @tr
toolkit label: ir pasūtītājs (grupa) @lv
toolkit label: kollektiv agent, som er opgavestiller af @da
toolkit label: megrendelő kollektív ágense: @hu
toolkit label: opdrachtgever-collectieve actor van @nl
toolkit label: oppdragsgiver for (kollektiv agent) @no
toolkit label: tellija (kollektiiv) teoses @et
toolkit label: toimeksiantaja (yhteistoimija) teoksessa
toolkit label: προσληφθέν όργανο συλλογικός φορέας του @el
toolkit label: وكيل جماعي جهة تكليف بـ @ar
toolkit label: ……的委托集体行为者 @zh-hans
has subproperty: toimeksiantaja (yhteisö) teoksessa
has subproperty: toimeksiantaja (suku) teoksessa
has subproperty: P50689
lexical alias: commissioningCollectiveAgentOf.en
status: Published
type: Property
domain: C10011
label: er kollektiv agent, som er opgavestiller af @da
label: er oppdragsgiver for (kollektiv agent) @no
label: est un agent collectif commanditaire de @fr
label: görevlendiren kolektif temsilcisidir @tr
label: ir pasūtītājs (grupa) @lv
label: is commissioning collective agent of @en
label: is opdrachtgever-collectieve actor van @nl
label: ist gemeinschaftlicher Akteur als Auftraggeberin/Auftraggeber von @de
label: megrendelő kollektív ágense a következőnek: @hu
label: tellija (kollektiiv) teoses @et
label: è ente committente agente collettivo di @it
label: és agent col·lectiu comitent de @ca
label: είναι προσληφθέν όργανο συλλογικός φορέας του @el
label: هو وكيل جماعي جهة تكليف لـ @ar
label: 是……的委托集体行为者 @zh-hans
sub property of: toimeksiantaja (toimija) teoksessa
sub property of: yhteistoimijaan liittyvä teos
definition: Correla un agente collettivo a un'opera che implica una responsabilità di un agente collettivo nella committenza di un'opera. @it
definition: Hozzákapcsol egy kollektív ágenst egy műhöz, amelyhez hozzátartozik egy kollektív ágens felelőssége egy mű megrendeléséért. @hu
definition: Kolektif bir temsilciyi, bir işi işletmekle görevli kolektif temsilcinin sorumluluğunu içeren bir eser ile ilişkilendirir. @tr
definition: Liittää yhteistoimijan teokseen, jossa yhteistoimija on vastuussa teoksen teettämisestä.
definition: Met un agent collectif en relation avec une œuvre qui comporte une responsabilité de la part d’un agent collectif consistant à commander une œuvre. @fr
definition: Relaciona un agent col·lectiu amb una obra que implica una responsabilitat d’un agent col·lectiu d’encarregar una obra. @ca
definition: Relateert een collectieve actor aan een werk dat met zich meebrengt een verantwoordelijkheid van een collectieve actor voor opdracht geven tot een werk. @nl
definition: Relaterer en kollektiv agent til et verk som involverer et ansvar for en kollektiv agent i form av å bestille et verk. @no
definition: Relaterer en kollektiv agent til et værk, som involverer en kollektiv agents ansvar for at bestille et værk. @da
definition: Relates a collective agent to a work that involves a responsibility of a collective agent for commissioning a work. @en
definition: Sasaista grupu ar darbu, kas ietver grupas atbildību par darba pasūtīšanu. @lv
definition: Seostab kollektiivi teosega, mis sisaldab kollektiivi vastutust teose tellimise eest. @et
definition: Setzt einen gemeinschaftlichen Akteur in Beziehung zu einem Werk, bei dem ein gemeinschaftlicher Akteur dafür verantwortlich ist, ein Werk in Auftrag zu geben. @de
definition: يربط وكيلا جماعيا بعمل ينطوي على مسئوليته عن إصدار التكليف بعمل. @ar
definition: 将一个集体行为者与涉及委托一种作品的一个集体行为者的责任的一种作品关联起来。 @zh-hans

ohjelmoija (yhteistoimija) teoksessa
has element type: 2
toolkit definition: A work that involves a responsibility of a collective agent for creating a computer program. @en
toolkit definition: Bir bilgisayar programını oluşturmakla görevli temsilcinin sorumluluğunu içeren bir eser. @tr
toolkit definition: Darbs, kas ietver grupas atbildību par datorprogrammas izveidi. @lv
toolkit definition: Een werk dat met zich meebrengt een verantwoordelijkheid van een collectieve actor voor programmeren voor een computer. @nl
toolkit definition: Egy mű, amelyhez hozzátartozik egy kollektív ágens felelőssége számítógépes programozásért. @hu
toolkit definition: Ein Werk, bei dem ein gemeinschaftlicher Akteur für die Schaffung eines Computerprogramms verantwortlich ist. @de
toolkit definition: Et verk som involverer et ansvar for en kollektiv agent i form av programmering. @no
toolkit definition: Obra que implica una responsabilitat d’un agent col·lectiu en la creació d’un programa informàtic. @ca
toolkit definition: Opera che implica una responsabilità di un agente collettivo per la programmazione informatica. @it
toolkit definition: Teos, jossa yhteistoimija on vastuussa tietokoneohjelman luomisesta.
toolkit definition: Teos, mis sisaldab kollektiivi vastutust programmeerimise eest. @et
toolkit definition: Værk, som involverer en kollektiv agents ansvar for computerprogrammering. @da
toolkit definition: Œuvre qui comporte une responsabilité de la part d’un agent collectif consistant à créer un programme informatique. @fr
toolkit definition: عمل يترتب عليه مسئولية وكيل جماعي عن البرمجة الحاسبوبية. @ar
toolkit definition: 涉及创建一个计算机程序的一个集体行为者的责任的一种作品 @zh-hans
toolkit label: Gemeinschaftlicher Akteur als Programmiererin/Programmierer von @de
toolkit label: agent collectif programmeur de @fr
toolkit label: agent col·lectiu programador de @ca
toolkit label: ir programmētājs (grupa) @lv
toolkit label: kollektiv agent, som er programmør af @da
toolkit label: ohjelmoija (yhteistoimija) teoksessa
toolkit label: programcı kolektif temsilcisi @tr
toolkit label: programmatore agente collettivo di @it
toolkit label: programmeerija (kollektiiv) teoses @et
toolkit label: programmer collective agent of @en
toolkit label: programmerer av (kollektiv agent) @no
toolkit label: programmeur-collectieve actor van @nl
toolkit label: programozó kollektív ágense: @hu
toolkit label: προγραμματιστής συλλογικός φορέας του @el
toolkit label: وكيل جماعي مبرمج @ar
toolkit label: ……的编程者集体行为者 @zh-hans
has subproperty: ohjelmoija (yhteisö) teoksessa
has subproperty: ohjelmoija (suku) teoksessa
has subproperty: P50690
lexical alias: programmerCollectiveAgentOf.en
status: Published
type: Property
domain: C10011
label: er kollektiv agent, som er programmør af @da
label: er programmerer av (kollektiv agent) @no
label: est un agent collectif programmeur de @fr
label: ir programmētājs (grupa) @lv
label: is programmer collective agent of @en
label: is programmeur-collectieve actor van @nl
label: ist gemeinschaftlicher Akteur als Programmiererin/Programmierer von @de
label: programcı kolektif temsilcisidir @tr
label: programmeerija (kollektiiv) teoses @et
label: programozó kollektív ágense a következőnek: @hu
label: è programmatore agente collettivo di @it
label: és agent col·lectiu programador de @ca
label: είναι προγραμματιστής συλλογικός φορέας του @el
label: هو وكيل جماعي مبرمج لـ @ar
label: 是……的编程者集体行为者 @zh-hans
sub property of: ohjelmoija (toimija) teoksessa
sub property of: teoksen tekijä (yhteistoimija) teoksessa
definition: Correla un agente collettivo a un'opera che implica una responsabilità di un agente collettivo per la programmazione informatica. @it
definition: Hozzákapcsol egy kollektív ágenst egy műhöz, amelyhez hozzátartozik egy kollektív ágens felelőssége számítógépes programozásért. @hu
definition: Kolektif bir temsilciyi, bir bilgisayar programını oluşturmakla görevli temsilcinin sorumluluğunu içeren bir eser ile ilişkilendirir. @tr
definition: Liittää yhteistoimijan teokseen, jossa yhteistoimija on vastuussa tietokoneohjelman luomisesta.
definition: Met un agent collectif en relation avec une œuvre qui comporte une responsabilité de la part d’un agent collectif consistant à créer un programme informatique. @fr
definition: Relaciona un agent col·lectiu amb una obra que implica una responsabilitat d’un agent col·lectiu en la creació d’un programa informàtic. @ca
definition: Relateert een collectieve actor aan een werk dat met zich meebrengt een verantwoordelijkheid van een collectieve actor voor programmeren voor een computer. @nl
definition: Relaterer en kollektiv agent til et verk som involverer et ansvar for en kollektiv agent i form av programmering. @no
definition: Relaterer en kollektiv agent til et værk, som involverer en kollektiv agents ansvar for computerprogrammering. @da
definition: Relates a collective agent to a work that involves a responsibility of a collective agent for creating a computer program. @en
definition: Sasaista grupu ar darbu, kas ietver grupas atbildību par datorprogrammas izveidi. @lv
definition: Seostab kollektiivi teosega, mis sisaldab kollektiivi vastutust programmeerimise eest. @et
definition: Setzt einen gemeinschaftlichen Akteur in Beziehung zu einem Werk, bei dem ein gemeinschaftlicher Akteur für die Schaffung eines Computerprogramms verantwortlich ist. @de
definition: يربط وكيلا جماعيا بعمل يترتب عليه مسئولية وكيل جماعي عن البرمجة الحاسبوبية. @ar
definition: 将一个集体行为者与涉及创建一个计算机程序的一个集体行为者的责任的一种作品关联起来。 @zh-hans

taiteilija (yhteistoimija) teoksessa
has element type: 2
toolkit definition: A work that involves a responsibility of a collective agent for conceiving, and often implementing, an original graphic design, drawing, painting, etc. @en
toolkit definition: Darbs, kas ietver grupas atbildību par oriģinālu estampa, zīmējuma, gleznas u.tml. radīšanu un īstenošanu. @lv
toolkit definition: Een werk dat met zich meebrengt een verantwoordelijkheid van een collectieve actor voor bedenken, en vaak uitvoeren, van een oorspronkelijk grafisch ontwerp, tekening, schilderij etc. @nl
toolkit definition: Egy mű, amelyhez hozzátartozik egy kollektv ágens felelőssége egy eredeti grafikai terv, rajz, festmény stb. elgondolásáért és gyakran kivitelezéséért is. @hu
toolkit definition: Ein Werk, bei dem ein gemeinschaftlicher Akteur für die Konzeption und oft auch Umsetzung einer originalen grafischen Gestaltung, einer Zeichnung oder eines Gemäldes und so weiter verantwortlich ist. @de
toolkit definition: Et verk som involverer et ansvar for en kollektiv agent i form av å skape, og ofte implementere, et originalt grafisk design, en tegning, et maleri etc. @no
toolkit definition: Obra que implica una responsabilitat d’un agent col·lectiu concebent, i sovint realitzant, un disseny gràfic, un dibuix, una pintura, original etc. @ca
toolkit definition: Opera che implica una responsabilità di un agente collettivo per la concezione, e spesso per lo sviluppo, di un progetto grafico, disegno, dipinto, etc. originale. @it
toolkit definition: Orijinal bir grafik tasarım, çizim, resim vb. tasarlamak ve sıklıkla uygulamakla görevli kolektif temsilcinin sorumluluğunu içeren bir eser.. @tr
toolkit definition: Teos, jossa yhteistoimija on vastuussa alkuperäisen graafisen suunnitelman, piirroksen, maalauksen tms. luomisesta.
toolkit definition: Teos, mis sisaldab kollektiivi vastutust originaalse graafilise kujunduse, joonistuse, maali vms kavandamise ja sageli ka teostamise eest. @et
toolkit definition: Værk, som involverer en kollektiv agents ansvar for at udtænke, og ofte udføre, et originalt grafisk design, en original tegning, et originalt maleri etc. @da
toolkit definition: Œuvre qui comporte une responsabilité de la part d’un agent collectif consistant à concevoir et souvent à réaliser un graphisme, une peinture, un dessin, etc. original. @fr
toolkit definition: عمل يترتب عليه مسئولية وكيل جماعي عن وضع تصور لتصميم جرافيكي، أو لرسم، أو للوحة زيتية أصلية، إلخ وغالبا تنفيذها. @ar
toolkit definition: 涉及构思并经常是完成原创图形设计、绘图、绘画等的一个集体行为者的责任的一种作品 @zh-hans
toolkit label: Gemeinschaftlicher Akteur als Künstlerin/Künstler von @de
toolkit label: agent collectif artiste de @fr
toolkit label: agent col·lectiu artista de @ca
toolkit label: artist collective agent of @en
toolkit label: artista agente collettivo di @it
toolkit label: ir mākslinieks (grupa) @lv
toolkit label: kollektiv agent, som er kunstner af @da
toolkit label: kunstenaar-collectieve actor van @nl
toolkit label: kunstner av (kollektiv agent) @no
toolkit label: kunstnik (kollektiiv) teoses @et
toolkit label: művész kollektív ágense: @hu
toolkit label: sanatçı kolektif temsilcisi @tr
toolkit label: taiteilija (yhteistoimija) teoksessa
toolkit label: καλλιτέχνης συλλογικός φορέας του @el
toolkit label: وكيل جماعي فنان @ar
toolkit label: ……的美术家集体行为者 @zh-hans
has subproperty: kalligrafi (yhteistoimija) teoksessa
has subproperty: kirjataiteilija (yhteistoimija) teoksessa
has subproperty: kuvanveistäjä (yhteistoimija) teoksessa
has subproperty: taiteilija (yhteisö) teoksessa
has subproperty: taiteilija (suku) teoksessa
has subproperty: P50691
lexical alias: artistCollectiveAgentOf.en
status: Published
type: Property
domain: C10011
label: er kollektiv agent, som er kunstner af @da
label: er kunstner av (kollektiv agent) @no
label: est un agent collectif artiste de @fr
label: ir mākslinieks (grupa) @lv
label: is artist collective agent of @en
label: is kunstenaar-collectieve actor van @nl
label: ist gemeinschaftlicher Akteur als Künstlerin/Künstler von @de
label: kunstnik (kollektiiv) teoses @et
label: művész kollektív ágense a következőnek: @hu
label: sanatçı kolektif temsilcidir @tr
label: è artista agente collettivo di @it
label: és agent col·lectiu artista de @ca
label: είναι καλλιτέχνης συλλογικός φορέας του @el
label: هو وكيل جماعي فنان لـ @ar
label: 是……的美术家集体行为者 @zh-hans
sub property of: taiteilija (toimija) teoksessa
sub property of: teoksen tekijä (yhteistoimija) teoksessa
definition: Correla un agente collettivo a un'opera che implica una responsabilità di un agente collettivo per la concezione, e spesso per lo sviluppo, di un progetto grafico, disegno, dipinto, etc. originale. @it
definition: Hozzákapcsol egy kollektív ágenst egy műhöz, amelyhez hozzátartozik egy kollektv ágens felelőssége egy eredeti grafikai terv, rajz, festmény stb. elgondolásáért és gyakran kivitelezéséért is. @hu
definition: Kolektif bir temsilciyi, orijinal bir grafik tasarım, çizim, resim vb. tasarlamak ve sıklıkla uygulamakla görevli kolektif temsilcinin sorumluluğunu içeren bir eser ile ilişkilendirir. @tr
definition: Liittää yhteistoimijan teokseen, jossa yhteistoimija on vastuussa alkuperäisen graafisen suunnitelman, piirroksen, maalauksen tms. luomisesta.
definition: Met un agent collectif en relation avec une œuvre qui comporte une responsabilité de la part d’un agent collectif consistant à concevoir et souvent à réaliser un graphisme, une peinture, un dessin, etc. original. @fr
definition: Relaciona un agent col·lectiu amb una obra que implica una responsabilitat d’un agent col·lectiu concebent, i sovint realitzant, un disseny gràfic, un dibuix, una pintura, original etc. @ca
definition: Relateert een collectieve actor aan een werk dat met zich meebrengt een verantwoordelijkheid van een collectieve actor voor bedenken, en vaak uitvoeren, van een oorspronkelijk grafisch ontwerp, tekening, schilderij etc. @nl
definition: Relaterer en kollektiv agent til et verk som involverer et ansvar for en kollektiv agent i form av å skape, og ofte implementere, et originalt grafisk design, en tegning, et maleri etc. @no
definition: Relaterer en kollektiv agent til et værk, som involverer en kollektiv agents ansvar for at udtænke, og ofte udføre, et originalt grafisk design, en original tegning, et originalt maleri etc. @da
definition: Relates a collective agent to a work that involves a responsibility of a collective agent for conceiving, and often implementing, an original graphic design, drawing, painting, etc. @en
definition: Sasaista grupu ar darbu, kas ietver grupas atbildību par oriģinālu estampa, zīmējuma, gleznas u.tml. radīšanu un īstenošanu. @lv
definition: Seostab kollektiivi teosega, mis sisaldab kollektiivi vastutust originaalse graafilise kujunduse, joonistuse, maali vms kavandamise ja sageli ka teostamise eest. @et
definition: Setzt einen gemeinschaftlichen Akteur in Beziehung zu einem Werk, bei dem ein gemeinschaftlicher Akteur für die Konzeption und oft auch Umsetzung einer originalen grafischen Gestaltung, einer Zeichnung oder eines Gemäldes und so weiter verantwortlich ist. @de
definition: يربط وكيلا جماعيا بعمل يترتب عليه مسئولية وكيل جماعي عن وضع تصور لتصميم جرافيكي، أو لرسم، أو للوحة زيتية أصلية، إلخ وغالبا تنفيذها. @ar
definition: 将一个集体行为者与涉及构思并经常是完成原创图形设计、绘图、绘画等的一个集体行为者的责任的一种作品关联起来。 @zh-hans

kirjoittaja (yhteistoimija) teoksessa
has element type: 2
toolkit definition: A work that involves a responsibility of a collective agent for creating a textual work. @en
toolkit definition: Bir metinsel çalışma yapmakla görevli kolektif temsilcinin sorumluluğunu içeren bir eser. @tr
toolkit definition: Darbs, kas ietver grupas atbildību par tekstuāla darba radīšanu. @lv
toolkit definition: Een werk met zich meebrengt een verantwoordelijkheid van een collectieve actor voor creëren van een tekstwerk. @nl
toolkit definition: Egy mű, amelyhez hozzátartozik egy kollektív ágens felelőssége egy szöveges mű létrehozásáért. @hu
toolkit definition: Ein Werk, bei dem ein gemeinschaftlicher Akteur für die Schaffung eines textlichen Werks verantwortlich ist. @de
toolkit definition: Et verk som involverer et ansvar for en kollektiv agent i form av å skape et tekstlig verk. @no
toolkit definition: Obra que implica una responsabilitat d’un agent col·lectiu en la creació d’una obra textual. @ca
toolkit definition: Opera che implica una responsabilità di un agente collettivo per la creazione di un'opera testuale. @it
toolkit definition: Tekstiteos, jonka luomisesta yhteistoimija on vastuussa.
toolkit definition: Værk, som involverer en kollektiv agents ansvar for at skabe et tekstværk. @da
toolkit definition: Œuvre qui comporte une responsabilité de la part d’un agent collectif consistant à créer une œuvre textuelle. @fr
toolkit definition: عمل يترتب عليه مسئولية وكيل جماعي عن إنشاء عمل نصي. @ar
toolkit definition: 涉及创作一种文字作品的一个集体行为者的责任的一种作品 @zh-hans
toolkit label: Gemeinschaftlicher Akteur als Verfasserin/Verfasser von @de
toolkit label: agent collectif auteur de @fr
toolkit label: agent col·lectiu autor de @ca
toolkit label: auteur-collectieve actor van @nl
toolkit label: author collective agent of @en
toolkit label: autore agente collettivo di @it
toolkit label: forfatter av (kollektiv agent) @no
toolkit label: ir autors (grupa) @lv
toolkit label: kirjoittaja (yhteistoimija) teoksessa
toolkit label: kollektiv agent, som er forfatter af @da
toolkit label: szerző kollektív ágense: @hu
toolkit label: yazar kolektif temsilcisi @tr
toolkit label: συγγραφέας συλλογικός φορέας του @el
toolkit label: وكيل جماعي مؤلف @ar
toolkit label: ……的著者集体行为者 @zh-hans
has subproperty: käsikirjoittaja (yhteistoimija) teoksessa
has subproperty: sanoittaja (yhteistoimija) teoksessa
has subproperty: libretisti (yhteistoimija) teoksessa
has subproperty: kokousten raportoija (yhteistoimija) teoksessa
has subproperty: kirjoittaja (yhteisö) teoksessa
has subproperty: kirjoittaja (suku) teoksessa
has subproperty: P50692
lexical alias: authorCollectiveAgentOf.en
status: Published
type: Property
domain: C10011
label: er forfatter av (kollektiv agent) @no
label: er kollektiv agent, som er forfatter af @da
label: est un agent collectif auteur de @fr
label: ir autors (grupa) @lv
label: is auteur-collectieve actor van @nl
label: is author collective agent of @en
label: ist gemeinschaftlicher Akteur als Verfasserin/Verfasser von @de
label: szerző kollektív ágense a következőnek: @hu
label: yazar kolektif temsilcisidir @tr
label: è autore agente collettivo di @it
label: és agent col·lectiu autor de @ca
label: είναι συγγραφέας συλλογικός φορέας του @el
label: هو وكيل جماعي مؤلف لـ @ar
label: 是……的著者集体行为者 @zh-hans
sub property of: kirjoittaja (toimija) teoksessa
sub property of: teoksen tekijä (yhteistoimija) teoksessa
definition: Correla un agente collettivo a un'opera che implica una responsabilità di un agente collettivo per la creazione di un'opera testuale. @it
definition: Hozzákapcsol egy kollektív ágenst egy műhöz, amelyhez hozzátartozik egy kollektív ágens felelőssége egy szöveges mű létrehozásáért. @hu
definition: Kolektif bir temsilciyi, bir metinsel çalışma yapmakla görevli kolektif temsilcinin sorumluluğunu içeren bir eser ile ilişkilendirir. @tr
definition: Liittää yhteistoimijan tekstiteokseen, jonka luomisesta yhteistoimija on vastuussa.
definition: Met un agent collectif en relation avec une œuvre qui comporte une responsabilité de la part d’un agent collectif consistant à créer une œuvre textuelle. @fr
definition: Relaciona un agent col·lectiu amb una obra que implica una responsabilitat d’un agent col·lectiu en la creació d’una obra textual. @ca
definition: Relateert een collectieve actor aan een werk met zich meebrengt een verantwoordelijkheid van een collectieve actor voor creëren van een tekstwerk. @nl
definition: Relaterer en kollektiv agent til et verk som involverer et ansvar for en kollektiv agent i form av å skape et tekstlig verk. @no
definition: Relaterer en kollektiv agent til et værk, som involverer en kollektiv agents ansvar for at skabe et tekstværk. @da
definition: Relates a collective agent to a work that involves a responsibility of a collective agent for creating a textual work. @en
definition: Sasaista grupu ar darbu, kas ietver grupas atbildību par tekstuāla darba radīšanu. @lv
definition: Setzt einen gemeinschaftlichen Akteur in Beziehung zu einem Werk, bei dem ein gemeinschaftlicher Akteur für die Schaffung eines textlichen Werks verantwortlich ist. @de
definition: يربط وكيلا جماعيا بعمل يترتب عليه مسئولية وكيل جماعي عن إنشاء عمل نصي. @ar
definition: 将一个行为者与涉及创作一种文字作品的一个集体行为者的责任的一种作品关联起来。 @zh-hans

teoksen tekijä (yhteistoimija) teoksessa
has element type: 2
toolkit definition: A work that involves a responsibility of a collective agent for creation. @en
toolkit definition: Darbs, kas ietver grupas atbildību par radīšanu. @lv
toolkit definition: Een werk dat met zich meebrengt een verantwoordelijkheid van een collectieve actor voor creatie. @nl
toolkit definition: Egy mű, amelyhez hozzátartozik egy kollektív ágens felelőssége a létrehozásért. @hu
toolkit definition: Ein Werk, bei dem ein gemeinschaftlicher Akteur für dessen Schaffung verantwortlich ist. @de
toolkit definition: Et verk som involverer et ansvar for en kollektiv agent i form av skapelse. @no
toolkit definition: Kolektif bir temsilcinin yaratım sorumluluğunu içeren bir eser. @tr
toolkit definition: Obra que implica una responsabilitat d’un agent col·lectiu en la creació. @ca
toolkit definition: Opera che implica una responsabilità di un agente collettivo per la creazione. @it
toolkit definition: Teos, jonka luomisesta yhteistoimija on vastuussa.
toolkit definition: Teos, mis sisaldab kollektiivi vastutust teose loomise eest. @et
toolkit definition: Værk, som involverer en kollektiv agents ansvar for skabelse. @da
toolkit definition: Œuvre qui comporte une responsabilité de la part d’un agent collectif en ce qui concerne la création. @fr
toolkit definition: عمل يترتب عليه مسئولية وكيل جماعي عن الإنشاء. @ar
toolkit definition: 涉及创作或贡献的一个集体行为者的责任的一种内容表达 @zh-hans
toolkit label: Gemeinschaftlicher Akteur als geistige Schöpferin/geistiger Schöpfer eines Werks von @de
toolkit label: agent collectif créateur d’une œuvre de @fr
toolkit label: agent col·lectiu creador d’una obra de @ca
toolkit label: creator collective agent of work of @en
toolkit label: creatore agente collettivo di opera di @it
toolkit label: eserin yaratıcı kolektif temsilcisi @tr
toolkit label: ir radītājs (grupa) darbam @lv
toolkit label: kollektiv agent, som er ophav til værk af @da
toolkit label: létrehozó kollektív ágense a következő műnek: @hu
toolkit label: maker-collectieve actor van werk van @nl
toolkit label: skaper av verk for (kollektiv agent) @no
toolkit label: teoksen tekijä (yhteistoimija) teoksessa
toolkit label: teose autor (kollektiiv) teoses @et
toolkit label: δημιουργός συλλογικός φορέας του έργου του @el
toolkit label: وكيل جماعي منشئ عمل @ar
toolkit label: ……的内容表达的创作者集体行为者 @zh-hans
has subproperty: koreografi (yhteistoimija) teoksessa
has subproperty: teoksen säveltäjä (yhteistoimija) musiikkiteoksessa
has subproperty: teoksen kartantekijä (yhteistoimija) teoksessa
has subproperty: keksijä (yhteistoimija) teoksessa
has subproperty: teoksen haastattelija (yhteistoimija) teoksessa
has subproperty: aggregaattori (yhteistoimija) teoksessa
has subproperty: arkkitehti (yhteistoimija) teoksessa
has subproperty: elokuvantekijä (yhteistoimija) teoksessa
has subproperty: ohjelmoija (yhteistoimija) teoksessa
has subproperty: taiteilija (yhteistoimija) teoksessa
has subproperty: kirjoittaja (yhteistoimija) teoksessa
has subproperty: designer (yhteistoimija) teoksessa
has subproperty: uudelleenmiksaaja (yhteistoimija) teoksessa
has subproperty: roolittaja (yhteistoimija) teoksessa
has subproperty: tuottaja (yhteistoimija) teoksessa
has subproperty: teoksen valokuvaaja (yhteistoimija) teoksessa
has subproperty: teoksen haastateltava (yhteistoimija) teoksessa
has subproperty: er korporation, som er ophav til værk af
has subproperty: teoksen tekijä (suku) teoksessa
has subproperty: muodostaja (yhteistoimija) kokoelmalle
has subproperty: P50693
lexical alias: creatorCollectiveAgentOfWorkOf.en
status: Published
type: Property
domain: C10011
label: er kollektiv agent, som er ophav til værk af @da
label: er skaper av verk for (kollektiv agent) @no
label: eserinin yaratıcı kolektif temsilcisidir @tr
label: est un agent collectif créateur d’une œuvre de @fr
label: ir radītājs (grupa) darbam @lv
label: is creator collective agent of work of @en
label: is maker-collectieve actor van werk van @nl
label: ist gemeinschaftlicher Akteur als geistige Schöpferin/geistiger Schöpfer eines Werks von @de
label: létrehozó kollektív ágense a következő műnek: @hu
label: teose autor (kollektiiv) teoses @et
label: è creatore agente collettivo di opera di @it
label: és agent col·lectiu creador d’una obra de @ca
label: είναι δημιουργός συλλογικός φορέας του έργου του @el
label: هو وكيل جماعي منشئ عمل لـ @ar
label: 是……的内容表达的创作者集体行为者 @zh-hans
sub property of: teoksen tekijä (toimija) teoksessa
sub property of: yhteistoimijaan liittyvä teos
definition: Correla un agente collettivo a un'opera che implica una responsabilità di un agente collettivo per la creazione. @it
definition: Hozzákapcsol egy kollektív ágenst egy műhöz, amelyhez hozzátartozik egy kollektív ágens felelőssége a létrehozásért. @hu
definition: Kolektif bir temsilciyi, kolektif temsilcisinin üretme sorumluluğunu içeren bir eser ile ilişkilendirir. @tr
definition: Liittää yhteistoimijan teokseen, jonka luomisesta yhteistoimija on vastuussa.
definition: Met un agent collectif en relation avec une œuvre qui comporte une responsabilité de la part d’un agent collectif en ce qui concerne la création. @fr

designer (yhteistoimija) teoksessa
has element type: 2
toolkit definition: A work that involves a responsibility of a collective agent for designing an object. @en
toolkit definition: Bir nesneyi tasarlamak için kollektif bir temsilcinin sorumluluğunu içeren bir eser. @tr
toolkit definition: Darbs, kas ietver grupas atbildību par objekta dizaina radīšanu. @lv
toolkit definition: Een werk dat met zich meebrengt een verantwoordelijkheid van een collectieve actor voor het ontwerpen van een object. @nl
toolkit definition: Egy mű, amelyhez hozzátartozik egy kollektív ágens felelőssége egy tárgy tervezéséért. @hu
toolkit definition: Ein Werk, bei dem ein gemeinschaftlicher Akteur für die Gestaltung eines Objekts verantwortlich ist. @de
toolkit definition: Et verk som involverer et ansvar for en kollektiv agent i form av å designe en gjenstand. @no
toolkit definition: Obra que implica una responsabilitat d’un agent col·lectiu en el disseny d’un objecte. @ca
toolkit definition: Opera che implica una responsabilità di un agente collettivo per la progettazione di oggetto. @it
toolkit definition: Teos, jossa yhteistoimija on vastuussa kohteen suunnittelusta tai muotoilusta.
toolkit definition: Teos, mis sisaldab kollektiivi vastutust objekti kujunduse eest. @et
toolkit definition: Værk, som involverer en kollektiv agents ansvar for at designe et objekt. @da
toolkit definition: Œuvre qui comporte une responsabilité de la part d’un agent collectif consistant à concevoir un objet. @fr
toolkit definition: عمل يشتمل على مسئولية وكيل جماعي عن تصميم كائن. @ar
toolkit definition: 涉及设计一个物体的一个集体行为者的责任的一种作品 @zh-hans
toolkit label: Gemeinschaftlicher Akteur als Designerin/Designer von @de
toolkit label: agent collectif designer de @fr
toolkit label: agent col·lectiu dissenyador de @ca
toolkit label: designer (yhteistoimija) teoksessa
toolkit label: designer agente collettivo di @it
toolkit label: designer av (kollektiv agent) @no
toolkit label: designer collective agent of @en
toolkit label: ir dizainers (grupa) @lv
toolkit label: kollektiv agent, som er designer af @da
toolkit label: kujundaja (kollektiiv) teoses @et
toolkit label: ontwerper-collectieve actor van @nl
toolkit label: tasarımcı kolektif temsilci @tr
toolkit label: tervező kollektív ágense: @hu
toolkit label: σχεδιαστής συλλογικός φορέας του @el
toolkit label: وكيل جماعي مصمم @ar
toolkit label: ……的设计者集体行为者 @zh-hans
has subproperty: designer (yhteisö) teoksessa
has subproperty: designer (suku) teoksessa
has subproperty: P50694
lexical alias: designerCollectiveAgentOf.en
status: Published
type: Property
domain: C10011
label: er designer av (kollektiv agent) @no
label: er kollektiv agent, som er designer af @da
label: est un agent collectif designer de @fr
label: ir dizainers (grupa) @lv
label: is designer collective agent of @en
label: is ontwerper-collectieve actor van @nl
label: ist gemeinschaftlicher Akteur als Designerin/Designer von @de
label: kujundaja (kollektiiv) teoses @et
label: tasarımcı kolektif temsilcisidir @tr
label: tervező kollektív ágense a következőnek: @hu
label: è designer agente collettivo di @it
label: és agent col·lectiu dissenyador de @ca
label: είναι σχεδιαστής συλλογικός φορέας του @el
label: هو وكيل جماعي مصمم لـ @ar
label: 是……的设计者集体行为者 @zh-hans
sub property of: designer (toimija) teoksessa
sub property of: teoksen tekijä (yhteistoimija) teoksessa
definition: Correla un agente collettivo a un'opera che implica una responsabilità di un agente collettivo per la progettazione di oggetto. @it
definition: Hozzákapcsol egy kollektív ágenst egy műhöz, amelyhez hozzátartozik egy kollektív ágens felelőssége egy tárgy tervezéséért. @hu
definition: Kollektif bir temsilciyi, bir nesneyi tasarlamak için kolektif bir temsilcinin sorumluluğunu içeren bir eserle ilişkilendirir. @tr
definition: Liittää yhteistoimijan teokseen, jossa yhteistoimija on vastuussa kohteen suunnittelusta tai muotoilusta.
definition: Met un agent collectif en relation avec une œuvre qui comporte une responsabilité de la part d’un agent collectif consistant à concevoir un objet. @fr
definition: Relaciona un agent col·lectiu amb una obra que implica una responsabilitat d’un agent col·lectiu en el disseny d’un objecte. @ca
definition: Relateert een collectieve actor aan een werk dat met zich meebrengt een verantwoordelijkheid van een collectieve actor voor het ontwerpen van een object. @nl
definition: Relaterer en kollektiv agent til et verk som involverer et ansvar for en kollektiv agent i form av å designe en gjenstand. @no
definition: Relaterer en kollektiv agent til et værk, som involverer en kollektiv agents ansvar for at designe et objekt. @da
definition: Relates a collective agent to a work that involves a responsibility of a collective agent for designing an object. @en
definition: Sasaista grupu ar darbu, kas ietver grupas atbildību par objekta dizaina radīšanu. @lv
definition: Seostab kollektiivi teosega, mis sisaldab kollektiivi vastutust objekti kujunduse eest. @et
definition: Setzt einen gemeinschaftlichen Akteur in Beziehung zu einem Werk, bei dem ein gemeinschaftlicher Akteur für die Gestaltung eines Objekts verantwortlich ist. @de
definition: يربط وكيلا جماعيا بعمل يشتمل على مسئولية وكيل جماعي عن تصميم كائن. @ar
definition: 将一个集体行为者与涉及设计一个物体的一个集体行为者的责任的一种作品关联起来。 @zh-hans

kirjataiteilija (yhteistoimija) teoksessa
has element type: 2
toolkit definition: A work that involves a responsibility of a collective agent for exploiting the book form or altering its physical structure. @en
toolkit definition: Darbs, kas ietver grupas atbildību par grāmatas formas izmantošanu vai tās fiziskās struktūras pārveidošanu. @lv
toolkit definition: Een werk dat met zich meebrengt een verantwoordelijkheid van een collectieve actor voor het benutten van de vorm van het boek of veranderen van de fysieke structuur. @nl
toolkit definition: Egy mű, amelyhez hozzátartozik egy kollektív ágens felelőssége a könyvforma kiaknázásáért vagy fizikai szerkezetének megváltoztatásáért. @hu
toolkit definition: Ein Werk, bei dem ein gemeinschaftlicher Akteur für die Verwertung der Buchform oder für die Veränderung ihrer physischen Struktur verantwortlich ist. @de
toolkit definition: Et verk som involverer et ansvar for en kollektiv agent i form av å utnytte bokformatet eller endre dets fysiske struktur. @no
toolkit definition: Kitap biçiminden yararlanmak veya fiziksel yapısını değiştirmek için kollektif bir temsilcinin sorumluluğunu içeren bir eser. @tr
toolkit definition: Obra que implica una responsabilitat d’un agent col·lectiu en l’explotació de la forma llibre o en la modificació de la seva estructura física. @ca
toolkit definition: Opera che implica una responsabilità di un agente collettivo per la valorizzazione del formato del libro o l'alterazione della sua struttura fisica. @it
toolkit definition: Teos, jossa yhteistoimija on vastuussa kirjan muodon hyödyntämisestä tai sen fyysisen rakenteen muuttamisesta.
toolkit definition: Teos, mis sisaldab kollektiivi vastutust raamatu vormi rakendamise või selle füüsilise struktuuri muutmise eest. @et
toolkit definition: Værk, som involverer en kollektiv agents ansvar for at udnytte bogformen eller ændre dens fysiske struktur. @da
toolkit definition: Œuvre qui comporte une responsabilité de la part d’un agent collectif consistant à exploiter la forme livre ou à modifier sa structure physique. @fr
toolkit definition: عمل يترتب عليه مسئولية وكيل جماعي عن استغلال شكل الكتاب أو تغيير بنيته المادية. @ar
toolkit definition: 涉及开发图书外形或改变其物理结构的一个集体行为者的责任的一种作品 @zh-hans
toolkit label: Gemeinschaftlicher Akteur als Buchkünstlerin/Buchkünstler von @de
toolkit label: agent collectif artiste du livre de @fr
toolkit label: agent col·lectiu artista de llibre d’art de @ca
toolkit label: boekkunstenaar-collectieve actor van @nl
toolkit label: bokkunstner for (kollektiv agent) @no
toolkit label: book artist agente collettivo di @it
toolkit label: book artist collective agent of @en
toolkit label: ir grāmatu mākslinieks (grupa) @lv
toolkit label: kirjataiteilija (yhteistoimija) teoksessa
toolkit label: kitap sanatçısı kollektif temsilcisi @tr
toolkit label: kollektiv agent, som er bogkunstner af @da
toolkit label: könyvművész kollektív ágense: @hu
toolkit label: raamatukunstnik (kollektiiv) teoses @et
toolkit label: βιβλίο του καλλιτέχνη συλλογικός φορέας του ? @el
toolkit label: وكيل جماعي رسام كتب مصورة @ar
toolkit label: ……的图书美术家集体行为者 @zh-hans
has subproperty: kirjataiteilija (yhteisö) teoksessa
has subproperty: kirjataiteilija (suku) teoksessa
has subproperty: P50695
lexical alias: bookArtistCollectiveAgentOf.en
status: Published
type: Property
domain: C10011
label: er bokkunstner for (kollektiv agent) @no
label: er kollektiv agent, som er bogkunstner af @da
label: est un agent collectif artiste du livre de @fr
label: ir grāmatu mākslinieks (grupa) @lv
label: is boekkunstenaar-collectieve actor van @nl
label: is book artist collective agent of @en
label: ist gemeinschaftlicher Akteur als Buchkünstlerin/Buchkünstler von @de
label: kitap sanatçısı kollektif temsilcisidir @tr
label: könyvművész kollektív ágense a következőnek: @hu
label: raamatukunstnik (kollektiiv) teoses @et
label: è book artist agente collettivo di @it
label: és agent col·lectiu artista de llibre d’art de @ca
label: είναι βιβλίο του καλλιτέχνη συλλογικός φορέας του ? @el
label: هو وكيل جماعي رسام كتب مصورة لـ @ar
label: 是……的图书美术家集体行为者 @zh-hans
sub property of: kirjataiteilija (toimija) teoksessa
sub property of: taiteilija (yhteistoimija) teoksessa
definition: Correla un agente collettivo a un'opera che implica una responsabilità di un agente collettivo per la valorizzazione del formato del libro o l'alterazione della sua struttura fisica. @it
definition: Hozzákapcsol egy kollektív ágenst egy műhöz, amelyhez hozzátartozik egy kollektív ágens felelőssége a könyvforma kiaknázásáért vagy fizikai szerkezetének megváltoztatásáért. @hu
definition: Kollektif bir temsilciyi, kitap formunu kullanmak veya bu formun fiziksel yapısını değiştirmek için kolektif bir temsilcinin sorumluluğunu gerektiren bir eseri ilişkilendirir. @tr
definition: Liittää yhteistoimijan teokseen, jossa yhteistoimija on vastuussa kirjan muodon hyödyntämisestä tai sen fyysisen rakenteen muuttamisesta.
definition: Met un agent collectif en relation avec une œuvre qui comporte une responsabilité de la part d’un agent collectif consistant à exploiter la forme livre ou à modifier sa structure physique. @fr
definition: Relaciona un agent col·lectiu amb una obra que implica una responsabilitat d’un agent col·lectiu en l’explotació de la forma llibre o en la modificació de la seva estructura física. @ca
definition: Relateert een collectieve actor aan een werk dat met zich meebrengt een verantwoordelijkheid van een collectieve actor voor het benutten van de vorm van het boek of veranderen van de fysieke structuur. @nl
definition: Relaterer en kollektiv agent til et verk som involverer et ansvar for en kollektiv agent i form av å utnytte bokformatet eller endre dets fysiske struktur. @no
definition: Relaterer en kollektiv agent til et værk, som involverer en kollektiv agents ansvar for at udnytte bogformen eller ændre dens fysiske struktur. @da
definition: Relates a collective agent to a work that involves a responsibility of a collective agent for exploiting the book form or altering its physical structure. @en
definition: Sasaista grupu ar darbu, kas ietver grupas atbildību par grāmatas formas izmantošanu vai tās fiziskās struktūras pārveidošanu. @lv
definition: Seostab kollektiivi teosega, mis sisaldab kollektiivi vastutust raamatu vormi rakendamise või selle füüsilise struktuuri muutmise eest. @et
definition: Setzt einen gemeinschaftlichen Akteur in Beziehung zu einem Werk, bei dem ein gemeinschaftlicher Akteur für die Verwertung der Buchform oder für die Veränderung ihrer physischen Struktur verantwortlich ist. @de
definition: يربط وكيلا جماعيا بعمل يترتب عليه مسئولية وكيل جماعي عن استغلال شكل الكتاب أو تغيير بنيته المادية. @ar
definition: 将一个集体行为者与涉及开发图书外形或改变其物理结构的一个集体行为者的责任的一种作品关联起来。 @zh-hans

teoksen perustaja (yhteistoimija) teoksessa
has element type: 2
toolkit definition: A work that involves a responsibility of a collective agent for initiating a diachronic work. @en
toolkit definition: Artzamanlı bir eserin başlatılması için kollektif bir temsilcinin sorumluluğunu içeren bir eser. @tr
toolkit definition: Darbs, kas ietver grupas atbildību par tā (seriālizdevuma, integrētā resursa vai vairākdaļu monogrāfijas) izveidošanu. @lv
toolkit definition: Een werk dat met zich meebrengt een verantwoordelijkheid van een collectieve actor voor het initiëren van een diachronisch werk. @nl
toolkit definition: Egy mű, amelyhez hozzátartozik egy kollektív ágens felelőssége egy diakronikus mű elindításáért. @hu
toolkit definition: Ein Werk, bei dem ein gemeinschaftlicher Akteur für das Begründen eines diachronen Werks verantwortlich ist. @de
toolkit definition: Et verk som involverer et ansvar for en kollektiv agent i form av å etablere et diakronisk verk. @no
toolkit definition: Obra que implica una responsabilitat d’un agent col·lectiu d’iniciar una obra diacrònica. @ca
toolkit definition: Opera che implica una responsabilità di un agente collettivo nell'avvio di un'opera diacronica. @it
toolkit definition: Teos, jossa yhteistoimija on vastuussa diakronisen teoksen alullepanosta.
toolkit definition: Teos, mis sisaldab kollektiivi vastutust diakroonilise teose ellukutsumise eest. @et
toolkit definition: Værk, som involverer en kollektiv agents ansvar for at igangsætte et diakronisk værk. @da
toolkit definition: Œuvre qui comporte une responsabilité de la part d’un agent collectif consistant à lancer une œuvre diachronique. @fr
toolkit definition: عمل يترتب عليه مسئولية وكيل جماعي عن البدء في عمل تزامني. @ar
toolkit definition: 涉及发起一种历时作品的一个集体行为者的责任的一种作品 @zh-hans
toolkit label: Gemeinschaftlicher Akteur als Begründerin/Begründer eines Werks von @de
toolkit label: agent collectif fondateur d’une œuvre de @fr
toolkit label: agent col·lectiu fundador d’una obra de @ca
toolkit label: alapító kollektív ágense a következő műnek: @hu
toolkit label: eserin kurucu kolektif temsilcisi @tr
toolkit label: fondatore agente collettivo di opera di @it
toolkit label: founder collective agent of work of @en
toolkit label: grunnlegger av verk for (kollektiv agent) @no
toolkit label: ir dibinātājs (grupa) darbam @lv
toolkit label: kollektiv agent, som er stifter af værk af @da
toolkit label: oprichter-collectieve actor van werk van @nl
toolkit label: teoksen perustaja (yhteistoimija) teoksessa
toolkit label: teose asutaja (kollektiiv) teoses @et
toolkit label: ιδρυτής συλλογικός φορέας του έργου του @el
toolkit label: وكيل جماعي مؤسس عمل @ar
toolkit label: ……的作品的创办者集体行为者 @zh-hans
has subproperty: teoksen perustaja (yhteisö) teoksessa
has subproperty: teoksen perustaja (suku) teoksessa
has subproperty: P50696
lexical alias: founderCollectiveAgentOfWorkOf.en
status: Published
type: Property
domain: C10011
label: alapító kollektív ágense a következő műnek: @hu
label: er grunnlegger av verk for (kollektiv agent) @no
label: er kollektiv agent, som er stifter af værk af @da
label: eserinin kurucu kolektif temsilcisidir @tr
label: est un agent collectif fondateur d’une œuvre de @fr
label: ir dibinātājs (grupa) darbam @lv
label: is founder collective agent of work of @en
label: is oprichter-collectieve actor van werk van @nl
label: ist gemeinschaftlicher Akteur als Begründerin/Begründer eines Werks von @de
label: teose asutaja (kollektiiv) teoses @et
label: è fondatore agente collettivo di opera di @it
label: és agent col·lectiu fundador d’una obra de @ca
label: είναι ιδρυτής συλλογικός φορέας του έργου του @el
label: هو وكيل جماعي مؤسس عمل لـ @ar
label: 是……的作品的创办者集体行为者 @zh-hans
sub property of: teoksen perustaja (toimija) teoksessa
sub property of: yhteistoimijaan liittyvä teos
definition: Correla un agente collettivo a un'opera che implica una responsabilità di un agente collettivo nell'avvio di un'opera diacronica. @it
definition: Hozzákapcsol egy kollektív ágenst egy műhöz, amelyhez hozzátartozik egy kollektív ágens felelőssége egy diakronikus mű elindításáért. @hu
definition: Kollektif bir temsilciyi, tarihi bir çalışmayı başlatmak için kolektif bir temsilcinin sorumluluğunu içeren bir eseri ilişkilendirir. @tr
definition: Liittää yhteistoimijan teokseen, jossa yhteistoimija on vastuussa diakronisen teoksen alullepanosta.
definition: Met un agent collectif en relation avec une œuvre qui comporte une responsabilité de la part d’un agent collectif consistant à lancer une œuvre diachronique. @fr
definition: Relaciona un agent col·lectiu amb una obra que implica una responsabilitat d’un agent col·lectiu d’iniciar una obra diacrònica. @ca
definition: Relateert een collectieve actor aan een werk dat met zich meebrengt een verantwoordelijkheid van een collectieve actor voor het initiëren van een diachronisch werk. @nl
definition: Relaterer en kollektiv agent til et verk som involverer et ansvar for en kollektiv agent i form av å etablere et diakronisk verk. @no
definition: Relaterer en kollektiv agent til et værk, som involverer en kollektiv agents ansvar for at igangsætte et diakronisk værk. @da
definition: Relates a collective agent to a work that involves a responsibility of a collective agent for initiating a diachronic work. @en
definition: Sasaista grupu ar darbu, kas ietver grupas atbildību par tā (seriālizdevuma, integrētā resursa vai vairākdaļu monogrāfijas) izveidošanu. @lv
definition: Seostab kollektiivi teosega, mis sisaldab kollektiivi vastutust diakroonilise teose ellukutsumise eest. @et
definition: Setzt einen gemeinschaftlicher Akteur in Beziehung zu einem Werk, bei dem ein gemeinschaftlicher Akteur für das Begründen eines diachronen Werks verantwortlich ist. @de
definition: يربط وكيلا جماعيا بعمل يترتب عليه مسئولية وكيل جماعي عن البدء في عمل تزامني. @ar
definition: 将一个集体行为者与涉及发起一种历时作品的一个集体行为者的责任的一种作品关联起来。 @zh-hans

julkaisija (yhteistoimija) teokselle
has element type: 2
toolkit definition: A work that involves a responsibility of a collective agent for issuing a work, such as an official organ of the body. @en
toolkit definition: Darbs, kas ietver grupas atbildību par darba publicēšanu, piemēram, iestādes biļetens. @lv
toolkit definition: Een werk dat met zich meebrengt een verantwoordelijkheid van een collectieve actor voor uitvaardigen van een werk, zoals een officieel orgaan van de instantie. @nl
toolkit definition: Egy mű, amelyhez hozzátartozik egy kollektív ágens felelőssége egy olyan mű kibocsátásáért, mint amilyen egy társaság hivatalos orgánuma. @hu
toolkit definition: Ein Werk, bei dem ein gemeinschaftlicher Akteur für die Herausgabe eines Werks, zum Beispiel eines offiziellen Organs der Körperschaft, verantwortlich ist. @de
toolkit definition: Et verk som involverer et ansvar for en kollektiv agent i form av å utgi et verk. @no
toolkit definition: Kuruluşun resmi bir organı gibi, bir eser yayınlamak için kollektif bir temsilci sorumluluğunu içeren bir eser. @tr
toolkit definition: Obra que implica una responsabilitat d’un agent col·lectiu en la publicació d’una obra, com ara un òrgan oficial de l’entitat. @ca
toolkit definition: Opera che implica una responsabilità di un agente collettivo per l'emissione di un'opera, come un organo ufficiale dell'ente. @it
toolkit definition: Teos, jossa yhteishenkilö on vastuussa (esim. virallisena toimielimenä) teoksen julkaisemisesta.
toolkit definition: Teos, mis sisaldab kollektiivi vastutust teose, nt asutuse ametliku häälekandja väljaandmise eest. @et
toolkit definition: Værk, som involverer en kollektiv agents ansvar for at udgive et værk, som et officielt organ for en organisation. @da
toolkit definition: Œuvre qui comporte une responsabilité de la part d’un agent collectif consistant à publier une œuvre, tel un organe officiel de l’agent collectif. @fr
toolkit definition: عمل يترتب عليه مسئولية وكيل جماعي عن إصدار عمل، مثل الجريدة الرسمية لهيئة. @ar
toolkit definition: 涉及一个颁布一种作品（例如一个团体的机关刊物）的一个集体行为者的责任的一种作品 @zh-hans
toolkit label: Herausgebender gemeinschaftlicher Akteur von @de
toolkit label: agent collectif émetteur de @fr
toolkit label: agent col·lectiu d’entitat editora de @ca
toolkit label: ente emittente agente collettivo di @it
toolkit label: ir publicētājs (grupa) @lv
toolkit label: issuing collective agent of @en
toolkit label: julkaisija (yhteistoimija) teokselle
toolkit label: kibocsátó kollektív ágense: @hu
toolkit label: udgivende kollektiv agent af @da
toolkit label: uitvaardiger-collectieve actor van @nl
toolkit label: utgiver av (kollektiv agent) @no
toolkit label: väljaandja (kollektiiv) teoses @et
toolkit label: yayınlayan kollektif temsilcisi @tr
toolkit label: οργανισμός έκδοσης συλλογικός φορέας του @el
toolkit label: وكيل جماعي جهة إصدار @ar
toolkit label: ……的颁布集体行为者 @zh-hans
has subproperty: julkaisija (yhteisö) teokselle
has subproperty: julkaisija (suku) teokselle
has subproperty: P50697
lexical alias: issuingCollectiveAgentOf.en
status: Published
type: Property
domain: C10011
label: er udgivende kollektiv agent af @da
label: er utgiver av (kollektiv agent) @no
label: est un agent collectif émetteur de @fr
label: ir publicētājs (grupa) @lv
label: is issuing collective agent of @en
label: is uitvaardiger-collectieve actor van @nl
label: ist herausgebender gemeinschaftlicher Akteur von @de
label: kibocsátó kollektív ágense a következőnek: @hu
label: piyasaya çıkaran kolektif temsilcisidir @tr
label: väljaandja (kollektiiv) teoses @et
label: è ente emittente agente collettivo di @it
label: és agent col·lectiu d’entitat editora de @ca
label: είναι οργανισμός έκδοσης συλλογικός φορέας του @el
label: هو وكيل جماعي جهة إصدار لـ @ar
label: 是……的颁布集体行为者 @zh-hans
sub property of: julkaisija (toimija) teokselle
sub property of: yhteistoimijaan liittyvä teos
definition: Correla un agente collettivo a un'opera che implica una responsabilità di un agente collettivo per l'emissione di un'opera, come un organo ufficiale dell'ente. @it
definition: Hozzákapcsol egy kollektív ágenst egy műhöz, amelyhez hozzátartozik egy kollektív ágens felelőssége egy olyan mű kibocsátásáért, mint amilyen egy társaság hivatalos orgánuma. @hu
definition: Kollektif bir temsilciyi, kuruluşun resmi bir organı gibi, bir eseri yayınlama sorumluluğunu içeren bir eseri ilişkilendirir. @tr
definition: Liittää yhteistoimijan teokseen, jossa yhteistoimija on vastuussa (esim. virallisena toimielimenä) teoksen julkaisemisesta.
definition: Met un agent collectif en relation avec une œuvre qui comporte une responsabilité de la part d’un agent collectif consistant à publier une œuvre, tel un organe officiel de l’agent collectif. @fr
definition: Relaciona un agent col·lectiu amb una obra que implica una responsabilitat d’un agent col·lectiu en la publicació d’una obra, com ara un òrgan oficial de l’entitat. @ca
definition: Relateert een collectieve actor aan een werk dat met zich meebrengt een verantwoordelijkheid van een collectieve actor voor uitvaardigen van een werk, zoals een officieel orgaan van de instantie. @nl
definition: Relaterer en kollektiv agent til et verk som involverer et ansvar for en kollektiv agent i form av å utgi et verk. @no
definition: Relaterer en kollektiv agent til et værk, som involverer en kollektiv agents ansvar for at udgive et værk, som et officielt organ for en organisation. @da
definition: Relates a collective agent to a work that involves a responsibility of a collective agent for issuing a work, such as an official organ of the body. @en
definition: Sasaista grupu ar darbu, kas ietver grupas atbildību par darba publicēšanu, piemēram, iestādes biļetens. @lv
definition: Seostab kollektiivi teosega, mis sisaldab kollektiivi vastutust teose, nt asutuse ametliku häälekandja väljaandmise eest. @et
definition: Setzt einen gemeinschaftlichen Akteur in Beziehung zu einem Werk, bei dem ein gemeinschaftlicher Akteur für die Herausgabe eines Werks, zum Beispiel eines offiziellen Organs der Körperschaft, verantwortlich ist. @de
definition: يربط وكيلا جماعيا بعمل يترتب عليه مسئولية وكيل جماعي عن إصدار عمل، مثل جريدة رسمية لجهة. @ar
definition: 将一个集体行为者与涉及一个颁布一种作品（例如一个团体的机关刊物）的一个集体行为者的责任的一种作品关联起来。 @zh-hans

äänituottaja (yhteistoimija) teoksessa
has element type: 2
toolkit definition: A work that involves a responsibility of a collective agent for managing most of the business aspects of an audio recording. @en
toolkit definition: Bir ses kaydının ticari yönlerinin çoğunu yönetmek için kollektif bir temsilcinin sorumluluğunu içeren bir eser. @tr
toolkit definition: Darbs, kas ietver grupas atbildību par lielāko daļu skaņu ieraksta biznesa aspektiem. @lv
toolkit definition: Een werk dat met zich meebrengt een verantwoordelijkheid van een collectieve actor voor het merendeel van de zakelijke aspecten van de productie van een geluidsopname. @nl
toolkit definition: Egy mű, amelyhez hozzátartozik egy kollektív ágens felelőssége egy audiofelvétel legtöbb üzleti vonatkozásának menedzseléséért. @hu
toolkit definition: Ein Werk, bei dem ein gemeinschaftlicher Akteur für die meisten geschäftlichen Aspekte einer Audioaufnahme verantwortlich ist. @de
toolkit definition: Et verk som involverer et ansvar for en kollektiv agent i form av å håndtere de fleste forretningsmessige aspektene ved et lydopptak. @no
toolkit definition: Obra que implica una responsabilitat d’un agent col·lectiu en la gestió de la majoria dels aspectes comercials d’un enregistrament àudio. @ca
toolkit definition: Opera che implica una responsabilità di un agente collettivo nella gestione della maggior parte degli aspetti commerciali di una registrazione audio. @it
toolkit definition: Teos, jossa yhteistoimija on vastuussa useimpien äänitteen liiketoiminnallisten tehtävien hoitamisesta.
toolkit definition: Teos, mis sisaldab kollektiivi vastutust helisalvestuse enamiku äriliste aspektide korraldamise eest. @et
toolkit definition: Værk, som involverer en kollektiv agents ansvar for at håndtere de fleste forretningsmæssige aspekter af en lydoptagelse. @da
toolkit definition: Œuvre qui comporte une responsabilité de la part d’un agent collectif consistant à gérer la majeure partie des aspects commerciaux d’un enregistrement audio. @fr
toolkit definition: عمل يترتب عليه مسئولية وكيل جماعي عن إدارة معظم جوانب الأعمال التجارية للتسجيل الصوتي. @ar
toolkit definition: 涉及音频录制工作大多数方面之管理的一个集体行为者的责任的一种作品 @zh-hans
toolkit label: Gemeinschaftlicher Akteur als Produzent einer Tonaufnahme von @de
toolkit label: agent collectif producteur audio de @fr
toolkit label: agent col·lectiu productor d’àudio de @ca
toolkit label: audio producer collective agent of @en
toolkit label: audio-producer kollektív ágense: @hu
toolkit label: audioprodutsent (kollektiiv) teoses @et
toolkit label: geluidsproducent-collectieve actor van @nl
toolkit label: ir skaņu ierakstu producents (grupa) @lv
toolkit label: kollektiv agent, som er lydproducer af @da
toolkit label: lydprodusent for (kollektiv agent) @no
toolkit label: produttore audio agente collettivo di @it
toolkit label: ses yapımcısı kolektif temsilci @tr
toolkit label: äänituottaja (yhteistoimija) teoksessa
toolkit label: παραγωγός ήχου συλλογικός φορέας του @el
toolkit label: وكيل جماعي منتج مواد صوتية @ar
toolkit label: ……的音频制作者集体行为者 @zh-hans
has subproperty: äänituottaja (yhteisö) teoksessa
has subproperty: äänituottaja (suku) teoksessa
has subproperty: P50698
lexical alias: audioProducerCollectiveAgentOf.en
status: Published
type: Property
domain: C10011
label: audio-producer kollektív ágense a következőnek: @hu
label: audioprodutsent (kollektiiv) teoses @et
label: er kollektiv agent, som er lydproducer af @da
label: er lydprodusent for (kollektiv agent) @no
label: est un agent collectif producteur audio de @fr
label: ir skaņu ierakstu producents (grupa) @lv
label: is audio producer collective agent of @en
label: is geluidsproducent-collectieve actor van @nl
label: ist gemeinschaftlicher Akteur als Produzentin/Produzent einer Tonaufnahme von @de
label: ses yapımcısı kolektif temsilcisidir @tr
label: è produttore audio agente collettivo di @it
label: és agent col·lectiu productor d’àudio de @ca
label: είναι παραγωγός ήχου συλλογικός φορέας του @el
label: هو وكيل جماعي منتج مواد صوتية لـ @ar
label: 是……的音频制作者集体行为者 @zh-hans
sub property of: äänituottaja (toimija) teoksessa
sub property of: tuottaja (yhteistoimija) teoksessa
definition: Correla un agente collettivo a un'opera che implica una responsabilità di un agente collettivo nella gestione della maggior parte degli aspetti commerciali di una registrazione audio. @it
definition: Hozzákapcsol egy kollektív ágenst egy műhöz, amelyhez hozzátartozik egy kollektív ágens felelőssége egy audiofelvétel legtöbb üzleti vonatkozásának menedzseléséért. @hu
definition: Kolektif bir temsilciyi, bir ses kaydının ticari yönlerinin çoğunu yönetmek için kollektif bir temsilcinin sorumluluğunu içeren bir eserle ilişkilendirir. @tr
definition: Liittää yhteistoimijan teokseen, jossa yhteistoimija on vastuussa useimpien äänitteen liiketoiminnallisten tehtävien hoitamisesta.
definition: Met un agent collectif en relation avec une œuvre qui comporte une responsabilité de la part d’un agent collectif consistant à gérer la majeure partie des aspects commerciaux d’un enregistrement audio. @fr
definition: Relaciona un agent col·lectiu amb una obra que implica una responsabilitat d’un agent col·lectiu en la gestió de la majoria dels aspectes comercials d’un enregistrament àudio. @ca
definition: Relateert een collectieve actor aan een werk dat met zich meebrengt een verantwoordelijkheid van een collectieve actor voor het merendeel van de zakelijke aspecten van de productie van een geluidsopname. @nl
definition: Relaterer en kollektiv agent til et verk som involverer et ansvar for en kollektiv agent i form av å håndtere de fleste forretningsmessige aspektene ved et lydopptak. @no
definition: Relaterer en kollektiv agent til et værk, som involverer en kollektiv agents ansvar for at håndtere de fleste forretningsmæssige aspekter af en lydoptagelse. @da
definition: Relates a collective agent to a work that involves a responsibility of a collective agent for managing most of the business aspects of an audio recording. @en
definition: Sasaista grupu ar darbu, kas ietver grupas atbildību par lielāko daļu skaņu ieraksta biznesa aspektiem. @lv
definition: Seostab kollektiivi teosega, mis sisaldab kollektiivi vastutust helisalvestuse enamiku äriliste aspektide korraldamise eest. @et
definition: Setzt einen gemeinschaftlichen Akteur in Beziehung zu einem Werk, bei dem ein gemeinschaftlicher Akteur für die meisten geschäftlichen Aspekte einer Audioaufnahme verantwortlich ist. @de
definition: يربط وكيلا جماعيا بعمل يترتب عليه مسئولية وكيل جماعي عن إدارة معظم جوانب الأعمال التجارية للتسجيل الصوتي. @ar
definition: 将一个集体行为者与涉及音频录制工作大多数方面之管理的一个集体行为者的责任的一种作品关联起来。 @zh-hans

uudelleenmiksaaja (yhteistoimija) teoksessa
has element type: 2
toolkit definition: A work that involves a responsibility of a collective agent for manipulating, recombining, mixing, and reproducing previously recorded sounds. @en
toolkit definition: Darbs, kas ietver grupas atbildību par iepriekš ierakstītas skaņas manipulāciju, pārkombinēšanu, miksēšanu un atkārtotu atskaņošanu. @lv
toolkit definition: Een werk dat met zich meebrengt een verantwoordelijkheid van een collectieve actor voor manipuleren, opnieuw combineren, mixen en reproduceren van eerder opgenomen geluiden. @nl
toolkit definition: Egy mű, amelyhez hozzátartozik egy kollektív ágens felelőssége korábbi hangfelvételek manipulálásáért, újrakombinálásáért, keveréséért és reprodukálásáért. @hu
toolkit definition: Ein Werk, bei dem ein gemeinschaftlicher Akteur für das Bearbeiten, Rekombinieren, Mischen und Reproduzieren einer bestehenden Tonaufnahme verantwortlich ist. @de
toolkit definition: Et verk som involverer et ansvar for en kollektiv agent i form av å manipulere, sette sammen og reprodusere lyd som er spilt inn tidligere. @no
toolkit definition: Obra que implica una responsabilitat d’un agent col·lectiu en la manipulació, la recombinació, la mescla i la reproducció de sons enregistrats prèviament. @ca
toolkit definition: Opera che implica una responsabilità di un agente collettivo nella manipolazione, ricombinazione, missaggio e riproduzione di suoni precedentemente registrati. @it
toolkit definition: Teos, jossa yhteistoimija on vastuussa ääniteoksen luomisesta manipuloimalla, yhdistelemällä, sekoittamalla ja uudelleen tuottamalla aiemmin äänitettyjä ääniä.
toolkit definition: Teos, mis sisaldab kollektiivi vastutust varem salvestatud helide manipuleerimise, ümberkombineerimise, segamise ja taastekitamise eest. @et
toolkit definition: Værk, som involverer en kollektiv agents ansvar for manipulering, rekombinering, mixing og gengivelse af tidligere indspillede lyde. @da
toolkit definition: Önceden kaydedilmiş sesleri düzenleme, yeniden birleştirme, miksleme ve yeniden üretmek için kolektif bir temsilcinin sorumluluğunu içeren bir eser. @tr
toolkit definition: Œuvre qui comporte une responsabilité de la part d’un agent collectif consistant à manipuler, à recombiner, à mixer et à reproduire des sons préalablement enregistrés. @fr
toolkit definition: عمل يترتب عليه مسئولية وكيل جماعي عن معالجة المواد السمعية المسجلة مسبقًا وإعادة تجميعها ومزجها واستنساخها. @ar
toolkit definition: 涉及操纵、重新组合、混合和复制事先录制的声音的一个集体行为者的责任的一种作品 @zh-hans
toolkit label: Gemeinschaftlicher Akteur als Remix Artist von @de
toolkit label: agent collectif remixeur de @fr
toolkit label: agent col·lectiu artista de remescla de @ca
toolkit label: artista di remix agente collettivo di @it
toolkit label: ir remiksa mākslinieks (grupa) @lv
toolkit label: kollektiv agent, som er remixer af @da
toolkit label: remiks sanatçısı kolektif temsilci @tr
toolkit label: remikser av (kollektiv agent) @no
toolkit label: remiksija (kollektiiv) teoses @et
toolkit label: remix artist collective agent of @en
toolkit label: remix καλλιτέχνης συλλογικός φορέας του @el
toolkit label: remixartiest-collectieve actor van @nl
toolkit label: remixművész kollektív ágense: @hu
toolkit label: uudelleenmiksaaja (yhteistoimija) teoksessa
toolkit label: وكيل جماعي فنان ريميكس @ar
toolkit label: ……的合成艺术家集体行为者 @zh-hans
has subproperty: uudelleenmiksaaja (yhteisö) teoksessa
has subproperty: uudelleenmiksaaja (suku) teoksessa
has subproperty: P50699
lexical alias: remixArtistCollectiveAgentOf.en
status: Published
type: Property
domain: C10011
label: er kollektiv agent, som er remixer af @da
label: er remikser av (kollektiv agent) @no
label: est un agent collectif remixeur de @fr
label: ir remiksa mākslinieks (grupa) @lv
label: is remix artist collective agent of @en
label: is remixartiest-collectieve actor van @nl
label: ist gemeinschaftlicher Akteur als Remix Artist von @de
label: remiksija (kollektiiv) teoses @et
label: remix sanatçısı kolektif temsilcisidir @tr
label: remixművész kollektív ágense a következőnek: @hu
label: è artista di remix agente collettivo di @it
label: és agent col·lectiu artista de remescla de @ca
label: είναι remix καλλιτέχνης συλλογικός φορέας του @el
label: هو وكيل جماعي فنان ريميكس لـ @ar
label: 是……的合成艺术家集体行为者 @zh-hans
sub property of: uudelleenmiksaaja (toimija) teoksessa
sub property of: teoksen tekijä (yhteistoimija) teoksessa
definition: Correla un agente collettivo a un'opera che implica una responsabilità di un agente collettivo nella manipolazione, ricombinazione, missaggio e riproduzione di suoni precedentemente registrati. @it
definition: Hozzákapcsol egy kollektív ágenst egy műhöz, amelyhez hozzátartozik egy kollektív ágens felelőssége korábbi hangfelvételek manipulálásáért, újrakombinálásáért, keveréséért és reprodukálásáért. @hu
definition: Kolektif bir temsilciyi, ses kayıtlarının iş durumunu, yeniden birleştirmek, karıştırmak ve yeniden üretmek için kolektif bir temsilcinin sorumluluğunu içeren bir eserle ilişkilendirir. @tr
definition: Liittää yhteistoimijan teokseen, jossa yhteistoimija on vastuussa ääniteoksen luomisesta manipuloimalla, yhdistelemällä, sekoittamalla ja uudelleen tuottamalla aiemmin äänitettyjä ääniä.
definition: Met un agent collectif en relation avec une œuvre qui comporte une responsabilité de la part d’un agent collectif consistant à manipuler, à recombiner, à mixer et à reproduire des sons préalablement enregistrés. @fr
definition: Relaciona un agent col·lectiu amb una obra que implica una responsabilitat d’un agent col·lectiu en la manipulació, la recombinació, la mescla i la reproducció de sons enregistrats prèviament. @ca
definition: Relateert een collectieve actor aan een werk dat met zich meebrengt een verantwoordelijkheid van een collectieve actor voor manipuleren, opnieuw combineren, mixen en reproduceren van eerder opgenomen geluiden. @nl
definition: Relaterer en kollektiv agent til et verk som involverer et ansvar for en kollektiv agent i form av å manipulere, sette sammen og reprodusere lyd som er spilt inn tidligere. @no
definition: Relaterer en kollektiv agent til et værk, som involverer en kollektiv agents ansvar for manipulering, rekombinering, mixing og gengivelse af tidligere indspillede lyde. @da
definition: Relates a collective agent to a work that involves a responsibility of a collective agent for manipulating, recombining, mixing, and reproducing previously recorded sounds. @en
definition: Sasaista grupu ar darbu, kas ietver grupas atbildību par iepriekš ierakstītas skaņas manipulāciju, pārkombinēšanu, miksēšanu un atkārtotu atskaņošanu. @lv
definition: Seostab kollektiivi teosega, mis sisaldab kollektiivi vastutust varem salvestatud helide manipuleerimise, ümberkombineerimise, segamise ja taastekitamise eest. @et
definition: Setzt einen gemeinschaftlichen Akteur in Beziehung zu einem Werk, bei dem ein gemeinschaftlicher Akteur für das Bearbeiten, Rekombinieren, Mischen und Reproduzieren einer bestehenden Tonaufnahme verantwortlich ist. @de
definition: يربط وكيلا جماعيا بعمل يترتب عليه مسئولية وكيل جماعي عن معالجة المواد السمعية المسجلة مسبقًا وإعادة تجميعها ومزجها واستنساخها. @ar
definition: 将一个集体行为者与涉及操纵、重新组合、混合和复制事先录制的声音的一个集体行为者的责任的一种作品关联起来。 @zh-hans
scope note: Darunter fallen keine Nachbearbeitungen, die weder Art noch Inhalt des Originalwerks wesentlich verändern, sowie das Zusammenmischen von aufgenommenen Einzelspuren (Kanälen) zu einem scheinbar ununterbrochen durchgehenden Klangerlebnis. @de
scope note: Ei hõlma remiksimist, mis ei muuda oluliselt originaalteose olemust ja sisu, ega salvestatud heliradade kokkupanekut üheks helirajaks. @et
scope note: Ei kata uudelleenmiksaamista, joka ei oleellisesti muuta alkuperäisen teoksen luonnetta ja sisältöä eikä aiemmin äänitettyjen musiikkikappaleiden yhdistämistä yhdeksi musiikkikappaleeksi.
scope note: Neietver remiksēšanas darbības, kas būtiski nemaina oriģinālā darba būtību un saturu, kā arī ierakstu celiņu apvienošanu vienā ieraksta celiņā. @lv
scope note: Nem tartoznak ide sem azok a remixelési tevékenységek, amelyek nem változtatják meg lényegesen az eredeti mű jellegét és tartalmát, sem a rögzített sávok látszólag egy folyamatos sávként való összemixelése. @hu
scope note: Orijinal çalışmanın niteliğini ve içeriğini önemli ölçüde değiştirmeyen remiks faaliyetleri ve kaydedilen parçaları kesintisiz tek bir parça olarak görünecek şekilde karıştırılması hariçtir. @tr
scope note: Remiksaktiviteter som ikke i betydelig grad endrer originalverkets særpreg og innhold, og miksing av innspilte spor slik at resultatet høres ut som ett sammenhengende spor, er ikke inkludert. @no
scope note: Remixhandelingen die de aard en content van de oorspronkelijke resource niet substantieel wijzigen, resulterend in een nieuwe resource, en mixen en samenstellen van meerdere sporen van een opname zijn uitgesloten. @nl

roolittaja (yhteistoimija) teoksessa
has element type: 2
toolkit definition: A work that involves a responsibility of a collective agent for most aspects of assigning roles and duties to performers. @en
toolkit definition: Darbs, kas ietver grupas atbildību par lomu sadali un pienākumu piešķiršanu izpildītājiem. @lv
toolkit definition: Een werk dat met zich meebrengt een verantwoordelijkheid van een collectieve actor voor de meeste aspecten van het toewijzen van rollen en taken aan uitvoerders. @nl
toolkit definition: Egy mű, amelyhez hozzátartozik egy kollektív ágens felelőssége a szerepek és feladatok előadókra osztásának legtöbb vonatkozásáért. @hu
toolkit definition: Ein Werk, bei dem ein gemeinschaftlicher Akteur für die meisten Aspekte der Rollenvergabe und Aufgabenzuteilung an Ausführende verantwortlich ist. @de
toolkit definition: Et verk som involverer et ansvar for en kollektiv agent i form av de fleste aspektene ved å fordele roller og oppgaver mellom utøvere. @no
toolkit definition: Obra que implica una responsabilitat d’un agent col·lectiu en la majoria dels aspectes de l’assignació de papers i funcions als intèrprets. @ca
toolkit definition: Opera che implica una responsabilità di un agente collettivo nella maggior parte degli aspetti dell'assegnazione di ruoli e incarichi agli attori. @it
toolkit definition: Sanatçılara roller ve görevler atamanın çoğu yönü için kollektif bir temsilcinin sorumluluğunu içeren bir eser. @tr
toolkit definition: Teos, jossa yhteistoimija on vastuussa useimmista esiintyjien roolien ja tehtävien antamiseen kuuluvista tehtävistä.
toolkit definition: Teos, mis sisaldab kollektiivi vastutust esitajatele rollide ja ülesannete jagamise enamiku aspektide eest. @et
toolkit definition: Værk, som involverer en kollektiv agents ansvar for de fleste aspekter ved tildeling af roller og opgaver til udøvere. @da
toolkit definition: Œuvre qui comporte une responsabilité de la part d’un agent collectif en ce qui concerne la majeure partie des aspects relatifs à la distribution des rôles et des fonctions aux interprètes. @fr
toolkit definition: عمل يترتب عليه مسئولية وكيل جماعي عن تحديد معظم الجوانب المتعلقة بأدوار الممثلين ومهامهم. @ar
toolkit definition: 涉及给演员分配角色和任务的大多数工作的一个集体行为者的责任的一种作品 @zh-hans
toolkit label: Gemeinschaftlicher Akteur als Casting Director von @de
toolkit label: agent collectif directeur de casting de @fr
toolkit label: agent col·lectiu director de càsting de @ca
toolkit label: casting director collective agent of @en
toolkit label: casting director for (kollektiv agent) @no
toolkit label: casting'u juht (kollektiiv) teoses @et
toolkit label: castingdirector-collectieve actor van @nl
toolkit label: direttore del casting agente collettivo di @it
toolkit label: ir aktieru atlases režisors (grupa) @lv
toolkit label: kast yönetmeni kolektif temsilcisi @tr
toolkit label: kollektiv agent, som er caster af @da
toolkit label: roolittaja (yhteistoimija) teoksessa
toolkit label: szereposztó rendező kollektív ágense: @hu
toolkit label: διευθυντής διανομής ρόλων συλλογικός φορέας του @el
toolkit label: وكيل جماعي مدير طاقم التمثيل @ar
toolkit label: ……的角色导演集体行为者 @zh-hans
has subproperty: roolittaja (yhteisö) teoksessa
has subproperty: roolittaja (suku) teoksessa
has subproperty: P50700
lexical alias: castingDirectorCollectiveAgentOf.en
status: Published
type: Property
domain: C10011
label: cast yönetmeni kolektif temsilcisidir @tr
label: casting'u juht (kollektiiv) teoses @et
label: er casting director for (kollektiv agent) @no
label: er kollektiv agent, som er caster af @da
label: est un agent collectif directeur de casting de @fr
label: ir aktieru atlases režisors (grupa) @lv
label: is casting director collective agent of @en
label: is castingdirector-collectieve actor van @nl
label: ist gemeinschaftlicher Akteur als Casting Director von @de
label: szereposztó rendező kollektív ágense a következőnek: @hu
label: è direttore del casting agente collettivo di @it
label: és agent col·lectiu director de càsting de @ca
label: είναι διευθυντής διανομής ρόλων συλλογικός φορέας του @el
label: هو وكيل جماعي مدير طاقم التمثيل لـ @ar
label: 是……的角色导演集体行为者 @zh-hans
sub property of: roolittaja (toimija) teoksessa
sub property of: teoksen tekijä (yhteistoimija) teoksessa
definition: Correla un agente collettivo a un'opera che implica una responsabilità di un agente collettivo nella maggior parte degli aspetti dell'assegnazione di ruoli e incarichi agli attori. @it
definition: Hozzákapcsol egy kollektív ágenst egy műhöz, amelyhez hozzátartozik egy kollektív ágens felelőssége a szerepek és feladatok előadókra osztásának legtöbb vonatkozásáért. @hu
definition: Kollektif bir temsilciyi, oyunculara roller ve görevler atamanın çoğu durum için kolektif bir temsilcinin sorumluluğunu içeren bir eseri ilişkilendirir. @tr
definition: Liittää yhteistoimijan teokseen, jossa yhteistoimija on vastuussa useimmista esiintyjien roolien ja tehtävien antamiseen kuuluvista tehtävistä.
definition: Met un agent collectif en relation avec une œuvre qui comporte une responsabilité de la part d’un agent collectif en ce qui concerne la majeure partie des aspects relatifs à la distribution des rôles et des fonctions aux interprètes. @fr
definition: Relaciona un agent amb una obra que implica una responsabilitat d’un agent col·lectiu en la majoria dels aspectes de l’assignació de papers i funcions als intèrprets. @ca
definition: Relateert een collectieve actor aan een werk dat met zich meebrengt een verantwoordelijkheid van een collectieve actor voor de meeste aspecten van het toewijzen van rollen en taken aan uitvoerders. @nl
definition: Relaterer en kollektiv agent til et verk som involverer et ansvar for en kollektiv agent i form av de fleste aspektene ved å fordele roller og oppgaver mellom utøvere. @no
definition: Relaterer en kollektiv agent til et værk, som involverer en kollektiv agents ansvar for de fleste aspekter ved tildeling af roller og opgaver til udøvere. @da
definition: Relates a collective agent to a work that involves a responsibility of a collective agent for most aspects of assigning roles and duties to performers. @en
definition: Sasaista grupu ar darbu, kas ietver grupas atbildību par lomu sadali un pienākumu piešķiršanu izpildītājiem. @lv
definition: Seostab kollektiivi teosega, mis sisaldab kollektiivi vastutust esitajatele rollide ja ülesannete jagamise enamiku aspektide eest. @et
definition: Setzt einen gemeinschaftlichen Akteur in Beziehung zu einem Werk, bei dem ein gemeinschaftlicher Akteur für die meisten Aspekte der Rollenvergabe und Aufgabenzuteilung an Ausführende verantwortlich ist. @de
definition: يربط وكيلا جماعيا بعمل يترتب عليه مسئولية وكيل جماعي عن تحديد معظم الجوانب المتعلقة بأدوار الممثلين ومهامهم. @ar
definition: 将一个集体行为者与涉及给演员分配角色和任务的大多数工作的一个集体行为者的责任的一种作品关联起来。 @zh-hans

tuottaja (yhteistoimija) teoksessa
has element type: 2
toolkit definition: A work that involves a responsibility of a collective agent for most of the business aspects of a production for screen, sound recording, television, webcast, etc. @en
toolkit definition: Darbs, kas ietver grupas atbildību par filmas, mūzikas ierakstu, televīzijas, tīmekļa pārraižu u.tml. biznesa aspektiem. @lv
toolkit definition: Een werk dat met zich meebrengt een verantwoordelijkheid van een collectieve actor voor het merendeel van de zakelijke aspecten van een productie voor scherm, geluidsopname, televisie, webcast etc. @nl
toolkit definition: Egy mű, amelyhez hozzátartozik egy kollektív ágens felelőssége képernyőre kerülő műsor, hangfelvétel, televíziós, webes közvetítés, stb. legtöbb üzleti vonatkozásáért. @hu
toolkit definition: Ein Werk, bei dem ein gemeinschaftlicher Akteur für die meisten geschäftlichen Aspekte einer Produktion für die Leinwand, für eine Tonaufnahme, für das Fernsehen, für einen Webcast und so weiter verantwortlich ist. @de
toolkit definition: Ekran, ses kaydı, televizyon, web yayını vb. için bir prodüksiyonun ticari yönlerinin çoğu için kollektif bir temsilcinin sorumluluğunu içeren bir eser. @tr
toolkit definition: Et verk som involverer et ansvar for en kollektiv agent i form av de fleste forretningsmessige aspektene ved en produksjon for film eller fjensyn, lydinnspilling, webkast etc. @no
toolkit definition: Obra que implica una responsabilitat d’un agent col·lectiu en la majoria dels aspectes comercials d’una producció d’una pel·lícula, d’un enregistrament sonor, d’un programa de televisió, d’una emissió web, etc. @ca
toolkit definition: Opera che implica una responsabilità di un agente collettivo per la maggior parte degli aspetti commerciali di una produzione per la proiezione, registrazione del suono, televisione, trasmissione via web, etc. @it
toolkit definition: Teos, jossa yhteistoimija on vastuussa suurimmasta osasta elokuva-, äänite-, televisio-, suoratoisto- tms. tuotannon liiketoiminnallisista tehtävistä.
toolkit definition: Teos, mis sisaldab kollektiivi vastutust enamiku äriliste aspektide eest filmide, helisalvestiste, telesaadete, veebiülekannete jms tootmisel. @et
toolkit definition: Værk, som involverer en kollektiv agents ansvar for størstedelen af de forretningsmæssige aspekter ved en produktion beregnet til lærred, lydoptagelse, tv, webcast etc. @da
toolkit definition: Œuvre qui comporte une responsabilité de la part d’un agent collectif en ce qui concerne la majeure partie des aspects commerciaux de la production d’un film, d’un enregistrement audio, d’une émission de télévision, d’une webémission, etc. @fr
toolkit definition: عمل يترتب عليه مسئولية وكيل جماعي عن معظم جوانب العمل أُعد لمسرح، أو لشاشة عرض، أو لتسجيل صوتي، أو لتلفزيون، أو لبث عبر الإنترنت، إلخ. @ar
toolkit definition: 涉及对银幕、录音、电视、网络直播等制作的大部分商业运作的一个集体行为者的责任的一种作品 @zh-hans
toolkit label: Gemeinschaftlicher Akteur als Produzentin/Produzent von @de
toolkit label: agent collectif producteur de @fr
toolkit label: agent col·lectiu productor de @ca
toolkit label: ir producents (grupa) @lv
toolkit label: kollektiv agent, som er producer af @da
toolkit label: producent-collectieve actor van @nl
toolkit label: producer collective agent of @en
toolkit label: producer kollektív ágense: @hu
toolkit label: produsent av (kollektiv agent) @no
toolkit label: produtsent (kollektiiv) teoses @et
toolkit label: produttore agente collettivo di @it
toolkit label: tuottaja (yhteistoimija) teoksessa
toolkit label: yapımcı kolektif temsilcisi @tr
toolkit label: παραγωγός συλλογικός φορέας του @el
toolkit label: وكيل جماعي منتج @ar
toolkit label: ……的制作者集体行为者 @zh-hans
has subproperty: äänituottaja (yhteistoimija) teoksessa
has subproperty: elokuvatuottaja (yhteistoimija) teoksessa
has subproperty: radiotuottaja (yhteistoimija) teoksessa
has subproperty: televisiotuottaja (yhteistoimija) teoksessa
has subproperty: tuottaja (yhteisö) teoksessa
has subproperty: tuottaja (suku) teoksessa
has subproperty: P50701
lexical alias: producerCollectiveAgentOf.en
status: Published
type: Property
domain: C10011
label: er kollektiv agent, som er producer af @da
label: er produsent av (kollektiv agent) @no
label: est un agent collectif producteur de @fr
label: ir producents (grupa) @lv
label: is producent-collectieve actor van @nl
label: is producer collective agent of @en
label: ist gemeinschaftlicher Akteur als Produzentin/Produzent von @de
label: producer kollektív ágense a következőnek: @hu
label: produtsent (kollektiiv) teoses @et
label: yapımcı kolektif temsilcisidir @tr
label: è produttore agente collettivo di @it
label: és agent col·lectiu productor de @ca
label: είναι παραγωγός συλλογικός φορέας του @el
label: هو وكيل جماعي منتج لـ @ar
label: 是……的制作者集体行为者 @zh-hans
sub property of: tuottaja (toimija) teoksessa
sub property of: teoksen tekijä (yhteistoimija) teoksessa
definition: Correla un agente collettivo a un'opera che implica una responsabilità di un agente collettivo per la maggior parte degli aspetti commerciali di una produzione per la proiezione, registrazione del suono, televisione, trasmissione via web, etc. @it
definition: Hozzákapcsol egy kollektív ágenst egy műhöz, amelyhez hozzátartozik egy kollektív ágens felelőssége képernyőre kerülő műsor, hangfelvétel, televíziós, webes közvetítés, stb. legtöbb üzleti vonatkozásáért. @hu
definition: Kolektif bir temsilciyi, ekran, ses kaydı, televizyon, web yayını vb. için bir prodüksiyonun ticari durumun çoğu için kolektif bir temsilcinin sorumluluğunu içeren bir eserle ilişkilendirir. @tr
definition: Liittää yhteistoimijan teokseen, jossa yhteistoimija on vastuussa suurimmasta osasta elokuva-, äänite-, televisio-, suoratoisto- tms. tuotannon liiketoiminnallisista tehtävistä.
definition: Met un agent collectif en relation avec une œuvre qui comporte une responsabilité de la part d’un agent collectif en ce qui concerne la majeure partie des aspects commerciaux de la production d’un film, d’un enregistrement audio, d’une émission de télévision, d’une webémission, etc. @fr
definition: Relaciona un agent col·lectiu amb una obra que implica una responsabilitat d’un agent col·lectiu en la majoria dels aspectes comercials d’una producció d’una pel·lícula, d’un enregistrament sonor, d’un programa de televisió, d’una emissió web, etc. @ca
definition: Relateert een collectieve actor aan een werk dat met zich meebrengt een verantwoordelijkheid van een collectieve actor voor het merendeel van de zakelijke aspecten van een productie voor scherm, geluidsopname, televisie, webcast etc. @nl
definition: Relaterer en kollektiv agent til et verk som involverer et ansvar for en kollektiv agent i form av de fleste forretningsmessige aspektene ved en produksjon for film eller fjensyn, lydinnspilling, webkast etc. @no
definition: Relaterer en kollektiv agent til et værk, som involverer en kollektiv agents ansvar for størstedelen af de forretningsmæssige aspekter ved en produktion beregnet til lærred, lydoptagelse, tv, webcast etc. @da
definition: Relates a collective agent to a work that involves a responsibility of a collective agent for most of the business aspects of a production for screen, sound recording, television, webcast, etc. @en
definition: Sasaista grupu ar darbu, kas ietver grupas atbildību par filmas, mūzikas ierakstu, televīzijas, tīmekļa pārraižu u.tml. biznesa aspektiem. @lv
definition: Seostab kollektiivi teosega, mis sisaldab kollektiivi vastutust enamiku äriliste aspektide eest filmide, helisalvestiste, telesaadete, veebiülekannete jms tootmisel. @et
definition: Setzt einen gemeinschaftlichen Akteur in Beziehung zu einem Werk, bei dem ein gemeinschaftlicher Akteur für die meisten geschäftlichen Aspekte einer Produktion für die Leinwand, für eine Tonaufnahme, für das Fernsehen, für einen Webcast und so weiter verantwortlich ist. @de
definition: يربط وكيلا جماعيا بعمل يترتب عليه مسئولية وكيل جماعي عن معظم جوانب العمل في أُعد لمسرح، أو لشاشة عرض، أو لتسجيل صوتي، أو لتلفزيون، أو لبث عبر الإنترنت، إلخ. @ar
definition: 将一个集体行为者与涉及对银幕、录音、电视、网络直播等制作的大部分商业运作的一个集体行为者的责任的一种作品关联起来。 @zh-hans
scope note: A producer is generally responsible for fundraising, managing the production, hiring key personnel, arranging for distributors, etc. @en
scope note: Bir yapımcı genellikle kaynak yaratma, üretimi yönetme, kilit personel işe alma, dağıtımcıları ayarlama vb. işlerden sorumludur. @tr
scope note: Een producer is over het algemeen verantwoordelijk voor fondsenwerving, het beheer van de productie, inhuren van belangrijkste personeel, regelen van distributoren etc. @nl
scope note: Egy producer általában felelős az adománygyűjtésért, a produkció irányításáért, a kulcsfontosságú személyzet felvételéért, a forgalmazók megszervezéséért stb. @hu

elokuvatuottaja (yhteistoimija) teoksessa
has element type: 2
toolkit definition: A work that involves a responsibility of a collective agent for most of the business aspects of the production of a film. @en
toolkit definition: Bir filmin yapımının ticari yönlerinin çoğu için kollektif bir temsilcinin sorumluluğunu içeren bir eser. @tr
toolkit definition: Darbs, kas ietver grupas atbildību par filmas uzņemšanas finansiālajiem aspektiem. @lv
toolkit definition: Een werk dat met zich meebrengt een verantwoordelijkheid van een collectieve actor voor het merendeel van de zakelijke aspecten van de productie van een film. @nl
toolkit definition: Egy mű, amelyhez hozzátartozik egy kollektív ágens felelőssége egy filmprodukció legtöbb üzleti vonatkozásáért. @hu
toolkit definition: Ein Werk, bei dem ein gemeinschaftlicher Akteur für die meisten geschäftlichen Aspekte bei der Produktion eines Films verantwortlich ist. @de
toolkit definition: Et verk som involverer et ansvar for en kollektiv agent i form av de fleste forretningsmessige aspektene ved produksjon av en film. @no
toolkit definition: Obra que implica una responsabilitat d’un agent col·lectiu en la majoria dels aspectes comercials de la producció d’una pel·lícula. @ca
toolkit definition: Opera che implica una responsabilità di un agente collettivo per la maggior parte degli aspetti commerciali della produzione di un film. @it
toolkit definition: Teos, jossa yhteistoimija on vastuussa suurimmasta osasta elokuvan liiketoimintaa.
toolkit definition: Teos, mis sisaldab kollektiivi vastutust enamiku äriliste aspektide eest filmi tootmisel. @et
toolkit definition: Værk, som involverer en kollektiv agents ansvar for størstedelen af de forretningsmæssige aspekter ved en film. @da
toolkit definition: Œuvre qui comporte une responsabilité de la part d’un agent collectif en ce qui concerne la majeure partie des aspects commerciaux de la production d’un film. @fr
toolkit definition: عمل يترتب عليه مسئولية وكيل جماعي عن معظم الجوانب التجارية لإنتاج فيلم. @ar
toolkit definition: 涉及电影制作的大部分商业运作的一个集体行为者的责任的一种作品 @zh-hans
toolkit label: Gemeinschaftlicher Akteur als Filmproduzentin/Filmproduzent von @de
toolkit label: agent collectif producteur de cinéma de @fr
toolkit label: agent col·lectiu productor cinematogràfic de @ca
toolkit label: elokuvatuottaja (yhteistoimija) teoksessa
toolkit label: film producer collective agent of @en
toolkit label: film yapımcısı kolektif temsilcisi @tr
toolkit label: filmiprodutsent (kollektiiv) teoses @et
toolkit label: filmproducent-collectieve actor van @nl
toolkit label: filmproducer kollektív ágense: @hu
toolkit label: filmprodusent for (kollektiv agent) @no
toolkit label: ir filmas producents (grupa) @lv
toolkit label: kollektiv agent, som er filmproducer af @da
toolkit label: produttore cinematografico agente collettivo di @it
toolkit label: παραγωγός ταινίας συλλογικός φορέας του @el
toolkit label: وكيل جماعي منتج لفيلم لـ @ar
toolkit label: ……的电影制作人集体行为者 @zh-hans
has subproperty: elokuvatuottaja (yhteisö) teoksessa
has subproperty: elokuvatuottaja (suku) teoksessa
has subproperty: P50702
lexical alias: filmProducerCollectiveAgentOf.en
status: Published
type: Property
domain: C10011
label: er filmprodusent for (kollektiv agent) @no
label: er kollektiv agent, som er filmproducer af @da
label: est un agent collectif producteur de cinéma de @fr
label: film yapımcısı kolektif temsilcisidir @tr
label: filmiprodutsent (kollektiiv) teoses @et
label: filmproducer kollektív ágense a következőnek: @hu
label: ir filmas producents (grupa) @lv
label: is film producer collective agent of @en
label: is filmproducent-collectieve actor van @nl
label: ist gemeinschaftlicher Akteur als Filmproduzentin/Filmproduzent von @de
label: è produttore cinematografico agente collettivo di @it
label: és agent col·lectiu productor cinematogràfic de @ca
label: είναι παραγωγός ταινίας συλλογικός φορέας του @el
label: هو وكيل جماعي منتج فيلم لـ @ar
label: 是……的电影制作人集体行为者 @zh-hans
sub property of: elokuvatuottaja (toimija) teoksessa
sub property of: tuottaja (yhteistoimija) teoksessa
alternative label: agent collectif producteur de film de @fr
definition: Correla un agente collettivo a un'opera che implica una responsabilità di un agente collettivoper la maggior parte degli aspetti commerciali della produzione di un film. @it
definition: Hozzákapcsol egy kollektív ágenst egy műhöz, amelyhez hozzátartozik egy kollektív ágens felelőssége egy filmprodukció legtöbb üzleti vonatkozásáért. @hu
definition: Kolektif bir temsilciyi, bir filmin yapımının ticari yönlerinin çoğu için kolektif bir temsilcinin sorumluluğunu içeren bir eserle ilişkilendirir. @tr
definition: Liittää yhteistoimijan teokseen, jossa yhteistoimija on vastuussa suurimmasta osasta elokuvan liiketoimintaa.
definition: Met un agent collectif en relation avec une œuvre qui comporte une responsabilité de la part d’un agent collectif en ce qui concerne la majeure partie des aspects commerciaux de la production d’un film. @fr
definition: Relaciona un agent col·lectiu amb una obra que implica una responsabilitat d’un agent col·lectiu en la majoria dels aspectes comercials de la producció d’una pel·lícula. @ca
definition: Relateert een collectieve actor aan een werk dat met zich meebrengt een verantwoordelijkheid van een collectieve actor voor het merendeel van de zakelijke aspecten van de productie van een film. @nl
definition: Relaterer en kollektiv agent til et verk som involverer et ansvar for en kollektiv agent i form av de fleste forretningsmessige aspektene ved produksjon av en film. @no
definition: Relaterer en kollektiv agent til et værk, som involverer en kollektiv agents ansvar for størstedelen af de forretningsmæssige aspekter ved en film. @da
definition: Relates a collective agent to a work that involves a responsibility of a collective agent for most of the business aspects of the production of a film. @en
definition: Sasaista grupu ar darbu, kas ietver grupas atbildību par filmas uzņemšanas finansiālajiem aspektiem. @lv
definition: Seostab kollektiivi teosega, mis sisaldab kollektiivi vastutust enamiku äriliste aspektide eest filmi tootmisel. @et
definition: Setzt einen gemeinschaftlichen Akteur in Beziehung zu einem Werk, bei dem ein gemeinschaftlicher Akteur für die meisten geschäftlichen Aspekte bei der Produktion eines Films verantwortlich ist. @de
definition: يربط وكيلا جماعيا بعمل يترتب عليه مسئولية وكيل جماعي عن معظم الجوانب التجارية لإنتاج فيلم. @ar
definition: 将一个集体行为者与涉及电影制作的大部分商业运作的一个集体行为者的责任的一种作品关联起来。 @zh-hans

radiotuottaja (yhteistoimija) teoksessa
has element type: 2
toolkit definition: A work that involves a responsibility of a collective agent for most of the business aspects of the production of a radio program. @en
toolkit definition: Bir radyo programının yapımının ticari yönlerinin çoğu için kollektif bir temsilcinin sorumluluğunu içeren bir eser. @tr
toolkit definition: Darbs, kas ietver grupas atbildību par radio raidījuma darbības/biznesa aspektiem. @lv
toolkit definition: Een werk dat met zich meebrengt een verantwoordelijkheid van een collectieve actor voor het merendeel van de zakelijke aspecten van het produceren van een radioprogramma. @nl
toolkit definition: Egy mű, amelyhez hozzátartozik egy kollektív ágens felelőssége egy rádióműsor legtöbb üzleti vonatkozásáért. @hu
toolkit definition: Ein Werk, bei dem ein gemeinschaftlicher Akteur für die meisten geschäftlichen Aspekte einer Hörfunksendung verantwortlich ist. @de
toolkit definition: Et verk som involverer et ansvar for en kollektiv agent i form av de fleste forretningsmessige aspektene ved produksjon av et radioprogram. @no
toolkit definition: Obra que implica una responsabilitat d’un agent col·lectiu en la majoria dels aspectes comercials de la producció d’un programa radiofònic. @ca
toolkit definition: Opera che implica una responsabilità di un agente collettivo per la maggior parte degli aspetti commerciali della produzione di un programma radiofonico. @it
toolkit definition: Teos, jossa yhteistoimija on vastuussa suurimmasta osasta radio-ohjelman liiketoimintaa.
toolkit definition: Teos, mis sisaldab kollektiivi vastutust enamiku äriliste aspektide eest raadiosaate tootmisel. @et
toolkit definition: Værk, som involverer en kollektiv agents ansvar for størstedelen af de forretningsmæssige aspekter ved et radioprogram. @da
toolkit definition: Œuvre qui comporte une responsabilité de la part d’un agent collectif en ce qui concerne la majeure partie des aspects commerciaux de la production d’une émission de radio. @fr
toolkit definition: عمل يترتب عليه مسئولية وكيل جماعي عن معظم الجوانب التجارية لإنتاج برنامج إذاعي. @ar
toolkit definition: 涉及广播节目制作的大部分商业运作的一个集体行为者的责任的一种作品 @zh-hans
toolkit label: Gemeinschaftlicher Akteur als Hörfunkproduzentin/Hörfunkproduzent von @de
toolkit label: agent collectif producteur de radio de @fr
toolkit label: agent col·lectiu productor radiofònic de @ca
toolkit label: ir radio raidījuma producents (grupa) @lv
toolkit label: kollektiv agent, som er radioproducer af @da
toolkit label: produttore radiofonico agente collettivo di @it
toolkit label: raadioprodutsent (kollektiiv) teoses @et
toolkit label: radio producer collective agent of @en
toolkit label: radioproducent-collectieve actor van @nl
toolkit label: radioprodusent for (kollektiv agent) @no
toolkit label: radiotuottaja (yhteistoimija) teoksessa
toolkit label: radyo yapımcısı kolektif temsilcisi @tr
toolkit label: rádióproducer kollektív ágense: @hu
toolkit label: ραδιοφωνικός παραγωγός συλλογικός φορέας του @el
toolkit label: وكيل جماعي منتج إذاعي لـ @ar
toolkit label: ……的广播制作人集体行为者 @zh-hans
has subproperty: radiotuottaja (yhteisö) teoksessa
has subproperty: radiotuottaja (suku) teoksessa
has subproperty: P50703
lexical alias: radioProducerCollectiveAgentOf.en
status: Published
type: Property
domain: C10011
label: er kollektiv agent, som er radioproducer af @da
label: er radioprodusent for (kollektiv agent) @no
label: est un agent collectif producteur de radio de @fr
label: ir radio raidījuma producents (grupa) @lv
label: is radio producer collective agent of @en
label: is radioproducent-collectieve actor van @nl
label: ist gemeinschaftlicher Akteur als Hörfunkproduzentin/Hörfunkproduzent von @de
label: raadioprodutsent (kollektiiv) teoses @et
label: radyo yapımcısı kolektif temsilcisidir @tr
label: rádióproducer kollektív ágense a következőnek: @hu
label: è produttore radiofonico agente collettivo di @it
label: és agent col·lectiu productor radiofònic de @ca
label: είναι ραδιοφωνικός παραγωγός συλλογικός φορέας του @el
label: هو وكيل جماعي منتج إذاعي لـ @ar
label: 是……的广播制作人集体行为者 @zh-hans
sub property of: radiotuottaja (toimija) teoksessa
sub property of: tuottaja (yhteistoimija) teoksessa
definition: Correla un agente collettivo a un'opera che implica una responsabilità di un agente collettivo per la maggior parte degli aspetti commerciali della produzione di un programma radiofonico. @it
definition: Hozzákapcsol egy kollektív ágenst egy műhöz, amelyhez hozzátartozik egy kollektív ágens felelőssége egy rádióműsor legtöbb üzleti vonatkozásáért. @hu
definition: Kollektif bir temsilciyi, bir radyo programının yapımının ticari yönlerinin çoğu için kolektif bir temsilcinin sorumluluğunu içeren bir eserle ilişkilendirir. @tr
definition: Liittää yhteistoimijan teokseen, jossa yhteistoimija on vastuussa suurimmasta osasta radio-ohjelman liiketoimintaa.
definition: Met un agent collectif en relation avec une œuvre qui comporte une responsabilité de la part d’un agent collectif en ce qui concerne la majeure partie des aspects commerciaux de la production d’une émission de radio. @fr
definition: Relaciona un agent col·lectiu amb una obra que implica una responsabilitat d’un agent col·lectiu en la majoria dels aspectes comercials de la producció d’un programa radiofònic. @ca
definition: Relateert een collectieve actor aan een werk dat met zich meebrengt een verantwoordelijkheid van een collectieve actor voor het merendeel van de zakelijke aspecten van het produceren van een radioprogramma. @nl
definition: Relaterer en kollektiv agent til et verk som involverer et ansvar for en kollektiv agent i form av de fleste forretningsmessige aspektene ved produksjon av et radioprogram. @no
definition: Relaterer en kollektiv agent til et værk, som involverer en kollektiv agents ansvar for størstedelen af de forretningsmæssige aspekter ved et radioprogram. @da
definition: Relates a collective agent to a work that involves a responsibility of a collective agent for most of the business aspects of the production of a radio program. @en
definition: Sasaista grupu ar darbu, kas ietver grupas atbildību par radio raidījuma darbības/biznesa aspektiem. @lv
definition: Seostab kollektiivi teosega, mis sisaldab kollektiivi vastutust enamiku äriliste aspektide eest raadiosaate tootmisel. @et
definition: Setzt einen gemeinschaftlichen Akteur in Beziehung zu einem Werk, bei dem ein gemeinschaftlicher Akteur für die meisten geschäftlichen Aspekte einer Hörfunksendung verantwortlich ist. @de
definition: يربط وكيلا جماعيا بعمل يترتب عليه مسئولية وكيل جماعي عن معظم الجوانب التجارية لإنتاج برنامج إذاعي. @ar
definition: 将一个集体行为者与涉及广播节目制作的大部分商业运作的一个集体行为者的责任的一种作品关联起来。 @zh-hans

televisiotuottaja (yhteistoimija) teoksessa
has element type: 2
toolkit definition: A work that involves a responsibility of a collective agent for most of the business aspects of the production of a television program. @en
toolkit definition: Bir televizyon programının yapımının ticari yönlerinin çoğu için kollektif bir temsilcinin sorumluluğunu içeren bir eser. @tr
toolkit definition: Darbs, kas ietver grupas atbildību par televīzijas raidījuma biznesa aspektiem. @lv
toolkit definition: Een werk dat met zich meebrengt een verantwoordelijkheid van een collectieve actor voor het merendeel van de zakelijke aspecten van de productie van een televisieprogramma. @nl
toolkit definition: Egy mű, amelyhez hozzátartozik egy kollektív ágens felelőssége egy televízióműsor legtöbb üzleti vonatkozásáért. @hu
toolkit definition: Ein Werk, bei dem ein gemeinschaftlicher Akteur für die meisten geschäftlichen Aspekte einer Fernsehsendung verantwortlich ist. @de
toolkit definition: Et verk som involverer et ansvar for en kollektiv agent i form av de fleste forretningsmessige aspektene ved produksjon av et fjernsynsprogram. @no
toolkit definition: Obra que implica una responsabilitat d’un agent col·lectiu en la majoria dels aspectes comercials de la producció d’un programa de televisió. @ca
toolkit definition: Opera che implica una responsabilità di un agente collettivo per la maggior parte degli aspetti commerciali della produzione di un programma televisivo. @it
toolkit definition: Teos, jossa yhteistoimija on vastuussa suurimmasta osasta televisio-ohjelman liiketoimintaa.
toolkit definition: Teos, mis sisaldab kollektiivi vastutust enamiku äriliste aspektide eest telesaate tootmisel. @et
toolkit definition: Værk, som involverer en kollektiv agents ansvar for størstedelen af de forretningsmæssige aspekter ved et tv-program. @da
toolkit definition: Œuvre qui comporte une responsabilité de la part d’un agent collectif en ce qui concerne la majeure partie des aspects commerciaux de la production d’une émission de télévision. @fr
toolkit definition: عمل يترتب عليه مسئولية وكيل جماعي عن معظم الجوانب التجارية لإنتاج برنامج تليفزيوني. @ar
toolkit definition: 涉及电视节目制作的大部分商业运作的一个集体行为者的责任的一种作品 @zh-hans
toolkit label: Gemeinschaftlicher Akteur als Fernsehproduzentin/Fernsehproduzent von @de
toolkit label: agent collectif producteur de télévision de @fr
toolkit label: agent col·lectiu productor de televisió de @ca
toolkit label: fjernsynsprodusent for (kollektiv agent) @no
toolkit label: ir televīzijas raidījuma producents (grupa) @lv
toolkit label: kollektiv agent, som er tv-producer af @da
toolkit label: produttore televisivo agente collettivo di @it
toolkit label: teleprodutsent (kollektiiv) teoses @et
toolkit label: televisieproducent-collectieve actor van @nl
toolkit label: television producer collective agent of @en
toolkit label: televisiotuottaja (yhteistoimija) teoksessa
toolkit label: televizyon yapımcısı kolektif temsilci @tr
toolkit label: televízió-producer kollektív ágense: @hu
toolkit label: τηλεοπτικός παραγωγός συλλογικός φορέας του @el
toolkit label: وكيل جماعي منتج تليفزيوني @ar
toolkit label: ……的电视制作人集体行为者 @zh-hans
has subproperty: televisiotuottaja (yhteisö) teoksessa
has subproperty: televisiotuottaja (suku) teoksessa
has subproperty: P50704
lexical alias: televisionProducerCollectiveAgentOf.en
status: Published
type: Property
domain: C10011
label: er fjernsynsprodusent for (kollektiv agent) @no
label: er kollektiv agent, som er tv-producer af @da
label: est un agent collectif producteur de télévision de @fr
label: ir televīzijas raidījuma producents (grupa) @lv
label: is televisieproducent-collectieve actor van @nl
label: is television producer collective agent of @en
label: ist gemeinschaftlicher Akteur als Fernsehproduzentin/Fernsehproduzent von @de
label: teleprodutsent (kollektiiv) teoses @et
label: televizyon yapımcısı kolektif temsilcidir @tr
label: televízió-producer kollektív ágense a következőnek: @hu
label: è produttore televisivo agente collettivo di @it
label: és agent col·lectiu productor de televisió de @ca
label: είναι τηλεοπτικός παραγωγός συλλογικός φορέας του @el
label: هو وكيل جماعي منتج تليفزيوني لـ @ar
label: 是……的电视制作人集体行为者 @zh-hans
sub property of: televisiotuottaja (toimija) teoksessa
sub property of: tuottaja (yhteistoimija) teoksessa
definition: Correla un agente collettivo a un'opera che implica una responsabilità di un agente collettivo per la maggior parte degli aspetti commerciali della produzione di un programma televisivo. @it
definition: Hozzákapcsol egy kollektív ágenst egy műhöz, amelyhez hozzátartozik egy kollektív ágens felelőssége egy televízióműsor legtöbb üzleti vonatkozásáért. @hu
definition: Kolektif bir temsilciyi, bir televizyon programının yapımının ticari yönlerinin çoğu için kollektif bir temsilcinin sorumluluğunu içeren bir eserle ilişkilendirir. @tr
definition: Liittää yhteistoimijan teokseen, jossa yhteistoimija on vastuussa suurimmasta osasta televisio-ohjelman liiketoimintaa.
definition: Met un agent collectif en relation avec une œuvre qui comporte une responsabilité de la part d’un agent collectif en ce qui concerne la majeure partie des aspects commerciaux de la production d’une émission de télévision. @fr
definition: Relaciona un agent col·lectiu amb una obra que implica una responsabilitat d’un agent col·lectiu en la majoria dels aspectes comercials de la producció d’un programa de televisió. @ca
definition: Relateert een collectieve actor aan een werk dat met zich meebrengt een verantwoordelijkheid van een collectieve actor voor het merendeel van de zakelijke aspecten van de productie van een televisieprogramma. @nl
definition: Relaterer en kollektiv agent til et verk som involverer et ansvar for en kollektiv agent i form av de fleste forretningsmessige aspektene ved produksjon av et fjernsynsprogram. @no
definition: Relaterer en kollektiv agent til et værk, som involverer en kollektiv agents ansvar for størstedelen af de forretningsmæssige aspekter ved et tv-program. @da
definition: Relates a collective agent to a work that involves a responsibility of a collective agent for most of the business aspects of the production of a television program. @en
definition: Sasaista grupu ar darbu, kas ietver grupas atbildību par televīzijas raidījuma biznesa aspektiem. @lv
definition: Seostab kollektiivi teosega, mis sisaldab kollektiivi vastutust enamiku äriliste aspektide eest telesaate tootmisel. @et
definition: Setzt einen gemeinschaftlichen Akteur in Beziehung zu einem Werk, bei dem ein gemeinschaftlicher Akteur für die meisten geschäftlichen Aspekte einer Fernsehsendung verantwortlich ist. @de
definition: يربط وكيلا جماعيا بعمل يترتب عليه مسئولية وكيل جماعي عن معظم الجوانب التجارية لإنتاج برنامج تليفزيوني. @ar
definition: 将一个集体行为者与涉及电视节目制作的大部分商业运作的一个集体行为者的责任的一种作品关联起来。 @zh-hans

järjestäjä (yhteistoimija) teoksessa
has element type: 2
toolkit definition: A work that involves a responsibility of a collective agent for organizing a conference, exhibition, or other event that gives rise to a work. @en
toolkit definition: Bir konferansı, sergiyi ya da bir çalışmaya yol açan başka bir etkinliği düzenlemek için kollektif bir temsilcinin sorumluluğunu içeren bir eser. @tr
toolkit definition: Darbs, kas ietver grupas atbildību par konferences, izstādes vai pasākuma organizēšanu. @lv
toolkit definition: Een werk dat met zich meebrengt een verantwoordelijkheid van een collectieve actor voor het organiseren van een conferentie, tentoonstelling of andere gebeurtenis die aanleiding geeft tot een werk. @nl
toolkit definition: Egy mű, amelyhez hozzátartozik egy kollektív ágens felelőssége egy mű létrejöttét eredményező konferencia, kiállítás vagy más esemény szervezéséért. @hu
toolkit definition: Ein Werk, bei dem ein gemeinschaftlicher Akteur für die Organisation beziehungsweise Veranstaltung einer Konferenz, einer Ausstellung oder eines anderen Ereignisses verantwortlich ist, aus der/dem ein Werk hervorgeht. @de
toolkit definition: Et verk som involverer et ansvar for en kollektiv agent i form av å organisere en konferanse, en utstilling eller et annet arrangement som gir opphav til et verk. @no
toolkit definition: Obra que implica una responsabilitat d’un agent col·lectiu organitzant un congrés, una exposició o qualsevol altre esdeveniment que dona lloc a una obra. @ca
toolkit definition: Opera che implica una responsabilità di un agente collettivo nell'organizzazione di una conferenza, mostra o altro evento che dà origine a un'opera. @it
toolkit definition: Teos, jossa yhteistoimija on vastuussa konferenssin, näyttelyn tai muun tapahtuman järjestämisestä ja jonka seurauksena syntyy teos.
toolkit definition: Teos, mis sisaldab kollektiivi vastutust teosele aluse pannud konverentsi, näituse vm ürituse korraldamise eest. @et
toolkit definition: Værk, som involverer en kollektiv agents ansvar for at organisere en konference, udstilling eller anden begivenhed, som giver anledning til et værk. @da
toolkit definition: Œuvre qui comporte une responsabilité de la part d’un agent collectif consistant à organiser un congrès, une exposition ou un autre événement qui donne lieu à la création d’une œuvre. @fr
toolkit definition: عمل يترتب عليه مسئولية وكيل جماعي عن تنظيم مؤتمر أو معرض أو فعالية أخرى ينشأ عنها عمل. @ar
toolkit definition: 涉及组织会议、展览或其他事件产生一种作品的一个集体行为者的责任的一种作品 @zh-hans
toolkit label: Gemeinschaftlicher Akteur als Veranstalterin/Veranstalter von @de
toolkit label: agent collectif organisateur de @fr
toolkit label: agent col·lectiu organitzador de @ca
toolkit label: arrangør av (kollektiv agent) @no
toolkit label: ir organizators (grupa) @lv
toolkit label: järjestäjä (yhteistoimija) teoksessa
toolkit label: kollektiv agent, som er arrangør af @da
toolkit label: korraldaja (kollektiiv) teoses @et
toolkit label: organisator-collectieve actor van @nl
toolkit label: organizatör kolektif temsilcisi @tr
toolkit label: organizer collective agent of @en
toolkit label: organizzatore agente collettivo di @it
toolkit label: szervező kollektív ágense: @hu
toolkit label: οργανωτής φυσικό πρόσωπο του @el
toolkit label: وكيل جماعي منظم @ar
toolkit label: ……的组织者集体行为者 @zh-hans
has subproperty: järjestäjä (yhteisö) teoksessa
has subproperty: järjestäjä (suku) teoksessa
has subproperty: P50705
lexical alias: organizerCollectiveAgentOf.en
status: Published
type: Property
domain: C10011
label: er arrangør av (kollektiv agent) @no
label: er kollektiv agent, som er arrangør af @da
label: est un agent collectif organisateur de @fr
label: ir organizators (grupa) @lv
label: is organisator-collectieve actor van @nl
label: is organizer collective agent of @en
label: ist gemeinschaftlicher Akteur als Veranstalterin/Veranstalter von @de
label: korraldaja (kollektiiv) teoses @et
label: organizatör kolektif temsilcisidir @tr
label: szervező kollektív ágense a következőnek: @hu
label: è organizzatore agente collettivo di @it
label: és agent col·lectiu organitzador de @ca
label: είναι οργανωτής φυσικό πρόσωπο του @el
label: هو وكيل جماعي منظم لـ @ar
label: 是……的组织者集体行为者 @zh-hans
sub property of: järjestäjä (toimija) teoksessa
sub property of: yhteistoimijaan liittyvä teos
definition: Correla un agente collettivo a un'opera che implica una responsabilità di un agente collettivo nell'organizzazione di una conferenza, mostra o altro evento che dà origine a un'opera. @it
definition: Hozzákapcsol egy kollektív ágenst egy műhöz, amelyhez hozzátartozik egy kollektív ágens felelőssége egy mű létrejöttét eredményező konferencia, kiállítás vagy más esemény szervezéséért. @hu
definition: Kollektif bir temsilciyi, bir esere yol açan bir konferans, sergi veya başka bir etkinliği organize etme sorumluluğunu içeren bir eserle ilişkilendirir. @tr
definition: Liittää yhteistoimijan teokseen, jossa yhteistoimija on vastuussa konferenssin, näyttelyn tai muun tapahtuman järjestämisestä ja jonka seurauksena syntyy teos.
definition: Met un agent collectif en relation avec une œuvre qui comporte une responsabilité de la part d’un agent collectif consistant à organiser un congrès, une exposition ou un autre événement qui donne lieu à la création d’une œuvre. @fr
definition: Relaciona un agent col·lectiu amb una obra que implica una responsabilitat d’un agent col·lectiu organitzant un congrés, una exposició o qualsevol altre esdeveniment que dona lloc a una obra. @ca
definition: Relateert een collectieve actor aan een werk dat met zich meebrengt een verantwoordelijkheid van een collectieve actor voor het organiseren van een conferentie, tentoonstelling of andere gebeurtenis die aanleiding geeft tot een werk. @nl
definition: Relaterer en kollektiv agent til et verk som involverer et ansvar for en kollektiv agent i form av å organisere en konferanse, en utstilling eller et annet arrangement som gir opphav til et verk. @no
definition: Relaterer en kollektiv agent til et værk, som involverer en kollektiv agents ansvar for at organisere en konference, udstilling eller anden begivenhed, som giver anledning til et værk. @da
definition: Relates a collective agent to a work that involves a responsibility of a collective agent for organizing a conference, exhibition, or other event that gives rise to a work. @en
definition: Sasaista grupu ar darbu, kas ietver grupas atbildību par konferences, izstādes vai pasākuma organizēšanu. @lv
definition: Seostab kollektiivi teosega, mis sisaldab kollektiivi vastutust teosele aluse pannud konverentsi, näituse vm ürituse korraldamise eest. @et
definition: Setzt einen gemeinschaftlichen Akteur in Beziehung zu einem Werk, bei dem ein gemeinschaftlicher Akteur für die Organisation beziehungsweise Veranstaltung einer Konferenz, einer Ausstellung oder eines anderen Ereignisses verantwortlich ist, aus der/dem ein Werk hervorgeht. @de
definition: يربط وكيلا جماعيا بعمل يترتب عليه مسئولية وكيل جماعي عن تنظيم مؤتمر أو معرض أو فعالية أخرى ينشأ عنها عمل. @ar
definition: 将一个集体行为者与涉及组织会议、展览或其他事件产生一种作品的一个集体行为者的责任的一种作品关联起来。 @zh-hans

teoksen valokuvaaja (yhteistoimija) teoksessa
has element type: 2
toolkit definition: A work that involves a responsibility of a collective agent for creating a photographic work. @en
toolkit definition: Darbs, kas ietver grupas atbildību par fotografēšanu. @lv
toolkit definition: Een werk dat is een fotografisch werk dat met zich meebrengt een verantwoordelijkheid van een collectieve actor voor fotografie. @nl
toolkit definition: Egy fényképészeti mű, amelyhez hozzátartozik egy kollektív ágens felelőssége a fotózásért. @hu
toolkit definition: Ein fotografisches Werk, bei dem ein gemeinschaftlicher Akteur für die Fotografie verantwortlich ist. @de
toolkit definition: Et verk som involverer et ansvar for en kollektiv agent i form av fotografi. @no
toolkit definition: Fotografik bir eseri yaratmak için kolektif bir temsilcinin sorumluluğunu içeren bir eser. @tr
toolkit definition: Obra que implica una responsabilitat d’un agent col·lectiu en la creació d’una obra fotogràfica. @ca
toolkit definition: Opera che implica una responsabilità di un agente collettivo per la fotografia. @it
toolkit definition: Teos, joka on valokuvateos, jonka luomisesta yhteistoimija on vastuussa.
toolkit definition: Teos, mis sisaldab kollektiivi vastutust fotograafia eest. @et
toolkit definition: Værk, som er et fotografisk værk, som involverer en kollektiv agents ansvar for fotografi. @da
toolkit definition: Œuvre qui comporte une responsabilité de la part d’un agent collectif consistant à créer une œuvre photographique. @fr
toolkit definition: عمل عبارة عن عمل فوتوغرافي يترتب عليه مسئولية وكيل جماعي عن التصوير. @ar
toolkit definition: 涉及创作一种摄影作品的一个集体行为者的责任的一种作品 @zh-hans
toolkit label: Eserin fotoğrafçı kolektif temsilcisi @tr
toolkit label: Gemeinschaftlicher Akteur als Fotografin/Fotograf eines Werks von @de
toolkit label: agent collectif photographe d’une œuvre de @fr
toolkit label: agent col·lectiu fotògraf d’una obra de @ca
toolkit label: fotograaf-collectieve actor van werk van @nl
toolkit label: fotograf for verk for (kollektiv agent) @no
toolkit label: fotografo agente collettivo di opera di @it
toolkit label: fényképész kollektív ágense a következő műnek: @hu
toolkit label: ir fotogrāfs (grupa) @lv
toolkit label: kollektiv agent, som er fotograf af værk af @da
toolkit label: photographer collective agent of work of @en
toolkit label: teoksen valokuvaaja (yhteistoimija) teoksessa
toolkit label: teose fotograaf (kollektiiv) teoses @et
toolkit label: φωτογράφος συλλογικός φορέας του έργου του @el
toolkit label: وكيل جماعي مصور عمل @ar
toolkit label: ……作品的摄影者集体行为者 @zh-hans
has subproperty: teoksen valokuvaaja (yhteisö) teoksessa
has subproperty: teoksen valokuvaaja (suku) teoksessa
has subproperty: P50706
lexical alias: photographerCollectiveAgentOfWorkOf.en
status: Published
type: Property
domain: C10011
label: er fotograf for verk for (kollektiv agent) @no
label: er kollektiv agent, som er fotograf af værk af @da
label: eserinin fotoğrafçı kolektif temsilcisidir @tr
label: est un agent collectif photographe d’une œuvre de @fr
label: fényképész kollektív ágense a következő műnek: @hu
label: ir fotogrāfs (grupa) @lv
label: is fotograaf-collectieve actor van werk van @nl
label: is photographer collective agent of work of @en
label: ist gemeinschaftlicher Akteur als Fotografin/Fotograf eines Werks von @de
label: teose fotograaf (kollektiiv) teoses @et
label: è fotografo agente collettivo di opera di @it
label: és agent col·lectiu fotògraf d’una obra de @ca
label: είναι φωτογράφος συλλογικός φορέας του έργου του @el
label: هو وكيل جماعي مصور لعمل لـ @ar
label: 是……作品的摄影者集体行为者 @zh-hans
sub property of: teoksen valokuvaaja (toimija) teoksessa
sub property of: teoksen tekijä (yhteistoimija) teoksessa
definition: Correla un agente collettivo a un'opera che implica una responsabilità di un agente collettivo per la fotografia. @it
definition: Hozzákapcsol egy kollektív ágenst egy fényképészeti műhöz, amelyhez hozzátartozik egy kollektív ágens felelőssége a fotózásért. @hu
definition: Kollektif bir temsilciyi, bir fotoğraf çalışması oluşturmak için kolektif bir temsilcinin sorumluluğunu içeren bir eserle ilişkilendirir. @tr
definition: Liittää yhteistoimijan teokseen, joka on valokuvateos, jonka luomisesta yhteistoimija on vastuussa.
definition: Met un agent collectif en relation avec une œuvre qui comporte une responsabilité de la part d’un agent collectif consistant à créer une œuvre photographique. @fr
definition: Relaciona un agent col·lectiu amb una obra que implica una responsabilitat d’un agent col·lectiu en la creació d’una obra fotogràfica. @ca
definition: Relateert een collectieve actor aan een werk dat is een fotografisch werk dat met zich meebrengt een verantwoordelijkheid van een collectieve actor voor fotografie. @nl
definition: Relaterer en kollektiv agent til et verk som involverer et ansvar for en kollektiv agent i form av fotografi. @no
definition: Relaterer en kollektiv agent til et værk, som er et fotografisk værk, som involverer en kollektiv agents ansvar for fotografi. @da
definition: Relates a collective agent to a work that involves a responsibility of a collective agent for creating a photographic work. @en
definition: Sasaista grupu ar darbu, kas ietver grupas atbildību par fotografēšanu. @lv
definition: Seostab kollektiivi teosega, mis sisaldab kollektiivi vastutust fotograafia eest. @et
definition: Setzt einen gemeinschaftlichen Akteur in Beziehung zu einem fotografischen Werk, bei dem ein gemeinschaftlicher Akteur für die Fotografie verantwortlich ist. @de
definition: يربط وكيلا جماعيا بعمل عبارة عن عمل فوتوغرافي يترتب عليه مسئولية وكيل جماعي عن التصوير. @ar
definition: 将一个集体行为者与涉及创作一种摄影作品的一个集体行为者的责任的一种作品关联起来。 @zh-hans

asiantuntija (yhteistoimija) teoksessa
has element type: 2
toolkit definition: A work that involves a responsibility of a collective agent for providing consultation services, and often making recommendations, to a creator of a work. @en
toolkit definition: Bir eserin yaratıcısına danışma hizmetleri sağlamak ve genellikle tavsiyelerde bulunmak için kollektif bir temsilcinin sorumluluğunu içeren bir eser. @tr
toolkit definition: Darbs, kas ietver grupas atbildību par konsultāciju pakalpojumu un ieteikumu sniegšanu citam aģentam, kas ir darba radītājs. @lv
toolkit definition: Een werk dat met zich meebrengt een verantwoordelijkheid van een collectieve actor voor het leveren van diensten van raadgeving, en vaak het doen van aanbevelingen, aan een maker van een werk. @nl
toolkit definition: Egy mű, amelyhez hozzátartozik egy kollektív ágens felelőssége tanácsadó szolgáltatásért és gyakran egy mű létrehozójának tett javaslatokért is. @hu
toolkit definition: Ein Werk, bei dem ein gemeinschaftlicher Akteur einer geistigen Schöpferin/einem geistigen Schöpfer eines Werks Beratungsdienste anbietet und Empfehlungen macht. @de
toolkit definition: Et verk som involverer et ansvar for en kollektiv agent i form av å levere konsulenttjenester og ofte gi anbefalinger til en skaper av et verk. @no
toolkit definition: Obra que implica una responsabilitat d’un agent col·lectiu proporcionant serveis d’assessorament, i que sovint fa recomanacions, a un creador d’una obra. @ca
toolkit definition: Opera che implica una responsabilità di un agente collettivo nel fornire servizi di consulenza e spesso raccomandazioni a un creatore di un'opera. @it
toolkit definition: Teos, jossa yhteistoimija on vastuussa asiantuntijapalveluiden tarjoamisesta ja suositusten antamisesta teoksen tekijälle.
toolkit definition: Teos, mis sisaldab kollektiivi vastutust konsultatsiooni ja sageli ka soovituste andmise eest teose autorile. @et
toolkit definition: Værk, som involverer en kollektiv agents ansvar for at yde rådgivning og ofte komme med anbefalinger til et ophav til et værk. @da
toolkit definition: Œuvre qui comporte une responsabilité de la part d’un agent collectif consistant à fournir des services de consultation et souvent à faire des recommandations à un créateur d’une œuvre. @fr
toolkit definition: عمل يترتب عليه مسئولية وكيل جماعي عن تقديم خدمات استشارية، وغالبا ما يقدم مقترحات إلى منشئ عمل @ar
toolkit definition: 涉及向作品创作者提供咨询服务并经常提供建议的一个集体行为者的责任的一种作品 @zh-hans
toolkit label: Gemeinschaftlicher Akteur als Beraterin/Berater von @de
toolkit label: agent collectif consultant de @fr
toolkit label: agent col·lectiu consultor de @ca
toolkit label: asiantuntija (yhteistoimija) teoksessa
toolkit label: consulente agente collettivo di @it
toolkit label: consultant collective agent of @en
toolkit label: consultant-collectieve actor van @nl
toolkit label: danışman kolektif temsilcisi @tr
toolkit label: ir konsultants (grupa) @lv
toolkit label: kollektiv agent, som er rådgiver af @da
toolkit label: konsulent for (kollektiv agent) @no
toolkit label: konsultant (kollektiiv) teoses @et
toolkit label: tanácsadó kollektív ágense: @hu
toolkit label: σύμβουλος συλλογικός φορέας του @el
toolkit label: وكيل جماعي استشاري @ar
toolkit label: ……的顾问集体行为者 @zh-hans
has subproperty: asiantuntija (yhteisö) teoksessa
has subproperty: asiantuntija (suku) teoksessa
has subproperty: P50707
lexical alias: consultantCollectiveAgentOf.en
status: Published
type: Property
domain: C10011
label: danışman kollektif temsilcisidir @tr
label: er kollektiv agent, som er rådgiver af @da
label: er konsulent for (kollektiv agent) @no
label: est un agent collectif consultant de @fr
label: ir konsultants (grupa) @lv
label: is consultant collective agent of @en
label: is consultant-collectieve actor van @nl
label: ist gemeinschaftlicher Akteur als Beraterin/Berater von @de
label: konsultant (kollektiiv) teoses @et
label: tanácsadó kollektív ágense a következőnek: @hu
label: è consulente agente collettivo di @it
label: és agent col·lectiu consultor de @ca
label: είναι σύμβουλος συλλογικός φορέας του @el
label: هو وكيل جماعي استشاري لـ @ar
label: 是……的顾问集体行为者 @zh-hans
sub property of: asiantuntija (toimija) teoksessa
sub property of: yhteistoimijaan liittyvä teos
definition: Correla un agente collettivo a un'opera che implica una responsabilità di un agente collettivo nel fornire servizi di consulenza e spesso raccomandazioni a un creatore di un'opera. @it
definition: Hozzákapcsol egy kollektív ágenst egy műhöz, amelyhez hozzátartozik egy kollektív ágens felelőssége tanácsadó szolgáltatásért és gyakran egy mű létrehozójának tett javaslatokért is. @hu
definition: Kolektif bir temsilciyi, bir eserin yaratıcısına danışma hizmetleri sağlama ve genellikle tavsiyelerde bulunma sorumluluğunu içeren bir eserle ilişkilendirir. @tr
definition: Liittää yhteistoimijan teokseen, jossa yhteistoimija on vastuussa asiantuntijapalveluiden tarjoamisesta ja suositusten antamisesta teoksen tekijälle.
definition: Met un agent collectif en relation avec une œuvre qui comporte une responsabilité de la part d’un agent collectif consistant à fournir des services de consultation et souvent à faire des recommandations à un créateur d’une œuvre. @fr
definition: Relaciona un agent col·lectiu amb una obra que implica una responsabilitat d’un agent col·lectiu proporcionant serveis d’assessorament, i que sovint fa recomanacions, a un creador d’una obra. @ca
definition: Relateert een collectieve actor aan een werk dat met zich meebrengt een verantwoordelijkheid van een collectieve actor voor het leveren van diensten van raadgeving, en vaak het doen van aanbevelingen, aan een maker van een werk. @nl
definition: Relaterer en kollektiv agent til et verk som involverer et ansvar for en kollektiv agent i form av å levere konsulenttjenester og ofte gi anbefalinger til en skaper av et verk. @no
definition: Relaterer en kollektiv agent til et værk, som involverer en kollektiv agents ansvar for at yde rådgivning og ofte komme med anbefalinger til et ophav til et værk. @da
definition: Relates a collective agent to a work that involves a responsibility of a collective agent for providing consultation services, and often making recommendations, to a creator of a work. @en
definition: Sasaista grupu ar darbu, kas ietver grupas atbildību par konsultāciju pakalpojumu un ieteikumu sniegšanu citam aģentam, kas ir darba radītājs. @lv
definition: Seostab kollektiivi teosega, mis sisaldab kollektiivi vastutust konsultatsiooni ja sageli ka soovituste andmise eest teose autorile. @et
definition: Setzt einen gemeinschaftlichen Akteur in Beziehung zu einem Werk, bei dem ein gemeinschaftlicher Akteur einer geistigen Schöpferin/einem geistigen Schöpfer eines Werks Beratungsdienste anbietet und Empfehlungen macht. @de
definition: يربط وكيلا جماعيا بعمل ينطوي على مسئوليته عن تقديم خدمات استشارية، وغالبا ما يقدم مقترحات إلى منشئ عمل. @ar
definition: 将一个集体行为者与涉及向作品创作者提供咨询服务并经常提供建议的一个集体行为者的责任的一种作品关联起来。 @zh-hans

kokousten raportoija (yhteistoimija) teoksessa
has element type: 2
toolkit definition: A work that involves a responsibility of a collective agent for reporting on the proceedings of meetings of an organization. @en
toolkit definition: Bir organizasyonun toplantılarının bildirileriniı raporlamak için kollektif bir temsilcinin sorumluluğunu içeren bir eser. @tr
toolkit definition: Darbs, kas ietver grupas atbildību par ziņošanu par organizācijas sanāksmju norisi. @lv
toolkit definition: Een werk dat met zich meebrengt een verantwoordelijkheid van een collectieve actor voor het rapporteren van handelingen van bijeenkomsten van een organisatie. @nl
toolkit definition: Egy mű, amelyhez hozzátartozik egy kollektív ágens felelőssége egy szervezet üléseinek lefolyásáról szóló jelentésért. @hu
toolkit definition: Ein Werk, bei dem ein gemeinschaftlicher Akteur für das Berichten über den Ablauf von Sitzungen einer Organisation verantwortlich ist. @de
toolkit definition: Et verk som involverer et ansvar for en kollektiv agent i form av å rapportere fra møtene i en organisasjon. @no
toolkit definition: Obra que implica una responsabilitat d’un agent col·lectiu en la redacció de les actes de les reunions d’una organització. @ca
toolkit definition: Opera che implica una responsabilità di un agente collettivo per la redazione dei verbali degli incontri di un'organizzazione. @it
toolkit definition: Teos, jossa yhteistoimijan vastuulla on raportoida organisaation kokousmenettelyistä.
toolkit definition: Teos, mis sisaldab kollektiivi vastutust organisatsiooni koosolekute toimingutest aruande kirjutamise eest. @et
toolkit definition: Værk, som involverer en kollektiv agents ansvar for at rapportere om udviklingerne ved en organisations møder. @da
toolkit definition: Œuvre qui comporte une responsabilité de la part d’un agent collectif consistant à rédiger les comptes rendus des réunions d’une organisation. @fr
toolkit definition: عمل يترتب عليه مسئولية وكيل جماعي عن إعداد تقرير عن وقائع اجتماعات مؤسسة. @ar
toolkit definition: 涉及一个组织的会议文集报告的一个集体行为者的责任的一种作品 @zh-hans
toolkit label: Gemeinschaftlicher Akteur als Berichterstatterin/Berichterstatter von @de
toolkit label: agent collectif rapporteur de @fr
toolkit label: agent col·lectiu relator de @ca
toolkit label: aruande koostaja (kollektiiv) teoses @et
toolkit label: ir ziņotājs (grupa) @lv
toolkit label: kokousten raportoija (yhteistoimija) teoksessa
toolkit label: kollektiv agent, som er rapportør af @da
toolkit label: raportör kollektif temsilcisi @tr
toolkit label: raportőr kollektív ágense: @hu
toolkit label: rapporteur collective agent of @en
toolkit label: rapporteur-collectieve actor van @nl
toolkit label: rapportør for (kollektiv agent) @no
toolkit label: relatore agente collettivo di @it
toolkit label: εισηγητής συλλογικός φορέας του @el
toolkit label: وكيل جماعي مقرر @ar
toolkit label: ……的会务报告人集体行为者 @zh-hans
has subproperty: kokousten raportoija (yhteisö) teoksessa
has subproperty: kokousten raportoija (suku) teoksessa
has subproperty: P50708
lexical alias: rapporteurCollectiveAgentOf.en
status: Published
type: Property
domain: C10011
label: aruande koostaja (kollektiiv) teoses @et
label: er kollektiv agent, som er rapportør af @da
label: er rapportør for (kollektiv agent) @no
label: est un agent collectif rapporteur de @fr
label: ir ziņotājs (grupa) @lv
label: is rapporteur collective agent of @en
label: is rapporteur-collectieve actor van @nl
label: ist gemeinschaftlicher Akteur als Berichterstatterin/Berichterstatter von @de
label: raportör kollektif temsilcisidir @tr
label: raportőr kollektív ágense a következőnek: @hu
label: è relatore agente collettivo di @it
label: és agent col·lectiu relator de @ca
label: είναι εισηγητής συλλογικός φορέας του @el
label: هو وكيل جماعي مقرر لـ @ar
label: 是……的会务报告人集体行为者 @zh-hans
sub property of: kokousten raportoija (toimija) teoksessa
sub property of: kirjoittaja (yhteistoimija) teoksessa
definition: Correla un agente collettivo a un'opera che implica una responsabilità di un agente collettivo per la redazione dei verbali degli incontri di un'organizzazione. @it
definition: Hozzákapcsol egy kollektív ágenst egy műhöz, amelyhez hozzátartozik egy kollektív ágens felelőssége egy szervezet üléseinek lefolyásáról szóló jelentésért. @hu
definition: Kollektif bir temsilciyi, bir organizasyonun toplantılarının işleyişi hakkında raporlama yapmak için bir kollektif temsilcinin sorumluluğunu içeren bir eserle ilişkilendirir. @tr
definition: Liittää yhteistoimijan teokseen, jossa yhteistoimijan vastuulla on raportoida organisaation kokousmenettelyistä.
definition: Met un agent collectif en relation avec une œuvre qui comporte une responsabilité de la part d’un agent collectif consistant à rédiger les comptes rendus des réunions d’une organisation. @fr
definition: Relaciona un agent col·lectiu amb una obra que implica una responsabilitat d’un agent col·lectiu en la redacció de les actes de les reunions d’una organització. @ca
definition: Relateert een collectieve actor aan een werk dat met zich meebrengt een verantwoordelijkheid van een collectieve actor voor het rapporteren van handelingen van bijeenkomsten van een organisatie. @nl
definition: Relaterer en kollektiv agent til et verk som involverer et ansvar for en kollektiv agent i form av å rapportere fra møtene i en organisasjon. @no
definition: Relaterer en kollektiv agent til et værk, som involverer en kollektiv agents ansvar for at rapportere om udviklingerne ved en organisations møder. @da
definition: Relates a collective agent to a work that involves a responsibility of a collective agent for reporting on the proceedings of meetings of an organization. @en
definition: Sasaista grupu ar darbu, kas ietver grupas atbildību par ziņošanu par organizācijas sanāksmju norisi. @lv
definition: Seostab kollektiivi teosega, mis sisaldab kollektiivi vastutust organisatsiooni koosolekute toimingutest aruande kirjutamise eest. @et
definition: Setzt einen gemeinschaftlichen Akteur in Beziehung zu einem Werk, bei dem ein gemeinschaftlicher Akteur für das Berichten über den Ablauf von Sitzungen einer Organisation verantwortlich ist. @de
definition: يربط وكيلا جماعيا بعمل يترتب عليه مسئولية وكيل جماعي عن إعداد تقرير عن وقائع اجتماعات مؤسسة. @ar
definition: 将一个集体行为者与涉及一个组织的会议文集报告的一个集体行为者的责任的一种作品关联起来。 @zh-hans

tutkija (yhteistoimija) teoksessa
has element type: 2
toolkit definition: A work that involves a responsibility of a collective agent for research in support of a work. @en
toolkit definition: Bir çalışmayı destekleyen araştırma için kollektif bir temsilcinin sorumluluğunu içeren bir eser. @tr
toolkit definition: Darbs, kas ietver grupas atbildību par pētījumu, lai atbalstītu darba radīšanu. @lv
toolkit definition: Een werk dat met zich meebrengt een verantwoordelijkheid van een collectieve actor voor onderzoek ter ondersteuning van een werk. @nl
toolkit definition: Egy mű, amelyhez hozzátartozik egy kollektív ágens felelőssége egy művet támogató kutatásért. @hu
toolkit definition: Ein Werk, bei dem ein gemeinschaftlicher Akteur für die Forschung zur Unterstützung eines Werks verantwortlich ist. @de
toolkit definition: Et verk som involverer et ansvar for en kollektiv agent i form av forskning som støtte for et verk. @no
toolkit definition: Obra que implica una responsabilitat d’un agent col·lectiu en la recerca per donar suport a una obra. @ca
toolkit definition: Opera che implica una responsabilità di un agente collettivo nella ricerca in supporto di un'opera. @it
toolkit definition: Teos, jossa yhteistoimija on vastuussa tutkimuksesta, joka tukee teoksen syntymistä.
toolkit definition: Teos, mis sisaldab kollektiivi vastutust teose heaks uurimistöö tegemise eest. @et
toolkit definition: Værk, som involverer en kollektiv agents ansvar for research til at understøtte et værk. @da
toolkit definition: Œuvre qui comporte une responsabilité de la part d’un agent collectif consistant à effectuer des recherches pour aider à la création d’une œuvre. @fr
toolkit definition: عمل يترتب عليه مسئولية وكيل جماعي عن البحث لدعم عمل. @ar
toolkit definition: 涉及对一种作品研究支持的一个集体行为者的责任的一种作品 @zh-hans
toolkit label: Gemeinschaftlicher Akteur als Forscherin/Forscher von @de
toolkit label: agent collectif recherchiste de @fr
toolkit label: agent col·lectiu investigador de @ca
toolkit label: araştırmacı kolektif temsilci @tr
toolkit label: forsker for (kollektiv agent) @no
toolkit label: ir pētnieks (grupa) @lv
toolkit label: kollektiv agent, som er researcher af @da
toolkit label: kutató kollektív ágense: @hu
toolkit label: onderzoeker-collectieve actor van @nl
toolkit label: researcher collective agent of @en
toolkit label: ricercatore agente collettivo di @it
toolkit label: tutkija (yhteistoimija) teoksessa
toolkit label: uurija (kollektiiv) teoses @et
toolkit label: ερευνητής συλλογικός φορέας του @el
toolkit label: وكيل جماعي باحث @ar
toolkit label: ……的研究者集体行为者 @zh-hans
has subproperty: tutkija (yhteisö) teoksessa
has subproperty: tutkija (suku) teoksessa
has subproperty: P50709
lexical alias: researcherCollectiveAgentOf.en
status: Published
type: Property
domain: C10011
label: araştırmacı kolektif temsilcisidir @tr
label: er forsker for (kollektiv agent) @no
label: er kollektiv agent, som er researcher af @da
label: est un agent collectif recherchiste de @fr
label: ir pētnieks (grupa) @lv
label: is onderzoeker-collectieve actor van @nl
label: is researcher collective agent of @en
label: ist gemeinschaftlicher Akteur als Forscherin/Forscher von @de
label: kutató kollektív ágense a következőnek: @hu
label: uurija (kollektiiv) teoses @et
label: è ricercatore agente collettivo di @it
label: és agent col·lectiu investigador de @ca
label: είναι ερευνητής συλλογικός φορέας του @el
label: هو وكيل جماعي باحث لـ @ar
label: 是……的研究者集体行为者 @zh-hans
sub property of: tutkija (toimija) teoksessa
sub property of: yhteistoimijaan liittyvä teos
definition: Correla un agente collettivo a un'opera che implica una responsabilità di un agente collettivo nella ricerca in supporto di un'opera. @it
definition: Hozzákapcsol egy kollektív ágenst egy műhöz, amelyhez hozzátartozik egy kollektív ágens felelőssége egy művet támogató kutatásért. @hu
definition: Kolektif bir temsilciyi, bir çalışmayı destekleyen araştırma için kolektif bir temsilcinin sorumluluğunu içeren bir eserle ilişkilendirir. @tr
definition: Liittää yhteistoimijan teokseen, jossa yhteistoimija on vastuussa tutkimuksesta, joka tukee teoksen syntymistä.
definition: Met un agent collectif en relation avec une œuvre qui comporte une responsabilité de la part d’un agent collectif consistant à effectuer des recherches pour aider à la création d’une œuvre. @fr
definition: Relaciona un agent col·lectiu amb una obra que implica una responsabilitat d’un agent col·lectiu en la recerca per donar suport a una obra. @ca
definition: Relateert een collectieve actor aan een werk dat met zich meebrengt een verantwoordelijkheid van een collectieve actor voor onderzoek ter ondersteuning van een werk. @nl
definition: Relaterer en kollektiv agent til et verk som involverer et ansvar for en kollektiv agent i form av forskning som støtte for et verk. @no
definition: Relaterer en kollektiv agent til et værk, som involverer en kollektiv agents ansvar for research til at understøtte et værk. @da
definition: Relates a collective agent to a work that involves a responsibility of a collective agent for research in support of a work. @en
definition: Sasaista grupu ar darbu, kas ietver grupas atbildību par pētījumu, lai atbalstītu darba radīšanu. @lv
definition: Seostab kollektiivi teosega, mis sisaldab kollektiivi vastutust teose heaks uurimistöö tegemise eest. @et
definition: Setzt einen gemeinschaftlichen Akteur in Beziehung zu einem Werk, bei dem ein gemeinschaftlicher Akteur für die Forschung zur Unterstützung eines Werks verantwortlich ist. @de
definition: يربط وكيلا جماعيا بعمل يترتب عليه مسئولية وكيل جماعي عن البحث لدعم عمل. @ar
definition: 将一个集体行为者与涉及对一种作品研究支持的一个集体行为者的责任的一种作品关联起来。 @zh-hans

teoksen haastateltava (yhteistoimija) teoksessa
has element type: 2
toolkit definition: A work that involves a responsibility of a collective agent for responding to an interviewer, usually a reporter, pollster, or some other kind of agent who gathers information. @en
toolkit definition: Bir görüşmeciye, genellikle bir muhabire, anketöre veya bilgi toplayan başka bir tür temsilciye yanıt vermek için kollektif bir temsilcinin sorumluluğunu içeren bir eser. @tr
toolkit definition: Darbs, kas ietver grupas atbildību, atbildot uz intervētāja, parasti reportiera, aptaujas organizētāja vai kāda cita informācijas apkopotāja jautājumiem. @lv
toolkit definition: Een werk dat met zich meebrengt een verantwoordelijkheid van een collectieve actor voor reageren op een interviewer, verslaggever, opiniepeiler of een andere soort actor die informatie verzamelt. @nl
toolkit definition: Egy mű, amelyhez hozzátartozik egy kollektív ágens felelőssége egy interjúkészítőnek, általában riporternek, közvélemény-kutatónak, vagy valamilyen más információgyűjtő ágensnek, adott válaszért. @hu
toolkit definition: Ein Werk, bei dem ein gemeinschaftlicher Akteur einer Interviewerin/einem Interviewer antwortet. Dabei handelt es sich normalerweise um eine Reporterin/einen Reporter, eine Meinungsforscherin/einen Meinungsforscher oder anderen Akteur, die/der Informationen zusammenträgt. @de
toolkit definition: Et verk som involverer et ansvar for en kollektiv agent i form av å svare på spørsmål fra en intervjuer, som oftest en reporter eller annen agent som samler inn informasjon. @no
toolkit definition: Obra que implica una responsabilitat d’un agent col·lectiu responent a un entrevistador, habitualment un periodista, un enquestador o qualsevol altre tipus d’agent que recull la informació. @ca
toolkit definition: Opera che implica una responsabilità di un agente collettivo nel rispondere a un intervistatore, solitamente un giornalista, sondaggista o un altro tipo di agente che raccoglie informazioni. @it
toolkit definition: Teos, jossa yhteistoimija on vastuussa teoksen luomisesta vastaamalla haastattelijalle, tavallisesti toimittajalle, mielipidetutkijalle tai muulle tietoa keräävälle toimijalle.
toolkit definition: Teos, mis sisaldab kollektiivi vastutust intervjueerijale, reporterile, küsitlejale või muule infot koguvale tegijale vastamise eest. @et
toolkit definition: Værk, som involverer en kollektiv agents ansvar for at besvare spørgsmål fra en interviewer, normalt en journalist, meningsmåler eller en anden form for agent, som indsamler information. @da
toolkit definition: Œuvre qui comporte une responsabilité de la part d’un agent collectif consistant à répondre à un intervieweur, habituellement un reporteur, un sondeur ou un autre type d’agent recueillant de l’information. @fr
toolkit definition: عمل يترتب عليه مسئولية وكيل جماعي عن الاستجابة لمحاور، وعادة ما يكون مراسلًا أو مستطلع رأي أو وكيل من نوع آخر يجمع معلومات. @ar
toolkit definition: 涉及回答采访者、记者、民意调查员行为者或其他类型信息搜集行为者的一集体个行为者的责任的一种作品 @zh-hans
toolkit label: Gemeinschaftlicher Akteur als Interviewte/Interviewter von @de
toolkit label: agent collectif interviewé d’une œuvre de @fr
toolkit label: agent col·lectiu entrevistat d’una obra de @ca
toolkit label: eserinin görüşülen kolektif temsilcisidir @tr
toolkit label: geïnterviewde collectieve actor van werk van @nl
toolkit label: interjúalany kollektív ágense a következő műnek: @hu
toolkit label: interviewee collective agent of work of @en
toolkit label: intervistato agente collettivo di opera di @it
toolkit label: intervjueeritav (kollektiiv) teoses @et
toolkit label: intervjuobjekt for verk for (kollektiv agent) @no
toolkit label: intervējamais (grupa) darbā @lv
toolkit label: kollektiv agent, som er interviewperson for værk af @da
toolkit label: teoksen haastateltava (yhteistoimija) teoksessa
toolkit label: συνεντευξιαζόμενος συλλογικός φορέας του έργου του @el
toolkit label: وكيل جماعي ضيف مقابلة في عمل @ar
toolkit label: ……的作品的受访者集体行为者 @zh-hans
has subproperty: teoksen haastateltava (yhteisö) teoksessa
has subproperty: teoksen haastateltava (suku) teoksessa
has subproperty: P50710
lexical alias: intervieweeCollectiveAgentOfWorkOf.en
status: Published
type: Property
domain: C10011
label: er intervjuobjekt for verk for (kollektiv agent) @no
label: er kollektiv agent, som er interviewperson for værk af @da
label: eserinin görüşülen kolektif temsilcisidir @tr
label: est un agent collectif interviewé d’une œuvre de @fr
label: interjúalany kollektív ágense a következő műnek: @hu
label: intervjueeritav (kollektiiv) teoses @et
label: ir intervējamais (grupa) darbā @lv
label: is geïnterviewde collectieve actor van werk van @nl
label: is interviewee collective agent of work of @en
label: ist gemeinschaftlicher Akteur als Interviewte/Interviewter eines Werks von @de
label: è intervistato agente collettivo di opera di @it
label: és agent col·lectiu entrevistat d’una obra de @ca
label: είναι συνεντευξιαζόμενος συλλογικός φορέας του έργου του @el
label: هو وكيل جماعي ضيف مقابلة في عمل لـ @ar
label: 是……的作品的受访者集体行为者 @zh-hans
sub property of: teoksen haastateltava (toimija) teoksessa
sub property of: teoksen tekijä (yhteistoimija) teoksessa
definition: Correla un agente collettivo a un'opera che implica una responsabilità di un agente collettivo nel rispondere a un intervistatore, solitamente un giornalista, sondaggista o altro tipo di agente che raccoglie informazioni. @it
definition: Hozzákapcsol egy kollektív ágenst egy műhöz, amelyhez hozzátartozik egy kollektív ágens felelőssége egy interjúkészítőnek, általában riporternek, közvélemény-kutatónak, vagy valamilyen más információgyűjtő ágensnek, adott válaszért. @hu
definition: Kolektif bir temsilciyi, genellikle bir muhabir, anketör veya bilgi toplayan başka bir tür aracı olan bir görüşmeciye yanıt verme sorumluluğunu içeren bir eserle ilişkilendirir. @tr
definition: Liittää yhteistoimijan teokseen, jossa yhteistoimija on vastuussa teoksen luomisesta vastaamalla haastattelijalle, tavallisesti toimittajalle, mielipidetutkijalle tai muulle tietoa keräävälle toimijalle.
definition: Met un agent collectif en relation avec une œuvre qui comporte une responsabilité de la part d’un agent collectif consistant à répondre à un intervieweur, habituellement un reporteur, un sondeur ou un autre type d’agent recueillant de l’information. @fr
definition: Relaciona un agent col·lectiu amb una obra que implica una responsabilitat d’un agent col·lectiu responent a un entrevistador, habitualment un periodista, un enquestador o qualsevol altre tipus d’agent que recull la informació. @ca
definition: Relateert een collectieve actor aan een werk dat met zich meebrengt een verantwoordelijkheid van een collectieve actor voor reageren op een interviewer, verslaggever, opiniepeiler of een andere soort actor die informatie verzamelt. @nl
definition: Relaterer en kollektiv agent til et verk som involverer et ansvar for en kollektiv agent i form av å svare på spørsmål fra en intervjuer, som oftest en reporter eller annen agent som samler inn informasjon. @no
definition: Relaterer en kollektiv agent til et værk, som involverer en kollektiv agents ansvar for at besvare spørgsmål fra en interviewer, normalt en journalist, meningsmåler eller en anden form for agent, som indsamler information. @da
definition: Relates a collective agent to a work that involves a responsibility of a collective agent for responding to an interviewer, usually a reporter, pollster, or some other kind of agent who gathers information. @en
definition: Sasaista grupu ar darbu, kas ietver grupas atbildību, atbildot uz intervētāja, parasti reportiera, aptaujas organizētāja vai kāda cita informācijas apkopotāja jautājumiem. @lv
definition: Seostab kollektiivi teosega, mis sisaldab kollektiivi vastutust intervjueerijale, reporterile, küsitlejale või muule infot koguvale tegijale vastamise eest. @et
definition: Setzt einen gemeinschaftlichen Akteur in Beziehung zu einem Werk, bei dem ein gemeinschaftlicher Akteur einer Interviewerin/einem Interviewer antwortet. Dabei handelt es sich normalerweise um eine Reporterin/einen Reporter, eine Meinungsforscherin/einen Meinungsforscher oder anderen Akteur, die/der Informationen zusammenträgt. @de
definition: يربط وكيلا جماعيا بعمل يترتب عليه مسئولية وكيل جماعي عن الاستجابة لمحاور، وعادة ما يكون مراسلًا أو مستطلع رأي أو وكيل من نوع آخر يجمع معلومات. @ar
definition: 将一个集体行为者与涉及回答采访者、记者、民意调查员行为者或其他类型信息搜集行为者的一集体个行为者的责任的一种作品关联起来。 @zh-hans

kokoaja (yhteistoimija) teoksessa
has element type: 2
toolkit definition: A work that involves a responsibility of a collective agent for creating a metadata description set. @en
toolkit definition: Bir üstveri seti oluşturmak için kolektif bir temsilcinin sorumluluğunu içeren bir eser. @tr
toolkit definition: Darbs, kas ietver grupas atbildību par datu un informācijas atlasi, sakārtošanu, apkopošanu un rediģēšanu tādam darbam kā bibliogrāfija vai rādītājs. @lv
toolkit definition: Een werk dat met zich meebrengt een verantwoordelijkheid van een collectieve actor voor selecteren, arrangeren, verzamelen en redigeren van data en informatie voor een werk zoals een bibliografie of een adresboek. @nl
toolkit definition: Egy mű, amelyhez hozzátartozik egy kollektív ágens felelőssége a kiválasztásáért, elrendezésért, aggregálásért, adatok és információk szerkesztéséért egy olyan mű számára, mint egy bibliográfia vagy egy címtár. @hu
toolkit definition: Ein Werk, bei dem ein gemeinschaftlicher Akteur für das Selektieren, Gliedern, Aggregieren und Editieren von Daten und Informationen für ein Werk, zum Beispiel einer Bibliografie oder eines Verzeichnisses, verantwortlich ist. @de
toolkit definition: Et verk som involverer et ansvar for en kollektiv agent i form av utvelgelse, arrangering, samling og redigering av data og informasjon for et verk slik som en bibliografi eller en katalog. @no
toolkit definition: Obra que implica una responsabilitat d’un agent col·lectiu en la creació d’un conjunt de descripció de metadades. @ca
toolkit definition: Opera che implica una responsabilità di un agente collettivo nella selezione, disposizione, aggregazione e redazione di dati e informazioni per un'opera come una bibliografia o una directory. @it
toolkit definition: Teos, jossa yhteistoimija on vastuussa metatietokokonaisuuden luomisesta.
toolkit definition: Teos, mis sisaldab kollektiivi vastutust andmete ja info valimise, korrastamise, koondamise ja toimetamise eest teose, nt bibliograafia või teatmiku jaoks. @et
toolkit definition: Værk, som involverer en kollektiv agents ansvar for at udvælge, arrangere, sammenlægge og redigere data og information til et værk, såsom en bibliografi eller en fortegnelse. @da
toolkit definition: Œuvre qui comporte une responsabilité de la part d’un agent collectif consistant à créer un ensemble de métadonnées descriptives. @fr
toolkit definition: عمل يترتب عليه مسئولية وكيل جماعي عن اختيار البيانات والمعلومات للعمل وترتيبها وتجميعها وتحريرها في ببليوجرافية أو في دليل. @ar
toolkit definition: 涉及创建一个元数据描述集的一个集体行为者的责任的一种作品 @zh-hans
toolkit label: Gemeinschaftlicher Akteur als Zusammenstellende/Zusammenstellender von @de
toolkit label: agent collectif compilateur de @fr
toolkit label: agent col·lectiu compilador de @ca
toolkit label: compilatore agente collettivo di @it
toolkit label: compiler collective agent of @en
toolkit label: derleyici kolektif temsilci @tr
toolkit label: ir sastādītājs (grupa) @lv
toolkit label: kokoaja (yhteistoimija) teoksessa
toolkit label: kollektiv agent, som er kompilator af @da
toolkit label: koostaja (kollektiiv) teoses @et
toolkit label: samensteller-collectieve actor van @nl
toolkit label: utarbeider for (kollektiv agent) @no
toolkit label: összeállító kollektív ágense: @hu
toolkit label: συμπιλητής συλλογικός φορέας του @el
toolkit label: وكيل جماعي جامع @ar
toolkit label: ……的编纂者集体行为者 @zh-hans
has subproperty: kokoaja (yhteisö) teoksessa
has subproperty: kokoaja (suku) teoksessa
has subproperty: kokoelman luetteloija (yhteistoimija) teokselle
has subproperty: P50711
lexical alias: compilerCollectiveAgentOf.en
status: Published
type: Property
domain: C10011
label: derleyici kolektif temsilcisidir @tr
label: er kollektiv agent, som er kompilator af @da
label: er utarbeider for (kollektiv agent) @no
label: est un agent collectif compilateur de @fr
label: ir sastādītājs (grupa) @lv
label: is compiler collective agent of @en
label: is samensteller-collectieve actor van @nl
label: ist gemeinschaftlicher Akteur als Zusammenstellende/Zusammenstellender von @de
label: koostaja (kollektiiv) teoses @et
label: è compilatore agente collettivo di @it
label: és agent col·lectiu compilador de @ca
label: összeállító kollektív ágense a következőnek: @hu
label: είναι συμπιλητής συλλογικός φορέας του @el
label: هو وكيل جماعي جامع لـ @ar
label: 是……的编纂者集体行为者 @zh-hans
sub property of: kokoaja (toimija) teoksessa
sub property of: aggregaattori (yhteistoimija) teoksessa
definition: Correla un agente collettivo a un'opera che implica una responsabilità di un agente collettivo nella selezione, disposizione, aggregazione e redazione di dati e informazioni per un'opera come una bibliografia o una directory. @it
definition: Hozzákapcsol egy kollektív ágenst egy műhöz, amelyhez hozzátartozik egy kollektív ágens felelőssége a kiválasztásáért, elrendezésért, aggregálásért, adatok és információk szerkesztéséért egy olyan mű számára, mint egy bibliográfia vagy egy címtár. @hu
definition: Kolektif bir temsilci, bir üst veri tanımlama seti oluşturmak için kolektif bir temsilcinin sorumluluğunu içeren bir eserle ilişkilendirir. @tr
definition: Liittää yhteistoimijan teokseen, jossa yhteistoimija on vastuussa metatietokokonaisuuden luomisesta.
definition: Met un agent collectif en relation avec une œuvre qui comporte une responsabilité de la part d’un agent collectif consistant à créer un ensemble de métadonnées descriptives. @fr
definition: Relaciona un agent col·lectiu amb una obra que implica una responsabilitat d’un agent col·lectiu en la creació d’un conjunt de descripció de metadades. @ca
definition: Relateert een collectieve actor aan een werk dat met zich meebrengt een verantwoordelijkheid van een collectieve actor voor selecteren, arrangeren, verzamelen en redigeren van data en informatie voor een werk zoals een bibliografie of een adresboek. @nl
definition: Relaterer en kollektiv agent til et verk som involverer et ansvar for en kollektiv agent i form av utvelgelse, arrangering, samling og redigering av data og informasjon for et verk slik som en bibliografi eller en katalog. @no
definition: Relaterer en kollektiv agent til et værk, som involverer en kollektiv agents ansvar for at udvælge, arrangere, sammenlægge og redigere data og information til et værk, såsom en bibliografi eller en fortegnelse. @da
definition: Relates a collective agent to a work that involves a responsibility of a collective agent for creating a metadata description set. @en
definition: Sasaista grupu ar darbu, kas ietver grupas atbildību par datu un informācijas atlasi, sakārtošanu, apkopošanu un rediģēšanu tādam darbam kā bibliogrāfija vai rādītājs. @lv
definition: Seostab kollektiivi teosega, mis sisaldab kollektiivi vastutust andmete ja info valimise, korrastamise, koondamise ja toimetamise eest teose, nt bibliograafia või teatmiku jaoks. @et
definition: Setzt einen gemeinschaftlichen Akteur in Beziehung zu einem Werk, bei dem ein gemeinschaftlicher Akteur für das Selektieren, Gliedern, Aggregieren und Editieren von Daten und Informationen für ein Werk, zum Beispiel einer Bibliografie oder eines Verzeichnisses, verantwortlich ist. @de
definition: يربط وكيلا جماعيا بعمل يترتب عليه مسئولية وكيل جماعي عن اختيار البيانات والمعلومات للعمل وترتيبها وتجميعها وتحريرها في ببليوجرافية أو في دليل. @ar
definition: 将一个集体行为者与涉及创建一个元数据描述集的一个集体行为者的责任的一种作品关联起来。 @zh-hans
scope note: A metadata description set includes a bibliography of works, expressions, or manifestations, a directory of agents and places, and an analytic finding aid. @en
scope note: Bir üstveri seti, eserlerin, anlatımların veya gösterimlerin bir bibliyografyasını, temsilciler ve yerler dizinini ve analitik rehber bilgi içerir. @tr
scope note: Darunter fallen keine Überarbeitungen oder Erläuterungen des Inhalts einer Expression eines Werks und die Auswahl und Zusammenstellung von Expressionen von Werken oder Teilen von Werken. @de
scope note: Det å redigere innholdet i et uttrykk av et verk eller gjøre det klarere, eller velge ut og kombinere uttrykk av et verk eller deler av et verk, er ikke inkludert. @no
scope note: Ei hõlma teose väljenduse sisu läbivaatamist ja parandamist ega teoste või nende osade väljenduste väljavalimist ja kokkupanemist. @et
scope note: Herzien of verduidelijken van de inhoud van een expressie van een werk en selecteren en combineren van expressies van werken of delen van werken zijn uitgesloten. @nl
scope note: Metatietokokonaisuus kattaa teosten, ekspressioiden tai manifestaatioiden bibliografian, toimija- tai paikkahakemiston ja analyyttisen luettelon.

ohjaaja (yhteistoimija) teoksessa
has element type: 2
toolkit definition: A work that involves a responsibility of a collective agent for the general management and supervision of a filmed performance, a radio or television program, etc. @en
toolkit definition: Darbs, kas ietver grupas atbildību par vispārējo vadību un par filmētā materiāla, radio vai televīzijas raidījuma, u.tml. uzraudzību. @lv
toolkit definition: Een werk dat met zich meebrengt een verantwoordelijkheid van een collectieve actor voor het algemene beheer en toezicht van een gefilmde uitvoering, een radio- of televisieprogramma etc. @nl
toolkit definition: Egy mű, amelyhez hozzátartozik egy kollektív ágens felelőssége egy filmforgatás, egy rádió- vagy televízióműsor, stb. általános menedzseléséért és felügyeletéért. @hu
toolkit definition: Ein Werk, bei dem ein gemeinschaftlicher Akteur für das allgemeine Management und die Leitung einer verfilmten Darbietung, einer Hörfunk- oder Fernsehsendung und so weiter verantwortlich ist. @de
toolkit definition: Et verk som involverer et ansvar for en kollektiv agent for den generelle ledelsen og tilsyn med en filmet forestilling, et radio- eller fjernsynsprogram etc. @no
toolkit definition: Filme alınmış bir performansın, bir radyo veya televizyon programının vb. genel yönetimi ve denetimi için kolektif bir temsilcinin sorumluluğunu içeren bir eser. @tr
toolkit definition: Obra que implica una responsabilitat d’un agent col·lectiu en la gestió general i la supervisió d’una actuació filmada, d’un programa radiofònic o de televisió, etc. @ca
toolkit definition: Opera che implica una responsabilità di un agente collettivo per la gestione e supervisione generale di un'interpretazione filmata, programma radiofonico o televisivo, etc. @it
toolkit definition: Teos, jossa yhteistoimija on vastuussa elokuvatun esityksen, radio- tai televisio-ohjelman tms. yleisestä johtamisesta.
toolkit definition: Teos, mis sisaldab kollektiivi vastutust filmitava etenduse, raadio- või telesaate vms üldise juhtimise ja juhendamise eest. @et
toolkit definition: Værk, som involverer en kollektiv agents ansvar for den generelle ledelse af- og tilsyn med en filmoptagelse, et radio- eller tv-program etc. @da
toolkit definition: Œuvre qui comporte une responsabilité de la part d’un agent collectif consistant à assurer la gestion et la supervision générales d’une prestation filmée, d’une émission de radio ou de télévision, etc. @fr
toolkit definition: عمل يترتب عليه مسئولية وكيل جماعي عن الإدارة العامة، والإشراف على أداء مصور، أو برنامج إذاعي أو تليفزيوني، إلخ. @ar
toolkit definition: 涉及电影表演、广播或电视节目等的全面管理和监督的一个集体行为者的责任的一种作品 @zh-hans
toolkit label: Gemeinschaftlicher Akteur als Regisseurin/Regisseur von @de
toolkit label: agent collectif réalisateur de @fr
toolkit label: agent col·lectiu realitzador de @ca
toolkit label: director collective agent of @en
toolkit label: direttore agente collettivo di @it
toolkit label: ir režisors (grupa) @lv
toolkit label: kollektiv agent, som er instruktør af @da
toolkit label: ohjaaja (yhteistoimija) teoksessa
toolkit label: regisseur-collectieve actor van @nl
toolkit label: regissør av (kollektiv agent) @no
toolkit label: rendező kollektív ágense: @hu
toolkit label: režissöör (kollektiiv) teoses @et
toolkit label: yönetmen kolektif temsilcisi @tr
toolkit label: διευθυντής συλλογικός φορέας του @el
toolkit label: وكيل جماعي مخرج @ar
toolkit label: ……的导演集体行为者 @zh-hans
has subproperty: elokuvaohjaaja (yhteistoimija) teoksessa
has subproperty: radio-ohjaaja (yhteistoimija) teoksessa
has subproperty: televisio-ohjaaja (yhteistoimija) teoksessa
has subproperty: ohjaaja (yhteisö) teoksessa
has subproperty: ohjaaja (suku) teoksessa
has subproperty: P50712
lexical alias: directorCollectiveAgentOf.en
status: Published
type: Property
domain: C10011
label: er kollektiv agent, som er instruktør af @da
label: er regissør av (kollektiv agent) @no
label: est un agent collectif réalisateur de @fr
label: ir režisors (grupa) @lv
label: is director collective agent of @en
label: is regisseur-collectieve actor van @nl
label: ist gemeinschaftlicher Akteur als Regisseurin/Regisseur von @de
label: rendező kollektív ágense a következőnek: @hu
label: režissöör (kollektiiv) teoses @et
label: yönetmen kolektif temsilisidir @tr
label: è direttore agente collettivo di @it
label: és agent col·lectiu realitzador de @ca
label: είναι διευθυντής συλλογικός φορέας του @el
label: هو وكيل جماعي مخرج لـ @ar
label: 是……的导演集体行为者 @zh-hans
sub property of: ohjaaja (toimija) teoksessa
sub property of: yhteistoimijaan liittyvä teos
definition: Correla un agente collettivo a un'opera che implica una responsabilità di un agente collettivo per la gestione e supervisione generale di un'interpretazione filmata, programma radiofonico o televisivo, etc. @it
definition: Hozzákapcsol egy kollektív ágenst egy műhöz, amelyhez hozzátartozik egy kollektív ágens felelőssége egy filmforgatás, egy rádió- vagy televízióműsor, stb. általános menedzseléséért és felügyeletéért. @hu
definition: Kolektif bir temsilciyi, filme alınmış bir performansın, bir radyo veya televizyon programının vb. genel yönetimi ve denetimi için bir kolektif temsilcinin sorumluluğunu içeren bir eserle ilişkilendirir. @tr
definition: Liittää yhteistoimijan teokseen, jossa yhteistoimija on vastuussa elokuvatun esityksen, radio- tai televisio-ohjelman tms. yleisestä johtamisesta.
definition: Met un agent collectif en relation avec une œuvre qui comporte une responsabilité de la part d’un agent collectif consistant à assurer la gestion et la supervision générales d’une prestation filmée, d’une émission de radio ou de télévision, etc. @fr
definition: Relaciona un agent col·lectiu amb una obra que implica una responsabilitat d’un agent col·lectiu en la gestió general i la supervisió d’una actuació filmada, d’un programa radiofònic o de televisió, etc. @ca
definition: Relateert een collectieve actor aan een werk dat met zich meebrengt een verantwoordelijkheid van een collectieve actor voor het algemene beheer en toezicht van een gefilmde uitvoering, een radio- of televisieprogramma etc. @nl
definition: Relaterer en kollektiv agent til et verk som involverer et ansvar for en kollektiv agent for den generelle ledelsen og tilsyn med en filmet forestilling, et radio- eller fjernsynsprogram etc. @no
definition: Relaterer en kollektiv agent til et værk, som involverer en kollektiv agents ansvar for den generelle ledelse af- og tilsyn med en filmoptagelse, et radio- eller tv-program etc. @da
definition: Relates a collective agent to a work that involves a responsibility of a collective agent for the general management and supervision of a filmed performance, a radio or television program, etc. @en
definition: Sasaista grupu ar darbu, kas ietver grupas atbildību par vispārējo vadību un par filmētā materiāla, radio vai televīzijas raidījuma, u.tml. uzraudzību. @lv
definition: Seostab kollektiivi teosega, mis sisaldab kollektiivi vastutust filmitava etenduse, raadio- või telesaate vms üldise juhtimise ja juhendamise eest. @et
definition: Setzt einen gemeinschaftlichen Akteur in Beziehung zu einem Werk, bei dem ein gemeinschaftlicher Akteur für das allgemeine Management und die Leitung einer verfilmten Darbietung, einer Hörfunk- oder Fernsehsendung und so weiter verantwortlich ist. @de
definition: يربط وكيلا جماعيا بعمل يترتب عليه مسئولية وكيل جماعي عن الإدارة العامة، والإشراف على أداء مصور، أو برنامج إذاعي أو تليفزيوني، إلخ. @ar
definition: 将一个集体行为者与涉及电影表演、广播或电视节目等的全面管理和监督的一个集体行为者的责任的一种作品关联起来。 @zh-hans

elokuvaohjaaja (yhteistoimija) teoksessa
has element type: 2
toolkit definition: A work that involves a responsibility of a collective agent for the general management and supervision of a filmed performance. @en
toolkit definition: Darbs, kas ietver grupas atbildību par uzfilmētā pasākuma vispārējo vadību un uzraudzību @lv
toolkit definition: Een werk dat met zich meebrengt een verantwoordelijkheid van een collectieve actor voor het algemeen beheer en toezicht van een gefilmde uitvoering. @nl
toolkit definition: Egy mű, amelyhez hozzátartozik egy kollektív ágens felelőssége egy filmforgatás általános menedzseléséért és felügyeletéért. @hu
toolkit definition: Ein Werk, bei dem ein gemeinschaftlicher Akteur für das allgemeine Management und die Leitung einer verfilmten Darbietung verantwortlich ist. @de
toolkit definition: Et verk som involverer et ansvar for en kollektiv agent for den generelle ledelsen og tilsyn med en filmet forestilling. @no
toolkit definition: Filme alınmış bir performansın genel yönetimi ve denetimi için kollektif bir temsilcinin sorumluluğunu içeren bir eser. @tr
toolkit definition: Obra que implica una responsabilitat d’un agent col·lectiu en la gestió general i la supervisió d’una actuació filmada. @ca
toolkit definition: Opera che implica una responsabilità di un agente collettivo per la gestione e supervisione generale di un'interpretazione filmata. @it
toolkit definition: Teos, joka sisältää vastuun elokuvatun esityksen yleisestä johtamisesta ja valvonnasta.
toolkit definition: Teos, mis sisaldab kollektiivi vastutust filmitava etenduse üldise juhtimise ja juhendamise eest. @et
toolkit definition: Værk, som involverer en kollektiv agents ansvar for den generelle ledelse af- og tilsyn med en filmoptagelse. @da
toolkit definition: Œuvre qui comporte une responsabilité de la part d’un agent collectif consistant à assurer la gestion et la supervision générales d’une prestation filmée. @fr
toolkit definition: عمل يترتب عليه مسئولية وكيل جماعي عن الإدارة العامة والإشراف على أداء مصور. @ar
toolkit definition: 涉及拍摄表演的总体管理和监督的一个集体行为者的责任的一种作品 @zh-hans
toolkit label: Gemeinschaftlicher Akteur als Filmregisseurin/Filmregisseur von @de
toolkit label: agent collectif réalisateur de cinéma de @fr
toolkit label: agent col·lectiu director cinematogràfic de @ca
toolkit label: elokuvaohjaaja (yhteistoimija) teoksessa
toolkit label: film director collective agent of @en
toolkit label: film yönetmeni kolektif temsilcisi @tr
toolkit label: filmirežissöör (kollektiiv) teoses @et
toolkit label: filmregisseur-collectieve actor van @nl
toolkit label: filmregissør for (kollektiv agent) @no
toolkit label: filmrendező kollektív ágense: @hu
toolkit label: ir kinorežisors (grupa) @lv
toolkit label: kollektiv agent, som er filminstruktør af @da
toolkit label: regista cinematografico agente collettivo di @it
toolkit label: σκηνοθέτης συλλογικός φορέας του @el
toolkit label: وكيل جماعي مخرج فيلم @ar
toolkit label: ……的电影导演集体行为者 @zh-hans
has subproperty: elokuvaohjaaja (yhteisö) teoksessa
has subproperty: elokuvaohjaaja (suku) teoksessa
has subproperty: P50713
lexical alias: filmDirectorCollectiveAgentOf.en
status: Published
type: Property
domain: C10011
label: er filmregissør for (kollektiv agent) @no
label: er kollektiv agent, som er filminstruktør af @da
label: est un agent collectif réalisateur de cinéma de @fr
label: film yönetmeni kolektif temsilcisidir @tr
label: filmirežissöör (kollektiiv) teoses @et
label: filmrendező kollektív ágense a következőnek: @hu
label: ir kinorežisors (grupa) @lv
label: is film director collective agent of @en
label: is filmregisseur-collectieve actor van @nl
label: ist gemeinschaftlicher Akteur als Filmregisseurin/Filmregisseur von @de
label: è regista cinematografico agente collettivo di @it
label: és agent col·lectiu director cinematogràfic de @ca
label: είναι σκηνοθέτης συλλογικός φορέας του @el
label: هو وكيل جماعي مخرج الفيلم لـ @ar
label: 是……的电影导演集体行为者 @zh-hans
sub property of: elokuvaohjaaja (toimija) teoksessa
sub property of: ohjaaja (yhteistoimija) teoksessa
alternative label: agent collectif réalisateur de film de @fr
definition: Correla un agente collettivo a un'opera che implica una responsabilità di un agente collettivo per la gestione e supervisione generale di un'interpretazione filmata. @it
definition: Hozzákapcsol egy kollektív ágenst egy műhöz, amelyhez hozzátartozik egy kollektív ágens felelőssége egy filmforgatás általános menedzseléséért és felügyeletéért. @hu
definition: Kolektif bir temsilciyi, filme alınmış bir performansın genel yönetimi ve denetimi için bir kolektif temsilcinin sorumluluğunu içeren bir eserle ilişkilendirir. @tr
definition: Liittää yhteistoimijan teokseen, joka sisältää vastuun elokuvatun esityksen yleisestä johtamisesta ja valvonnasta.
definition: Met un agent collectif en relation avec une œuvre qui comporte une responsabilité de la part d’un agent collectif consistant à assurer la gestion et la supervision générales d’une prestation filmée. @fr
definition: Relaciona un agent col·lectiu amb una obra que implica una responsabilitat d’un agent col·lectiu en la gestió general i la supervisió d’una actuació filmada. @ca
definition: Relateert een collectieve actor aan een werk dat met zich meebrengt een verantwoordelijkheid van een collectieve actor voor het algemeen beheer en toezicht van een gefilmde uitvoering. @nl
definition: Relaterer en kollektiv agent til et verk som involverer et ansvar for en kollektiv agent for den generelle ledelsen og tilsyn med en filmet forestilling. @no
definition: Relaterer en kollektiv agent til et værk, som involverer en kollektiv agents ansvar for den generelle ledelse af- og tilsyn med en filmoptagelse. @da
definition: Relates a collective agent to a work that involves a responsibility of a collective agent for the general management and supervision of a filmed performance. @en
definition: Sasaista grupu ar darbu, kas ietver grupas atbildību par uzfilmētā pasākuma vispārējo vadību un uzraudzību. @lv
definition: Seostab kollektiivi teosega, mis sisaldab kollektiivi vastutust filmitava etenduse üldise juhtimise ja juhendamise eest. @et
definition: Setzt einen gemeinschaftlichen Akteur in Beziehung zu einem Werk, bei dem ein gemeinschaftlicher Akteur für das allgemeine Management und die Leitung einer verfilmten Darbietung verantwortlich ist. @de
definition: يربط وكيلا جماعيا بعمل يترتب عليه مسئولية وكيل جماعي عن الإدارة العامة والإشراف على أداء مصور. @ar
definition: 将一个集体行为者与涉及拍摄表演的总体管理和监督的一个集体行为者的责任的一种作品关联起来。 @zh-hans

radio-ohjaaja (yhteistoimija) teoksessa
has element type: 2
toolkit definition: A work that involves a responsibility of a collective agent for the general management and supervision of a radio program. @en
toolkit definition: Bir radyo programının genel yönetimi ve denetimi için kollektif bir temsilcinin sorumluluğunu içeren bir çalışma. @tr
toolkit definition: Darbs, kas ietver grupas atbildību par radio raidījuma vispārējo vadību un uzraudzību. @lv
toolkit definition: Een werk dat met zich meebrengt een verantwoordelijkheid van een collectieve actor voor het algemeen beheer en toezicht van een radioprogramma. @nl
toolkit definition: Egy mű, amelyhez hozzátartozik egy kollektív ágens felelőssége egy rádióműsor általános menedzseléséért és felügyeletéért. @hu
toolkit definition: Ein Werk, bei dem ein gemeinschaftlicher Akteur für das allgemeine Management und die Leitung einer Hörfunksendung verantwortlich ist. @de
toolkit definition: Et verk som involverer et ansvar for en kollektiv agent for den generelle ledelsen og tilsyn med et radioprogram. @no
toolkit definition: Obra que implica una responsabilitat d’un agent col·lectiu en la gestió general i la supervisió d’un programa radiofònic. @ca
toolkit definition: Opera che implica una responsabilità di un agente collettivo per la gestione e supervisione generale di un programma radiofonico. @it
toolkit definition: Teos, joka sisältää vastuun radio-ohjelman yleisestä johtamisesta ja valvonnasta.
toolkit definition: Teos, mis sisaldab kollektiivi vastutust raadiosaate üldise juhtimise ja juhendamise eest. @et
toolkit definition: Værk, som involverer en kollektiv agents ansvar for den generelle ledelse af- og tilsyn med et radioprogram. @da
toolkit definition: Œuvre qui comporte une responsabilité de la part d’un agent collectif consistant à assurer la gestion et la supervision générales d’une émission de radio. @fr
toolkit definition: عمل يترتب عليه مسئولية وكيل جماعي عن الإدارة العامة والإشراف على برنامج إذاعي. @ar
toolkit definition: 涉及广播节目的总体管理和监督的一个集体行为者的责任的一种作品 @zh-hans
toolkit label: Gemeinschaftlicher Akteur als Hörfunkregisseurin/Hörfunkregisseur von @de
toolkit label: agent collectif réalisateur de radio de @fr
toolkit label: agent col·lectiu realitzador radiofònic de @ca
toolkit label: ir radio raidījuma direktors (grupa) @lv
toolkit label: kollektiv agent, som er radioregissør af @da
toolkit label: raadiorežissöör (kollektiiv) teoses @et
toolkit label: radio director collective agent of @en
toolkit label: radio-ohjaaja (yhteistoimija) teoksessa
toolkit label: radioregisseur-collectieve actor van @nl
toolkit label: radioregissør for (kollektiv agent) @no
toolkit label: radyo yönetmeni kolektif temsilcisi @tr
toolkit label: regista radiofonico agente collettivo di @it
toolkit label: rádiós rendező kollektív ágense: @hu
toolkit label: διευθυντής ραδιοφώνου συλλογικός φορέας του @el
toolkit label: وكيل جماعي مخرج إذاعي @ar
toolkit label: ……的广播导演集体行为者 @zh-hans
has subproperty: radio-ohjaaja (yhteisö) teoksessa
has subproperty: radio-ohjaaja (suku) teoksessa
has subproperty: P50714
lexical alias: radioDirectorCollectiveAgentOf.en
status: Published
type: Property
domain: C10011
label: er kollektiv agent, som er radioregissør af @da
label: er radioregissør for (kollektiv agent) @no
label: est un agent collectif réalisateur de radio de @fr
label: ir radio raidījuma direktors (grupa) @lv
label: is radio director collective agent of @en
label: is radioregisseur-collectieve actor van @nl
label: ist gemeinschaftlicher Akteur als Hörfunkregisseurin/Hörfunkregisseur von @de
label: raadiorežissöör (kollektiiv) teoses @et
label: radyo yönetmeni kolektif temsilcisidir @tr
label: rádiós rendező kollektív ágense a következőnek: @hu
label: è regista radiofonico agente collettivo di @it
label: és agent col·lectiu realitzador radiofònic de @ca
label: είναι διευθυντής ραδιοφώνου συλλογικός φορέας του @el
label: هو وكيل جماعي مخرج إذاعي لـ @ar
label: 是……的广播导演集体行为者 @zh-hans
sub property of: radio-ohjaaja (toimija) teoksessa
sub property of: ohjaaja (yhteistoimija) teoksessa
definition: Correla un agente collettivo a un'opera che implica una responsabilità di un agente collettivo per la gestione e supervisione generale di un programma radiofonico. @it
definition: Hozzákapcsol egy kollektív ágenst egy műhöz, amelyhez hozzátartozik egy kollektív ágens felelőssége egy rádióműsor általános menedzseléséért és felügyeletéért. @hu
definition: Kolektif bir temsilciyi, bir radyo programının genel yönetimi ve denetimi için kolektif bir temsilcinin sorumluluğunu içeren bir eserle ile bir ilişkilendirir. @tr
definition: Liittää yhteistoimijan teokseen, joka sisältää vastuun radio-ohjelman yleisestä johtamisesta ja valvonnasta.
definition: Met un agent collectif en relation avec une œuvre qui comporte une responsabilité de la part d’un agent collectif consistant à assurer la gestion et la supervision générales d’une émission de radio. @fr
definition: Relaciona un agent col·lectiu amb una obra que implica una responsabilitat d’un agent col·lectiu en la gestió general i la supervisió d’un programa radiofònic. @ca
definition: Relateert een collectieve actor aan een werk dat met zich meebrengt een verantwoordelijkheid van een collectieve actor voor het algemeen beheer en toezicht van een radioprogramma. @nl
definition: Relaterer en kollektiv agent til et verk som involverer et ansvar for en kollektiv agent for den generelle ledelsen og tilsyn med et radioprogram. @no
definition: Relaterer en kollektiv agent til et værk, som involverer en kollektiv agents ansvar for den generelle ledelse af- og tilsyn med et radioprogram. @da
definition: Relates a collective agent to a work that involves a responsibility of a collective agent for the general management and supervision of a radio program. @en
definition: Sasaista grupu ar darbu, kas ietver grupas atbildību par radio raidījuma vispārējo vadību un uzraudzību. @lv
definition: Seostab kollektiivi teosega, mis sisaldab kollektiivi vastutust raadiosaate üldise juhtimise ja juhendamise eest. @et
definition: Setzt einen gemeinschaftlichen Akteur in Beziehung zu einem Werk, bei dem ein gemeinschaftlicher Akteur für das allgemeine Management und die Leitung einer Hörfunksendung verantwortlich ist. @de
definition: يربط وكيلا جماعيا بعمل يترتب عليه مسئولية وكيل جماعي عن الإدارة العامة والإشراف على برنامج إذاعي. @ar
definition: 将一个集体行为者与涉及广播节目的总体管理和监督的一个集体行为者的责任的一种作品关联起来。 @zh-hans

televisio-ohjaaja (yhteistoimija) teoksessa
has element type: 2
toolkit definition: A work that involves a responsibility of a collective agent for the general management and supervision of a television program. @en
toolkit definition: Bir televizyon programının genel yönetimi ve denetimi için kolektif bir temsilcinin sorumluluğunu içeren bir çalışma. @tr
toolkit definition: Darbs, kas ietver grupas atbildību par televīzijas raidījuma vispārēju vadību un uzraudzību. @lv
toolkit definition: Een werk dat met zich meebrengt een verantwoordelijkheid van een collectieve actor voor het algemeen beheer en toezicht van een televisieprogramma. @nl
toolkit definition: Egy mű, amelyhez hozzátartozik egy kollektív ágens felelőssége egy televízióműsor általános menedzseléséért és felügyeletéért. @hu
toolkit definition: Ein Werk, bei dem ein gemeinschaftlicher Akteur für das allgemeine Management und die Leitung einer Fernsehsendung verantwortlich ist. @de
toolkit definition: Et verk som involverer et ansvar for en kollektiv agent for den generelle ledelsen og tilsyn med et fjernsynsprogram. @no
toolkit definition: Obra que implica una responsabilitat d’un agent col·lectiu en la gestió general i la supervisió d’un programa de televisió. @ca
toolkit definition: Opera che implica una responsabilità di un agente collettivo per la gestione e supervisione generale di un programma televisivo. @it
toolkit definition: Teos, joka sisältää vastuun televisio-ohjelman yleisestä johtamisesta ja valvonnasta.
toolkit definition: Teos, mis sisaldab kollektiivi vastutust telesaate üldise juhtimise ja juhendamise eest. @et
toolkit definition: Værk, som involverer en kollektiv agents ansvar for den generelle ledelse af- og tilsyn med et tv-program. @da
toolkit definition: Œuvre qui comporte une responsabilité de la part d’un agent collectif consistant à assurer la gestion et la supervision générales d’une émission de télévision. @fr
toolkit definition: عمل يترتب عليه مسئولية وكيل جماعي عن الإدارة العامة والإشراف على برنامج تليفزيوني. @ar
toolkit definition: 涉及电视节目的总体管理和监督的一个集体行为者的责任的一种作品 @zh-hans
toolkit label: Gemeinschaftlicher Akteur als Fernsehregisseurin/Fernsehregisseur von @de
toolkit label: agent collectif réalisateur de télévision de @fr
toolkit label: agent col·lectiu realitzador de televisió de @ca
toolkit label: fjernsynsregissør for (kollektiv agent) @no
toolkit label: ir televīzijas raidījuma direktors (grupa) @lv
toolkit label: kollektiv agent, som er tv-regissør af @da
toolkit label: regista televisivo agente collettivo di @it
toolkit label: telerežissöör (kollektiiv) teoses @et
toolkit label: televisieregisseur-collectieve actor van @nl
toolkit label: televisio-ohjaaja (yhteistoimija) teoksessa
toolkit label: television director collective agent of @en
toolkit label: televizyon yönetmeni kolektif temsilci @tr
toolkit label: televíziós rendező kollektív ágense: @hu
toolkit label: τηλεοπτικός διευθυντής συλλογικός φορέας του @el
toolkit label: وكيل جماعي مخرج تليفزيوني @ar
toolkit label: ……的电视导演集体行为者 @zh-hans
has subproperty: televisio-ohjaaja (yhteisö) teoksessa
has subproperty: televisio-ohjaaja (suku) teoksessa
has subproperty: P50715
lexical alias: televisionDirectorCollectiveAgentOf.en
status: Published
type: Property
domain: C10011
label: er fjernsynsregissør for (kollektiv agent) @no
label: er kollektiv agent, som er tv-regissør af @da
label: est un agent collectif réalisateur de télévision de @fr
label: ir televīzijas raidījuma direktors (grupa) @lv
label: is televisieregisseur-collectieve actor van @nl
label: is television director collective agent of @en
label: ist gemeinschaftlicher Akteur als Fernsehregisseurin/Fernsehregisseur von @de
label: telerežissöör (kollektiiv) teoses @et
label: televizyon yönetmeni kolektif temsilcidir @tr
label: televíziós rendező kollektív ágense a következőnek: @hu
label: è regista televisivo agente collettivo di @it
label: és agent col·lectiu realitzador de televisió de @ca
label: είναι τηλεοπτικός διευθυντής συλλογικός φορέας του @el
label: هو وكيل جماعي مخرج تليفزيوني لـ @ar
label: 是……的电视导演集体行为者 @zh-hans
sub property of: televisio-ohjaaja (toimija) teoksessa
sub property of: ohjaaja (yhteistoimija) teoksessa
definition: Correla un agente collettivo a un'opera che implica una responsabilità di un agente collettivo per la gestione e supervisione generale di un programma televisivo. @it
definition: Hozzákapcsol egy kollektív ágenst egy műhöz, amelyhez hozzátartozik egy kollektív ágens felelőssége egy televízióműsor általános menedzseléséért és felügyeletéért. @hu
definition: Kollektif bir temsilciyi, bir televizyon programının genel yönetimi ve denetimi için kollektif temsilcinin sorumluluğunu içeren bir eserle ilişkilendirir. @tr
definition: Liittää yhteistoimijan teokseen, joka sisältää vastuun televisio-ohjelman yleisestä johtamisesta ja valvonnasta.
definition: Met un agent collectif en relation avec une œuvre qui comporte une responsabilité de la part d’un agent collectif consistant à assurer la gestion et la supervision générales d’une émission de télévision. @fr
definition: Relaciona un agent col·lectiu amb una obra que implica una responsabilitat d’un agent col·lectiu en la gestió general i la supervisió d’un programa de televisió. @ca
definition: Relateert een collectieve actor aan een werk dat met zich meebrengt een verantwoordelijkheid van een collectieve actor voor het algemeen beheer en toezicht van een televisieprogramma. @nl
definition: Relaterer en kollektiv agent til et verk som involverer et ansvar for en kollektiv agent for den generelle ledelsen og tilsyn med et fjernsynsprogram. @no
definition: Relaterer en kollektiv agent til et værk, som involverer en kollektiv agents ansvar for den generelle ledelse af- og tilsyn med et tv-program. @da
definition: Relates a collective agent to a work that involves a responsibility of a collective agent for the general management and supervision of a television program. @en
definition: Sasaista grupu ar darbu, kas ietver grupas atbildību par televīzijas raidījuma vispārēju vadību un uzraudzību. @lv
definition: Seostab kollektiivi teosega, mis sisaldab kollektiivi vastutust telesaate üldise juhtimise ja juhendamise eest. @et
definition: Setzt einen gemeinschaftlichen Akteur in Beziehung zu einem Werk, bei dem ein gemeinschaftlicher Akteur für das allgemeine Management und die Leitung einer Fernsehsendung verantwortlich ist. @de
definition: يربط وكيلا جماعيا بعمل يترتب عليه مسئولية وكيل جماعي عن الإدارة العامة والإشراف على برنامج تليفزيوني. @ar
definition: 将一个集体行为者与涉及电视节目的总体管理和监督的一个集体行为者的责任的一种作品关联起来。 @zh-hans

kuvanveistäjä (yhteistoimija) teoksessa
has element type: 2
toolkit definition: A work that involves a responsibility of a collective agent for three-dimensional modeling, carving, or similar technique. @en
toolkit definition: Darbs, kas ietver grupas atbildību par trīsdimensionālu modelēšanu, grebšanu vai līdzīgu tehniku. @lv
toolkit definition: Een werk dat met zich meebrengt een verantwoordelijkheid van een collectieve actor voor driedimensionaal modelleren, snijden of gelijksoortige techniek. @nl
toolkit definition: Egy mű, amelyhez hozzátartozik egy kollektív ágens felelőssége háromdimenziós modellezésért, faragásért vagy hasonló technikáért. @hu
toolkit definition: Ein Werk, bei dem ein gemeinschaftlicher Akteur für dreidimensionales Modellieren, Schnitzen oder ähnliche Techniken verantwortlich ist. @de
toolkit definition: Et verk som involverer et ansvar for en kollektiv agent i form av modellering, utskjæring eller lignende teknikker for et tredimensjonalt verk. @no
toolkit definition: Obra que implica una responsabilitat d’un agent col·lectiu en el modelatge, la talla o una tècnica tridimensional similar. @ca
toolkit definition: Opera che implica una responsabilità di un agente collettivo per la modellazione tridimensionale, scultura o tecnica simile. @it
toolkit definition: Teos, jossa yhteistoimija on vastuussa kolmiulotteisen teoksen luomisesta muovaamalla, veistämällä tai vastaavalla tekniikalla.
toolkit definition: Teos, mis sisaldab kollektiivi vastutust kolmemõõtmelise modelleerimise, nikerdamise või muu sellise tehnika eest. @et
toolkit definition: Værk, som involverer en kollektiv agents ansvar for tredimensionel modellering, udskæring eller lignende teknik. @da
toolkit definition: Üç boyutlu modelleme, oyma veya benzeri bir teknik için kolektif bir temsilcinin sorumluluğunu içeren bir çalışma. @tr
toolkit definition: Œuvre qui comporte une responsabilité de la part d’un agent collectif consistant à utiliser le modelage, la taille ou une technique similaire pour une œuvre tridimensionnelle. @fr
toolkit definition: عمل يترتب عليه مسئولية وكيل جماعي عن نمذجة ثلاثية الأبعاد أو نحت أو تقنية مماثلة. @ar
toolkit definition: 涉及三维模型、雕刻或类似技术的一个集体行为者的责任的一种作品 @zh-hans
toolkit label: Gemeinschaftlicher Akteur als Bildhauerin/Bildhauer von @de
toolkit label: agent collectif sculpteur de @fr
toolkit label: agent col·lectiu escultor de @ca
toolkit label: beeldhouwer-collectieve actor van @nl
toolkit label: heykeltıraş kollektif temsilci @tr
toolkit label: ir tēlnieks (grupa) @lv
toolkit label: kollektiv agent, som er skulptør af @da
toolkit label: kuvanveistäjä (yhteistoimija) teoksessa
toolkit label: sculptor collective agent of @en
toolkit label: scultore agente collettivo di @it
toolkit label: skulptor (kollektiiv) teoses @et
toolkit label: skulptør for (kollektiv agent) @no
toolkit label: szobrász kollektív ágense: @hu
toolkit label: γλύπτης συλλογικός φορέας του @el
toolkit label: وكيل جماعي نحات @ar
toolkit label: ……的雕塑家集体行为者 @zh-hans
has subproperty: kuvanveistäjä (yhteisö) teoksessa
has subproperty: kuvanveistäjä (suku) teoksessa
has subproperty: P50716
lexical alias: sculptorCollectiveAgentOf.en
status: Published
type: Property
domain: C10011
label: er kollektiv agent, som er skulptør af @da
label: er skulptør for (kollektiv agent) @no
label: est un agent collectif sculpteur de @fr
label: heykeltıraş kollektif temsilcidir @tr
label: ir tēlnieks (grupa) @lv
label: is beeldhouwer-collectieve actor van @nl
label: is sculptor collective agent of @en
label: ist gemeinschaftlicher Akteur als Bildhauerin/Bildhauer von @de
label: skulptor (kollektiiv) teoses @et
label: szobrász kollektív ágense a következőnek: @hu
label: è scultore agente collettivo di @it
label: és agent col·lectiu escultor de @ca
label: είναι γλύπτης συλλογικός φορέας του @el
label: هو وكيل جماعي نحات لـ @ar
label: 是……的雕塑家集体行为者 @zh-hans
sub property of: kuvanveistäjä (toimija) teoksessa
sub property of: taiteilija (yhteistoimija) teoksessa
definition: Correla un agente collettivo a un'opera che implica una responsabilità di un agente collettivo per la modellazione tridimensionale, scultura o tecnica simile. @it
definition: Hozzákapcsol egy kollektív ágenst egy műhöz, amelyhez hozzátartozik egy kollektív ágens felelőssége háromdimenziós modellezésért, faragásért vagy hasonló technikáért. @hu
definition: Kolektif bir temsilciyi, üç boyutlu modelleme, oyma veya benzer bir teknikler için kolektif bir temsilcinin sorumluluğunu içeren bir eserle ilişkilendirir. @tr
definition: Liittää yhteistoimijan teokseen, jossa yhteistoimija on vastuussa kolmiulotteisen teoksen luomisesta muovaamalla, veistämällä tai vastaavalla tekniikalla.
definition: Met un agent collectif en relation avec une œuvre qui comporte une responsabilité de la part d’un agent collectif consistant à utiliser le modelage, la taille ou une technique similaire pour une œuvre tridimensionnelle. @fr
definition: Relaciona un agent col·lectiu amb una obra que implica una responsabilitat d’un agent col·lectiu en el modelatge, la talla o una tècnica tridimensional similar. @ca
definition: Relateert een collectieve actor aan een werk dat met zich meebrengt een verantwoordelijkheid van een collectieve actor voor driedimensionaal modelleren, snijden of gelijksoortige techniek. @nl
definition: Relaterer en kollektiv agent til et verk som involverer et ansvar for en kollektiv agent i form av modellering, utskjæring eller lignende teknikker for et tredimensjonalt verk. @no
definition: Relaterer en kollektiv agent til et værk, som involverer en kollektiv agents ansvar for tredimensionel modellering, udskæring eller lignende teknik. @da
definition: Relates a collective agent to a work that involves a responsibility of a collective agent for three-dimensional modeling, carving, or similar technique. @en
definition: Sasaista grupu ar darbu, kas ietver grupas atbildību par trīsdimensionālu modelēšanu, grebšanu vai līdzīgu tehniku. @lv
definition: Seostab kollektiivi teosega, mis sisaldab kollektiivi vastutust kolmemõõtmelise modelleerimise, nikerdamise või muu sellise tehnika eest. @et
definition: Setzt einen gemeinschaftlichen Akteur in Beziehung zu einem Werk, bei dem ein gemeinschaftlicher Akteur für dreidimensionales Modellieren, Schnitzen oder ähnliche Techniken verantwortlich ist. @de
definition: يربط وكيلا جماعيا بعمل يترتب عليه مسئولية وكيل جماعي عن نمذجة ثلاثية الأبعاد أو نحت أو تقنية مماثلة. @ar
definition: 将一个集体行为者与涉及三维模型、雕刻或类似技术的一个集体行为者的责任的一种作品关联起来。 @zh-hans

omistuskirjoituksen tekijä (yhteistoimija) teoksessa
has element type: 2
toolkit definition: A work that is assigned as an acknowledgment of the inspiration or support of a related collective agent. @en
toolkit definition: Darbs, kas ir veltīts pateicībā par saistītās grupas iedvesmojumu vai atbalstu. @lv
toolkit definition: Een werk dat toegekend is als erkenning van de inspiratie of hulp van een gerelateerde collectieve actor. @nl
toolkit definition: Egy mű, amelyet egy műhöz kapcsolódó kollektív ágens ösztönzésének vagy támogatásának köszöneteként jelölnek meg. @hu
toolkit definition: Ein Werk, das als Zeichen der Anerkennung oder Unterstützung einem in Beziehung stehenden gemeinschaftlichen Akteur gewidmet ist. @de
toolkit definition: Et verk som er tilegnet som en anerkjennelse for inspirasjonen eller støtten fra en relatert kollektiv agent. @no
toolkit definition: Obra que s’assigna com a reconeixement per la inspiració o suport d’un agent col·lectiu relacionat. @ca
toolkit definition: Opera assegnata come riconoscimento dell'ispirazione o supporto di un agente collettivo correlato. @it
toolkit definition: Teos, joka on omistettu sitä innoittaneelle tai tukeneelle yhteistoimijalle.
toolkit definition: Teos, mille seotud kollektiiv on pühendanud kellelegi tänuavaldusena innustuse või toetuse eest. @et
toolkit definition: Værk, som er tilegnet en relateret kollektiv agent, som en anerkendelse af inspiration eller støtte. @da
toolkit definition: İlgili bir kollektif temsilcinin ilhamının veya desteğinin bir teşekkürü olarak atanan bir eser. @tr
toolkit definition: Œuvre qui est dédiée en reconnaissance de l’inspiration ou du soutien d’un agent collectif en relation. @fr
toolkit definition: عمل تم تعيينه كإقرار بالإلهام أو الدعم لوكيل جماعي ذي الصلة. @ar
toolkit definition: 被指定对一个相关集体行为者的启发或支持之感谢的一种作品 @zh-hans
toolkit label: Gemeinschaftlicher Akteur als Widmende/Widmender von @de
toolkit label: adayan kolektif temsilci @tr
toolkit label: agent collectif dédicateur d’une œuvre de @fr
toolkit label: agent col·lectiu dedicant de @ca
toolkit label: dedicante agente collettivo di @it
toolkit label: dedicator collective agent of @en
toolkit label: dedikáló kollektív ágense: @hu
toolkit label: dediserende kollektiv agent av @no
toolkit label: ir darba veltītājs (grupa) @lv
toolkit label: kollektiv agent, som er dedikationsskriver af @da
toolkit label: omistuskirjoituksen tekijä (yhteistoimija) teoksessa
toolkit label: opdrager-collectieve actor van @nl
toolkit label: pühendaja (kollektiiv) teoses @et
toolkit label: αφιερωτής συλλογικός φορέας του @el
toolkit label: وكيل جماعي مُهدي كتاب @ar
toolkit label: ……的题献者集体行为者 @zh-hans
has subproperty: omistuskirjoituksen tekijä (yhteisö) teoksessa
has subproperty: omistuskirjoituksen tekijä (suku) teoksessa
has subproperty: P50717
lexical alias: dedicatorCollectiveAgentOf.en
status: Published
type: Property
domain: C10011
label: dedikáló kollektív ágense a következőnek: @hu
label: er dediserende kollektiv agent av @no
label: er kollektiv agent, som er dedikationsskriver af @da
label: est un agent collectif dédicateur d’une œuvre de @fr
label: ir darba veltītājs (grupa) @lv
label: is dedicator collective agent of @en
label: is opdrager-collectieve actor van @nl
label: ist gemeinschaftlicher Akteur als Widmende/Widmender von @de
label: ithaf eden kolektif temsilcisidir @tr
label: pühendaja (kollektiiv) teoses @et
label: è dedicante agente collettivo di @it
label: és agent col·lectiu dedicant de @ca
label: είναι αφιερωτής συλλογικός φορέας του @el
label: هو وكيل جماعي مُهدي كتاب لـ @ar
label: 是……的题献者集体行为者 @zh-hans
sub property of: omistuskirjoituksen tekijä (toimija) teoksessa
sub property of: yhteistoimijaan liittyvä teos
definition: Correla un agente collettivo a un'opera assegnata come riconoscimento dell'ispirazione o supporto di un agente collettivo correlato. @it
definition: Hozzákapcsol egy kollektív ágenst egy műhöz, amelyet egy műhöz kapcsolódó kollektív ágens ösztönzésének vagy támogatásának köszöneteként jelölnek meg. @hu
definition: Kolektif bir temsilciyi, ilgili bir kolektif temsilcinin ilhamının veya desteğinin kabulü olarak atanan bir eserle ilişkilendirir. @tr
definition: Liittää yhteistoimijan teokseen, joka on omistettu sitä innoittaneelle tai tukeneelle yhteistoimijalle.
definition: Met un agent collectif en relation avec une œuvre qui est dédiée en reconnaissance de l’inspiration ou du soutien d’un agent collectif en relation. @fr
definition: Relaciona un agent col·lectiu amb una obra que s’assigna com a reconeixement per la inspiració o suport d’un agent col·lectiu relacionat. @ca
definition: Relateert een collectieve actor aan een werk dat toegekend is als erkenning van de inspiratie of hulp van een gerelateerde collectieve actor. @nl
definition: Relaterer en kollektiv agent til et verk som er tilegnet som en anerkjennelse for inspirasjonen eller støtten fra en relatert kollektiv agent. @no
definition: Relaterer en kollektiv agent til et værk, som er tilegnet en relateret kollektiv agent, som en anerkendelse af inspiration eller støtte. @da
definition: Relates a collective agent to a work that is assigned as an acknowledgment of the inspiration or support of a related collective agent. @en
definition: Sasaista grupu ar darbu, kas ir veltīts pateicībā par saistītās grupas iedvesmojumu vai atbalstu. @lv
definition: Seostab kollektiivi teosega, mille seotud kollektiiv on pühendanud kellelegi tänuavaldusena innustuse või toetuse eest. @et
definition: Setzt einen gemeinschaftlichen Akteur in Beziehung zu einem Werk, das als Zeichen der Anerkennung oder Unterstützung einem in Beziehung stehenden gemeinschaftlichen Akteur gewidmet ist. @de
definition: يربط وكيلا جماعيا بعمل تم تعيينه كإقرار بالإلهام أو الدعم لوكيل جماعي ذي الصلة. @ar
definition: 将一个集体行为者与被指定对一个相关集体行为者的启发或支持之感谢的一种作品关联起来。 @zh-hans

teoksella kunnioitettu yhteistoimija teoksessa
has element type: 2
toolkit definition: A work that marks the esteem of and respect for a collective agent. @en
toolkit definition: Darbs, ar kuru godināta grupa. @lv
toolkit definition: Een werk dat toont de waardering en respect voor een collectieve actor. @nl
toolkit definition: Egy mű, amely jelzi egy kollektív ágens megbecsülését és tiszteletét. @hu
toolkit definition: Ein Werk, das einen gemeinschaftlichen Akteur ehrt. @de
toolkit definition: Et verk som markerer aktelsen og respekten for en kollektiv agent. @no
toolkit definition: Kolektif bir temsilcinin itibarını ve saygısını simgeleyen bir eser. @tr
toolkit definition: Obra que marca l’estima i el respecte per un agent col·lectiu. @ca
toolkit definition: Opera che esprime la stima e il rispetto per un agente collettivo. @it
toolkit definition: Teos, joka osoittaa arvostusta ja kunnioitusta yhteistoimijalle.
toolkit definition: Teos, mis märgib lugupidamist ja austust kollektiivi vastu. @et
toolkit definition: Værk, som markerer en hædring af en kollektiv agent. @da
toolkit definition: Œuvre qui marque l’estime et le respect pour un agent collectif. @fr
toolkit definition: عمل يدل على تقدير واحترام وكيل جماعي. @ar
toolkit definition: 表示对一个集体行为者尊重或尊敬的一种作品 @zh-hans
toolkit label: Gemeinschaftlicher Akteur als Gefeierte/Gefeierter eines Werks von @de
toolkit label: agent collectif honoré d’une œuvre de @fr
toolkit label: agent col·lectiu homenatjat d’una obra de @ca
toolkit label: austusavalduse saaja (kollektiiv) teoses @et
toolkit label: beæret kollektiv agent av verk for @no
toolkit label: eserinin onurlandırılan kolektif temsilcisidir @tr
toolkit label: geëerde collectieve actor van werk van @nl
toolkit label: grupu godinošais darbs @lv
toolkit label: honouree collective agent of work of @en
toolkit label: kollektiv agent, som beæres af værk af @da
toolkit label: méltatott kollektív ágense a következő műnek: @hu
toolkit label: onorato agente collettivo di opera di @it
toolkit label: teoksella kunnioitettu yhteistoimija teoksessa
toolkit label: τιμώμενος συλλογικός φορέας του έργου του @el
toolkit label: وكيل جماعي مكرم بعمل @ar
toolkit label: ……的作品的被纪念者集体行为者 @zh-hans
has subproperty: teoksella kunnioitettu yhteisö teoksessa
has subproperty: teoksella kunnioitettu suku teoksessa
has subproperty: P50718
lexical alias: honoureeCollectiveAgentOfWorkOf.en
status: Published
type: Property
domain: C10011
label: austusavalduse saaja (kollektiiv) teoses @et
label: er beæret kollektiv agent av verk for @no
label: er kollektiv agent, som beæres af værk af @da
label: eserinin onurlandırılan kolektif temsilcisidir @tr
label: est un agent collectif honoré d’une œuvre de @fr
label: grupu godinošais darbs @lv
label: is geëerde collectieve actor van werk van @nl
label: is honouree collective agent of work of @en
label: ist gemeinschaftlicher Akteur als Gefeierte/Gefeierter eines Werks von @de
label: méltatott kollektív ágense a következő műnek: @hu
label: è onorato agente collettivo di opera di @it
label: és agent col·lectiu homenatjat d’una obra de @ca
label: είναι τιμώμενος συλλογικός φορέας του έργου του @el
label: هو وكيل جماعي مكرم بعمل لـ @ar
label: 是……的作品的被纪念者集体行为者 @zh-hans
sub property of: teoksella kunnioitettu toimija teoksessa
sub property of: yhteistoimijaan liittyvä teos
alternative label: agente colectivo homenajeado de obra de @es
alternative label: honoree collective agent of work of @en
alternative label: kollektiv agent, som er hædersperson i værk af @da
alternative label: kunnioitettu yhteistoimija teoksessa
alternative label: onorato agente collettivo di opera di @it
alternative label: τιμώμενος συλλογικός φορέας του έργου του @el
alternative label: وكيل جماعي مكرم بعمل @ar
alternative label: ……的作品的被纪念者集体行为者 @zh-hans
definition: Correla un agente collettivo a un'opera che esprime la stima e il rispetto per un agente collettivo. @it
definition: Hozzákapcsol egy kollektív ágenst egy műhöz, amely jelzi egy kollektív ágens megbecsülését és tiszteletét. @hu
definition: Kollektif bir temsilciyi, kolektif bir temsilciye saygınlık kazandıran ve duyulan saygıyı gösteren bir eserle ilişkilendirir. @tr
definition: Liittää yhteistoimijan teokseen, joka osoittaa arvostusta ja kunnioitusta yhteistoimijalle.
definition: Met un agent collectif en relation avec une œuvre qui marque l’estime et le respect pour un agent collectif. @fr
definition: Relaciona un agent col·lectiu amb una obra que marca l’estima i el respecte per un agent col·lectiu. @ca
definition: Relateert een collectieve actor aan een werk dat toont de waardering en respect voor een collectieve actor. @nl
definition: Relaterer en kollektiv agent til et verk som markerer aktelsen og respekten for en kollektiv agent. @no
definition: Relaterer en kollektiv agent til et værk, som markerer en hædring af en kollektiv agent. @da
definition: Relates a collective agent to a work that marks the esteem of and respect for a collective agent. @en
definition: Sasaista grupu ar darbu, ar kuru godināta grupa. @lv
definition: Seostab kollektiivi teosega, mis märgib lugupidamist ja austust kollektiivi vastu. @et
definition: Setzt einen gemeinschaftlichen Akteur in Beziehung zu einem Werk, das einen gemeinschaftlichen Akteur ehrt. @de
definition: يربط وكيلا جماعيا بعمل يدل على تقدير واحترام وكيل جماعي. @ar
definition: 将一个集体行为者与表示对一个集体行为者尊重或尊敬的一种作品关联起来。 @zh-hans

näyttelijä (yhteistoimija) ekspressiossa
has element type: 2
toolkit definition: An expression that includes a contribution by a collective agent of acting as a cast member or player in a musical or dramatic presentation. @en
toolkit definition: Een expressie die omvat een bijdrage door een collectieve actor die optreedt als een lid van een gezelschap of speler in een muziek- of dramapresentatie. @nl
toolkit definition: Egy kifejezési forma, amely magában foglalja egy kollektív ágensnek, mint a szereposztás egy tagjának vagy előadójának a közreműködését egy zenei vagy drámai bemutatóban. @hu
toolkit definition: Eine Expression, zu der ein gemeinschaftlicher Akteur beiträgt, indem er als Ensemble-Mitglied oder Darstellerin/Darsteller in einer musikalischen oder dramatischen Darbietung fungiert. @de
toolkit definition: Ekspressio, jonka tekemisessä yhteistoimija on osallisena näyttelemällä musiikki- tai näytelmäesityksessä.
toolkit definition: Espressione che comprende un contributo di un agente collettivo nella recitazione come membro del cast o musicista in una presentazione musicale o drammatica. @it
toolkit definition: Et uttrykk som inkluderer et bidrag fra en kollektiv agent i form av å spille en rolle eller som utøver i en musikalsk eller dramatisk forestilling. @no
toolkit definition: Expression qui intègre une contribution de la part d’un agent collectif consistant à agir à titre de membre d’une distribution artistique ou de comédien dans une présentation musicale ou dramatique. @fr
toolkit definition: Expressió que inclou una contribució d’un agent col·lectiu actuant com un membre del repartiment o com un comediant d’una representació musical o dramàtica. @ca
toolkit definition: Izteiksme, kas ietver grupas ieguldījumu, izpildot lomu dramatiskā uzvedumā vai spēlējot mūzikas uzvedumā. @lv
toolkit definition: Müzikal veya dramatik bir sunumda oyuncu veya oyuncu kadrosu üyesi olarak rol alan kolektif bir temsilcinin katkısını içeren bir anlatım. @tr
toolkit definition: Udtryk, som omfatter en kollektiv agents bidrag ved at være skuespiller eller musiker i en musikalsk eller dramatisk præsentation. @da
toolkit definition: Väljendus, millesse kollektiiv on andnud panuse, osaledes trupiliikme või näitlejana muusika- või draamaetenduses. @et
toolkit definition: تعبيرة تتضمن إسهام وكيل جماعي يعمل كعضو فريق تمثيل أو عازف في عرض موسيقي أو درامي. @ar
toolkit definition: 包括在音乐或戏剧呈现中扮演角色或演奏的一个集体行为者的贡献的一种内容表达 @zh-hans
toolkit label: Gemeinschaftlicher Akteur als Schauspielerin/Schauspieler von @de
toolkit label: Oyuncu kolektif temsilci @tr
toolkit label: acteur-collectieve actor van @nl
toolkit label: actor collective agent of @en
toolkit label: agent collectif acteur de @fr
toolkit label: agent col·lectiu actor de @ca
toolkit label: attore agente collettivo di @it
toolkit label: ir aktieris (grupa) @lv
toolkit label: kollektiv agent, som er skuespiller af @da
toolkit label: näitleja (kollektiiv) väljenduses @et
toolkit label: näyttelijä (yhteistoimija) ekspressiossa
toolkit label: skuepiller for (kollektiv agent) @no
toolkit label: színész kollektív ágense: @hu
toolkit label: ηθοποιός συλλογικός φορέας του @el
toolkit label: وكيل جماعي ممثل @ar
toolkit label: ……的演员集体行为者 @zh-hans
has subproperty: ääninäyttelijä (yhteistoimija) ekspressiossa
has subproperty: näyttelijä (yhteisö) ekspressiossa
has subproperty: näyttelijä (suku) ekspressiossa
has subproperty: P50719
lexical alias: actorCollectiveAgentOf.en
status: Published
type: Property
domain: C10011
label: aktör kolektif temsilcisidir @tr
label: er kollektiv agent, som er skuespiller af @da
label: er skuepiller for (kollektiv agent) @no
label: est un agent collectif acteur de @fr
label: ir aktieris (grupa) @lv
label: is acteur-collectieve actor van @nl
label: is actor collective agent of @en
label: ist gemeinschaftlicher Akteur als Schauspielerin/Schauspieler von @de
label: näitleja (kollektiiv) väljenduses @et
label: színész kollektív ágense a következőnek: @hu
label: è attore agente collettivo di @it
label: és agent col·lectiu actor de @ca
label: είναι ηθοποιός συλλογικός φορέας του @el
label: هو وكيل جماعي ممثل لـ @ar
label: 是……的演员集体行为者 @zh-hans
sub property of: näyttelijä (toimija) ekspressiossa
sub property of: esittäjä (yhteistoimija) ekspressiossa
definition: Correla un agente collettivo a un'espressione che comprende un contributo di un agente collettivo nella recitazione come membro del cast o musicista in una presentazione musicale o drammatica. @it
definition: Hozzákapcsol egy kollektív ágenst egy kifejezési formához, amely magában foglalja egy kollektív ágensnek, mint a szereposztás egy tagjának vagy előadójának a közreműködését egy zenei vagy drámai bemutatóban. @hu
definition: Kolektif bir temsilciyi, müzikal veya dramatik bir sunumda oyuncu veya oyuncu olarak rol alan kolektif bir temsilcinin katkısını içeren bir anlatımla ilişkilendirir. @tr
definition: Liittää yhteistoimijan ekspressioon, jonka tekemisessä yhteistoimija on osallisena näyttelemällä musiikki- tai näytelmäesityksessä.
definition: Met un agent collectif en relation avec une expression qui intègre une contribution de la part d’un agent collectif consistant à agir à titre de membre d’une distribution artistique ou de comédien dans une présentation musicale ou dramatique. @fr
definition: Relaciona un agent col·lectiu amb una expressió que inclou una contribució d’un agent col·lectiu actuant com un membre del repartiment o com un comediant d’una representació musical o dramàtica. @ca
definition: Relateert een collectieve actor aan een expressie die omvat een bijdrage door een collectieve actor die optreedt als een lid van een gezelschap of speler in een muziek- of dramapresentatie. @nl
definition: Relaterer en kollektiv agent til et udtryk, som omfatter en kollektiv agents bidrag ved at være skuespiller eller musiker i en musikalsk eller dramatisk præsentation. @da
definition: Relaterer en kollektiv agent til et uttrykk som inkluderer et bidrag fra en kollektiv agent i form av å spille en rolle eller som utøver i en musikalsk eller dramatisk forestilling. @no
definition: Relates a collective agent to an expression that includes a contribution by a collective agent of acting as a cast member or player in a musical or dramatic presentation. @en
definition: Sasaista grupu ar izteiksmi, kas ietver grupas ieguldījumu, izpildot lomu dramatiskā uzvedumā vai spēlējot mūzikas uzvedumā. @lv
definition: Seostab kollektiivi väljendusega, millesse kollektiiv on andnud panuse, osaledes trupiliikme või näitlejana muusika- või draamaetenduses. @et
definition: Setzt einen gemeinschaftlichen Akteur in Beziehung zu einer Expression, zu der ein gemeinschaftlicher Akteur beiträgt, indem er als Ensemble-Mitglied oder Darstellerin/Darsteller in einer musikalischen oder dramatischen Darbietung fungiert. @de
definition: يربط وكيلا جماعيا بتعبيرة تتضمن إسهام وكيل جماعي يعمل كعضو فريق تمثيل أو عازف في عرض موسيقي أو درامي. @ar
definition: 将一个集体行为者与包括在音乐或戏剧呈现中扮演角色或演奏的一个集体行为者的贡献的一种内容表达关联起来。 @zh-hans

toimittaja (yhteistoimija) ekspressiossa
has element type: 2
toolkit definition: An expression that includes a contribution by a collective agent of amending content created by other agents in order to meet standards for publication or other use. @en
toolkit definition: Een expressie die omvat een bijdrage door een collectieve actor door aanpassen van tekst gecreëerd door andere actoren met de bedoeling te voldoen aan standaarden voor publiceren of ander gebruik. @nl
toolkit definition: Egy kifejezési forma, amely magában foglalja egy kollektív ágens más ágensek által létrehozott tartalmat módosító közreműködését, hogy az megfeleljen a publikáció és az egyéb felhasználás szabályainak. @hu
toolkit definition: Eine Expression, zu der ein gemeinschaftlicher Akteur beiträgt, indem er von anderen Akteuren erstellte Inhalte so verändert, dass sie den Standards für die Veröffentlichung oder einer anderweitigen Verwendung entsprechen. @de
toolkit definition: Ekspressio, jonka tekemiseen yhteistoimija osallistuu tarkistamalla muiden toimijoiden luomaa sisältöä julkaisu- tai muiden käyttöstandardien saavuttamiseksi.
toolkit definition: Espressione che comprende un contributo di un agente collettivo nella correzione di testo creato da altri agenti collettivi per soddisfare standard di pubblicazione come uniformità, chiarezza e stile. @it
toolkit definition: Et uttrykk som inkluderer et bidrag fra en kollektiv agent i form av å å gjøre endringer i tekst skrevet av andre kollektiv agenter for å imøtekomme utgivelsesstandarder for sammenheng, tydelighet og stil. @no
toolkit definition: Expression qui intègre une contribution de la part d’un agent collectif consistant à modifier du contenu créé par d’autres agents afin de répondre à des normes pour la publication ou une autre utilisation. @fr
toolkit definition: Expressió que inclou una contribució d’un agent col·lectiu esmenant contingut creat per altres agents per tal de complir els estàndards de publicació o un altre ús. @ca
toolkit definition: Izteiksme, kas ietver grupas ieguldījumu, pielāgojot citu aģentu radīto saturu, lai tas atbilstu publicēšanas vai citādas izmantošanas standartiem. @lv
toolkit definition: Udtryk, som omfatter en kollektiv agents bidrag ved at ændre indhold skabt af andre agenter, for at opfylde publikationsstandarder eller til andet brug. @da
toolkit definition: Väljendus, millesse kollektiiv on andnud panuse, parandades teiste kollektiivide loodud teksti, et see vastaks loogilisuse, selguse ja stiili poolest avaldamisnõuetele. @et
toolkit definition: Yayınlama veya diğer kullanım standartlarını karşılamak için diğer temsilciler tarafından oluşturulan içeriği düzelten kolektif bir temsilcinin katkısını içeren bir anlatım. @tr
toolkit definition: تعبيرة تتضمن إسهام وكيل جماعي في تعديل نص من تأليف وكلاء آخرين من أجل استيفاء معايير النشر مثل الاتساق والوضوح والأسلوب. @ar
toolkit definition: 包括修正其他行为者创作的内容以满足出版标准或其他用途的一个集体行为者的贡献的一种内容表达 @zh-hans
toolkit label: Gemeinschaftlicher Akteur als Herausgeberin/Herausgeber von @de
toolkit label: agent collectif éditeur intellectuel de @fr
toolkit label: agent col·lectiu editor literari de @ca
toolkit label: curatore agente collettivo di testo di @it
toolkit label: editor collective agent of @en
toolkit label: editör kolektif temsilci @tr
toolkit label: ir redaktors (grupa) @lv
toolkit label: kollektiv agent, som er redaktør @da
toolkit label: redacteur-collectieve actor van tekst van @nl
toolkit label: redaktør av tekst for (kollektiv agent) @no
toolkit label: szerkesztő kollektív ágense: @hu
toolkit label: tekstitoimetaja (kollektiiv) väljenduses @et
toolkit label: toimittaja (yhteistoimija) ekspressiossa
toolkit label: επιμελητής συλλογικός φορέας του κειμένου του @el
toolkit label: وكيل جماعي محرر نص @ar
toolkit label: ……的编者集体行为者 @zh-hans
has subproperty: toimittaja (yhteisö) ekspressiossa
has subproperty: toimittaja (suku) ekspressiossa
has subproperty: P50720
lexical alias: editorCollectiveAgentOf.en
status: Published
type: Property
domain: C10011
label: editör kolektif temsilcisidir @tr
label: er kollektiv agent, som er redaktør af tekst af @da
label: er redaktør av tekst for (kollektiv agent) @no
label: est un agent collectif éditeur intellectuel de @fr
label: ir redaktors (grupa) @lv
label: is editor collective agent of @en
label: is redacteur-collectieve actor van @nl
label: ist gemeinschaftlicher Akteur als Herausgeberin/Herausgeber von @de
label: szerkesztő kollektív ágense a következőnek: @hu
label: tekstitoimetaja (kollektiiv) väljenduses @et
label: è curatore agente collettivo di testo di @it
label: és agent col·lectiu editor literari de @ca
label: είναι επιμελητής συλλογικός φορέας του κειμένου του @el
label: هو وكيل جماعي محرر نص لـ @ar
label: 是……的编者集体行为者 @zh-hans
sub property of: toimittaja (toimija) ekspressiossa
sub property of: yhdistymään osallinen yhteistoimija ekspressiossa
alternative label: A tartalom mozgásírás, zenei lejegyzés, tapintható mozgásírás, tapintható zenei lejegyzés, tapintható szöveg és szöveg lehet. @hu
alternative label: Gemeinschaftlicher Akteur als Herausgeberin/Herausgeber eines Texts von @de
alternative label: agent collectif éditeur intellectuel de texte de @fr
alternative label: agent col·lectiu editor de text de @ca
alternative label: agente colectivo editor de texto de @es
alternative label: editor collective agent of text of @en
alternative label: kollektiv agent, som er redaktør af tekst af @da
alternative label: metnin editör kolektif temsilcisi @tr
alternative label: tekstin toimittaja (yhteistoimija) ekspressiossa
alternative label: وكيل جماعي محرر نص @ar
alternative label: ……的文本的编者集体行为者 @zh-hans
definition: Correla un agente collettivo a un'espressione che comprende un contributo di un agente collettivo nella correzione di testo creato da altri agenti collettivi per soddisfare standard di pubblicazione come uniformità, chiarezza e stile. @it
definition: Hozzákapcsol egy kollektív ágenst egy kifejezési formához, amely magában foglalja egy kollektív ágens más ágensek által létrehozott tartalmat módosító közreműködését, hogy az megfeleljen a publikáció és az egyéb felhasználás szabályainak. @hu
definition: Kollektif bir temsilciyi yayın veya diğer kullanım standartlarını karşılamak için diğer kollektif temsilciler tarafından oluşturulan içeriği değiştirilen kollektif temsilcinin katkısını içeren bir anlatımla ilişkilendirir. @tr
definition: Liittää yhteistoimijan ekspressioon, jonka tekemiseen yhteistoimija osallistuu tarkistamalla muiden toimijoiden luomaa sisältöä julkaisu- tai muiden käyttöstandardien saavuttamiseksi.
definition: Met un agent collectif en relation avec une expression qui intègre une contribution de la part d’un agent collectif consistant à modifier du contenu créé par d’autres agents afin de répondre à des normes pour la publication ou une autre utilisation. @fr
definition: Relaciona un agent col·lectiu amb una expressió que inclou una contribució d’un agent col·lectiu esmenant contingut creat per altres agents per tal de complir els estàndards de publicació o un altre ús. @ca
definition: Relateert een collectieve actor aan een expressie die omvat een bijdrage door een collectieve actor door aanpassen van tekst gecreëerd door andere actoren met de bedoeling te voldoen aan standaarden voor publiceren of ander gebruik. @nl
definition: Relaterer en kollektiv agent til et udtryk, som omfatter en kollektiv agents bidrag ved at ændre indhold skabt af andre agenter, for at opfylde publikationsstandarder eller til andet brug. @da
definition: Relaterer en kollektiv agent til et uttrykk som inkluderer et bidrag fra en kollektiv agent i form av å å gjøre endringer i tekst skrevet av andre kollektiv agenter for å imøtekomme utgivelsesstandarder for sammenheng, tydelighet og stil. @no
definition: Relates a collective agent to an expression that includes a contribution by a collective agent of amending content created by other agents in order to meet standards for publication or other use. @en
definition: Sasaista grupu ar izteiksmi, kas ietver grupas ieguldījumu, pielāgojot citu aģentu radīto saturu, lai tas atbilstu publicēšanas vai citādas izmantošanas standartiem. @lv
definition: Seostab kollektiivi väljendusega, millesse kollektiiv on andnud panuse, parandades teiste kollektiivide loodud teksti, et see vastaks loogilisuse, selguse ja stiili poolest avaldamisnõuetele. @et

esittelijä (yhteistoimija) ekspressiossa
has element type: 2
toolkit definition: An expression that includes a contribution by a collective agent of appearing on-screen to provide contextual or background information. @en
toolkit definition: Bağlamsal veya arka plan bilgisi sağlamak için ekranda görünen kolektif bir temsilcinin katkısını içeren bir anlatım. @tr
toolkit definition: Een expressie die omvat een bijdrage door een collectieve actor door in beeld te verschijnen om contextuele of achtergrondinformatie te geven. @nl
toolkit definition: Egy kifejezési forma, amely magában foglalja egy képernyőn megjelenő kollektív ágens közreműködését szövegösszefüggésre vonatkozó vagy háttérinformáció szolgáltatásában. @hu
toolkit definition: Eine Expression, zu der ein gemeinschaftlicher Akteur beiträgt, indem er auf dem Bildschirm erscheint, um Kontext- und Hintergrundinformationen zu liefern. @de
toolkit definition: Ekspressio, jonka tekemisessä yhteistoimija on osallisena esiintymällä televisiossa tai elokuvassa taustatiedon antajana.
toolkit definition: Espressione che comprende un contributo di un agente collettivo nell'apparire sullo schermo per fornire informazioni contestuali o in sottofondo. @it
toolkit definition: Et uttrykk som inkluderer et bidrag fra en kollektiv agent i form av å vises på skjermen for å gi kontekst eller bakgrunnsinformasjon. @no
toolkit definition: Expression qui intègre une contribution de la part d’un agent collectif consistant à apparaître à l’écran pour fournir de l’information contextuelle ou complémentaire. @fr
toolkit definition: Expressió que inclou una contribució d’un agent col·lectiu apareixent en pantalla per proporcionar informació contextual o dels antecedents. @ca
toolkit definition: Izteiksme, kas ietver grupas ieguldījumu, parādoties ekrānā, lai nodrošinātu konteksta vai fona informāciju. @lv
toolkit definition: Udtryk, som omfatter en kollektiv agents bidrag ved at optræde på en skærm for at give kontekstuel- eller baggrundsinformation. @da
toolkit definition: Väljendus, millesse kollektiiv on andnud panuse, pakkudes ekraanil kontekstilist ja taustinfot. @et
toolkit definition: تعبيرة تتضمن إسهام وكيل جماعي بظهوره على الشاشة لتقديم معلومات سياقية أو معلومات أساسية. @ar
toolkit definition: 包括有出现在屏幕上提供语境或背景信息的一个集体行为者的贡献的一种内容表达 @zh-hans
toolkit label: Gemeinschaftlicher Akteur als On-Screen-Präsentatorin/On-Screen-Präsentator von @de
toolkit label: agent collectif présentateur à l’écran de @fr
toolkit label: agent col·lectiu presentador en pantalla de @ca
toolkit label: ekraanil esineja (kollektiiv) väljenduses @et
toolkit label: ekran sunucusu kollektif temsilcisi @tr
toolkit label: esittelijä (yhteistoimija) ekspressiossa
toolkit label: ir ekrānā redzamais vadītājs (grupa) @lv
toolkit label: kollektiv agent, som er programvært af @da
toolkit label: képernyőn megjelenő előadó kollektív ágense: @hu
toolkit label: onscreen presenter collective agent of @en
toolkit label: presentator in beeld-collectieve actor van @nl
toolkit label: presentatore video agente collettivo di @it
toolkit label: programleder for (kollektiv agent) @no
toolkit label: οθονικός παρουσιαστής συλλογικός φορέας του @el
toolkit label: وكيل جماعي مقدم برامج على الشاشة @ar
toolkit label: ……的屏幕主持人集体行为者 @zh-hans
has subproperty: esittelijä (yhteisö) ekspressiossa
has subproperty: esittelijä (suku) ekspressiossa
has subproperty: P50721
lexical alias: onscreenPresenterCollectiveAgentOf.en
status: Published
type: Property
domain: C10011
label: ekraanil esineja (kollektiiv) väljenduses @et
label: ekran sunucusu kollektif temsilcisidir @tr
label: er kollektiv agent, som er programvært af @da
label: er programleder for (kollektiv agent) @no
label: est un agent collectif présentateur à l’écran de @fr
label: ir ekrānā redzamais vadītājs (grupa) @lv
label: is onscreen presenter collective agent of @en
label: is presentator in beeld-collectieve actor van @nl
label: ist gemeinschaftlicher Akteur als On-Screen-Präsentatorin/On-Screen-Präsentator von @de
label: képernyőn megjelenő előadó kollektív ágense a következőnek: @hu
label: è presentatore video agente collettivo di @it
label: és agent col·lectiu presentador en pantalla de @ca
label: είναι οθονικός παρουσιαστής συλλογικός φορέας του @el
label: هو وكيل جماعي مقدم برامج على الشاشة لـ @ar
label: 是……的屏幕主持人集体行为者 @zh-hans
sub property of: esittelijä (toimija) ekspressiossa
sub property of: esittäjä (yhteistoimija) ekspressiossa
definition: Correla un agente collettivo a un'espressione che comprende un contributo di un agente collettivo nell'apparire sullo schermo per fornire informazioni contestuali o in sottofondo. @it
definition: Hozzákapcsol egy kollektív ágenst egy kifejezési formához, amely magában foglalja egy képernyőn megjelenő kollektív ágens közreműködését szövegösszefüggésre vonatkozó vagy háttérinformáció szolgáltatásában. @hu
definition: Kolektif bir temsilciyi, bağlamsal veya arka plan bilgisi sağlamak için ekranda görünen kollektif bir temsilcinin katkısını içeren bir anlaıtmla ilişkilendirir. @tr
definition: Liittää yhteistoimijan ekspressioon, jonka tekemisessä yhteistoimija on osallisena esiintymällä televisiossa tai elokuvassa taustatiedon antajana.
definition: Met un agent collectif en relation avec une expression qui intègre une contribution de la part d’un agent collectif consistant à apparaître à l’écran pour fournir de l’information contextuelle ou complémentaire. @fr
definition: Relaciona un agent col·lectiu amb una expressió que inclou una contribució d’un agent col·lectiu apareixent en pantalla per proporcionar informació contextual o dels antecedents. @ca
definition: Relateert een collectieve actor aan een expressie die omvat een bijdrage door een collectieve actor door in beeld te verschijnen om contextuele of achtergrondinformatie te geven. @nl
definition: Relaterer en kollektiv agent til et udtryk, som omfatter en kollektiv agents bidrag ved at optræde på en skærm for at give kontekstuel- eller baggrundsinformation. @da
definition: Relaterer en kollektiv agent til et uttrykk som inkluderer et bidrag fra en kollektiv agent i form av å vises på skjermen for å gi kontekst eller bakgrunnsinformasjon. @no
definition: Relates a collective agent to an expression that includes a contribution by a collective agent of appearing on screen to provide contextual or background information. @en
definition: Sasaista grupu ar izteiksmi, kas ietver grupas ieguldījumu, parādoties ekrānā, lai nodrošinātu konteksta vai fona informāciju. @lv
definition: Seostab kollektiivi väljendusega, millesse kollektiiv on andnud panuse, pakkudes ekraanil kontekstilist ja taustinfot. @et
definition: Setzt einen gemeinschaftlichen Akteur in Beziehung zu einer Expression, zu der ein gemeinschaftlicher Akteur beiträgt, indem er auf dem Bildschirm erscheint, um Kontext- und Hintergrundinformationen zu liefern. @de
definition: يربط وكيلا جماعيا بتعبيرة تتضمن إسهام وكيل جماعي بظهوره على الشاشة لتقديم معلومات سياقية أو معلومات أساسية. @ar
definition: 将一个集体行为者与包括有出现在屏幕上提供语境或背景信息的一个集体行为者的贡献的一种内容表达关联起来。 @zh-hans
scope note: An on-screen presenter may appear in nonfiction moving image materials or in introductions to fiction moving image materials. @en
scope note: Bir ekran sunucusu, kurgusal olmayan hareketli görüntü materyallerinde veya kurgusal hareketli görüntü materyallerine girişlerde görünebilir. @tr
scope note: Darunter fallen Auftritte in nicht-fiktionalen Bewegtbildmaterialien oder in Einführungen zu fiktionalen Bewegtbildmaterialien. @de
scope note: Een presentator in beeld kan voorkomen in non-fictie bewegend beeldmaterialen of in inleidingen op fictie bewegend beeldmaterialen. @nl
scope note: Egy képernyőn megjelenő előadó tényszerű mozgóképanyagokban vagy fikciós mozgóképanyagok bevezetőiben is látható. @hu
scope note: Ekraanil esineja võib esineda mittefiktsioonilistes filmides ja fiktsioonfilmide sissejuhatavates osades. @et
scope note: Ekrānā redzamais vadītājs var parādīties dokumentālās filmas materiālos, vai spēlfilmas pieteikumos. @lv
scope note: En programvært kan optræde i levende billedmaterialer af faktuel karakter eller i introduktioner til levende billedmaterialer af fiktiv karakter. @da

värittäjä (yhteistoimija) ekspressiossa
has element type: 2
toolkit definition: An expression that includes a contribution by a collective agent of applying colour to drawings, prints, photographs, maps, moving images, and other visual content. @en
toolkit definition: Een expressie die omvat een bijdrage door een collectieve actor door toevoegen van kleur aan tekeningen, afdrukken, foto's, kaarten, bewegende beelden en andere visuele content. @nl
toolkit definition: Egy kifejezési forma, amely magában foglalja egy kollektív ágens közreműködését szín felhordásában rajzokra, nyomtatványokra, fényképekre, térképekre, mozgóképekre és más vizuális tartalmakra. @hu
toolkit definition: Eine Expression, zu der ein gemeinschaftlicher Akteur beiträgt, indem er Farben auf Zeichnungen, Drucke, Fotografien, Karten, Bewegtbilder und so weiter aufbringt. @de
toolkit definition: Ekspressio, jossa yhteistoimija on osallisena värittämällä piirustuksia, vedoksia, valokuvia, karttoja, elokuvia tms.
toolkit definition: Espressione che comprende un contributo di un agente collettivo nell'applicazione di colore a disegni, stampe, fotografie, mappe, immagini in movimento e altri contenuti visivi. @it
toolkit definition: Et uttrykk som inkluderer et bidrag fra en kollektiv agent i form av fargelegge tegninger, trykk, fotografier, kart, levende bilder og annet visuelt materiale. @no
toolkit definition: Expression qui intègre une contribution de la part d’un agent collectif consistant à appliquer de la couleur à des dessins, des images imprimées, des photographies, des cartes, des images animées et d’autres contenus visuels. @fr
toolkit definition: Expressió que inclou una contribució d’un agent col·lectiu aplicant color a dibuixos, gravats, fotografies, mapes, imatges en moviment i a qualsevol altre contingut visual. @ca
toolkit definition: Izteiksme, kas ietver grupas ieguldījumu, izkrāsojot zīmējumu, gravīru, fotogrāfiju, karšu, kustīgo attēlu, u. tml. @lv
toolkit definition: Udtryk, som omfatter en kollektiv agents bidrag ved at farvelægge tegninger, tryk, fotos, kort, levende billeder og andet visuelt indhold. @da
toolkit definition: Väljendus, millesse kollektiiv on andnud panuse, värvides joonistusi, tõmmiseid, fotosid, kaarte, liikuvaid pilte ja muud visuaalset sisu. @et
toolkit definition: Çizimlere, baskılara, fotoğraflara, haritalara, hareketli görüntülere ve diğer görsel içeriğe kolektif bir temsilcinin renk uygulama katkısını içeren bir anlatım. @tr
toolkit definition: تعبيرة تتضمن إسهام وكيل جماعي في تلوين رسومات، ومطبوعات، وصور فوتوغرافية، وخرائط، وصور متحركة، وأي محتوى مرئي آخر. @ar
toolkit definition: 包括将颜色施加于图画、印刷品、照片、地图、动态图像和其他视觉内容上的一个集体行为者的贡献的一种内容表达 @zh-hans
toolkit label: Gemeinschaftlicher Akteur als Koloristin/Kolorist von @de
toolkit label: agent collectif coloriste de @fr
toolkit label: agent col·lectiu colorista de @ca
toolkit label: colorist kollektív ágense: @hu
toolkit label: colorista agente collettivo di @it
toolkit label: colourist collective agent of @en
toolkit label: fargelegger for (kollektiv agent) @no
toolkit label: inkleurder-collectieve actor van @nl
toolkit label: ir kolorists (grupa) @lv
toolkit label: kollektiv agent, som er farvelægger af @da
toolkit label: koloreerija (kollektiiv) väljenduses @et
toolkit label: renklendirici kolektif temsilcisi @tr
toolkit label: värittäjä (yhteistoimija) ekspressiossa
toolkit label: επιχρωματιστής συλλογικός φορέας του @el
toolkit label: وكيل جماعي فني تلوين لـ @ar
toolkit label: ……的着色者集体行为者 @zh-hans
has subproperty: värittäjä (yhteisö) ekspressiossa
has subproperty: värittäjä (suku) ekspressiossa
has subproperty: P50722
lexical alias: colouristCollectiveAgentOf.en
status: Published
type: Property
domain: C10011
label: colorist kollektív ágense a következőnek: @hu
label: er fargelegger for (kollektiv agent) @no
label: er kollektiv agent, som er farvelægger af @da
label: est un agent collectif coloriste de @fr
label: ir kolorists (grupa) @lv
label: is colourist collective agent of @en
label: is inkleurder-collectieve actor van @nl
label: ist gemeinschaftlicher Akteur als Koloristin/Kolorist von @de
label: koloreerija (kollektiiv) väljenduses @et
label: renklendirici kolektif temsilcisidir @tr
label: è colorista agente collettivo di @it
label: és agent col·lectiu colorista de @ca
label: είναι επιχρωματιστής συλλογικός φορέας του @el
label: هو وكيل جماعي فني تلوين لـ @ar
label: 是……的着色者集体行为者 @zh-hans
sub property of: värittäjä (toimija) ekspressiossa
sub property of: yhdistymään osallinen yhteistoimija ekspressiossa
alternative label: -
alternative label: agente colectivo colorista de @es
alternative label: colorist collective agent of @en
alternative label: renklendirici kolektif temsilcisi @tr
alternative label: színező kollektív ágense: @hu
alternative label: وكيل جماعي جامع لـ @ar
alternative label: ……的着色者集体行为者 @zh-hans
definition: Correla un agente collettivo a un'espressione che comprende un contributo di un agente collettivo nell'applicazione di colore a disegni, stampe, fotografie, mappe, immagini in movimento e altri contenuti visivi. @it
definition: Hozzákapcsol egy kollektív ágenst egy kifejezési formához, amely magában foglalja egy kollektív ágens közreműködését szín felhordásában rajzokra, nyomtatványokra, fényképekre, térképekre, mozgóképekre és más vizuális tartalmakra. @hu
definition: Kolektif bir temsilciyi, kollektif bir temsilcinin çizimlere, baskılara, fotoğraflara, haritalara, hareketli görüntülere ve diğer görsel içeriğe renk uygulama katkısını içeren bir anlatımla ilişkilendirir. @tr
definition: Liittää yhteistoimijan ekspressioon, jossa yhteistoimija on osallisena värittämällä piirustuksia, vedoksia, valokuvia, karttoja, elokuvia tms.
definition: Met un agent collectif en relation avec une expression qui intègre une contribution de la part d’un agent collectif consistant à appliquer de la couleur à des dessins, des images imprimées, des photographies, des cartes, des images animées et d’autres contenus visuels. @fr
definition: Relaciona un agent col·lectiu amb una expressió que inclou una contribució d’un agent col·lectiu aplicant color a dibuixos, gravats, fotografies, mapes, imatges en moviment i a qualsevol altre contingut visual. @ca
definition: Relateert een collectieve actor aan een expressie die omvat een bijdrage door een collectieve actor door toevoegen van kleur aan tekeningen, afdrukken, foto's, kaarten, bewegende beelden en andere visuele content. @nl
definition: Relaterer en kollektiv agent til et udtryk, som omfatter en kollektiv agents bidrag ved at farvelægge tegninger, tryk, fotos, kort, levende billeder og andet visuelt indhold. @da
definition: Relaterer en kollektiv agent til et uttrykk som inkluderer et bidrag fra en kollektiv agent i form av fargelegge tegninger, trykk, fotografier, kart, levende bilder og annet visuelt materiale. @no
definition: Relates a collective agent to an expression that includes a contribution by a collective agent of applying colour to drawings, prints, photographs, maps, moving images, and other visual content. @en
definition: Sasaista grupu ar izteiksmi, kas ietver grupas ieguldījumu, izkrāsojot zīmējumu, gravīru, fotogrāfiju, karšu, kustīgo attēlu, u. tml. @lv
definition: Seostab kollektiivi väljendusega, millesse kollektiiv on andnud panuse, värvides joonistusi, tõmmiseid, fotosid, kaarte, liikuvaid pilte ja muud visuaalset sisu. @et
definition: Setzt einen gemeinschaftlichen Akteur in Beziehung zu einer Expression, zu der ein gemeinschaftlicher Akteur beiträgt, indem er Farben auf Zeichnungen, Drucke, Fotografien, Karten, Bewegtbilder und so weiter aufbringt. @de
definition: يربط وكيلا جماعيا بتعبيرة تتضمن إسهام وكيل جماعي في تلوين رسومات، ومطبوعات، وصور فوتوغرافية، وخرائط، وصور متحركة، وأي محتوى مرئي آخر. @ar
definition: 将一个集体行为者与包括将颜色施加于图画、印刷品、照片、地图、动态图像和其他视觉内容上的一个集体行为者的贡献的一种内容表达关联起来。 @zh-hans

maskeeraaja (yhteistoimija) ekspressiossa
has element type: 2
toolkit definition: An expression that includes a contribution by a collective agent of applying makeup and prosthetics for a moving image production or for a musical or dramatic presentation or entertainment. @en
toolkit definition: Een expressie die omvat een bijdrage door een collectieve actor door aanbrengen van make-up en protheses voor een bewegend beeld-productie of voor een muzikale of dramatische presentatie of vermaak. @nl
toolkit definition: Egy kifejezési forma, amely magában foglalja egy kollektív ágens közreműködését makeup és protézisek alkalmazásában mozgókép-produkcióhoz, zenei vagy drámai előadáshoz vagy szórakoztató műsorhoz. @hu
toolkit definition: Eine Expression, zu der ein gemeinschaftlicher Akteur beiträgt, indem er Schminke und Prothetik für eine Bewegtbildproduktion oder eine musikalische oder dramatische Darbietung oder Aufführung aufträgt. @de
toolkit definition: Ekspressio, jossa yhteistoimija on osallisena vastaamalla elokuvan, musikaalin tai näyttämöteoksen maskeerauksesta.
toolkit definition: Espressione che comprende un contributo di un agente collettivo nell'applicazione di trucco e protesi per una produzione di immagini in movimento o per una presentazione o spettacolo musicale o drammatico. @it
toolkit definition: Et uttrykk som inkluderer et bidrag fra en kollektiv agent i form av å bruke sminke og proteser for en produksjon med levende bilder eller en musikalsk eller dramatisk forestilling eller form for underholdning. @no
toolkit definition: Expression qui intègre une contribution de la part d’un agent collectif consistant à appliquer du maquillage et des prothèses pour une production d’images animées ou bien pour une présentation ou un spectacle musical ou dramatique. @fr
toolkit definition: Expressió que inclou una contribució d’un agent col·lectiu aplicant maquillatge i pròtesis en el cas d’una producció d’imatge en moviment o una representació o un espectacle musical o dramàtic. @ca
toolkit definition: Hareketli bir görüntü üretimi veya müzikal ya da dramatik bir sunum ya da eğlence için kolektif bir temsilcinin makyaj ve protez uygulama katkısını içeren bir anlatım. @tr
toolkit definition: Izteiksme, kas ietver grupas ieguldījumu, pielietojot dekoratīvo kosmētiku un protezēšanu filmu veidošanā, mūzikas vai dramatiskā uzvedumā vai izklaides pasākumā. @lv
toolkit definition: Udtryk, som omfatter en kollektiv agents bidrag ved at lægge makeup og påsætte proteser til en levende billedproduktion eller til en musikalsk eller dramatisk præsentation eller til underholdning. @da
toolkit definition: Väljendus, millesse kollektiiv on andnud panuse, tehes grimmi ja proteesgrimmi filmi tootmise, muusika- või draamaetenduse või meelelahutusürituse jaoks. @et
toolkit definition: تعبيرة تتضمن إسهام وكيل جماعي في وضع مكياج أو أطراف صناعية في إنتاج صور متحركة أو في عرض موسيقي أو درامي أو ترفيهي. @ar
toolkit definition: 包括为动态图像制作或者为音乐或戏剧呈现或娱乐施加化妆品或假体的一个集体行为者的贡献的一种内容表达 @zh-hans
toolkit label: Gemeinschaftlicher Akteur als Maskenbildnerin/Maskenbildner von @de
toolkit label: agent collectif maquilleur de @fr
toolkit label: agent col·lectiu maquillador de @ca
toolkit label: grimmikunstnik (kollektiiv) väljenduses @et
toolkit label: ir grima mākslinieks (grupa) @lv
toolkit label: kollektiv agent, som er sminkør af @da
toolkit label: make-upartiest-collectieve actor van @nl
toolkit label: makeup artist collective agent of @en
toolkit label: makyaj sanatçısı kolektif temsilcisi @tr
toolkit label: maskeeraaja (yhteistoimija) ekspressiossa
toolkit label: sminkmester kollektív ágense: @hu
toolkit label: sminkør for (kollektiv agent) @no
toolkit label: truccatore agente collettivo di @it
toolkit label: ψιμυθιολόγος συλλογικός φορέας του @el
toolkit label: وكيل جماعي فنان مكياج @ar
toolkit label: ……的化妆艺术家集体行为者 @zh-hans
has subproperty: maskeeraaja (yhteisö) ekspressiossa
has subproperty: maskeeraaja (suku) ekspressiossa
has subproperty: P50723
lexical alias: makeupArtistCollectiveAgentOf.en
status: Published
type: Property
domain: C10011
label: er kollektiv agent, som er sminkør af @da
label: er sminkør for (kollektiv agent) @no
label: est un agent collectif maquilleur de @fr
label: grimmikunstnik (kollektiiv) väljenduses @et
label: ir grima mākslinieks (grupa) @lv
label: is make-upartiest-collectieve actor van @nl
label: is makeup artist collective agent of @en
label: ist gemeinschaftlicher Akteur als Maskenbildnerin/Maskenbildner von @de
label: makyaj sanatçısı kolektif temsilcisidir @tr
label: sminkmester kollektív ágense a következőnek: @hu
label: è truccatore agente collettivo di @it
label: és agent col·lectiu maquillador de @ca
label: είναι ψιμυθιολόγος συλλογικός φορέας του @el
label: هو وكيل جماعي فنان مكياج لـ @ar
label: 是……的化妆艺术家集体行为者 @zh-hans
sub property of: maskeeraaja (toimija) ekspresiossa
sub property of: esitykseen osallinen yhteistoimija ekspressiossa
definition: Correla un agente collettivo a un'espressione che comprende un contributo di un agente collettivo nell'applicazione di trucco e protesi per una produzione di immagini in movimento o per una presentazione o spettacolo musicale o drammatico. @it
definition: Hozzákapcsol egy kollektív ágenst egy kifejezési formához, amely magában foglalja egy kollektív ágens közreműködését makeup és protézisek alkalmazásában mozgókép-produkcióhoz, zenei vagy drámai előadáshoz vagy szórakoztató műsorhoz. @hu
definition: Kolektif bir temsilciyi, hareketli bir görüntü üretimi veya müzikal veya dramatik bir sunum veya eğlence için kolektif bir temsilcinin makyaj ve protez uygulama katkısını içeren bir anlatımla ilişkilendirir. @tr
definition: Liittää yhteistoimijan ekspressioon, jossa yhteistoimija on osallisena vastaamalla elokuvan, musikaalin tai näyttämöteoksen maskeerauksesta.
definition: Met un agent collectif en relation avec une expression qui intègre une contribution de la part d’un agent collectif consistant à appliquer du maquillage et des prothèses pour une production d’images animées ou bien pour une présentation ou un spectacle musical ou dramatique. @fr
definition: Relaciona un agent col·lectiu amb una expressió que inclou una contribució d’un agent col·lectiu aplicant maquillatge i pròtesis en el cas d’una producció d’imatge en moviment o una representació o un espectacle musical o dramàtic. @ca
definition: Relateert een collectieve actor aan een expressie die omvat een bijdrage door een collectieve actor door aanbrengen van make-up en protheses voor een bewegend beeld-productie of voor een muzikale of dramatische presentatie of vermaak. @nl
definition: Relaterer en kollektiv agent til et udtryk, som omfatter en kollektiv agents bidrag ved at lægge makeup og påsætte proteser til en levende billedproduktion eller til en musikalsk eller dramatisk præsentation eller til underholdning. @da
definition: Relaterer en kollektiv agent til et uttrykk som inkluderer et bidrag fra en kollektiv agent i form av å bruke sminke og proteser for en produksjon med levende bilder eller en musikalsk eller dramatisk forestilling eller form for underholdning. @no
definition: Relates a collective agent to an expression that includes a contribution by a collective agent of applying makeup and prosthetics for a moving image production or for a musical or dramatic presentation or entertainment. @en
definition: Sasaista grupu ar izteiksmi, kas ietver grupas ieguldījumu, pielietojot dekoratīvo kosmētiku un protezēšanu filmu veidošanā, mūzikas vai dramatiskā uzvedumā vai izklaides pasākumā. @lv
definition: Seostab kollektiivi väljendusega, millesse kollektiiv on andnud panuse, tehes grimmi ja proteesgrimmi filmi tootmise, muusika- või draamaetenduse või meelelahutusürituse jaoks. @et
definition: Setzt einen gemeinschaftlichen Akteur in Beziehung zu einer Expression, zu der ein gemeinschaftlicher Akteur beiträgt, indem er Schminke und Prothetik für eine Bewegtbildproduktion oder eine musikalische oder dramatische Darbietung oder Aufführung aufträgt. @de
definition: يربط وكيلا جماعيا بتعبيرة تتضمن إسهام وكيل جماعي بوضع مكياج أو أطراف صناعية في إنتاج صور متحركة أو في عرض موسيقي أو درامي أو ترفيهي. @ar
definition: 将一个集体行为者与包括为动态图像制作或者为音乐或戏剧呈现或娱乐施加化妆品或假体的一个集体行为者的贡献的一种内容表达关联起来。 @zh-hans

leikkaaja (yhteistoimija) ekspressiossa
has element type: 2
toolkit definition: An expression that includes a contribution by a collective agent of assembling, arranging, and trimming film, video, or other moving image formats, including both visual and audio aspects. @en
toolkit definition: Een expressie die omvat een bijdrage door een collectieve actor door samenstellen, arrangeren en couperen van film, video of andere bewegend beeld-vormen, inclusief zowel visuele als geluidaspecten. @nl
toolkit definition: Egy kifejezési forma, amely magában foglalja egy kollektív ágens film, videó vagy más mozgóképformátum összeállításával, elrendezésével és vágásával járó közreműködését, beleértve mind a vizuális, mind az audió szempontokat. @hu
toolkit definition: Eine Expression, zu der ein gemeinschaftlicher Akteur beiträgt, indem er für das Zusammensetzen, Arrangieren und Nachschneiden von Film-, Video- oder anderen Bewegtbildformaten zuständig ist. Darunter fallen Video- und Audio-Eigenschaften. @de
toolkit definition: Ekspressio, jonka tekemisessä yhteistoimija on osallisena elokuvan, videon tai muiden elokuvaformaattien kokoamisessa, järjestämisessä ja leikkauksessa sekä kuvan että äänen osalta.
toolkit definition: Espressione che comprende un contributo di un agente collettivo per l'assemblaggio, organizzazione e taglio di film, video o altri formati di immagini in movimento, inclusi gli aspetti sia visivi sia audio. @it
toolkit definition: Et uttrykk som inkluderer et bidrag fra en kollektiv agent i form av å sette sammen, arrangere og klippe film, video eller andre formater for levende bilder, inkludert både bilde- og lydaspekter. @no
toolkit definition: Expression qui intègre une contribution de la part d’un agent collectif consistant à assembler, à agencer et à découper du film, de la vidéo ou d’autres formats d’images animées, y compris les aspects visuels et sonores. @fr
toolkit definition: Expressió que inclou una contribució d’un agent col·lectiu d’aplegar, arranjar i retallar pel·lícules, vídeos i altres formats d’imatge en moviment, inclosos tant els aspectes visuals com els d’àudio. @ca
toolkit definition: Hem görsel hem de işitsel yönler dahil olmak üzere, film, video veya diğer hareketli görüntü formatlarını bir araya getiren, düzenleyen ve kırpan kolektif bir temsilcinin katkısını içeren bir anlatım. @tr
toolkit definition: Izteiksme, kas ietver grupas ieguldījumu, montējot, pārkārtojot un saīsinot filmas, video vai citu kustīga attēla formātu, ietverot gan vizuālos, gan audio aspektus. @lv
toolkit definition: Udtryk, som omfatter en kollektiv agents bidrag ved at sammensætte, arrangere og klippe film, video eller andre levende billedformater, inkl. både visuelle og lydmæssige aspekter. @da
toolkit definition: Väljendus, millesse kollektiiv on andnud panuse, monteerides, järjestades ja lõigates filmist, videost jm liikuvast pildist koosnevaid formaate, hõlmates nii visuaalseid kui ka heli aspekte. @et
toolkit definition: يربط وكيلا جماعيا بتعبيرة تتضمن إسهام وكيل جماعي في تجميع فيلم، أو فيديو أو شكل آخر من أشكال الصور المتحركة وترتيبها واقتطاعها، بما في ذلك الجوانب المرئية والمسموعة. @ar
toolkit definition: 包括对影片、视频或其他动态图像格式（包括视频和音频方面）的汇编、编排和剪辑的一个集体行为者的贡献的一种内容表达 @zh-hans
toolkit label: Gemeinschaftlicher Akteur als Filmeditorin/Filmeditor von @de
toolkit label: agent collectif monteur d’une œuvre d’images animées de @fr
toolkit label: agent col·lectiu editor d’una obra d’imatge en moviment de @ca
toolkit label: curatore agente collettivo di opera immagine in movimento di @it
toolkit label: editor collective agent of moving image work of @en
toolkit label: filmeditor-collectieve actor van bewegend beeldwerk van @nl
toolkit label: filmiteose monteerija (kollektiiv) väljenduses @et
toolkit label: hareketli görüntü eserinin editör kolektif temsilcisi @tr
toolkit label: ir filmas montāžas redaktors (grupa) @lv
toolkit label: kollektiv agent, som er klipper af levende billedværk af @da
toolkit label: leikkaaja (yhteistoimija) ekspressiossa
toolkit label: redaktør av verk i form av levende bilder for (kollektiv agent) @no
toolkit label: vágó kollektív ágense a következő mozgóképműnek: @hu
toolkit label: επιμελητής συλλογικός φορέας του έργου κινητής εικόνας του @el
toolkit label: وكيل جماعي محرر لعمل صور متحركة لـ @ar
toolkit label: ……的动态图像作品的剪辑师集体行为者 @zh-hans
has subproperty: leikkaaja (yhteisö) ekspressiossa
has subproperty: leikkaaja (suku) ekspressiossa
has subproperty: P50724
lexical alias: editorCollectiveAgentOfMovingImageWorkOf.en
status: Published
type: Property
domain: C10011
label: er kollektiv agent, som er klipper af levende billedværk af @da
label: er redaktør av verk i form av levende bilder for (kollektiv agent) @no
label: est un agent collectif monteur d’une œuvre d’images animées de @fr
label: filmiteose monteerija (kollektiiv) väljenduses @et
label: hareketli görüntü eserinin editör kolektif temsilcisidir @tr
label: ir filmas montāžas redaktors (grupa) @lv
label: is editor collective agent of moving image work of @en
label: is filmeditor-collectieve actor van bewegend beeldwerk van @nl
label: ist gemeinschaftlicher Akteur als Filmeditorin/Filmeditor von @de
label: vágó kollektív ágense a következő mozgóképműnek: @hu
label: è curatore agente collettivo di opera immagine in movimento di @it
label: és agent col·lectiu editor d’una obra d’imatge en moviment de @ca
label: είναι επιμελητής συλλογικός φορέας του έργου κινητής εικόνας του @el
label: هو وكيل جماعي محرر عمل صور متحركة لـ @ar
label: 是……的动态图像作品的剪辑师集体行为者 @zh-hans
sub property of: leikkaaja (toimija) ekspressiossa
sub property of: esitykseen osallinen yhteistoimija ekspressiossa
definition: Correla un agente collettivo a un'espressione che comprende un contributo di un agente collettivo per l'assemblaggio, organizzazione e taglio di film, video o altri formati di immagini in movimento, inclusi gli aspetti sia visivi sia audio. @it
definition: Hozzákapcsol egy kollektív ágenst egy kifejezési formához, amely magában foglalja egy kollektív ágens film, videó vagy más mozgóképformátum összeállításával, elrendezésével és vágásával járó közreműködését, beleértve mind a vizuális, mind az audió szempontokat. @hu
definition: Kolektif bir temsilciyi, hem görsel hem de işitsel yönler dahil olmak üzere film, video veya diğer hareketli görüntü formatlarının birleştirilmesi, düzenlenmesi ve kırpılması için kolektif bir temsilcinin katkısını içeren bir anlatımla ilişkilendirir. @tr
definition: Liittää yhteistoimijan ekspressioon, jonka tekemisessä yhteistoimija on osallisena elokuvan, videon tai muiden elokuvaformaattien kokoamisessa, järjestämisessä ja leikkauksessa sekä kuvan että äänen osalta.
definition: Met un agent collectif en relation avec une expression qui intègre une contribution de la part d’un agent collectif consistant à assembler, à agencer et à découper du film, de la vidéo ou d’autres formats d’images animées, y compris les aspects visuels et sonores. @fr
definition: Relaciona un agent col·lectiu amb una expressió que inclou una contribució d’un agent col·lectiu d’aplegar, arranjar i retallar pel·lícules, vídeos i altres formats d’imatge en moviment, inclosos tant els aspectes visuals com els d’àudio. @ca
definition: Relateert een collectieve actor aan een expressie die omvat een bijdrage door een collectieve actor door samenstellen, arrangeren en couperen van film, video of andere bewegend beeld-vormen, inclusief zowel visuele als geluidaspecten. @nl
definition: Relaterer en kollektiv agent til et udtryk, som omfatter en kollektiv agents bidrag ved at sammensætte, arrangere og klippe film, video eller andre levende billedformater, inkl. både visuelle og lydmæssige aspekter. @da
definition: Relaterer en kollektiv agent til et uttrykk som inkluderer et bidrag fra en kollektiv agent i form av å sette sammen, arrangere og klippe film, video eller andre formater for levende bilder, inkludert både bilde- og lydaspekter. @no
definition: Relates a collective agent to an expression that includes a contribution by a collective agent of assembling, arranging, and trimming film, video, or other moving image formats, including both visual and audio aspects. @en
definition: Sasaista grupu ar izteiksmi, kas ietver grupas ieguldījumu, montējot, pārkārtojot un saīsinot filmas, video vai citu kustīga attēla formātu, ietverot gan vizuālos, gan audio aspektus. @lv
definition: Seostab kollektiivi väljendusega, millesse kollektiiv on andnud panuse, monteerides, järjestades ja lõigates filmist, videost jm liikuvast pildist koosnevaid formaate, hõlmates nii visuaalseid kui ka heli aspekte. @et
definition: Setzt einen gemeinschaftlichen Akteur in Beziehung zu einer Expression, zu der ein gemeinschaftlicher Akteur beiträgt, indem er für das Zusammensetzen, Arrangieren und Nachschneiden von Film-, Video- oder anderen Bewegtbildformaten zuständig ist. Darunter fallen Video- und Audio-Eigenschaften. @de
definition: يربط وكيلا جماعيا بتعبيرة تتضمن إسهام وكيل جماعي في تجميع فيلم، أو فيديو أو شكل آخر من أشكال الصور المتحركة وترتيبها واقتطاعها، بما في ذلك الجوانب المرئية والمسموعة. @ar
definition: 将一个集体行为者与包括对影片、视频或其他动态图像格式（包括视频和音频方面）的汇编、编排和剪辑的一个集体行为者的贡献的一种内容表达关联起来。 @zh-hans

ekspression haastateltava (yhteistoimija) ekspressiossa
has element type: 2
toolkit definition: An expression that includes a contribution by a collective agent of being interviewed, usually by a reporter or some other kind of agent who gathers information. @en
toolkit definition: Een expressie die omvat een bijdrage door een collectieve actor door ondervraagd worden, meestal door een journalist of een andere soort actor die informatie verzamelt. @nl
toolkit definition: Egy kifejezési forma, amelyhez hozzátartozik egy kollektív ágens felelőssége a válaszadásért egy interjúkészítőnek, rendszerint egy riporternek vagy más információgyűjtő ágensnek. @hu
toolkit definition: Eine Expression, zu der ein gemeinschaftlicher Akteur beiträgt, indem er einer Interviewerin/einem Interviewer antwortet. Dabei handelt es sich normalerweise um eine Reporterin/einen Reporter oder einen anderen Akteur, der Informationen zusammenträgt. @de
toolkit definition: Ekspressio, jonka tekemisessä yhteistoimija on osallisena vastaamalla haastattelijalle, tavallisesti toimittajalle, tai muulle tietoa keräävälle toimijalle.
toolkit definition: Espressione che comprende un contributo di un agente collettivo nell'essere intervistato, solitamente da un giornalista o altro tipo di agente che raccoglie informazioni. @it
toolkit definition: Et uttrykk som inkluderer et bidrag fra en kollektiv agent i form av å svare på spørsmål fra en intervjuer, reporter eller annen agent som samler inn informasjon. @no
toolkit definition: Expression qui intègre une contribution de la part d’un agent collectif consistant à être interviewé, habituellement par un reporteur ou un autre type d’agent recueillant de l’information. @fr
toolkit definition: Expressió que inclou una contribució d’un agent col·lectiu essent entrevistat, habitualment per un periodista o qualsevol altre tipus d’agent que recull la informació. @ca
toolkit definition: Genellikle bir muhabir veya bilgi toplayan başka bir tür temsilci tarafından röportaj yapılmasına kolektif bir temsilcinin katkısını içeren bir anlatım. @tr
toolkit definition: Izteiksme, kas ietver grupas ieguldījumu, atbildot uz intervētāja, parasti reportiera, aptaujas organizētāja vai kāda cita informācijas apkopotāja jautājumiem. @lv
toolkit definition: Udtryk, som omfatter en kollektiv agents bidrag ved at besvare spørgsmål fra en interviewer, normalt en journalist eller en anden form for agent, som indsamler information. @da
toolkit definition: Väljendus, millesse kollektiiv on andnud panuse, vastates intervjueerijale, reporterile või muule infot koguvale tegijale. @et
toolkit definition: يربط وكيلا جماعيا بتعبيرة تتضمن إسهام وكيل جماعي بكونه ضيف مقابلة عادةً يجريها مراسل أو وكيل من نوع آخر يجمع معلومات. @ar
toolkit definition: 包括一个被采访（通常由记者或其他某种信息收集的行为者）的一个集体行为者的贡献的一种内容表达 @zh-hans
toolkit label: Gemeinschaftlicher Akteur als Interviewte/Interviewter einer Expression von @de
toolkit label: agent collectif interviewé d’une expression de @fr
toolkit label: agent col·lectiu entrevistat d’una expressió de @ca
toolkit label: anlatımının görüşülen kolektif temsilcisidir @tr
toolkit label: ekspression haastateltava (yhteistoimija) ekspressiossa
toolkit label: geïnterviewde collectieve actor van expressie van @nl
toolkit label: interjúalany kollektív ágense a következő kifejezési formának: @hu
toolkit label: interviewee collective agent of expression of @en
toolkit label: intervistato agente collettivo di espressione di @it
toolkit label: intervjueeritav (kollektiiv) väljenduses @et
toolkit label: intervjuobjekt for uttrykk for (kollektiv agent) @no
toolkit label: ir intervējamais (grupa) izteiksmē @lv
toolkit label: kollektiv agent, som er interviewperson for udtryk af @da
toolkit label: συνεντευξιαζόμενος συλλογικός φορέας της έκφρασης του @el
toolkit label: وكيل جماعي ضيف مقابلة في تعبيرة لـ @ar
toolkit label: ……的内容表达的受访者集体行为者 @zh-hans
has subproperty: ekspression haastateltava (yhteisö) ekspressiossa
has subproperty: ekspression haastateltava (suku) ekspressiossa
has subproperty: P50725
lexical alias: intervieweeCollectiveAgentOfExpressionOf.en
status: Published
type: Property
domain: C10011
label: anlatımının görüşülen kolektif temsilcisidir @tr
label: er intervjuobjekt for uttrykk for (kollektiv agent) @no
label: er kollektiv agent, som er interviewperson for udtryk af @da
label: est un agent collectif interviewé d’une expression de @fr
label: interjúalany kollektív ágense a következő kifejezési formának: @hu
label: intervjueeritav (kollektiiv) väljenduses @et
label: ir intervējamais (grupa) izteiksmē @lv
label: is geïnterviewde collectieve actor van expressie van @nl
label: is interviewee collective agent of expression of @en
label: ist gemeinschaftlicher Akteur als Interviewte/Interviewter einer Expression von @de
label: è intervistato agente collettivo di espressione di @it
label: és agent col·lectiu entrevistat d’una expressió de @ca
label: είναι συνεντευξιαζόμενος συλλογικός φορέας της έκφρασης του @el
label: هو وكيل جماعي ضيف مقابلة في تعبيرة لـ @ar
label: 是……的内容表达的受访者集体行为者 @zh-hans
sub property of: ekspression haastateltava (toimija) ekspressiossa
sub property of: esitykseen osallinen yhteistoimija ekspressiossa
definition: Correla un agente collettivo a un'espressione che comprende un contributo di un agente collettivo nell'essere intervistato, solitamente da un giornalista o altro tipo di agente che raccoglie informazioni. @it
definition: Hozzákapcsol egy kollektív ágenst egy kifejezési formához, amelyhez hozzátartozik egy kollektív ágens felelőssége a válaszadásért egy interjúkészítőnek, rendszerint egy riporternek vagy más információgyűjtő ágensnek. @hu
definition: Kolektif bir temsilcinin, genellikle bir ropörtör veya bilgi toplayan başka tür bir temsilci tarafından, kolektif bir temsilcinin mülakata katkısını içeren bir anlatımla ilişkilendirir. @tr
definition: Liittää yhteistoimijan ekspressioon, jonka tekemisessä yhteistoimija on osallisena vastaamalla haastattelijalle, tavallisesti toimittajalle, tai muulle tietoa keräävälle toimijalle.
definition: Met un agent collectif en relation avec une expression qui intègre une contribution de la part d’un agent collectif consistant à être interviewé, habituellement par un reporteur ou un autre type d’agent recueillant de l’information. @fr
definition: Relaciona un agent col·lectiu amb una expressió que inclou una contribució d’un agent col·lectiu essent entrevistat, habitualment per un periodista o qualsevol altre tipus d’agent que recull la informació. @ca
definition: Relateert een collectieve actor aan een expressie die omvat een bijdrage door een collectieve actor door ondervraagd worden, meestal door een journalist of een andere soort actor die informatie verzamelt. @nl
definition: Relaterer en kollektiv agent til et udtryk, som omfatter en kollektiv agents bidrag ved at besvare spørgsmål fra en interviewer, normalt en journalist eller en anden form for agent, som indsamler information. @da
definition: Relaterer en kollektiv agent til et uttrykk som inkluderer et bidrag fra en kollektiv agent i form av å svare på spørsmål fra en intervjuer, reporter eller annen agent som samler inn informasjon. @no
definition: Relates a collective agent to an expression that includes a contribution by a collective agent of being interviewed, usually by a reporter or some other kind of agent who gathers information. @en
definition: Sasaista grupu ar izteiksmi, kas ietver grupas ieguldījumu, atbildot uz intervētāja, parasti reportiera, aptaujas organizētāja vai kāda cita informācijas apkopotāja jautājumiem. @lv
definition: Seostab kollektiivi väljendusega, millesse kollektiiv on andnud panuse, vastates intervjueerijale, reporterile või muule infot koguvale tegijale. @et
definition: Setzt einen gemeinschaftlichen Akteur in Beziehung zu einer Expression, zu der ein gemeinschaftlicher Akteur beiträgt, indem er einer Interviewerin/einem Interviewer antwortet. Dabei handelt es sich normalerweise um eine Reporterin/einen Reporter oder einen anderen Akteur, der Informationen zusammenträgt. @de
definition: يربط وكيلا جماعيا بتعبيرة تتضمن إسهام وكيل جماعي بكونه ضيف مقابلة عادةً يجريها مراسل أو وكيل من نوع آخر يجمع معلومات. @ar
definition: 将一个集体行为者与包括一个被采访（通常由记者或其他某种信息收集的行为者）的一个集体行为者的贡献的一种内容表达关联起来。 @zh-hans

kapellimestari (yhteistoimija) ekspressiossa
has element type: 2
toolkit definition: An expression that includes a contribution by a collective agent of conducting and leading an instrumental performing group in a musical or dramatic presentation. @en
toolkit definition: Een expressie die omvat een bijdrage door een collectieve actor van dirigeren en leiden van een instrumentaal optredende groep in een muziek- of dramapresentatie. @nl
toolkit definition: Egy kifejezési forma, amely magában foglalja egy zenei vagy drámai bemutatóban hangszeres előadói csoportot vezénylő és vezető kollektív ágens közreműködését. @hu
toolkit definition: Eine Expression, zu der ein gemeinschaftlicher Akteur beiträgt, indem er eine Instrumentalgruppe in einer musikalischen oder dramatischen Darbietung leitet. @de
toolkit definition: Ekspressio, jonka tekemisessä yhteistoimija on osallisena johtamalla soitinryhmää musiikki- tai näytelmäesityksessä tms.
toolkit definition: Espressione che comprende un contributo di un agente collettivo nella direzione e conduzione di un gruppo di esecuzione strumentale in una presentazione musicale o drammatica. @it
toolkit definition: Et uttrykk som inkluderer et bidrag fra en kollektiv agent i form av direksjon og ledelse av en instrumentalgruppe i en musikalsk eller dramatisk forestilling. @no
toolkit definition: Expression qui intègre une contribution de la part d’un agent collectif consistant à diriger un groupe d’instrumentistes dans une présentation musicale ou dramatique. @fr
toolkit definition: Expressió que inclou una contribució d’un agent col·lectiu dirigint un grup instrumental en una representació musical o dramàtica. @ca
toolkit definition: Izteiksme, kas ietver grupas ieguldījumu, diriģējot un vadot orķestri muzikālā vai dramatiskā uzvedumā. @lv
toolkit definition: Müzikal veya dramatik bir sunumda enstrümantal bir performans grubunu yöneten ve liderlik eden kolektif bir temsilcinin katkısını içeren bir anlatım. @tr
toolkit definition: Udtryk, som omfatter en kollektiv agents bidrag ved at lede en optrædende instrumentalgruppe i en musikalsk eller dramatisk præsentation. @da
toolkit definition: Väljendus, millesse kollektiiv on andnud panuse, juhatades instrumentaalkoosseisu muusika- või draamaetenduses. @et
toolkit definition: تعبيرة تتضمن إسهام وكيل جماعي في إدارة فرقة عزف وقيادتها في عرض موسيقي أو درامي. @ar
toolkit definition: 包括在音乐或戏剧呈现中指挥并领导一个器乐表演团体的一个集体行为者的贡献的一种内容表达 @zh-hans
toolkit label: Gemeinschaftlicher Akteur als Orchesterleiterin/Orchesterleiter von @de
toolkit label: agent collectif chef d’orchestre de @fr
toolkit label: agent col·lectiu director instrumental de @ca
toolkit label: direttore d'orchestra agente collettivo di @it
toolkit label: enstrüman şefi kolektif temsilcisidir @tr
toolkit label: instrumentaal dirigent-collectieve actor van @nl
toolkit label: instrumental conductor collective agent of @en
toolkit label: instrumentaldirigent for (kollektiv agent) @no
toolkit label: ir orķestra diriģents (grupa) @lv
toolkit label: kapellimestari (yhteistoimija) ekspressiossa
toolkit label: kollektiv agent, som er instrumentaldirigent af @da
toolkit label: orkestrijuht (kollektiiv) väljenduses @et
toolkit label: zenekari karmester kollektív ágense: @hu
toolkit label: διευθυντής ορχήστρας συλλογικός φορέας του @el
toolkit label: هو وكيل جماعي قائد فرقة عزف لـ @ar
toolkit label: ……的器乐指挥集体行为者 @zh-hans
has subproperty: kapellimestari (yhteisö) ekspressiossa
has subproperty: kapellimestari (suku) ekspressiossa
has subproperty: P50726
lexical alias: instrumentalConductorCollectiveAgentOf.en
status: Published
type: Property
domain: C10011
label: enstrüman şefi kolektif temsilcisidir @tr
label: er instrumentaldirigent for (kollektiv agent) @no
label: er kollektiv agent, som er instrumentaldirigent af @da
label: est un agent collectif chef d’orchestre de @fr
label: ir orķestra diriģents (grupa) @lv
label: is instrumentaal dirigent-collectieve actor van @nl
label: is instrumental conductor collective agent of @en
label: ist gemeinschaftlicher Akteur als Orchesterleiterin/Orchesterleiter von @de
label: orkestrijuht (kollektiiv) väljenduses @et
label: zenekari karmester kollektív ágense a következőnek: @hu
label: è direttore d'orchestra agente collettivo di @it
label: és agent col·lectiu director instrumental de @ca
label: είναι διευθυντής ορχήστρας συλλογικός φορέας του @el
label: هو وكيل جماعي قائد فرقة عزف لـ @ar
label: 是……的器乐指挥集体行为者 @zh-hans
sub property of: kapellimestari (toimija) ekspressiossa
sub property of: johtaja (yhteistoimija) ekspressiossa
definition: Correla un agente collettivo a un'espressione che comprende un contributo di un agente collettivo nella direzione e conduzione di un gruppo di esecuzione strumentale in una presentazione musicale o drammatica. @it
definition: Hozzákapcsol egy kollektív ágenst egy kifejezési formához, amely magában foglalja egy zenei vagy drámai bemutatóban hangszeres előadói csoportot vezénylő és vezető kollektív ágens közreműködését. @hu
definition: Kolektif bir temsilciyi, müzikal veya dramatik bir sunumda enstrümantal bir performans grubunu yürüten ve yöneten kolektif bir temsilcinin katkısını içeren bir anlatımla ilikilendirir. @tr
definition: Liittää yhteistoimijan ekspressioon, jonka tekemisessä yhteistoimija on osallisena johtamalla soitinryhmää musiikki- tai näytelmäesityksessä tms.
definition: Met un agent collectif en relation avec une expression qui intègre une contribution de la part d’un agent collectif consistant à diriger un groupe d’instrumentistes dans une présentation musicale ou dramatique. @fr
definition: Relaciona un agent col·lectiu amb una expressió que inclou una contribució d’un agent col·lectiu dirigint un grup instrumental en una representació musical o dramàtica. @ca
definition: Relateert een collectieve actor aan een expressie die omvat een bijdrage door een collectieve actor van dirigeren en leiden van een instrumentaal optredende groep in een muziek- of dramapresentatie. @nl
definition: Relaterer en kollektiv agent til et udtryk, som omfatter en kollektiv agents bidrag ved at lede en optrædende instrumentalgruppe i en musikalsk eller dramatisk præsentation. @da
definition: Relaterer en kollektiv agent til et uttrykk som inkluderer et bidrag fra en kollektiv agent i form av direksjon og ledelse av en instrumentalgruppe i en musikalsk eller dramatisk forestilling. @no
definition: Relates a collective agent to an expression that includes a contribution by a collective agent of conducting and leading an instrumental performing group in a musical or dramatic presentation. @en
definition: Sasaista grupu ar izteiksmi, kas ietver grupas ieguldījumu, diriģējot un vadot orķestri muzikālā vai dramatiskā uzvedumā. @lv
definition: Seostab kollektiivi väljendusega, millesse kollektiiv on andnud panuse, juhatades instrumentaalkoosseisu muusika- või draamaetenduses. @et
definition: Setzt einen gemeinschaftlichen Akteur in Beziehung zu einer Expression, zu der ein gemeinschaftlicher Akteur beiträgt, indem er eine Instrumentalgruppe in einer musikalischen oder dramatischen Darbietung leitet. @de
definition: يربط وكيلا جماعيا بتعبيرة تتضمن إسهام وكيل جماعي في إدارة فرقة عزف وقيادتها في عرض موسيقي أو درامي. @ar
definition: 将一个集体行为者与包括在音乐或戏剧呈现中指挥并领导一个器乐表演团体的一个集体行为者的贡献的一种内容表达关联起来。 @zh-hans

musiikillinen johtaja (yhteistoimija) ekspressiossa
has element type: 2
toolkit definition: An expression that includes a contribution by a collective agent of coordinating the activities of composers, sound editors, and sound mixers for a moving image production or for a musical or dramatic presentation or entertainment. @en
toolkit definition: Een expressie die omvat een bijdrage van een collectieve actor in het coördineren van de activiteiten van componisten, geluidseditors en geluidsmixers voor een bewegend beeld-productie of in een muziek- of dramapresentatie of vermaak. @nl
toolkit definition: Egy kifejezési forma, amely magában foglalja egy kollektív ágens közreműködését zeneszerzők, hangszerkesztők és hangkeverők feladatainak összehangolásában mozgókép-produkcióban, zenei vagy drámai előadásban vagy szórakoztató műsorban. @hu
toolkit definition: Eine Expression, zu der ein gemeinschaftlicher Akteur beiträgt, indem er die Arbeit der Komponistin/des Komponisten, der Tonbearbeiterin/des Tonbearbeiters und der Tonmeisterin/des Tonmeisters für eine Bewegtbildproduktion oder eine musikalische oder dramatische Darbietung oder Aufführung koordiniert. @de
toolkit definition: Ekspressio, jonka tekemisessä yhteistoimija on osallisena koordinoimalla säveltäjien, äänileikkaajien ja äänimiksaajien toimintaa elokuvatuotannossa tai musiikki- tai näytelmäesityksessä.
toolkit definition: Espressione che comprende un contributo di un agente collettivo nel coordinamento delle attività di compositori, curatori del suono e addetti al missaggio per una produzione di immagini in movimento o per una presentazione o spettacolo musicale o drammatico. @it
toolkit definition: Et uttrykk som inkluderer et bidrag fra en kollektiv agent i form av koordinasjon av aktivitetene til komponist, lydtekniker og lydmiksere for en produksjon med levende bilder eller en musikalsk eller dramatisk forestilling eller annen form for underholdning. @no
toolkit definition: Expression qui intègre une contribution de la part d’un agent collectif consistant à coordonner les activités des compositeurs, des monteurs son et des mixeurs de son pour une production d’images animées ou bien pour une présentation ou un spectacle musical ou dramatique. @fr
toolkit definition: Expressió que inclou una contribució d’un agent col·lectiu en la coordinació de les activitats de compositors, editors de so i mescladors de so en el cas d’una producció d’imatge en moviment o d’una representació o un espectacle musical o dramàtic. @ca
toolkit definition: Hareketli bir görüntü üretimi veya müzikal veya dramatik bir sunum veya eğlence için bestecilerin, ses editörlerinin ve ses mikserlerinin faaliyetlerini koordine eden kolektif bir temsilcinin katkısını içeren bir anlatım. @tr
toolkit definition: Izteiksme, kas ietver grupas ieguldījumu, koordinējot komponista, skaņu redaktora un skaņas miksētāja kustīga attēla izveidi, mūzikāla vai dramatiska darba prezentācijā vai izklaidē. @lv
toolkit definition: Udtryk, som omfatter en kollektiv agents bidrag ved at koordinere komponister, tonemestre og lydmixeres aktiviteter til en levende billedproduktion eller en musikalsk eller dramatisk præsentation eller underholdning. @da
toolkit definition: Väljendus, millesse kollektiiv on andnud panuse, koordineerides heliloojate, helimonteerijate ja helimiksijate tegevust filmi tootmise, muusika- või draamaetenduse või meelelahutusürituse jaoks. @et
toolkit definition: تعبيرة تتضمن إسهام وكيل جماعي بتنسيق أنشطة الملحنين؛ ومحرري الصوت؛ ومازجي الصوت لإنتاج صور متحركة، أو لعرض موسيقي أو درامي أو ترفيهي. @ar
toolkit definition: 包括为动态图像制作或者为音乐或戏剧呈现或娱乐协调作曲者、音响编辑、音响师活动的一个集体行为者的贡献的一种内容表达 @zh-hans
toolkit label: agent collectif directeur musical de @fr
toolkit label: agent col·lectiu director musical de @ca
toolkit label: direttore musicale agente collettivo di @it
toolkit label: ir muzikālais vadītājs (grupa) @lv
toolkit label: ist gemeinschaftlicher Akteur als musikalische Leiterin/musikalischer Leiter von @de
toolkit label: kollektiv agent, som er musikdirektør af @da
toolkit label: musical director collective agent of @en
toolkit label: musiikillinen johtaja (yhteistoimija) ekspressiossa
toolkit label: musikalregissør for (kollektiv agent) @no
toolkit label: muusikajuht (kollektiiv) väljenduses @et
toolkit label: muzikaal director-collectieve actor van @nl
toolkit label: müzikal yönetmeni kolektif temsilcisi @tr
toolkit label: zenei rendező kollektív ágense: @hu
toolkit label: μουσικός διευθυντής συλλογικός φορέας του @el
toolkit label: هو وكيل جماعي قائد فرقة عزف لـ @ar
toolkit label: ……的音乐总监集体行为者 @zh-hans
has subproperty: musiikillinen johtaja (yhteisö) ekspressiossa
has subproperty: musiikillinen johtaja (suku) ekspressiossa
has subproperty: P50727
lexical alias: musicalDirectorCollectiveAgentOf.en
status: Published
type: Property
domain: C10011
label: er kollektiv agent, som er musikdirektør af @da
label: er musikalregissør for (kollektiv agent) @no
label: est un agent collectif directeur musical de @fr
label: ir muzikālais vadītājs (grupa) @lv
label: is musical director collective agent of @en
label: is muzikaal director-collectieve actor van @nl
label: ist gemeinschaftlicher Akteur als musikalische Leiterin/musikalischer Leiter von @de
label: muusikajuht (kollektiiv) väljenduses @et
label: müzik yönetmeni kolektif temsilcisidir @tr
label: zenei rendező kollektív ágense a következőnek: @hu
label: è direttore musicale agente collettivo di @it
label: és agent col·lectiu director musical de @ca
label: είναι μουσικός διευθυντής συλλογικός φορέας του @el
label: هو وكيل جماعي قائد فرقة عزف لـ @ar
label: 是……的音乐总监集体行为者 @zh-hans
sub property of: musiikillinen johtaja (toimija) ekspressiossa
sub property of: esitykseen osallinen yhteistoimija ekspressiossa
definition: Correla un agente collettivo a un'espressione che comprende un contributo di un agente collettivo nel coordinamento delle attività di compositori, curatori del suono e addetti al missaggio per una produzione di immagini in movimento o per una presentazione o spettacolo musicale o drammatico. @it
definition: Hozzákapcsol egy kollektív ágenst egy kifejezési formához, amely magában foglalja egy kollektív ágens közreműködését zeneszerzők, hangszerkesztők és hangkeverők feladatainak összehangolásában mozgókép-produkcióban, zenei vagy drámai előadásban vagy szórakoztató műsorban. @hu
definition: Kolektif bir temsilciyi, hareketli bir görüntü üretimi veya müzikal veya dramatik bir sunum veya eğlence için bestecilerin, ses editörlerinin ve ses mikserlerinin faaliyetlerini koordine eden kolektif bir temsilcinin katkısını içeren bir anlatımla ilişkilendirir. @tr
definition: Liittää yhteistoimijan ekspressioon, jonka tekemisessä yhteistoimija on osallisena koordinoimalla säveltäjien, äänileikkaajien ja äänimiksaajien toimintaa elokuvatuotannossa tai musiikki- tai näytelmäesityksessä.
definition: Met un agent collectif en relation avec une expression qui intègre une contribution de la part d’un agent collectif consistant à coordonner les activités des compositeurs, des monteurs son et des mixeurs de son pour une production d’images animées ou bien pour une présentation ou un spectacle musical ou dramatique. @fr
definition: Relaciona un agent col·lectiu amb una expressió que inclou una contribució d’un agent col·lectiu en la coordinació de les activitats de compositors, editors de so i mescladors de so en el cas d’una producció d’imatge en moviment o d’una representació o un espectacle musical o dramàtic. @ca
definition: Relateert een collectieve actor aan een expressie die omvat een bijdrage van een collectieve actor in het coördineren van de activiteiten van componisten, geluidseditors en geluidsmixers voor een bewegend beeld-productie of in een muziek- of dramapresentatie of vermaak. @nl
definition: Relaterer en kollektiv agent til et udtryk, som omfatter en kollektiv agents bidrag ved at koordinere komponister, tonemestre og lydmixeres aktiviteter til en levende billedproduktion eller en musikalsk eller dramatisk præsentation eller underholdning. @da
definition: Relaterer en kollektiv agent til et uttrykk som inkluderer et bidrag fra en kollektiv agent i form av koordinasjon av aktivitetene til komponist, lydtekniker og lydmiksere for en produksjon med levende bilder eller en musikalsk eller dramatisk forestilling eller annen form for underholdning. @no
definition: Relates a collective agent to an expression that includes a contribution by a collective agent of coordinating the activities of composers, sound editors, and sound mixers for a moving image production or for a musical or dramatic presentation or entertainment. @en
definition: Sasaista grupu ar izteiksmi, kas ietver grupas ieguldījumu, koordinējot komponista, skaņu redaktora un skaņas miksētāja kustīga attēla izveidi, mūzikāla vai dramatiska darba prezentācijā vai izklaidē. @lv
definition: Seostab kollektiivi väljendusega, millesse kollektiiv on andnud panuse, koordineerides heliloojate, helimonteerijate ja helimiksijate tegevust filmi tootmise, muusika- või draamaetenduse või meelelahutusürituse jaoks. @et
definition: Setzt einen gemeinschaftlichen Akteur in Beziehung zu einer Expression, zu der ein gemeinschaftlicher Akteur beiträgt, indem er die Arbeit der Komponistin/des Komponisten, der Tonbearbeiterin/des Tonbearbeiters und der Tonmeisterin/des Tonmeisters für eine Bewegtbildproduktion oder eine musikalische oder dramatische Darbietung oder Aufführung koordiniert. @de
definition: تربط وكيل جماعي بتعبيرة تتضمن إسهام وكيل جماعي في تنسيق أنشطة الملحنين؛ ومحرري الصوت؛ ومازجي الصوت لإنتاج صور متحركة، أو لعرض موسيقي، أو درامي، أو ترفيهي. @ar
definition: 将一个集体行为者与包括为动态图像制作或者为音乐或戏剧呈现或娱乐协调作曲者、音响编辑、音响师活动的一个集体行为者的贡献的一种内容表达关联起来。 @zh-hans

tanssija (yhteistoimija) ekspressiossa
has element type: 2
toolkit definition: An expression that includes a contribution by a collective agent of dancing in a musical or dramatic presentation. @en
toolkit definition: Een expressie die omvat een bijdrage van een collectieve actor door het dansen in een muziek- of dramapresentatie. @nl
toolkit definition: Egy kifejezési forma, amely magában foglalja egy zenei vagy drámai bemutatóban táncoló kollektív ágens közreműködését. @hu
toolkit definition: Eine Expression, zu der ein gemeinschaftlicher Akteur beiträgt, indem er in einer musikalischen oder dramatischen Darbietung tanzt. @de
toolkit definition: Ekspressio, jonka tekemisessä yhteistoimija on osallisena tanssimalla musiikki- tai näyttämöesityksessä.
toolkit definition: Espressione che comprende un contributo di un agente collettivo nella danza in una presentazione musicale o drammatica. @it
toolkit definition: Et uttrykk som inkluderer et bidrag fra en kollektiv agent i form av dansing i en musikalsk eller dramatisk forestilling. @no
toolkit definition: Expression qui intègre une contribution de la part d’un agent collectif consistant à danser dans une présentation musicale ou dramatique. @fr
toolkit definition: Expressió que inclou una contribució d’un agent col·lectiu dansant en una representació musical o dramàtica. @ca
toolkit definition: Izteiksme, kas ietver grupas ieguldījumu, dejojot muzikālā vai dramatiskā uzvedumā. @lv
toolkit definition: Müzikal veya dramatik bir sunumda kolektif bir temsilcinin dans katkısını içeren bir anlatım. @tr
toolkit definition: Udtryk, som omfatter en kollektiv agents bidrag ved at danse i en musikalsk eller dramatisk præsentation. @da
toolkit definition: Väljendus, millesse kollektiiv on andnud panuse, tantsides muusika- või draamaetenduses. @et
toolkit definition: تعبيرة تتضمن إسهام وكيل جماعي في الرقص في عرض موسيقي أو درامي. @ar
toolkit definition: 包括在音乐或戏剧呈现中的一个舞蹈集体行为者的贡献的一种内容表达 @zh-hans
toolkit label: Gemeinschaftlicher Akteur als Tänzerin/Tänzer von @de
toolkit label: agent collectif danseur de @fr
toolkit label: agent col·lectiu ballarí de @ca
toolkit label: ballerino agente collettivo di @it
toolkit label: dancer collective agent of @en
toolkit label: danser for (kollektiv agent) @no
toolkit label: danser-collectieve actor van @nl
toolkit label: dansçı kolektif temsilci @tr
toolkit label: ir dejotājs (grupa) @lv
toolkit label: kollektiv agent, som er danser af @da
toolkit label: tanssija (yhteistoimija) ekspressiossa
toolkit label: tantsija (kollektiiv) väljenduses @et
toolkit label: táncos kollektív ágense: @hu
toolkit label: χορευτής συλλογικός φορέας του @el
toolkit label: هو وكيل جماعي راقص لـ @ar
toolkit label: ……的舞蹈者集体行为者 @zh-hans
has subproperty: tanssija (yhteisö) ekspressiossa
has subproperty: tanssija (suku) ekspressiossa
has subproperty: P50728
lexical alias: dancerCollectiveAgentOf.en
status: Published
type: Property
domain: C10011
label: dansçı kolektif temsilcisidir @tr
label: er danser for (kollektiv agent) @no
label: er kollektiv agent, som er danser af @da
label: est un agent collectif danseur de @fr
label: ir dejotājs (grupa) @lv
label: is dancer collective agent of @en
label: is danser-collectieve actor van @nl
label: ist gemeinschaftlicher Akteur als Tänzerin/Tänzer von @de
label: tantsija (kollektiiv) väljenduses @et
label: táncos kollektív ágense a következőnek: @hu
label: è ballerino agente collettivo di @it
label: és agent col·lectiu ballarí de @ca
label: είναι χορευτής συλλογικός φορέας του @el
label: هو وكيل جماعي راقص لـ @ar
label: 是……的舞蹈者集体行为者 @zh-hans
sub property of: tanssija (toimija) ekspressiossa
sub property of: esittäjä (yhteistoimija) ekspressiossa
definition: Correla un agente collettivo a un'espressione che comprende un contributo di un agente collettivo nella danza in una presentazione musicale o drammatica. @it
definition: Hozzákapcsol egy kollektív ágenst egy kifejezési formához, amely magában foglalja egy zenei vagy drámai bemutatóban táncoló kollektív ágens közreműködését. @hu
definition: Kolektif bir temsilciyi, müzikal veya dramatik bir sunumda kolektif bir dans temsilcisinin katkısını içeren bir anlatımla ilişkilendirir. @tr
definition: Liittää yhteistoimijan ekspressioon, jonka tekemisessä yhteistoimija on osallisena tanssimalla musiikki- tai näyttämöesityksessä.
definition: Met un agent collectif en relation avec une expression qui intègre une contribution de la part d’un agent collectif consistant à danser dans une présentation musicale ou dramatique. @fr
definition: Relaciona un agent col·lectiu amb una expressió que inclou una contribució d’un agent col·lectiu dansant en una representació musical o dramàtica. @ca
definition: Relateert een collectieve actor aan een expressie die omvat een bijdrage van een collectieve actor door het dansen in een muziek- of dramapresentatie. @nl
definition: Relaterer en kollektiv agent til et udtryk, som omfatter en kollektiv agents bidrag ved at danse i en musikalsk eller dramatisk præsentation. @da
definition: Relaterer en kollektiv agent til et uttrykk som inkluderer et bidrag fra en kollektiv agent i form av dansing i en musikalsk eller dramatisk forestilling. @no
definition: Relates a collective agent to an expression that includes a contribution by a collective agent of dancing in a musical or dramatic presentation. @en
definition: Sasaista grupu ar izteiksmi, kas ietver grupas ieguldījumu, dejojot muzikālā vai dramatiskā uzvedumā. @lv
definition: Seostab kollektiivi väljendusega, millesse kollektiiv on andnud panuse, tantsides muusika- või draamaetenduses. @et
definition: Setzt einen gemeinschaftlichen Akteur in Beziehung zu einer Expression, zu der ein gemeinschaftlicher Akteur beiträgt, indem er in einer musikalischen oder dramatischen Darbietung tanzt. @de
definition: يربط وكيلا جماعيا بتعبيرة تتضمن إسهام وكيل جماعي في إدارة فرقة عزف وقيادتها في عرض موسيقي أو درامي. @ar
definition: 将一个集体行为者与包括在音乐或戏剧呈现中的一个舞蹈集体行为者的贡献的一种内容表达关联起来。 @zh-hans

äänisuunnittelija (yhteistoimija) ekspressiossa
has element type: 2
toolkit definition: An expression that includes a contribution by a collective agent of designing and creating audio or sound components. @en
toolkit definition: Een expressie die omvat een bijdrage door een collectieve actor door ontwerpen en creëren van audio- en geluidseffecten. @nl
toolkit definition: Egy kifejezési forma, amely magában foglalja egy kollektív ágens közreműködését audio- vagy hangösszetevők tervezésében és létrehozásában. @hu
toolkit definition: Eine Expression, zu der ein gemeinschaftlicher Akteur beiträgt, indem er Tonelemente entwirft und erstellt. @de
toolkit definition: Ekspressio, jossa yhteistoimija on osallisena suunnittelemalla ja luomalla äänikomponentteja.
toolkit definition: Espressione che comprende un contributo di un agente collettivo per la progettazione e creazione di componenti audio o sonori. @it
toolkit definition: Et uttrykk som inkluderer et bidrag fra en kollektiv agent i form av å utforme og skape lydkomponenter. @no
toolkit definition: Expression qui intègre une contribution de la part d’un agent collectif consistant à concevoir et à créer des effets audio ou sonores. @fr
toolkit definition: Expressió que inclou una contribució d’un agent col·lectiu en el disseny i la creació de components àudio o sonors. @ca
toolkit definition: Izteiksme, kas ietver grupas ieguldījumu, izstrādājot un radot audio vai skaņas komponentus. @lv
toolkit definition: Ses veya ses bileşenlerini tasarlama ve oluşturulmasında kolektif bir temsilcinin katkısını içeren bir anlatım. @tr
toolkit definition: Udtryk, som omfatter en kollektiv agents bidrag ved at designe og skabe audio- eller lyddele. @da
toolkit definition: Väljendus, millesse kollektiiv on andnud panuse, kavandades ja luues selle helikomponendid. @et
toolkit definition: تعبيرة تتضمن إسهام وكيل جماعي بوضع مكياج أومكياج ترقيعي في إنتاج صور متحركة أو في عرض موسيقي أو درامي أو ترفيهي. @ar
toolkit definition: 包括设计并创作音频或音响组成部分的一个集体行为者的贡献的一种内容表达 @zh-hans
toolkit label: Gemeinschaftlicher Akteur als Tongestalterin/Tongestalter von @de
toolkit label: agent collectif concepteur sonore de @fr
toolkit label: agent col·lectiu dissenyador de so de @ca
toolkit label: geluidsontwerper-collectieve actor van @nl
toolkit label: hangtervező kollektív ágense: @hu
toolkit label: helikujundaja (kollektiiv) väljenduses @et
toolkit label: ir skaņu mākslinieks (grupa) @lv
toolkit label: kollektiv agent, som er lyddesigner af @da
toolkit label: lyddesigner for (kollektiv agent) @no
toolkit label: progettista del suono agente collettivo di @it
toolkit label: ses tasarımcısı kolektif temsilci @tr
toolkit label: sound designer collective agent of @en
toolkit label: äänisuunnittelija (yhteistoimija) ekspressiossa
toolkit label: σχεδιαστής ήχου συλλογικός φορέας του @el
toolkit label: هو وكيل جماعي قائد فرقة عزف لـ @ar
toolkit label: ……的音响设计者集体行为者 @zh-hans
has subproperty: äänisuunnittelija (yhteisö) ekspressiossa
has subproperty: äänisuunnittelija (suku) ekspressiossa
has subproperty: P50729
lexical alias: soundDesignerCollectiveAgentOf.en
status: Published
type: Property
domain: C10011
label: er kollektiv agent, som er lyddesigner af @da
label: er lyddesigner for (kollektiv agent) @no
label: est un agent collectif concepteur sonore de @fr
label: hangtervező kollektív ágense a következőnek: @hu
label: helikujundaja (kollektiiv) väljenduses @et
label: ir skaņu mākslinieks (grupa) @lv
label: is geluidsontwerper-collectieve actor van @nl
label: is sound designer collective agent of @en
label: ist gemeinschaftlicher Akteur als Tongestalterin/Tongestalter von @de
label: ses tasarımcısı kolektif temsilci @tr
label: è progettista del suono agente collettivo di @it
label: és agent col·lectiu dissenyador de so de @ca
label: είναι σχεδιαστής ήχου συλλογικός φορέας του @el
label: هو وكيل جماعي قائد فرقة عزف لـ @ar
label: 是……的音响设计者集体行为者 @zh-hans
sub property of: äänisuunnittelija (toimija) ekspressiossa
sub property of: esitykseen osallinen yhteistoimija ekspressiossa
definition: Correla un agente collettivo a un'espressione che comprende un contributo di un agente collettivo per la progettazione e creazione di componenti audio o sonori. @it
definition: Hozzákapcsol egy kollektív ágenst egy kifejezési formához, amely magában foglalja egy kollektív ágens közreműködését audio- vagy hangösszetevők tervezésében és létrehozásában. @hu
definition: Kolektif bir temsilciyi, ses veya ses bileşenlerinin tasarlanması ve yaratılmasına yönelik kolektif bir temsilcinin katkısını içeren bir anlatımla ilişkilendirir. @tr
definition: Liittää yhteistoimijan ekspressioon, jossa yhteistoimija on osallisena suunnittelemalla ja luomalla äänikomponentteja.
definition: Met un agent collectif en relation avec une expression qui intègre une contribution de la part d’un agent collectif consistant à concevoir et à créer des effets audio ou sonores. @fr
definition: Relaciona un agent col·lectiu amb una expressió que inclou una contribució d’un agent col·lectiu en el disseny i la creació de components àudio o sonors. @ca
definition: Relateert een collectieve actor aan een expressie die omvat een bijdrage door een collectieve actor door ontwerpen en creëren van audio- en geluidseffecten. @nl
definition: Relaterer en kollektiv agent til et udtryk, som omfatter en kollektiv agents bidrag ved at designe og skabe audio- eller lyddele. @da
definition: Relaterer en kollektiv agent til et uttrykk som inkluderer et bidrag fra en kollektiv agent i form av å utforme og skape lydkomponenter. @no
definition: Relates a collective agent to an expression that includes a contribution by a collective agent of designing and creating audio or sound components. @en
definition: Sasaista grupu ar izteiksmi, kas ietver grupas ieguldījumu, izstrādājot un radot audio vai skaņas komponentus. @lv
definition: Seostab kollektiivi väljendusega, millesse kollektiiv on andnud panuse, kavandades ja luues selle helikomponendid. @et
definition: Setzt einen gemeinschaftlichen Akteur in Beziehung zu einer Expression, zu der ein gemeinschaftlicher Akteur beiträgt, indem er Tonelemente entwirft und erstellt. @de
definition: يربط وكيلا جماعيا بتعبيرة تتضمن إسهام وكيل جماعي في إدارة فرقة عزف وقيادتها في عرض موسيقي أو درامي. @ar
definition: 将一个集体行为者与包括设计并创作音频或音响组成部分的一个集体行为者的贡献的一种内容表达关联起来。 @zh-hans

valosuunnittelija (yhteistoimija) ekspressiossa
has element type: 2
toolkit definition: An expression that includes a contribution by a collective agent of designing and creating lighting components. @en
toolkit definition: Een expressie die omvat een bijdrage door een collectieve actor door ontwerpen en creëren van lichteffecten. @nl
toolkit definition: Egy kifejezési forma, amely magában foglalja egy kollektív ágens közreműködését világítási összetevők tervezésében és létrehozásában. @hu
toolkit definition: Eine Expression, zu der ein gemeinschaftlicher Akteur beiträgt, indem er Lichtelemente entwirft und erstellt. @de
toolkit definition: Ekspressio, jossa yhteistoimija on osallisena suunnittelemalla ja luomalla valokomponentteja.
toolkit definition: Espressione che comprende un contributo di un agente collettivo nella progettazione e creazione di componenti per l'illuminazione. @it
toolkit definition: Et uttrykk som inkluderer et bidrag fra en kollektiv agent i form av å utforme og skape lyssettingskomponenter. @no
toolkit definition: Expression qui intègre une contribution de la part d’un agent collectif consistant à concevoir et à créer des effets de lumière. @fr
toolkit definition: Expressió que inclou una contribució d’un agent col·lectiu en el disseny i creació de components luminotècnics. @ca
toolkit definition: Izteiksme, kas ietver grupas ieguldījumu, izstrādājot un radot apgaismojuma efektus. @lv
toolkit definition: Işıklandırma bileşenlerini tasarlama ve oluşturulmasında kolektif bir temsilcinin katkısını içeren bir anlatım. @tr
toolkit definition: Udtryk, som omfatter en kollektiv agents bidrag ved at designe og skabe belysningsdele. @da
toolkit definition: Väljendus, millesse kollektiiv on andnud panuse, kavandades ja luues selle valguskomponendid. @et
toolkit definition: تعبيرة تتضمن إسهام وكيل جماعي بوضع مكياج أومكياج ترقيعي في إنتاج صور متحركة أو في عرض موسيقي أو درامي أو ترفيهي. @ar
toolkit definition: 包括设计并创作灯光组成部分的一个集体行为者的贡献的一种内容表达 @zh-hans
toolkit label: Gemeinschaftlicher Akteur als Lichtgestalterin/Lichtgestalter von @de
toolkit label: Işık tasarımcısı kollektif temsilci @tr
toolkit label: agent collectif éclairagiste de @fr
toolkit label: agent col·lectiu dissenyador d’il·luminació de @ca
toolkit label: ir gaismu mākslinieks (grupa) @lv
toolkit label: kollektiv agent, som er belysningsdesigner af @da
toolkit label: lichtontwerper-collectieve actor van @nl
toolkit label: lighting designer collective agent of @en
toolkit label: lysdesigner for (kollektiv agent) @no
toolkit label: progettista dell'illuminazione agente collettivo di @it
toolkit label: valguskujundaja (kollektiiv) väljenduses @et
toolkit label: valosuunnittelija (yhteistoimija) ekspressiossa
toolkit label: világítástervező kollektív ágense: @hu
toolkit label: σχεδιαστής φωτισμού συλλογικός φορέας του @el
toolkit label: هو وكيل جماعي قائد فرقة عزف لـ @ar
toolkit label: ……的灯光设计者集体行为者 @zh-hans
has subproperty: valosuunnittelija (yhteisö) ekspressiossa
has subproperty: valosuunnittelija (suku) ekspressiossa
has subproperty: P50730
lexical alias: lightingDesignerCollectiveAgentOf.en
status: Published
type: Property
domain: C10011
label: er kollektiv agent, som er belysningsdesigner af @da
label: er lysdesigner for (kollektiv agent) @no
label: est un agent collectif éclairagiste de @fr
label: ir gaismu mākslinieks (grupa) @lv
label: is lichtontwerper-collectieve actor van @nl
label: is lighting designer collective agent of @en
label: ist gemeinschaftlicher Akteur als Lichtgestalterin/Lichtgestalter von @de
label: valguskujundaja (kollektiiv) väljenduses @et
label: világítástervező kollektív ágense a következőnek: @hu
label: è progettista dell'illuminazione agente collettivo di @it
label: és agent col·lectiu dissenyador d’il·luminació de @ca
label: ışık tasarımcısı kolektif temsilcisidir @tr
label: είναι σχεδιαστής φωτισμού συλλογικός φορέας του @el
label: هو وكيل جماعي قائد فرقة عزف لـ @ar
label: 是……的灯光设计者集体行为者 @zh-hans
sub property of: valosuunnittelija (toimija) ekspressiossa
sub property of: esitykseen osallinen yhteistoimija ekspressiossa
definition: Correla un agente collettivo a un'espressione che comprende un contributo di un agente collettivo nella progettazione e creazione di componenti per l'illuminazione. @it
definition: Hozzákapcsol egy kollektív ágenst egy kifejezési formához, amely magában foglalja egy kollektív ágens közreműködését világítási összetevők tervezésében és létrehozásában. @hu
definition: Kolektif bir temsilciyi, aydınlatma bileşenlerini tasarlamak ve oluşturmak için kolektif bir temsilcinin katkısını içeren bir anlatımla ilişkilendirir. @tr
definition: Liittää yhteistoimijan ekspressioon, jossa yhteistoimija on osallisena suunnittelemalla ja luomalla valokomponentteja.
definition: Met un agent collectif en relation avec une expression qui intègre une contribution de la part d’un agent collectif consistant à concevoir et à créer des effets de lumière. @fr
definition: Relaciona un agent col·lectiu amb una expressió que inclou una contribució d’un agent col·lectiu en el disseny i creació de components luminotècnics. @ca
definition: Relateert een collectieve actor aan een expressie die omvat een bijdrage door een collectieve actor door ontwerpen en creëren van lichteffecten. @nl
definition: Relaterer en kollektiv agent til et udtryk, som omfatter en kollektiv agents bidrag ved at designe og skabe belysningsdele. @da
definition: Relaterer en kollektiv agent til et uttrykk som inkluderer et bidrag fra en kollektiv agent i form av å utforme og skape lyssettingskomponenter. @no
definition: Relates a collective agent to an expression that includes a contribution by a collective agent of designing and creating lighting components. @en
definition: Sasaista grupu ar izteiksmi, kas ietver grupas ieguldījumu, izstrādājot un radot apgaismojuma efektus. @lv
definition: Seostab kollektiivi väljendusega, millesse kollektiiv on andnud panuse, kavandades ja luues selle valguskomponendid. @et
definition: Setzt einen gemeinschaftlichen Akteur in Beziehung zu einer Expression, zu der ein gemeinschaftlicher Akteur beiträgt, indem er Lichtelemente entwirft und erstellt. @de
definition: يربط وكيلا جماعيا بتعبيرة تتضمن إسهام وكيل جماعي في إدارة فرقة عزف وقيادتها في عرض موسيقي أو درامي. @ar
definition: 将一个集体行为者与包括设计并创作灯光组成部分的一个集体行为者的贡献的一种内容表达关联起来。 @zh-hans

erikoistehosteiden tekijä (yhteistoimija) ekspressiossa
has element type: 2
toolkit definition: An expression that includes a contribution by a collective agent of designing and creating on-set special effects, such as on-set mechanical effects and in-camera optical effects. @en
toolkit definition: Een expressie die omvat een bijdrage door een collectieve actor door ontwerpen en creëren van op-de-set speciale effecten, zoals op-de-set mechanische effecten en in-camera optische effecten. @nl
toolkit definition: Egy kifejezési forma, amely magában foglalja egy kollektív ágens közreműködését olyan helyszíni speciális effektusok tervezésében és létrehozásában, mint a mechanikai és kamerán belüli optikai hatások. @hu
toolkit definition: Eine Expression, zu der ein gemeinschaftlicher Akteur beiträgt, indem er am Set Spezialeffekte, wie zum Beispiel mechanische Effekte am Set und optische Effekte in der Kamera, entwirft und erstellt. @de
toolkit definition: Ekspressio, jossa yhteistoimija on osallisena liikkuvan kuvan tai ääniteoksen ekspression tekemisessä suunnittelemalla ja luomalla taltioinnin aikana tapahtuvat erikoistehosteet, kuten mekaaniset tehosteet ja kameralla toteutettavat optiset tehosteet.
toolkit definition: Espressione che comprende un contributo di un agente collettivo nella progettazione e creazione di effetti speciali sul set, quali effetti meccanici sul set ed effetti ottici della telecamera. @it
toolkit definition: Et uttrykk som inkluderer et bidrag fra en kollektiv agent i form av å utforme og skape spesialeffekter under innspilling, for eksempel mekaniske effekter på settet eller optiske effekter i kameraet. @no
toolkit definition: Expression qui intègre une contribution de la part d’un agent collectif consistant à concevoir et à créer des effets spéciaux de plateau tels que des effets mécaniques de plateau et des effets d’optique dans la caméra. @fr
toolkit definition: Expressió que inclou una contribució d’un agent col·lectiu en el disseny i la creació d’efectes especials de plató, com ara efectes mecànics de plató i efectes òptics de càmera. @ca
toolkit definition: Izteiksme, kas ietver grupas ieguldījumu, izstrādājot un radot scēnu specefektus, piemēram, radot scēnas mehāniskos efektus un kameras specifiskos optiskos efektus. @lv
toolkit definition: Sette mekanik efektler ve kamera içi optik efektler gibi özel efektlerin tasarlanması ve oluşturulmasında kolektif bir temsilcinin katkısını içeren bir anlatım. @tr
toolkit definition: Udtryk, som omfatter en kollektiv agents bidrag ved at designe og skabe specialeffekter på stedet, såsom mekaniske effekter og optiske kameraeffekter. @da
toolkit definition: Väljendus, millesse kollektiiv on andnud panuse, kavandades ja luues salvestusaegsed eriefektid, nt salvestusaegsed mehaanilised efektid ja kaameraga tehtavad optilised efektid. @et
toolkit definition: يربط وكيلا جماعيا بتعبيرة تتضمن إسهام وكيل جماعي في تصميم مؤثرات خاصة وإنشائها أثناء التصوير، مثل المؤثرات الميكانيكية والمؤثرات البصرية في الكاميرا. @ar
toolkit definition: 包括设计并创作现场特殊效果（例如现场机械效果和相机光学效果）的一个集体行为者的贡献的一种内容表达 @zh-hans
toolkit label: Gemeinschaftlicher Akteur als Special-effects-Provider von @de
toolkit label: aanbieder speciale effecten-collectieve actor van @nl
toolkit label: agent collectif fournisseur d’effets spéciaux de @fr
toolkit label: agent col·lectiu proveïdor d’efectes especials de @ca
toolkit label: curatore degli effetti speciali agente collettivo di @it
toolkit label: eriefektide tootja (kollektiiv) väljenduses @et
toolkit label: erikoistehosteiden tekijä (yhteistoimija) ekspressiossa
toolkit label: ir specefektu mākslinieks (grupa) @lv
toolkit label: kollektiv agent, som er leverandør af specialeffekter af @da
toolkit label: leverandør av spesialeffekter for (kollektiv agent) @no
toolkit label: special effects provider collective agent of @en
toolkit label: speciális effektusokat szolgáltató kollektív ágense: @hu
toolkit label: özel efekt sağlayıcı kolektif temsilci @tr
toolkit label: παροχέας ειδικών αποτελεσμάτων συλλογικός φορέας του @el
toolkit label: هو وكيل جماعي مورد مؤثرات خاصة لـ @ar
toolkit label: ……的特殊效果提供者集体行为者 @zh-hans
has subproperty: erikoistehosteiden tekijä (yhteisö) ekspressiossa
has subproperty: erikoistehosteiden tekijä (suku) ekspressiossa
has subproperty: P50731
lexical alias: specialEffectsProviderCollectiveAgentOf.en
status: Published
type: Property
domain: C10011
label: er kollektiv agent, som er leverandør af specialeffekter af @da
label: er leverandør av spesialeffekter for (kollektiv agent) @no
label: eriefektide tootja (kollektiiv) väljenduses @et
label: est un agent collectif fournisseur d’effets spéciaux de @fr
label: ir specefektu mākslinieks (grupa) @lv
label: is aanbieder speciale effecten-collectieve actor van @nl
label: is special effects provider collective agent of @en
label: ist gemeinschaftlicher Akteur als Special-effects-Provider von @de
label: speciális effektusokat szolgáltató kollektív ágense a következőnek: @hu
label: Özel efekt sağlayıcı kolektif temsilcisi @tr
label: è curatore degli effetti speciali agente collettivo di @it
label: és agent col·lectiu proveïdor d’efectes especials de @ca
label: είναι παροχέας ειδικών αποτελεσμάτων συλλογικός φορέας του @el
label: هو وكيل جماعي مورد مؤثرات خاصة لـ @ar
label: 是……的特殊效果提供者集体行为者 @zh-hans
sub property of: erikoistehosteiden tekijä (toimija) ekspressiossa
sub property of: esitykseen osallinen yhteistoimija ekspressiossa
definition: Correla un agente collettivo a un'espressione che comprende un contributo di un agente collettivo nella progettazione e creazione di effetti speciali sul set, quali effetti meccanici sul set ed effetti ottici della telecamera. @it
definition: Hozzákapcsol egy kollektív ágenst egy kifejezési formához, amely magában foglalja egy kollektív ágens közreműködését olyan helyszíni speciális effektusok tervezésében és létrehozásában, mint a mechanikai és kamerán belüli optikai hatások. @hu
definition: Kolektif bir temsilciyi, sette mekanik efektler ve kamera içi optik efektler gibi sette özel efektlerin tasarlanması ve oluşturulmasına yönelik kolektif bir temsilcinin katkısını içeren bir anlatımla ilişkilendirir. @tr
definition: Liittää yhteistoimijan ekspressioon, jossa yhteistoimija on osallisena liikkuvan kuvan tai ääniteoksen ekspression tekemisessä suunnittelemalla ja luomalla taltioinnin aikana tapahtuvat erikoistehosteet, kuten mekaaniset tehosteet ja kameralla toteutettavat optiset tehosteet.
definition: Met un agent collectif en relation avec une expression qui intègre une contribution de la part d’un agent collectif consistant à concevoir et à créer des effets spéciaux de plateau tels que des effets mécaniques de plateau et des effets d’optique dans la caméra. @fr
definition: Relaciona un agent col·lectiu amb una expressió que inclou una contribució d’un agent col·lectiu en el disseny i la creació d’efectes especials de plató, com ara efectes mecànics de plató i efectes òptics de càmera. @ca
definition: Relateert een collectieve actor aan een expressie die omvat een bijdrage door een collectieve actor door ontwerpen en creëren van op-de-set speciale effecten, zoals op-de-set mechanische effecten en in-camera optische effecten. @nl
definition: Relaterer en kollektiv agent til et udtryk, som omfatter en kollektiv agents bidrag ved at designe og skabe specialeffekter på stedet, såsom mekaniske effekter og optiske kameraeffekter. @da
definition: Relaterer en kollektiv agent til et uttrykk som inkluderer et bidrag fra en kollektiv agent i form av å utforme og skape spesialeffekter under innspilling, for eksempel mekaniske effekter på settet eller optiske effekter i kameraet. @no
definition: Relates a collective agent to an expression that includes a contribution by a collective agent of designing and creating on-set special effects, such as on-set mechanical effects and in-camera optical effects. @en
definition: Sasaista grupu ar izteiksmi, kas ietver grupas ieguldījumu, izstrādājot un radot scēnu specefektus, piemēram, radot scēnas mehāniskos efektus un kameras specifiskos optiskos efektus. @lv
definition: Seostab kollektiivi väljendusega, millesse kollektiiv on andnud panuse, kavandades ja luues salvestusaegsed eriefektid, nt salvestusaegsed mehaanilised efektid ja kaameraga tehtavad optilised efektid. @et
definition: Setzt einen gemeinschaftlichen Akteur in Beziehung zu einer Expression, zu der ein gemeinschaftlicher Akteur beiträgt, indem er am Set Spezialeffekte, wie zum Beispiel mechanische Effekte am Set und optische Effekte in der Kamera, entwirft und erstellt. @de
definition: يربط وكيلا جماعيا بتعبيرة تتضمن إسهام وكيل جماعي في تصميم مؤثرات خاصة وإنشائها أثناء التصوير، مثل المؤثرات الميكانيكية والمؤثرات البصرية في الكاميرا. @ar
definition: 将一个集体行为者与包括设计并创作现场特殊效果（例如现场机械效果和相机光学效果）的一个集体行为者的贡献的一种内容表达关联起来。 @zh-hans

visuaalisten tehosteiden tekijä (yhteistoimija) ekspressiossa
has element type: 2
toolkit definition: An expression that includes a contribution by a collective agent of designing and creating post-production visual effects. @en
toolkit definition: Een expressie die omvat een bijdrage door een collectieve actor door ontwerpen en creëren van post-productie visuele effecten. @nl
toolkit definition: Egy kifejezési forma, amely magában foglalja egy kollektív ágens közreműködését utómunkálati vizuális effektusok tervezésében és létrehozásában. @hu
toolkit definition: Eine Expression, zu der ein gemeinschaftlicher Akteur beiträgt, indem er in der Postproduktion visuelle Effekte entwirft und erstellt. @de
toolkit definition: Ekspressio, jossa yhteistoimija on osallisena liikkuvan kuvan teoksen ekspression tekemisessä suunnittelemalla ja luomalla visuaaliset tehosteet jälkituotantovaiheessa.
toolkit definition: Espressione che comprende un contributo di un agente collettivo nella progettazione e creazione di effetti visivi in post-produzione. @it
toolkit definition: Et uttrykk som inkluderer et bidrag fra en kollektiv agent i form av å utforme og skape visuelle effekter i etterproduksjon. @no
toolkit definition: Expression qui intègre une contribution de la part d’un agent collectif consistant à concevoir et à créer des effets visuels en postproduction. @fr
toolkit definition: Expressió que inclou una contribució d’un agent col·lectiu en el disseny i la creació dels efectes visuals de postproducció. @ca
toolkit definition: Izteiksme, kas ietver grupas ieguldījumu, izstrādājot un radot kustīga attēla pēcapstrādes vizuālos efektus. @lv
toolkit definition: Udtryk, som omfatter en kollektiv agents bidrag ved at designe og skabe visuelle effekter efter produktionen. @da
toolkit definition: Väljendus, millesse kollektiiv on andnud panuse, kavandades ja luues järelproduktsiooni ajal visuaalseid efekte. @et
toolkit definition: Üretim sonrası görsel efektlerin tasarlanması ve oluşturulmasında kolektif bir temsilcinin katkısını içeren bir anlatım. @tr
toolkit definition: تعبيرة تتضمن إسهام وكيل جماعي بوضع مكياج أومكياج ترقيعي في إنتاج صور متحركة أو في عرض موسيقي أو درامي أو ترفيهي. @ar
toolkit definition: 包括设计并创作制作后视觉效果的一个集体行为者的贡献的一种内容表达 @zh-hans
toolkit label: Gemeinschaftlicher Akteur als Visual-effects-Provider von @de
toolkit label: aanbieder visuele effecten-collectieve actor van @nl
toolkit label: agent collectif fournisseur d’effets visuels de @fr
toolkit label: agent col·lectiu proveïdor d’efectes visuals de @ca
toolkit label: curatore degli effetti visivi agente collettivo di @it
toolkit label: görsel efekt sağlayıcı kolektif temsilci @tr
toolkit label: ir vizuālo efektu mākslinieks (grupa) @lv
toolkit label: kollektiv agent, som er leverandør af visuelle effekter af @da
toolkit label: leverandør av visuelle effekter for (kollektiv agent) @no
toolkit label: visuaalefektide tootja (kollektiiv) väljenduses @et
toolkit label: visuaalisten tehosteiden tekijä (yhteistoimija) ekspressiossa
toolkit label: visual effects provider collective agent of @en
toolkit label: vizuális effektusokat szolgáltató kollektív ágense: @hu
toolkit label: παροχέας οπτικών αποτελεσμάτων συλλογικός φορέας του @el
toolkit label: هو وكيل جماعي مورد مؤثرات خاصة لـ @ar
toolkit label: ……的视觉效果提供者集体行为者 @zh-hans
has subproperty: visuaalisten tehosteiden tekijä (yhteisö) ekspressiossa
has subproperty: visuaalisten tehosteiden tekijä (suku) ekspressiossa
has subproperty: P50732
lexical alias: visualEffectsProviderCollectiveAgentOf.en
status: Published
type: Property
domain: C10011
label: Görsel efektler sağlayıcı kolektif temsilcisidir @tr
label: er kollektiv agent, som er leverandør af visuelle effekter af @da
label: er leverandør av visuelle effekter for (kollektiv agent) @no
label: est un agent collectif fournisseur d’effets visuels de @fr
label: ir vizuālo efektu mākslinieks (grupa) @lv
label: is aanbieder visuele effecten-collectieve actor van @nl
label: is visual effects provider collective agent of @en
label: ist gemeinschaftlicher Akteur als Visual-effects-Provider von @de
label: visuaalefektide tootja (kollektiiv) väljenduses @et
label: vizuális effektusokat szolgáltató kollektív ágense: @hu
label: è curatore degli effetti visivi agente collettivo di @it
label: és agent col·lectiu proveïdor d’efectes visuals de @ca
label: είναι παροχέας οπτικών αποτελεσμάτων συλλογικός φορέας του @el
label: هو وكيل جماعي مورد مؤثرات خاصة لـ @ar
label: 是……的视觉效果提供者集体行为者 @zh-hans
sub property of: visuaalisten tehosteiden tekijä (toimija) ekspressiossa
sub property of: esitykseen osallinen yhteistoimija ekspressiossa
definition: Correla un agente collettivo a un'espressione che comprende un contributo di un agente collettivo nella progettazione e creazione di effetti visivi in post-produzione. @it
definition: Hozzákapcsol egy kollektív ágenst egy kifejezési formához, amely magában foglalja egy kollektív ágens közreműködését utómunkálati vizuális effektusok tervezésében és létrehozásában. @hu
definition: Kolektif bir temsilciyi, üretim sonrası görsel efektleri tasarlama ve oluşturmaya yönelik kolektif bir temsilcinin katkısını içeren bir anlatımla ilişkilendirir. @tr
definition: Liittää yhteistoimijan ekspressioon, jossa yhteistoimija on osallisena liikkuvan kuvan teoksen ekspression tekemisessä suunnittelemalla ja luomalla visuaaliset tehosteet jälkituotantovaiheessa.
definition: Met un agent collectif en relation avec une expression qui intègre une contribution de la part d’un agent collectif consistant à concevoir et à créer des effets visuels en postproduction. @fr
definition: Relaciona un agent col·lectiu amb una expressió que inclou una contribució d’un agent col·lectiu en el disseny i la creació dels efectes visuals de postproducció. @ca
definition: Relateert een collectieve actor aan een expressie die omvat een bijdrage door een collectieve actor door ontwerpen en creëren van post-productie visuele effecten. @nl
definition: Relaterer en kollektiv agent til et udtryk, som omfatter en kollektiv agents bidrag ved at designe og skabe visuelle effekter efter produktionen. @da
definition: Relaterer en kollektiv agent til et uttrykk som inkluderer et bidrag fra en kollektiv agent i form av å utforme og skape visuelle effekter i etterproduksjon. @no
definition: Relates a collective agent to an expression that includes a contribution by a collective agent of designing and creating post-production visual effects. @en
definition: Sasaista grupu ar izteiksmi, kas ietver grupas ieguldījumu, izstrādājot un radot kustīga attēla pēcapstrādes vizuālos efektus. @lv
definition: Seostab kollektiivi väljendusega, millesse kollektiiv on andnud panuse, kavandades ja luues järelproduktsiooni ajal visuaalseid efekte. @et
definition: Setzt einen gemeinschaftlichen Akteur in Beziehung zu einer Expression, zu der ein gemeinschaftlicher Akteur beiträgt, indem er in der Postproduktion visuelle Effekte entwirft und erstellt. @de
definition: يربط وكيلا جماعيا بتعبيرة تتضمن إسهام وكيل جماعي في إدارة فرقة عزف وقيادتها في عرض موسيقي أو درامي. @ar
definition: 将一个集体行为者与包括设计并创作制作后视觉效果的一个集体行为者的贡献的一种内容表达关联起来。 @zh-hans

puvustaja (yhteistoimija) ekspressiossa
has element type: 2
toolkit definition: An expression that includes a contribution by a collective agent of designing costumes for a moving image production or for a musical or dramatic presentation or entertainment. @en
toolkit definition: Een expressie die omvat een bijdrage door een collectieve actor door ontwerpen van kostuums voor een bewegend beeld-productie of voor een muzikale of dramatische presentatie of vermaak. @nl
toolkit definition: Egy kifejezési forma, amely magában foglalja egy kollektív ágens közreműködését jelmezek tervezésében mozgókép-produkciókhoz, zenei vagy drámai előadásokhoz vagy szórakoztató műsorokhoz. @hu
toolkit definition: Eine Expression, zu der ein gemeinschaftlicher Akteur beiträgt, indem er die Kostüme für eine Bewegtbildproduktion oder für eine musikalische oder dramatische Darbietung oder Aufführung entwirft. @de
toolkit definition: Ekspressio, jonka tekemisessä yhteistoimija on osallisena suunnittelemalla elokuvatuotannon tai musiikki- tai näytelmäesityksen puvustuksen.
toolkit definition: Espressione che comprende un contributo di un agente collettivo nella progettazione di costumi per una produzione di immagini in movimento o per una presentazione o spettacolo musicale o drammatico. @it
toolkit definition: Et uttrykk som inkluderer et bidrag fra en kollektiv agent i form av å utforme kostymene for en produksjon med levende bilder eller en musikalsk eller dramatisk forestilling eller form for underholdning. @no
toolkit definition: Expression qui intègre une contribution de la part d’un agent collectif consistant à concevoir des costumes pour une production d’images animées ou bien pour une présentation ou un spectacle musical ou dramatique. @fr
toolkit definition: Expressió que inclou una contribució d’un agent col·lectiu amb el disseny del vestuari en el cas d’una producció d’imatge en moviment o una representació o un espectacle musical o dramàtic. @ca
toolkit definition: Hareketli bir görüntü üretimi ya da müzikal ya da dramatik bir sunum ya da eğlence için kostüm tasarlanmasında kolektif bir temsilcinin katkısını içeren bir anlatım. @tr
toolkit definition: Izteiksme, kas ietver grupas ieguldījumu, izstrādājot tērpu dizainu filmai, muzikālam vai dramatiskam uzvedumam, vai sarīkojumam. @lv
toolkit definition: Udtryk, som omfatter en kollektiv agents bidrag ved at designe kostumer til en levende billedproduktion eller til en musikalsk eller dramatisk præsentation eller underholdning. @da
toolkit definition: Väljendus, millesse kollektiiv on andnud panuse, kujundades kostüüme filmi tootmise, muusika- või draamaetenduse või meelelahutusürituse jaoks. @et
toolkit definition: تعبيرة تتضمن إسهام وكيل جماعي بوضع مكياج أومكياج ترقيعي في إنتاج صور متحركة أو في عرض موسيقي أو درامي أو ترفيهي. @ar
toolkit definition: 包括为动态图像制作或者为音乐或戏剧呈现或娱乐设计服装的一个集体行为者的贡献的一种内容表达 @zh-hans
toolkit label: Gemeinschaftlicher Akteur als Kostümbildnerin/Kostümbildner von @de
toolkit label: agent collectif concepteur de costumes de @fr
toolkit label: agent col·lectiu dissenyador de vestuari de @ca
toolkit label: costume designer collective agent of @en
toolkit label: costumista agente collettivo di @it
toolkit label: ir kostīmu mākslinieks (grupa) @lv
toolkit label: jelmeztervező kollektív ágense: @hu
toolkit label: kollektiv agent, som er kostumedesigner af @da
toolkit label: kostuumontwerper-collectieve actor van @nl
toolkit label: kostymedesigner for (kollektiv agent) @no
toolkit label: kostüm tasarımcısı kolektif temsilci @tr
toolkit label: kostüümikunstnik (kollektiiv) väljenduses @et
toolkit label: puvustaja (yhteistoimija) ekspressiossa
toolkit label: ενδυματολόγος συλλογικός φορέας του @el
toolkit label: هو وكيل جماعي قائد فرقة عزف لـ @ar
toolkit label: ……的服装设计者集体行为者 @zh-hans
has subproperty: puvustaja (yhteisö) ekspressiossa
has subproperty: puvustaja (suku) ekspressiossa
has subproperty: P50733
lexical alias: costumeDesignerCollectiveAgentOf.en
status: Published
type: Property
domain: C10011
label: er kollektiv agent, som er kostumedesigner af @da
label: er kostymedesigner for (kollektiv agent) @no
label: est un agent collectif concepteur de costumes de @fr
label: ir kostīmu mākslinieks (grupa) @lv
label: is costume designer collective agent of @en
label: is kostuumontwerper-collectieve actor van @nl
label: ist gemeinschaftlicher Akteur als Kostümbildnerin/Kostümbildner von @de
label: jelmeztervező kollektív ágense a következőnek: @hu
label: kostüm tasarımcısı kolektif temsilcidir @tr
label: kostüümikunstnik (kollektiiv) väljenduses @et
label: è costumista agente collettivo di @it
label: és agent col·lectiu dissenyador de vestuari de @ca
label: είναι ενδυματολόγος συλλογικός φορέας του @el
label: هو وكيل جماعي قائد فرقة عزف لـ @ar
label: 是……的服装设计者集体行为者 @zh-hans
sub property of: puvustaja (toimija) ekspressiossa
sub property of: esitykseen osallinen yhteistoimija ekspressiossa
definition: Correla un agente collettivo a un'espressione che comprende un contributo di un agente collettivo nella progettazione di costumi per una produzione di immagini in movimento o per una presentazione o spettacolo musicale o drammatico. @it
definition: Hozzákapcsol egy kollektív ágenst egy kifejezési formához, amely magában foglalja egy kollektív ágens közreműködését jelmezek tervezésében mozgókép-produkciókhoz, zenei vagy drámai előadásokhoz vagy szórakoztató műsorokhoz. @hu
definition: Kolektif bir temsilciyi, hareketli bir görüntü üretimi veya müzikal veya dramatik bir sunum veya eğlence için kostüm tasarlamaya yönelik kolektif bir temsilcinin katkısını içeren bir anlatımla ilişkilendirir. @tr
definition: Liittää yhteistoimijan ekspressioon, jonka tekemisessä yhteistoimija on osallisena suunnittelemalla elokuvatuotannon tai musiikki- tai näytelmäesityksen puvustuksen.
definition: Met un agent collectif en relation avec une expression qui intègre une contribution de la part d’un agent collectif consistant à concevoir des costumes pour une production d’images animées ou bien pour une présentation ou un spectacle musical ou dramatique. @fr
definition: Relaciona un agent amb una expressió que inclou una contribució d’un agent col·lectiu amb el disseny del vestuari en el cas d’una producció d’imatge en moviment o una representació o un espectacle musical o dramàtic. @ca
definition: Relateert een collectieve actor aan een expressie die omvat een bijdrage door een collectieve actor door ontwerpen van kostuums voor een bewegend beeld-productie of voor een muzikale of dramatische presentatie of vermaak. @nl
definition: Relaterer en kollektiv agent til et udtryk, som omfatter en kollektiv agents bidrag ved at designe kostumer til en levende billedproduktion eller til en musikalsk eller dramatisk præsentation eller underholdning. @da
definition: Relaterer en kollektiv agent til et uttrykk som inkluderer et bidrag fra en kollektiv agent i form av å utforme kostymene for en produksjon med levende bilder eller en musikalsk eller dramatisk forestilling eller form for underholdning. @no
definition: Relates a collective agent to an expression that includes a contribution by a collective agent of designing costumes for a moving image production or for a musical or dramatic presentation or entertainment. @en
definition: Sasaista grupu ar izteiksmi, kas ietver grupas ieguldījumu, izstrādājot tērpu dizainu filmai, muzikālam vai dramatiskam uzvedumam, vai sarīkojumam. @lv
definition: Seostab kollektiivi väljendusega, millesse kollektiiv on andnud panuse, kujundades kostüüme filmi tootmise, muusika- või draamaetenduse või meelelahutusürituse jaoks. @et
definition: Setzt einen gemeinschaftlichen Akteur in Beziehung zu einer Expression, zu der ein gemeinschaftlicher Akteur beiträgt, indem er die Kostüme für eine Bewegtbildproduktion oder für eine musikalische oder dramatische Darbietung oder Aufführung entwirft. @de
definition: تعبيرة تتضمن إسهام وكيل جماعي بوضع مكياج أومكياج ترقيعي في إنتاج صور متحركة أو في عرض موسيقي أو درامي أو ترفيهي. @ar
definition: 将一个集体行为者与包括为动态图像制作或者为音乐或戏剧呈现或娱乐设计服装的一个集体行为者的贡献的一种内容表达关联起来。 @zh-hans

lavastussuunnittelija (yhteistoimija) ekspressiossa
has element type: 2
toolkit definition: An expression that includes a contribution by a collective agent of designing the overall visual appearance of a moving image production. @en
toolkit definition: Een expressie die omvat een bijdrage door een collectieve actor door ontwerpen van het totale visuele uiterlijk van een bewegend beeld-productie. @nl
toolkit definition: Egy kifejezési forma, amely magában foglalja egy tervező kollektív ágens közreműködését mozgókép-produkció általános vizuális megjelenésében. @hu
toolkit definition: Eine Expression, zu der ein gemeinschaftlicher Akteur beiträgt, indem er für die Gestaltung des gesamten visuellen Erscheinungsbilds einer Bewegtbildproduktion verantwortlich ist. @de
toolkit definition: Ekspressio, johon yhteistoimija osallistuu suunnittelemalla liikkuvan kuvan tuotannon visuaalisen kokonaisilmeen.
toolkit definition: Espressione che comprende un contributo di un agente collettivo nella progettazione dell'aspetto visivo complessivo di una produzione di immagini in movimento. @it
toolkit definition: Et uttrykk som inkluderer et bidrag fra en kollektiv agent i form av å utforme det generelle visuelle uttrykket til en produksjon med levende bilder. @no
toolkit definition: Expression qui intègre une contribution de la part d’un agent collectif consistant à concevoir l’aspect visuel global d’une production d’images animées. @fr
toolkit definition: Expressió que inclou una contribució d’un agent col·lectiu dissenyant l’aparença visual general d’una producció d’imatge en moviment. @ca
toolkit definition: Hareketli bir görüntü prodüksiyonunun genel görsel görünümünün tasarlanmasında kolektif bir temsilcinin katkısını içeren bir anlatım. @tr
toolkit definition: Izteiksme, kas ietver grupas ieguldījumu, izstrādājot kustīga attēla vispārējo vizuālo izskatu. @lv
toolkit definition: Udtryk, som omfatter en kollektiv agents bidrag ved at designe en levende billedproduktions overordnede visuelle udtryk. @da
toolkit definition: Väljendus, millesse kollektiiv on andnud panuse, kujundades liikuvast pildist koosneva produktsiooni visuaalse üldilme. @et
toolkit definition: تعبيرة تتضمن إسهام وكيل جماعي لتصميم المظهر المرئي العام لإنتاج صور متحركة. @ar
toolkit definition: 包括设计动态图像制作整体视觉效果的一个集体行为者的贡献的一种内容表达 @zh-hans
toolkit label: Gemeinschaftlicher Akteur als Szenenbildnerin/Szenenbildner von @de
toolkit label: agent collectif chef décorateur de @fr
toolkit label: agent col·lectiu dissenyador de producció de @ca
toolkit label: designer di produzione agente collettivo di @it
toolkit label: ir filmas scenogrāfs (grupa) @lv
toolkit label: kollektiv agent, som er produktionsdesigner af @da
toolkit label: kunstnik-lavastaja (kollektiiv) väljenduses @et
toolkit label: lavastussuunnittelija (yhteistoimija) ekspressiossa
toolkit label: látványtervező kollektív ágense: @hu
toolkit label: productieontwerper-collectieve actor van @nl
toolkit label: production designer collective agent of @en
toolkit label: produksjonsdesigner for (kollektiv agent) @no
toolkit label: Üretim tasarimcisi kolekti̇f temsilci̇si @tr
toolkit label: σχεδιαστής παραγωγής συλλογικός φορέας του @el
toolkit label: وكيل جماعي مصمم إَنتاج @ar
toolkit label: ……的制作设计者集体行为者 @zh-hans
has subproperty: lavastussuunnittelija (yhteisö) ekspressiossa
has subproperty: lavastussuunnittelija (suku) ekspressiossa
has subproperty: P50734
lexical alias: productionDesignerCollectiveAgentOf.en
status: Published
type: Property
domain: C10011
label: er kollektiv agent, som er produktionsdesigner af @da
label: er produksjonsdesigner for (kollektiv agent) @no
label: est un agent collectif chef décorateur de @fr
label: ir filmas scenogrāfs (grupa) @lv
label: is productieontwerper-collectieve actor van @nl
label: is production designer collective agent of @en
label: ist gemeinschaftlicher Akteur als Szenenbildnerin/Szenenbildner von @de
label: kunstnik-lavastaja (kollektiiv) väljenduses @et
label: látványtervező kollektív ágense a következőnek: @hu
label: yapım tasarımcısı kolektif temsilcisidir @tr
label: è designer di produzione agente collettivo di @it
label: és agent col·lectiu dissenyador de producció de @ca
label: είναι σχεδιαστής παραγωγής συλλογικός φορέας του @el
label: هو وكيل جماعي قائد فرقة عزف لـ @ar
label: 是……的制作设计者集体行为者 @zh-hans
sub property of: lavastussuunnittelija (toimija) ekspressiossa
sub property of: esitykseen osallinen yhteistoimija ekspressiossa
definition: Correla un agente collettivo a un'espressione che comprende un contributo di un agente collettivo nella progettazione dell'aspetto visivo complessivo di una produzione di immagini in movimento. @it
definition: Hozzákapcsol egy kollektív ágenst egy kifejezési formához, amely magában foglalja egy tervező kollektív ágens közreműködését mozgókép-produkció általános vizuális megjelenésében. @hu
definition: Kolektif bir temsilciyi, bir hareketli görüntü prodüksiyonunun genel görsel tasarımının kolektif bir temsilci tarafından tasarlanmasına katkıda bulunulmasını içeren anlatım ile ilişkilendirir. @tr
definition: Liittää yhteistoimijan ekspressioon, johon yhteistoimija osallistuu suunnittelemalla liikkuvan kuvan tuotannon visuaalisen kokonaisilmeen.
definition: Met un agent collectif en relation avec une expression qui intègre une contribution de la part d’un agent collectif consistant à concevoir l’aspect visuel global d’une production d’images animées. @fr
definition: Relaciona un agent col·lectiu amb una expressió que inclou una contribució d’un agent col·lectiu dissenyant l’aparença visual general d’una producció d’imatge en moviment. @ca
definition: Relateert een collectieve actor aan een expressie die omvat een bijdrage door een collectieve actor door ontwerpen van het totale visuele uiterlijk van een bewegend beeld-productie. @nl
definition: Relaterer en kollektiv agent til et udtryk, som omfatter en kollektiv agents bidrag ved at designe en levende billedproduktions overordnede visuelle udtryk. @da
definition: Relaterer en kollektiv agent til et uttrykk som inkluderer et bidrag fra en kollektiv agent i form av å utforme det generelle visuelle uttrykket til en produksjon med levende bilder. @no
definition: Relates a collective agent to an expression that includes a contribution by a collective agent of designing the overall visual appearance of a moving image production. @en
definition: Sasaista grupu ar izteiksmi, kas ietver grupas ieguldījumu, izstrādājot kustīga attēla vispārējo vizuālo izskatu. @lv
definition: Seostab kollektiivi väljendusega, millesse kollektiiv on andnud panuse, kujundades liikuvast pildist koosneva produktsiooni visuaalse üldilme. @et
definition: Setzt einen gemeinschaftlichen Akteur in Beziehung zu einer Expression, zu der ein gemeinschaftlicher Akteur beiträgt, indem er für die Gestaltung des gesamten visuellen Erscheinungsbilds einer Bewegtbildproduktion verantwortlich ist. @de
definition: يربط وكيلا جماعيا بتعبيرة تتضمن إسهام وكيل جماعي لتصميم المظهر المرئي العام لإنتاج صور متحركة. @ar
definition: 将一个集体行为者与包括设计动态图像制作整体视觉效果的一个集体行为者的贡献的一种内容表达关联起来。 @zh-hans

tekstaaja (yhteistoimija) ekspressiossa
has element type: 2
toolkit definition: An expression that includes a contribution by a collective agent of drawing text and graphic sound effects for a comic book, graphic novel, etc. @en
toolkit definition: Bir çizgi roman için metin ve grafik ses efektleri çizilmesinde kolektif bir temsilcinin katkısını içeren bir anlatım. @tr
toolkit definition: Een expressie die omvat een bijdrage door een collectieve actor door tekenen van tekst en grafische geluidseffecten voor een comic, stripboek etc. @nl
toolkit definition: Egy kifejezési forma, amely magában foglalja egy kollektív ágens közreműködését képregény, képregényalbum stb. szövegének és grafikai hangeffektusainak rajzolásában. @hu
toolkit definition: Eine Expression, zu der ein gemeinschaftlicher Akteur beiträgt, indem er für ein Comicbuch, eine Graphic Novel und so weiter Text und grafische Toneffekte zeichnet. @de
toolkit definition: Ekspressio, jossa yhteistoimija on osallisena sarjakuvan, sarjakuvaromaanin tms. ekspression tekemisessä piirtämällä tekstin ja graafiset äänitehosteet.
toolkit definition: Espressione che comprende un contributo di un agente collettivo nel disegno di testo ed effetti sonori grafici per un fumetto, graphic novel, etc. @it
toolkit definition: Et uttrykk som inkluderer et bidrag fra en kollektiv agent i form av å tegne tekst of grafiske lydeffekter for en tegneserie, grafisk roman etc. @no
toolkit definition: Expression qui intègre une contribution de la part d’un agent collectif consistant à dessiner le texte et les effets sonores graphiques pour une bande dessinée, un roman graphique, etc. @fr
toolkit definition: Expressió que inclou una contribució d’un agent col·lectiu en el dibuix de text i d’efectes sonors gràfics d’un còmic, una novel·la gràfica, etc. @ca
toolkit definition: Izteiksme, kas ietver grupas ieguldījumu, zīmējot tekstu un skaņu efektus grafiskā formā komiksu grāmatai, grafiskam romānam u.tml. @lv
toolkit definition: Udtryk, som omfatter en kollektiv agents bidrag ved at tegne tekst og grafiske lydeffekter til en tegneserie, graphic novel etc. @da
toolkit definition: Väljendus, millesse kollektiiv on andnud panuse, joonistades teksti ja graafilisi helijäljendusi koomiksi, graafilise romaani vms jaoks. @et
toolkit definition: تعبيرة تتضمن إسهام وكيل جماعي في رسم النص والمؤثرات الصوتية لرسومات قصة مصورة أو رواية مصورة، إلخ. @ar
toolkit definition: 包括一个为漫画书、图解小说等绘制文字和图案声音效果的一个集体行为者的贡献的一种内容表达 @zh-hans
toolkit label: Gemeinschaftlicher Akteur als Letterer von @de
toolkit label: Hat sanatçısı kolekti̇f temsilci̇si @tr
toolkit label: agent collectif lettreur de @fr
toolkit label: agent col·lectiu retolista de @ca
toolkit label: betűrajzoló kollektív ágense: @hu
toolkit label: ir komiksa teksta rakstītājs (grupa) @lv
toolkit label: kollektiv agent, som er bogstavtegner af @da
toolkit label: letteraar-collectieve actor van @nl
toolkit label: letterer collective agent of @en
toolkit label: letterer for (kollektiv agent) @no
toolkit label: letterista agente collettivo di @it
toolkit label: tekstaaja (yhteistoimija) ekspressiossa
toolkit label: tekstijoonistaja (kollektiiv) väljenduses @et
toolkit label: σχεδιαστής γραμμάτων επιγραφών συλλογικός φορέας του @el
toolkit label: وكيل جماعي رسّام حروف @ar
toolkit label: ……的字母图案画者集体行为者 @zh-hans
has subproperty: tekstaaja (yhteisö) ekspressiossa
has subproperty: tekstaaja (suku) ekspressiossa
has subproperty: P50735
lexical alias: lettererCollectiveAgentOf.en
status: Published
type: Property
domain: C10011
label: betűrajzoló kollektív ágense a következőnek: @hu
label: er kollektiv agent, som er bogstavtegner af @da
label: er letterer for (kollektiv agent) @no
label: est un agent collectif lettreur de @fr
label: ir komiksa teksta rakstītājs (grupa) @lv
label: is letteraar-collectieve actor van @nl
label: is letterer collective agent of @en
label: ist gemeinschaftlicher Akteur als Letterer von @de
label: tekstijoonistaja (kollektiiv) väljenduses @et
label: yazı tasarımcısı kolektif temsilcisidir @tr
label: è letterista agente collettivo di @it
label: és agent col·lectiu retolista de @ca
label: είναι σχεδιαστής γραμμάτων επιγραφών συλλογικός φορέας του @el
label: هو وكيل جماعي رسّام حروف لـ @ar
label: 是……的字母图案画者集体行为者 @zh-hans
sub property of: tekstaaja (toimija) ekspressiossa
sub property of: yhdistymään osallinen yhteistoimija ekspressiossa
definition: Correla un agente collettivo a un'espressione che comprende un contributo di un agente collettivo nel disegno di testo ed effetti sonori grafici per un fumetto, graphic novel, etc. @it
definition: Hozzákapcsol egy kollektív ágenst egy kifejezési formához, amely magában foglalja egy kollektív ágens közreműködését képregény, képregényalbum stb. szövegének és grafikai hangeffektusainak rajzolásában. @hu
definition: Kolektif bir temsilciyi, bir çizgi roman, grafik roman vb. için metin ve grafik ses efektleri çizerek katkıda bulunmasını içeren anlatımla ilişkilendirir. @tr
definition: Liittää yhteistoimijan ekspressioon, jossa yhteistoimija on osallisena sarjakuvan, sarjakuvaromaanin tms. ekspression tekemisessä piirtämällä tekstin ja graafiset äänitehosteet.
definition: Met un agent collectif en relation avec une expression qui intègre une contribution de la part d’un agent collectif consistant à dessiner le texte et les effets sonores graphiques pour une bande dessinée, un roman graphique, etc. @fr
definition: Relaciona un agent col·lectiu amb una expressió que inclou una contribució d’un agent col·lectiu en el dibuix de text i d’efectes sonors gràfics d’un còmic, una novel·la gràfica, etc. @ca
definition: Relateert een collectieve actor aan een expressie die omvat een bijdrage door een collectieve actor door tekenen van tekst en grafische geluidseffecten voor een comic, stripboek etc. @nl
definition: Relaterer en kollektiv agent til et udtryk, som omfatter en kollektiv agents bidrag ved at tegne tekst og grafiske lydeffekter til en tegneserie, graphic novel etc. @da
definition: Relaterer en kollektiv agent til et uttrykk som inkluderer et bidrag fra en kollektiv agent i form av å tegne tekst of grafiske lydeffekter for en tegneserie, grafisk roman etc. @no
definition: Relates a collective agent to an expression that includes a contribution by a collective agent of drawing text and graphic sound effects for a comic book, graphic novel, etc. @en
definition: Sasaista grupu ar izteiksmi, kas ietver grupas ieguldījumu, zīmējot tekstu un skaņu efektus grafiskā formā komiksu grāmatai, grafiskam romānam u.tml. @lv
definition: Seostab kollektiivi väljendusega, millesse kollektiiv on andnud panuse, joonistades teksti ja graafilisi helijäljendusi koomiksi, graafilise romaani vms jaoks. @et
definition: Setzt einen gemeinschaftlichen Akteur in Beziehung zu einer Expression, zu der ein gemeinschaftlicher Akteur beiträgt, indem er für ein Comicbuch, eine Graphic Novel und so weiter Text und grafische Toneffekte zeichnet. @de
definition: يربط وكيلا جماعيا بتعبيرة تتضمن إسهام وكيل جماعي في رسم النص والمؤثرات الصوتية لرسومات قصة مصورة أو رواية مصورة، إلخ. @ar
definition: 将一个集体行为者与包括一个为漫画书、图解小说等绘制文字和图案声音效果的一个集体行为者的贡献的一种内容表达关联起来。 @zh-hans

kääntäjä (yhteistoimija) ekspressiossa
has element type: 2
toolkit definition: An expression that includes a contribution by a collective agent of expressing the linguistic content of the work in a different language. @en
toolkit definition: Bir eserin dilsel içeriğinin farklı bir dilde ifade edilmesinde kolektif bir temsilcinin katkısını içeren bir anlatım. @tr
toolkit definition: Een expressie die omvat een bijdrage door een collectieve actor van uitdrukken van de taalkundige content van het werk in een andere taal. @nl
toolkit definition: Egy kifejezési forma, amely magában foglalja egy kollektív ágens közreműködését egy mű nyelvi tartalmának más nyelven történő kifejezésével. @hu
toolkit definition: Eine Expression, zu der ein gemeinschaftlicher Akteur beiträgt, indem er den sprachlichen Inhalt des Werks in einer anderen Sprache ausdrückt. @de
toolkit definition: Ekspressio, jonka tekemisessä yhteistoimija on osallisena ilmaisemalla teoksen kielellisen sisällön toisella kielellä.
toolkit definition: Espressione che comprende un contributo di un agente collettivo nell'esprimere il contenuto linguistico dell'opera in una lingua differente. @it
toolkit definition: Et uttrykk som inkluderer et bidrag fra en kollektiv agent i form av å uttrykke det språklige innholdet av et verk på et annet språk. @no
toolkit definition: Expression qui intègre une contribution de la part d’un agent collectif consistant à exprimer le contenu linguistique de l’œuvre dans une langue différente. @fr
toolkit definition: Expressió que inclou una contribució d’un agent col·lectiu expressant el contingut lingüístic de l’obra en una llengua diferent. @ca
toolkit definition: Izteiksme, kas ietver grupas ieguldījumu, izsakot darba saturu valodā, kas atšķiras no sākotnējās darba valodas. @lv
toolkit definition: Udtryk, som omfatter en kollektiv agents bidrag ved at udtrykke værkets sproglige indhold på et andet sprog. @da
toolkit definition: Väljendus, millesse kollektiiv on andnud panuse, väljendades teose keelesisu teises keeles. @et
toolkit definition: تعبيرة تتضمن إسهام وكيل جماعي في التعبير عن المحتوى اللغوي للعمل بلغة مختلفة. @ar
toolkit definition: 包括用另一种语言表达作品语言内容的一个集体行为者的贡献的一种内容表达 @zh-hans
toolkit label: Gemeinschaftlicher Akteur als Übersetzerin/Übersetzer von @de
toolkit label: agent collectif traducteur de @fr
toolkit label: agent col·lectiu traductor de @ca
toolkit label: fordító kollektív ágense: @hu
toolkit label: ir tulkotājs (grupa) @lv
toolkit label: kollektiv agent, som er oversætter af @da
toolkit label: kääntäjä (yhteistoimija) ekspressiossa
toolkit label: oversetter for (kollektiv agent) @no
toolkit label: tercüman kolektif temsilcisi @tr
toolkit label: traduttore agente collettivo di @it
toolkit label: translator collective agent of @en
toolkit label: tõlkija (kollektiiv) väljenduses @et
toolkit label: vertaler-collectieve actor van @nl
toolkit label: μεταφραστής συλλογικός φορέας του @el
toolkit label: وكيل جماعي مترجم لـ @ar
toolkit label: ……的译者集体行为者 @zh-hans
has subproperty: kääntäjä (yhteisö) ekspressiossa
has subproperty: kääntäjä (suku) ekspressiossa
has subproperty: P50736
lexical alias: translatorCollectiveAgentOf.en
status: Published
type: Property
domain: C10011
label: er kollektiv agent, som er oversætter af @da
label: er oversetter for (kollektiv agent) @no
label: est un agent collectif traducteur de @fr
label: fordító kollektív ágense a következőnek: @hu
label: ir tulkotājs (grupa) @lv
label: is translator collective agent of @en
label: is vertaler-collectieve actor van @nl
label: ist gemeinschaftlicher Akteur als Übersetzerin/Übersetzer von @de
label: tercüman kolektif temsilcisidir @tr
label: tõlkija (kollektiiv) väljenduses @et
label: è traduttore agente collettivo di @it
label: és agent col·lectiu traductor de @ca
label: είναι μεταφραστής συλλογικός φορέας του @el
label: هو وكيل جماعي مترجم لـ @ar
label: 是……的译者集体行为者 @zh-hans
sub property of: kääntäjä (toimija) ekspressiossa
sub property of: ekspression tekijä (yhteistoimija) ekspressiossa
definition: Correla un agente collettivo a un'espressione che comprende un contributo di un agente collettivo nell'esprimere il contenuto linguistico dell'opera in una lingua differente. @it
definition: Hozzákapcsol egy kollektív ágenst egy kifejezési formához, amely magában foglalja egy kollektív ágens közreműködését egy mű nyelvi tartalmának más nyelven történő kifejezésével. @hu
definition: Kolektif bir temsilciyi, eserin dil içeriğinin farklı bir dilde ifade edilmesine bir kolektif temsilcinin katkısını içeren anlatım ile ilişkilendirir. @tr
definition: Liittää yhteistoimijan ekspressioon, jonka tekemisessä yhteistoimija on osallisena ilmaisemalla teoksen kielellisen sisällön toisella kielellä.
definition: Met un agent collectif en relation avec une expression qui intègre une contribution de la part d’un agent collectif consistant à exprimer le contenu linguistique de l’œuvre dans une langue différente. @fr
definition: Relaciona un agent col·lectiu amb una expressió que inclou una contribució d’un agent col·lectiu expressant el contingut lingüístic de l’obra en una llengua diferent. @ca
definition: Relateert een collectieve actor aan een expressie die omvat een bijdrage door een collectieve actor van uitdrukken van de taalkundige content van het werk in een andere taal. @nl
definition: Relaterer en kollektiv agent til et udtryk, som omfatter en kollektiv agents bidrag ved at udtrykke værkets sproglige indhold på et andet sprog. @da
definition: Relaterer en kollektiv agent til et uttrykk som inkluderer et bidrag fra en kollektiv agent i form av å uttrykke det språklige innholdet av et verk på et annet språk. @no
definition: Relates a collective agent to an expression that includes a contribution by a collective agent of expressing the linguistic content of the work in a different language. @en
definition: Sasaista grupu ar izteiksmi, kas ietver grupas ieguldījumu, izsakot darba saturu valodā, kas atšķiras no sākotnējās darba valodas. @lv
definition: Seostab kollektiivi väljendusega, millesse kollektiiv on andnud panuse, väljendades teose keelesisu teises keeles. @et
definition: Setzt einen gemeinschaftlichen Akteur in Beziehung zu einer Expression, zu der ein gemeinschaftlicher Akteur beiträgt, indem er den sprachlichen Inhalt des Werks in einer anderen Sprache ausdrückt. @de
definition: يربط وكيلا جماعيا بتعبيرة تتضمن إسهام وكيل جماعي في التعبير عن المحتوى اللغوي للعمل بلغة مختلفة. @ar
definition: 将一个集体行为者与包括用另一种语言表达作品语言内容的一个集体行为者的贡献的一种内容表达关联起来。 @zh-hans
scope note: A translator may also translate linguistic content between forms of the same language from different time periods. @en
scope note: Bir çevirmen, aynı dilin farklı zaman dilimlerindeki biçimleri arasında da dilsel içerik çevirisi yapabilir. @tr
scope note: Darunter fallen Übersetzungen sprachlichen Inhalts aus Formen derselben Sprache aus verschiedenen Zeitperioden. @de
scope note: Een vertaler kan ook taalkundige content vertalen tussen vormen van dezelfde taal uit verschillende tijdperiodes. @nl
scope note: Egy fordító ugyanannak a nyelvnek a különböző időszakokból származó formái közötti nyelvi tartalmat is fordíthatja. @hu
scope note: En oversetter kan også oversette språklig innhold mellom ulike former av det samme språket fra ulike tidsperioder. @no
scope note: En oversætter kan også oversætte sprogligt indhold mellem former af samme sprog fra forskellige tidsperioder. @da
scope note: Kääntäjä voi myös kääntää kielisisältöä saman kielen eri aikakausien kielimuotojen välillä.

näyttämöohjaaja (yhteistoimija) ekspressiossa
has element type: 2
toolkit definition: An expression that includes a contribution by a collective agent of general management and supervision of a stage performance. @en
toolkit definition: Bir sahne performansının genel yönetimi ve denetiminde kolektif bir temsilcinin katkısını içeren bir anlatım. @tr
toolkit definition: Een expressie die omvat een bijdrage door een collectieve actor door algeheel beheer en toezicht van een toneeluitvoering. @nl
toolkit definition: Egy kifejezési forma, amely magában foglalja egy kollektív ágens közreműködését egy színpadi előadás általános menedzselésében és felügyeletében. @hu
toolkit definition: Eine Expression einer Bühnendarbietung, zu der ein gemeinschaftlicher Akteur durch die allgemeine Betreuung und Leitung beiträgt. @de
toolkit definition: Ekspressio, jonka tekemisessä yhteistoimija on osallisena johtamalla ja valvomalla näyttämöesitystä.
toolkit definition: Espressione che comprende un contributo di un agente collettivo per la gestione e supervisione generale di un'interpretazione teatrale. @it
toolkit definition: Et uttrykk som inkluderer et bidrag fra en kollektiv agent i form av generell ledelse og tilsyn med en sceneforestilling. @no
toolkit definition: Expression qui intègre une contribution de la part d’un agent collectif consistant à assurer la gestion et la supervision générales d’une prestation scénique. @fr
toolkit definition: Expressió que inclou una contribució d’un agent col·lectiu en la gestió general i la supervisió d’una representació escènica. @ca
toolkit definition: Izteiksme, kas ietver grupas ieguldījumu, vispārēji vadot un uzraugot uzvedumu. @lv
toolkit definition: Udtryk, som omfatter en kollektiv agents bidrag gennem den generelle ledelse af- og tilsyn med en sceneoptræden. @da
toolkit definition: Väljendus, millesse kollektiiv on andnud panuse lavateose esituse üldise juhtimise ja juhendamisega. @et
toolkit definition: تعبيرة تتضمن إسهام وكيل جماعي في الإدارة العامة لأداء مسرحي والإشراف عليه. @ar
toolkit definition: 包括一个集体行为者对舞台表演总体管理和监督的贡献的一种内容表达 @zh-hans
toolkit label: Gemeinschaftlicher Akteur als Bühnenregisseurin/Bühnenregisseur von @de
toolkit label: agent collectif metteur en scène de @fr
toolkit label: agent col·lectiu director d’escena de @ca
toolkit label: ir teātra režisors (grupa) @lv
toolkit label: kollektiv agent, som er sceneinstruktør af @da
toolkit label: lavastaja (kollektiiv) väljenduses @et
toolkit label: näyttämöohjaaja (yhteistoimija) ekspressiossa
toolkit label: regista teatrale agente collettivo di @it
toolkit label: sahne yönetmeni kolektif temsilci @tr
toolkit label: sceneregissør for (kollektiv agent) @no
toolkit label: stage director collective agent of @en
toolkit label: színpadi rendező kollektív ágense: @hu
toolkit label: toneelregisseur-collectieve actor van @nl
toolkit label: διευθυντής σκηνής συλλογικός φορέας του @el
toolkit label: وكيل جماعي مدير مسرح @ar
toolkit label: ……的舞台导演集体行为者 @zh-hans
has subproperty: näyttämöohjaaja (yhteisö) ekspressiossa
has subproperty: näyttämöohjaaja (suku) ekspressiossa
has subproperty: P50737
lexical alias: stageDirectorCollectiveAgentOf.en
status: Published
type: Property
domain: C10011
label: er kollektiv agent, som er sceneinstruktør af @da
label: er sceneregissør for (kollektiv agent) @no
label: est un agent collectif metteur en scène de @fr
label: ir teātra režisors (grupa) @lv
label: is stage director collective agent of @en
label: is toneelregisseur-collectieve actor van @nl
label: ist gemeinschaftlicher Akteur als Bühnenregisseurin/Bühnenregisseur von @de
label: lavastaja (kollektiiv) väljenduses @et
label: sahne yönetmeni kolektif temsilcisidir @tr
label: színpadi rendező kollektív ágense a következőnek: @hu
label: è regista teatrale agente collettivo di @it
label: és agent col·lectiu director d’escena de @ca
label: είναι διευθυντής σκηνής συλλογικός φορέας του @el
label: هو وكيل جماعي مدير مسرح لـ @ar
label: 是……的舞台导演集体行为者 @zh-hans
sub property of: näyttämöohjaaja (toimija) ekspressiossa
sub property of: esitykseen osallinen yhteistoimija ekspressiossa
definition: Correla un agente collettivo a un'espressione che comprende un contributo di un agente collettivo per la gestione e supervisione generale di un'interpretazione teatrale. @it
definition: Hozzákapcsol egy kollektív ágenst egy kifejezési formához, amely magában foglalja egy kollektív ágens közreműködését egy színpadi előadás általános menedzselésében és felügyeletében. @hu
definition: Kolektif bir temsilciyi, bir sahne performansının genel yönetim ve denetimine kolektif bir temsilcinin katkısını içeren anlatımla ilişkilendirir. @tr
definition: Liittää yhteistoimijan ekspressioon, jonka tekemisessä yhteistoimija on osallisena johtamalla ja valvomalla näyttämöesitystä.
definition: Met un agent collectif en relation avec une expression qui intègre une contribution de la part d’un agent collectif consistant à assurer la gestion et la supervision générales d’une prestation scénique. @fr
definition: Relaciona un agent col·lectiu amb una expressió que inclou una contribució d’un agent col·lectiu en la gestió general i la supervisió d’una representació escènica. @ca
definition: Relateert een collectieve actor aan een expressie die omvat een bijdrage door een collectieve actor door algeheel beheer en toezicht van een toneeluitvoering. @nl
definition: Relaterer en kollektiv agent til et udtryk, som omfatter en kollektiv agents bidrag gennem den generelle ledelse af- og tilsyn med en sceneoptræden. @da
definition: Relaterer en kollektiv agent til et uttrykk som inkluderer et bidrag fra en kollektiv agent i form av generell ledelse og tilsyn med en sceneforestilling. @no
definition: Relates a collective agent to an expression that includes a contribution by a collective agent of general management and supervision of a stage performance. @en
definition: Sasaista grupu ar izteiksmi, kas ietver grupas ieguldījumu, vispārēji vadot un uzraugot uzvedumu. @lv
definition: Seostab kollektiivi väljendusega, millesse kollektiiv on andnud panuse lavateose esituse üldise juhtimise ja juhendamisega. @et
definition: Setzt einen gemeinschaftlichen Akteur in Beziehung zu einer Expression einer Bühnendarbietung, zu der ein gemeinschaftlicher Akteur durch die allgemeine Betreuung und Leitung beiträgt. @de
definition: يربط وكيلا جماعيا بتعبيرة تتضمن إسهام وكيل جماعي في الإدارة العامة لأداء مسرحي والإشراف عليه. @ar
definition: 将一个集体行为者与包括一个集体行为者对舞台表演总体管理和监督的贡献的一种内容表达关联起来。 @zh-hans

animaattori (yhteistoimija) ekspressiossa
has element type: 2
toolkit definition: An expression that includes a contribution by a collective agent of giving apparent movement to inanimate objects or drawings. @en
toolkit definition: Cansız nesnelere veya çizimlere görünür hareket sağlanmasında kolektif bir temsilcinin katkısını içeren bir anlatım. @tr
toolkit definition: Een expressie die omvat een bijdrage door een collectieve actor door het geven van schijnbare beweging aan levenloze objecten of tekeningen. @nl
toolkit definition: Egy kifejezési forma, amely magában foglalja egy kollektív ágens közreműködését élettelen tárgyak vagy rajzok látszólagos mozgatásában. @hu
toolkit definition: Eine Expression, zu der ein gemeinschaftlicher Akteur beiträgt, indem er unbelebte Objekte oder Zeichnungen in scheinbare Bewegung versetzt. @de
toolkit definition: Ekspressio, jonka tekemisessä yhteistoimija on osallisena tuottamalla näennäistä liikettä elottomiin esineisiin tai piirroksiin.
toolkit definition: Espressione che comprende un contributo di un agente collettivo nel dare movimento apparente a oggetti inanimati o disegni. @it
toolkit definition: Et uttrykk som inkluderer et bidrag fra en kollektiv agent i form av å gi tilsynelatende bevegelse til tegninger eller figurer. @no
toolkit definition: Expression qui intègre une contribution de la part d’un agent collectif consistant à donner l’illusion du mouvement à des objets inanimés ou à des dessins. @fr
toolkit definition: Expressió que inclou una contribució d’un agent col·lectiu donant l’aparença de moviment a objectes o dibuixos inanimats. @ca
toolkit definition: Izteiksme, kas ietver grupas ieguldījumu, pieškirot šķietamu kustību nekustīgiem objektiem vai zīmējumiem. @lv
toolkit definition: Udtryk, som omfatter en kollektiv agents bidrag ved at give en illusion af bevægelse til livløse objekter eller tegninger. @da
toolkit definition: Väljendus, millesse kollektiiv on andnud panuse, pannes näiliselt liikuma elutud esemed või joonistused. @et
toolkit definition: تعبيرة تتضمن إسهام وكيل جماعي في جعل كائنات أو رسومات جامدة تتحرك حركة واضحة. @ar
toolkit definition: 包括一个集体行为者对给予无生命对象或绘画以貌似运动之贡献的一种内容表达 @zh-hans
toolkit label: Gemeinschaftlicher Akteur als Trickfilmzeichnerin/Trickfilmzeichner von @de
toolkit label: [σχεδιαστής] κινουμένων σχεδίων συλλογικός φορέας του @el
toolkit label: agent collectif animateur de @fr
toolkit label: agent col·lectiu animador de @ca
toolkit label: animaator (kollektiiv) väljenduses @et
toolkit label: animaattori (yhteistoimija) ekspressiossa
toolkit label: animator collective agent of @en
toolkit label: animator-collectieve actor van @nl
toolkit label: animatore agente collettivo di @it
toolkit label: animatör kolektif temsilcisi @tr
toolkit label: animatør for (kollektiv agent) @no
toolkit label: animátor kollektív ágense: @hu
toolkit label: ir animators (grupa) @lv
toolkit label: kollektiv agent, som er animator af @da
toolkit label: وكيل جماعي فنان رسوم متحركة @ar
toolkit label: ……的动画师集体行为者 @zh-hans
has subproperty: animaattori (yhteisö) ekspressiossa
has subproperty: animaattori (suku) ekspressiossa
has subproperty: P50738
lexical alias: animatorCollectiveAgentOf.en
status: Published
type: Property
domain: C10011
label: animaator (kollektiiv) väljenduses @et
label: animatör kolektif temsilcisidir @tr
label: animátor kollektív ágense a következőnek: @hu
label: er animatør for (kollektiv agent) @no
label: er kollektiv agent, som er animator af @da
label: est un agent collectif animateur de @fr
label: ir animators (grupa) @lv
label: is animator collective agent of @en
label: is animator-collectieve actor van @nl
label: ist gemeinschaftlicher Akteur als Trickfilmzeichnerin/Trickfilmzeichner von @de
label: è animatore agente collettivo di @it
label: és agent col·lectiu animador de @ca
label: είναι [σχεδιαστής] κινουμένων σχεδίων συλλογικός φορέας του @el
label: هو وكيل جماعي فنان رسوم متحركة لـ @ar
label: 是……的动画师集体行为者 @zh-hans
sub property of: animaattori (toimija) ekspressiossa
sub property of: esitykseen osallinen yhteistoimija ekspressiossa
definition: Correla un agente collettivo a un'espressione che comprende un contributo di un agente collettivo nel dare movimento apparente a oggetti inanimati o disegni. @it
definition: Hozzákapcsol egy kollektív ágenst egy kifejezési formához, amely magában foglalja egy kollektív ágens közreműködését élettelen tárgyak vagy rajzok látszólagos mozgatásában. @hu
definition: Kolektif bir temsilciyi, bir kolektif temsilcinin cansız nesnelere veya çizimlere görsel hareket sağlama katkısını içeren anlatımla ilişkilendirir. @tr
definition: Liittää yhteistoimijan ekspressioon, jonka tekemisessä yhteistoimija on osallisena tuottamalla näennäistä liikettä elottomiin esineisiin tai piirroksiin.
definition: Met un agent collectif en relation avec une expression qui intègre une contribution de la part d’un agent collectif consistant à donner l’illusion du mouvement à des objets inanimés ou à des dessins. @fr
definition: Relaciona un agent col·lectiu amb una expressió que inclou una contribució d’un agent col·lectiu donant l’aparença de moviment a objectes o dibuixos inanimats. @ca
definition: Relateert een collectieve actor aan een expressie die omvat een bijdrage door een collectieve actor door het geven van schijnbare beweging aan levenloze objecten of tekeningen. @nl
definition: Relaterer en kollektiv agent til et udtryk, som omfatter en kollektiv agents bidrag ved at give en illusion af bevægelse til livløse objekter eller tegninger. @da
definition: Relaterer en kollektiv agent til et uttrykk som inkluderer et bidrag fra en kollektiv agent i form av å gi tilsynelatende bevegelse til tegninger eller figurer. @no
definition: Relates a collective agent to an expression that includes a contribution by a collective agent of giving apparent movement to inanimate objects or drawings. @en
definition: Sasaista grupu ar izteiksmi, kas ietver grupas ieguldījumu, pieškirot šķietamu kustību nekustīgiem objektiem vai zīmējumiem. @lv
definition: Seostab kollektiivi väljendusega, millesse kollektiiv on andnud panuse, pannes näiliselt liikuma elutud esemed või joonistused. @et
definition: Setzt einen gemeinschaftlichen Akteur in Beziehung zu einer Expression, zu der ein gemeinschaftlicher Akteur beiträgt, indem er unbelebte Objekte oder Zeichnungen in scheinbare Bewegung versetzt. @de
definition: يربط وكيلا جماعيا بتعبيرة تتضمن إسهام وكيل جماعي في جعل كائنات أو رسومات جامدة تتحرك حركة واضحة. @ar
definition: 将一个集体行为者与包括一个集体行为者对给予无生命对象或绘画以貌似运动之贡献的一种内容表达关联起来。 @zh-hans

ekspression haastattelija (yhteistoimija) ekspressiossa
has element type: 2
toolkit definition: An expression that includes a contribution by a collective agent of interviewing, reporting, or some other kind of gathering of information. @en
toolkit definition: Een expressie die omvat een bijdrage door een collectieve actor door ondervragen, rapporteren of een andere vorm van informatie verzamelen. @nl
toolkit definition: Egy kifejezési forma, amely magában foglalja egy kollektív ágens közreműködését interjúban, riportban vagy más információgyűjtő minőségben. @hu
toolkit definition: Eine Expression, zu der ein gemeinschaftlicher Akteur beiträgt, indem er als Interviewerin/Interviewer, Reporterin/Reporter, Meinungsforscherin/Meinungsforscher oder anderer gemeinschaftlicher Akteur Informationen zusammenträgt. @de
toolkit definition: Ekspressio, jonka tekemisessä yhteistoimija on osallisena toimimalla haastattelijana, toimittajana tai jonain muuna tietoja keräävänä toimijana.
toolkit definition: Espressione che comprende un contributo di un agente collettivo nell'intervistare, riferire notizie o altro tipo di raccolta di informazioni. @it
toolkit definition: Et uttrykk som inkluderer et bidrag fra en kollektiv agent i form av intervjuer, rapportering eller en annen form for innsamling av informasjon. @no
toolkit definition: Expression qui intègre une contribution de la part d’un agent collectif consistant à réaliser un entretien, un reportage ou un autre type de collecte d’informations. @fr
toolkit definition: Expressió que inclou una contribució d’un agent col·lectiu entrevistant, informant o recopilant informació d’alguna altra manera. @ca
toolkit definition: Görüşme, raporlama veya başka bir tür bilgi toplama konusunda kolektif bir temsilcinin katkısını içeren bir anlatım. @tr
toolkit definition: Izteiksme, kas ietver grupas ieguldījumu, darbojoties kā intervētājs, reportieris, aptaujas organizētājs vai kāds cits informācijas apkopotājs. @lv
toolkit definition: Udtryk, som omfatter en kollektiv agents bidrag ved at interviewe, rapportere eller en anden form for indsamling af information. @da
toolkit definition: Väljendus, millesse kollektiiv on andnud panuse, intervjueerides, tehes reportaaži või kogudes muul viisil infot. @et
toolkit definition: تعبيرة تتضمن إسهام وكيل جماعي في إجراء مقابلات أو إعداد تقارير أو جمع المعلومات بطريقة أخرى. @ar
toolkit definition: 包括一个采访、报道或其他某种信息收集的一个集体行为者的贡献的一种内容表达 @zh-hans
toolkit label: Gemeinschaftlicher Akteur als Interviewerin/Interviewer einer Expression von @de
toolkit label: agent collectif intervieweur d’une expression de @fr
toolkit label: agent col·lectiu entrevistador d’una expressió de @ca
toolkit label: anlatımının görüşmeci kolektif temsilcisidir @tr
toolkit label: ekspression haastattelija (yhteistoimija) ekspressiossa
toolkit label: interjúkészítő kollektív ágense a következő kifejezési formának: @hu
toolkit label: interviewer collective agent of expression of @en
toolkit label: interviewer-collectieve actor van expressie van @nl
toolkit label: intervistatore agente collettivo di espressione di @it
toolkit label: intervjueerija (kollektiiv) väljenduses @et
toolkit label: intervjuer for uttrykk for (kollektiv agent) @no
toolkit label: ir intervētājs (grupa) izteiksmē @lv
toolkit label: kollektiv agent, som er interviewer for udtryk af @da
toolkit label: συνεντευκτής συλλογικός φορέας της έκφρασης του @el
toolkit label: وكيل جماعي محاور في تعبيرة @ar
toolkit label: ……的内容表达的采访者集体行为者 @zh-hans
has subproperty: ekspression haastattelija (yhteisö) ekspressiossa
has subproperty: ekspression haastattelija (suku) ekspressiossa
has subproperty: P50739
lexical alias: interviewerCollectiveAgentOfExpressionOf.en
status: Published
type: Property
domain: C10011
label: anlatımının görüşmeci kolektif temsilcisidir @tr
label: er intervjuer for uttrykk for (kollektiv agent) @no
label: er kollektiv agent, som er interviewer for udtryk af @da
label: est un agent collectif intervieweur d’une expression de @fr
label: interjúkészítő kollektív ágense a következő kifejezési formának: @hu
label: intervjueerija (kollektiiv) väljenduses @et
label: ir intervētājs (grupa) izteiksmē @lv
label: is interviewer collective agent of expression of @en
label: is interviewer-collectieve actor van expressie van @nl
label: ist gemeinschaftlicher Akteur als Interviewerin/Interviewer einer Expression von @de
label: è intervistatore agente collettivo di espressione di @it
label: és agent col·lectiu entrevistador d’una expressió de @ca
label: είναι συνεντευκτής συλλογικός φορέας της έκφρασης του @el
label: هو وكيل جماعي محاور في تعبيرة لـ @ar
label: 是……的内容表达的采访者集体行为者 @zh-hans
sub property of: ekspression haastattelija (toimija) ekspressiossa
sub property of: esitykseen osallinen yhteistoimija ekspressiossa
definition: Correla un agente collettivo a un'espressione che comprende un contributo di un agente collettivo nell'intervistare, riferire notizie o altro tipo di raccolta di informazioni. @it
definition: Hozzákapcsol egy kollektív ágenst egy kifejezési formához, amely magában foglalja egy kollektív ágens közreműködését interjúban, riportban vagy más információgyűjtő minőségben. @hu
definition: Kolektif bir temsilciyi, kolektif bir temsilcinin görüşme, raporlama veya başka bir tür bilgi toplama katkısını içeren ifadeyle ilişkilendirir. @tr
definition: Liittää yhteistoimijan ekspressioon, jonka tekemisessä yhteistoimija on osallisena toimimalla haastattelijana, toimittajana tai jonain muuna tietoja keräävänä toimijana.
definition: Met un agent collectif en relation avec une expression qui intègre une contribution de la part d’un agent collectif consistant à réaliser un entretien, un reportage ou un autre type de collecte d’informations. @fr
definition: Relaciona un agent col·lectiu amb una expressió que inclou una contribució d’un agent col·lectiu entrevistant, informant o recopilant informació d’alguna altra manera. @ca
definition: Relateert een collectieve actor aan een expressie die omvat een bijdrage door een collectieve actor door ondervragen, rapporteren of een andere vorm van informatie verzamelen. @nl
definition: Relaterer en kollektiv agent til et udtryk, som omfatter en kollektiv agents bidrag ved at interviewe, rapportere eller en anden form for indsamling af information. @da
definition: Relaterer en kollektiv agent til et uttrykk som inkluderer et bidrag fra en kollektiv agent i form av intervjuer, rapportering eller en annen form for innsamling av informasjon. @no
definition: Relates a collective agent to an expression that includes a contribution by a collective agent of interviewing, reporting, or some other kind of gathering of information. @en
definition: Sasaista grupu ar izteiksmi, kas ietver grupas ieguldījumu, darbojoties kā intervētājs, reportieris, aptaujas organizētājs vai kāds cits informācijas apkopotājs. @lv
definition: Seostab kollektiivi väljendusega, millesse kollektiiv on andnud panuse, intervjueerides, tehes reportaaži või kogudes muul viisil infot. @et
definition: Setzt einen gemeinschaftlichen Akteur in Beziehung zu einer Expression, zu der ein gemeinschaftlicher Akteur beiträgt, indem er als Interviewerin/Interviewer, Reporterin/Reporter, Meinungsforscherin/Meinungsforscher oder anderer gemeinschaftlicher Akteur Informationen zusammenträgt. @de
definition: يربط وكيلا جماعيا بتعبيرة تتضمن إسهام وكيل جماعي في إجراء مقابلات أو إعداد تقارير أو جمع المعلومات بطريقة أخرى. @ar
definition: 将一个集体行为者与包括一个采访、报道或其他某种信息收集的一个集体行为者的贡献的一种内容表达关联起来。 @zh-hans

kuoronjohtaja (yhteistoimija) ekspressiossa
has element type: 2
toolkit definition: An expression that includes a contribution by a collective agent of leading a choral performing group in a musical or dramatic presentation. @en
toolkit definition: Een expressie die omvat een bijdrage door een collectieve actor door leiden van een optredende koorgroep in een muzikale of dramatische presentatie. @nl
toolkit definition: Egy kifejezési forma, amely magában foglalja egy zenei vagy drámai bemutatóban énekkari előadó csoportot vezető kollektív ágens közreműködését. @hu
toolkit definition: Eine Expression, zu der ein gemeinschaftlicher Akteur beiträgt, indem er einen Chor in einer musikalischen oder dramatischen Darbietung leitet. @de
toolkit definition: Ekspressio, jonka tekemisessä yhteistoimija on osallisena johtamalla kuoroa musiikki- tai näytelmäesityksessä.
toolkit definition: Espressione che comprende un contributo di un agente collettivo nella direzione di un gruppo di esecuzione corale in una presentazione musicale o drammatica. @it
toolkit definition: Et uttrykk som inkluderer et bidrag fra en kollektiv agent i form av ledelse av et kor i en musikalsk eller dramatisk forestilling. @no
toolkit definition: Expression qui intègre une contribution de la part d’un agent collectif consistant à diriger un groupe de choristes dans une présentation musicale ou dramatique. @fr
toolkit definition: Expressió que inclou una contribució d’un agent col·lectiu dirigint una coral en una representació musical o dramàtica. @ca
toolkit definition: Izteiksme, kas ietver grupas ieguldījumu, diriģējot izpildītājmākslinieku grupu mūzikas vai dramatiskā uzvedumā. @lv
toolkit definition: Müzikal veya dramatik bir gösteride, bir koro performans grubuna liderlik eden kolektif bir temsilcinin katkısını içeren bir anlatım. @tr
toolkit definition: Udtryk, som omfatter en kollektiv agents bidrag ved at lede et optrædende kor i en musikalsk eller dramatisk præsentation. @da
toolkit definition: Väljendus, millesse kollektiiv on andnud panuse, juhatades koori muusika- või draamaetenduses @et
toolkit definition: تعبيرة تتضمن إسهام وكيل جماعي في قيادة فريق كورال في عرض موسيقي أو درامي. @ar
toolkit definition: 包括在音乐或戏剧呈现中领导一个合唱表演团体的一个集体行为者的贡献的一种内容表达 @zh-hans
toolkit label: Gemeinschaftlicher Akteur als Chorleiterin/Chorleiter von @de
toolkit label: agent collectif chef de chœur de @fr
toolkit label: agent col·lectiu director de cor de @ca
toolkit label: choral conductor collective agent of @en
toolkit label: direttore di coro agente collettivo di @it
toolkit label: ir kordiriģents (grupa) @lv
toolkit label: kollektiv agent, som er kordirigent af @da
toolkit label: koordirigent-collectieve actor van @nl
toolkit label: koorijuht (kollektiiv) väljenduses @et
toolkit label: kordirigent for (kollektiv agent) @no
toolkit label: koro şefi kolektif temsilcisi @tr
toolkit label: kuoronjohtaja (yhteistoimija) ekspressiossa
toolkit label: kórusvezető kollektív ágense: @hu
toolkit label: διευθυντής χορωδίας συλλογικός φορέας του @el
toolkit label: وكيل جماعي قائد كورال @ar
toolkit label: ……的合唱指挥集体行为者 @zh-hans
has subproperty: kuoronjohtaja (yhteisö) ekspressiossa
has subproperty: kuoronjohtaja (suku) ekspressiossa
has subproperty: P50740
lexical alias: choralConductorCollectiveAgentOf.en
status: Published
type: Property
domain: C10011
label: er kollektiv agent, som er kordirigent af @da
label: er kordirigent for (kollektiv agent) @no
label: est un agent collectif chef de chœur de @fr
label: ir kordiriģents (grupa) @lv
label: is choral conductor collective agent of @en
label: is koordirigent-collectieve actor van @nl
label: ist gemeinschaftlicher Akteur als Chorleiterin/Chorleiter von @de
label: koorijuht (kollektiiv) väljenduses @et
label: koro şefi kolektif temsilcisidir @tr
label: kórusvezető kollektív ágense a következőnek: @hu
label: è direttore di coro agente collettivo di @it
label: és agent col·lectiu director de cor de @ca
label: είναι διευθυντής χορωδίας συλλογικός φορέας του @el
label: هو وكيل جماعي قائد كورال لـ @ar
label: 是……的合唱指挥集体行为者 @zh-hans
sub property of: kuoronjohtaja (toimija) ekspressiossa
sub property of: johtaja (yhteistoimija) ekspressiossa
definition: Correla un agente collettivo a un'espressione che comprende un contributo di un agente collettivo nella direzione di un gruppo di esecuzione corale in una presentazione musicale o drammatica. @it
definition: Hozzákapcsol egy kollektív ágenst egy kifejezési formához, amely magában foglalja egy zenei vagy drámai bemutatóban énekkari előadó csoportot vezető kollektív ágens közreműködését. @hu
definition: Kolektif bir temsilciyi, müzikal veya drama gösteriminde bir koro performans grubuna liderlik eden bir kolektif temsilcinin katkısını içeren anlatım ile ilişkilendirir. @tr
definition: Liittää yhteistoimijan ekspressioon, jonka tekemisessä yhteistoimija on osallisena johtamalla kuoroa musiikki- tai näytelmäesityksessä.
definition: Met un agent collectif en relation avec une expression qui intègre une contribution de la part d’un agent collectif consistant à diriger un groupe de choristes dans une présentation musicale ou dramatique. @fr
definition: Relaciona un agent col·lectiu amb una expressió que inclou una contribució d’un agent col·lectiu dirigint una coral en una representació musical o dramàtica. @ca
definition: Relateert een collectieve actor aan een expressie die omvat een bijdrage door een collectieve actor door leiden van een optredende koorgroep in een muzikale of dramatische presentatie. @nl
definition: Relaterer en kollektiv agent til et udtryk, som omfatter en kollektiv agents bidrag ved at lede et optrædende kor i en musikalsk eller dramatisk præsentation. @da
definition: Relaterer en kollektiv agent til et uttrykk som inkluderer et bidrag fra en kollektiv agent i form av ledelse av et kor i en musikalsk eller dramatisk forestilling. @no
definition: Relates a collective agent to an expression that includes a contribution by a collective agent of leading a choral performing group in a musical or dramatic presentation. @en
definition: Sasaista grupu ar izteiksmi, kas ietver grupas ieguldījumu, diriģējot izpildītājmākslinieku grupu mūzikas vai dramatiskā uzvedumā. @lv
definition: Seostab kollektiivi väljendusega, millesse kollektiiv on andnud panuse, juhatades koori muusika- või draamaetenduses @et
definition: Setzt einen gemeinschaftlichen Akteur in Beziehung zu einer Expression, zu der ein gemeinschaftlicher Akteur beiträgt, indem er einen Chor in einer musikalischen oder dramatischen Darbietung leitet. @de
definition: يربط وكيلا جماعيا بتعبيرة تتضمن إسهام وكيل جماعي في قيادة فريق كورال في عرض موسيقي أو درامي. @ar
definition: 将一个集体行为者与包括在音乐或戏剧呈现中领导一个合唱表演团体的一个集体行为者的贡献的一种内容表达关联起来。 @zh-hans

juontaja (yhteistoimija) ekspressiossa
has element type: 2
toolkit definition: An expression that includes a contribution by a collective agent of leading a program, often broadcast, that includes other performers. @en
toolkit definition: Een expressie die omvat een bijdrage van een collectieve actor door het leiden van een programma, vaak uitgezonden, dat omvat andere uitvoerders. @nl
toolkit definition: Egy kifejezési forma, amely magában foglalja egy kollektív ágens közreműködését program, gyakran sugárzott műsor vezetésében, amelyen más előadók vesznek részt. @hu
toolkit definition: Eine Expression, zu der ein gemeinschaftlicher Akteur beiträgt, indem er eine Veranstaltung (meist eine Sendung) leitet, an der auch andere Ausführende teilnehmen. @de
toolkit definition: Ekspressio, jonka tekemiseen yhteistoimija osallistuu juontamalla (useimmiten lähetettyä) ohjelmaa, johon osallistuu muita esiintyjiä.
toolkit definition: Espressione che comprende un contributo di un agente collettivo nella conduzione di un programma, spesso una trasmissione, che comprende altri ospiti, artisti e altri agenti. @it
toolkit definition: Et uttrykk som inkluderer et bidrag fra en kollektiv agent i form av ledelse av et program, ofte kringkastet, som inkluderer andre gjester, utøvere eller andre agenter. @no
toolkit definition: Expression qui intègre une contribution de la part d’un agent collectif consistant à diriger une activité, souvent diffusée à la radio, à la télévision, etc., qui fait appel à d’autres interprètes. @fr
toolkit definition: Expressió que inclou una contribució d’un agent col·lectiu que és un intèrpret dirigint un programa, sovint emès, que inclou altres intèrprets. @ca
toolkit definition: Genellikle yayınlanan ve diğer sanatçıları içeren bir programı yöneten kolektif bir temsilcinin katkısını içeren bir anlatım. @tr
toolkit definition: Izteiksme, kas ietver grupas ieguldījumu, vadot programmu (parasti apraidi), kas ietver citu viesu, izpildītāju, citu aģentu piedalīšanos. @lv
toolkit definition: Udtryk, som omfatter en kollektiv agents bidrag ved at lede et program, ofte transmitteret, som omfatter andre optrædende. @da
toolkit definition: Väljendus, millesse kollektiiv on andnud panuse, juhtides saadet (sageli ringhäälingus), kus osalevad külalised, esitajad ja teised tegijad. @et
toolkit definition: تعبيرة تتضمن إسهام وكيل جماعي في إدارة برنامج، غالبًا ما يجري بثه، ويستضيف فناني أداء آخرين. @ar
toolkit definition: 包括有主导节目（经常是广播节目）的一个集体行为者并包括其他表演者的贡献的一种内容表达 @zh-hans
toolkit label: Gemeinschaftlicher Akteur als Gastgeberin/Gastgeber von @de
toolkit label: agent collectif hôte de @fr
toolkit label: agent col·lectiu amfitrió de @ca
toolkit label: gastgever-collectieve actor van @nl
toolkit label: host collective agent of @en
toolkit label: házigazda kollektív ágense: @hu
toolkit label: ir programmas vadītājs (grupa) @lv
toolkit label: juontaja (yhteistoimija) ekspressiossa
toolkit label: kollektiv agent, som er vært af @da
toolkit label: ospite agente collettivo di @it
toolkit label: saatejuht (kollektiiv) väljenduses @et
toolkit label: sunucu kolektif temsilcisidir @tr
toolkit label: vert for (kollektiv agent) @no
toolkit label: ξενιστής συλλογικός φορέας του @el
toolkit label: وكيل جماعي مضيف @ar
toolkit label: ……的主持人集体行为者 @zh-hans
has subproperty: juontaja (yhteisö) ekspressiossa
has subproperty: juontaja (suku) ekspressiossa
has subproperty: P50741
lexical alias: hostCollectiveAgentOf.en
status: Published
type: Property
domain: C10011
label: er kollektiv agent, som er vært af @da
label: er vert for (kollektiv agent) @no
label: est un agent collectif hôte de @fr
label: házigazda kollektív ágense a következőnek: @hu
label: ir programmas vadītājs (grupa) @lv
label: is gastgever-collectieve actor van @nl
label: is host collective agent of @en
label: ist gemeinschaftlicher Akteur als Gastgeberin/Gastgeber von @de
label: saatejuht (kollektiiv) väljenduses @et
label: sunucu kolektif temsilcisidir @tr
label: è ospite agente collettivo di @it
label: és agent col·lectiu amfitrió de @ca
label: είναι ξενιστής συλλογικός φορέας του @el
label: هو وكيل جماعي مضيف لـ @ar
label: 是……的主持人集体行为者 @zh-hans
sub property of: juontaja (toimija) ekspressiossa
sub property of: esittäjä (yhteistoimija) ekspressiossa
definition: Correla un agente collettivo a un'espressione che comprende un contributo di un agente collettivo nella conduzione di un programma, spesso una trasmissione, che comprende altri ospiti, artisti e altri agenti. @it
definition: Hozzákapcsol egy kollektív ágenst egy kifejezési formához, amely magában foglalja egy kollektív ágens közreműködését program, gyakran sugárzott műsor vezetésében, amelyen más előadók vesznek részt. @hu
definition: Kolektif bir temsilciyi, diğer sanatçıları da içeren, genellikle yayınlanan bir programa liderlik eden kolektif bir temsilcinin katkısını içeren bir anlatımla ilişkilendirir. @tr
definition: Liittää yhteistoimijan ekspressioon, jonka tekemiseen yhteistoimija osallistuu juontamalla (useimmiten lähetettyä) ohjelmaa, johon osallistuu muita esiintyjiä.
definition: Met un agent collectif en relation avec une expression qui intègre une contribution de la part d’un agent collectif consistant à diriger une activité, souvent diffusée à la radio, à la télévision, etc., qui fait appel à d’autres interprètes. @fr
definition: Relaciona un agent col·lectiu amb una expressió que inclou una contribució d’un agent col·lectiu dirigint un programa, sovint emès, que inclou altres intèrprets. @ca
definition: Relateert een collectieve actor aan een expressie die omvat een bijdrage van een collectieve actor door het leiden van een programma, vaak uitgezonden, dat omvat andere uitvoerders. @nl
definition: Relaterer en kollektiv agent til et udtryk, som omfatter en kollektiv agents bidrag ved at lede et program, ofte transmitteret, som omfatter andre optrædende. @da
definition: Relaterer en kollektiv agent til et uttrykk som inkluderer et bidrag fra en kollektiv agent i form av ledelse av et program, ofte kringkastet, som inkluderer andre gjester, utøvere eller andre agenter. @no
definition: Relates a collective agent to an expression that includes a contribution by a collective agent of leading a program, often broadcast, that includes other performers. @en
definition: Sasaista grupu ar izteiksmi, kas ietver grupas ieguldījumu, vadot programmu (parasti apraidi), kas ietver citu viesu, izpildītāju, citu aģentu piedalīšanos. @lv
definition: Seostab kollektiivi väljendusega, millesse kollektiiv on andnud panuse, juhtides saadet (sageli ringhäälingus), kus osalevad külalised, esitajad ja teised tegijad. @et
definition: Setzt einen gemeinschaftlichen Akteur in Beziehung zu einer Expression, zu der ein gemeinschaftlicher Akteur beiträgt, indem er eine Veranstaltung (meist eine Sendung) leitet, an der auch andere Ausführende teilnehmen. @de
definition: يربط وكيلا جماعيا بتعبيرة تتضمن إسهام وكيل جماعي مؤدي في برنامج يجري في الغالب بثه، ويستضيف فناني أداء آخرين. @ar
definition: 将一个集体行为者与包括有主导节目（经常是广播节目）的一个集体行为者并包括其他表演者的贡献的一种内容表达关联起来。 @zh-hans

moderoija (yhteistoimija) ekspressiossa
has element type: 2
toolkit definition: An expression that includes a contribution by a collective agent of leading a program, often broadcast, where topics are discussed, usually with participation of experts in fields related to the discussion. @en
toolkit definition: Een expressie die omvat een bijdrage van een collectieve actor door leiden van een programma, vaak uitgezonden, waar onderwerpen worden bediscussieerd, vaak met deelname van experts op gebieden gerelateerd aan de discussie. @nl
toolkit definition: Egy kifejezési forma, amely magában foglalja egy kollektív ágens közreműködését egy program, gyakran sugárzott műsor, vezetésében, amelyen témákat vitatnak meg, rendszerint a beszélgetés témájában jártas szakértők részvételével. @hu
toolkit definition: Eine Expression, zu der ein gemeinschaftlicher Akteur beiträgt, indem er eine Veranstaltung (meist eine Sendung) leitet, in der Themen üblicherweise mit Expertinnen/Experten diskutiert werden. @de
toolkit definition: Ekspressio, jonka tekemiseen yhteistoimija osallistuu juontamalla (useimmiten lähetettyä) ohjelmaa, jossa keskustellaan eri aiheista tavallisesti keskusteluun liittyvien aiheiden asiantuntijoiden kanssa.
toolkit definition: Espressione che comprende un contributo di un agente collettivo nella conduzione di un programma, spesso una trasmissione, in cui si discutono argomenti, solitamente con la partecipazione di esperti in campi relativi alla discussione. @it
toolkit definition: Et uttrykk som inkluderer et bidrag fra en kollektiv agent i form av ledelse av et program, ofte kringkastet, hvor temaer blir diskutert vanligvis med deltakere som er eksperter på feltene som er knyttet til diskusjonen. @no
toolkit definition: Expression qui intègre une contribution de la part d’un agent collectif consistant à diriger une activité, souvent diffusée à la radio, à la télévision, etc., où des sujets sont discutés, habituellement avec la participation d’experts dans les domaines reliés à la discussion. @fr
toolkit definition: Expressió que inclou una contribució d’un agent col·lectiu dirigint un programa, sovint emès, on es discuteixen temes, habitualment amb la participació d’experts en els camps relacionats amb la discussió. @ca
toolkit definition: Genellikle yayınlanan, konuların tartışıldığı, genellikle tartışmayla ilgili alanlardaki uzmanların katılımıyla bir programa liderlik eden kolektif bir temsilcinin katkısını içeren bir anlatım. @tr
toolkit definition: Izteiksme, kas ietver grupas ieguldījumu, vadot programmu (parasti apraidi), kurā tiek apspriestas tēmas ar ekspertu piedalīšanos. @lv
toolkit definition: Udtryk, som omfatter en kollektiv agents bidrag ved at lede et program, ofte transmitteret, hvor emner diskuteres, normalt med deltagelse af fagfolk indenfor felter, som er relateret til diskussionen. @da
toolkit definition: Väljendus, millesse kollektiiv on andnud panuse, juhtides saadet (sageli ringhäälingus), kus arutatakse mingeid teemasid ja kus tavaliselt osalevad arutatava teemavaldkonna asjatundjad. @et
toolkit definition: تعبيرة تتضمن إسهام وكيل جماعي في إدارة برنامج، غالبا يجري بثه، ومناقشة موضوعات، بمشاركة عادة خبراء في المجالات المتعلقة بموضوع النقاش. @ar
toolkit definition: 包括有主导节目（经常是广播节目，其中讨论话题，通常有讨论相关领域专家参与）的一个集体行为者的贡献的一种内容表达 @zh-hans
toolkit label: Gemeinschaftlicher Akteur als Moderatorin/Moderator von @de
toolkit label: agent collectif modérateur de @fr
toolkit label: agent col·lectiu moderador de @ca
toolkit label: ir moderators (grupa) @lv
toolkit label: kollektiv agent, som er ordstyrer af @da
toolkit label: moderator collective agent of @en
toolkit label: moderator-collectieve actor van @nl
toolkit label: moderatore agente collettivo di @it
toolkit label: moderatör kolektif temsilcisi @tr
toolkit label: moderoija (yhteistoimija) ekspressiossa
toolkit label: moderátor kollektív ágense: @hu
toolkit label: ordstyrer for (kollektiv agent) @no
toolkit label: väitlusjuht (kollektiiv) väljenduses @et
toolkit label: συντονιστής συλλογικός φορέας του @el
toolkit label: وكيل جماعي مدير مناقشة لـ @ar
toolkit label: ……的谈话类节目主持人集体行为者 @zh-hans
has subproperty: moderoija (yhteisö) ekspressiossa
has subproperty: moderoija (suku) ekspressiossa
has subproperty: P50742
lexical alias: moderatorCollectiveAgentOf.en
status: Published
type: Property
domain: C10011
label: er kollektiv agent, som er ordstyrer af @da
label: er ordstyrer for (kollektiv agent) @no
label: est un agent collectif modérateur de @fr
label: ir moderators (grupa) @lv
label: is moderator collective agent of @en
label: is moderator-collectieve actor van @nl
label: ist gemeinschaftlicher Akteur als Moderatorin/Moderator von @de
label: moderatör kolektif temsilcisidir @tr
label: moderátor kollektív ágense a következőnek: @hu
label: väitlusjuht (kollektiiv) väljenduses @et
label: è moderatore agente collettivo di @it
label: és agent col·lectiu moderador de @ca
label: είναι συντονιστής συλλογικός φορέας του @el
label: هو وكيل جماعي مدير مناقشة لـ @ar
label: 是……的谈话类节目主持人集体行为者 @zh-hans
sub property of: moderoija (toimija) ekspressiossa
sub property of: esittäjä (yhteistoimija) ekspressiossa
definition: Correla un agente collettivo a un'espressione che comprende un contributo di un agente collettivo nella conduzione di un programma, spesso una trasmissione, in cui si discutono argomenti, solitamente con la partecipazione di esperti in campi relativi alla discussione. @it
definition: Hozzákapcsol egy kollektív ágenst egy kifejezési formához, amely magában foglalja egy kollektív ágens közreműködését egy program, gyakran sugárzott műsor, vezetésében, amelyen témákat vitatnak meg, rendszerint a beszélgetés témájában jártas szakértők részvételével. @hu
definition: Kolektif bir temsilciyi, genellikle tartışma ile ilgili alanlarda uzmanların katılımıyla konuların tartışıldığı, genellikle yayınlanan bir programa öncülük eden bir kolektif temsilcinin katkısını içeren bir anlatım ile ilişkilendirir. @tr
definition: Liittää yhteistoimijan ekspressioon, jonka tekemiseen yhteistoimija osallistuu juontamalla (useimmiten lähetettyä) ohjelmaa, jossa keskustellaan eri aiheista tavallisesti keskusteluun liittyvien aiheiden asiantuntijoiden kanssa.
definition: Met un agent collectif en relation avec une expression qui intègre une contribution de la part d’un agent collectif consistant à diriger une activité, souvent diffusée à la radio, à la télévision, etc., où des sujets sont discutés, habituellement avec la participation d’experts dans les domaines reliés à la discussion. @fr
definition: Relaciona un agent col·lectiu amb una expressió que inclou una contribució d’un agent col·lectiu dirigint un programa, sovint emès, on es discuteixen temes, habitualment amb la participació d’experts en els camps relacionats amb la discussió. @ca
definition: Relateert een collectieve actor aan een expressie die omvat een bijdrage van een collectieve actor door leiden van een programma, vaak uitgezonden, waar onderwerpen worden bediscussieerd, vaak met deelname van experts op gebieden gerelateerd aan de discussie. @nl
definition: Relaterer en kollektiv agent til et udtryk, som omfatter en kollektiv agents bidrag ved at lede et program, ofte transmitteret, hvor emner diskuteres, normalt med deltagelse af fagfolk indenfor felter, som er relateret til diskussionen. @da
definition: Relaterer en kollektiv agent til et uttrykk som inkluderer et bidrag fra en kollektiv agent i form av ledelse av et program, ofte kringkastet, hvor temaer blir diskutert vanligvis med deltakere som er eksperter på feltene som er knyttet til diskusjonen. @no
definition: Relates a collective agent to an expression that includes a contribution by a collective agent of leading a program, often broadcast, where topics are discussed, usually with participation of experts in fields related to the discussion. @en
definition: Sasaista grupu ar izteiksmi, kas ietver grupas ieguldījumu, vadot programmu (parasti apraidi), kurā tiek apspriestas tēmas ar ekspertu piedalīšanos. @lv
definition: Seostab kollektiivi väljendusega, millesse kollektiiv on andnud panuse, juhtides saadet (sageli ringhäälingus), kus arutatakse mingeid teemasid ja kus tavaliselt osalevad arutatava teemavaldkonna asjatundjad. @et
definition: Setzt einen gemeinschaftlichen Akteur in Beziehung zu einer Expression, zu der ein gemeinschaftlicher Akteur beiträgt, indem er eine Veranstaltung (meist eine Sendung) leitet, in der Themen üblicherweise mit Expertinnen/Experten diskutiert werden. @de
definition: يربط وكيلا جماعيا بتعبيرة تتضمن إسهام وكيل جماعي في إدارة برنامج، غالبا يجري بثه، ومناقشة موضوعات، بمشاركة عادة خبراء في المجالات المتعلقة بموضوع النقاش. @ar
definition: 将一个集体行为者与包括有主导节目（经常是广播节目，其中讨论话题，通常有讨论相关领域专家参与）的一个集体行为者的贡献的一种内容表达关联起来。 @zh-hans

johtaja (yhteistoimija) ekspressiossa
has element type: 2
toolkit definition: An expression that includes a contribution by a collective agent of leading a performing group in a musical or dramatic presentation. @en
toolkit definition: Een expressie die omvat een bijdrage van een collectieve actor door het leiden van een uitvoerende groep in een muziek- of dramapresentatie. @nl
toolkit definition: Egy kifejezési forma, amely magában foglalja egy zenei vagy drámai bemutatóban, előadói csoportot vezető kollektív ágens közreműködését. @hu
toolkit definition: Eine Expression, zu der ein gemeinschaftlicher Akteur beiträgt, indem er ein aufführendes Ensemble in einer musikalischen oder dramatischen Darbietung leitet. @de
toolkit definition: Ekspressio, jonka tekemisessä yhteistoimija on osallisena johtamalla esiintyjäryhmän esiintymistä musiikki- tai näytelmäesityksessä.
toolkit definition: Espressione che comprende un contributo di un agente collettivo nella conduzione di un gruppo che si esibisce in una presentazione musicale o drammatica. @it
toolkit definition: Et uttrykk som inkluderer et bidrag fra en kollektiv agent i form av ledelse av en gruppe med utøvere i en musikalsk eller dramatisk forestilling. @no
toolkit definition: Expression qui intègre une contribution de la part d’un agent collectif consistant à diriger un groupe d’interprètes dans une présentation musicale ou dramatique. @fr
toolkit definition: Expressió que inclou una contribució d’un agent col·lectiu dirigint un grup d’intèrprets en una representació musical o dramàtica. @ca
toolkit definition: Izteiksme, kas ietver grupas ieguldījumu, vadot izpildītāju grupu muzikālā vai dramatiskā uzvedumā. @lv
toolkit definition: Müzikal veya dramatik bir gösteride, bir performans gruba liderlik eden kolektif bir temsilcinin katkısını içeren bir anlatım. @tr
toolkit definition: Udtryk, som omfatter en kollektiv agents bidrag ved at lede en udøvende gruppe i en musikalsk eller dramatisk præsentation. @da
toolkit definition: Väljendus, millesse kollektiiv on andnud panuse, juhatades muusika- või draamaetenduse esitusrühma. @et
toolkit definition: تعبيرة تتضمن إسهام وكيل جماعي في قيادة فرقة عزف في عرض موسيقي أو درامي. @ar
toolkit definition: 包括领导音乐或戏剧呈现的表演团体的一个集体行为者的贡献的一种内容表达 @zh-hans
toolkit label: Gemeinschaftlicher Akteur als Dirigentin/Dirigent von @de
toolkit label: agent collectif chef musical de @fr
toolkit label: agent col·lectiu director d’orquestra de @ca
toolkit label: conductor collective agent of @en
toolkit label: direttore agente collettivo di @it
toolkit label: dirigent (kollektiiv) väljenduses @et
toolkit label: dirigent for (kollektiv agent) @no
toolkit label: dirigent-collectieve actor van @nl
toolkit label: ir diriģents (grupa) @lv
toolkit label: johtaja (yhteistoimija) ekspressiossa
toolkit label: karmester kollektív ágense: @hu
toolkit label: kollektiv agent, som er dirigent af @da
toolkit label: orkestra şefi kolektif temsilcisi @tr
toolkit label: διευθυντής ορχήστρας συλλογικός φορέας του @el
toolkit label: وكيل جماعي قائد فرقة موسيقية @ar
toolkit label: ……的指挥集体行为者 @zh-hans
has subproperty: kapellimestari (yhteistoimija) ekspressiossa
has subproperty: kuoronjohtaja (yhteistoimija) ekspressiossa
has subproperty: johtaja (yhteisö) ekspressiossa
has subproperty: johtaja (suku) ekspressiossa
has subproperty: P50743
lexical alias: conductorCollectiveAgentOf.en
status: Published
type: Property
domain: C10011
label: dirigent (kollektiiv) väljenduses @et
label: er dirigent for (kollektiv agent) @no
label: er kollektiv agent, som er dirigent af @da
label: est un agent collectif chef musical de @fr
label: ir diriģents (grupa) @lv
label: is conductor collective agent of @en
label: is dirigent-collectieve actor van @nl
label: ist gemeinschaftlicher Akteur als Dirigentin/Dirigent von @de
label: karmester kollektív ágense a következőnek: @hu
label: orkestra şefi kolektif temsilcisidir @tr
label: è direttore agente collettivo di @it
label: és agent col·lectiu director d’orquestra de @ca
label: είναι διευθυντής ορχήστρας συλλογικός φορέας του @el
label: هو وكيل جماعي قائد فرقة موسيقية لـ @ar
label: 是……的指挥集体行为者 @zh-hans
sub property of: johtaja (toimija) ekspressiossa
sub property of: esittäjä (yhteistoimija) ekspressiossa
definition: Correla un agente collettivo a un'espressione che comprende un contributo di un agente collettivo nella conduzione di un gruppo che si esibisce in una presentazione musicale o drammatica. @it
definition: Hozzákapcsol egy kollektív ágenst egy kifejezési formához, amely magában foglalja egy zenei vagy drámai bemutatóban, előadói csoportot vezető kollektív ágens közreműködését. @hu
definition: Koleklif bir temsilciyi, müzikal veya dramatik bir sunumda performans gösteren bir gruba liderlik eden kolektif bir temsilcinin katkısını içeren bir anlatımla ilişkilendirir. @tr
definition: Liittää yhteistoimijan ekspressioon, jonka tekemisessä yhteistoimija on osallisena johtamalla esiintyjäryhmän esiintymistä musiikki- tai näytelmäesityksessä.
definition: Met un agent collectif en relation avec une expression qui intègre une contribution de la part d’un agent collectif consistant à diriger un groupe d’interprètes dans une présentation musicale ou dramatique. @fr
definition: Relaciona un agent col·lectiu amb una expressió que inclou una contribució d’un agent col·lectiu dirigint un grup d’intèrprets en una representació musical o dramàtica. @ca
definition: Relateert een collectieve actor aan een expressie die omvat een bijdrage van een collectieve actor door het leiden van een uitvoerende groep in een muziek- of dramapresentatie. @nl
definition: Relaterer en kollektiv agent til et udtryk, som omfatter en kollektiv agents bidrag ved at lede en udøvende gruppe i en musikalsk eller dramatisk præsentation. @da
definition: Relaterer en kollektiv agent til et uttrykk som inkluderer et bidrag fra en kollektiv agent i form av ledelse av en gruppe med utøvere i en musikalsk eller dramatisk forestilling. @no
definition: Relates a collective agent to an expression that includes a contribution by a collective agent of leading a performing group in a musical or dramatic presentation. @en
definition: Sasaista grupu ar izteiksmi, kas ietver grupas ieguldījumu, vadot izpildītāju grupu muzikālā vai dramatiskā uzvedumā. @lv
definition: Seostab kollektiivi väljendusega, millesse kollektiiv on andnud panuse, juhatades muusika- või draamaetenduse esitusrühma. @et
definition: Setzt einen gemeinschaftlichen Akteur in Beziehung zu einer Expression, zu der ein gemeinschaftlicher Akteur beiträgt, indem er ein aufführendes Ensemble in einer musikalischen oder dramatischen Darbietung leitet. @de
definition: يربط وكيلا جماعيا بتعبيرة تتضمن إسهام وكيل جماعي في قيادة فرقة عزف في عرض موسيقي أو درامي. @ar
definition: 将一个集体行为者与包括领导音乐或戏剧呈现的表演团体的一个集体行为者的贡献的一种内容表达关联起来。 @zh-hans

tarkastaja (yhteistoimija) ekspressiossa
has element type: 2
toolkit definition: An expression that includes a contribution by a collective agent of making changes to the content of another expression. @en
toolkit definition: Başka bir anlatımın içeriğinde değişiklik yapan kolektif bir temsilcinin katkısını içeren bir anlatım. @tr
toolkit definition: Een expressie die omvat een bijdrage door een collectieve actor door wijzigingen te maken in de content van een andere expressie. @nl
toolkit definition: Egy kifejezési forma, amely magában foglalja egy kollektív ágens közreműködését egy másik kifejezési forma tartalmának megváltoztatásában. @hu
toolkit definition: Eine Expression, zu der ein gemeinschaftlicher Akteur beiträgt, indem er am Inhalt einer anderen Expression Veränderungen vornimmt. @de
toolkit definition: Ekspressio, jonka tekemiseen yhteistoimija osallistuu tekemällä muutoksia toisen ekspression sisältöön.
toolkit definition: Espressione che comprende un contributo di un agente collettivo nell'apportare modifiche al contenuto di un'altra espressione. @it
toolkit definition: Et uttrykk som inkluderer et bidrag fra en kollektiv agent i form av å gjøre endringer i innholdet av et annet uttrykk. @no
toolkit definition: Expression qui intègre une contribution de la part d’un agent collectif consistant à apporter des modifications au contenu d’une autre expression. @fr
toolkit definition: Expressió que inclou una contribució d’un agent col·lectiu fent canvis en el contingut d’una altra expressió. @ca
toolkit definition: Izteiksme, kas ietver grupas ieguldījumu, veicot izmaiņas citas izteiksmes saturā. @lv
toolkit definition: Udtryk, som omfatter en kollektiv agents bidrag ved at foretage ændringer i indholdet af et andet udtryk. @da
toolkit definition: Väljendus, millesse kollektiiv on andnud panuse, tehes muudatusi teise väljenduse sisusse. @et
toolkit definition: تعبيرة تتضمن إسهام وكيل جماعي لإجراء تغييرات على محتوى تعبيرة أخرى. @ar
toolkit definition: 包括对另一种内容表达的内容作改动的一个集体行为者的贡献的一种内容表达 @zh-hans
toolkit label: Gemeinschaftlicher Akteur als Überarbeiterin/Überarbeiter von @de
toolkit label: agent collectif réviseur de @fr
toolkit label: agent col·lectiu revisor de @ca
toolkit label: gözden geçiren kolektif temsilci @tr
toolkit label: herziener-collectieve actor van @nl
toolkit label: ir korektors (grupa) @lv
toolkit label: kollektiv agent, som er omarbejder af @da
toolkit label: omarbeider av (kollektiv agent) @no
toolkit label: redigeerija (kollektiiv) väljenduses @et
toolkit label: reviser collective agent of @en
toolkit label: revisore agente collettivo di @it
toolkit label: tarkastaja (yhteistoimija) ekspressiossa
toolkit label: átdolgozó kollektív ágense: @hu
toolkit label: αναθεωρητής συλλογικός φορέας του @el
toolkit label: وكيل جماعي مراجع @ar
toolkit label: ……的修订者集体行为者 @zh-hans
has subproperty: ekspression entisöijä (yhteistoimija) ekspressiossa
has subproperty: sensori (yhteistoimija) ekspressiossa
has subproperty: sovittaja (yhteistoimija) ekspressiossa
has subproperty: lyhentäjä (yhteistoimija) ekspressiossa
has subproperty: transkriboija (yhteistoimija) ekspressiossa
has subproperty: tarkastaja (yhteisö) ekspressiossa
has subproperty: tarkastaja (suku) ekspressiossa
has subproperty: P50744
lexical alias: reviserCollectiveAgentOf.en
status: Published
type: Property
domain: C10011
label: er kollektiv agent, som er omarbejder af @da
label: er omarbeider av (kollektiv agent) @no
label: est un agent collectif réviseur de @fr
label: gözden geçiren kolektif temsilcisidir @tr
label: ir korektors (grupa) @lv
label: is herziener-collectieve actor van @nl
label: is reviser collective agent of @en
label: ist gemeinschaftlicher Akteur als Überarbeiterin/Überarbeiter von @de
label: redigeerija (kollektiiv) väljenduses @et
label: átdolgozó kollektív ágense a következőnek: @hu
label: è revisore agente collettivo di @it
label: és agent col·lectiu revisor de @ca
label: είναι αναθεωρητής συλλογικός φορέας του @el
label: هو وكيل جماعي مراجع لـ @ar
label: 是……的修订者集体行为者 @zh-hans
sub property of: tarkastaja (toimija) ekspressiossa
sub property of: ekspression tekijä (yhteistoimija) ekspressiossa
definition: Correla un agente collettivo a un'espressione che comprende un contributo di un agente collettivo nell'apportare modifiche al contenuto di un'altra espressione. @it
definition: Hozzákapcsol egy kollektív ágenst egy kifejezési formához, amely magában foglalja egy kollektív ágens közreműködését egy másik kifejezési forma tartalmának megváltoztatásában. @hu
definition: Kolektif bir temsilciyi, başka bir ifadenin içeriğinde değişiklik yapmak için kolektif bir temsilcinin katkısını içeren bir anlatım ile ilişkilendirir. @tr
definition: Liittää yhteistoimijan ekspressioon, jossa yhteistoimija on osallisena ekspression tekemisessä tekemällä muutoksia toisen ekspression sisältöön.
definition: Met un agent collectif en relation avec une expression qui intègre une contribution de la part d’un agent collectif consistant à apporter des modifications au contenu d’une autre expression. @fr
definition: Relaciona un agent col·lectiu amb una expressió que inclou una contribució d’un agent col·lectiu fent canvis en el contingut d’una altra expressió. @ca
definition: Relateert een collectieve actor aan een expressie die omvat een bijdrage door een collectieve actor door wijzigingen te maken in de content van een andere expressie. @nl
definition: Relaterer en kollektiv agent til et udtryk, som omfatter en kollektiv agents bidrag ved at foretage ændringer i indholdet af et andet udtryk. @da
definition: Relaterer en kollektiv agent til et uttrykk som inkluderer et bidrag fra en kollektiv agent i form av å gjøre endringer i innholdet av et annet uttrykk. @no
definition: Relates a collective agent to an expression that includes a contribution by a collective agent of making changes to the content of another expression. @en
definition: Sasaista grupu ar izteiksmi, kas ietver grupas ieguldījumu, veicot izmaiņas citas izteiksmes saturā. @lv
definition: Seostab kollektiivi väljendusega, millesse kollektiiv on andnud panuse, tehes muudatusi teise väljenduse sisusse. @et
definition: Setzt einen gemeinschaftlichen Akteur in Beziehung zu einer Expression, zu der ein gemeinschaftlicher Akteur beiträgt, indem er am Inhalt einer anderen Expression Veränderungen vornimmt. @de
definition: يربط وكيلا جماعيا بتعبيرة تتضمن إسهام وكيل جماعي لإجراء تغييرات على محتوى تعبيرة أخرى. @ar
definition: 将一个集体行为者与包括对另一种内容表达的内容作改动的一个集体行为者的贡献的一种内容表达关联起来。 @zh-hans

piirtäjä (yhteistoimija) ekspressiossa
has element type: 2
toolkit definition: An expression that includes a contribution by a collective agent of making detailed plans or drawings for buildings, ships, aircraft, machines, objects, etc. @en
toolkit definition: Binalar, gemiler, uçaklar, makineler, nesneler vb. için ayrıntılı plan veya çizimler yapan kolektif bir temsilcinin katkısını içeren bir anlatım. @tr
toolkit definition: Een expressie die omvat een bijdrage door een collectieve actor door het maken van gedetailleerde plattegronden of tekeningen voor gebouwen, schepen, luchtvaartuigen, machines, voorwerpen etc. @nl
toolkit definition: Egy kifejezési forma, amely magában foglalja egy kollektív ágens közreműködését épületek, hajók, repülőgépek, gépek, objektumok, stb. részletes terveinek vagy rajzainak elkészítésében. @hu
toolkit definition: Eine Expression, zu der ein gemeinschaftlicher Akteur beiträgt, indem er detaillierte Pläne oder Zeichnungen für Gebäude, Schiffe, Flugzeuge, Maschinen, Objekte oder ähnliches erstellt. @de
toolkit definition: Ekspressio, jonka tekemisessä yhteistoimija on osallisena tuottamalla tarkkoja suunnitelmia tai piirroksia rakennuksista, laivoista, lentokoneista, laitteista, esineistä tms.
toolkit definition: Espressione che comprende un contributo di un agente collettivo nel fare progetti o disegni dettagliati per edifici, navi, aerei, macchine, oggetti, etc. @it
toolkit definition: Et uttrykk som inkluderer et bidrag fra en kollektiv agent i form av å lage detaljerte plantegninger for bygninger, skip, fly, maskiner, gjenstander, etc. @no
toolkit definition: Expression qui intègre une contribution de la part d’un agent collectif consistant à effectuer des plans ou des dessins détaillés pour des bâtiments, des navires, des avions, des machines, des objets, etc. @fr
toolkit definition: Expressió que inclou una contribució d’un agent col·lectiu elaborant plànols o dibuixos detallats d’edificis, de vaixells, d’avions, de màquines, d’objectes, etc. @ca
toolkit definition: Izteiksme, kas ietver grupas ieguldījumu, izstrādājot ēku, kuģu, lidmašīnu, mašīnu, objektu utt. detalizētus plānus vai rasējumus. @lv
toolkit definition: Udtryk, som omfatter en kollektiv agents bidrag ved at lave detaljerede planer eller tegninger til bygninger, skibe, luftfartøj, maskiner, objekter etc. @da
toolkit definition: Väljendus, millesse kollektiiv on andnud panuse, tehes täpseid plaane või jooniseid ehitistele, laevadele, lennukitele, masinatele vm objektidele. @et
toolkit definition: تعبيرة تتضمن إسهام وكيل جماعي في وضع خطط أو رسومات مفصلة للمباني والسفن والطائرات والآلات والأشياء، إلخ. @ar
toolkit definition: 包括为建筑物、船舶、飞行器、机械装置、物体等制作详细平面图或绘制草图的一个集体行为者的贡献的一种内容表达 @zh-hans
toolkit label: Gemeinschaftlicher Akteur als Technische Zeichnerin/Technischer Zeichner von @de
toolkit label: agent collectif dessinateur industriel de @fr
toolkit label: agent col·lectiu delineant de @ca
toolkit label: disegnatore industriale agente collettivo di @it
toolkit label: draftsman collective agent of @en
toolkit label: ir rasētājs (grupa) @lv
toolkit label: joonestaja (kollektiiv) väljenduses @et
toolkit label: kollektiv agent, som er teknisk tegner af @da
toolkit label: műszaki rajzoló kollektív ágense: @hu
toolkit label: piirtäjä (yhteistoimija) ekspressiossa
toolkit label: tasarımcı kolektif temsilci @tr
toolkit label: technisch tekenaar-collectieve actor van @nl
toolkit label: teknisk tegner for (kollektiv agent) @no
toolkit label: σχεδιαστής συλλογικός φορέας του @el
toolkit label: وكيل جماعي رسام هندسي @ar
toolkit label: ……的绘图者集体行为者 @zh-hans
has subproperty: piirtäjä (yhteisö) ekspressiossa
has subproperty: piirtäjä (suku) ekspressiossa
has subproperty: P50745
lexical alias: draftsmanCollectiveAgentOf.en
status: Published
type: Property
domain: C10011
label: er kollektiv agent, som er teknisk tegner af @da
label: er teknisk tegner for (kollektiv agent) @no
label: est un agent collectif dessinateur industriel de @fr
label: ir rasētājs (grupa) @lv
label: is draftsman collective agent of @en
label: is technisch tekenaar-collectieve actor van @nl
label: ist gemeinschaftlicher Akteur als Technische Zeichnerin/Technischer Zeichner von @de
label: joonestaja (kollektiiv) väljenduses @et
label: műszaki rajzoló kollektív ágense a következőnek: @hu
label: teknik ressam kolektif temsilcisidir @tr
label: è disegnatore industriale agente collettivo di @it
label: és agent col·lectiu delineant de @ca
label: είναι σχεδιαστής συλλογικός φορέας του @el
label: هو وكيل جماعي رسام هندسي لـ @ar
label: 是……的绘图者集体行为者 @zh-hans
sub property of: piirtäjä (toimija) ekspressiossa
sub property of: yhdistymään osallinen yhteistoimija ekspressiossa
definition: Correla un agente collettivo a un'espressione che comprende un contributo di un agente collettivo nel fare progetti o disegni dettagliati per edifici, navi, aerei, macchine, oggetti, etc. @it
definition: Hozzákapcsol egy kollektív ágenst egy kifejezési formához, amely magában foglalja egy kollektív ágens közreműködését épületek, hajók, repülőgépek, gépek, objektumok, stb. részletes terveinek vagy rajzainak elkészítésében. @hu
definition: Kolektif bir temsilciyi, binalar, gemiler, uçaklar, makineler, nesneler vb. için ayrıntılı planlar veya çizimler yapmaya kolektif bir temsilcinin katkısını içeren bir anlatım ile ilişkilendirir. @tr
definition: Liittää yhteistoimijan ekspressioon, jonka tekemisessä yhteistoimija on osallisena tuottamalla tarkkoja suunnitelmia tai piirroksia rakennuksista, laivoista, lentokoneista, laitteista, esineistä tms.
definition: Met un agent collectif en relation avec une expression qui intègre une contribution de la part d’un agent collectif consistant à effectuer des plans ou des dessins détaillés pour des bâtiments, des navires, des avions, des machines, des objets, etc. @fr
definition: Relaciona un agent col·lectiu amb una expressió que inclou una contribució d’un agent col·lectiu elaborant plànols o dibuixos detallats d’edificis, de vaixells, d’avions, de màquines, d’objectes, etc. @ca
definition: Relateert een collectieve actor aan een expressie die omvat een bijdrage door een collectieve actor door het maken van gedetailleerde plattegronden of tekeningen voor gebouwen, schepen, luchtvaartuigen, machines, voorwerpen etc. @nl
definition: Relaterer en kollektiv agent til et udtryk, som omfatter en kollektiv agents bidrag ved at lave detaljerede planer eller tegninger til bygninger, skibe, luftfartøj, maskiner, objekter etc. @da
definition: Relaterer en kollektiv agent til et uttrykk som inkluderer et bidrag fra en kollektiv agent i form av å lage detaljerte plantegninger for bygninger, skip, fly, maskiner, gjenstander, etc. @no
definition: Relates a collective agent to an expression that includes a contribution by a collective agent of making detailed plans or drawings for buildings, ships, aircraft, machines, objects, etc. @en
definition: Sasaista grupu ar izteiksmi, kas ietver grupas ieguldījumu, izstrādājot ēku, kuģu, lidmašīnu, mašīnu, objektu utt. detalizētus plānus vai rasējumus. @lv
definition: Seostab kollektiivi väljendusega, millesse kollektiiv on andnud panuse, tehes täpseid plaane või jooniseid ehitistele, laevadele, lennukitele, masinatele vm objektidele. @et
definition: Setzt einen gemeinschaftlichen Akteur in Beziehung zu einer Expression, zu der ein gemeinschaftlicher Akteur beiträgt, indem er detaillierte Pläne oder Zeichnungen für Gebäude, Schiffe, Flugzeuge, Maschinen, Objekte oder ähnliches erstellt. @de
definition: يربط وكيلا جماعيا بتعبيرة تتضمن إسهام وكيل جماعي في وضع خطط أو رسومات مفصلة للمباني والسفن والطائرات والآلات والأشياء، إلخ. @ar
definition: 将一个集体行为者与包括为建筑物、船舶、飞行器、机械装置、物体等制作详细平面图或绘制草图的一个集体行为者的贡献的一种内容表达关联起来。 @zh-hans

ääniteknikko (yhteistoimija) ekspressiossa
has element type: 2
toolkit definition: An expression that includes a contribution by a collective agent of managing the technical aspects of sound during the processes of recording, mixing, and reproduction. @en
toolkit definition: Een expressie die omvat een bijdrage door een collectieve actor door beheren van de technische aspecten van geluid gedurende de procedures van opname, mixen en reproductie. @nl
toolkit definition: Egy kifejezési forma, amely magában foglalja egy kollektív ágens közreműködését a hang technikai vonatkozásainak kezelésében a rögzítés, a keverés és a sokszorosítás folyamatában. @hu
toolkit definition: Eine Expression, zu der ein gemeinschaftlicher Akteur beiträgt, indem er die technischen Aspekte für den Ton während der Aufnahme, des Misch-Verfahrens und der Vervielfältigung handhabt. @de
toolkit definition: Ekspressio, jossa yhteistoimija on osallisena ekspression tekemisessä huolehtimalla äänen teknisistä näkökohdista äänitys-, miksaus- ja äänentoistoprosessien aikana.
toolkit definition: Espressione che comprende un contributo di un agente collettivo nella gestione degli aspetti tecnici del suono durante i processi di registrazione, missaggio e riproduzione. @it
toolkit definition: Et uttrykk som inkluderer et bidrag fra en kollektiv agent i form av å styre de tekniske aspektene ved lyd under innspilling, miksing og gjengivelse. @no
toolkit definition: Expression qui intègre une contribution de la part d’un agent collectif consistant à gérer les aspects techniques du son durant les processus d’enregistrement, de mixage et de reproduction. @fr
toolkit definition: Expressió que inclou una contribució d’un agent col·lectiu gestionant els aspectes tècnics del so durant els processos d’enregistrament, mescla i reproducció. @ca
toolkit definition: Izteiksme, kas ietver grupas ieguldījumu, pārvaldot skaņas tehnisko aspektu ierakstīšanas, miksēšanas un pavairošanas laikā. @lv
toolkit definition: Kayıt, miksaj ve yeniden üretim süreçleri sırasında sesin teknik yönlerini yöneten kolektif bir temsilcinin katkısını içeren bir anlatım. @tr
toolkit definition: Udtryk, som omfatter en kollektiv agents bidrag ved at håndtere de tekniske lydaspekter under indspilning, mixning og reproduktion. @da
toolkit definition: Väljendus, millesse kollektiiv on andnud panuse, tegeldes heli tehniliste aspektidega salvestamise, miksimise ja taasesituse protsesside ajal. @et
toolkit definition: تعبيرة تتضمن إسهام وكيل جماعي في إدارة الجوانب الفنية للصوت أثناء عمليات التسجيل والمزج والاستنساخ. @ar
toolkit definition: 包括声音的录制、合成和复制过程技术方面管理的一个集体行为者的贡献的一种内容表达 @zh-hans
toolkit label: Gemeinschaftlicher Akteur als Tontechnikerin/Tontechniker von @de
toolkit label: agent collectif ingénieur du son de @fr
toolkit label: agent col·lectiu enginyer d’àudio de @ca
toolkit label: audio engineer collective agent of @en
toolkit label: geluidstechnicus-collectieve actor van @nl
toolkit label: hangmester kollektív ágense: @hu
toolkit label: heliinsener (kollektiiv) väljenduses @et
toolkit label: ingegnere del suono agente collettivo di @it
toolkit label: ir skaņu inženieris (grupa) @lv
toolkit label: kollektiv agent, som er lydtekniker af @da
toolkit label: lydtekniker for (kollektiv agent) @no
toolkit label: ses mühendisi kolektif temsilcisi @tr
toolkit label: ääniteknikko (yhteistoimija) ekspressiossa
toolkit label: μηχανικός ήχου συλλογικός φορέας του @el
toolkit label: وكيل جماعي مهندس صوت @ar
toolkit label: ……的音频工程师集体行为者 @zh-hans
has subproperty: miksaaja (yhteistoimija) ekspressiossa
has subproperty: äänittäjä (yhteistoimija) ekspressiossa
has subproperty: ääniteknikko (yhteisö) ekspressiossa
has subproperty: ääniteknikko (suku) ekspressiossa
has subproperty: P50746
lexical alias: audioEngineerCollectiveAgentOf.en
status: Published
type: Property
domain: C10011
label: er kollektiv agent, som er lydtekniker af @da
label: er lydtekniker for (kollektiv agent) @no
label: est un agent collectif ingénieur du son de @fr
label: hangmester kollektív ágense a következőnek: @hu
label: heliinsener (kollektiiv) väljenduses @et
label: ir skaņu inženieris (grupa) @lv
label: is audio engineer collective agent of @en
label: is geluidstechnicus-collectieve actor van @nl
label: ist gemeinschaftlicher Akteur als Tontechnikerin/Tontechniker von @de
label: ses mühendisi kolektif temsilcisidir @tr
label: è ingegnere del suono agente collettivo di @it
label: és agent col·lectiu enginyer d’àudio de @ca
label: είναι μηχανικός ήχου συλλογικός φορέας του @el
label: هو وكيل جماعي مهندس صوت لـ @ar
label: 是……的音频工程师集体行为者 @zh-hans
sub property of: ääniteknikko (toimija) ekspressiossa
sub property of: esitykseen osallinen yhteistoimija ekspressiossa
definition: Correla un agente collettivo a un'espressione che comprende un contributo di un agente collettivo nella gestione degli aspetti tecnici del suono durante i processi di registrazione, missaggio e riproduzione. @it
definition: Hozzákapcsol egy kollektív ágenst egy kifejezési formához, amely magában foglalja egy kollektív ágens közreműködését a hang technikai vonatkozásainak kezelésében a rögzítés, a keverés és a sokszorosítás folyamatában. @hu
definition: Kolektif bir temsilciyi, kayıt, miksaj ve yeniden üretim süreçleri sırasında sesin teknik yönlerini yönetmeye kolektif bir temsilcinin katkısını içeren bir anlatım ile ilişkilendirir. @tr
definition: Liittää yhteistoimijan ekspressioon, jossa yhteistoimija on osallisena ekspression tekemisessä huolehtimalla äänen teknisistä näkökohdista äänitys-, miksaus- ja äänentoistoprosessien aikana.
definition: Met un agent collectif en relation avec une expression qui intègre une contribution de la part d’un agent collectif consistant à gérer les aspects techniques du son durant les processus d’enregistrement, de mixage et de reproduction. @fr
definition: Relaciona un agent col·lectiu amb una expressió que inclou una contribució d’un agent col·lectiu gestionant els aspectes tècnics del so durant els processos d’enregistrament, mescla i reproducció. @ca
definition: Relateert een collectieve actor aan een expressie die omvat een bijdrage door een collectieve actor door beheren van de technische aspecten van geluid gedurende de procedures van opname, mixen en reproductie. @nl
definition: Relaterer en kollektiv agent til et udtryk, som omfatter en kollektiv agents bidrag ved at håndtere de tekniske lydaspekter under indspilning, mixning og reproduktion. @da
definition: Relaterer en kollektiv agent til et uttrykk som inkluderer et bidrag fra en kollektiv agent i form av å styre de tekniske aspektene ved lyd under innspilling, miksing og gjengivelse. @no
definition: Relates a collective agent to an expression that includes a contribution by a collective agent of managing the technical aspects of sound during the processes of recording, mixing, and reproduction. @en
definition: Sasaista grupu ar izteiksmi, kas ietver grupas ieguldījumu, pārvaldot skaņas tehnisko aspektu ierakstīšanas, miksēšanas un pavairošanas laikā. @lv
definition: Seostab kollektiivi väljendusega, millesse kollektiiv on andnud panuse, tegeldes heli tehniliste aspektidega salvestamise, miksimise ja taasesituse protsesside ajal. @et
definition: Setzt einen gemeinschaftlichen Akteur in Beziehung zu einer Expression, zu der ein gemeinschaftlicher Akteur beiträgt, indem er die technischen Aspekte für den Ton während der Aufnahme, des Misch-Verfahrens und der Vervielfältigung handhabt. @de
definition: يربط وكيلا جماعيا بتعبيرة تتضمن إسهام وكيل جماعي في إدارة الجوانب الفنية للصوت أثناء عمليات التسجيل والمزج والاستنساخ. @ar
definition: 将一个集体行为者与包括声音的录制、合成和复制过程技术方面管理的一个集体行为者的贡献的一种内容表达关联起来。 @zh-hans

nukettaja (yhteistoimija) ekspressiossa
has element type: 2
toolkit definition: An expression that includes a contribution by a collective agent of manipulating, controlling, or directing puppets or marionettes in a moving image production or a musical or dramatic presentation or entertainment. @en
toolkit definition: Een expressie die omvat een bijdrage van een collectieve actor in het manipuleren, sturen of regisseren van poppen of marionetten in een bewegend beeld-productie of in een muziek- of dramapresentatie of vermaak. @nl
toolkit definition: Egy kifejezési forma, amely magában foglalja egy kollektív ágens közreműködését bábok vagy marionettfigurák manipulálásában, vezérlésében vagy irányításában egy mozgókép-produkcióban, zenei vagy drámai bemutatóban vagy szórakoztató műsorban. @hu
toolkit definition: Eine Expression, zu der ein gemeinschaftlicher Akteur beiträgt, indem er Puppen oder Marionetten in einer Bewegtbildproduktion oder einer musikalischen oder dramatischen Darbietung oder Aufführung bewegt, kontrolliert oder lenkt. @de
toolkit definition: Ekspressio, jonka tekemisessä yhteistoimija on osallisena käsittelemällä, kontrolloimalla tai ohjaamalla nukkeja tai marionetteja elokuvatuotannossa tai musiikki- tai näytelmäesityksessä.
toolkit definition: Espressione che comprende un contributo di un agente collettivo nella manipolazione, controllo o direzione di burattini o marionette in una produzione di immagini in movimento o una presentazione o spettacolo musicale o drammatico. @it
toolkit definition: Et uttrykk som inkluderer et bidrag fra en kollektiv agent i form av å manipulere, kontrollere eller styre dukker eller marionetter i en produksjon med levende bilder eller en musikalsk eller dramatisk forestilling eller underholdning. @no
toolkit definition: Expression qui intègre une contribution de la part d’un agent collectif consistant à manipuler, à contrôler ou à diriger des marionnettes dans une production d’images animées ou bien dans une présentation ou un spectacle musical ou dramatique. @fr
toolkit definition: Expressió que inclou una contribució d’un agent col·lectiu manipulant, controlant o dirigint titelles o marionetes en una producció d’imatge en moviment o en una representació o un espectacle musical o dramàtic. @ca
toolkit definition: Hareketli bir görüntü üretiminde veya müzikal veya dramatik bir sunumda veya eğlencede kuklaları manipüle eden, kontrol eden veya yöneten kolektif bir temsilcinin katkısını içeren bir anlatım. @tr
toolkit definition: Izteiksme, kas ietver grupas ieguldījumu, manipulējot, kontrolējot vai vadot lelles vai marionetes, radot kustīgu attēlu vai muzikālu, vai dramatisku prezentāciju vai izklaidei. @lv
toolkit definition: Udtryk, som omfatter en kollektiv agents bidrag ved at manipulere, styre eller føre dukker eller marionetter i en levende billedproduktion eller en musikalsk eller dramatisk præsentation eller underholdning. @da
toolkit definition: Väljendus, millesse kollektiiv on andnud panuse, käsitsedes, kontrollides või juhtides nukke või marionette filmi tootmisel, muusika- või draamaetenduses või meelelahutusüritusel. @et
toolkit definition: تعبيرة تتضمن إسهام وكيل جماعي باللعب بالعرائس أو الدمى المتحركة أو التحكم فيها، أو توجيهها في إنتاج لصور متحركة أو في عرض موسيقي أو درامي أو ترفيهي. @ar
toolkit definition: 包括有在动态图像制作或者音乐或戏剧呈现或娱乐中操纵、控制、指引木偶的一个集体行为者的贡献的一种内容表达 @zh-hans
toolkit label: Gemeinschaftlicher Akteur als Puppenspielerin/Puppenspieler von @de
toolkit label: agent collectif marionnettiste de @fr
toolkit label: agent col·lectiu titellaire de @ca
toolkit label: bábjátékos kollektív ágense: @hu
toolkit label: dukkefører for (kollektiv agent) @no
toolkit label: ir leļļu teātra aktieris (grupa) @lv
toolkit label: kollektiv agent, som er dukkefører af @da
toolkit label: kuklacı kolektif temsilcisi @tr
toolkit label: marionettista agente collettivo di @it
toolkit label: nukettaja (yhteistoimija) ekspressiossa
toolkit label: nukujuht (kollektiiv) väljenduses @et
toolkit label: poppenspeler-collectieve actor van @nl
toolkit label: puppeteer collective agent of @en
toolkit label: κουκλοπαίκτης συλλογικός φορέας του @el
toolkit label: وكيل جماعي محرك عرائس @ar
toolkit label: ……的木偶表演者集体行为者 @zh-hans
has subproperty: nukettaja (yhteisö) ekspressiossa
has subproperty: nukettaja (suku) ekspressiossa
has subproperty: P50747
lexical alias: puppeteerCollectiveAgentOf.en
status: Published
type: Property
domain: C10011
label: bábjátékos kollektív ágense a következőnek: @hu
label: er dukkefører for (kollektiv agent) @no
label: er kollektiv agent, som er dukkefører af @da
label: est un agent collectif marionnettiste de @fr
label: ir leļļu teātra aktieris (grupa) @lv
label: is poppenspeler-collectieve actor van @nl
label: is puppeteer collective agent of @en
label: ist gemeinschaftlicher Akteur als Puppenspielerin/Puppenspieler von @de
label: kuklacı kolektif temsilcisidir @tr
label: nukujuht (kollektiiv) väljenduses @et
label: è marionettista agente collettivo di @it
label: és agent col·lectiu titellaire de @ca
label: είναι κουκλοπαίκτης συλλογικός φορέας του @el
label: هو وكيل جماعي محرك عرائس لـ @ar
label: 是……的木偶表演者集体行为者 @zh-hans
sub property of: nukettaja (toimija) ekspressiossa
sub property of: esittäjä (yhteistoimija) ekspressiossa
definition: Correla un agente collettivo a un'espressione che comprende un contributo di un agente collettivo nella manipolazione, controllo o direzione di burattini o marionette in una produzione di immagini in movimento o una presentazione o spettacolo musicale o drammatico. @it
definition: Hozzákapcsol egy kollektív ágenst egy kifejezési formához, amely magában foglalja egy kollektív ágens közreműködését bábok vagy marionettfigurák manipulálásában, vezérlésében vagy irányításában egy mozgókép-produkcióban, zenei vagy drámai bemutatóban vagy szórakoztató műsorban. @hu
definition: Kolektif bir temsilciyi, hareketli bir görüntü üretiminde veya müzikal veya dramatik bir sunumda veya eğlencede kuklaları veya kuklaları manipüle etme, kontrol etme veya yönetme konusunda kolektif bir temsilcinin katkısını içeren bir anlatım ile ilişkilendirir. @tr
definition: Liittää yhteistoimijan ekspressioon, jonka tekemisessä yhteistoimija on osallisena käsittelemällä, kontrolloimalla tai ohjaamalla nukkeja tai marionetteja elokuvatuotannossa tai musiikki- tai näytelmäesityksessä.
definition: Met un agent collectif en relation avec une expression qui intègre une contribution de la part d’un agent collectif consistant à manipuler, à contrôler ou à diriger des marionnettes dans une production d’images animées ou bien dans une présentation ou un spectacle musical ou dramatique. @fr
definition: Relaciona un agent col·lectiu amb una expressió que inclou una contribució d’un agent col·lectiu manipulant, controlant o dirigint titelles o marionetes en una producció d’imatge en moviment o en una representació o un espectacle musical o dramàtic. @ca
definition: Relateert een collectieve actor aan een expressie die omvat een bijdrage van een collectieve actor in het manipuleren, sturen of regisseren van poppen of marionetten in een bewegend beeld-productie of in een muziek- of dramapresentatie of vermaak. @nl
definition: Relaterer en kollektiv agent til et udtryk, som omfatter en kollektiv agents bidrag ved at manipulere, styre eller føre dukker eller marionetter i en levende billedproduktion eller en musikalsk eller dramatisk præsentation eller underholdning. @da
definition: Relaterer en kollektiv agent til et uttrykk som inkluderer et bidrag fra en kollektiv agent i form av å manipulere, kontrollere eller styre dukker eller marionetter i en produksjon med levende bilder eller en musikalsk eller dramatisk forestilling eller underholdning. @no
definition: Relates a collective agent to an expression that includes a contribution by a collective agent of manipulating, controlling, or directing puppets or marionettes in a moving image production or a musical or dramatic presentation or entertainment @en
definition: Sasaista grupu ar izteiksmi, kas ietver grupas ieguldījumu, manipulējot, kontrolējot vai vadot lelles vai marionetes, radot kustīgu attēlu vai muzikālu, vai dramatisku prezentāciju vai izklaidei. @lv
definition: Seostab kollektiivi väljendusega, millesse kollektiiv on andnud panuse, käsitsedes, kontrollides või juhtides nukke või marionette filmi tootmisel, muusika- või draamaetenduses või meelelahutusüritusel. @et
definition: Setzt einen gemeinschaftlichen Akteur in Beziehung zu einer Expression, zu der ein gemeinschaftlicher Akteur beiträgt, indem er Puppen oder Marionetten in einer Bewegtbildproduktion oder einer musikalischen oder dramatischen Darbietung oder Aufführung bewegt, kontrolliert oder lenkt. @de
definition: يربط وكيلا جماعيا بتعبيرة تتضمن إسهام وكيل جماعي باللعب بالعرائس أو الدمى المتحركة أو التحكم فيها، أو توجيهها في إنتاج لصور متحركة أو في عرض موسيقي أو درامي أو ترفيهي. @ar
definition: 将一个集体行为者与包括有在动态图像制作或者音乐或戏剧呈现或娱乐中操纵、控制、指引木偶的一个集体行为者的贡献的一种内容表达关联起来。 @zh-hans

miksaaja (yhteistoimija) ekspressiossa
has element type: 2
toolkit definition: An expression that includes a contribution by a collective agent of manipulating, mixing and assembling the multiple tracks of an audio recording. @en
toolkit definition: Bir ses kaydının birden çok parçasını manipüle eden, karıştıran ve bir araya getiren kolektif bir temsilcinin katkısını içeren bir anlatım. @tr
toolkit definition: Een expressie die omvat een bijdrage door een collectieve actor door manipuleren, mixen en samenstellen van meerdere sporen van een geluidsopname. @nl
toolkit definition: Egy kifejezési forma, amely magában foglalja egy kollektív ágens közreműködését egy hangfelvétel sávjainak manipulálásában, keverésében és összeállításában. @hu
toolkit definition: Eine Expression, zu der ein gemeinschaftlicher Akteur beiträgt, indem er mehrere Tonspuren einer Aufnahme bearbeitet, mischt und zusammenlegt. @de
toolkit definition: Ekspressio, jossa yhteistoimija on osallisena ekspression äänisisällön tekemisessä käsittelemällä, miksaamalla ja yhdistelemällä useampia äänitteen raitoja.
toolkit definition: Espressione che comprende un contributo di un agente collettivo nella manipolazione, missaggio e assemblaggio delle tracce multiple di una registrazione audio. @it
toolkit definition: Et uttrykk som inkluderer et bidrag fra en kollektiv agent i form av å manipulere, mikse og sette sammen de ulike sporene i et lydopptak. @no
toolkit definition: Expression qui intègre une contribution de la part d’un agent collectif consistant à manipuler, à mixer et à assembler les différentes pistes d’un enregistrement audio. @fr
toolkit definition: Expressió que inclou una contribució d’un agent col·lectiu en la manipulació, la mescla i el muntatge de les diverses pistes d’un enregistrament àudio. @ca
toolkit definition: Izteiksme, kas ietver grupas ieguldījumu, miksējot un montējot audio ieraksta vairākus celiņus. @lv
toolkit definition: Udtryk, som omfatter en kollektiv agents bidrag ved at manipulere, mixe og samle de forskellige lydspor på en optagelse. @da
toolkit definition: Väljendus, millesse kollektiiv on andnud panuse, töödeldes, miksides ja monteerides mitmerealise salvestise heliradasid. @et
toolkit definition: تعبيرة تتضمن إسهام وكيل جماعي في معالجة المسارات المتعددة لتسجيل صوتي ومزجها وتجميعها. @ar
toolkit definition: 包括操纵、合成和聚集一个录音的多个音轨的一个集体行为者的贡献的一种内容表达 @zh-hans
toolkit label: Gemeinschaftlicher Akteur als Mischtontechnikerin/Mischtontechniker von @de
toolkit label: Ses mühendisi kolektif temsilcisi @tr
toolkit label: agent collectif mixeur de son de @fr
toolkit label: agent col·lectiu enginyer de remescla de @ca
toolkit label: hangkeverő kollektív ágense: @hu
toolkit label: ingegnere del missaggio agente collettivo di @it
toolkit label: ir skaņu miksētājs (grupa) @lv
toolkit label: kollektiv agent, som er mixingtekniker af @da
toolkit label: miksaaja (yhteistoimija) ekspressiossa
toolkit label: miksetekniker for (kollektiv agent) @no
toolkit label: miksimisinsener (kollektiiv) väljenduses @et
toolkit label: mixing engineer collective agent of @en
toolkit label: mixtechnicus-collectieve actor van @nl
toolkit label: μηχανικός μείξης συλλογικός φορέας του @el
toolkit label: وكيل جماعي مهندس للمكساج @ar
toolkit label: ……的合成工程师集体行为者 @zh-hans
has subproperty: miksaaja (yhteisö) ekspressiossa
has subproperty: miksaaja (suku) ekspressiossa
has subproperty: P50748
lexical alias: mixingEngineerCollectiveAgentOf.en
status: Published
type: Property
domain: C10011
label: er kollektiv agent, som er mixingtekniker af @da
label: er miksetekniker for (kollektiv agent) @no
label: est un agent collectif mixeur de son de @fr
label: hangkeverő kollektív ágense a következőnek: @hu
label: ir skaņu miksētājs (grupa) @lv
label: is mixing engineer collective agent of @en
label: is mixtechnicus-collectieve actor van @nl
label: ist gemeinschaftlicher Akteur als Mischtontechnikerin/Mischtontechniker von @de
label: miksimisinsener (kollektiiv) väljenduses @et
label: ses miksaj mühendisi kolektif temsilcisidir @tr
label: è ingegnere del missaggio agente collettivo di @it
label: és agent col·lectiu enginyer de remescla de @ca
label: είναι μηχανικός μείξης συλλογικός φορέας του @el
label: هو وكيل جماعي مهندس مكساج لـ @ar
label: 是……的合成工程师集体行为者 @zh-hans
sub property of: miksaaja (toimija) ekspressiossa
sub property of: ääniteknikko (yhteistoimija) ekspressiossa
definition: Correla un agente collettivo a un'espressione che comprende un contributo di un agente collettivo nella manipolazione, missaggio e assemblaggio delle tracce multiple di una registrazione audio. @it
definition: Hozzákapcsol egy kollektív ágenst egy kifejezési formához, amely magában foglalja egy kollektív ágens közreműködését egy hangfelvétel sávjainak manipulálásában, keverésében és összeállításában. @hu
definition: Kolektif bir temsilciyi, bir ses kaydının birden çok parçasını manipüle etme, karıştırma ve bir araya getirme konusunda kolektif bir temsilcinin katkısını içeren bir anlatım ile ilişkilendirir. @tr
definition: Liittää yhteistoimijan ekspressioon, jossa yhteistoimija on osallisena ekspression äänisisällön tekemisessä käsittelemällä, miksaamalla ja yhdistelemällä useampia äänitteen raitoja.
definition: Met un agent collectif en relation avec une expression qui intègre une contribution de la part d’un agent collectif consistant à manipuler, à mixer et à assembler les différentes pistes d’un enregistrement audio. @fr
definition: Relaciona un agent col·lectiu amb una expressió que inclou una contribució d’un agent col·lectiu en la manipulació, la mescla i el muntatge de les diverses pistes d’un enregistrament àudio. @ca
definition: Relateert een collectieve actor aan een expressie die omvat een bijdrage door een collectieve actor door manipuleren, mixen en samenstellen van meerdere sporen van een geluidsopname. @nl
definition: Relaterer en kollektiv agent til et udtryk, som omfatter en kollektiv agents bidrag ved at manipulere, mixe og samle de forskellige lydspor på en optagelse. @da
definition: Relaterer en kollektiv agent til et uttrykk som inkluderer et bidrag fra en kollektiv agent i form av å manipulere, mikse og sette sammen de ulike sporene i et lydopptak. @no
definition: Relates a collective agent to an expression that includes a contribution by a collective agent of manipulating, mixing and assembling the multiple tracks of an audio recording. @en
definition: Sasaista grupu ar izteiksmi, kas ietver grupas ieguldījumu, miksējot un montējot audio ieraksta vairākus celiņus. @lv
definition: Seostab kollektiivi väljendusega, millesse kollektiiv on andnud panuse, töödeldes, miksides ja monteerides mitmerealise salvestise heliradasid. @et
definition: Setzt einen gemeinschaftlichen Akteur in Beziehung zu einer Expression, zu der ein gemeinschaftlicher Akteur beiträgt, indem er mehrere Tonspuren einer Aufnahme bearbeitet, mischt und zusammenlegt. @de
definition: يربط وكيلا جماعيا بتعبيرة تتضمن إسهام وكيل جماعي في معالجة المسارات المتعددة لتسجيل صوتي ومزجها وتجميعها. @ar
definition: 将一个集体行为者与包括操纵、合成和聚集一个录音的多个音轨的一个集体行为者的贡献的一种内容表达关联起来。 @zh-hans
scope note: Darunter fallen keine Nachbearbeitungen, die die Art und den Inhalt des Originalwerks substantiell verändern, so dass ein neues Werk entsteht, sowie das Mischen und Zusammenlegen von mehreren Einzelspuren einer Aufnahme. @de
scope note: Ei hõlma remiksimist, mis muudab oluliselt originaalteose olemust ja sisu, nii et tekib uus teos, ega mitmerealise salvestise heliradade miksimist ja monteerimist. @et
scope note: Ei koske uudelleenmiksauksia, jotka olennaisesti muuttavat alkuperäisen teoksen luonnetta ja sisältöä, mikä johtaa uuteen teokseen.
scope note: Neietver remiksēšanas darbību, kas maina sākotnējā darba būtību un saturu, kā rezultātā tiek radīts jauns darbs, kā arī neietver vairāku ieraksta celiņu miksēšanu un montēšanu. @lv
scope note: Nem tartoznak ide azok az új forrást eredményező újrakeverési tevékenységek, amelyek jelentősen megváltoztatják az eredeti forrás jellegét és tartalmát, sem a felvétel több sávjának keverése és összeállítása. @hu
scope note: Orijinal eserin niteliğini ve içeriğini önemli ölçüde değiştirerek, yeni bir eser ortaya çıkaran remiks faaliyetleri hariçtir. @tr
scope note: Remiksaktiviteter som i betydelig grad endrer originalverkets særpreg og innhold og som resulterer i et nytt verk, er ikke inkludert. @no
scope note: Remixhandelingen die de aard en content van de oorspronkelijke resource substantieel wijzigen, resulterend in een nieuwe resource, en mixen en samenstellen van meerdere sporen van een opname zijn uitgesloten. @nl

DJ (yhteistoimija) ekspressiossa
has element type: 2
toolkit definition: An expression that includes a contribution by a collective agent of mixing recorded tracks together during a live performance or in a recording studio to appear as one continuous track. @en
toolkit definition: Canlı bir performans sırasında veya bir kayıt stüdyosunda kaydedilmiş parçaları tek bir sürekli parça olarak görünecek şekilde karıştıran kolektif bir temsilcinin katkısını içeren bir anlatım. @tr
toolkit definition: Een expressie die omvat een bijdrage door een collectieve actor door het samenmixen van geluidssporen gedurende een live optreden of in een opnamestudio om als één doorlopend spoor te lijken. @nl
toolkit definition: Egy kifejezési forma, amely magában foglalja egy kollektív ágens közreműködését felvett hangsávok élő előadás közben vagy egy hangstúdióban történő keverésében, hogy azok egy folyamatos műsorszámként jelenjenek meg. @hu
toolkit definition: Eine Expression, zu der ein gemeinschaftlicher Akteur beiträgt, indem er während eines Live-Auftritts oder in einem Aufnahme-Studio aufgenommene Einzelspuren (Kanäle) zu einem scheinbar ununterbrochen durchgehenden Klangerlebnis zusammen mischt. @de
toolkit definition: Ekspressio, jossa yhteistoimija on osallisena ekspression tekemisessä miksaamalla ääniraitoja yhteen yhtäjaksoiseksi raidaksi live-esityksessä tai äänitysstudiossa.
toolkit definition: Espressione che comprende un contributo di un agente collettivo nel missaggio di tracce registrate durante un'esibizione dal vivo o in uno studio di registrazione in modo che appaiano come una traccia continua. @it
toolkit definition: Et uttrykk av et verk som innlemmer et bidrag av miksing av innspilte spor i løpet av en liveopptreden eller i et studio for å framstilles som ett kontinuerlig spor. @no
toolkit definition: Expression qui intègre une contribution de la part d’un agent collectif consistant à mixer ensemble des pistes enregistrées, durant une prestation en direct ou dans un studio d’enregistrement, pour donner l’impression d’une seule piste continue. @fr
toolkit definition: Expressió que inclou una contribució d’un agent col·lectiu mesclant pistes enregistrades conjuntament durant una actuació en directe o en un estudi de gravació perquè sembli una pista continua. @ca
toolkit definition: Izteiksme, kas ietver grupas ieguldījumu, miksējot ierakstītus mūzikas celiņus dzīvās uzstāšanās laikā vai ierakstu studijā, lai radītu vienu nepārtrauktu ierakstu. @lv
toolkit definition: Udtryk, som omfatter en kollektiv agents bidrag ved at mixe indspillede spor sammen under en live-optræden eller i et indspilningsstudie, så de fremstår som et uafbrudt spor. @da
toolkit definition: Väljendus, millesse kollektiiv on andnud panuse, miksides salvestatud lugusid kokku üheks jätkuvaks looks, tehes seda elavas esituses või salvestusstuudios. @et
toolkit definition: تعبيرة تتضمن إسهام وكيل جماعي في مزج ألحان مسجلة أثناء أدائها مباشرة أو أثناء تسجيلها في استوديو لتبدو كمسار واحد مستمر. @ar
toolkit definition: 包括在现场表演中或在录音工作室中混合已录制音轨使其出现为一个连续的音轨的一个集体行为者的贡献的一种内容表达 @zh-hans
toolkit label: DJ (kollektiiv) väljenduses @et
toolkit label: DJ (yhteistoimija) ekspressiossa
toolkit label: DJ agente collettivo di @it
toolkit label: DJ collective agent of @en
toolkit label: DJ for (kollektiv agent) @no
toolkit label: DJ kolektif temsilci @tr
toolkit label: DJ kollektív ágense: @hu
toolkit label: DJ συλλογικός φορέας του @el
toolkit label: Gemeinschaftlicher Akteur als DJane/DJ von @de
toolkit label: agent collectif disque-jockey de @fr
toolkit label: agent col·lectiu discjòquei de @ca
toolkit label: deejay-collectieve actor van @nl
toolkit label: ir dīdžejs (grupa) @lv
toolkit label: kollektiv agent, som er dj af @da
toolkit label: وكيل جماعي منسق دي جي @ar
toolkit label: ……的打碟者集体行为者 @zh-hans
has subproperty: DJ (yhteisö) ekspressiossa
has subproperty: DJ (suku) ekspressiossa
has subproperty: P50749
lexical alias: djCollectiveAgentOf.en
status: Published
type: Property
domain: C10011
label: DJ (kollektiiv) väljenduses @et
label: DJ kolektif temsilcisidir @tr
label: DJ kollektív ágense a következőnek: @hu
label: er DJ for (kollektiv agent) @no
label: er kollektiv agent, som er dj af @da
label: est un agent collectif disque-jockey de @fr
label: ir dīdžejs (grupa) @lv
label: is DJ collective agent of @en
label: is deejay-collectieve actor van @nl
label: ist gemeinschaftlicher Akteur als DJane/DJ von @de
label: è DJ agente collettivo di @it
label: és agent col·lectiu discjòquei de @ca
label: είναι DJ συλλογικός φορέας του @el
label: هو وكيل جماعي لدي جي لـ @ar
label: 是……的打碟者集体行为者 @zh-hans
sub property of: DJ (toimija) ekspressiossa
sub property of: esitykseen osallinen yhteistoimija ekspressiossa
alternative label: agent collectif DJ de @fr
alternative label: agent collectif disc-jockey de @fr
definition: Correla un agente collettivo a un'espressione che comprende un contributo di un agente collettivo nel missaggio di tracce registrate durante un'esibizione dal vivo o in uno studio di registrazione in modo che appaiano come una traccia continua. @it
definition: Hozzákapcsol egy kollektív ágenst egy kifejezési formához, amely magában foglalja egy kollektív ágens közreműködését felvett hangsávok élő előadás közben vagy egy hangstúdióban történő keverésében, hogy azok egy folyamatos műsorszámként jelenjenek meg. @hu
definition: Kolektif bir temsilciyi, canlı bir performans sırasında veya bir kayıt stüdyosunda kaydedilmiş parçaları tek bir sürekli parça olarak görünecek şekilde bir araya getirmede kolektif bir temsilcinin katkısını içeren bir anlatım ile ilişkilendirir. @tr
definition: Liittää yhteistoimijan ekspressioon, jossa yhteistoimija on osallisena ekspression tekemisessä miksaamalla ääniraitoja yhteen yhtäjaksoiseksi raidaksi live-esityksessä tai äänitysstudiossa.
definition: Met un agent collectif en relation avec une expression qui intègre une contribution de la part d’un agent collectif consistant à mixer ensemble des pistes enregistrées, durant une prestation en direct ou dans un studio d’enregistrement, pour donner l’impression d’une seule piste continue. @fr
definition: Relaciona un agent col·lectiu amb una expressió que inclou una contribució d’un agent col·lectiu mesclant pistes enregistrades conjuntament durant una actuació en directe o en un estudi de gravació perquè sembli una pista continua. @ca
definition: Relateert een collectieve actor aan een expressie die omvat een bijdrage door een collectieve actor door het samenmixen van geluidssporen gedurende een live optreden of in een opnamestudio om als één doorlopend spoor te lijken. @nl
definition: Relaterer en kollektiv agent til et udtryk, som omfatter en kollektiv agents bidrag ved at mixe indspillede spor sammen under en live-optræden eller i et indspilningsstudie, så de fremstår som et uafbrudt spor. @da
definition: Relaterer en kollektiv agent til et uttrykk av et verk som innlemmer et bidrag av miksing av innspilte spor i løpet av en liveopptreden eller i et studio for å framstilles som ett kontinuerlig spor. @no
definition: Relates a collective agent to an expression that includes a contribution by a collective agent of mixing recorded tracks together during a live performance or in a recording studio to appear as one continuous track. @en
definition: Sasaista grupu ar izteiksmi, kas ietver grupas ieguldījumu, miksējot ierakstītus mūzikas celiņus dzīvās uzstāšanās laikā vai ierakstu studijā, lai radītu vienu nepārtrauktu ierakstu. @lv
definition: Seostab kollektiivi väljendusega, millesse kollektiiv on andnud panuse, miksides salvestatud lugusid kokku üheks jätkuvaks looks, tehes seda elavas esituses või salvestusstuudios. @et
definition: Setzt einen gemeinschaftlichen Akteur in Beziehung zu einer Expression, zu der ein gemeinschaftlicher Akteur beiträgt, indem er während eines Live-Auftritts oder in einem Aufnahme-Studio aufgenommene Einzelspuren (Kanäle) zu einem scheinbar ununterbrochen durchgehenden Klangerlebnis zusammen mischt. @de
definition: يربط وكيلا جماعيا بتعبيرة تتضمن إسهام وكيل جماعي في مزج ألحان مسجلة أثناء أدائها مباشرة أو أثناء تسجيلها في استوديو لتبدو كمسار واحد مستمر. @ar
definition: 将一个集体行为者与包括在现场表演中或在录音工作室中混合已录制音轨使其出现为一个连续的音轨的一个集体行为者的贡献的一种内容表达关联起来。 @zh-hans
scope note: Darunter fallen keine Nachbearbeitungen, die die Art und den Inhalt des Originalwerks substantiell verändert, so dass ein neues Werk entsteht, sowie das Mischen und Zusammenlegen von mehreren Einzelspuren einer Aufnahme. @de
scope note: Ei koske uudelleenmiksauksia, jotka olennaisesti muuttavat alkuperäisen teoksen luonnetta ja sisältöä, mikä johtaa uuteen teokseen, eikä äänitteen useampien raitojen miksaamista ja yhdistelyä.
scope note: Espressione di un'opera che incorpora un contributo nel missaggio di tracce registrate durante un'esibizione dal vivo o in uno studio di registrazione in modo che appaiano come una traccia continua. @it
scope note: Et uttrykk av et verk som innlemmer et bidrag av miksing av innspilte spor i løpet av en liveopptreden eller i et studio for å framstilles som ett kontinuerlig spor. @no
scope note: Neietver miksēšanas darbības, kas būtiski maina oriģināldarba būtību un saturu, radot jaunu darbu, kā arī ieraksta vairāku celiņu miksēšanu un montāžu. @lv
scope note: Nem tartoznak ide azok az új művet eredményező újrakeverési tevékenységek, amelyek jelentősen megváltoztatják az eredeti mű jellegét és tartalmát, sem a felvétel több sávjának keverése és összeállítása. @hu

lavastaja (yhteistoimija) ekspressiossa
has element type: 2
toolkit definition: An expression that includes a contribution by a collective agent of overseeing artists and craftspeople who build sets for moving image productions. @en
toolkit definition: Een expressie die omvat een bijdrage door een collectieve actor door toezicht houden op kunstenaars en ambachtslieden die decors bouwen voor bewegend beeld-producties. @nl
toolkit definition: Egy kifejezési forma, amely magában foglalja egy kollektív ágens közreműködését, amely mozgókép-produkciókhoz díszletépítő művészeket és mesterembereket felügyel. @hu
toolkit definition: Eine Expression, zu der ein gemeinschaftlicher Akteur beiträgt, indem er Künstlerinnen/Künstler und Kunsthandwerkerinnen/Kunsthandwerker betreut, die Sets für Bewegtbildproduktionen aufbauen. @de
toolkit definition: Ekspressio, jonka tekemisessä yhteistoimija on osallisena valvomalla taiteilijoita ja käsityöläisiä, jotka rakentavat lavasteita elokuvatuotantoihin.
toolkit definition: Espressione che comprende un contributo di un agente collettivo nella supervisione di artisti e artigiani che costruiscono scenografie per produzioni di immagini in movimento. @it
toolkit definition: Et uttrykk som inkluderer et bidrag fra en kollektiv agent i form av å lede kunstnerne og håndverkerne som bygger kulissene for spillefilmproduksjoner. @no
toolkit definition: Expression qui intègre une contribution de la part d’un agent collectif consistant à superviser les artistes et les artisans qui construisent les décors pour des productions d’images animées. @fr
toolkit definition: Expressió que inclou una contribució d’un agent col·lectiu supervisant els artistes i els artesans que construeixen els decorats de les produccions d’imatge en moviment. @ca
toolkit definition: Hareketli görüntü prodüksiyonları için setler inşa eden sanatçılar ve zanaatkarlardan oluşan kolektif bir temsilcinin katkısını içeren bir anlatım. @tr
toolkit definition: Izteiksme, kas ietver grupas ieguldījumu, uzraugot māksliniekus un meistarus, kuri darbojas kustīgu attēlu veidošanā. @lv
toolkit definition: Udtryk, som omfatter en kollektiv agents bidrag ved at føre tilsyn med kunstnere og håndværkere, som bygger kulisser til levende billedproduktioner. @da
toolkit definition: Väljendus, millesse kollektiiv on andnud panuse, juhendades kunstnikke ja oskustöölisi, kes valmistavad filmi tootmise jaoks dekoratsioonid ja rekvisiidid. @et
toolkit definition: تعبيرة تتضمن إسهام وكيل جماعي بالإشراف على الفنيين والحرفيين الذين يبنون مواقع لإنتاج الأفلام. @ar
toolkit definition: 包括监督为动态图像制作建造布景的艺术家和艺人的一个集体行为者的贡献的一种内容表达 @zh-hans
toolkit label: Gemeinschaftlicher Akteur als Art Director von @de
toolkit label: agent collectif directeur artistique de @fr
toolkit label: agent col·lectiu director artístic de @ca
toolkit label: art director collective agent of @en
toolkit label: artdirector-collectieve actor van @nl
toolkit label: direttore artistico agente collettivo di @it
toolkit label: filmikunstnik (kollektiiv) väljenduses @et
toolkit label: ir galvenais mākslinieks (grupa) @lv
toolkit label: kollektiv agent, som er artdirector af @da
toolkit label: lavastaja (yhteistoimija) ekspressiossa
toolkit label: művészeti vezető kollektív ágense: @hu
toolkit label: sanat yönetmeni kolektif temsilcisi @tr
toolkit label: scenograf for (kollektiv agent) @no
toolkit label: καλλιτεχνικός διευθυντής συλλογικός φορέας του @el
toolkit label: وكيل جماعي جامع مخرج فني @ar
toolkit label: ……的艺术总监集体行为者 @zh-hans
has subproperty: lavastaja (yhteisö) ekspressiossa
has subproperty: lavastaja (suku) ekspressiossa
has subproperty: P50750
lexical alias: artDirectorCollectiveAgentOf.en
status: Published
type: Property
domain: C10011
label: er kollektiv agent, som er artdirector af @da
label: er scenograf for (kollektiv agent) @no
label: est un agent collectif directeur artistique de @fr
label: filmikunstnik (kollektiiv) väljenduses @et
label: ir galvenais mākslinieks (grupa) @lv
label: is art director collective agent of @en
label: is artdirector-collectieve actor van @nl
label: ist gemeinschaftlicher Akteur als Art Director von @de
label: művészeti vezető kollektív ágense a következőnek: @hu
label: sanat yönetmeni kolektif temsilcisidir @tr
label: è direttore artistico agente collettivo di @it
label: és agent col·lectiu director artístic de @ca
label: είναι καλλιτεχνικός διευθυντής συλλογικός φορέας του @el
label: وكيل جماعي مخرج فني @ar
label: 是……的艺术总监集体行为者 @zh-hans
sub property of: lavastaja (toimija) ekspressiossa
sub property of: esitykseen osallinen yhteistoimija ekspressiossa
definition: Correla un agente collettivo a un'espressione che comprende un contributo di un agente collettivo nella supervisione di artisti e artigiani che costruiscono scenografie per produzioni di immagini in movimento. @it
definition: Hozzákapcsol egy kollektív ágenst egy kifejezési formához, amely magában foglalja egy kollektív ágens közreműködését, amely mozgókép-produkciókhoz díszletépítő művészeket és mesterembereket felügyel. @hu
definition: Kolektif bir temsilciyi, hareketli görüntü prodüksiyonları için setler oluşturan, denetleyen sanatçılardan ve zanaatkarlardan oluşan kolektif bir temsilcinin katkısını içeren bir anlatımla ilişkilendirir. @tr
definition: Liittää yhteistoimijan ekspressioon, jonka tekemisessä yhteistoimija on osallisena valvomalla taiteilijoita ja käsityöläisiä, jotka rakentavat lavasteita elokuvatuotantoihin.
definition: Met un agent collectif en relation avec une expression qui intègre une contribution de la part d’un agent collectif consistant à superviser les artistes et les artisans qui construisent les décors pour des productions d’images animées. @fr
definition: Relaciona un agent col·lectiu amb una expressió que inclou una contribució d’un agent col·lectiu supervisant els artistes i els artesans que construeixen els decorats de les produccions d’imatge en moviment. @ca
definition: Relateert een collectieve actor aan een expressie die omvat een bijdrage door een collectieve actor door toezicht houden op kunstenaars en ambachtslieden die decors bouwen voor bewegend beeld-producties. @nl
definition: Relaterer en kollektiv agent til et udtryk, som omfatter en kollektiv agents bidrag ved at føre tilsyn med kunstnere og håndværkere, som bygger kulisser til levende billedproduktioner. @da
definition: Relaterer en kollektiv agent til et uttrykk som inkluderer et bidrag fra en kollektiv agent i form av å lede kunstnerne og håndverkerne som bygger kulissene for spillefilmproduksjoner. @no
definition: Relates a collective agent to an expression that includes a contribution by a collective agent of overseeing artists and craftspeople who build sets for moving image productions. @en
definition: Sasaista grupu ar izteiksmi, kas ietver grupas ieguldījumu, uzraugot māksliniekus un meistarus, kuri darbojas kustīgu attēlu veidošanā. @lv
definition: Seostab kollektiivi väljendusega, millesse kollektiiv on andnud panuse, juhendades kunstnikke ja oskustöölisi, kes valmistavad filmi tootmise jaoks dekoratsioonid ja rekvisiidid. @et
definition: Setzt einen gemeinschaftlichen Akteur in Beziehung zu einer Expression, zu der ein gemeinschaftlicher Akteur beiträgt, indem er Künstlerinnen/Künstler und Kunsthandwerkerinnen/Kunsthandwerker betreut, die Sets für Bewegtbildproduktionen aufbauen. @de
definition: يربط وكيلا جماعيا بتعبيرة تتضمن إسهام وكيل جماعي بالإشراف على الفنيين والحرفيين الذين يبنون مواقع لإنتاج الأفلام. @ar
definition: 将一个集体行为者与包括监督为动态图像制作建造布景的艺术家和艺人的一个集体行为者的贡献的一种内容表达关联起来。 @zh-hans

panelisti (yhteistoimija) ekspressiossa
has element type: 2
toolkit definition: An expression that includes a contribution by a collective agent of participating in a program, often broadcast, where topics are discussed, usually with participation of experts in fields related to the discussion. @en
toolkit definition: Een expressie die omvat een bijdrage van een collectieve actor door deelname aan een programma, vaak uitgezonden, waar onderwerpen worden bediscussieerd, vaak met deelname van experts op gebieden gerelateerd aan de discussie. @nl
toolkit definition: Egy kifejezési forma, amely magában foglalja egy kollektív ágens közreműködését egy programban, gyakran sugárzott műsorban, való részvételével, amelyen témákat vitatnak meg, rendszerint a beszélgetés témájában jártas szakértők részvételével. @hu
toolkit definition: Eine Expression, zu der ein gemeinschaftlicher Akteur beiträgt, indem er an einer Veranstaltung (meist in einer Sendung) teilnimmt, in der Themen üblicherweise mit Expertinnen/Experten diskutiert werden. @de
toolkit definition: Ekspressio, jonka tekemisessä yhteistoimija on osallisena panelistina (useimmiten lähetetyssä) ohjelmassa, jossa keskustellaan eri aiheista tavallisesti keskusteluun liittyvien aiheiden asiantuntijoiden kanssa.
toolkit definition: Espressione che comprende un contributo di un agente collettivo nella partecipazione in un programma, spesso una trasmissione, in cui si discutono argomenti, solitamente con la partecipazione di esperti in campi relativi alla discussione. @it
toolkit definition: Et uttrykk som inkluderer et bidrag fra en kollektiv agent i form av å delta i et program, gjerne kringkastet, der emner diskuteres, som regel med eksperter innen områder knyttet til diskusjonen, som deltakere. @no
toolkit definition: Expression qui intègre une contribution de la part d’un agent collectif consistant à participer à une activité, souvent diffusée à la radio, à la télévision, etc., où des sujets sont discutés, habituellement avec la participation d’experts dans les domaines reliés à la discussion. @fr
toolkit definition: Expressió que inclou una contribució d’un agent col·lectiu participant en un programa, sovint emès, on es discuteixen temes, habitualment amb la participació d’experts en els camps relacionats amb la discussió. @ca
toolkit definition: Genellikle yayınlanan, konuların tartışıldığı, genellikle tartışmayla ilgili alanlardaki uzmanların katılımıyla bir programa katılan kolektif bir temsilcinin katkısını içeren bir anlatım. @tr
toolkit definition: Izteiksme, kas ietver grupas ieguldījumu, piedaloties programmā (parasti apraidē), kurā tiek apspriestas tēmas ar ekspertu līdzdalību. @lv
toolkit definition: Udtryk, som omfatter en kollektiv agents bidrag ved at deltage i et program, ofte transmitteret, hvor emner diskuteres, normat med deltagelse af fagfolk indenfor felter, som er relateret til diskussionen. @da
toolkit definition: Väljendus, millesse kollektiiv on andnud panuse, osaledes saates (sageli ringhäälingus), kus arutatakse mingeid teemasid ja kus tavaliselt osalevad arutatava teemavaldkonna asjatundjad. @et
toolkit definition: تعبيرة تتضمن إسهام وكيل جماعي بالمشاركة في برنامج، غالبا يجري بثه، ومناقشة موضوعات، بمشاركة عادة خبراء في المجالات المتعلقة بموضوع النقاش. @ar
toolkit definition: 包括有参与节目（经常是广播节目，其中讨论话题，通常有讨论相关领域专家参与）的一个集体行为者的贡献的一种内容表达 @zh-hans
toolkit label: Gemeinschaftlicher Akteur als Diskussionsteilnehmerin/Diskussionsteilnehmer von @de
toolkit label: agent collectif panéliste de @fr
toolkit label: agent col·lectiu panelista de @ca
toolkit label: arutelust osavõtja (kollektiiv) väljenduses @et
toolkit label: ir diskusijas dalībnieks (grupa) @lv
toolkit label: kollektiv agent, som er paneldeltager af @da
toolkit label: panel katılımcısı kolektif temsilcisi @tr
toolkit label: paneldeltaker for (kollektiv agent) @no
toolkit label: panelist collective agent of @en
toolkit label: panelisti (yhteistoimija) ekspressiossa
toolkit label: panellid-collectieve actor van @nl
toolkit label: partecipante al panel agente collettivo di @it
toolkit label: vitafórumtag kollektív ágense: @hu
toolkit label: μέλος λογομήγυρης συλλογικός φορέας του @el
toolkit label: وكيل جماعي مشارك في برنامج @ar
toolkit label: ……的访谈嘉宾集体行为者 @zh-hans
has subproperty: panelisti (yhteisö) ekspressiossa
has subproperty: panelisti (suku) ekspressiossa
has subproperty: P50751
lexical alias: panelistCollectiveAgentOf.en
status: Published
type: Property
domain: C10011
label: arutelust osavõtja (kollektiiv) väljenduses @et
label: er kollektiv agent, som er paneldeltager af @da
label: er paneldeltaker for (kollektiv agent) @no
label: est un agent collectif panéliste de @fr
label: ir diskusijas dalībnieks (grupa) @lv
label: is panelist collective agent of @en
label: is panellid-collectieve actor van @nl
label: ist gemeinschaftlicher Akteur als Diskussionsteilnehmerin/Diskussionsteilnehmer von @de
label: panelist kolektif temsilcisidir @tr
label: vitafórumtag kollektív ágense a következőnek: @hu
label: è partecipante al panel agente collettivo di @it
label: és agent col·lectiu panelista de @ca
label: είναι μέλος λογομήγυρης συλλογικός φορέας του @el
label: هو وكيل جماعي مشارك في مناقشة عامة لـ @ar
label: 是……的访谈嘉宾集体行为者 @zh-hans
sub property of: panelisti (toimija) ekspressiossa
sub property of: esittäjä (yhteistoimija) ekspressiossa
definition: Correla un agente collettivo a un'espressione che comprende un contributo di un agente collettivo nella partecipazione in un programma, spesso una trasmissione, in cui si discutono argomenti, solitamente con la partecipazione di esperti in campi relativi alla discussione. @it
definition: Hozzákapcsol egy kollektív ágenst egy kifejezési formához, amely magában foglalja egy kollektív ágens közreműködését egy programban, gyakran sugárzott műsorban, való részvételével, amelyen témákat vitatnak meg, rendszerint a beszélgetés témájában jártas szakértők részvételével. @hu
definition: Kolektif bir temsilciyi, genellikle yayınlanan konuların tartışıldığı, tartışmayla ilgili alanlardaki uzmanların katılımıyla bir programa katılan kolektif bir temsilcinin katkısını içeren bir anlatım ile ilgilidir. @tr
definition: Liittää yhteistoimijan ekspressioon, jonka tekemisessä yhteistoimija on osallisena panelistina (useimmiten lähetetyssä) ohjelmassa, jossa keskustellaan eri aiheista tavallisesti keskusteluun liittyvien aiheiden asiantuntijoiden kanssa.
definition: Met un agent collectif en relation avec une expression qui intègre une contribution de la part d’un agent collectif consistant à participer à une activité, souvent diffusée à la radio, à la télévision, etc., où des sujets sont discutés, habituellement avec la participation d’experts dans les domaines reliés à la discussion. @fr
definition: Relaciona un agent col·lectiu amb una expressió que inclou una contribució d’un agent col·lectiu participant en un programa, sovint emès, on es discuteixen temes, habitualment amb la participació d’experts en els camps relacionats amb la discussió. @ca
definition: Relateert een collectieve actor aan een expressie die omvat een bijdrage van een collectieve actor door deelname aan een programma, vaak uitgezonden, waar onderwerpen worden bediscussieerd, vaak met deelname van experts op gebieden gerelateerd aan de discussie. @nl
definition: Relaterer en kollektiv agent til et udtryk, som omfatter en kollektiv agents bidrag ved at deltage i et program, ofte transmitteret, hvor emner diskuteres, normat med deltagelse af fagfolk indenfor felter, som er relateret til diskussionen. @da
definition: Relaterer en kollektiv agent til et uttrykk som inkluderer et bidrag fra en kollektiv agent i form av å delta i et program, gjerne kringkastet, der emner diskuteres, som regel med eksperter innen områder knyttet til diskusjonen, som deltakere. @no
definition: Relates a collective agent to an expression that includes a contribution by a collective agent of participating in a program, often broadcast, where topics are discussed, usually with participation of experts in fields related to the discussion. @en
definition: Sasaista grupu ar izteiksmi, kas ietver grupas ieguldījumu, piedaloties programmā (parasti apraidē), kurā tiek apspriestas tēmas ar ekspertu līdzdalību. @lv
definition: Seostab kollektiivi väljendusega, millesse kollektiiv on andnud panuse, osaledes saates (sageli ringhäälingus), kus arutatakse mingeid teemasid ja kus tavaliselt osalevad arutatava teemavaldkonna asjatundjad. @et
definition: Setzt einen gemeinschaftlichen Akteur in Beziehung zu einer Expression, zu der ein gemeinschaftlicher Akteur beiträgt, indem er an einer Veranstaltung (meist in einer Sendung) teilnimmt, in der Themen üblicherweise mit Expertinnen/Experten diskutiert werden. @de
definition: يربط وكيلا جماعيا بتعبيرة تتضمن إسهام وكيل جماعي بالمشاركة في برنامج، غالبا يجري بثه، ومناقشة موضوعات، بمشاركة عادة خبراء في المجالات المتعلقة بموضوع النقاش. @ar
definition: 将一个集体行为者与包括有参与节目（经常是广播节目，其中讨论话题，通常有讨论相关领域专家参与）的一个集体行为者的贡献的一种内容表达关联起来。 @zh-hans

tarinankertoja (yhteistoimija) ekspressiossa
has element type: 2
toolkit definition: An expression that includes a contribution by a collective agent of relaying a story with dramatic or theatrical interpretation. @en
toolkit definition: Dramatik veya teatral bir yorumla bir hikayeyi aktaran kolektif bir temsilcinin katkısını içeren bir anlatım. @tr
toolkit definition: Een expressie die omvat een bijdrage door een collectieve actor die een uitvoerder is door het doorvertellen van een verhaal met dramatische of theatrale vertolking. @nl
toolkit definition: Egy kifejezési forma, amely magában foglalja egy kollektív ágens közreműködését egy történet dramatizált vagy színházi interpretációjában. @hu
toolkit definition: Eine Expression, zu der eine Ausführende/ein Ausführender (gemeinschaftlicher Akteur) beiträgt, indem sie/er eine Geschichte mit dramatischer oder theatralischer Interpretation wiedergibt. @de
toolkit definition: Ekspressio, jonka tekemiseen yhteistoimija osallistuu välittämällä tarinan draamallisella tai teatraalisella tulkinnalla.
toolkit definition: Espressione che comprende un contributo di un agente collettivo di un'esibizione che riporta una storia originale con un'interpretazione drammatica o teatrale. @it
toolkit definition: Et uttrykk som inkluderer et bidrag fra en kollektiv agent i form av å lese forfatterens originalhistorie med innlevelse eller dramatisk tolkning. @no
toolkit definition: Expression qui intègre une contribution de la part d’un agent collectif consistant à raconter une histoire au moyen d’une interprétation dramatique ou théâtrale. @fr
toolkit definition: Expressió que inclou una contribució d’un agent col·lectiu explicant un conte amb una interpretació dramàtica o teatral. @ca
toolkit definition: Izteiksme, kas ietver grupas ieguldījumu, pasniedzot radītāja oriģinālo stāstu ar dramatisku vai teatrālu interpretāciju. @lv
toolkit definition: Udtryk, som omfatter en kollektiv agents bidrag ved at give en historie dramatisk eller teatralsk fortolkning. @da
toolkit definition: Väljendus, millesse kollektiiv on andnud panuse, esitades originaallugu draama- või teatritõlgenduses. @et
toolkit definition: تعبيرة تتضمن إسهام وكيل جماعي بنقل قصة أصلية ووصفها بصورة درامية أو مسرحية. @ar
toolkit definition: 包括有用戏剧化解释转达故事的一个集体行为者的贡献的一种内容表达 @zh-hans
toolkit label: Gemeinschaftlicher Akteur als Geschichtenerzählerin/Geschichtenerzähler von @de
toolkit label: agent collectif conteur de @fr
toolkit label: agent col·lectiu rondallaire de @ca
toolkit label: hikaye anlatıcı kolektif temsilci @tr
toolkit label: historieforteller for (kollektiv agent) @no
toolkit label: ir stāstnieks (grupa) @lv
toolkit label: jutuvestja (kollektiiv) väljenduses @et
toolkit label: kollektiv agent, som er historiefortæller af @da
toolkit label: storyteller agente collettivo di @it
toolkit label: storyteller collective agent of @en
toolkit label: tarinankertoja (yhteistoimija) ekspressiossa
toolkit label: történetmesélő kollektív ágense: @hu
toolkit label: verhalenverteller-collectieve actor van @nl
toolkit label: αφηγητής ιστοριών συλλογικός φορέας του @el
toolkit label: وكيل جماعي رواي قصة @ar
toolkit label: ……的说书人集体行为者 @zh-hans
has subproperty: tarinankertoja (yhteisö) ekspressiossa
has subproperty: tarinankertoja (suku) ekspressiossa
has subproperty: P50752
lexical alias: storytellerCollectiveAgentOf.en
status: Published
type: Property
domain: C10011
label: er historieforteller for (kollektiv agent) @no
label: er kollektiv agent, som er historiefortæller af @da
label: est un agent collectif conteur de @fr
label: hikaye anlatıcısı kolektif temsilcisidir @tr
label: ir stāstnieks (grupa) @lv
label: is storyteller collective agent of @en
label: is verhalenverteller-collectieve actor van @nl
label: ist gemeinschaftlicher Akteur als Geschichtenerzählerin/Geschichtenerzähler von @de
label: jutuvestja (kollektiiv) väljenduses @et
label: történetmesélő kollektív ágense a következőnek: @hu
label: è storyteller agente collettivo di @it
label: és agent col·lectiu rondallaire de @ca
label: είναι αφηγητής ιστοριών συλλογικός φορέας του @el
label: هو وكيل جماعي راوي قصص لـ @ar
label: 是……的说书人集体行为者 @zh-hans
sub property of: tarinankertoja (toimija) ekspressiossa
sub property of: esittäjä (yhteistoimija) ekspressiossa
definition: Correla un agente collettivo a un'espressione che comprende un contributo di un agente collettivo di un'esibizione che riporta una storia originale con un'interpretazione drammatica o teatrale. @it
definition: Hozzákapcsol egy kollektív ágenst egy kifejezési formához, amely magában foglalja egy kollektív ágens közreműködését egy történet dramatizált vagy színházi interpretációjában. @hu
definition: Kolektif bir temsilciyi, bir hikayeyi dramatik veya tiyatral yorumla aktarmaya yönelik kolektif bir temsilcinin katkısını içeren bir anlatım ile ilişkilendirir. @tr
definition: Liittää yhteistoimijan ekspressioon, jonka tekemiseen yhteistoimija osallistuu välittämällä tarinan draamallisella tai teatraalisella tulkinnalla.
definition: Met un agent collectif en relation avec une expression qui intègre une contribution de la part d’un agent collectif consistant à raconter une histoire au moyen d’une interprétation dramatique ou théâtrale. @fr
definition: Relaciona un agent col·lectiu amb una expressió que inclou una contribució d’un agent col·lectiu explicant un conte amb una interpretació dramàtica o teatral. @ca
definition: Relateert een collectieve actor aan een expressie die omvat een bijdrage door een collectieve actor die een uitvoerder is door het doorvertellen van een verhaal met dramatische of theatrale vertolking. @nl
definition: Relaterer en kollektiv agent til et udtryk, som omfatter en kollektiv agents bidrag ved at give en historie dramatisk eller teatralsk fortolkning. @da
definition: Relaterer en kollektiv agent til et uttrykk som inkluderer et bidrag fra en kollektiv agent i form av å lese forfatterens originalhistorie med innlevelse eller dramatisk tolkning. @no
definition: Relates a collective agent to an expression that includes a contribution by a collective agent of relaying a story with dramatic or theatrical interpretation. @en
definition: Sasaista grupu ar izteiksmi, kas ietver grupas ieguldījumu, pasniedzot radītāja oriģinālo stāstu ar dramatisku vai teatrālu interpretāciju. @lv
definition: Seostab kollektiivi väljendusega, millesse kollektiiv on andnud panuse, esitades originaallugu draama- või teatritõlgenduses. @et
definition: Setzt einen gemeinschaftlichen Akteur in Beziehung zu einer Expression, zu der eine Ausführende/ein Ausführender (gemeinschaftlicher Akteur) beiträgt, indem sie/er eine Geschichte mit dramatischer oder theatralischer Interpretation wiedergibt. @de
definition: يربط وكيلا جماعيا بتعبيرة تتضمن إسهام وكيل جماعي بنقل قصة أصلية ووصفها بصورة درامية أو مسرحية. @ar
definition: 将一个集体行为者与包括有用戏剧化解释转达故事的一个集体行为者的贡献的一种内容表达关联起来。 @zh-hans

laulaja (yhteistoimija) ekspressiossa
has element type: 2
toolkit definition: An expression that includes a contribution by a collective agent who uses their voice, with or without instrumental accompaniment, to produce music. @en
toolkit definition: Een expressie die omvat een bijdrage door een collectieve actor die een uitvoerder is van stem, met of zonder instrumentale begeleiding, om muziek te produceren. @nl
toolkit definition: Egy kifejezési forma, amely magában foglalja egy kollektív ágens közreműködését zenei produktum hanggal történő előadásában hangszeres kísérettel vagy anélkül. @hu
toolkit definition: Eine Expression, zu der eine Ausführende/ein Ausführender (gemeinschaftlicher Akteur) beiträgt, indem sie/er durch ihre/seine Singstimme, mit oder ohne instrumentale Begleitung, Musik erzeugt. @de
toolkit definition: Ekspressio, jonka tekemisessä yhteistoimija, joka esiintyy lauluäänellä (soitinsäestyksellä tai ilman), on osallisena tuottaakseen musiikkia.
toolkit definition: Espressione che comprende un contributo di un agente collettivo in un'esecuzione vocale, corredata o meno da accompagnamento strumentale, per produrre musica. @it
toolkit definition: Et uttrykk som inkluderer et bidrag fra en kollektiv agent i form av å stemmen sin, med eller uten akkompagnement fra instrumenter, til å lage musikk. @no
toolkit definition: Expression qui intègre une contribution de la part d’un agent collectif qui utilise sa voix, avec ou sans accompagnement instrumental, pour produire de la musique. @fr
toolkit definition: Expressió que inclou una contribució d’un agent col·lectiu que usa la seva veu, amb acompanyament instrumental o sense, per produir música. @ca
toolkit definition: Izteiksme, kas ietver grupas ieguldījumu, izmantojot balsi, ar vai bez instrumentāla pavadījuma, lai radītu mūziku. @lv
toolkit definition: Müzik üretmek için enstrüman eşliğinde veya enstrümansız olarak sesini kullanan kolektif bir temsilcinin katkısını içeren bir anlatım. @tr
toolkit definition: Udtryk, som omfatter en kollektiv agents bidrag ved at bruge sin stemme, med eller uden instrumentalledsagelse, til at skabe musik. @da
toolkit definition: Väljendus, millesse kollektiiv on andnud panuse, kasutades muusika tegemiseks oma häält, kas instrumentaalsaatega või ilma. @et
toolkit definition: تعبيرة تتضمن إسهام وكيل جماعي بأداء صوتي، بمصاحبة أو دون مصاحبة آلة موسيقية، لإنتاج أغنية. @ar
toolkit definition: 包括有用其人声（不管是否有乐器伴奏）产生音乐的一个集体行为者的贡献的一种内容表达 @zh-hans
toolkit label: Gemeinschaftlicher Akteur als Sängerin/Sänger von @de
toolkit label: agent collectif chanteur de @fr
toolkit label: agent col·lectiu cantant de @ca
toolkit label: cantante agente collettivo di @it
toolkit label: ir dziedātājs (grupa) @lv
toolkit label: kollektiv agent, som er sanger af @da
toolkit label: laulaja (yhteistoimija) ekspressiossa
toolkit label: laulja (kollektiiv) väljenduses @et
toolkit label: sanger for (kollektiv agent) @no
toolkit label: singer collective agent of @en
toolkit label: zanger-collectieve actor van @nl
toolkit label: énekes kollektív ágense: @hu
toolkit label: şarkıcı kolektif temsilci @tr
toolkit label: τραγουδιστής συλλογικός φορέας του @el
toolkit label: وكيل جماعي مغنّ @ar
toolkit label: ……的演唱者集体行为者 @zh-hans
has subproperty: laulaja (yhteisö) ekspressiossa
has subproperty: laulaja (suku) ekspressiossa
has subproperty: P50753
lexical alias: singerCollectiveAgentOf.en
status: Published
type: Property
domain: C10011
label: er kollektiv agent, som er sanger af @da
label: er sanger for (kollektiv agent) @no
label: est un agent collectif chanteur de @fr
label: ir dziedātājs (grupa) @lv
label: is singer collective agent of @en
label: is zanger-collectieve actor van @nl
label: ist gemeinschaftlicher Akteur als Sängerin/Sänger von @de
label: laulja (kollektiiv) väljenduses @et
label: è cantante agente collettivo di @it
label: énekes kollektív ágense a következőnek: @hu
label: és agent col·lectiu cantant de @ca
label: şarkıcı kolektif temsilcisidir @tr
label: είναι τραγουδιστής συλλογικός φορέας του @el
label: هو وكيل جماعي مغنّ لـ @ar
label: 是……的演唱者集体行为者 @zh-hans
sub property of: laulaja (toimija) ekspressiossa
sub property of: esittäjä (yhteistoimija) ekspressiossa
definition: Correla un agente collettivo a un'espressione che comprende un contributo di un agente collettivo in un'esecuzione vocale, corredata o meno da accompagnamento strumentale, per produrre musica. @it
definition: Hozzákapcsol egy kollektív ágenst egy kifejezési formához, amely magában foglalja egy kollektív ágens közreműködését zenei produktum hanggal történő előadásában hangszeres kísérettel vagy anélkül. @hu
definition: Kolektif bir temsilciyi, müzik üretmek için enstrümantal eşlikli ya da eşliksiz olarak sesleri müzik üretmek için kullanan kolektif bir temsilcinin katkısını içeren bir anlatım ile ilişkilendirir. @tr
definition: Liittää yhteistoimijan ekspressioon, jonka tekemisessä yhteistoimija, joka esiintyy lauluäänellä (soitinsäestyksellä tai ilman), on osallisena tuottaakseen musiikkia.
definition: Met un agent collectif en relation avec une expression qui intègre une contribution de la part d’un agent collectif qui utilise sa voix, avec ou sans accompagnement instrumental, pour produire de la musique. @fr
definition: Relaciona un agent col·lectiu amb una expressió que inclou una contribució d’un agent col·lectiu que usa la seva veu, amb acompanyament instrumental o sense, per produir música. @ca
definition: Relateert een collectieve actor aan een expressie die omvat een bijdrage door een collectieve actor die een uitvoerder is van stem, met of zonder instrumentale begeleiding, om muziek te produceren. @nl
definition: Relaterer en kollektiv agent til et udtryk, som omfatter en kollektiv agents bidrag ved at bruge sin stemme, med eller uden instrumentalledsagelse, til at skabe musik. @da
definition: Relaterer en kollektiv agent til et uttrykk som inkluderer et bidrag fra en kollektiv agent i form av å stemmen sin, med eller uten akkompagnement fra instrumenter, til å lage musikk. @no
definition: Relates a collective agent to an expression that includes a contribution by a collective agent who uses their voice, with or without instrumental accompaniment, to produce music. @en
definition: Sasaista grupu ar izteiksmi, kas ietver grupas ieguldījumu, izmantojot balsi, ar vai bez instrumentāla pavadījuma, lai radītu mūziku. @lv
definition: Seostab kollektiivi väljendusega, millesse kollektiiv on andnud panuse, kasutades muusika tegemiseks oma häält, kas instrumentaalsaatega või ilma. @et
definition: Setzt einen gemeinschaftlichen Akteur in Beziehung zu einer Expression, zu der eine Ausführende/ein Ausführender (gemeinschaftlicher Akteur) beiträgt, indem sie/er durch ihre/seine Singstimme, mit oder ohne instrumentale Begleitung, Musik erzeugt. @de
definition: يربط وكيلا جماعيا بتعبيرة تتضمن إسهام وكيل جماعي بأداء صوتي، بمصاحبة أو دون مصاحبة آلة موسيقية لإنتاج أغنية. @ar
definition: 将一个集体行为者与包括有用其人声（不管是否有乐器伴奏）产生音乐的一个集体行为者的贡献的一种内容表达关联起来。 @zh-hans
scope note: A performance of a singer may or may not include actual words. @en
scope note: Bir şarkıcının performansı gerçek sözleri içerebilir veya içermebilir. @tr
scope note: Die Darbietung einer Sängerin/eines Sängers kann richtige Worte enthalten oder nicht. @de
scope note: Dziedātāja sniegumā var būt vai nebūt teksts. @lv
scope note: Een uitvoering door een zanger kan wel of niet echte woorden omvatten. @nl
scope note: Egy énekes előadása tartalmazhat vagy nem tartalmazhat tényleges szavakat. @hu
scope note: En sangers optræden kan omfatte egentlige ord, men gør det ikke nødvendigvis. @da
scope note: Laulajan esitys voi sisältää tai olla sisältämättä todellisia sanoja.

esittäjä (yhteistoimija) ekspressiossa
has element type: 2
toolkit definition: An expression that includes a contribution by a collective agent of performing music, acting, dancing, speaking, etc. @en
toolkit definition: Een expressie die omvat een bijdrage door een collectieve actor door uitvoering van muziek, acteren, dansen, spreken etc. @nl
toolkit definition: Egy kifejezési forma, amely magában foglalja egy kollektív ágens közreműködését zene, színjátszás, tánc, élőbeszéd, stb. előadásában. @hu
toolkit definition: Eine Expression, zu der ein gemeinschaftlicher Akteur beiträgt, indem er Musik aufführt, schauspielt, tanzt oder spricht und so weiter. @de
toolkit definition: Ekspressio, jonka tekemisessä yhteistoimija on osallisena esittämällä musiikkia, näyttelemällä, tanssimalla, puhumalla tms.
toolkit definition: Espressione che comprende un contributo di un agente collettivo nell'esecuzione di musica, recitazione, danza, parlato, etc. @it
toolkit definition: Et uttrykk som inkluderer et bidrag fra en kollektiv agent i form av framføring av musikk, skuespill, dans, tale etc. @no
toolkit definition: Expression qui intègre une contribution de la part d’un agent collectif consistant à exécuter de la musique, à jouer, à danser, à parler, etc. @fr
toolkit definition: Expressió que inclou una contribució d’un agent col·lectiu executant la música, actuant, dansant, parlant, etc. @ca
toolkit definition: Izteiksme, kas ietver grupas ieguldījumu, izpildot mūziku, tēlojumu, deju, runu u.tml. @lv
toolkit definition: Müzik icra etme, oyunculuk, dans etme, konuşma vb. kolektif bir temsilcinin katkısını içeren bir anlatım. @tr
toolkit definition: Udtryk, som omfatter en kollektiv agents bidrag ved at opføre musik, spille skuespil, danse, tale etc. @da
toolkit definition: Väljendus, millesse kollektiiv on andnud panuse, esitades muusikat, näideldes, tantsides, kõneldes vms. @et
toolkit definition: تعبيرة تتضمن إسهام وكيل جماعي في أداء موسيقى، تمثيل، رقص، حوار، إلخ. @ar
toolkit definition: 包括演奏音乐、扮演、舞蹈、说话等的一个集体行为者的贡献的一种内容表达 @zh-hans
toolkit label: Gemeinschaftlicher Akteur als Ausführende/Ausführender von @de
toolkit label: agent collectif interprète de @fr
toolkit label: agent col·lectiu intèrpret de @ca
toolkit label: előadó kollektív ágense: @hu
toolkit label: esitaja (kollektiiv) väljenduses @et
toolkit label: esittäjä (yhteistoimija) ekspressiossa
toolkit label: interprete agente collettivo di @it
toolkit label: ir izpildītājs (grupa) @lv
toolkit label: kollektiv agent, som er udøver af @da
toolkit label: performer collective agent of @en
toolkit label: sanatçı kolektif temsilcisi @tr
toolkit label: uitvoerder-collectieve actor van @nl
toolkit label: utøver for (kollektiv agent) @no
toolkit label: εκτελεστής συλλογικός φορέας του @el
toolkit label: وكيل جماعي مؤد @ar
toolkit label: ……的表演者集体行为者 @zh-hans
has subproperty: näyttelijä (yhteistoimija) ekspressiossa
has subproperty: esittelijä (yhteistoimija) ekspressiossa
has subproperty: tanssija (yhteistoimija) ekspressiossa
has subproperty: juontaja (yhteistoimija) ekspressiossa
has subproperty: moderoija (yhteistoimija) ekspressiossa
has subproperty: johtaja (yhteistoimija) ekspressiossa
has subproperty: nukettaja (yhteistoimija) ekspressiossa
has subproperty: panelisti (yhteistoimija) ekspressiossa
has subproperty: tarinankertoja (yhteistoimija) ekspressiossa
has subproperty: laulaja (yhteistoimija) ekspressiossa
has subproperty: soittaja (yhteistoimija) ekspressiossa
has subproperty: kommentaattori (yhteistoimija) ekspressiossa
has subproperty: kertoja (yhteistoimija) ekspressiossa
has subproperty: puhuja (yhteistoimija) ekspressiossa
has subproperty: opettaja (yhteistoimija) ekspressiossa
has subproperty: esittäjä (yhteisö) ekspressiossa
has subproperty: esittäjä (suku) ekspressiossa
has subproperty: P50754
lexical alias: performerCollectiveAgentOf.en
status: Published
type: Property
domain: C10011
label: előadó kollektív ágense a következőnek: @hu
label: er kollektiv agent, som er udøver af @da
label: er utøver for (kollektiv agent) @no
label: esitaja (kollektiiv) väljenduses @et
label: est un agent collectif interprète de @fr
label: ir izpildītājs (grupa) @lv
label: is performer collective agent of @en
label: is uitvoerder-collectieve actor van @nl
label: ist gemeinschaftlicher Akteur als Ausführende/Ausführender von @de
label: sanatçı kolektif temsilcisidir @tr
label: è interprete agente collettivo di @it
label: és agent col·lectiu intèrpret de @ca
label: είναι εκτελεστής συλλογικός φορέας του @el
label: هو وكيل جماعي مؤدي لـ @ar
label: 是……的表演者集体行为者 @zh-hans
sub property of: esittäjä (toimija) ekspressiossa
sub property of: esitykseen osallinen yhteistoimija ekspressiossa
definition: Correla un agente collettivo a un'espressione che comprende un contributo di un agente collettivo nell'esecuzione di musica, recitazione, danza, parlato, etc. @it
definition: Hozzákapcsol egy kollektív ágenst egy kifejezési formához, amely magában foglalja egy kollektív ágens közreműködését zene, színjátszás, tánc, élőbeszéd, stb. előadásában. @hu
definition: Kolektif bir temsilciyi, müzik yapma, oyunculuk, dans etme, konuşma vb. kolektif bir temsilcinin katkısını içeren bir anlatım ile ilişkilendirir. @tr
definition: Liittää yhteistoimijan ekspressioon, jonka tekemisessä yhteistoimija on osallisena esittämällä musiikkia, näyttelemällä, tanssimalla, puhumalla tms.
definition: Met un agent collectif en relation avec une expression qui intègre une contribution de la part d’un agent collectif consistant à exécuter de la musique, à jouer, à danser, à parler, etc. @fr
definition: Relaciona un agent col·lectiu amb una expressió que inclou una contribució d’un agent col·lectiu executant la música, actuant, dansant, parlant, etc. @ca
definition: Relateert een collectieve actor aan een expressie die omvat een bijdrage door een collectieve actor door uitvoering van muziek, acteren, dansen, spreken etc. @nl
definition: Relaterer en kollektiv agent til et udtryk, som omfatter en kollektiv agents bidrag ved at opføre musik, spille skuespil, danse, tale etc. @da

soittaja (yhteistoimija) ekspressiossa
has element type: 2
toolkit definition: An expression that includes a contribution by a collective agent of playing a musical instrument. @en
toolkit definition: Bir müzik aleti çalmak için kolektif bir temsilcinin katkısını içeren bir anlatım. @tr
toolkit definition: Een expressie die omvat een bijdrage door een collectieve actor van het spelen van een muziekinstrument. @nl
toolkit definition: Egy kifejezési forma, amely magában foglalja egy hangszeren játszó kollektív ágens közreműködését. @hu
toolkit definition: Eine Expression, zu der ein gemeinschaftlicher Akteur beiträgt, indem er ein Musikinstrument spielt. @de
toolkit definition: Ekspressio, jonka tekemisessä yhteistoimija on osallisena soittamalla soitinta.
toolkit definition: Espressione che comprende un contributo di un agente collettivo nel suonare uno strumento musicale. @it
toolkit definition: Et uttrykk som inkluderer et bidrag fra en kollektiv agent i form av å spille et musikkinstrument. @no
toolkit definition: Expression qui intègre une contribution de la part d’un agent collectif consistant à jouer d’un instrument de musique. @fr
toolkit definition: Expressió que inclou una contribució d’un agent col·lectiu tocant un instrument musical. @ca
toolkit definition: Izteiksme, kas ietver grupas ieguldījumu, spēlējot mūzikas instrumentu. @lv
toolkit definition: Udtryk, som omfatter en kollektiv agents bidrag ved at spille et musikinstrument. @da
toolkit definition: Väljendus, millesse kollektiiv on andnud panuse, mängides muusikainstrumenti. @et
toolkit definition: تعبيرة تتضمن إسهام وكيل جماعي في العزف على آلة موسيقية. @ar
toolkit definition: 包括有演奏乐器的一个集体行为者的贡献的一种内容表达 @zh-hans
toolkit label: Gemeinschaftlicher Akteur als Instrumentalmusikerin/Instrumentalmusiker von @de
toolkit label: agent collectif instrumentiste de @fr
toolkit label: agent col·lectiu instrumentista de @ca
toolkit label: enstrümantalist kolektif temsilcisidir @tr
toolkit label: instrumentalist (kollektiiv) väljenduses @et
toolkit label: instrumentalist collective agent of @en
toolkit label: instrumentalist for (kollektiv agent) @no
toolkit label: instrumentalist-collectieve actor van @nl
toolkit label: ir instrumentālists (grupa) @lv
toolkit label: kollektiv agent, som er instrumentalist af @da
toolkit label: soittaja (yhteistoimija) ekspressiossa
toolkit label: strumentista agente collettivo di @it
toolkit label: zenész kollektív ágense: @hu
toolkit label: εκτελεστής [μουσικού οργάνου] συλλογικός φορέας του @el
toolkit label: وكيل جماعي عازف @ar
toolkit label: ……的乐器演奏者集体行为者 @zh-hans
has subproperty: soittaja (yhteisö) ekspressiossa
has subproperty: soittaja (suku) ekspressiossa
has subproperty: P50755
lexical alias: instrumentalistCollectiveAgentOf.en
status: Published
type: Property
domain: C10011
label: enstrümantalist kolektif temsilcisidir @tr
label: er instrumentalist for (kollektiv agent) @no
label: er kollektiv agent, som er instrumentalist af @da
label: est un agent collectif instrumentiste de @fr
label: instrumentalist (kollektiiv) väljenduses @et
label: ir instrumentālists (grupa) @lv
label: is instrumentalist collective agent of @en
label: is instrumentalist-collectieve actor van @nl
label: ist gemeinschaftlicher Akteur als Instrumentalmusikerin/Instrumentalmusiker von @de
label: zenész kollektív ágense a következőnek: @hu
label: è strumentista agente collettivo di @it
label: és agent col·lectiu instrumentista de @ca
label: είναι εκτελεστής [μουσικού οργάνου] συλλογικός φορέας του @el
label: هو وكيل جماعي عازف لـ @ar
label: 是……的乐器演奏者集体行为者 @zh-hans
sub property of: soittaja (toimija) ekspressiossa
sub property of: esittäjä (yhteistoimija) ekspressiossa
definition: Correla un agente collettivo a un'espressione che comprende un contributo di un agente collettivo nel suonare uno strumento musicale. @it
definition: Hozzákapcsol egy kollektív ágenst egy kifejezési formához, amely magában foglalja egy hangszeren játszó kollektív ágens közreműködését. @hu
definition: Kolektif bir temsilciyi, bir müzik aleti çalmak için kolektif bir temsilcinin katkısını içeren bir anlatım ile ilişkilendirir. @tr
definition: Liittää yhteistoimijan ekspressioon, jonka tekemisessä yhteistoimija on osallisena soittamalla soitinta.
definition: Met un agent collectif en relation avec une expression qui intègre une contribution de la part d’un agent collectif consistant à jouer d’un instrument de musique. @fr
definition: Relaciona un agent col·lectiu amb una expressió que inclou una contribució d’un agent col·lectiu tocant un instrument musical. @ca
definition: Relateert een collectieve actor aan een expressie die omvat een bijdrage door een collectieve actor van het spelen van een muziekinstrument. @nl
definition: Relaterer en kollektiv agent til et udtryk, som omfatter en kollektiv agents bidrag ved at spille et musikinstrument. @da
definition: Relaterer en kollektiv agent til et uttrykk som inkluderer et bidrag fra en kollektiv agent i form av å spille et musikkinstrument. @no
definition: Relates a collective agent to an expression that includes a contribution by a collective agent of playing a musical instrument. @en
definition: Sasaista grupu ar izteiksmi, kas ietver grupas ieguldījumu, spēlējot mūzikas instrumentu. @lv
definition: Seostab kollektiivi väljendusega, millesse kollektiiv on andnud panuse, mängides muusikainstrumenti. @et
definition: Setzt einen gemeinschaftlichen Akteur in Beziehung zu einer Expression, zu der ein gemeinschaftlicher Akteur beiträgt, indem er ein Musikinstrument spielt. @de
definition: يربط وكيلا جماعيا بتعبيرة تتضمن إسهام وكيل جماعي في العزف على آلة موسيقية. @ar
definition: 将一个集体行为者与包括有演奏乐器的一个集体行为者的贡献的一种内容表达关联起来。 @zh-hans

tuomioistuimen kirjuri (yhteistoimija) ekspressiossa
has element type: 2
toolkit definition: An expression that includes a contribution by a collective agent of preparing an opinion of a court for publication. @en
toolkit definition: Bir mahkemenin yayınlanmak üzere görüşünü hazırlayan kolektif bir temsilcinin katkısını içeren bir anlatım. @tr
toolkit definition: Een expressie die omvat een bijdrage door een collectieve actor door voorbereiden van een oordeel van een rechtbank voor publicatie. @nl
toolkit definition: Egy kifejezési forma, amely magában foglalja egy kollektív ágens közreműködését egy bíróság ítéleteinek közlésre való előkészítésében. @hu
toolkit definition: Eine Expression, zu der ein gemeinschaftlicher Akteur beiträgt, indem er die Urteilsbegründung zur Veröffentlichung vorbereitet. @de
toolkit definition: Ekspressio, jonka tekemisessä yhteistoimija on osallisena valmistelemalla tuomioistuimen lausunnon julkaistavaksi.
toolkit definition: Espressione che comprende un contributo di un agente collettivo nella preparazione di un giudizio di un tribunale per la pubblicazione. @it
toolkit definition: Et uttrykk som inkluderer et bidrag fra en kollektiv agent i form av å klargjøre en domstols kjennelser for utgivelse. @no
toolkit definition: Expression qui intègre une contribution de la part d’un agent collectif consistant à préparer une opinion d’un tribunal aux fins de publication. @fr
toolkit definition: Expressió que inclou una contribució d’un agent col·lectiu preparant una opinió d’un tribunal per a la seva publicació. @ca
toolkit definition: Izteiksme, kas ietver grupas ieguldījumu, sagatavojot tiesas atzinumu publicēšanai. @lv
toolkit definition: Udtryk, som omfatter en kollektiv agents bidrag ved at klargøre en domstols afgørelser til publicering. @da
toolkit definition: Väljendus, millesse kollektiiv on andnud panuse, valmistades avaldamiseks ette kohtu seisukohad. @et
toolkit definition: تعبيرة تتضمن إسهام وكيل جماعي في إعداد رأي محكمة للنشر. @ar
toolkit definition: 包括准备用于公布的法院意见的一个集体行为者的贡献的一种内容表达 @zh-hans
toolkit label: Gemeinschaftlicher Akteur als Gerichtsstenografin/Gerichtsstenograf von @de
toolkit label: agent collectif rapporteur judiciaire de @fr
toolkit label: agent col·lectiu relator d’un tribunal de @ca
toolkit label: bírósági jegyzőkönyvvezető kollektív ágense: @hu
toolkit label: court reporter collective agent of @en
toolkit label: ir tiesas sekretārs (grupa) @lv
toolkit label: kohtureporter (kollektiiv) väljenduses @et
toolkit label: kollektiv agent, som er retsstenograf af @da
toolkit label: protokollfører for (kollektiv agent) @no
toolkit label: rechtbankverslaggever-collectieve actor van @nl
toolkit label: stenografo del tribunale agente collettivo di @it
toolkit label: tuomioistuimen kirjuri (yhteistoimija) ekspressiossa
toolkit label: yazman kolektif temsilcisi @tr
toolkit label: στενογράφος συλλογικός φορέας του @el
toolkit label: وكيل جماعي كاتب محكمة @ar
toolkit label: ……的法院书记官集体行为者 @zh-hans
has subproperty: tuomioistuimen kirjuri (yhteisö) ekspressiossa
has subproperty: tuomioistuimen kirjuri (suku) ekspressiossa
has subproperty: P50756
lexical alias: courtReporterCollectiveAgentOf.en
status: Published
type: Property
domain: C10011
label: bírósági jegyzőkönyvvezető kollektív ágense a következőnek: @hu
label: er kollektiv agent, som er retsstenograf af @da
label: er protokollfører for (kollektiv agent) @no
label: est un agent collectif rapporteur judiciaire de @fr
label: ir tiesas sekretārs (grupa) @lv
label: is court reporter collective agent of @en
label: is rechtbankverslaggever-collectieve actor van @nl
label: ist gemeinschaftlicher Akteur als Gerichtsstenografin/Gerichtsstenograf von @de
label: kohtureporter (kollektiiv) väljenduses @et
label: yazman temsilcisidir @tr
label: è stenografo del tribunale agente collettivo di @it
label: és agent col·lectiu relator d’un tribunal de @ca
label: είναι στενογράφος συλλογικός φορέας του @el
label: هو وكيل جماعي كاتب محكمة لـ @ar
label: 是……的法院书记官集体行为者 @zh-hans
sub property of: tuomioistuimen kirjuri (toimija) ekspressiossa
sub property of: yhdistymään osallinen yhteistoimija ekspressiossa
definition: Correla un agente collettivo a un'espressione che comprende un contributo di un agente collettivo nella preparazione di un giudizio di un tribunale per la pubblicazione. @it
definition: Hozzákapcsol egy kollektív ágenst egy kifejezési formához, amely magában foglalja egy kollektív ágens közreműködését egy bíróság ítéleteinek közlésre való előkészítésében. @hu
definition: Kolektif bir temsilciyi, bir mahkemenin yayınlanmak üzere görüşünü hazırlayan bir kolektif temsilcinin katkısını içeren bir anlatım ile ilişkilendirir. @tr
definition: Liittää yhteistoimijan ekspressioon, jonka tekemisessä yhteistoimija on osallisena valmistelemalla tuomioistuimen lausunnon julkaistavaksi.
definition: Met un agent collectif en relation avec une expression qui intègre une contribution de la part d’un agent collectif consistant à préparer une opinion d’un tribunal aux fins de publication. @fr
definition: Relaciona un agent col·lectiu amb una expressió que inclou una contribució d’un agent col·lectiu preparant una opinió d’un tribunal per a la seva publicació. @ca
definition: Relateert een collectieve actor aan een expressie die omvat een bijdrage door een collectieve actor door voorbereiden van een oordeel van een rechtbank voor publicatie. @nl
definition: Relaterer en kollektiv agent til et udtryk, som omfatter en kollektiv agents bidrag ved at klargøre en domstols afgørelser til publicering. @da
definition: Relaterer en kollektiv agent til et uttrykk som inkluderer et bidrag fra en kollektiv agent i form av å klargjøre en domstols kjennelser for utgivelse. @no
definition: Relates a collective agent to an expression that includes a contribution by a collective agent of preparing the opinions of a court for publication. @en
definition: Sasaista grupu ar izteiksmi, kas ietver grupas ieguldījumu, sagatavojot tiesas atzinumu publicēšanai. @lv
definition: Seostab kollektiivi väljendusega, millesse kollektiiv on andnud panuse, valmistades avaldamiseks ette kohtu seisukohad. @et
definition: Setzt einen gemeinschaftlichen Akteur in Beziehung zu einer Expression, zu der ein gemeinschaftlicher Akteur beiträgt, indem er die Urteilsbegründung zur Veröffentlichung vorbereitet. @de
definition: يربط وكيلا جماعيا بتعبيرة تتضمن إسهام وكيل جماعي في إعداد رأي محكمة للنشر. @ar
definition: 将一个集体行为者与包括准备用于公布的法院意见的一个集体行为者的贡献的一种内容表达关联起来。 @zh-hans

kommentaattori (yhteistoimija) ekspressiossa
has element type: 2
toolkit definition: An expression that includes a contribution by a collective agent of providing interpretation, analysis, or a discussion of the subject matter on a recording, film, or other audiovisual medium. @en
toolkit definition: Bir kayıtta, filmde veya diğer görsel-işitsel ortamda konuya ilişkin yorum, analiz veya tartışma sağlayan kolektif bir temsilcinin katkısını içeren bir anlatım. @tr
toolkit definition: Een expressie die omvat een bijdrage door een collectieve actor door het verlenen van uitleg, analyse of een discussie over het onderwerp op een opname, film of ander audiovisueel medium. @nl
toolkit definition: Egy kifejezési forma, amely magában foglalja egy kollektív ágens közreműködését tolmácsolásban, elemzésben vagy a téma megvitatásában egy felvételen, filmen vagy más audiovizuális médiumon. @hu
toolkit definition: Eine Expression, zu der ein gemeinschaftlicher Akteur beiträgt, indem er in einer Aufnahme, in einem Film oder in einem anderen audiovisuellen Medium eine Interpretation, eine Analyse oder eine Diskussion des Themas präsentiert. @de
toolkit definition: Ekspressio, jonka tekemisessä yhteistoimija on osallisena tulkitsemalla tai analysoimalla äänitteen, elokuvan tai muun audiovisuaalisen aineiston aihetta tai keskustelemalla siitä.
toolkit definition: Espressione che comprende un contributo di un agente collettivo nel fornire interpretazione, analisi o discussione dell'argomento di una registrazione, film o altro mezzo audiovisivo. @it
toolkit definition: Et uttrykk som inkluderer et bidrag fra en kollektiv agent i form av å tilføre tolkning, analyse eller drøfting av temaet for et opptak, en film eller et annet audiovisuelt medium. @no
toolkit definition: Expression qui intègre une contribution de la part d’un agent collectif consistant à fournir une interprétation, une analyse ou une explication du sujet sur un enregistrement, un film ou un autre support audiovisuel. @fr
toolkit definition: Expressió que inclou una contribució d’un agent col·lectiu proporcionant l’opinió, l’anàlisi o una explicació del tema d’un enregistrament, una pel·lícula o de qualsevol altre suport audiovisual. @ca
toolkit definition: Izteiksme, kas ietver grupas ieguldījumu, sniedzot interpretāciju, analīzi vai diskusiju par tēmu ierakstā, filmā vai citā audiovizuālā vidē. @lv
toolkit definition: Udtryk, som omfatter en kollektiv agents bidrag ved at stå for fortolkning, analyse eller diskussion af det emne, som behandles i en optagelse, film eller andet audiovisuelt medium. @da
toolkit definition: Väljendus, millesse kollektiiv on andnud panuse, tõlgendades või analüüsides salvestuse, filmi või muu audiovisuaalse meediumi ainestikku või arutledes selle üle. @et
toolkit definition: تعبيرة تتضمن إسهام وكيل جماعي في تقديم تفسير للموضوع، أو تحليله، أو مناقشته في تسجيل أو في فيلم، أو أي وسيط سمعي بصري آخر. @ar
toolkit definition: 包括有提供关于录像、电影或其他视听媒介中的主要内容之解释、分析或讨论的一个集体行为者的贡献的一种内容表达 @zh-hans
toolkit label: Gemeinschaftlicher Akteur als Kommentatorin/Kommentator von @de
toolkit label: agent collectif commentateur de @fr
toolkit label: agent col·lectiu comentarista de @ca
toolkit label: commentator collective agent of @en
toolkit label: commentator-collectieve actor van @nl
toolkit label: commentatore agente collettivo di @it
toolkit label: ir komentators (grupa) @lv
toolkit label: kollektiv agent, som er kommentator af @da
toolkit label: kommentaator (kollektiiv) väljenduses @et
toolkit label: kommentaattori (yhteistoimija) ekspressiossa
toolkit label: kommentator for (kollektiv agent) @no
toolkit label: kommentátor kollektív ágense: @hu
toolkit label: yorumcu kolektif temsilcisi @tr
toolkit label: σχολιαστής συλλογικός φορέας του @el
toolkit label: وكيل جماعي معلق @ar
toolkit label: ……的解说员集体行为者 @zh-hans
has subproperty: kommentaattori (yhteisö) ekspressiossa
has subproperty: kommentaattori (suku) ekspressiossa
has subproperty: P50757
lexical alias: commentatorCollectiveAgentOf.en
status: Published
type: Property
domain: C10011
label: er kollektiv agent, som er kommentator af @da
label: er kommentator for (kollektiv agent) @no
label: est un agent collectif commentateur de @fr
label: ir komentators (grupa) @lv
label: is commentator collective agent of @en
label: is commentator-collectieve actor van @nl
label: ist gemeinschaftlicher Akteur als Kommentatorin/Kommentator von @de
label: kommentaator (kollektiiv) väljenduses @et
label: kommentátor kollektív ágense a következőnek: @hu
label: yorumcu kolektif temsilcisidir @tr
label: è commentatore agente collettivo di @it
label: és agent col·lectiu comentarista de @ca
label: είναι σχολιαστής συλλογικός φορέας του @el
label: هو وكيل جماعي معلق لـ @ar
label: 是……的解说员集体行为者 @zh-hans
sub property of: kommentaattori (toimija) ekspressiossa
sub property of: esittäjä (yhteistoimija) ekspressiossa
definition: Correla un agente collettivo a un'espressione che comprende un contributo di un agente collettivo nel fornire interpretazione, analisi o discussione dell'argomento di una registrazione, film o altro mezzo audiovisivo. @it
definition: Hozzákapcsol egy kollektív ágenst egy kifejezési formához, amely magában foglalja egy kollektív ágens közreműködését tolmácsolásban, elemzésben vagy a téma megvitatásában egy felvételen, filmen vagy más audiovizuális médiumon. @hu
definition: Kolektif bir temsilciyi, bir kayıt, film veya başka bir görsel-işitsel ortamda konunun yorumunu, analizini veya tartışmasını sağlayan kolektif bir temsilcinin katkısını içeren bir anlatım ile ilişkilendirir. @tr
definition: Liittää yhteistoimijan ekspressioon, jonka tekemisessä yhteistoimija on osallisena tulkitsemalla tai analysoimalla äänitteen, elokuvan tai muun audiovisuaalisen aineiston aihetta tai keskustelemalla siitä.
definition: Met un agent collectif en relation avec une expression qui intègre une contribution de la part d’un agent collectif consistant à fournir une interprétation, une analyse ou une explication du sujet sur un enregistrement, un film ou un autre support audiovisuel. @fr
definition: Relaciona un agent col·lectiu amb una expressió que inclou una contribució d’un agent col·lectiu proporcionant l’opinió, l’anàlisi o una explicació del tema d’un enregistrament, una pel·lícula o de qualsevol altre suport audiovisual. @ca
definition: Relateert een collectieve actor aan een expressie die omvat een bijdrage door een collectieve actor door het verlenen van uitleg, analyse of een discussie over het onderwerp op een opname, film of ander audiovisueel medium. @nl
definition: Relaterer en kollektiv agent til et udtryk, som omfatter en kollektiv agents bidrag ved at stå for fortolkning, analyse eller diskussion af det emne, som behandles i en optagelse, film eller andet audiovisuelt medium. @da
definition: Relaterer en kollektiv agent til et uttrykk som inkluderer et bidrag fra en kollektiv agent i form av å tilføre tolkning, analyse eller drøfting av temaet for et opptak, en film eller et annet audiovisuelt medium. @no
definition: Relates a collective agent to an expression that includes a contribution by a collective agent of providing interpretation, analysis, or a discussion of the subject matter on a recording, film, or other audiovisual medium. @en
definition: Sasaista grupu ar izteiksmi, kas ietver grupas ieguldījumu, sniedzot interpretāciju, analīzi vai diskusiju par tēmu ierakstā, filmā vai citā audiovizuālā vidē. @lv
definition: Seostab kollektiivi väljendusega, millesse kollektiiv on andnud panuse, tõlgendades või analüüsides salvestuse, filmi või muu audiovisuaalse meediumi ainestikku või arutledes selle üle. @et
definition: Setzt einen gemeinschaftlichen Akteur in Beziehung zu einer Expression, zu der ein gemeinschaftlicher Akteur beiträgt, indem er in einer Aufnahme, in einem Film oder in einem anderen audiovisuellen Medium eine Interpretation, eine Analyse oder eine Diskussion des Themas präsentiert. @de
definition: يربط وكيلا جماعيا بتعبيرة تتضمن إسهام وكيل جماعي في تقديم تفسير للموضوع، أو تحليله، أو مناقشته في تسجيل أو في فيلم، أو أي وسيط سمعي بصري آخر. @ar
definition: 将一个集体行为者与包括有提供关于录像、电影或其他视听媒介中的主要内容之解释、分析或讨论的一个集体行为者的贡献的一种内容表达关联起来。 @zh-hans