Item properties
type: Ontology
description: Properties that represent the attribute and relationship elements of the RDA Item entity. @en
preferred namespace prefix: rdai
rights: Copyright © 2020 American Library Association, Canadian Federation of Library Associations, and CILIP: Chartered Institute of Library and Information Professionals @en
licence: deed.en US
creator: RDA Steering Committee
contributor: RSC Technical Working Group
publisher: ALA Digital Reference
type: http://rdaregistry.info/termList/RDALinkedDataWork/1003
issued: 2014-01-18
title: RDA:n kappaleen ominaisuudet @fi
description: RDA-elementeistä johdetut ominaisuudet RDA:n kappaleen määrittelyjoukossa. @fi
version info: v5.4.2
modified: 2025-05-16

a pour point d’accès d’un item
status: Published
label: has access point for item @en
lexical alias: accessPointForItem.en
type: Property
definition: Relates an item to a nomen that is an appellation of item in natural language that is taken from a vocabulary encoding scheme or is constructed using a string encoding scheme. @en
domain: C10003
toolkit label: access point for item @en
toolkit definition: A nomen that is an appellation of item in natural language that is taken from a vocabulary encoding scheme or is constructed using a string encoding scheme. @en
sub property of: a pour appellation d’item
has element type: 3
sub property of: P00016
definition: Met un item en relation avec un nomen qui est une appellation d’item en langage naturel provenant d’un schéma d’encodage de vocabulaire ou construite à l’aide d’un schéma d’encodage de chaînes.
toolkit label: point d’accès d’un item
toolkit definition: Nomen qui est une appellation d’item en langage naturel provenant d’un schéma d’encodage de vocabulaire ou construite à l’aide d’un schéma d’encodage de chaînes.
label: kappaleen hakutieto @fi
definition: Liittää kappaleen nomeniin, joka on luonnollisen kielen mukainen kappaleen nimitys, joka on otettu sanaston merkintäjärjestelmästä tai joka on muodostettu merkkijonon merkintäjärjestelmää käyttäen. @fi
toolkit label: kappaleen hakutieto @fi
toolkit definition: Nomen, joka on luonnollisen kielen mukainen kappaleen nimitys, joka on otettu sanaston merkintäjärjestelmästä tai joka on muodostettu merkkijonon merkintäjärjestelmää käyttäen. @fi
label: har søkeinngang for eksemplar @no
definition: Relaterer et eksemplar til en betegnelse på eksemplar på et naturlig språk som er hentet fra et kodeskjema for vokabular eller er laget ved bruk av et kodeskjema for syntaks. @no
toolkit label: søkeinngang for eksemplar @no
toolkit definition: En betegnelse på eksemplar på et naturlig språk som er hentet fra et kodeskjema for vokabular eller er laget ved bruk av et kodeskjema for syntaks. @no
label: heeft ingang voor item @nl
definition: Relateert een item aan een nomen dat is een benaming van item in natuurlijke taal die ontleend is aan een vocabulair coderingsschema of gevormd is volgens een string coderingsschema. @nl
toolkit label: ingang voor item @nl
toolkit definition: Een nomen dat is een benaming van item in natuurlijke taal die ontleend is aan een vocabulair coderingsschema of gevormd is volgens een string coderingsschema. @nl
label: له نقطة وصول لمفردة @ar
definition: يربط مفردة بتسمية هي اسم مفردة في لغة طبيعية مأخوذة من خطة ترميز مفردات أو مبنية باستخدام خطة ترميز سلسلة تمثيلات. @ar
toolkit label: نقطة وصول لمفردة @ar
toolkit definition: تسمية هي اسم مفردة في لغة طبيعية مأخوذة من خطة ترميز مفردات أو مبنية باستخدام خطة ترميز سلسلة تمثيلات. @ar
label: té com a punt d’accés d’ítem @ca
definition: Relaciona un ítem amb un nomen que és una apel·lació d’ítem en llenguatge natural que s’obté d’un esquema de codificació de vocabulari o s’elabora usant un esquema de codificació de cadenes. @ca
toolkit label: punt d’accés d’ítem @ca
toolkit definition: Nomen que és una apel·lació d’ítem en llenguatge natural que s’obté d’un esquema de codificació de vocabulari o s’elabora usant un esquema de codificació de cadenes. @ca
label: har søgeindgang for eksemplar @da
definition: Relaterer et eksemplar til en benævnelse på eksemplar på normalsprog, som er taget fra et vokabularkodningsskema eller er konstrueret ved hjælp af et strengkodningsskema. @da
toolkit label: søgeindgang for eksemplar @da
toolkit definition: Benævnelse på eksemplar på normalsprog, som er taget fra et vokabularkodningsskema eller er konstrueret ved hjælp af et strengkodningsskema. @da
label: eksemplari otsielement @et
definition: Seostab eksemplari eksemplari nimetusega loomulikus keeles, mis on võetud leksikaalsest märkimissüsteemist või moodustatud stringilise märkimissüsteemi alusel. @et
toolkit label: eksemplari otsielement @et
toolkit definition: Eksemplari nimetus loomulikus keeles, mis on võetud leksikaalsest märkimissüsteemist või moodustatud stringilise märkimissüsteemi alusel. @et
label: hat Sucheinstieg für ein Exemplar @de
definition: Setzt ein Exemplar in Beziehung zu einer Bezeichnung für ein Exemplar in natürlicher Sprache, die einem Vocabulary Encoding Scheme entnommen oder mit einem String Encoding Scheme konstruiert wird. @de
toolkit label: Sucheinstieg für ein Exemplar @de
toolkit definition: Eine Bezeichnung für ein Exemplar in natürlicher Sprache, die einem Vocabulary Encoding Scheme entnommen oder mit einem String Encoding Scheme konstruiert wird. @de
label: hozzáférési pontja példányhoz a következő: @hu
definition: Hozzákapcsol példányt egy nomenhez, egy példány természetes nyelvű megnevezéséhez, amely egy szótárkódolási sémából származik, vagy egy karakterlánc-kódolási séma használatával szerkesztett. @hu
toolkit label: hozzáférési pontja példányhoz: @hu
toolkit definition: Egy nomen, egy példány természetes nyelvű megnevezése, amely egy szótárkódolási sémából származik, vagy egy karakterlánc-kódolási séma használatával szerkesztett. @hu
label: ha come punto d'accesso per item @it
definition: Correla un item a una denominazione di item in linguaggio naturale, tratta da uno schema di codifica di vocabolario o costruita utilizzando uno schema di codifica della stringa. @it
toolkit label: punto d'accesso per item @it
toolkit definition: Denominazione di item in linguaggio naturale, tratta da uno schema di codifica di vocabolario o costruita utilizzando uno schema di codifica della stringa @it
label: vienības pamatforma @lv
definition: Sasaista vienību ar nomenu, kas ir vienības vārds/nosaukums dabiskā valodā, kas ņemts no shēmas kontrolētu vārdnīcu kodēšanai vai tiek konstruēts, izmantojot virknes kodēšanas shēmu. @lv
toolkit label: vienības pamatforma @lv
toolkit definition: Vienības vārds/nosaukums dabiskā valodā, kas ņemts no shēmas kontrolētu vārdnīcu kodēšanai vai tiek konstruēts, izmantojot virknes kodēšanas shēmu. @lv
has subproperty: a pour point d’accès autorisé d’un item
has subproperty: a pour variante de point d’accès d’un item
has subproperty: P40080
label: 有单件的检索点 @zh-hans
definition: 将一个单件与作为一个单件的称谓、取自一个词表编码体系或者用一个串编码体系构建、用自然语言的一个命名关联起来。 @zh-hans
toolkit label: 单件的检索点 @zh-hans
toolkit definition: 作为一个单件的称谓、取自一个词表编码体系或者用一个串编码体系构建、用自然语言的一个命名 @zh-hans
label: kopya için erişim noktası ile ilişkilidir @tr
definition: Bir kopyayı, bir sözcük kodlama şemasından alınan veya bir dizge kodlama şeması kullanılarak oluşturulan doğal dilde bir kopyanın unvanı olan bir isimle ilişkilendirir. @tr
toolkit label: Kopya için erişim noktası @tr
toolkit definition: Bir kelime kodlama şemasından alınan veya bir dizi kodlama şeması kullanılarak oluşturulan, doğal dilde bir kopyanın unvanı olan bir isim. @tr

est conservé avec
status: Published
label: is held with @en
definition: Relates an item to an item that is held in the same collection as an item. @en
type: Property
domain: C10003
sub property of: a pour item en relation avec un item
toolkit label: held with @en
toolkit definition: An item that is held in the same collection as an item. @en
definition: Met un item en relation avec un item qui est conservé dans la même collection de ressources qu’un item.
toolkit label: conservé avec
toolkit definition: Item qui est conservé dans la même collection de ressources qu’un item.
toolkit label: acompañado por (ítem) @es
toolkit definition: Un ítem que se ha unido con otro ítem después de su publicación. @es
instruction number: 24.5
label: được kèm theo bởi (bản) @vi
definition: Liên kết bản với bản đi kèm với bản khác sau khi được công bố. @vi
toolkit label: được kèm theo bởi (bản) @vi
toolkit definition: Bản đi kèm với bản khác sau khi được công bố. @vi
label: er ledsaget af eksemplar @da
definition: Relaterer et eksemplar til et eksemplar, som er ført sammen med et andet eksemplar efter udgivelse. @da
toolkit label: ledsaget af eksemplar @da
toolkit definition: Eksemplar, som er ført sammen med et andet eksemplar efter udgivelse. @da
label: ist begleitet von (Exemplar) @de
definition: Setzt ein Exemplar in Beziehung zu einem Exemplar, das mit einem anderen Exemplar nach dem Herausgeben zusammengebracht wurde. @de
toolkit label: Begleitet von (Exemplar) @de
toolkit definition: Ein Exemplar, das mit einem anderen Exemplar nach dem Herausgeben zusammengebracht wurde. @de
label: συνοδεύεται από (αντίτυπο) @el
definition: Συνδέει ένα αντίτυπο με ένα αντίτυπο το οποίο συνενώνεται με ένα άλλο αντίτυπο μετά την έκδοσή του. @el
toolkit label: συνοδεύεται από (αντίτυπο) @el
toolkit definition: Ένα αντίτυπο το οποίο συνενώνεται με ένα άλλο αντίτυπο μετά την έκδοσή του. @el
label: és acompanyat d’un ítem @ca
definition: Relaciona un ítem amb un ítem que és aplegat amb un altre ítem després de la publicació. @ca
toolkit label: acompanyat d’un ítem @ca
toolkit definition: Ítem que és aplegat amb un altre ítem després de la publicació. @ca
definition: Liittää kappaleen kappaleeseen, joka on samassa kokoelmassa. @fi
toolkit label: saman kokoelman kappale @fi
toolkit definition: Kappale, joka on samassa kokoelmassa. @fi
toolkit label: ledsaget av eksemplar @no
toolkit definition: Et eksemplar som er knyttet til et annet eksemplar etter utgivelse. @no
has element type: 2
label: kíséri a következő példány: @hu
definition: Hozzákapcsol egy példányt egy példányhoz, amelyet kibocsátás után összevetetnek egy másik példánnyal. @hu
toolkit label: kíséri ez a példány: @hu
toolkit definition: Egy példány, amelyet kibocsátás után összevetetnek egy másik példánnyal. @hu
alternative label: accompanying item relationship @en
alternative label: accompanied by item @en
label: saman kokoelman kappale @fi
label: er ledsaget av eksemplar @no
definition: Relaterer et eksemplar til et eksemplar som er knyttet til et annet eksemplar etter utgivelse. @no
label: is begeleid door item @nl
definition: Relateert een item aan een item dat is samengebracht met een ander item nadat het is uitgevaardigd. @nl
toolkit label: begeleid door item @nl
toolkit definition: Een item dat is samengebracht met een ander item nadat het is uitgevaardigd. @nl
label: هي مصاحبة لمفردة @ar
definition: يربط مفردة بمفردة جُمعت مع مفردة أخرى بعد اصدارها. @ar
toolkit label: مصاحبة لمفردة @ar
toolkit definition: مفردة جُمعت مع مفردة أخرى بعد اصدارها. @ar
label: kaasasolev eksemplar @et
definition: Seostab eksemplari eksemplariga, mis on pärast väljaandmist teise eksemplariga kokku pandud. @et
toolkit label: kaasasolev eksemplar @et
toolkit definition: Eksemplar, mis on pärast väljaandmist teise eksemplariga kokku pandud. @et
label: è accompagnato da item @it
definition: Correla un item a un item che è stato unito a un altro item dopo la sua emissione. @it
toolkit label: accompagnato da item @it
toolkit definition: Item che è stato unito a un altro item dopo la sua emissione. @it
label: ir izdots kopā ar vienību @lv
definition: Sasaista vienību ar vienību, kas ir salikta kopā ar citu vienību, pēc izdošanas. @lv
toolkit label: izdots kopā ar vienību @lv
toolkit definition: Vienība, kas ir salikta kopā ar citu vienību, pēc izdošanas. @lv
lexical alias: heldWith.en
alternative label: علاقة مفردة مصاحبة @ar
alternative label: ledsaget af eksemplar-relation @da
alternative label: Begleitende Beziehungen auf Exemplarebene @de
has subproperty: est relié avec
has subproperty: est filmé avec un item
has subproperty: est sur le disque avec un item
has subproperty: P40029
label: 和……一起收藏 @zh-hans
definition: 将一个单件与和一个单件在同一个收藏中的一个单件关联起来。 @zh-hans

a pour relation d’item d’accompagnement
status: Deprecated
type: Property
domain: C10003
lexical alias: accompanyingItemRelationship.en
definition: Met un item en relation avec un item qui accompagne ou est accompagné par un autre item.
toolkit label: relation d’item d’accompagnement
toolkit definition: Item qui accompagne ou est accompagné par un autre item.
toolkit label: relaciones de ítem acompañante @es
toolkit definition: Un ítem que acompaña o está acompañado por el ítem. @es
sub property of: a pour item en relation avec un item
instruction number: 24.5
label: có mối quan hệ bản kèm theo @vi
definition: Liên kết bản với bản lèm theo hoặc đi kèm bởi bản khác. @vi
toolkit label: mối quan hệ bản kèm theo @vi
toolkit definition: Bản lèm theo hoặc đi kèm bởi bản khác. @vi
label: har ledsagende eksemplarrelation med @da
definition: Relaterer et eksemplar til et eksemplar der ledsager eller er ledsaget af et eksemplar. @da
toolkit label: ledsagende eksemplarrelation @da
toolkit definition: Eksemplar der ledsager eller er ledsaget af et eksemplar. @da
label: hat begleitende Beziehungen auf Exemplarebene @de
definition: Setzt ein Exemplar mit einem Exemplar, das ein anderes Exemplar begleitet oder von einem begleitet wird, in Beziehung. @de
toolkit label: Begleitende Beziehung auf Exemplarebene @de
toolkit definition: Ein Exemplar, das ein anderes Exemplar begleitet oder von einem begleitet wird. @de
label: έχει συνοδευτική σχέση του αντιτύπου με @el
definition: Συνδέει ένα αντίτυπο με ένα αντίτυπο το οποίο συνοδεύει ή συνοδεύεται από κάποιο άλλο αντίτυπο. @el
toolkit label: συνοδευτική σχέση του αντιτύπου @el
toolkit definition: Ένα αντίτυπο το οποίο συνοδεύει ή συνοδεύεται από κάποιο άλλο αντίτυπο. @el
label: té com a relació d’ítem d’acompanyament @ca
definition: Relaciona un item amb un ítem que acompanya o és acompanyat per un altre ítem. @ca
toolkit label: relació d’ítem d’acompanyament @ca
toolkit definition: Ítem que acompanya o és acompanyat per un altre ítem. @ca
label: suhde yhdistettyyn kappaleeseen @fi
definition: Liittää kappaleen sellaiseen kappaleeseen, johon on yhdistetty toinen kappale tai joka on yhdistetty toiseen kappaleeseen. @fi
toolkit label: suhde yhdistettyyn kappaleeseen @fi
toolkit definition: Kappale, johon on yhdistetty toinen kappale tai joka on yhdistetty toiseen kappaleeseen. @fi
toolkit label: ledsagende eksemplar: relasjonstype @no
toolkit definition: Et eksemplar som ledsager eller ledsages av et annet eksemplar. @no
has subproperty: P40051

is analysis of (item) (Deprecated)
status: Deprecated
type: Property
sub property of: is description of (item) (Deprecated)
toolkit definition: An item that has been examined to identify its components and their relations. (Deprecated) @en
toolkit label: analysis of (item) (Deprecated) @en
definition: Relates a work to an item that has been examined to identify its components and their relations. (Deprecated) @en
lexical alias: analysisOfItem.en
domain: C10001
instruction number: 24.5

a pour annotateur
status: Published
label: has annotator @en
definition: Relates an item to a person who adds notes and other information to an item by hand. @en
type: Property
domain: C10003
sub property of: a pour personne modificatrice
lexical alias: annotator.en
toolkit label: annotator @en
toolkit definition: A person who adds notes and other information to an item by hand. @en
definition: Met un item en relation avec une personne qui ajoute des notes ou d’autres informations à la main sur un item.
toolkit label: annotateur
toolkit definition: Personne qui ajoute des notes ou d’autres informations à la main sur un item.
toolkit label: anotador @es
toolkit definition: Una persona que hace anotaciones manuscritas en un ítem. @es
instruction number: 18.5
label: có người chú thích @vi
definition: Liên kết bản với cá nhân người tạo chú thích bản thảo trên bản. @vi
toolkit label: người chú thích @vi
toolkit definition: Cá nhân người tạo chú thích bản thảo trên bản. @vi
label: har annoteringsskriver @da
definition: Relaterer et eksemplar til en person, som i hånden tilføjer noter og anden information på et eksemplar. @da
toolkit label: annoteringsskriver @da
toolkit definition: Person, som i hånden tilføjer noter og anden information på et eksemplar. @da
label: hat annotierende Person @de
definition: Setzt ein Exemplar in Beziehung zu einer Person, die handschriftlich Anmerkungen und andere Informationen in ein Exemplar hinzufügt. @de
toolkit label: Annotierende Person @de
toolkit definition: Eine Person, die handschriftlich Anmerkungen und andere Informationen in ein Exemplar hinzufügt. @de
label: έχει υπομνηματιστή @el
definition: Συνδέει ένα αντίτυπο με ένα φυσικό πρόσωπο το οποίο δημιουργεί χειρόγραφα σχόλια/σημειώσεις σε ένα αντίτυπο. @el
toolkit label: υπομνηματιστής @el
toolkit definition: Ένα φυσικό πρόσωπο το οποίο δημιουργεί χειρόγραφα σχόλια/σημειώσεις σε ένα αντίτυπο. @el
label: té com a anotador @ca
definition: Relaciona un ítem amb una persona que afegeix a mà notes i altra informació a un ítem. @ca
toolkit definition: Persona que afegeix a mà notes i altra informació a un ítem. @ca
definition: Liittää kappaleen henkilöön, joka kirjoittaa käsin lisähuomautuksia tai muita selityksiä kappaleeseen. @fi
toolkit label: lisähuomautusten kirjoittaja @fi
toolkit definition: Henkilö, joka kirjoittaa käsin lisähuomautuksia tai muita selityksiä kappaleeseen. @fi
toolkit label: annoterende person @no
toolkit definition: En person som legger til håndskrevne noter og annen informasjon i et eksemplar. @no
has element type: 2
label: jegyzetekkel ellátója a következő: @hu
definition: Hozzákapcsol egy példányt egy személyhez, aki jegyzeteket és más, kézzel írott információt fűz egy példányhoz. @hu
toolkit label: jegyzetekkel ellátója: @hu
toolkit definition: Egy személy, aki jegyzeteket és más, kézzel írott információt fűz egy példányhoz. @hu
label: lisähuomautusten kirjoittaja @fi
label: har annoterende person @no
definition: Relaterer et eksemplar til en person som legger til håndskrevne noter og annen informasjon i et eksemplar. @no
label: heeft annotator @nl
definition: Relateert een item aan een persoon die aantekeningen en andere informatie met de hand toevoegt aan een item. @nl
toolkit definition: Een persoon die aantekeningen en andere informatie met de hand toevoegt aan een item. @nl
label: له مُعلِق @ar
definition: يربط مفردة بشخص يضيف باليد حواشي ومعلومات أخرى على مفردة . @ar
toolkit label: مُعلِق @ar
toolkit definition: شخص يضيف حواشي ومعلومات أخرى على مفردة باليد. @ar
label: sissekirjutuste autor @et
definition: Seostab eksemplari isikuga, kes lisab eksemplari käsitsi märkusi ja muud infot. @et
toolkit label: sissekirjutuste autor @et
toolkit definition: Isik, kes lisab eksemplari käsitsi märkusi ja muud infot. @et
label: ha come postillatore @it
definition: Correla un item a una persona che appone annotazioni o altre informazioni manoscritte su un item. @it
toolkit label: postillatore @it
toolkit definition: Persona che appone annotazioni o altre informazioni manoscritte su un item. @it
label: anotācijas autors @lv
definition: Sasaista vienību ar personu, kura pievieno rakstam/vienībai ar roku rakstītas piezīmes un citu informāciju. @lv
toolkit label: anotācijas autors @lv
toolkit definition: Persona, kura pievieno rakstam/vienībai ar roku rakstītas piezīmes un citu informāciju. @lv
has subproperty: P40015
label: 有手写批注者 @zh-hans
definition: 将一个单件与在单件上手写批注和其他信息的个人关联起来。 @zh-hans
toolkit label: 手写批注者 @zh-hans
toolkit definition: 在单件上手写批注和其他信息的个人 @zh-hans
label: yorumlayıcı ile ilişkilidir @tr
definition: Bir kopyayı, bir kopyaya elle alınan notlar ve diğer bilgiler ekleyen bir kişiyle ilişkilendirir. @tr
toolkit label: yorumlayıcı @tr
toolkit definition: Bir kopyaya, notlar ve diğer bilgileri elle ekleyen kişi. @tr

a pour appellation d’item
status: Published
type: Property
label: has appellation of item @en
lexical alias: appellationOfItem.en
definition: Relates an item to a nomen that is used within a given scheme or context to refer to an item. @en
domain: C10003
toolkit label: appellation of item @en
toolkit definition: A nomen that is used within a given scheme or context to refer to an item. @en
sub property of: a pour nomen en relation avec un item
has element type: 3
sub property of: P00017
definition: Met un item en relation avec un nomen qui est utilisé à l’intérieur d’un schéma ou d’un contexte donnés pour désigner un item.
toolkit label: appellation d’item
toolkit definition: Nomen qui est utilisé à l’intérieur d’un schéma ou d’un contexte donnés pour désigner un item.
label: kappaleen nimitys @fi
definition: Liittää kappaleen nomeniin, jota käytetään viitattaessa kappaleeseen tietyssä järjestelmässä tai kontekstissa. @fi
toolkit label: kappaleen nimitys @fi
toolkit definition: Nomen, jota käytetään viitattaessa kappaleeseen tietyssä järjestelmässä tai kontekstissa. @fi
label: har betegnelse for eksemplar @no
definition: Relaterer et eksemplar til et nomen som er brukt i et bestemt skjema eller en bestemt sammenheng for å refere til et eksemplar. @no
toolkit label: betegnelse for eksemplar @no
toolkit definition: Et nomen som er brukt i et bestemt skjema eller en bestemt sammenheng for å refere til et eksemplar. @no
label: heeft benaming voor item @nl
definition: Relateert een item aan een nomen gebruikt binnen een bepaald schema of context om te verwijzen naar een item. @nl
toolkit label: benaming voor item @nl
toolkit definition: Een nomen gebruikt binnen een bepaald schema of context om te verwijzen naar een item. @nl
label: té com a apel·lació d’ítem @ca
definition: Relaciona un ítem amb un nomen que s’usa en un esquema o un context determinat per referir-se a un ítem. @ca
toolkit label: apel·lació d’ítem @ca
toolkit definition: Nomen que s’usa en un esquema o un context determinat per referir-se a un ítem. @ca
label: har benævnelse på eksemplar @da
definition: Relaterer et eksemplar til et nomen, som anvendes inden for et givet skema eller kontekst for at henvise til et eksemplar. @da
toolkit label: benævnelse på eksemplar @da
toolkit definition: Nomen, som anvendes inden for et givet skema eller kontekst for at henvise til et eksemplar. @da
label: eksemplari nimetus @et
definition: Seostab eksemplari nomen'iga, mida antud süsteemis või kontekstis kasutatakse eksemplarile viitamiseks. @et
toolkit label: eksemplari nimetus @et
toolkit definition: Nomen, mida antud süsteemis või kontekstis kasutatakse eksemplarile viitamiseks. @et
label: hat Bezeichnung für ein Exemplar @de
definition: Setzt ein Exemplar in Beziehung zu einem Nomen, das in einem bestimmten Schema oder Kontext verwendet wird, um ein Exemplar zu referenzieren. @de
toolkit label: Bezeichnung für ein Exemplar @de
toolkit definition: Ein Nomen, das in einem bestimmten Schema oder Kontext verwendet wird, um ein Exemplar zu referenzieren. @de
label: példány megnevezése a következő: @hu
definition: Hozzákapcsol egy példányt egy nomenhez, amelyet egy adott sémán vagy kontextuson belül használnak egy példányra való hivatkozásra. @hu
toolkit label: példány megnevezése: @hu
toolkit definition: Egy nomen, amelyet egy adott sémán vagy kontextuson belül használnak egy példányra való hivatkozásra. @hu
label: ha come appellativo di item @it
definition: Correla un item a un nomen utilizzato nell'ambito di un dato schema o contesto da riferire a un item. @it
toolkit label: denominazione di item @it
toolkit definition: Nomen utilizzato nell'ambito di un dato schema o contesto da riferire a un item. @it
label: vienības apzīmējums @lv
definition: Sasaista vienību ar nomenu, ko lieto konkrētajā sistēmā vai kontekstā, lai norādītu uz vienību. @lv
toolkit label: vienības apzīmējums @lv
toolkit definition: Nomens, ko lieto konkrētajā sistēmā vai kontekstā, lai norādītu uz vienību @lv
label: له اسم لمفردة @ar
definition: يربط مفردة بتسمية مستخدمة ضمن خطة أو سياق معين للإشارة إلى مفردة. @ar
toolkit label: اسم لمفردة @ar
toolkit definition: تسمية مستخدمة ضمن خطة أو سياق محدد للإشارة إلى مفردة. @ar
has subproperty: a pour point d’accès d’un item
has subproperty: a pour identifiant d’item
has subproperty: a pour titre d’item
has subproperty: P40081
label: 有单件的称谓 @zh-hans
definition: 将一个单件与在一个给定的体系或语境中指称一个单件所用的一个命名关联起来。 @zh-hans
toolkit label: 单件的称谓 @zh-hans
toolkit definition: 在一个给定的体系或语境中指称一个单件所用的一个命名 @zh-hans
label: kopyanın unvanı ile ilişkilidir @tr
definition: Bir kopyayı, bir kopyaya atıfta bulunmak için belirli bir şema veya bağlam içinde kullanılan bir isimle ilişkilendirir. @tr
toolkit label: kopyanın unvanı @tr
toolkit definition: Belirli bir şema veya bağlam içinde bir kopyaya atıfta bulunmak için kullanılan bir isim. @tr

a pour point d’accès autorisé d’un item
status: Published
type: Property
label: has authorized access point for item @en
lexical alias: authorizedAccessPointForItem.en
definition: Relates an item to a nomen that is an access point of item that is selected for preference in a specific vocabulary encoding scheme. @en
domain: C10003
toolkit label: authorized access point for item @en
toolkit definition: A nomen that is an access point of item that is selected for preference in a specific vocabulary encoding scheme. @en
sub property of: a pour point d’accès d’un item
has element type: 3
sub property of: P00020
definition: Met un item en relation avec un nomen qui est un point d’accès d’un item faisant l’objet d’un choix privilégié dans un schéma d’encodage de vocabulaire spécifique.
toolkit label: point d’accès autorisé d’un item
toolkit definition: Nomen qui est un point d’accès d’un item faisant l’objet d’un choix privilégié dans un schéma d’encodage de vocabulaire spécifique.
label: kappaleen auktorisoitu hakutieto @fi
definition: Liittää kappaleen nomeniin, joka on kappaleen hakutieto, joka on valittu ensisijaiseksi tietyssä sanaston merkintäjärjestelmässä. @fi
toolkit label: kappaleen auktorisoitu hakutieto @fi
toolkit definition: Nomen, joka on kappaleen hakutieto, joka on valittu ensisijaiseksi tietyssä sanaston merkintäjärjestelmässä. @fi
label: har autorisert søkeinngang for eksemplar @no
definition: Relaterer et eksemplar til en foretrukket søkeinngang for eksemplar som er valgt fra et bestemt kodeskjema for vokabular. @no
toolkit label: autorisert søkeinngang for eksemplar @no
toolkit definition: En foretrukket søkeinngang for eksemplar som er valgt fra et bestemt kodeskjema for vokabular. @no
label: heeft geautoriseerde ingang voor item @nl
definition: Relateert een item aan een nomen dat is een ingang van item die als voorkeursterm geselecteerd is in een specifiek vocabulair coderingssysteem. @nl
toolkit label: geautoriseerde ingang voor item @nl
toolkit definition: Een nomen dat is een ingang van item die als voorkeursterm geselecteerd is in een specifiek vocabulair coderingssysteem. @nl
label: له نقطة وصول مقننة لمفردة @ar
definition: يربط مفردة بتسمية هي نقطة وصول لمفردة اختيرت للتفضيل في خطة ترميز مفردات محددة. @ar
toolkit label: نقطة وصول مقننة لمفردة @ar
toolkit definition: تسمية هي نقطة وصول لمفردة اختير للتفضيل في خطة ترميز مفردات محددة. @ar
label: té com a punt d’accés autoritzat d’ítem @ca
definition: Relaciona un ítem amb un nomen que és un punt d’accés d’ítem que se selecciona com a preferent en un esquema de codificació de vocabulari específic. @ca
toolkit label: punt d’accés autoritzat d’ítem @ca
toolkit definition: Nomen que és un punt d’accés d’ítem que se selecciona com a preferent en un esquema de codificació de vocabulari específic. @ca
label: har autoriseret søgeindgang for eksemplar @da
definition: Relaterer et eksemplar til en søgeindgang for eksemplar, som er valgt som præference i et specifikt vokabularkodningsskema. @da
toolkit label: autoriseret søgeindgang for eksemplar @da
toolkit definition: Søgeindgang for eksemplar, som er valgt som præference i et specifikt vokabularkodningsskema. @da
label: eksemplari normitud otsielement @et
definition: Seostab eksemplari eksemplari otsielemendiga, mis on valitud eelistatuks vastavas leksikaalses märkimissüsteemis. @et
toolkit label: eksemplari normitud otsielement @et
toolkit definition: Eksemplari otsielement, mis on valitud eelistatuks vastavas leksikaalses märkimissüsteemis. @et
label: hat normierten Sucheinstieg für ein Exemplar @de
definition: Setzt ein Exemplar in Beziehung zu einem Sucheinstieg für ein Exemplar, der in einem bestimmten Vocabulary Encoding Scheme als Vorzugsform bestimmt wird. @de
toolkit label: Normierter Sucheinstieg für ein Exemplar @de
toolkit definition: Ein Sucheinstieg für ein Exemplar, der in einem bestimmten Vocabulary Encoding Scheme als Vorzugsform bestimmt wird. @de
label: példány autorizált hozzáférési pontja a következő: @hu
definition: Hozzákapcsol egy példányt egy nomenhez, amely egy példány olyan előnyben részesített hozzáférési pontja, amelyet egy adott szótárkódolási sémából választanak ki. @hu
toolkit label: példány autorizált hozzáférési pontja: @hu
toolkit definition: Egy nomen, amely egy példány olyan előnyben részesített hozzáférési pontja, amelyet egy adott szótárkódolási sémából választanak ki. @hu
label: ha come punto d'accesso autorizzato per item @it
definition: Correla un item a un punto d'accesso autorizzato di item selezionato come preferito in uno specifico schema di codifica di vocabolario. @it
toolkit label: punto d'accesso autorizzato per item @it
toolkit definition: Punto d'accesso autorizzato di item selezionato come preferito in uno specifico schema di codifica di vocabolario. @it
label: vienības autoritatīvā pamatforma @lv
definition: Sasaista vienību ar nomenu, kas ir vienības pamatforma, kas ir izvēle no konkrētas vārdnīcas. @lv
toolkit label: vienības autoritatīvā pamatforma @lv
toolkit definition: Vienības pamatforma, kas ir izvēle no konkrētas vārdnīcas. @lv
has subproperty: P40083
label: 有单件的规范检索点 @zh-hans
definition: 将一个单件与作为一个单件的检索点、并在一个特定的词表编码体系中被首选的一个命名关联起来。 @zh-hans
toolkit label: 单件的规范检索点 @zh-hans
toolkit definition: 作为一个单件的检索点、并在一个特定的词表编码体系中被首选的一个命名 @zh-hans
label: kopya için yetkilendirilmiş erişim noktası ile ilişkilidir @tr
definition: Bir kopyayı, belirli bir kelime kodlama şemasında tercih edilmek üzere seçilen bir kopyanın erişim noktası olan bir isimle ilişkilendirir. @tr
toolkit label: kopya için yetkili erişim noktası @tr
toolkit definition: Belirli bir kelime kodlama şemasında tercih için seçilen bir kopyanın erişim noktası olan bir isim. @tr

a pour signataire autographe
status: Published
label: has autographer @en
definition: Relates an item to a person whose manuscript signature appears on an item. @en
type: Property
domain: C10003
sub property of: a pour personne modificatrice
lexical alias: autographer.en
toolkit label: autographer @en
toolkit definition: A person whose manuscript signature appears on an item. @en
definition: Met un item en relation avec une personne dont la signature manuscrite figure sur un item.
toolkit label: signataire autographe
toolkit definition: Personne dont la signature manuscrite figure sur un item.
toolkit label: firmante de autógrafo @es
toolkit definition: Una persona cuya firma manuscrita aparece en un ítem. @es
instruction number: 18.5
label: có người ghi bút tích @vi
definition: Liên kết bản với cá nhân có chữ ký bản thảo xuất hiện trên bản. @vi
toolkit label: người ghi bút tích @vi
toolkit definition: Cá nhân có chữ ký bản thảo xuất hiện trên bản. @vi
label: har autografskriver @da
definition: Relaterer et eksemplar til en person, hvis signatur forekommer på et eksemplar. @da
toolkit label: autografskriver @da
toolkit definition: Person, hvis signatur forekommer på et eksemplar. @da
label: hat Unterzeichnerin/Unterzeichner @de
definition: Setzt ein Exemplar in Beziehung zu einer Person, deren handschriftliche Unterschrift auf einem Exemplar steht. @de
toolkit label: Unterzeichnerin/Unterzeichner @de
toolkit definition: Eine Person, deren handschriftliche Unterschrift auf einem Exemplar steht. @de
label: έχει χειρόγραφη υπογραφή @el
definition: Συνδέει ένα αντίτυπο με ένα φυσικό πρόσωπο του οποίου η ιδιόχειρη υπογραφή υπάρχει σε ένα αντίτυπο. @el
toolkit label: χειρόγραφη υπογραφή @el
toolkit definition: Ένα φυσικό πρόσωπο του οποίου η ιδιόχειρη υπογραφή υπάρχει σε ένα αντίτυπο. @el
label: té com a signatari d’un autògraf @ca
definition: Relaciona un ítem amb una persona la signatura autògrafa de la qual figura en un ítem. @ca
toolkit label: signatari d’un autògraf @ca
toolkit definition: Persona la signatura autògrafa de la qual figura en un ítem. @ca
definition: Liittää kappaleen henkilöön, jonka käsin kirjoitettu nimikirjoitus on kappaleessa. @fi
toolkit label: nimikirjoituksen kirjoittaja @fi
toolkit definition: Henkilö, jonka käsin kirjoitettu nimikirjoitus on kappaleessa. @fi
toolkit label: person som signerer @no
toolkit definition: En person hvis håndskrevne signatur finnes på et eksemplar. @no
has element type: 2
label: aláírója a következő: @hu
definition: Hozzákapcsol egy példányt egy személyhez, akinek a kézírásos aláírása megjelenik egy példányon. @hu
toolkit label: aláírója: @hu
toolkit definition: Egy személy, akinek a kézírásos aláírása megjelenik egy példányon. @hu
label: nimikirjoituksen kirjoittaja @fi
label: har person som signerer @no
definition: Relaterer et eksemplar til en person hvis håndskrevne signatur finnes på et eksemplar. @no
label: heeft handtekeningzetter @nl
definition: Relateert een item aan een persoon wiens handtekening in manuscript op een item staat. @nl
toolkit label: handtekeningzetter @nl
toolkit definition: Een persoon wiens handtekening in manuscript op een item staat. @nl
label: له شخص موقِّع أتوجراف @ar
definition: يربط مفردة بشخص يظهر توقيعه بخط اليد على مفردة. @ar
toolkit label: موقِّع أتوجراف @ar
toolkit definition: شخص يظهر توقيعه بخط اليد على مفردة. @ar
label: autograafi kirjutaja @et
definition: Seostab eksemplari isikuga, kelle omakäeline nimi või nimemärk on eksemplaris või eksemplaril. @et
toolkit label: autograafi kirjutaja @et
toolkit definition: Isik, kelle omakäeline nimi või nimemärk on eksemplaris või eksemplaril. @et
label: ha come autore di autografo @it
definition: Correla un item a una persona la cui firma compare su un item. @it
toolkit label: autore di autografo @it
toolkit definition: Persona la cui firma compare su un item. @it
label: autogrāfa autors @lv
definition: Sasaista vienību ar personu, kuras paraksts parādās uz vienības. @lv
toolkit label: autogrāfa autors @lv
toolkit definition: Persona, kuras paraksts parādās uz vienības. @lv
has subproperty: P40016
label: 有亲笔签名者 @zh-hans
definition: 将一个单件与在单件上亲笔签名的个人关联起来。 @zh-hans
toolkit label: 亲笔签名者 @zh-hans
toolkit definition: 在单件上亲笔签名的个人 @zh-hans
label: imza sahibi ile ilişkilidir @tr
definition: Bir kopyayı, el yazması imzası bir kopya üzerinde görünen bir kişiyle ilişkilendirir. @tr
toolkit label: imzalayan @tr
toolkit definition: El yazması imzası bir kopya üzerinde görünen bir kişi. @tr

a pour agent relieur
status: Published
label: has binder agent @en
definition: Relates an item to an agent who binds an item. @en
type: Property
domain: C10003
sub property of: a pour agent modificateur
lexical alias: binderAgent.en
toolkit label: binder agent @en
toolkit definition: An agent who binds an item. @en
definition: Met un item en relation avec un agent qui relie un item.
toolkit label: agent relieur
toolkit definition: Agent qui relie un item.
toolkit label: encuadernador @es
toolkit definition: Una persona que encuaderna un ítem. @es
instruction number: 18.5
label: có người đóng sách @vi
definition: Liên kết bản với cá nhân người đóng một bản. @vi
toolkit label: người đóng sách @vi
toolkit definition: Cá nhân người đóng một bản. @vi
label: har agent, som er bogbinder @da
definition: Relaterer et eksemplar til en agent, som indbinder et eksemplar. @da
toolkit label: agent, som er bogbinder @da
toolkit definition: Agent, som indbinder et eksemplar. @da
label: hat Buchbinderin/Buchbinder (Akteur) @de
definition: Setzt ein Exemplar in Beziehung zu einem Akteur, der ein Exemplar bindet. @de
toolkit label: Buchbinderin/Buchbinder (Akteur) @de
toolkit definition: Ein Akteur, der ein Exemplar bindet. @de
label: έχει βιβλιοδέτη @el
definition: Συνδέει ένα αντίτυπο με ένα φυσικό πρόσωπο που βιβλιοδετεί ένα αντίτυπο. @el
toolkit label: βιβλιοδέτης @el
toolkit definition: Ένα φυσικό πρόσωπο που βιβλιοδετεί ένα αντίτυπο. @el
label: té com a agent enquadernador @ca
definition: Relaciona un ítem amb un agent que enquaderna un ítem. @ca
toolkit label: agent enquadernador @ca
toolkit definition: Agent que enquaderna un ítem. @ca
definition: Liittää kappaleen toimijaan, joka sitoo kappaleen. @fi
toolkit label: sitoja (toimija) @fi
toolkit definition: Toimija, joka sitoo kappaleen. @fi
toolkit label: bokbinder (agent) @no
toolkit definition: En agent som binder inn et eksemplar. @no
has element type: 2
label: könyvkötő ágense a következő: @hu
definition: Hozzákapcsol egy példányt egy ágenshez, amely beköt egy forrást. @hu
toolkit label: könyvkötő ágense: @hu
toolkit definition: Egy ágens, amely beköt egy forrást. @hu
alternative label: binder @en
alternative label: relieur
alternative label: sitoja @fi
label: sitoja (toimija) @fi
label: har bokbinder (agent) @no
definition: Relaterer et eksemplar til en agent som binder inn et eksemplar. @no
alternative label: bokbinder @no
label: heeft binder-actor @nl
definition: Relateert een item aan een actor die een item bindt. @nl
toolkit label: binder-actor @nl
toolkit definition: Een actor die een item bindt. @nl
label: له وكيل مسئول عن التجليد @ar
definition: يربط مفردة بوكيل يقوم بتجليد مفردة. @ar
alternative label: مسئول عن التجليد @ar
toolkit label: وكيل مسئول عن التجليد @ar
toolkit definition: وكيل يقوم بتجليد مفردة. @ar
alternative label: enquadernador @ca
alternative label: bogbinder @da
label: köitja (tegija) @et
definition: Seostab eksemplari tegijaga, kes on eksemplari köitnud. @et
alternative label: köitja @et
toolkit label: köitja (tegija) @et
toolkit definition: Tegija, kes on eksemplari köitnud. @et
alternative label: könyvkötője: @hu
label: ha come rilegatore agente @it
definition: Correla un item a un agente che rilega un item. @it
alternative label: rilegatore @it
toolkit label: rilegatore agente @it
toolkit definition: Agente che rilega un item. @it
label: grāmatsējējs (aģents) @lv
definition: Sasaista vienību ar aģentu, kas iesien vienību. @lv
toolkit label: grāmatsējējs (aģents) @lv
toolkit definition: Aģents, kas iesien vienību. @lv
alternative label: Buchbinder @de
has subproperty: a pour agent collectif relieur

a pour agent collectif relieur
status: Published
label: has binder collective agent @en
lexical alias: binderCollectiveAgent.en
definition: Relates an item to a collective agent who binds an item. @en
toolkit label: binder collective agent @en
toolkit definition: A collective agent who binds an item. @en
type: Property
domain: C10003
has element type: 2
sub property of: a pour agent collectif modificateur
sub property of: a pour agent relieur
definition: Met un item en relation avec un agent collectif qui relie un item.
toolkit label: agent collectif relieur
toolkit definition: Agent collectif qui relie un item.
label: sitoja (yhteistoimija) @fi
definition: Liittää kappaleen yhteistoimijaan, joka sitoo kappaleen. @fi
toolkit label: sitoja (yhteistoimija) @fi
toolkit definition: Yhteistoimija, joka sitoo kappaleen. @fi
label: har bokbinder (kollektiv agent) @no
definition: Relaterer et eksemplar til en kollektiv agent som binder inn et eksemplar. @no
toolkit label: bokbinder (kollektiv agent) @no
toolkit definition: En kollektiv agent som binder inn et eksemplar. @no
label: heeft binder-collectieve actor @nl
definition: Relateert een item aan een collectieve actor die een item bindt. @nl
toolkit label: binder-collectieve actor @nl
toolkit definition: Een collectieve actor die een item bindt. @nl
label: له وكيل جماعي مسئول عن التجليد @ar
definition: يربط مفردة بوكيل جماعي يجلد مفردة. @ar
toolkit label: وكيل جماعي مسئول عن التجليد @ar
toolkit definition: وكيل جامع يجلد مفردة. @ar
label: té com a agent col·lectiu enquadernador @ca
definition: Relaciona un ítem amb un agent col·lectiu que enquaderna un ítem. @ca
toolkit label: agent col·lectiu enquadernador @ca
toolkit definition: Agent col·lectiu que enquaderna un ítem. @ca
label: har kollektiv agent, som er bogbinder @da
definition: Relaterer et eksemplar til en kollektiv agent, som indbinder et eksemplar. @da
toolkit label: kollektiv agent, som er bogbinder @da
toolkit definition: Kollektiv agent, som indbinder et eksemplar. @da
label: köitja (kollektiiv) @et
definition: Seostab eksemplari kollektiiviga, kes on eksemplari köitnud. @et
toolkit label: köitja (kollektiiv) @et
toolkit definition: Kollektiiv, kes on eksemplari köitnud. @et
label: hat Buchbinderin/Buchbinder (Gemeinschaftlicher Akteur) @de
definition: Setzt ein Exemplar in Beziehung zu einem gemeinschaftlichen Akteur, der ein Exemplar bindet. @de
toolkit label: Buchbinderin/Buchbinder (Gemeinschaftlicher Akteur) @de
toolkit definition: Ein gemeinschaftlicher Akteur, der ein Exemplar bindet. @de
label: könyvkötő kollektív ágense a következő: @hu
definition: Hozzákapcsol egy példányt egy kollektív ágenshez, amely beköt egy példányt. @hu
toolkit label: könyvkötő kollektív ágense: @hu
toolkit definition: Egy kollektív ágens, amely beköt egy példányt. @hu
label: ha come rilegatore agente collettivo @it
definition: Correla un item a un agente collettivo che rilega un item. @it
toolkit label: rilegatore agente collettivo @it
toolkit definition: Agente collettivo che rilega un item. @it
label: grāmatsējējs (grupa) @lv
definition: Sasaista vienību ar grupu, kas ir iesējusi vienību. @lv
toolkit label: grāmatsējējs (grupa) @lv
toolkit definition: Grupa, kas ir iesējusi vienību. @lv
has subproperty: a pour collectivité relieuse
has subproperty: a pour famille relieuse
has subproperty: P40114
label: 有装订者集体行为者 @zh-hans
definition: 将一个单件与装订单件的一个集体行为者关联起来。 @zh-hans
toolkit label: 装订者集体行为者 @zh-hans
toolkit definition: 装订单件的一个集体行为者 @zh-hans
label: ciltleyen kolektif temsilci ile ilişkilidir @tr
definition: Bir kopyayı, bir kopyayı ciltleyen kolektif bir temsilciyle ilişkilendirir. @tr
toolkit label: ciltleyici kolektif temsilci @tr
toolkit definition: Bir kopyayı ciltleyen kolektif temsilci @tr

a pour collectivité relieuse
status: Published
label: has binder corporate body @en
lexical alias: binderCorporateBody.en
definition: Relates an item to a corporate body who binds an item. @en
toolkit label: binder corporate body @en
toolkit definition: A corporate body who binds an item. @en
type: Property
domain: C10003
has element type: 2
sub property of: a pour collectivité modificatrice
sub property of: a pour agent collectif relieur
definition: Met un item en relation avec une collectivité qui relie un item.
toolkit label: collectivité relieuse
toolkit definition: Collectivité qui relie un item.
label: sitoja (yhteisö) @fi
definition: Liittää kappaleen yhteisöön, joka sitoo kappaleen. @fi
toolkit label: sitoja (yhteisö) @fi
toolkit definition: Yhteisö, joka sitoo kappaleen. @fi
label: har bokbinder (korporasjon) @no
definition: Relaterer et eksemplar til en korporasjon som binder inn et eksemplar. @no
toolkit label: bokbinder (korporasjon) @no
toolkit definition: En korporasjon som binder inn et eksemplar. @no
label: heeft binder-corporatie @nl
definition: Relateert een item aan een corporatie die een item bindt. @nl
toolkit label: binder-corporatie @nl
toolkit definition: Een corporatie die een item bindt. @nl
label: له هيئة مسئولة عن التجليد @ar
definition: يربط مفردة بهيئة تجلد مفردة. @ar
toolkit label: هيئة مسئولة عن التجليد @ar
toolkit definition: هيئة تجلد مفردة. @ar
label: té com a entitat corporativa enquadernadora @ca
definition: Relaciona un ítem amb una entitat corporativa que enquaderna un ítem. @ca
toolkit label: entitat corporativa enquadernadora @ca
toolkit definition: Entitat corporativa que enquaderna un ítem. @ca
label: har korporation, som er bogbinder @da
definition: Relaterer et eksemplar til en korporation, som indbinder et eksemplar. @da
toolkit label: korporation, som er bogbinder @da
toolkit definition: Korporation, som indbinder et eksemplar. @da
label: köitja (asutus) @et
definition: Seostab eksemplari asutusega, kes on eksemplari köitnud. @et
toolkit label: köitja (asutus) @et
toolkit definition: Asutus, kes on eksemplari köitnud. @et
label: hat Buchbinderin/Buchbinder (Körperschaft) @de
definition: Setzt ein Exemplar in Beziehung zu einer Körperschaft, die ein Exemplar bindet. @de
toolkit label: Buchbinderin/Buchbinder (Körperschaft) @de
toolkit definition: Eine Körperschaft, die ein Exemplar bindet. @de
label: könyvkötő testülete a következő: @hu
definition: Egy példányt hozzákapcsol egy testülethez, amely beköti a példányt. @hu
toolkit label: könyvkötő testülete: @hu
toolkit definition: Egy testület, amely beköt egy példányt. @hu
label: ha come rilegatore ente @it
definition: Correla un item a un ente che rilega un item. @it
toolkit label: rilegatore ente @it
toolkit definition: Ente che rilega un item. @it
label: grāmatsējējs (institūcija) @lv
definition: Sasaista vienību ar institūciju, kas ir iesējusi vienību. @lv
toolkit label: grāmatsējējs (institūcija) @lv
toolkit definition: Institūcija, kas ir iesējusi vienību. @lv
has subproperty: P40130
label: 有装订者团体 @zh-hans
definition: 将一个单件与装订单件的一个团体关联起来。 @zh-hans
toolkit label: 装订者团体 @zh-hans
toolkit definition: 装订单件的一个团体 @zh-hans
label: ciltleyen tüzel kişi ile ilişkilidir @tr
definition: Bir kopyayı, bir kopyayı ciltleyen tüzel bir kişiyle ilişkilendirir. @tr
toolkit label: ciltleyici tüzel kişi @tr
toolkit definition: Bir kopyayı ciltleyen tüzel kişi @tr

a pour famille relieuse
status: Published
label: has binder family @en
lexical alias: binderFamily.en
definition: Relates an item to a family who binds an item. @en
toolkit label: binder family @en
toolkit definition: A family who binds an item. @en
type: Property
domain: C10003
has element type: 2
sub property of: a pour famille modificatrice
sub property of: a pour agent collectif relieur
definition: Met un item en relation avec une famille qui relie un item.
toolkit label: famille relieuse
toolkit definition: Famille qui relie un item.
label: sitoja (suku) @fi
definition: Liittää kappaleen sukuun, joka sitoo kappaleen. @fi
toolkit label: sitoja (suku) @fi
toolkit definition: Suku, joka sitoo kappaleen. @fi
label: har bokbinder (familie) @no
definition: Relaterer et eksemplar til en familie som binder inn et eksemplar. @no
toolkit label: bokbinder (familie) @no
toolkit definition: En familie som binder inn et eksemplar. @no
label: heeft binder-familie @nl
definition: Relateert een item aan een familie die een item bindt. @nl
toolkit label: binder-familie @nl
toolkit definition: Een familie die een item bindt. @nl
label: له عائلة مسئولة عن التجليد @ar
definition: يربط مفردة بعائلة تُجلِّد مفردة. @ar
toolkit label: عائلة مسئولة عن التجليد @ar
toolkit definition: عائلة تجلد مفردة. @ar
label: té com a família enquadernadora @ca
definition: Relaciona un ítem amb una família que enquaderna un ítem. @ca
toolkit label: família enquadernadora @ca
toolkit definition: Família que enquaderna un ítem. @ca
label: har familie, som er bogbinder @da
definition: Relaterer et eksemplar til en familie, som indbinder et eksemplar. @da
toolkit label: familie, som er bogbinder @da
toolkit definition: Familie, som indbinder et eksemplar. @da
label: köitja (perekond) @et
definition: Seostab eksemplari perekonnaga, kes on eksemplari köitnud. @et
toolkit label: köitja (perekond) @et
toolkit definition: Perekond, kes on eksemplari köitnud. @et
label: hat Buchbinderin/Buchbinder (Familie) @de
definition: Setzt ein Exemplar in Beziehung zu einer Familie, die ein Exemplar bindet. @de
toolkit label: Buchbinderin/Buchbinder (Familie) @de
toolkit definition: Eine Familie, die ein Exemplar bindet. @de
label: könyvkötő családja a következő: @hu
definition: Hozzákapcsol egy példányt egy családhoz, amely beköt egy példányt. @hu
toolkit label: könyvkötő család @hu
toolkit definition: Egy család, amely beköt egy példányt. @hu
label: ha come rilegatore famiglia @it
definition: Correla un item a una famiglia che rilega un item. @it
toolkit label: rilegatore famiglia @it
toolkit definition: Famiglia che rilega un item. @it
label: grāmatsējējs (dzimta/ģimene) @lv
definition: Sasaista vienību ar dzimtu/ģimeni, kas ir iesējusi vienību. @lv
toolkit label: grāmatsējējs (dzimta/ģimene) @lv
toolkit definition: Dzimta/ģimene, kas ir iesējusi vienību. @lv
has subproperty: P40146
label: 有装订者家族 @zh-hans
definition: 将一个单件与装订单件的一个家族关联起来。 @zh-hans
toolkit label: 装订者家族 @zh-hans
toolkit definition: 装订单件的一个家族 @zh-hans
label: ciltleyen aile ile ilişkilidir @tr
definition: Bir kopyayı, bir kopyayı ciltleyen bir aileyle ilişkilendirir. @tr
toolkit label: ciltleyici aile @tr
toolkit definition: Bir kopyayı ciltleyen bir aile. @tr

a pour personne relieuse
status: Published
label: has binder person @en
lexical alias: binderPerson.en
definition: Relates an item to a person who binds an item. @en
toolkit label: binder person @en
toolkit definition: A person who binds an item. @en
type: Property
domain: C10003
has element type: 2
sub property of: a pour personne modificatrice
sub property of: a pour agent relieur
definition: Met un item en relation avec une personne qui relie un item.
toolkit label: personne relieuse
toolkit definition: Personne qui relie un item.
label: sitoja (henkilö) @fi
definition: Liittää kappaleen henkilöön, joka sitoo kappaleen. @fi
toolkit label: sitoja (henkilö) @fi
toolkit definition: Henkilö, joka sitoo kappaleen. @fi
label: har bokbinder (person) @no
definition: Relaterer et eksemplar til en person som binder inn et eksemplar. @no
toolkit label: bokbinder (person) @no
toolkit definition: En person som binder inn et eksemplar. @no
label: heeft binder-persoon @nl
definition: Relateert een item aan een persoon die een item bindt. @nl
toolkit label: binder-persoon @nl
toolkit definition: Een persoon die een item bindt. @nl
label: له شخص مسئول عن التجليد @ar
definition: يربط مفردة بشخص يجلد مفردة. @ar
toolkit label: شخص مسئول عن التجليد @ar
toolkit definition: شخص يجلد مفردة. @ar
label: té com a persona enquadernadora @ca
definition: Relaciona un ítem amb una persona que enquaderna un ítem. @ca
toolkit label: persona enquadernadora @ca
toolkit definition: Persona que enquaderna un ítem. @ca
label: har person, som er bogbinder @da
definition: Relaterer et eksemplar til en person, som indbinder et eksemplar. @da
toolkit label: person, som er bogbinder @da
toolkit definition: Person, som indbinder et eksemplar. @da
label: köitja (isik) @et
definition: Seostab eksemplari isikuga, kes on eksemplari köitnud. @et
toolkit label: köitja (isik) @et
toolkit definition: Isik, kes on eksemplari köitnud. @et
label: hat Buchbinderin/Buchbinder (Person) @de
definition: Setzt ein Exemplar in Beziehung zu einer Person, die ein Exemplar bindet. @de
toolkit label: Buchbinderin/Buchbinder (Person) @de
toolkit definition: Eine Person, die ein Exemplar bindet. @de
label: könyvkötő személye a következő: @hu
definition: Hozzákapcsol egy példányt egy személyhez, aki beköt egy példányt. @hu
toolkit label: könyvkötő személye: @hu
toolkit definition: Egy személy, aki beköt egy példányt. @hu
label: ha come rilegatore persona @it
definition: Correla un item a una persona che rilega un item. @it
toolkit label: rilegatore persona @it
toolkit definition: Persona che rilega un item. @it
label: grāmatsējējs (persona) @lv
definition: Sasaista vienību ar personu, kura iesējusi vienību. @lv
toolkit label: grāmatsējējs (persona) @lv
toolkit definition: Persona, kura iesējusi vienību. @lv
has subproperty: P40098
label: 有装订者个人 @zh-hans
definition: 将一个单件与装订单件的一个个人关联起来。 @zh-hans
toolkit label: 装订者个人 @zh-hans
toolkit definition: 装订单件的一个个人 @zh-hans
label: ciltleyen kişi ile ilişkilidir @tr
definition: Bir kopyayı, bir kopyayı ciltleyen bir kişiyle ilişkilendirir. @tr
toolkit label: ciltleyici @tr
toolkit definition: Kopyayı ciltleyen kişi @tr

a pour reliure d’un item
status: Published
label: has binding of item @en
lexical alias: bindingOfItem.en
definition: Relates an item to a work that is a binding of an item. @en
toolkit label: binding of item @en
toolkit definition: A work that is a binding of an item. @en
type: Property
sub property of: a pour œuvre en relation avec un item
has element type: 2
domain: C10003
definition: Met un item en relation avec une œuvre qui consiste en une reliure d’un item.
toolkit label: reliure d’un item
toolkit definition: Œuvre qui consiste en une reliure d’un item.
label: kappaleen sidos @fi
definition: Liittää kappaleen teokseen, joka on kappaleen sidos. @fi
toolkit label: kappaleen sidos @fi
toolkit definition: Teos, joka on kappaleen sidos. @fi
label: har innbinding for eksemplar @no
definition: Relaterer et eksemplar til et verk som er en innbinding av et eksemplar. @no
toolkit label: innbinding for eksemplar @no
toolkit definition: Et verk som er en innbinding av et eksemplar. @no
label: heeft bindwijze van item @nl
definition: Relateert een item aan een werk dat een band is van een item. @nl
toolkit label: band van item @nl
toolkit definition: Een werk dat een band is van een item. @nl
label: له تجليد لمفردة @ar
definition: يربط مفردة بعمل هو تجليد لمفردة. @ar
toolkit label: تجليد مفردة @ar
toolkit definition: عمل هو تجليد مفردة. @ar
label: té com a enquadernació d’un ítem @ca
definition: Relaciona un ítem amb una obra que és una enquadernació d’un ítem. @ca
toolkit label: enquadernació d’un ítem @ca
toolkit definition: Obra que és una enquadernació d’un ítem. @ca
label: har indbinding af eksemplar @da
definition: Relaterer et eksemplar til et værk, som er en indbinding af et eksemplar. @da
toolkit label: indbinding af eksemplar @da
toolkit definition: Værk, som er en indbinding af et eksemplar. @da
label: eksemplari köide @et
definition: Seostab eksemplari teosega, mis on eksemplari köide. @et
toolkit label: eksemplari köide @et
toolkit definition: Teos, mis on eksemplari köide. @et
label: hat Einband eines Exemplars @de
definition: Setzt ein Exemplar in Beziehung zu einem einem Werk, bei dem es sich um den Einband eines Exemplars handelt. @de
toolkit label: Einband eines Exemplars @de
toolkit definition: Ein Werk, bei dem es sich um den Einband eines Exemplars handelt. @de
label: példány kötése a következő: @hu
definition: Hozzákapcsol egy példányt egy műhöz, amely egy példány kötése. @hu
toolkit label: példány kötése: @hu
toolkit definition: Egy mű, amely egy példány kötése. @hu
label: ha come rilegatura di item @it
definition: Correla un item un'opera che è una rilegatura di un item. @it
toolkit label: rilegatura di item @it
toolkit definition: Opera che è una rilegatura di un item. @it
label: vienības iesējums @lv
definition: Sasaista vienību ar darbu, kas ir vienības iesējums. @lv
toolkit label: vienības iesējums @lv
toolkit definition: Darbs, kas ir vienības iesējums. @lv
has subproperty: P40094
label: 有单件的装订 @zh-hans
definition: 将一个单件与作为一个单件的装订的一种作品关联起来。 @zh-hans
toolkit label: 单件的装订 @zh-hans
toolkit definition: 作为一个单件的装订的一种作品 @zh-hans
label: kopyanın ciltlenmesi ile ilişkilidir @tr
definition: Bir kopyayı, bir kopyanın ciltlemesi olan bir eserle ilişkilendirir. @tr
toolkit label: kopyanın ciltlenmesi @tr
toolkit definition: Bir kopyanın bağlantısı olan bir eser. @tr

est relié avec
status: Published
label: is bound with @en
definition: Relates an item to an item that is physically combined with an item to form a collection manifestation. @en
type: Property
domain: C10003
sub property of: est conservé avec
lexical alias: boundWith.en
toolkit label: bound with @en
toolkit definition: An item that is physically combined with an item to form a collection manifestation. @en
definition: Met un item en relation avec un item qui est physiquement combiné à un item pour former une manifestation de collection de ressources.
toolkit label: relié avec
toolkit definition: Item qui est physiquement combiné à un item pour former une manifestation de collection de ressources.
toolkit label: encuadernado con @es
toolkit definition: Un ítem que se ha incluido con la misma encuadernación que el ítem descrito. @es
instruction number: 24.5
label: được đóng với @vi
definition: Liên kết bản với bản được đóng lại cùng tập đóng với bản đang được mô tả. @vi
toolkit label: được đóng với @vi
toolkit definition: Bản được đóng lại cùng tập đóng với bản đang được mô tả. @vi
label: er indbundet sammen med @da
definition: Relaterer et eksemplar til et eksemplar, som er fysisk kombineret eller sat sammen med et eksemplar. @da
toolkit label: indbundet sammen med @da
toolkit definition: Eksemplar, som er fysisk kombineret eller sat sammen med et eksemplar. @da
label: ist eingebunden mit @de
definition: Setzt ein Exemplar in Beziehung zu einem Exemplar, das physisch mit einem Exemplar verbunden ist. @de
toolkit label: Eingebunden mit @de
toolkit definition: Ein Exemplar, das physisch mit einem Exemplar verbunden ist. @de
label: είναι δεμένο με @el
definition: Συνδέει ένα αντίτυπο με ένα αντίτυπο το οποίο έχει δεθεί μαζί με το περιγραφόμενο αντίτυπο. @el
toolkit label: δεμένο με @el
toolkit definition: Ένα αντίτυπο το οποίο έχει δεθεί μαζί με το περιγραφόμενο αντίτυπο. @el
label: és enquadernat amb @ca
definition: Relaciona un ítem amb un ítem que es combina físicament amb un ítem per formar una manifestació de col·lecció de recursos. @ca
toolkit label: enquadernat amb @ca
toolkit definition: Ítem que es combina físicament amb un ítem per formar una manifestació de col·lecció de recursos. @ca
definition: Liittää kappaleen kappaleeseen, joka on fyysisesti sidottu yhteen toisen samassa kokoelmassa olevan kappaleen kanssa. @fi
toolkit label: yhteensidottu @fi
toolkit definition: Kappale, joka on fyysisesti sidottu yhteen toisen samassa kokoelmassa olevan kappaleen kanssa. @fi
toolkit label: innbundet med @no
toolkit definition: Et eksemplar som er fysisk kombinert eller satt sammen med et eksemplar. @no
has element type: 2
label: egybekötve a következővel: @hu
definition: Hozzákapcsol egy példányt egy példányhoz, amelyet fizikailag hozzákapcsolnak vagy egyesítenek egy példánnyal. @hu
toolkit label: egybekötve a következővel: @hu
toolkit definition: Egy példány, amelyet fizikailag hozzákapcsolnak vagy egyesítenek egy példánnyal. @hu
label: yhteensidottu @fi
label: er innbundet med @no
definition: Relaterer et eksemplar til et eksemplar som er fysisk kombinert eller satt sammen med et eksemplar. @no
label: is gebonden met @nl
definition: Relateert een item aan een item dat fysiek gecombineerd of verenigd is met een item. @nl
toolkit label: gebonden met @nl
toolkit definition: Een item dat fysiek gecombineerd of verenigd is met een item. @nl
label: هي مرتبطة بـ @ar
definition: يربط مفردة بمفردة مدمجة أو مرتبطة مادياً بمفردة. @ar
toolkit label: مرتبطة بـ @ar
toolkit definition: مفردة مدمجة أو مرتبطة مادياً بمفردة. @ar
label: kokku köidetud eksemplariga @et
definition: Seostab eksemplari eksemplariga, mis on füüsiliselt ühendatud teise eksemplariga. @et
toolkit label: kokku köidetud eksemplariga @et
toolkit definition: Eksemplar, mis on füüsiliselt ühendatud teise eksemplariga. @et
label: è legato con @it
definition: Correla un item a un item fisicamente congiunto o unito a un item. @it
toolkit label: legato con @it
toolkit definition: Item fisicamente congiunto o unito a un item. @it
label: ir iesiets kopā ar @lv
definition: Sasaista vienību ar vienību, kas iesieta vienā iesējumā ar aprakstāmo vienību. @lv
toolkit label: iesiets kopā ar @lv
toolkit definition: Vienība, kas iesieta vienā iesējumā ar aprakstāmo vienību. @lv
has subproperty: P40032
label: 与……合订 @zh-hans
definition: 将一个单件与和一个单件在物理上结合起来形成一个收藏载体表现的一个单件关联起来。 @zh-hans
toolkit label: 与……合订 @zh-hans
toolkit definition: 和一个单件在物理上结合起来形成一个收藏载体表现的一个单件 @zh-hans
label: ile bağlanmıştır @tr
definition: Bir kopyayı, bir koleksiyon gösterimi oluşturmak için bir kopyayla fiziksel olarak birleştirilen bir kopyayla ilişkilendirir. @tr
toolkit label: ile bağlı @tr
toolkit definition: Bir koleksiyon gösterimi oluşturmak için bir kopyayla fiziksel olarak birleştirilen bir kopya. @tr

a pour catégorie d’item
status: Published
label: has category of item @en
lexical alias: categoryOfItem.en
definition: Relates an item to a type to which an item belongs. @en
alternative label: type of item @en
toolkit label: category of item @en
toolkit definition: A type to which an item belongs. @en
type: Property
domain: C10003
sub property of: P00029
has element type: 5
definition: Met un item en relation avec un type auquel un item appartient.
alternative label: type d’item
toolkit label: catégorie d’item
toolkit definition: Type auquel un item appartient.
label: kappaleen kategoria @fi
definition: Liittää kappaleen tyyppiin, johon kappale kuuluu. @fi
alternative label: kappaleen tyyppi @fi
toolkit label: kappaleen kategoria @fi
toolkit definition: Tyyppi, johon kappale kuuluu. @fi
label: har eksemplarkategori @no
definition: Relaterer et eksemplar til en type som et eksemplar tilhører. @no
alternative label: type eksemplar @no
toolkit label: eksemplarkategori @no
toolkit definition: En type som et eksemplar tilhører. @no
label: heeft categorie van item @nl
definition: Relateert een item aan een type waartoe een item behoort. @nl
toolkit label: categorie van item @nl
toolkit definition: Een type waartoe een item behoort. @nl
label: له فئة مفردة @ar
definition: يربط مفردة بنوع تنتمى إليه مفردة. @ar
alternative label: نوع مفردة @ar
toolkit label: فئة مفردة @ar
toolkit definition: نوع تنتمي إليه مفردة @ar
label: té com a categoria d’ítem @ca
definition: Relaciona un ítem amb un tipus al qual pertany un ítem. @ca
alternative label: tipus d’ítem @ca
toolkit label: categoria d’ítem @ca
toolkit definition: Tipus al qual pertany un ítem. @ca
label: har kategori af eksemplar @da
definition: Relaterer et eksemplar til en type, hvortil et eksemplar tilhører. @da
alternative label: type af eksemplar @da
toolkit label: kategori af eksemplar @da
toolkit definition: Type, hvortil et eksemplar tilhører. @da
label: eksemplari kategooria @et
definition: Seostab eksemplari tüübiga, millesse eksemplar kuulub. @et
alternative label: eksemplari tüüp @et
toolkit label: eksemplari kategooria @et
toolkit definition: Tüüp, millesse eksemplar kuulub. @et
label: hat Kategorie eines Exemplars @de
definition: Setzt ein Exemplar in Beziehung zu einer Art, zu der ein Exemplar gehört. @de
toolkit label: Kategorie eines Exemplars @de
toolkit definition: Eine Art, zu der ein Exemplar gehört. @de
label: példány kategóriája a következő: @hu
definition: Hozzákapcsol egy példányt egy típushoz, amelyhez a példány tartozik. @hu
alternative label: példány kategóriája: @hu
toolkit label: Egy típus, amelyhez a példány tartozik. @hu
toolkit definition: példány típusa: @hu
label: ha come categoria di item @it
definition: Correla un item a un tipo al quale un item appartiene. @it
alternative label: tipo @it
toolkit label: categoria di item @it
toolkit definition: Tipo al quale un item appartiene. @it
label: vienības kategorija @lv
definition: Sasaista vienību ar veidu, pie kura pieder vienība. @lv
toolkit label: vienības kategorija @lv
toolkit definition: Veids, pie kura pieder vienība. @lv
has subproperty: P40096
alternative label: 单件的类型 @zh-hans
label: 有单件的类别 @zh-hans
definition: 将一个单件与一个单件所属于的一种类型关联起来。 @zh-hans
toolkit label: 单件的类别 @zh-hans
toolkit definition: 一个单件所属于的一种类型 @zh-hans
alternative label: tipo de ítem @es
alternative label: kopyanın türü @tr
label: kopyanın kategorisi ile ilişkilidir @tr
definition: Bir kopyayı, kopyanın ait olduğu bir türle ilişkilendirir. @tr
toolkit label: kopya kategorisi @tr
toolkit definition: Bir kopyanın ait olduğu bir tür. @tr

a pour agent catalogueur d’une collection de ressources
label: has collection registrar agent (Deprecated) @en
definition: Relates an item to an agent who is a curator who lists or inventories items in a collection aggregate. (Deprecated) @en
type: Property
domain: C10003
sub property of: a pour agent conservateur
lexical alias: collectionRegistrarAgent.en
toolkit label: collection registrar agent (Deprecated) @en
toolkit definition: An agent who is a curator who lists or inventories items in a collection aggregate. (Deprecated) @en
definition: Met un item en relation avec un agent conservateur qui dresse une liste ou un inventaire des items faisant partie d’un agrégat par regroupement.
toolkit label: agent catalogueur d’une collection de ressources
toolkit definition: Agent conservateur qui dresse une liste ou un inventaire des items faisant partie d’un agrégat par regroupement.
toolkit label: conservador de colección @es
toolkit definition: Un conservador que lista o hace inventarios de ítems en una obra agregada tal como una colección de ítems u obras. @es
instruction number: 18.5
label: có người giữ bộ sưu tập @vi
definition: Liên kết bản với người giữ bộ sưu tập, người lập danh mục hoặc bản kê trong một tác phẩm gộp chung như là bộ sưu tập của các bản hoặc tác phẩm. @vi
toolkit label: người giữ bộ sưu tập @vi
toolkit definition: Người giữ bộ sưu tập, người lập danh mục hoặc bản kê trong một tác phẩm gộp chung như là bộ sưu tập của các bản hoặc tác phẩm. @vi
label: har agent, som er samlingsregistrator @da
definition: Relaterer et eksemplar til en agent, som er kurator, som listefører eller opgører en inventarliste over eksemplarer i et samlingsaggregat. @da
toolkit label: agent, som er samlingsregistrator @da
toolkit definition: Agent, som er kurator, som listefører eller opgører en inventarliste over eksemplarer i et samlingsaggregat. @da
label: hat Registrarin/Registrar (Akteur) @de
definition: Setzt ein Exemplar in Beziehung zu einer Kuratorin/einem Kurator (Akteur), die/der die Exemplare eines Sammlungsaggregats verzeichnet oder inventarisiert. @de
toolkit label: Registrarin/Registrar (Akteur) @de
toolkit definition: Eine Kuratorin/Ein Kurator (Akteur), die/der die Exemplare eines Sammlungsaggregats verzeichnet oder inventarisiert. @de
label: έχει υπεύθυνο γραμματείας της συλλογής @el
definition: Συνδέει ένα αντίτυπο με έναν έφορο ο οποίος απαριθμεί ή καταγράφει τα αντίτυπα σε ένα συγκεντρωτικό έργο, όπως μια συλλογή αντιτύπων ή έργων. @el
toolkit label: υπεύθυνος γραμματείας της συλλογής @el
toolkit definition: Ένας έφορος που απαριθμεί ή καταγράφει τα αντίτυπα σε ένα συγκεντρωτικό έργο, όπως μια συλλογή αντιτύπων ή έργων. @el
label: té com a agent conservador de col·leccions de recursos @ca
definition: Relaciona un ítem amb un agent que és un conservador que llista o inventaria els ítems en una col·lecció agregada. @ca
toolkit label: agent conservador de col·leccions de recursos @ca
toolkit definition: Agent que és un conservador que llista o inventaria els ítems en una col·lecció agregada. @ca
definition: Liittää kappaleen kuraattoriin, joka luetteloi tai inventoi kokoelma-aggregaatin kappaleet. @fi
toolkit label: kokoelman luetteloija (toimija) @fi
toolkit definition: Kuraattori, joka luetteloi tai inventoi kokoelma-aggregaatin kappaleet. @fi
toolkit label: samlingsregistrator (agent) @no
toolkit definition: En agent som er en kurator som lager lister eller oversikter over eksemplarene i en aggregert samling. @no
has element type: 2
label: gyűjtemény-nyilvántartó ágense a következő: @hu
definition: Hozzákapcsol egy példányt egy kurátor ágenshez, amely példányokat sorol fel vagy leltároz egy gyűjteményi aggregátumban. @hu
toolkit label: gyűjtemény-nyilvántartó ágens: @hu
toolkit definition: Egy kurátor ágens, amely példányokat sorol fel vagy leltároz egy gyűjteményi aggregátumban. @hu
alternative label: collection registrar @en
alternative label: agent conservateur d’une collection de ressources
alternative label: kokoelman luetteloija @fi
label: kokoelman luetteloija (toimija) @fi
label: har samlingsregistrator (agent) @no
definition: Relaterer et eksemplar til en agent som er en kurator som lager lister eller oversikter over eksemplarene i en aggregert samling. @no
alternative label: samlingsregistrator @no
label: heeft collectieregistrator-actor @nl
definition: Relateert een item aan een actor die een curator is die een lijst of inventaris aanlegt van items in een collectie-aggregaat. @nl
toolkit label: collectieregistrator-actor @nl
toolkit definition: Een actor die een curator is die een lijst of inventaris aanlegt van items in een collectie-aggregaat. @nl
label: له وكيل مسجل المجموعات @ar
definition: يربط مفردة بوكيل هو أمين متحف يقوم بتسجيل قوائم مفردات أو جردها لمجموعة مجمعة. @ar
alternative label: مُسجل مجموعة @ar
toolkit label: وكيل مُسجل جامع @ar
toolkit definition: وكيل هو أمين متحف يقوم بتسجيل قوائم مفردات أو جردها لمجموعة مجمعة. @ar
alternative label: conservador de col·leccions de recursos @ca
label: kogu registreerija (tegija) @et
definition: Seostab eksemplari tegijaga, kes kuraatorina loetleb või inventeerib liitumit moodustava kogu eksemplarid. @et
alternative label: kogu registreerija @et
toolkit label: kogu registreerija (tegija) @et
toolkit definition: Tegija, kes kuraatorina loetleb või inventeerib liitumit moodustava kogu eksemplarid. @et
alternative label: gyűjtemény-nyilvántartó: @hu
status: Deprecated
label: kolekcijas reģistrētājs (aģents) @lv
definition: Sasaista vienību ar aģentu, kas kolekciju apkopojumā uzskaita vai inventarizē vienības. @lv
toolkit label: kolekcijas reģistrētājs (aģents) @lv
toolkit definition: Aģents, kas kolekciju apkopojumā uzskaita vai inventarizē vienības. @lv
alternative label: Registrar @de
has subproperty: a pour agent collectif catalogueur d’une collection de ressources
has subproperty: a pour personne catalogueuse d’une collection de ressources
has subproperty: P40005

a pour agent collectif catalogueur d’une collection de ressources
label: has collection registrar collective agent (Deprecated) @en
lexical alias: collectionRegistrarCollectiveAgent.en
definition: Relates an item to a collective agent who is a curator who lists or inventories items in a collection aggregate. (Deprecated) @en
toolkit label: collection registrar collective agent (Deprecated) @en
toolkit definition: A collective agent who is a curator who lists or inventories items in a collection aggregate. (Deprecated) @en
type: Property
domain: C10003
has element type: 2
sub property of: a pour agent collectif conservateur
sub property of: a pour agent catalogueur d’une collection de ressources
definition: Met un item en relation avec un agent collectif conservateur qui dresse une liste ou un inventaire des items faisant partie d’un agrégat par regroupement.
toolkit label: agent collectif catalogueur d’une collection de ressources
toolkit definition: Agent collectif conservateur qui dresse une liste ou un inventaire des items faisant partie d’un agrégat par regroupement.
label: kokoelman luetteloija (yhteistoimija) @fi
definition: Liittää kappaleen kuraattorina toimivaan yhteistoimijaan, joka luetteloi tai inventoi kokoelma-aggregaatin kappaleet. @fi
toolkit label: kokoelman luetteloija (yhteistoimija) @fi
toolkit definition: Kuraattorina toimiva yhteistoimija, joka luetteloi tai inventoi kokoelma-aggregaatin kappaleet. @fi
label: har samlingsregistrator (kollektiv agent) @no
definition: Relaterer et eksemplar til en kollektiv agent som er en kurator som lager lister eller oversikter over eksemplarene i en aggregert samling. @no
toolkit label: samlingsregistrator (kollektiv agent) @no
toolkit definition: En kollektiv agent som er en kurator som lager lister eller oversikter over eksemplarene i en aggregert samling. @no
label: heeft collectieregistrator-collectieve actor @nl
definition: Relateert een item aan een collectieve actor die een curator is die een lijst of inventaris aanlegt van items in een collectie-aggregaat. @nl
toolkit label: collectieregistrator-collectieve actor @nl
toolkit definition: Een collectieve actor die een curator is die een lijst of inventaris aanlegt van items in een collectie-aggregaat. @nl
label: له وكيل جماعي مسجل المجموعات @ar
definition: يربط مفردة بوكيل جماعي هو أمين متحف يقوم بتسجيل قوائم مفردات أو جردها لمجموعة مجمعة. @ar
toolkit label: وكيل جماعي مسجل المجموعات @ar
toolkit definition: وكيل جماعي أمين متحف يسجل قوائم مفردات أو يجردها لمجموعة مجمعة. @ar
label: té com a agent col·lectiu conservador de col·leccions @ca
definition: Relaciona un ítem amb un agent col·lectiu que és un conservador que llista o inventaria els ítems en una col·lecció agregada. @ca
toolkit label: agent col·lectiu conservador de col·leccions @ca
toolkit definition: Agent col·lectiu que és un conservador que llista o inventaria els ítems en una col·lecció agregada. @ca
label: har kollektiv agent, som er samlingsregistrator @da
definition: Relaterer et eksemplar til en kollektiv agent, som er kurator, som listefører eller opgører en inventarliste over eksemplarer i et samlingsaggregat. @da
toolkit label: kollektiv agent, som er samlingsregistrator @da
toolkit definition: Kollektiv agent, som er kurator, som listefører eller opgører en inventarliste over eksemplarer i et samlingsaggregat. @da
label: kogu registreerija (kollektiiv) @et
definition: Seostab eksemplari kollektiiviga, kes kuraatorina loetleb või inventeerib kogu eksemplarid. @et
toolkit label: kogu registreerija (kollektiiv) @et
toolkit definition: Kollektiiv, kes kuraatorina loetleb või inventeerib kogu eksemplarid. @et
label: hat Registrarin/Registrar (Gemeinschaftlicher Akteur) @de
definition: Setzt ein Exemplar in Beziehung zu einer Kuratorin/einem Kurator (Gemeinschaftlicher Akteur), die/der die Exemplare in einem Sammlungsaggregat verzeichnet oder inventarisiert. @de
toolkit label: Registrarin/Registrar (Gemeinschaftlicher Akteur) @de
toolkit definition: Eine Kuratorin/Ein Kurator (Gemeinschaftlicher Akteur), die/der die Exemplare in einem Sammlungsaggregat verzeichnet oder inventarisiert. @de
label: gyűjtemény-nyilvántartó kollektív ágense a következő: @hu
definition: Hozzákapcsol egy példányt egy kurátor kollektív ágenshez, amely példányokat sorol fel vagy leltároz egy gyűjteményi aggregátumban. @hu
toolkit label: gyűjtemény-nyilvántartó kollektív ágense: @hu
toolkit definition: Egy kurátor kollektív ágens, amely példányokat sorol fel vagy leltároz egy gyűjteményi aggregátumban. @hu
label: ha come conservatore di collezione agente collettivo @it
definition: Correla un item all'agente collettivo curatore che elenca o inventaria gli item in un aggregato collezione. @it
toolkit label: conservatore di collezione agente collettivo @it
toolkit definition: Agente collettivo curatore che elenca o inventaria gli item in un aggregato collezione. @it
status: Deprecated
label: kolekcijas reģistrētājs (grupa) @lv
definition: Sasaista vienību ar grupu, kas kolekciju apkopojumā uzskaita vai inventarizē vienības. @lv
toolkit label: kolekcijas reģistrētājs (grupa) @lv
toolkit definition: Grupa, kas kolekciju apkopojumā uzskaita vai inventarizē vienības. @lv
alternative label: agent collectif conservateur d’une collection de ressources
has subproperty: a pour collectivité catalogueuse d’une collection de ressources
has subproperty: a pour famille catalogueuse d’une collection de ressources
has subproperty: P40122

a pour collectivité catalogueuse d’une collection de ressources
label: has collection registrar corporate body (Deprecated) @en
lexical alias: collectionRegistrarCorporateBody.en
definition: Relates an item to a corporate body who is a curator who lists or inventories items in a collection aggregate. (Deprecated) @en
toolkit label: collection registrar corporate body (Deprecated) @en
toolkit definition: A corporate body who is a curator who lists or inventories items in a collection aggregate. (Deprecated) @en
type: Property
domain: C10003
has element type: 2
sub property of: a pour collectivité conservatrice
sub property of: a pour agent collectif catalogueur d’une collection de ressources
definition: Met un item en relation avec une collectivité conservatrice qui dresse une liste ou un inventaire des items faisant partie d’un agrégat par regroupement.
toolkit label: collectivité catalogueuse d’une collection de ressources
toolkit definition: Collectivité conservatrice qui dresse une liste ou un inventaire des items faisant partie d’un agrégat par regroupement.
label: kokoelman luetteloija (yhteisö) @fi
definition: Liittää kappaleen kuraattorina toimivaan yhteisöön, joka luetteloi tai inventoi kokoelma-aggregaatin kappaleet. @fi
toolkit label: kokoelman luetteloija (yhteisö) @fi
toolkit definition: Kuraattorina toimiva yhteisö, joka luetteloi tai inventoi kokoelma-aggregaatin kappaleet. @fi
label: har samlingsregistrator (korporasjon) @no
definition: Relaterer et eksemplar til en korporasjon som er en kurator som lager lister eller oversikter over eksemplarene i en aggregert samling. @no
toolkit label: samlingsregistrator (korporasjon) @no
toolkit definition: En korporasjon som er en kurator som lager lister eller oversikter over eksemplarene i en aggregert samling. @no
label: heeft collectieregistrator-corporatie @nl
definition: Relateert een item aan een corporatie die een curator is die een lijst of inventaris aanlegt van items in een collectie-aggregaat. @nl
toolkit label: collectieregistrator-corporatie @nl
toolkit definition: Een corporatie die een curator is die een lijst of inventaris aanlegt van items in een collectie-aggregaat. @nl
label: té com a entitat corporativa conservadora de col·leccions @ca
definition: Relaciona un ítem amb una entitat corporativa que és un conservador que llista o inventaria els ítems en una col·lecció agregada. @ca
toolkit label: entitat corporativa conservadora de col·leccions @ca
toolkit definition: Entitat corporativa que és un conservador que llista o inventaria els ítems en una col·lecció agregada. @ca
label: har korporation, som er samlingsregistrator @da
definition: Relaterer et eksemplar til en korporation, som er kurator, som listefører eller opgører en inventarliste over eksemplarer i et samlingsaggregat. @da
toolkit label: korporation, som er samlingsregistrator @da
toolkit definition: Korporation, som er kurator, som listefører eller opgører en inventarliste over eksemplarer i et samlingsaggregat. @da
label: kogu registreerija (asutus) @et
definition: Seostab eksemplari asutusega, kes kuraatorina loetleb või inventeerib kogu eksemplarid. @et
toolkit label: kogu registreerija (asutus) @et
toolkit definition: Asutus, kes kuraatorina loetleb või inventeerib kogu eksemplarid. @et
label: hat Registrarin/Registrar (Körperschaft) @de
definition: Setzt ein Exemplar in Beziehung zu einer Kuratorin/einem Kurator (Körperschaft), die/der die Exemplare in einem Sammlungsaggregat verzeichnet oder inventarisiert. @de
toolkit label: Registrarin/Registrar (Körperschaft) @de
toolkit definition: Eine Kuratorin/Ein Kurator (Körperschaft), die/der die Exemplare in einem Sammlungsaggregat verzeichnet oder inventarisiert. @de
label: gyűjtemény-nyilvántartó testülete a következő: @hu
definition: Hozzákapcsol egy példányt egy kurátor testülethez, amely példányokat sorol fel vagy leltároz egy gyűjteményi aggregátumban. @hu
toolkit label: gyűjtemény-nyilvántartó testület: @hu
toolkit definition: Egy kurátor testület, amely példányokat sorol fel vagy leltároz egy gyűjteményi aggregátumban. @hu
label: ha come conservatore di collezione ente @it
definition: Correla un item all'ente curatore che elenca o inventaria gli item in un aggregato collezione. @it
toolkit label: conservatore di collezione ente @it
toolkit definition: Ente curatore che elenca o inventaria gli item in un aggregato collezione. @it
status: Deprecated
label: kolekcijas reģistrētājs (institūcija) @lv
definition: Sasaista vienību ar institūciju, kas kolekciju apkopojumā uzskaita vai inventarizē vienības. @lv
toolkit label: kolekcijas reģistrētājs (institūcija) @lv
toolkit definition: Institūcija, kas kolekciju apkopojumā uzskaita vai inventarizē vienības. @lv
alternative label: collectivité conservatrice d’une collection de ressources
label: هي هيئة مسجلة المجموعات لـ @ar
definition: يربط مفردة بهيئة هي أمينة متحف تقوم بتسجيل قوائم مفردات أو جردها لمجموعة مجمعة. @ar
toolkit label: هيئة مسجلة المجموعات @ar
toolkit definition: هيئة أمينة متحف تقوم بتسجيل قوائم مفردات أو جردها لمجموعة مجمعة. @ar
has subproperty: P40138

a pour famille catalogueuse d’une collection de ressources
label: has collection registrar family (Deprecated) @en
lexical alias: collectionRegistrarFamily.en
definition: Relates an item to a family who is a curator who lists or inventories items in a collection aggregate. (Deprecated) @en
toolkit label: collection registrar family (Deprecated) @en
toolkit definition: A family who is a curator who lists or inventories items in a collection aggregate. (Deprecated) @en
type: Property
domain: C10003
has element type: 2
sub property of: a pour famille conservatrice
sub property of: a pour agent collectif catalogueur d’une collection de ressources
definition: Met un item en relation avec une famille conservatrice qui dresse une liste ou un inventaire des items faisant partie d’un agrégat par regroupement.
toolkit label: famille catalogueuse d’une collection de ressources
toolkit definition: Famille conservatrice qui dresse une liste ou un inventaire des items faisant partie d’un agrégat par regroupement.
label: kokoelman luetteloija (suku) @fi
definition: Liittää kappaleen kuraattorina toimivaan sukuun, joka luetteloi tai inventoi kokoelma-aggregaatin kappaleet. @fi
toolkit label: kokoelman luetteloija (suku) @fi
toolkit definition: Kuraattorina toimiva suku, joka luetteloi tai inventoi kokoelma-aggregaatin kappaleet. @fi
label: har samlingsregistrator (familie) @no
definition: Relaterer et eksemplar til en familie som er en kurator som lager lister eller oversikter over eksemplarene i en aggregert samling. @no
toolkit label: samlingsregistrator (familie) @no
toolkit definition: En familie som er en kurator som lager lister eller oversikter over eksemplarene i en aggregert samling. @no
label: heeft collectieregistrator-familie @nl
definition: Relateert een item aan een familie die een curator is die een lijst of inventaris aanlegt van items in een collectie-aggregaat. @nl
toolkit label: collectieregistrator-familie @nl
toolkit definition: Een familie die een curator is die een lijst of inventaris aanlegt van items in een collectie-aggregaat. @nl
label: té com a família conservadora de col·leccions @ca
definition: Relaciona un ítem amb una família que és un conservador que llista o inventaria els ítems en una col·lecció agregada. @ca
toolkit label: família conservadora de col·leccions @ca
toolkit definition: Família que és un conservador que llista o inventaria els ítems en una col·lecció agregada. @ca
label: har familie, som er samlingsregistrator @da
definition: Relaterer et eksemplar til en familie, som er kurator, som listefører eller opgører en inventarliste over eksemplarer i et samlingsaggregat. @da
toolkit label: familie, som er samlingsregistrator @da
toolkit definition: Familie, som er kurator, som listefører eller opgører en inventarliste over eksemplarer i et samlingsaggregat. @da
label: kogu registreerija (perekond) @et
definition: Seostab eksemplari perekonnaga, kes kuraatorina loetleb või inventeerib kogu eksemplarid. @et
toolkit label: kogu registreerija (perekond) @et
toolkit definition: Perekond, kes kuraatorina loetleb või inventeerib kogu eksemplarid. @et
label: hat Registrarin/Registrar (Familie) @de
definition: Setzt ein Exemplar in Beziehung zu einer Kuratorin/einem Kurator (Familie), die die Exemplare in einem Sammlungsaggregat verzeichnet oder inventarisiert. @de
toolkit label: Registrarin/Registrar (Familie) @de
toolkit definition: Eine Kuratorin/Ein Kurator (Familie), die die Exemplare in einem Sammlungsaggregat verzeichnet oder inventarisiert. @de
label: gyűjtemény-nyilvántartó családja a következő: @hu
definition: Hozzákapcsol egy példányt egy kurátor családhoz, amely példányokat sorol fel vagy leltároz egy gyűjteményi aggregátumban. @hu
toolkit label: gyűjtemény-nyilvántartó család: @hu
toolkit definition: Egy kurátor család, amely példányokat sorol fel vagy leltároz egy gyűjteményi aggregátumban. @hu
label: ha come conservatore di collezione famiglia @it
definition: Correla un item alla famiglia curatore che elenca o inventaria gli item in un aggregato collezione. @it
toolkit label: conservatore di collezione famiglia @it
toolkit definition: Famiglia curatore che elenca o inventaria gli item in un aggregato collezione. @it
status: Deprecated
label: kolekcijas reģistrētājs (dzimta/ģimene) @lv
definition: Sasaista vienību ar dzimtu/ģimeni, kas kolekciju apkopojumā uzskaita vai inventarizē vienības. @lv
toolkit label: kolekcijas reģistrētājs (dzimta/ģimene) @lv
toolkit definition: Dzimta/ģimene, kas kolekciju apkopojumā uzskaita vai inventarizē vienības. @lv
alternative label: famille conservatrice d’une collection de ressources
label: له عائلة مسجِلة المجموعات @ar
definition: يربط مفردة عائلة هي أمينة متحف تقوم بتسجيل قوائم مفردات أو بجردها في مجموعة مجمعة. @ar
toolkit label: عائلة مسجلة المجموعات @ar
toolkit definition: عائلة أمين متحف تقوم بتسجيل قوائم مفردات أو بجردها في مجموعة مجمعة. @ar
has subproperty: P40154

a pour personne catalogueuse d’une collection de ressources
label: has collection registrar person (Deprecated) @en
lexical alias: collectionRegistrarPerson.en
definition: Relates an item to a person who is a curator who lists or inventories items in a collection aggregate. (Deprecated) @en
toolkit label: collection registrar person (Deprecated) @en
toolkit definition: A person who is a curator who lists or inventories items in a collection aggregate. (Deprecated) @en
type: Property
domain: C10003
has element type: 2
sub property of: a pour personne conservatrice
sub property of: a pour agent catalogueur d’une collection de ressources
definition: Met un item en relation avec une personne conservatrice qui dresse une liste ou un inventaire des items faisant partie d’un agrégat par regroupement.
toolkit label: personne catalogueuse d’une collection de ressources
toolkit definition: Personne conservatrice qui dresse une liste ou un inventaire des items faisant partie d’un agrégat par regroupement.
label: kokoelman luetteloija (henkilö) @fi
definition: Liittää kappaleen kuraattorina toimivaan henkilöön, joka luetteloi tai inventoi kokoelma-aggregaatin kappaleet. @fi
toolkit label: kokoelman luetteloija (henkilö) @fi
toolkit definition: Kuraattorina toimiva henkilö, joka luetteloi tai inventoi kokoelma-aggregaatin kappaleet. @fi
label: har samlingsregistrator (person) @no
definition: Relaterer et eksemplar til en person som er en kurator som lager lister eller oversikter over eksemplarene i en aggregert samling. @no
toolkit label: samlingsregistrator (person) @no
toolkit definition: En person som er en kurator som lager lister eller oversikter over eksemplarene i en aggregert samling. @no
label: heeft collectieregistrator-persoon @nl
definition: Relateert een item aan een persoon die een curator is die een lijst of inventaris aanlegt van items in een collectie-aggregaat. @nl
toolkit label: collectieregistrator-persoon @nl
toolkit definition: Een persoon die een curator is die een lijst of inventaris aanlegt van items in een collectie-aggregaat. @nl
label: له شخص مسجِل المجموعات @ar
definition: يربط مفردة بشخص هو أمين متحف يقوم بتسجيل قوائم مفردات أو بجردها في مجموعة مجمعة. @ar
toolkit label: شخص مسجل المجموعات @ar
toolkit definition: شخص هو أمين متحف يقوم بتسجيل قوائم مفردات أو بجردها في مجموعة مجمعة. @ar
label: té com a persona conservadora de col·leccions @ca
definition: Relaciona un ítem amb una persona que és un conservador que llista o inventaria els ítems en una col·lecció agregada. @ca
toolkit label: persona conservadora de col·leccions @ca
toolkit definition: Persona que és un conservador que llista o inventaria els ítems en una col·lecció agregada. @ca
label: har person, som er samlingsregistrator @da
definition: Relaterer et eksemplar til en person, som er kurator, som listefører eller opgører en inventarliste over eksemplarer i et samlingsaggregat. @da
toolkit label: person, som er samlingsregistrator @da
toolkit definition: Person, som er kurator, som listefører eller opgører en inventarliste over eksemplarer i et samlingsaggregat. @da
label: kogu registreerija (isik) @et
definition: Seostab eksemplari isikuga, kes kuraatorina loetleb või inventeerib kogu eksemplarid. @et
toolkit label: kogu registreerija (isik) @et
toolkit definition: Isik, kes kuraatorina loetleb või inventeerib kogu eksemplarid. @et
label: hat Registrarin/Registrar (Person) @de
definition: Setzt ein Exemplar in Beziehung zu einer Kuratorin/einem Kurator (Person), die/der die Exemplare eines Sammlungsaggregats verzeichnet oder inventarisiert. @de
toolkit label: Registrarin/Registrar (Person) @de
toolkit definition: Eine Kuratorin/Ein Kurator (Person), die/der die Exemplare eines Sammlungsaggregats verzeichnet oder inventarisiert. @de
label: gyűjtemény-nyilvántartó személye a következő: @hu
definition: Hozzákapcsol egy példányt egy kurátor személyhez, aki példányokat sorol fel vagy leltároz egy gyűjteményi aggregátumban. @hu
toolkit label: gyűjtemény-nyilvántartó személy: @hu
toolkit definition: Egy kurátor személy, aki példányokat sorol fel vagy leltároz egy gyűjteményi aggregátumban. @hu
label: ha come conservatore di collezione persona @it
definition: Correla un item al curatore persona che elenca o inventaria gli item in un aggregato collezione. @it
toolkit label: persona conservatrice di collezione @it
toolkit definition: Curatore persona che elenca o inventaria gli item in un aggregato collezione. @it
status: Deprecated
label: kolekcijas reģistrētājs (persona) @lv
definition: Sasaista vienību ar personu, kura kolekciju apkopojumā uzskaita vai inventarizē vienības. @lv
toolkit label: kolekcijas reģistrētājs (persona) @lv
toolkit definition: Persona, kura kolekciju apkopojumā uzskaita vai inventarizē vienības. @lv
alternative label: personne conservatrice d’une collection de ressources
has subproperty: P40106

a pour agent collectionneur
label: has collector agent (Deprecated) @en
definition: Relates an item to an agent who is a curator who brings together items from various sources that are arranged, described, or catalogued as a collection. @en
type: Property
domain: C10003
sub property of: a pour agent conservateur
lexical alias: collectorAgent.en
toolkit label: collector agent (Deprecated) @en
toolkit definition: An agent who is a curator who brings together items from various sources that are arranged, described, or catalogued as a collection. (Deprecated) @en
definition: Met un item en relation avec un agent conservateur qui rassemble des items de diverses sources qui sont arrangés, décrits et catalogués comme une collection.
toolkit label: agent collectionneur
toolkit definition: Agent conservateur qui rassemble des items de diverses sources qui sont arrangés, décrits et catalogués comme une collection.
toolkit label: coleccionista @es
toolkit definition: Un conservador que reúne ítems de varias fuentes que luego se arreglan, describen y catalogan como una colección. @es
instruction number: 18.5
label: có người thu thập @vi
definition: Liên kết bản với người thu thập gop góp các bản từ các nguồn khác nhau sau đó sắp xếp, mô tả, và lập mục lục như là bộ sưu tập. @vi
toolkit label: người thu thập @vi
toolkit definition: Người thu thập gop góp các bản từ các nguồn khác nhau sau đó sắp xếp, mô tả, và lập mục lục như là bộ sưu tập. @vi
label: har agent, som er samler @da
definition: Relaterer et eksemplar til en agent, som er kurator, som indsamler eksemplarer fra forskellige kilder, som bliver arrangeret, beskrevet eller katalogiseret som en samling. @da
toolkit label: agent, som er samler @da
toolkit definition: Agent, som er kurator, som indsamler eksemplarer fra forskellige kilder, som bliver arrangeret, beskrevet eller katalogiseret som en samling. @da
label: hat Sammlerin/Sammler (Akteur) @de
definition: Setzt ein Exemplar in Beziehung zu einer Kuratorin/einem Kurator (Akteur), die/der Materialien aus unterschiedlichen Quellen zusammenträgt, die dann als Sammlung geordnet, beschrieben oder katalogisiert werden. @de
toolkit label: Sammlerin/Sammler (Akteur) @de
toolkit definition: Eine Kuratorin/Ein Kurator (Akteur), die/der Materialien aus unterschiedlichen Quellen zusammenträgt, die dann als Sammlung geordnet, beschrieben oder katalogisiert werden. @de
label: έχει συλλέκτη @el
definition: Συνδέει ένα αντίτυπο με έναν έφορο που συγκεντρώνει αντίτυπα από διάφορες πηγές τα οποία κατόπιν οργανώνονται, περιγράφονται και καταλογογραφούνται ως συλλογή. @el
toolkit label: συλλέκτης @el
toolkit definition: Ένας έφορος που συγκεντρώνει αντίτυπα από διάφορες πηγές, τα οποία κατόπιν οργανώνονται, περιγράφονται και καταλογογραφούνται ως συλλογή. @el
label: té com a agent col·leccionista @ca
definition: Relaciona un ítem amb un agent que és un conservador que aplega ítems de diverses fonts que s’arrangen, es descriuen o es cataloguen com una col·lecció. @ca
toolkit label: agent col·leccionista @ca
toolkit definition: Agent que és un conservador que aplega ítems de diverses fonts que s’arrangen, es descriuen o es cataloguen com una col·lecció. @ca
definition: Liittää kappaleen kuraattoriin, joka kokoaa eri lähteistä järjestettävät, kuvailtavat ja luetteloitavat kappaleet kokoelmaksi. @fi
toolkit label: kokoelman muodostaja (toimija) @fi
toolkit definition: Kuraattori, joka kokoaa eri lähteistä järjestettävät, kuvailtavat ja luetteloitavat kappaleet kokoelmaksi. @fi
toolkit label: samler (agent) @no
toolkit definition: En agent som er en kurator som setter sammen eksemplarer fra ulike kilder og som er arrangert, beskrevet eller katalogisert som en samling. @no
has element type: 2
label: kollektor ágense a következő: @hu
definition: Hozzákapcsol egy példányt egy kurátor ágenshez, amely különböző forrásokból származó, gyűjteményként rendezett, leírt és katalogizált példányokat fog össze. @hu
toolkit label: kollektor ágens: @hu
toolkit definition: Egy kurátor ágens, amely különböző forrásokból származó, gyűjteményként rendezett, leírt és katalogizált példányokat fog össze. @hu
alternative label: collector @en
alternative label: collectionneur
alternative label: kokoelman muodostaja @fi
label: kokoelman muodostaja (toimija) @fi
label: har samler (agent) @no
definition: Relaterer et eksemplar til en agent som er en kurator som setter sammen eksemplarer fra ulike kilder og som er arrangert, beskrevet eller katalogisert som en samling. @no
alternative label: samler @no
label: heeft verzamelaar-actor @nl
definition: Relateert een item aan een actor die een curator is die items samenbrengt uit diverse bronnen die gerangschikt, beschreven of gecatalogiseerd zijn als een collectie. @nl
toolkit label: verzamelaar-actor @nl
toolkit definition: Een actor die een curator is die items samenbrengt uit diverse bronnen die gerangschikt, beschreven of gecatalogiseerd zijn als een collectie. @nl
label: له وكيل جامع @ar
definition: يربط مفردة بوكيل هو أمين متحف يجمع مفردات معاً من مصادر مختلفة رتُبت، أو وُصفت، أو فُهرست كمجموعة. @ar
alternative label: جامع @ar
toolkit label: وكيل جامع @ar
toolkit definition: وكيل هو أمين متحف يجمع مفردات معاً من مصادر مختلفة رتُبت، أو وُصفت، أو فُهرست كمجموعة. @ar
alternative label: col·leccionista @ca
label: kogu moodustaja (tegija) @et
definition: Seostab eksemplari tegijaga, kes kuraatorina kogub eri allikatest kokku eksemplarid, mis korrastatakse, kirjeldatakse või kataloogitakse koguna. @et
alternative label: kogu moodustaja @et
alternative label: koguja @et
toolkit label: kogu moodustaja (tegija) @et
toolkit definition: Tegija, kes kuraatorina kogub eri allikatest kokku eksemplarid, mis korrastatakse, kirjeldatakse või kataloogitakse koguna. @et
alternative label: kollektor: @hu
label: Ha come collezionista agente @it
definition: Correla un item all'agente curatore che raccoglie item da varie fonti, che sono organizzati, descritti o catalogati come una collezione. @it
alternative label: collezionista @it
toolkit label: collezionista agente @it
toolkit definition: Agente curatore, che riunisce da fonti diverse item organizzati, descritti o catalogati come una raccolta. @it
status: Deprecated
label: kolekcionārs (aģents) @lv
definition: Sasaista vienību ar aģentu, kas apkopo vienības no dažādiem avotiem, kas ir sakārtotas, aprakstītas vai kataloģizētas kā kolekcija. @lv
toolkit label: kolekcionārs (aģents) @lv
toolkit definition: Aģents, kas apkopo vienības no dažādiem avotiem, kas ir sakārtotas, aprakstītas vai kataloģizētas kā kolekcija. @lv
alternative label: Sammler @de
has subproperty: a pour agent collectif collectionneur

a pour agent collectif collectionneur
label: has collector collective agent (Deprecated) @en
lexical alias: collectorCollectiveAgent.en
definition: Relates an item to a collective agent who is a curator who brings together items from various sources that are arranged, described, or catalogued as a collection. (Deprecated) @en
toolkit label: collector collective agent (Deprecated) @en
toolkit definition: A collective agent who is a curator who brings together items from various sources that are arranged, described, or catalogued as a collection. (Deprecated) @en
type: Property
domain: C10003
has element type: 2
sub property of: a pour agent collectif conservateur
sub property of: a pour agent collectionneur
definition: Met un item en relation avec un agent collectif conservateur qui rassemble des items de diverses sources qui sont arrangés, décrits et catalogués comme une collection.
toolkit label: agent collectif collectionneur
toolkit definition: Agent collectif conservateur qui rassemble des items de diverses sources qui sont arrangés, décrits et catalogués comme une collection.
label: kokoelman muodostaja (yhteistoimija) @fi
definition: Liittää kappaleen kuraattorina toimivaan yhteistoimijaan, joka kokoaa eri lähteistä järjestettävät, kuvailtavat ja luetteloitavat kappaleet kokoelmaksi. @fi
toolkit label: kokoelman muodostaja (yhteistoimija) @fi
toolkit definition: Kuraattorina toimiva yhteistoimija, joka kokoaa eri lähteistä järjestettävät, kuvailtavat ja luetteloitavat kappaleet kokoelmaksi. @fi
label: har samler (kollektiv agent) @no
definition: Relaterer et eksemplar til en kollektiv agent som er en kurator som setter sammen eksemplarer fra ulike kilder og som er arrangert, beskrevet eller katalogisert som en samling. @no
toolkit label: samler (kollektiv agent) @no
toolkit definition: En kollektiv agent som er en kurator som setter sammen eksemplarer fra ulike kilder og som er arrangert, beskrevet eller katalogisert som en samling. @no
label: heeft verzamelaar-collectieve actor @nl
definition: Relateert een item aan een collectieve actor die een curator is die items samenbrengt uit diverse bronnen die gerangschikt, beschreven of gecatalogiseerd zijn als een collectie. @nl
toolkit label: verzamelaar-collectieve actor @nl
toolkit definition: Een collectieve actor die een curator is die items samenbrengt uit diverse bronnen die gerangschikt, beschreven of gecatalogiseerd zijn als een collectie. @nl
label: té com a agent col·lectiu col·leccionista @ca
definition: Relaciona un ítem amb un agent col·lectiu que és un conservador que aplega ítems de diverses fonts que s’arrangen, es descriuen o es cataloguen com una col·lecció. @ca
toolkit label: agent col·lectiu col·leccionista @ca
toolkit definition: Agent col·lectiu que és un conservador que aplega ítems de diverses fonts que s’arrangen, es descriuen o es cataloguen com una col·lecció. @ca
label: har kollektiv agent, som er samler @da
definition: Relaterer et eksemplar til en kollektiv agent, som er kurator, som indsamler eksemplarer fra forskellige kilder, som bliver arrangeret, beskrevet eller katalogiseret som en samling. @da
toolkit label: kollektiv agent, som er samler @da
toolkit definition: Kollektiv agent, som er kurator, som indsamler eksemplarer fra forskellige kilder, som bliver arrangeret, beskrevet eller katalogiseret som en samling. @da
label: kogu moodustaja (kollektiiv) @et
definition: Seostab eksemplari kollektiiviga, kes kuraatorina kogub eri allikatest kokku eksemplarid, mis korrastatakse, kirjeldatakse või kataloogitakse koguna. @et
toolkit label: kogu moodustaja (kollektiiv) @et
toolkit definition: Kollektiiv, kes kuraatorina kogub eri allikatest kokku eksemplarid, mis korrastatakse, kirjeldatakse või kataloogitakse koguna. @et
label: hat Sammlerin/Sammler (Gemeinschaftlicher Akteur) @de
definition: Setzt ein Exemplar in Beziehung zu einer Kuratorin/einem Kurator (Gemeinschaftlicher Akteur), die/der Materialien aus unterschiedlichen Quellen zusammenträgt, die dann als Sammlung geordnet, beschrieben oder katalogisiert werden. @de
toolkit label: Sammlerin/Sammler (Gemeinschaftlicher Akteur) @de
toolkit definition: Eine Kuratorin/Ein Kurator (Gemeinschaftlicher Akteur), die/der Materialien aus unterschiedlichen Quellen zusammenträgt, die dann als Sammlung geordnet, beschrieben oder katalogisiert werden. @de
label: kollektor kollektív ágense a következő: @hu
definition: Hozzákapcsol egy példányt egy kurátor kollektív ágenshez, amely különböző forrásokból származó, gyűjteményként rendezett, leírt és katalogizált példányokat fog össze. @hu
toolkit label: kollektor kollektív ágense: @hu
toolkit definition: Egy kurátor kollektív ágens, amely különböző forrásokból származó, gyűjteményként rendezett, leírt és katalogizált példányokat fog össze. @hu
label: ha come collezionista agente collettivo @it
definition: Correla un item all'agente collettivo curatore che raccoglie item da varie fonti, che sono organizzati, descritti o catalogati come una collezione. @it
toolkit label: collezionista agente collettivo @it
toolkit definition: Agente collettivo curatore che raccoglie item da varie fonti, che sono organizzati, descritti o catalogati come una collezione. @it
status: Deprecated
label: kolekcionārs (grupa) @lv
definition: Sasaista vienību ar grupu, kas apkopo vienības no dažādiem avotiem, kas ir sakārtotas, aprakstītas vai kataloģizētas kā kolekcija. @lv
toolkit label: kolekcionārs (grupa) @lv
toolkit definition: Grupa, kas apkopo vienības no dažādiem avotiem, kas ir sakārtotas, aprakstītas vai kataloģizētas kā kolekcija. @lv
label: له وكيل جماعي جامع @ar
definition: يربط مفردة بوكيل هو أمين متحف يجمع مفردات معاً من مصادر مختلفة رتُبت، أو وُصفت، أو فُهرست كمجموعة. @ar
toolkit label: وكيل جماعي جامع @ar
toolkit definition: وكيل هو أمين متحف يجمع مفردات معاً من مصادر مختلفة رتُبت، أو وُصفت، أو فُهرست كمجموعة. @ar
has subproperty: a pour collectivité collectionneuse
has subproperty: a pour famille collectionneuse
has subproperty: P40121

a pour collectivité collectionneuse
label: has collector corporate body (Deprecated) @en
lexical alias: collectorCorporateBody.en
definition: Relates an item to a corporate body who is a curator who brings together items from various sources that are arranged, described, or catalogued as a collection. (Deprecated) @en
toolkit label: collector corporate body (Deprecated) @en
toolkit definition: A corporate body who is a curator who brings together items from various sources that are arranged, described, or catalogued as a collection. (Deprecated) @en
type: Property
domain: C10003
has element type: 2
sub property of: a pour collectivité conservatrice
sub property of: a pour agent collectif collectionneur
definition: Met un item en relation avec une collectivité conservatrice qui rassemble des items de diverses sources qui sont arrangés, décrits et catalogués comme une collection.
toolkit label: collectivité collectionneuse
toolkit definition: Collectivité conservatrice qui rassemble des items de diverses sources qui sont arrangés, décrits et catalogués comme une collection.
label: kokoelman muodostaja (yhteisö) @fi
definition: Liittää kappaleen kuraattorina toimivaan yhteisöön, joka kokoaa eri lähteistä järjestettävät, kuvailtavat ja luetteloitavat kappaleet kokoelmaksi. @fi
toolkit label: kokoelman muodostaja (yhteisö) @fi
toolkit definition: Kuraattorina toimiva yhteisö, joka kokoaa eri lähteistä järjestettävät, kuvailtavat ja luetteloitavat kappaleet kokoelmaksi. @fi
label: har samler (korporasjon) @no
definition: Relaterer et eksemplar til en korporasjon som er en kurator som setter sammen eksemplarer fra ulike kilder og som er arrangert, beskrevet eller katalogisert som en samling. @no
toolkit label: samler (korporasjon) @no
toolkit definition: En korporasjon som er en kurator som setter sammen eksemplarer fra ulike kilder og som er arrangert, beskrevet eller katalogisert som en samling. @no
label: heeft verzamelaar-corporatie @nl
definition: Relateert een item aan een corporatie die een curator is die items samenbrengt uit diverse bronnen die gerangschikt, beschreven of gecatalogiseerd zijn als een collectie. @nl
toolkit label: verzamelaar-corporatie @nl
toolkit definition: Een corporatie die een curator is die items samenbrengt uit diverse bronnen die gerangschikt, beschreven of gecatalogiseerd zijn als een collectie. @nl
label: له هيئة تجميع @ar
definition: يربط مفردة بهيئة هي أمينة متحف تجمع معاً مفردات من مصادر مختلفة رتُبت، أو وُصفت، أو فُهرست كمجموعة. @ar
toolkit label: هيئة جامعة @ar
toolkit definition: هيئة هي أمينة متحف تجمع معاً مفردات من مصادر مختلفة رتُبت، أو وُصفت، أو فُهرست كمجموعة. @ar
label: té com a entitat corporativa col·leccionista @ca
definition: Relaciona un ítem amb una entitat corporativa que és un conservador que aplega ítems de diverses fonts que s’arrangen, es descriuen o es cataloguen com una col·lecció. @ca
toolkit label: entitat corporativa col·leccionista @ca
toolkit definition: Entitat corporativa que és un conservador que aplega ítems de diverses fonts que s’arrangen, es descriuen o es cataloguen com una col·lecció. @ca
label: har korporation, som er samler @da
definition: Relaterer et eksemplar til en korporation, som er kurator, som indsamler eksemplarer fra forskellige kilder, som bliver arrangeret, beskrevet eller katalogiseret som en samling. @da
toolkit label: korporation, som er samler @da
toolkit definition: Korporation, som er kurator, som indsamler eksemplarer fra forskellige kilder, som bliver arrangeret, beskrevet eller katalogiseret som en samling. @da
label: kogu moodustaja (asutus) @et
definition: Seostab eksemplari asutusega, kes kuraatorina kogub eri allikatest kokku eksemplarid, mis korrastatakse, kirjeldatakse või kataloogitakse koguna. @et
toolkit label: kogu moodustaja (asutus) @et
toolkit definition: Asutus, kes kuraatorina kogub eri allikatest kokku eksemplarid, mis korrastatakse, kirjeldatakse või kataloogitakse koguna. @et
label: hat Sammlerin/Sammler (Körperschaft) @de
definition: Setzt ein Exemplar in Beziehung zu einer Kuratorin/einem Kurator (Körperschaft), die/der Materialien aus unterschiedlichen Quellen zusammenträgt, die dann als Sammlung geordnet, beschrieben oder katalogisiert werden. @de
toolkit label: Sammlerin/Sammler (Körperschaft) @de
toolkit definition: Eine Kuratorin/Ein Kurator (Körperschaft), die/der Materialien aus unterschiedlichen Quellen zusammenträgt, die dann als Sammlung geordnet, beschrieben oder katalogisiert werden. @de
label: kollektor testülete a következő: @hu
definition: Hozzákapcsol egy példányt egy kurátor testülethez, amely különböző forrásokból származó, gyűjteményként rendezett, leírt és katalogizált példányokat fog össze. @hu
toolkit label: kollektor testület: @hu
toolkit definition: Egy kurátor testület, amely különböző forrásokból származó, gyűjteményként rendezett, leírt és katalogizált példányokat fog össze. @hu
label: ha come collezionista ente @it
definition: Correla un item all'ente curatore che raccoglie item da varie fonti, che sono organizzati, descritti o catalogati come una collezione. @it
toolkit label: collezionista ente @it
toolkit definition: Ente curatore che raccoglie item da varie fonti, che sono organizzati, descritti o catalogati come una collezione. @it
status: Deprecated
label: kolekcionārs (institūcija) @lv
definition: Sasaista vienību ar institūciju, kas apkopo vienības no dažādiem avotiem, kas ir sakārtotas, aprakstītas vai kataloģizētas kā kolekcija. @lv
toolkit label: kolekcionārs (institūcija) @lv
toolkit definition: Institūcija, kas apkopo vienības no dažādiem avotiem, kas ir sakārtotas, aprakstītas vai kataloģizētas kā kolekcija. @lv
has subproperty: P40137

a pour famille collectionneuse
label: has collector family (Deprecated) @en
lexical alias: collectorFamily.en
definition: Relates an item to a family who is a curator who brings together items from various sources that are arranged, described, or catalogued as a collection. (Deprecated) @en
toolkit label: collector family (Deprecated) @en
toolkit definition: A family who is a curator who brings together items from various sources that are arranged, described, or catalogued as a collection. (Deprecated) @en
type: Property
domain: C10003
has element type: 2
sub property of: a pour famille conservatrice
sub property of: a pour agent collectif collectionneur
definition: Met un item en relation avec une famille conservatrice qui rassemble des items de diverses sources qui sont arrangés, décrits et catalogués comme une collection.
toolkit label: famille collectionneuse
toolkit definition: Famille conservatrice qui rassemble des items de diverses sources qui sont arrangés, décrits et catalogués comme une collection.
label: kokoelman muodostaja (suku) @fi
definition: Liittää kappaleen kuraattorina toimivaan sukuun, joka kokoaa eri lähteistä järjestettävät, kuvailtavat ja luetteloitavat kappaleet kokoelmaksi. @fi
toolkit label: kokoelman muodostaja (suku) @fi
toolkit definition: Kuraattorina toimiva suku, joka kokoaa eri lähteistä järjestettävät, kuvailtavat ja luetteloitavat kappaleet kokoelmaksi. @fi
label: har samler (familie) @no
definition: Relaterer et eksemplar til en familie som er en kurator som setter sammen eksemplarer fra ulike kilder og som er arrangert, beskrevet eller katalogisert som en samling. @no
toolkit label: samler (familie) @no
toolkit definition: En familie som er en kurator som setter sammen eksemplarer fra ulike kilder og som er arrangert, beskrevet eller katalogisert som en samling. @no
label: heeft verzamelaar-familie @nl
definition: Relateert een item aan een familie die een curator is die items samenbrengt uit diverse bronnen die gerangschikt, beschreven of gecatalogiseerd zijn als een collectie. @nl
toolkit label: verzamelaar-familie @nl
toolkit definition: Een familie die een curator is die items samenbrengt uit diverse bronnen die gerangschikt, beschreven of gecatalogiseerd zijn als een collectie. @nl
label: له عائلة جامعة @ar
definition: يربط مفردة بعائلة هي أمينة متحف تقوم بجمع مفردات معاً من مصادر مختلفة رتُبت، أو وُصفت، أو فُهرست كمجموعة. @ar
toolkit label: عائلة جامعة @ar
toolkit definition: عائلة هي أمينة متحف تجمع معاً مفردات من مصادر مختلفة رتُبت، أو وُصفت، أو فُهرست كمجموعة. @ar
label: té com a família col·leccionista @ca
definition: Relaciona un ítem amb una família que és un conservador que aplega ítems de diverses fonts que s’arrangen, es descriuen o es cataloguen com una col·lecció. @ca
toolkit label: família col·leccionista @ca
toolkit definition: Família que és un conservador que aplega ítems de diverses fonts que s’arrangen, es descriuen o es cataloguen com una col·lecció. @ca
label: har familie, som er samler @da
definition: Relaterer et eksemplar til en familie, som er kurator, som indsamler eksemplarer fra forskellige kilder, som bliver arrangeret, beskrevet eller katalogiseret som en samling. @da
toolkit label: familie, som er samler @da
toolkit definition: Familie, som er kurator, som indsamler eksemplarer fra forskellige kilder, som bliver arrangeret, beskrevet eller katalogiseret som en samling. @da
label: kogu moodustaja (perekond) @et
definition: Seostab eksemplari perekonnaga, kes kuraatorina kogub eri allikatest kokku eksemplarid, mis korrastatakse, kirjeldatakse või kataloogitakse koguna. @et
toolkit label: kogu moodustaja (perekond) @et
toolkit definition: Perekond, kes kuraatorina kogub eri allikatest kokku eksemplarid, mis korrastatakse, kirjeldatakse või kataloogitakse koguna. @et
label: hat Sammlerin/Sammler (Familie) @de
definition: Setzt ein Exemplar in Beziehung zu einer Kuratorin/einem Kurator (Familie), die/der Materialien aus unterschiedlichen Quellen zusammenträgt, die dann als Sammlung geordnet, beschrieben oder katalogisiert werden. @de
toolkit label: Sammlerin/Sammler (Familie) @de
toolkit definition: Eine Kuratorin/Ein Kurator (Familie), die Materialien aus unterschiedlichen Quellen zusammenträgt, die dann als Sammlung geordnet, beschrieben oder katalogisiert werden. @de
label: kollektor családja a következő: @hu
definition: Hozzákapcsol egy példányt egy kurátor családhoz, amely különböző forrásokból származó, gyűjteményként rendezett, leírt és katalogizált példányokat fog össze. @hu
toolkit label: kollektor család @hu
toolkit definition: Egy család, amely különböző forrásokból származó, gyűjteményként rendezett, leírt és katalogizált példányokat fog össze. @hu
label: ha come collezionista famiglia @it
definition: Correla un item alla famiglia curatore che raccoglie item da varie fonti, che sono organizzati, descritti o catalogati come una collezione. @it
toolkit label: collezionista famiglia @it
toolkit definition: Famiglia curatore che raccoglie item da varie fonti, che sono organizzati, descritti o catalogati come una collezione. @it
status: Deprecated
label: kolekcionārs (dzimta/ģimene) @lv
definition: Sasaista vienību ar dzimtu/ģimeni, kas apkopo vienības no dažādiem avotiem, kas ir sakārtotas, aprakstītas vai kataloģizētas kā kolekcija. @lv
toolkit label: kolekcionārs (dzimta/ģimene) @lv
toolkit definition: Dzimta/ģimene, kas apkopo vienības no dažādiem avotiem, kas ir sakārtotas, aprakstītas vai kataloģizētas kā kolekcija. @lv
has subproperty: P40153

a pour personne collectionneuse
label: has collector person (Deprecated) @en
lexical alias: collectorPerson.en
definition: Relates an item to a person who is a curator who brings together items from various sources that are arranged, described, or catalogued as a collection. (Deprecated) @en
toolkit label: collector person (Deprecated) @en
toolkit definition: A person who is a curator who brings together items from various sources that are arranged, described, or catalogued as a collection. (Deprecated) @en
type: Property
domain: C10003
has element type: 2
sub property of: a pour personne conservatrice
sub property of: a pour agent collectionneur
definition: Met un item en relation avec une personne conservatrice qui rassemble des items de diverses sources qui sont arrangés, décrits et catalogués comme une collection.
toolkit label: personne collectionneuse
toolkit definition: Personne conservatrice qui rassemble des items de diverses sources qui sont arrangés, décrits et catalogués comme une collection.
label: kokoelman muodostaja (henkilö) @fi
definition: Liittää kappaleen kuraattorina toimivaan henkilöön, joka kokoaa eri lähteistä järjestettävät, kuvailtavat ja luetteloitavat kappaleet kokoelmaksi. @fi
toolkit label: kokoelman muodostaja (henkilö) @fi
toolkit definition: Kuraattorina toimiva henkilö, joka kokoaa eri lähteistä järjestettävät, kuvailtavat ja luetteloitavat kappaleet kokoelmaksi. @fi
label: har samler (person) @no
definition: Relaterer et eksemplar til en person som er en kurator som setter sammen eksemplarer fra ulike kilder og som er arrangert, beskrevet eller katalogisert som en samling. @no
toolkit label: samler (person) @no
toolkit definition: En person som er en kurator som setter sammen eksemplarer fra ulike kilder og som er arrangert, beskrevet eller katalogisert som en samling. @no
label: heeft verzamelaar-persoon @nl
definition: Relateert een item aan een persoon die een curator is die items samenbrengt uit diverse bronnen die gerangschikt, beschreven of gecatalogiseerd zijn als een collectie. @nl
toolkit label: verzamelaar-persoon @nl
toolkit definition: Een persoon die een curator is die items samenbrengt uit diverse bronnen die gerangschikt, beschreven of gecatalogiseerd zijn als een collectie. @nl
label: له شخص جامع @ar
definition: يربط مفردة بشخص هو أمين متحف يجمع مفردات معاً من مصادر مختلفة رتُبت، أو وُصفت، أو فُهرست كمجموعة. @ar
toolkit label: شخص جامع @ar
toolkit definition: شخص هو أمين متحف يجمع مفردات معاً من مصادر مختلفة رتُبت، أو وُصفت، أو فُهرست كمجموعة. @ar
label: té com a persona col·leccionista @ca
definition: Relaciona un ítem amb una persona que és un conservador que aplega ítems de diverses fonts que s’arrangen, es descriuen o es cataloguen com una col·lecció. @ca
toolkit label: persona col·leccionista @ca
toolkit definition: Persona que és un conservador que aplega ítems de diverses fonts que s’arrangen, es descriuen o es cataloguen com una col·lecció. @ca
label: har person, som er samler @da
definition: Relaterer et eksemplar til en person, som er kurator, som indsamler eksemplarer fra forskellige kilder, som bliver arrangeret, beskrevet eller katalogiseret som en samling. @da
toolkit label: person, som er samler @da
toolkit definition: Person, som er kurator, som indsamler eksemplarer fra forskellige kilder, som bliver arrangeret, beskrevet eller katalogiseret som en samling. @da
label: kogu moodustaja (isik) @et
definition: Seostab eksemplari isikuga, kes kuraatorina kogub eri allikatest kokku eksemplarid, mis korrastatakse, kirjeldatakse või kataloogitakse koguna. @et
toolkit label: kogu moodustaja (isik) @et
toolkit definition: Isik, kes kuraatorina kogub eri allikatest kokku eksemplarid, mis korrastatakse, kirjeldatakse või kataloogitakse koguna. @et
label: hat Sammlerin/Sammler (Person) @de
definition: Setzt ein Exemplar in Beziehung zu einer Kuratorin/einem Kurator (Person), die/der Materialien aus unterschiedlichen Quellen zusammenträgt, die dann als Sammlung geordnet, beschrieben oder katalogisiert werden. @de
toolkit label: Sammlerin/Sammler (Person) @de
toolkit definition: Eine Kuratorin/Ein Kurator (Person), die/der Materialien aus unterschiedlichen Quellen zusammenträgt, die dann als Sammlung geordnet, beschrieben oder katalogisiert werden. @de
label: kollektor személye a következő: @hu
definition: Hozzákapcsol egy példányt egy kurátor személyhez, aki különböző forrásokból származó, gyűjteményként rendezett, leírt és katalogizált példányokat fog össze. @hu
toolkit label: kollektor személy: @hu
toolkit definition: Egy kurátor személy, aki különböző forrásokból származó, gyűjteményként rendezett, leírt és katalogizált példányokat fog össze. @hu
label: ha come collezionista persona @it
definition: Correla un item al curatore persona che raccoglie item da varie fonti, che sono organizzati, descritti o catalogati come una collezione. @it
toolkit label: collezionista persona @it
toolkit definition: Curatore persona che raccoglie item da varie fonti, che sono organizzati, descritti o catalogati come una collezione. @it
status: Deprecated
label: kolekcionārs (persona) @lv
definition: Sasaista vienību ar personu, kura apkopo vienības no dažādiem avotiem, kas ir sakārtotas, aprakstītas vai kataloģizētas kā kolekcija. @lv
toolkit label: kolekcionārs (persona) @lv
toolkit definition: Persona, kura apkopo vienības no dažādiem avotiem, kas ir sakārtotas, aprakstītas vai kataloģizētas kā kolekcija. @lv
has subproperty: P40105

is commentary on (item) (Deprecated)
status: Deprecated
type: Property
sub property of: is description of (item) (Deprecated)
toolkit definition: An item used as the basis for a set of explanatory or critical notes. (Deprecated) @en
toolkit label: commentary on (item) (Deprecated) @en
definition: Relates a work to an item used as the basis for a set of explanatory or critical notes. (Deprecated) @en
lexical alias: commentaryOnItem.en
domain: C10001
instruction number: 24.5

est contenu dans un item
status: Published
label: is contained in item @en
definition: Relates an item to an item that is a larger item of which an item is a discrete component. @en
type: Property
domain: C10003
sub property of: a pour item en relation avec un item
lexical alias: containedInItem.en
toolkit label: contained in item @en
toolkit definition: An item that is a larger item of which an item is a discrete component. @en
definition: Met un item en relation avec un item qui consiste en un item plus vaste dont un item forme une composante distincte.
toolkit label: contenu dans un item
toolkit definition: Item qui consiste en un item plus vaste dont un item forme une composante distincte.
toolkit label: contenido en (ítem) @es
toolkit definition: Un ítem mayor del cual una parte es un componente separado. @es
instruction number: 24.5
label: được chứa trong (bản) @vi
definition: Liên kết bản với bản lớn hơn trong đó một bản là một bộ phần cấu thành tách biệt. @vi
toolkit label: được chứa trong (bản) @vi
toolkit definition: Bản lớn hơn trong đó một bản là một bộ phần cấu thành tách biệt. @vi
label: er indeholdt i eksemplar @da
definition: Relaterer et eksemplar til et større eksemplar, som eksemplaret udgør en adskilt komponent af. @da
toolkit label: indeholdt i eksemplar @da
toolkit definition: Større eksemplar, som eksemplaret udgør en adskilt komponent af. @da
label: ist enthalten in (Exemplar) @de
definition: Setzt ein Exemplar in Beziehung zu einem größeren Exemplar, von dem ein Exemplar ein eigenständiger Bestandteil ist. @de
toolkit label: Enthalten in (Exemplar) @de
toolkit definition: Ein größeres Exemplar, von dem ein Exemplar ein eigenständiger Bestandteil ist. @de
label: περιέχεται σε (αντίτυπο) @el
definition: Συνδέει ένα αντίτυπο με ένα μεγαλύτερο αντίτυπο του οποίου ένα αντίτυπο συνιστά διακριτό συστατικό. @el
toolkit label: περιέχεται σε (αντίτυπο) @el
toolkit definition: Ένα μεγαλύτερο αντίτυπο του οποίου ένα αντίτυπο συνιστά διακριτό συστατικό. @el
label: és contingut en un ítem @ca
definition: Relaciona un ítem amb un ítem que és un ítem més ampli del qual un ítem és un component discret. @ca
toolkit label: contingut en un ítem @ca
toolkit definition: Ítem que és un ítem més ampli del qual un ítem és un component discret. @ca
definition: Liittää kappaleen kappaleeseen, joka on laajempi kappale, jonka itsenäinen osa kappale on. @fi
toolkit label: sisältyy kappaleeseen @fi
toolkit definition: Kappale, joka on laajempi kappale, jonka itsenäinen osa kappale on. @fi
toolkit label: omfattes av eksemplar @no
toolkit definition: Et større eksemplar der et eksemplar er en avgrenset bestanddel. @no
has element type: 2
label: a következő példány tartalmazza: @hu
definition: Hozzákapcsol egy példányt egy nagyobb példányhoz, amelynek egy példány különálló alkotóeleme. @hu
toolkit label: a következő példány tartalmazza: @hu
toolkit definition: Egy nagyobb példány, amelynek egy példány különálló alkotóeleme. @hu
label: sisältyy kappaleeseen @fi
label: blir omfattet av eksemplar @no
definition: Relaterer et eksemplar til et større eksemplar der et eksemplar er en avgrenset bestanddel. @no
label: is opgenomen in item @nl
definition: Relateert een item aan een item dat is een groter item waarvan een item een afzonderlijk onderdeel is. @nl
toolkit label: opgenomen in item @nl
toolkit definition: Een item dat is een groter item waarvan een item een afzonderlijk onderdeel is. @nl
label: هي حاوية لمفردة @ar
definition: يربط مفردة بمفردة هي ضمن تشكيل أكبر، وتشكل جزءا منفصلا عنه. @ar
toolkit label: حاوية لمفردة @ar
toolkit definition: مفردة أكبر تتضمن مفردة تشكل جزءا منفصلا عنها. @ar
label: sisaldub eksemplaris @et
definition: Seostab eksemplari mahukama eksemplariga, mille iseseisev osa eksemplar on. @et
toolkit label: sisaldub eksemplaris @et
toolkit definition: Mahukam eksemplar, mille iseseisev osa eksemplar on. @et
label: ir ietverts vienībā @lv
definition: Sasaista vienību ar vienību, kas ir lielāka vienība, kuras atsevišķs komponents ir aprakstāmā vienība. @lv
toolkit label: ietverts vienībā @lv
toolkit definition: Vienība, kas ir lielāka vienība, kuras atsevišķs komponents ir aprakstāmā vienība. @lv
has subproperty: P40009
label: 被包含于单件中 @zh-hans
definition: 将一个单件与作为包含独立组成部分单件的较大单件的一个单件关联起来。 @zh-hans
toolkit label: 被包含于单件中 @zh-hans
toolkit definition: 作为包含独立组成部分单件的较大单件的一个单件 @zh-hans
label: kopyada yer almaktadır @tr
definition: Bir kopyayı, bir kopyanın ayrık bir bileşeni olduğu daha büyük bir kopya olan bir kopyayla ilişkilendirir. @tr
toolkit label: içinde bulunan kopya @tr
toolkit definition: Bir kopyanın ayrı bir bileşeni olduğu daha büyük olan bir kopya. @tr

est un conteneur d’un item
status: Published
label: is container of item @en
definition: Relates an item to an item that is a discrete component of a larger item. @en
type: Property
domain: C10003
sub property of: a pour item en relation avec un item
lexical alias: containerOfItem.en
toolkit label: container of item @en
toolkit definition: An item that is a discrete component of a larger item. @en
definition: Met un item en relation avec un item qui constitue une composante distincte d’un item plus vaste.
toolkit label: conteneur d’un item
toolkit definition: Item qui constitue une composante distincte d’un item plus vaste.
toolkit label: contiene (ítem) @es
toolkit definition: Un ítem que es un componente separado de un ítem mayor. @es
instruction number: 24.5
label: là vỏ chứa của (bản) @vi
definition: Liên kết bản với bản là bộ phận cấu thành tách biệt của bản lớn hơn. @vi
toolkit label: vỏ chứa của (bản) @vi
toolkit definition: Bản là bộ phận cấu thành tách biệt của bản lớn hơn. @vi
label: er container af eksemplar @da
definition: Relaterer et eksemplar til et eksemplar, som udgør en adskilt komponent af et større eksemplar. @da
toolkit label: container af eksemplar @da
toolkit definition: Eksemplar, som udgør en adskilt komponent af et større eksemplar. @da
definition: Setzt ein Exemplar in Beziehung zu einem Exemplar, das ein eigenständiger Bestandteil eines größeren Exemplars ist. @de
toolkit label: Enthält ein Exemplar @de
toolkit definition: Ein Exemplar, das ein eigenständiger Bestandteil eines größeren Exemplars ist. @de
label: είναι περιέκτης του (αντίτυπο) @el
definition: Συνδέει ένα αντίτυπο με ένα αντίτυπο το οποίο είναι διακριτό συστατικό ενός μεγαλύτερου αντιτύπου. @el
toolkit label: περιέκτης του (αντίτυπο) @el
toolkit definition: Ένα αντίτυπο το οποίο είναι διακριτό συστατικό ενός μεγαλύτερου αντιτύπου. @el
label: és contenidor d’un ítem @ca
definition: Relaciona un ítem amb un ítem que és un component discret d’un ítem més ampli. @ca
toolkit label: contenidor d’un ítem @ca
toolkit definition: Ítem que és un component discret d’un ítem més ampli. @ca
definition: Liittää kappaleen kappaleeseen, joka on itsenäinen osa laajempaa kappaletta. @fi
toolkit label: sisältää kappaleen @fi
toolkit definition: Kappale, joka on itsenäinen osa laajempaa kappaletta. @fi
toolkit label: omfattet av eksemplar @no
toolkit definition: Et eksemplar som er en avgrenset bestanddel av et større eksemplar. @no
has element type: 2
label: befoglalója a következő példánynak: @hu
definition: Hozzákapcsol egy példányt egy példányhoz, amely egy nagyobb példány elkülöníthető alkotóeleme. @hu
toolkit label: példány befoglalója: @hu
toolkit definition: Egy példány, amely egy nagyobb példány elkülöníthető alkotóeleme. @hu
label: sisältää kappaleen @fi
label: er omfattet av eksemplar @no
definition: Relaterer et eksemplar til et eksemplar som er en avgrenset bestanddel av et større eksemplar. @no
label: is houder van item @nl
definition: Relateert een item aan een item dat een afzonderlijk onderdeel is van een groter item. @nl
toolkit label: houder van item @nl
toolkit definition: Een item dat een afzonderlijk onderdeel is van een groter item. @nl
label: هي حاوية لمفردة @ar
definition: يربط مفردة بمفردة هي جزء منفصل عن مفردة أكبر. @ar
toolkit label: حاوية لمفردة @ar
toolkit definition: مفردة هي جزء منفصل عن مفردة أكبر @ar
label: ümbris eksemplarile @et
definition: Seostab eksemplari eksemplariga, mis on suurema eksemplari eraldi osa. @et
toolkit label: ümbris eksemplarile @et
toolkit definition: Eksemplar, mis on suurema eksemplari eraldi osa. @et
label: ist enthält ein Exemplar @de
label: è contenitore di item @it
definition: Correla un item a un item che costituisce un componente distinto di un item più ampio. @it
toolkit label: contenitore di item @it
toolkit definition: Item che costituisce una componente distinta di un item più ampio. @it
label: ir ietver vienību @lv
definition: Sasaista vienību ar vienību, kas ir lielākas vienības atsevišķs komponents. @lv
toolkit label: ietver vienību @lv
toolkit definition: Vienība, kas ir lielākas vienības atsevišķs komponents. @lv
has subproperty: P40034
label: 是单件的整体 @zh-hans
definition: 将一个单件与作为一个更大单件的分离组成部分的一个单件关联起来。 @zh-hans
toolkit label: 单件的整体 @zh-hans
toolkit definition: 作为一个更大单件的分离组成部分的一个单件 @zh-hans
label: kopyanın kapsayıcısıdır @tr
definition: Bir kopyayı, daha büyük bir kopyanın ayrık bir bileşeni olan bir kopyayla ilişkilendirir. @tr
toolkit label: kopyanın kapsayıcısı @tr
toolkit definition: Daha büyük bir kopyanın ayrı bir bileşeni olan bir kopya. @tr

is critique of (item) (Deprecated)
status: Deprecated
type: Property
sub property of: is description of (item) (Deprecated)
toolkit definition: An item used as the basis for a critical evaluation. (Deprecated) @en
toolkit label: critique of (item) (Deprecated) @en
definition: Relates a work to an item used as the basis for a critical evaluation. (Deprecated) @en
lexical alias: critiqueOfItem.en
domain: C10001
instruction number: 24.5

a pour agent conservateur
label: has curator agent (Deprecated) @en
definition: Relates an item to an agent who conceives or manages the aggregation of an item in an exhibition or collection. (Deprecated) @en
type: Property
domain: C10003
sub property of: a pour agent en relation avec un item
lexical alias: curatorAgent.en
toolkit label: curator agent (Deprecated) @en
toolkit definition: An agent who conceives or manages the aggregation of an item in an exhibition or collection. (Deprecated) @en
definition: Met un item en relation avec un agent qui conçoit ou gère l’agrégation d’un item dans une exposition ou une collection.
toolkit label: agent conservateur
toolkit definition: Agent qui conçoit ou gère l’agrégation d’un item dans une exposition ou une collection.
toolkit label: curador @es
toolkit definition: Una persona, familia o entidad corporativa que concibe, agrega y/o organiza una exhibición, colección u otro ítem. @es
instruction number: 18.5
label: có người trông nom @vi
definition: Liên kết bản với tác nhân tạo lập, tập hợp, hoặc tổ chức triển lãm, bộ sưu tập, hoặc hạng mục khác. @vi
toolkit label: người trông nom @vi
toolkit definition: Tác nhân tạo lập, tập hợp, hoặc tổ chức triển lãm, bộ sưu tập, hoặc hạng mục khác. @vi
label: har agent, som er kurator @da
definition: Relaterer et eksemplar til en agent, som udtænker eller administrerer samlingen af et eksemplar til en udstilling eller samling. @da
toolkit label: agent, som er kurator @da
toolkit definition: Agent, som udtænker eller administrerer samlingen af et eksemplar til en udstilling eller samling. @da
label: hat Kuratorin/Kurator (Akteur) @de
definition: Setzt ein Exemplar in Beziehung zu einem Akteur, der die Aggregation eines Exemplars in einer Ausstellung oder Sammlung konzipiert oder organisiert. @de
toolkit label: Kuratorin/Kurator (Akteur) @de
toolkit definition: Ein Akteur, der die Aggregation eines Exemplars in einer Ausstellung oder Sammlung konzipiert oder organisiert. @de
label: έχει έφορο @el
definition: Συνδέει ένα αντίτυπο με έναν φορέα που συλλαμβάνει, συγκεντρώνει ή και οργανώνει μια έκθεση, συλλογή ή άλλο αντίτυπο. @el
toolkit label: έφορος @el
toolkit definition: Ένας φορέας που συλλαμβάνει, συγκεντρώνει ή και οργανώνει μια έκθεση, συλλογή ή άλλο αντίτυπο. @el
label: té com a agent conservador @ca
definition: Relaciona un ítem amb un agent que concep o gestiona l’agregació d’un ítem en una exposició o una col·lecció. @ca
toolkit label: agent conservador @ca
toolkit definition: Agent que concep o gestiona l’agregació d’un ítem en una exposició o una col·lecció. @ca
definition: Liittää kappaleen toimijaan, joka saa aikaan ja hallinnoi näyttelyn tai kokoelman kappaleaggregaatiota. @fi
toolkit label: kuraattori (toimija) @fi
toolkit definition: Toimija, joka saa aikaan ja hallinnoi näyttelyn tai kokoelman kappaleaggregaatiota. @fi
toolkit label: kurator (agent) @no
toolkit definition: En agent som har idéen til eller håndterer innsamlingen av et eksemplar i en utstilling eller samling. @no
has element type: 2
label: kurátor ágense a következő: @hu
definition: Hozzákapcsol egy példányt egy ágenshez, amely kigondolja vagy kezeli egy példány begyűjtését egy kiállítás keretébe vagy gyűjteménybe. @hu
toolkit label: kurátor ágense: @hu
toolkit definition: Egy ágens, amely kigondolja vagy kezeli egy példány begyűjtését egy kiállítás keretébe vagy gyűjteménybe. @hu
alternative label: curator @en
alternative label: conservateur
alternative label: kuraattori @fi
label: kuraattori (toimija) @fi
label: har kurator (agent) @no
definition: Relaterer et eksemplar til en agent som har idéen til eller håndterer innsamlingen av et eksemplar i en utstilling eller samling. @no
alternative label: kurator @no
label: heeft curator-actor @nl
definition: Relateert een item aan een actor die de samenstelling bedenkt of beheert van een item in een tentoonstelling of collectie. @nl
alternative label: conservator @nl
toolkit label: curator-actor @nl
toolkit definition: Een actor die de samenstelling bedenkt of beheert van een item in een tentoonstelling of collectie. @nl
label: له وكيل أمين متحف @ar
definition: يربط مفردة بوكيل يطرح أو يدير تجميعة لمفردة في معرض، أو في مجموعة. @ar
alternative label: أمين متحف @ar
toolkit label: وكيل أمين متحف @ar
toolkit definition: وكيل يطرح أو يدير تجميعة لمفردة في معرض، أو في مجموعة. @ar
alternative label: conservador @ca
label: kuraator (tegija) @et
definition: Seostab eksemplari tegijaga, kes kavandab või korraldab eksemplari liitmise näituse või koguga. @et
alternative label: kuraator @et
toolkit label: kuraator (tegija) @et
toolkit definition: Tegija, kes kavandab või korraldab eksemplari liitmise näituse või koguga. @et
alternative label: kurátora: @hu
label: ha come curatore agente @it
definition: Correla un item a un agente che concepisce o gestisce l'aggregazione di un item in una mostra o in una raccolta. @it
alternative label: curatore @it
toolkit label: curatore agente @it
toolkit definition: Agente che concepisce o gestisce l'aggregazione di un item in una mostra o in una raccolta. @it
status: Deprecated
label: kurators (aģents) @lv
definition: Sasaista vienību ar aģentu, kas iecer un realizē vienības iekļaušanu izstādē vai kolekcijā. @lv
toolkit label: kurators (aģents) @lv
toolkit definition: Aģents, kas iecer un realizē vienības iekļaušanu izstādē vai kolekcijā. @lv
alternative label: Kurator @de
has subproperty: a pour agent catalogueur d’une collection de ressources

a pour agent collectif conservateur
label: has curator collective agent (Deprecated) @en
lexical alias: curatorCollectiveAgent.en
definition: Relates an item to a collective agent who conceives or manages the aggregation of an item in an exhibition or collection. (Deprecated) @en
toolkit label: curator collective agent (Deprecated) @en
toolkit definition: A collective agent who conceives or manages the aggregation of an item in an exhibition or collection. (Deprecated) @en
type: Property
domain: C10003
has element type: 2
sub property of: a pour agent collectif en relation avec un item
sub property of: a pour agent conservateur
definition: Met un item en relation avec un agent collectif qui conçoit ou gère l’agrégation d’un item dans une exposition ou une collection.
toolkit label: agent collectif conservateur
toolkit definition: Agent collectif qui conçoit ou gère l’agrégation d’un item dans une exposition ou une collection.
label: kuraattori (yhteistoimija) @fi
definition: Liittää kappaleen yhteistoimijaan, joka saa aikaan ja hallinnoi näyttelyn tai kokoelman kappaleaggregaatiota. @fi
toolkit label: kuraattori (yhteistoimija) @fi
toolkit definition: Yhteistoimija, joka saa aikaan ja hallinnoi näyttelyn tai kokoelman kappaleaggregaatiota. @fi
label: har kurator (kollektiv agent) @no
definition: Relaterer et eksemplar til en kollektiv agent som har idéen til eller håndterer innsamlingen av et eksemplar i en utstilling eller samling. @no
toolkit label: kurator (kollektiv agent) @no
toolkit definition: En kollektiv agent som har idéen til eller håndterer innsamlingen av et eksemplar i en utstilling eller samling. @no
label: heeft curator-collectieve actor @nl
definition: Relateert een item aan een collectieve actor die de samenstelling bedenkt of beheert van een item in een tentoonstelling of collectie. @nl
toolkit label: curator-collectieve actor @nl
toolkit definition: Een collectieve actor die de samenstelling bedenkt of beheert van een item in een tentoonstelling of collectie. @nl
label: له وكيل جماعي أمين متحف @ar
definition: يربط مفردة بوكيل جماعي يطرح تجميعة لمفردة في معرض، أو في مجموعة أو يديرها. @ar
toolkit label: وكيل جماعي أمين متحف @ar
toolkit definition: وكيل جماعي يطرح تجميعة لمفردة في معرض، أو في مجموعة أو يديرها. @ar
label: té com a agent col·lectiu conservador @ca
definition: Relaciona un ítem amb un agent col·lectiu que concep o gestiona l’agregació d’un ítem en una exposició o en una col·lecció. @ca
toolkit label: agent col·lectiu conservador @ca
toolkit definition: Agent col·lectiu que concep o gestiona l’agregació d’un ítem en una exposició o en una col·lecció. @ca
label: har kollektiv agent, som er kurator @da
definition: Relaterer et eksemplar til en kollektiv agent, som udtænker eller administrerer samlingen af et eksemplar til en udstilling eller samling. @da
toolkit label: kollektiv agent, som er kurator @da
toolkit definition: Kollektiv agent, som udtænker eller administrerer samlingen af et eksemplar til en udstilling eller samling. @da
label: kuraator (kollektiiv) @et
definition: Seostab eksemplari kollektiiviga, kes kavandab või korraldab eksemplari liitmise näituse või koguga. @et
toolkit label: kuraator (kollektiiv) @et
toolkit definition: Kollektiiv, kes kavandab või korraldab eksemplari liitmise näituse või koguga. @et
label: hat Kuratorin/Kurator (Gemeinschaftlicher Akteur) @de
definition: Setzt ein Exemplar in Beziehung zu einem gemeinschaftlichen Akteur, der die Aggregation eines Exemplars in einer Ausstellung oder Sammlung konzipiert oder organisiert @de
toolkit label: Kuratorin/Kurator (Gemeinschaftlicher Akteur) @de
toolkit definition: Ein gemeinschaftlicher Akteur, der die Aggregation eines Exemplars in einer Ausstellung oder Sammlung konzipiert oder organisiert @de
label: kurátor kollektív ágense a következő: @hu
definition: Hozzákapcsol egy példányt egy kollektív ágenshez, amely kigondolja vagy kezeli egy példány begyűjtését egy kiállítás keretébe vagy egy gyűjteménybe. @hu
toolkit label: kurátor kollektív ágense: @hu
toolkit definition: Egy kollektív ágens, amely kigondolja vagy kezeli egy példány begyűjtését egy kiállítás keretébe vagy egy gyűjteménybe. @hu
label: ha come curatore agente collettivo @it
definition: Correla un item a un agente collettivo che concepisce o gestisce l'aggregazione di una mostra o collezione. @it
toolkit label: curatore agente collettivo @it
toolkit definition: Agente collettivo che concepisce o gestisce l'aggergazione di un item in una mostra o collezione. @it
status: Deprecated
label: kurators (grupa) @lv
definition: Sasaista vienību ar grupu, kas iecer un realizē vienības iekļaušanu izstādē vai kolekcijā. @lv
toolkit label: kurators (grupa) @lv
toolkit definition: Grupa, kas iecer un realizē vienības iekļaušanu izstādē vai kolekcijā. @lv
has subproperty: a pour agent collectif catalogueur d’une collection de ressources
has subproperty: a pour agent collectif collectionneur
has subproperty: a pour collectivité conservatrice
has subproperty: a pour famille conservatrice
has subproperty: P40115

a pour collectivité conservatrice
label: has curator corporate body (Deprecated) @en
lexical alias: curatorCorporateBody.en
definition: Relates an item to a corporate body who conceives or manages the aggregation of an item in an exhibition or collection. (Deprecated) @en
toolkit label: curator corporate body (Deprecated) @en
toolkit definition: A corporate body who conceives or manages the aggregation of an item in an exhibition or collection. (Deprecated) @en
type: Property
domain: C10003
has element type: 2
sub property of: a pour collectivité en relation avec un item
sub property of: a pour agent collectif conservateur
definition: Met un item en relation avec une collectivité qui conçoit ou gère l’agrégation d’un item dans une exposition ou une collection.
toolkit label: collectivité conservatrice
toolkit definition: Collectivité qui conçoit ou gère l’agrégation d’un item dans une exposition ou une collection.
label: kuraattori (yhteisö) @fi
definition: Liittää kappaleen yhteisöön, joka saa aikaan ja hallinnoi näyttelyn tai kokoelman kappaleaggregaatiota. @fi
toolkit label: kuraattori (yhteisö) @fi
toolkit definition: Yhteisö, joka saa aikaan ja hallinnoi näyttelyn tai kokoelman kappaleaggregaatiota. @fi
label: har kurator (korporasjon) @no
definition: Relaterer et eksemplar til en korporasjon som har idéen til eller håndterer innsamlingen av et eksemplar i en utstilling eller samling. @no
toolkit label: kurator (korporasjon) @no
toolkit definition: En korporasjon som har idéen til eller håndterer innsamlingen av et eksemplar i en utstilling eller samling. @no
label: heeft curator-corporatie @nl
definition: Relateert een item aan een corporatie die de samenstelling bedenkt of beheert van een item in een tentoonstelling of collectie. @nl
toolkit label: curator-corporatie @nl
toolkit definition: Een corporatie die de samenstelling bedenkt of beheert van een item in een tentoonstelling of collectie. @nl
label: له هيئة أمينة متحف @ar
definition: يربط مفردة بهيئة تطرح تجميعة لمفردة في معرض، أو في مجموعة أو تديرها. @ar
toolkit label: هيئة أمينة متحف @ar
toolkit definition: هيئة تطرح تجميعة لمفردة في معرض، أو في مجموعة أو تديرها . @ar
label: té com a entitat corporativa conservadora @ca
definition: Relaciona un ítem amb una entitat corporativa que concep o gestiona l’agregació d’un ítem en una exposició o en una col·lecció. @ca
toolkit label: entitat corporativa conservadora @ca
toolkit definition: Entitat corporativa que concep o gestiona l’agregació d’un ítem en una exposició o en una col·lecció. @ca
label: har korporation, som er kurator @da
definition: Relaterer et eksemplar til en korporation, som udtænker eller administrerer samlingen af et eksemplar til en udstilling eller samling. @da
toolkit label: korporation, som er kurator @da
toolkit definition: Korporation, som udtænker eller administrerer samlingen af et eksemplar til en udstilling eller samling. @da
label: kuraator (asutus) @et
definition: Seostab eksemplari asutusega, kes kavandab või korraldab eksemplari liitmise näituse või koguga. @et
toolkit label: kuraator (asutus) @et
toolkit definition: Asutus, kes kavandab või korraldab eksemplari liitmise näituse või koguga. @et
label: hat Kuratorin/Kurator (Körperschaft) @de
definition: Setzt ein Exemplar in Beziehung zu einer Körperschaft, die die Aggregation eines Exemplars in einer Ausstellung oder Sammlung konzipiert oder organisiert. @de
toolkit label: Kuratorin/Kurator (Körperschaft) @de
toolkit definition: Einer Körperschaft, die die Aggregation eines Exemplars in einer Ausstellung oder Sammlung konzipiert oder organisiert. @de
label: kurátor testülete a következő: @hu
definition: Egy példányt hozzákapcsol egy testülethez, amely kigondolja vagy kezeli a példány begyűjtését kiállítás keretébe vagy gyűjteménybe. @hu
toolkit label: kurátor testülete: @hu
toolkit definition: Egy testület, amely kigondolja vagy kezeli egy példány begyűjtését kiállítás keretébe vagy gyűjteménybe. @hu
label: ha come curatore ente @it
definition: Correla un item a un ente che concepisce o gestisce l'aggregazione di un item nell'ambito di una mostra o collezione. @it
toolkit label: curatore ente @it
toolkit definition: Ente che concepisce o gestisce l'aggregazione di un item nell'ambito di una mostra o collezione. @it
status: Deprecated
label: kurators (institūcija) @lv
definition: Sasaista vienību ar institūciju, kas iecer un realizē vienības iekļaušanu izstādē vai kolekcijā. @lv
toolkit label: kurators (institūcija) @lv
toolkit definition: Institūcija, kas iecer un realizē vienības iekļaušanu izstādē vai kolekcijā. @lv
has subproperty: a pour collectivité catalogueuse d’une collection de ressources
has subproperty: a pour collectivité collectionneuse
has subproperty: P40131

a pour famille conservatrice
label: has curator family (Deprecated) @en
lexical alias: curatorFamily.en
definition: Relates an item to a family who conceives or manages the aggregation of an item in an exhibition or collection. (Deprecated) @en
toolkit label: curator family (Deprecated) @en
toolkit definition: A family who conceives or manages the aggregation of an item in an exhibition or collection. (Deprecated) @en
type: Property
domain: C10003
has element type: 2
sub property of: a pour famille en relation avec un item
sub property of: a pour agent collectif conservateur
definition: Met un item en relation avec une famille qui conçoit ou gère l’agrégation d’un item dans une exposition ou une collection.
toolkit label: famille conservatrice
toolkit definition: Famille qui conçoit ou gère l’agrégation d’un item dans une exposition ou une collection.
label: kuraattori (suku) @fi
definition: Liittää kappaleen sukuun, joka saa aikaan ja hallinnoi näyttelyn tai kokoelman kappaleaggregaatiota. @fi
toolkit label: kuraattori (suku) @fi
toolkit definition: Suku, joka saa aikaan ja hallinnoi näyttelyn tai kokoelman kappaleaggregaatiota. @fi
label: har kurator (familie) @no
definition: Relaterer et eksemplar til en familie som har idéen til eller håndterer innsamlingen av et eksemplar i en utstilling eller samling. @no
toolkit label: kurator (familie) @no
toolkit definition: En familie som har idéen til eller håndterer innsamlingen av et eksemplar i en utstilling eller samling. @no
label: heeft curator-familie @nl
definition: Relateert een item aan een familie die de samenstelling bedenkt of beheert van een item in een tentoonstelling of collectie. @nl
toolkit label: curator-familie @nl
toolkit definition: Een familie die de samenstelling bedenkt of beheert van een item in een tentoonstelling of collectie. @nl
label: له عائلة أمينة متحف @ar
definition: يربط مفردة بعائلة تطرح تجميعة لمفردة في معرض، أو في مجموعة أو تديرها. @ar
toolkit label: عائلة أُمينة متحف @ar
toolkit definition: عائلة تطرح تجميعة لمفردة في معرض، أو في مجموعة أو تديرها. @ar
label: té com a família conservadora @ca
definition: Relaciona un ítem amb una família que concep o gestiona l’agregació d’un ítem en una exposició o en una col·lecció. @ca
toolkit label: família conservadora @ca
toolkit definition: Família que concep o gestiona l’agregació d’un ítem en una exposició o en una col·lecció. @ca
label: har familie, som er kurator @da
definition: Relaterer et eksemplar til en familie, som udtænker eller administrerer samlingen af et eksemplar til en udstilling eller samling. @da
toolkit label: familie, som er kurator @da
toolkit definition: Familie, som udtænker eller administrerer samlingen af et eksemplar til en udstilling eller samling. @da
label: kuraator (perekond) @et
definition: Seostab eksemplari perekonnaga, kes kavandab või korraldab eksemplari liitmise näituse või koguga. @et
toolkit label: kuraator (perekond) @et
toolkit definition: Perekond, kes kavandab või korraldab eksemplari liitmise näituse või koguga. @et
label: hat Kuratorin/Kurator (Familie) @de
definition: Setzt ein Exemplar in Beziehung zu einer Familie, die die Aggregation eines Exemplars in einer Ausstellung oder Sammlung konzipiert oder organisiert. @de
toolkit label: Kuratorin/Kurator (Familie) @de
toolkit definition: Eine Familie, die die Aggregation eines Exemplars in einer Ausstellung oder Sammlung konzipiert oder organisiert. @de
label: kurátor családja a következő: @hu
definition: Egy példányt hozzákapcsol egy családhoz, amely kigondolja vagy kezeli a példány begyűjtését kiállítás keretébe vagy gyűjteménybe. @hu
toolkit label: kurátor család @hu
toolkit definition: Egy család, amely kigondolja vagy kezeli egy példány begyűjtését kiállítás keretébe vagy gyűjteménybe. @hu
label: ha come curatore famiglia @it
definition: Correla un item a una famiglia che concepisce o gestisce l'aggregazione di un item nell'ambito di una mostra o collezione. @it
toolkit label: curatore famiglia @it
toolkit definition: Famiglia che concepisce o gestisce l'aggregazione di un item all'interno di una mostra o collezione. @it
status: Deprecated
label: kurators (dzimta/ģimene) @lv
definition: Sasaista vienību ar dzimtu/ģimeni, kas iecer un realizē vienības iekļaušanu izstādē vai kolekcijā. @lv
toolkit label: kurators (dzimta/ģimene) @lv
toolkit definition: Dzimta/ģimene, kas iecer un realizē vienības iekļaušanu izstādē vai kolekcijā. @lv
has subproperty: a pour famille catalogueuse d’une collection de ressources
has subproperty: a pour famille collectionneuse
has subproperty: P40147

a pour personne conservatrice
label: has curator person (Deprecated) @en
lexical alias: curatorPerson.en
definition: Relates an item to a person who conceives or manages the aggregation of an item in an exhibition or collection. (Deprecated) @en
toolkit label: curator person (Deprecated) @en
toolkit definition: A person who conceives or manages the aggregation of an item in an exhibition or collection. (Deprecated) @en
type: Property
domain: C10003
has element type: 2
sub property of: a pour personne en relation avec un item
sub property of: a pour agent conservateur
definition: Met un item en relation avec une personne qui conçoit ou gère l’agrégation d’un item dans une exposition ou une collection.
toolkit label: personne conservatrice
toolkit definition: Personne qui conçoit ou gère l’agrégation d’un item dans une exposition ou une collection.
label: kuraattori (henkilö) @fi
definition: Liittää kappaleen henkilöön, joka saa aikaan ja hallinnoi näyttelyn tai kokoelman kappaleaggregaatiota. @fi
toolkit label: kuraattori (henkilö) @fi
toolkit definition: Henkilö, joka saa aikaan ja hallinnoi näyttelyn tai kokoelman kappaleaggregaatiota. @fi
label: har kurator (person) @no
definition: Relaterer et eksemplar til en person som har idéen til eller håndterer innsamlingen av et eksemplar i en utstilling eller samling. @no
toolkit label: kurator (person) @no
toolkit definition: En person som har idéen til eller håndterer innsamlingen av et eksemplar i en utstilling eller samling. @no
label: heeft curator-persoon @nl
definition: Relateert een item aan een persoon die de samenstelling bedenkt of beheert van een item in een tentoonstelling of collectie. @nl
toolkit label: curator-persoon @nl
toolkit definition: Een persoon die de samenstelling bedenkt of beheert van een item in een tentoonstelling of collectie. @nl
label: له شخص أمين متحف @ar
definition: يربط مفردة بشخص لديه تصور أو يدير تجميعة لمفردة في معرض، أو في مجموعة . @ar
toolkit label: شخص أمين متحف @ar
toolkit definition: شخص لديه تصور أو يدير تجميعة لمفردة في معرض، أو في مجموعة . @ar
label: té com a persona conservadora @ca
definition: Relaciona un ítem amb una persona que concep o gestiona l’agregació d’un ítem en una exposició o en una col·lecció. @ca
toolkit label: persona conservadora @ca
toolkit definition: Persona que concep o gestiona l’agregació d’un ítem en una exposició o en una col·lecció. @ca
label: har person, som er kurator @da
definition: Relaterer et eksemplar til en person, som udtænker eller administrerer samlingen af et eksemplar til en udstilling eller samling. @da
toolkit label: person, som er kurator @da
toolkit definition: Person, som udtænker eller administrerer samlingen af et eksemplar til en udstilling eller samling. @da
label: kuraator (isik) @et
definition: Seostab eksemplari isikuga, kes kavandab või korraldab eksemplari liitmise näituse või koguga. @et
toolkit label: kuraator (isik) @et
toolkit definition: Isik, kes kavandab või korraldab eksemplari liitmise näituse või koguga. @et
label: hat Kuratorin/Kurator (Person) @de
definition: Setzt ein Exemplar in Beziehung zu einer Person, die die Aggregation eines Exemplars in einer Ausstellung oder Sammlung konzipiert oder organisiert. @de
toolkit label: Kuratorin/Kurator (Person) @de
toolkit definition: Eine Person, die die Aggregation eines Exemplars in einer Ausstellung oder Sammlung konzipiert oder organisiert. @de
label: kurátor személye a következő: @hu
definition: Hozzákapcsol egy példányt egy személyhez, aki kigondolja vagy kezeli a példány begyűjtését egy kiállítás keretébe vagy egy gyűjteménybe. @hu
toolkit label: kurátor személye: @hu
toolkit definition: Egy személy, aki kigondolja vagy kezeli egy példány begyűjtését egy kiállítás keretébe vagy egy gyűjteménybe. @hu
label: ha come curatore persona @it
definition: Correla un item a una persona che concepisce o gestisce l'aggregazione di un item in una mostra o collezione. @it
toolkit label: curatore persona @it
toolkit definition: Persona che concepisce o gestisce l'aggregazione di un item in una mostra o collezione. @it
status: Deprecated
label: kurators (persona) @lv
definition: Sasaista vienību ar personu, kura iecer un realizē vienības iekļaušanu izstādē vai kolekcijā. @lv
toolkit label: kurators (persona) @lv
toolkit definition: Persona, kura iecer un realizē vienības iekļaušanu izstādē vai kolekcijā. @lv
has subproperty: a pour personne catalogueuse d’une collection de ressources
has subproperty: a pour personne collectionneuse
has subproperty: P40099

a pour agent propriétaire actuel
status: Published
label: has current owner agent @en
definition: Relates an item to an agent who has current legal possession of an item. @en
type: Property
domain: C10003
sub property of: a pour agent propriétaire
lexical alias: currentOwnerAgent.en
toolkit label: current owner agent @en
toolkit definition: An agent who has current legal possession of an item. @en
definition: Met un item en relation avec un agent qui possède actuellement et légalement un item.
toolkit label: agent propriétaire actuel
toolkit definition: Agent qui possède actuellement et légalement un item.
toolkit label: propietario actual @es
toolkit definition: Una persona, familia o entidad corporativa que actualmente tiene la posesión legal de un ítem. @es
instruction number: 18.5
label: có người chủ hiện tại @vi
definition: Liên kết bản với tác nhân hiện đang sở hữu theo pháp luật một bản. @vi
toolkit label: người chủ hiện tại @vi
toolkit definition: Tác nhân hiện đang sở hữu theo pháp luật một bản. @vi
label: har agent, som er nuværende ejer @da
definition: Relaterer et eksemplar til en agent, som p.t. er i lovlig besiddelse af et eksemplar. @da
toolkit label: agent, som er nuværende ejer @da
toolkit definition: Agent, som p.t. er i lovlig besiddelse af et eksemplar. @da
label: hat gegenwärtige Eigentümerin/gegenwärtigen Eigentümer (Akteur) @de
definition: Setzt ein Exemplar in Beziehung zu einem Akteur, der derzeit im rechtmäßigen Besitz eines Exemplars ist. @de
toolkit label: Gegenwärtige Eigentümerin/Gegenwärtiger Eigentümer (Akteur) @de
toolkit definition: Ein Akteur, der derzeit im rechtmäßigen Besitz eines Exemplars ist. @de
label: έχει τρέχοντα ιδιοκτήτη @el
definition: Συνδέει ένα αντίτυπο με έναν φορέα ο οποίος επί του παρόντος έχει τη νόμιμη κατοχή ενός αντιτύπου. @el
toolkit label: τρέχων ιδιοκτήτης @el
toolkit definition: Ένας φορέας, ο οποίος επί του παρόντος έχει τη νόμιμη κατοχή ενός αντιτύπου. @el
label: té com a agent propietari actual @ca
definition: Relaciona un ítem amb un agent que té la propietat legal actual d’un ítem. @ca
toolkit label: agent propietari actual @ca
toolkit definition: Agent que té la propietat legal actual d’un ítem. @ca
definition: Liittää kappaleen toimijaan, joka tällä hetkellä laillisesti omistaa kappaleen. @fi
toolkit label: nykyinen omistaja (toimija) @fi
toolkit definition: Toimija, joka tällä hetkellä laillisesti omistaa kappaleen. @fi
toolkit label: nåværende eier (agent) @no
toolkit definition: En agent som for tiden er den rettmessige eieren av et eksemplar. @no
has element type: 2
label: jelenlegi tulajdonos ágense a következő: @hu
definition: Hozzákapcsol egy példányt egy ágenshez, amelynek jelenleg jogszerű tulajdonában van egy példány. @hu
toolkit label: jelenlegi tulajdonos ágense: @hu
toolkit definition: Egy ágens, amelynek jelenleg jogszerű tulajdonában van egy példány. @hu
alternative label: current owner @en
alternative label: propriétaire actuel
alternative label: nykyinen omistaja @fi
label: nykyinen omistaja (toimija) @fi
label: har nåværende eier (agent) @no
definition: Relaterer et eksemplar til en agent som for tiden er den rettmessige eieren av et eksemplar. @no
alternative label: nåværende eier @no
label: heeft huidige eigenaar-actor @nl
definition: Relateert een item aan een actor die huidig wettelijk bezit heeft van een item. @nl
toolkit label: huidige eigenaar-actor @nl
toolkit definition: Een actor die huidig wettelijk bezit heeft van een item. @nl
label: له وكيل مالك حالي @ar
definition: يربط مفردة بوكيل لديه حاليا الملكية القانونية لمفردة. @ar
alternative label: مالك حالي @ar
toolkit label: وكيل مالك حالي @ar
toolkit definition: وكيل لديه حاليا الملكية القانونية لمفردة. @ar
alternative label: propietari actual @ca
alternative label: nuværende ejer @da
label: praegune omanik (tegija) @et
definition: Seostab eksemplari tegijaga, kellele praegu õiguspäraselt eksemplar kuulub. @et
alternative label: praegune omanik @et
toolkit label: praegune omanik (tegija) @et
toolkit definition: Tegija, kellele praegu õiguspäraselt eksemplar kuulub. @et
alternative label: jelenlegi tulajdonosa: @hu
label: ha come proprietario attuale agente @it
definition: Correla un item a un agente che detiene l'attuale proprietà giuridica di un item. @it
alternative label: proprietario attuale @it
toolkit label: proprietario attuale agente @it
toolkit definition: Agente che detiene l'attuale proprietà giuridica di un item. @it
label: pašreizējais īpašnieks (aģents) @lv
definition: Sasaista vienību ar aģentu, kas ir vienības pašreizējais likumīgais īpašnieks. @lv
toolkit label: pašreizējais īpašnieks (aģents) @lv
toolkit definition: Aģents, kas ir vienības pašreizējais likumīgais īpašnieks. @lv
alternative label: Gegenwärtiger Eigentümer @de
has subproperty: a pour agent collectif propriétaire actuel

a pour agent collectif propriétaire actuel
status: Published
label: has current owner collective agent @en
lexical alias: currentOwnerCollectiveAgent.en
definition: Relates an item to a collective agent who has current legal possession of an item. @en
toolkit label: current owner collective agent @en
toolkit definition: A collective agent who has current legal possession of an item. @en
type: Property
domain: C10003
has element type: 2
sub property of: a pour agent collectif propriétaire
sub property of: a pour agent propriétaire actuel
definition: Met un item en relation avec un agent collectif qui possède actuellement et légalement un item.
toolkit label: agent collectif propriétaire actuel
toolkit definition: Agent collectif qui possède actuellement et légalement un item.
label: nykyinen omistaja (yhteistoimija) @fi
definition: Liittää kappaleen yhteistoimijaan, joka tällä hetkellä laillisesti omistaa kappaleen. @fi
toolkit label: nykyinen omistaja (yhteistoimija) @fi
toolkit definition: Yhteistoimija, joka tällä hetkellä laillisesti omistaa kappaleen. @fi
label: har nåværende eier (kollektiv agent) @no
definition: Relaterer et eksemplar til en kollektiv agent som for tiden er den rettmessige eieren av et eksemplar. @no
toolkit label: nåværende eier (kollektiv agent) @no
toolkit definition: En kollektiv agent som for tiden er den rettmessige eieren av et eksemplar. @no
label: heeft huidige eigenaar-collectieve actor @nl
definition: Relateert een item aan een collectieve actor die huidig wettelijk bezit heeft van een item. @nl
toolkit label: huidige eigenaar-collectieve actor @nl
toolkit definition: Een collectieve actor die huidig wettelijk bezit heeft van een item. @nl
label: له وكيل جماعي مالك حالي @ar
definition: يربط مفردة بوكيل جماعي لديه حاليا الملكية القانونية لمفردة. @ar
toolkit label: وكيل جماعي مالك حالي @ar
toolkit definition: وكيل جماعي لديه حاليا الملكية القانونية لمفردة. @ar
label: té com a agent col·lectiu propietari actual @ca
definition: Relaciona un ítem amb un agent col·lectiu que té la propietat legal actual d’un ítem. @ca
toolkit label: agent col·lectiu propietari actual @ca
toolkit definition: Agent col·lectiu que té la propietat legal actual d’un ítem. @ca
label: har kollektiv agent, som er nuværende ejer @da
definition: Relaterer et eksemplar til en kollektiv agent, som p.t. er i lovlig besiddelse af et eksemplar. @da
toolkit label: kollektiv agent, som er nuværende ejer @da
toolkit definition: Kollektiv agent, som p.t. er i lovlig besiddelse af et eksemplar. @da
label: praegune omanik (kollektiiv) @et
definition: Seostab eksemplari kollektiiviga, kellele praegu õiguspäraselt eksemplar kuulub. @et
toolkit label: praegune omanik (kollektiiv) @et
toolkit definition: Kollektiiv, kellele praegu õiguspäraselt eksemplar kuulub. @et
label: hat gegenwärtige Eigentümerin/gegenwärtigen Eigentümer (Gemeinschaftlicher Akteur) @de
definition: Setzt ein Exemplar in Beziehung zu einem gemeinschaftlichen Akteur, der derzeit im rechtmäßigen Besitz eines Exemplars ist. @de
toolkit label: Gegenwärtige Eigentümerin/Gegenwärtiger Eigentümer (Gemeinschaftlicher Akteur) @de
toolkit definition: Ein gemeinschaftlicher Akteur, der derzeit im rechtmäßigen Besitz eines Exemplars ist. @de
label: jelenlegi tulajdonos kollektív ágense a következő: @hu
definition: Hozzákapcsol egy példányt egy kollektív ágenshez, amely jelenleg törvényesen birtokol egy példányt. @hu
toolkit label: jelenlegi tulajdonos kollektív ágense: @hu
toolkit definition: Egy kollektív ágens, amely jelenleg törvényesen birtokol egy példányt. @hu
label: ha come proprietario attuale agente collettivo @it
definition: Correla un item a un agente collettivo che detiene l'attuale proprietà giuridica di un item. @it
toolkit label: proprietario attuale agente collettivo @it
toolkit definition: Agente collettivo che detiene l'attuale proprietà giuridica di un item. @it
label: pašreizējais īpašnieks (grupa) @lv
definition: Sasaista vienību ar grupu, kas ir vienības pašreizējais likumīgais īpašnieks. @lv
toolkit label: pašreizējais īpašnieks (grupa) @lv
toolkit definition: Grupa, kas ir vienības pašreizējais likumīgais īpašnieks. @lv
has subproperty: a pour collectivité propriétaire actuelle
has subproperty: a pour famille propriétaire actuelle
has subproperty: a pour agent collectif déposant
has subproperty: P40117
label: 有当前拥有者集体行为者 @zh-hans
definition: 将一个单件与拥有对一个单件当前法定所有权的一个集体行为者关联起来。 @zh-hans
toolkit label: 当前拥有者集体行为者 @zh-hans
toolkit definition: 拥有对一个单件当前法定所有权的一个集体行为者 @zh-hans
label: mevcut sahip kolektif temsilcisi ile ilişkilidir @tr
definition: Bir kopyayı, bir kopyanın mevcut yasal mülkiyetine sahip olan kolektif bir temsilciyle ilişkilendirir. @tr
toolkit label: şu anki sahibi olan kolektif temsilci @tr
toolkit definition: Bir kopyanın mevcut yasal mülkiyetine sahip olan kolektif bir temsilci. @tr

a pour collectivité propriétaire actuelle
status: Published
label: has current owner corporate body @en
lexical alias: currentOwnerCorporateBody.en
definition: Relates an item to a corporate body who has current legal possession of an item. @en
toolkit label: current owner corporate body @en
toolkit definition: A corporate body who has current legal possession of an item. @en
type: Property
domain: C10003
has element type: 2
sub property of: a pour collectivité propriétaire
sub property of: a pour agent collectif propriétaire actuel
definition: Met un item en relation avec une collectivité qui possède actuellement et légalement un item.
toolkit label: collectivité propriétaire actuelle
toolkit definition: Collectivité qui possède actuellement et légalement un item.
label: nykyinen omistaja (yhteisö) @fi
definition: Liittää kappaleen yhteisöön, joka tällä hetkellä laillisesti omistaa kappaleen. @fi
toolkit label: nykyinen omistaja (yhteisö) @fi
toolkit definition: Yhteisö, joka tällä hetkellä laillisesti omistaa kappaleen. @fi
label: har nåværende eier (korporasjon) @no
definition: Relaterer et eksemplar til en korporasjon som for tiden er den rettmessige eieren av et eksemplar. @no
toolkit label: nåværende eier (korporasjon) @no
toolkit definition: En korporasjon som for tiden er den rettmessige eieren av et eksemplar. @no
label: heeft huidige eigenaar-corporatie @nl
definition: Relateert een item aan een corporatie die huidig wettelijk bezit heeft van een item. @nl
toolkit label: huidige eigenaar-corporatie @nl
toolkit definition: Een corporatie die huidig wettelijk bezit heeft van een item. @nl
label: له هيئة مالكة حاليا @ar
definition: يربط مفردة بهيئة لديها حاليا الملكية القانونية لمفردة. @ar
toolkit label: هيئة مالكة حاليا @ar
toolkit definition: هيئة لديها حاليا الملكية القانونية لمفردة. @ar
label: té com a entitat corporativa propietària actual @ca
definition: Relaciona un ítem amb una entitat corporativa que té la propietat legal actual d’un ítem. @ca
toolkit label: entitat corporativa propietària actual @ca
toolkit definition: Entitat corporativa que té la propietat legal actual d’un ítem. @ca
label: har korporation, som er nuværende ejer @da
definition: Relaterer et eksemplar til en korporation, som p.t. er i lovlig besiddelse af et eksemplar. @da
toolkit label: korporation, som er nuværende ejer @da
toolkit definition: Korporation, som p.t. er i lovlig besiddelse af et eksemplar. @da
label: praegune omanik (asutus) @et
definition: Seostab eksemplari asutusega, kellele praegu õiguspäraselt eksemplar kuulub. @et
toolkit label: praegune omanik (asutus) @et
toolkit definition: Asutus, kellele praegu õiguspäraselt eksemplar kuulub. @et
label: hat gegenwärtige Eigentümerin/gegenwärtigen Eigentümer (Körperschaft) @de
definition: Setzt ein Exemplar in Beziehung zu einer Körperschaft, die derzeit im rechtmäßigen Besitz eines Exemplars ist. @de
toolkit label: Gegenwärtige Eigentümerin/Gegenwärtiger Eigentümer (Körperschaft) @de
toolkit definition: Eine Körperschaft, die derzeit im rechtmäßigen Besitz eines Exemplars ist. @de
label: jelenlegi tulajdonos testülete a következő: @hu
definition: Egy példányt hozzákapcsol egy testülethez, amely jelenleg törvényesen birtokolja a példányt. @hu
toolkit label: jelenlegi tulajdonos testülete: @hu
toolkit definition: Egy testület, amely jelenleg törvényesen birtokol egy példányt. @hu
label: ha come proprietario attuale ente @it
definition: Correla un item a un ente che detiene l'attuale proprietà giuridica di un item. @it
toolkit label: proprietario attuale ente @it
toolkit definition: Ente che detiene la proprietà giuridica attuale di un item. @it
label: pašreizējais īpašnieks (institūcija) @lv
definition: Sasaista vienību ar institūciju, kas ir vienības pašreizējais likumīgais īpašnieks. @lv
toolkit label: pašreizējais īpašnieks (institūcija) @lv
toolkit definition: Institūcija, kas ir vienības pašreizējais likumīgais īpašnieks. @lv
has subproperty: a pour collectivité déposante
has subproperty: P40133
label: 有当前拥有者团体 @zh-hans
definition: 将一个单件与拥有对一个单件当前法定所有权的一个团体关联起来。 @zh-hans
toolkit label: 当前拥有者团体 @zh-hans
toolkit definition: 拥有对一个单件当前法定所有权的一个团体 @zh-hans
label: mevcut sahip tüzel kişisi ile ilişkilidir @tr
definition: Bir kopyayı, bir kopyanın halihazırda yasal mülkiyetine sahip olan tüzel bir kişiyle ilişkilendirir. @tr
toolkit label: şu anki sahibi olan tüzel kişi @tr
toolkit definition: Bir kopyanın mevcut yasal mülkiyetine sahip olan bir tüzel kişi. @tr

a pour famille propriétaire actuelle
status: Published
label: has current owner family @en
lexical alias: currentOwnerFamily.en
definition: Relates an item to a family who has current legal possession of an item. @en
toolkit label: current owner family @en
toolkit definition: A family who has current legal possession of an item. @en
type: Property
domain: C10003
has element type: 2
sub property of: a pour famille propriétaire
sub property of: a pour agent collectif propriétaire actuel
definition: Met un item en relation avec une famille qui possède actuellement et légalement un item.
toolkit label: famille propriétaire actuelle
toolkit definition: Famille qui possède actuellement et légalement un item.
label: nykyinen omistaja (suku) @fi
definition: Liittää kappaleen sukuun, joka tällä hetkellä laillisesti omistaa kappaleen. @fi
toolkit label: nykyinen omistaja (suku) @fi
toolkit definition: Suku, joka tällä hetkellä laillisesti omistaa kappaleen. @fi
label: har nåværende eier (familie) @no
definition: Relaterer et eksemplar til en familie som for tiden er den rettmessige eieren av et eksemplar. @no
toolkit label: nåværende eier (familie) @no
toolkit definition: En familie som for tiden er den rettmessige eieren av et eksemplar. @no
label: heeft huidige eigenaar-familie @nl
definition: Relateert een item aan een familie die huidig wettelijk bezit heeft van een item. @nl
toolkit label: huidige eigenaar-familie @nl
toolkit definition: Een familie die huidig wettelijk bezit heeft van een item. @nl
label: له عائلة مالكة حاليا @ar
definition: يربط مفردة بعائلة لديها حاليا الملكية القانونية لمفردة. @ar
toolkit label: عائلة مالكة حاليا @ar
toolkit definition: عائلة لديها حاليا الملكية القانونية لمفردة. @ar
label: té com a família propietària actual @ca
definition: Relaciona un ítem amb una família que té la propietat legal actual d’un ítem. @ca
toolkit label: família propietària actual @ca
toolkit definition: Família que té la propietat legal actual d’un ítem. @ca
label: har familie, som er nuværende ejer @da
definition: Relaterer et eksemplar til en familie, som p.t. er i lovlig besiddelse af et eksemplar. @da
toolkit label: familie, som er nuværende ejer @da
toolkit definition: Familie, som p.t. er i lovlig besiddelse af et eksemplar. @da
label: praegune omanik (perekond) @et
definition: Seostab eksemplari perekonnaga, kellele praegu õiguspäraselt eksemplar kuulub. @et
toolkit label: praegune omanik (perekond) @et
toolkit definition: Perekond, kellele praegu õiguspäraselt eksemplar kuulub. @et
label: hat gegenwärtige Eigentümerin/gegenwärtigen Eigentümer (Familie) @de
definition: Setzt ein Exemplar in Beziehung zu einer Familie, die derzeit im rechtmäßigen Besitz eines Exemplars ist. @de
toolkit label: Gegenwärtige Eigentümerin/Gegenwärtiger Eigentümer (Familie) @de
toolkit definition: Eine Familie, die derzeit im rechtmäßigen Besitz eines Exemplars ist. @de
label: jelenleg tulajdonos családja a következő: @hu
definition: Egy példányt hozzákapcsol egy családhoz, amely jelenleg törvényesen birtokolja a példányt. @hu
toolkit label: jelenleg tulajdonos családja: @hu
toolkit definition: Egy család, amely jelenleg törvényesen birtokol.egy példányt @hu
label: ha come proprietario attuale famiglia @it
definition: Correla un item a una famiglia che detiene l'attuale proprietà giuridica di un item. @it
toolkit label: proprietario attuale famiglia @it
toolkit definition: Famiglia che detiene l'attuale proprietà giuridica di un item. @it
label: pašreizējais īpašnieks (dzimta/ģimene) @lv
definition: Sasaista vienību ar dzimtu/ģimeni, kas ir vienības pašreizējais likumīgais īpašnieks. @lv
toolkit label: pašreizējais īpašnieks (dzimta/ģimene) @lv
toolkit definition: Dzimta/ģimene, kas ir vienības pašreizējais likumīgais īpašnieks. @lv
has subproperty: a pour famille déposante
has subproperty: P40149
label: 有当前拥有者家族 @zh-hans
definition: 将一个家族与拥有对一个单件当前法定所有权的一个家族关联起来。 @zh-hans
toolkit label: 当前拥有者家族 @zh-hans
toolkit definition: 拥有对一个单件当前法定所有权的一个家族 @zh-hans
label: mevcut sahip ailesi ile ilişkilidir @tr
definition: Bir kopyayı, bir kopyanın mevcut yasal mülkiyetine sahip olan bir aileyle ilişkilendirir. @tr
toolkit label: şu anki sahibi olan aile @tr
toolkit definition: Bir kopyanın şu anda yasal mülkiyetine sahip olan bir aile. @tr

a pour personne propriétaire actuelle
status: Published
label: has current owner person @en
lexical alias: currentOwnerPerson.en
definition: Relates an item to a person who has current legal possession of an item. @en
toolkit label: current owner person @en
toolkit definition: A person who has current legal possession of an item. @en
type: Property
domain: C10003
has element type: 2
sub property of: a pour personne propriétaire
sub property of: a pour agent propriétaire actuel
definition: Met un item en relation avec une personne qui possède actuellement et légalement un item.
toolkit label: personne propriétaire actuelle
toolkit definition: Personne qui possède actuellement et légalement un item.
label: nykyinen omistaja (henkilö) @fi
definition: Liittää kappaleen henkilöön, joka tällä hetkellä laillisesti omistaa kappaleen. @fi
toolkit label: nykyinen omistaja (henkilö) @fi
toolkit definition: Henkilö, joka tällä hetkellä laillisesti omistaa kappaleen. @fi
label: har nåværende eier (person) @no
definition: Relaterer et eksemplar til en person som for tiden er den rettmessige eieren av et eksemplar. @no
toolkit label: nåværende eier (person) @no
toolkit definition: En person som for tiden er den rettmessige eieren av et eksemplar. @no
label: heeft huidige eigenaar-persoon @nl
definition: Relateert een item aan een persoon die huidig wettelijk bezit heeft van een item. @nl
toolkit label: huidige eigenaar-persoon @nl
toolkit definition: Een persoon die huidig wettelijk bezit heeft van een item. @nl
label: له شخص مالك حالي @ar
definition: يربط مفردة بشخص لديه حاليا الملكية القانونية لمفردة. @ar
toolkit label: شخص مالك حالي @ar
toolkit definition: شخص لديه حاليا الملكية القانونية لمفردة @ar
label: té com a persona propietària actual @ca
definition: Relaciona un ítem amb una persona que té la propietat legal actual d’un ítem. @ca
toolkit label: persona propietària actual @ca
toolkit definition: Persona que té la propietat legal actual d’un ítem. @ca
label: har person, som er nuværende ejer @da
definition: Relaterer et eksemplar til en person, som p.t. er i lovlig besiddelse af et eksemplar. @da
toolkit label: person, som er nuværende ejer @da
toolkit definition: Person, som p.t. er i lovlig besiddelse af et eksemplar. @da
label: praegune omanik (isik) @et
definition: Seostab eksemplari isikuga, kellele praegu õiguspäraselt eksemplar kuulub. @et
toolkit label: praegune omanik (isik) @et
toolkit definition: Isik, kellele praegu õiguspäraselt eksemplar kuulub. @et
label: hat gegenwärtige Eigentümerin/gegenwärtigen Eigentümer (Person) @de
definition: Setzt ein Exemplar in Beziehung zu einer Person, die derzeit im rechtmäßigen Besitz eines Exemplars ist. @de
toolkit label: Gegenwärtige Eigentümerin/Gegenwärtiger Eigentümer (Person) @de
toolkit definition: Eine Person, die derzeit im rechtmäßigen Besitz eines Exemplars ist. @de
label: jelenlegi tulajdonos személye a következő: @hu
definition: Hozzákapcsol egy példányt egy személyhez, aki jelenleg törvényesen birtokol egy példányt. @hu
toolkit label: jelenlegi tulajdonos személye: @hu
toolkit definition: Egy személy, aki jelenleg törvényesen birtokol egy példányt. @hu
label: ha come proprietario attuale persona @it
definition: Correla un item a una persona che detiene l'attuale proprietà giuridica di un item. @it
toolkit label: proprietario attuale persona @it
toolkit definition: Persona che detiene l'attuale proprietà giuridica di un item. @it
label: pašreizējais īpašnieks (persona) @lv
definition: Sasaista vienību ar personu, kura ir vienības pašreizējais likumīgais īpašnieks. @lv
toolkit label: pašreizējais īpašnieks (persona) @lv
toolkit definition: Persona, kura ir vienības pašreizējais likumīgais īpašnieks. @lv
has subproperty: a pour personne déposante
has subproperty: P40101
label: 有当前拥有者个人 @zh-hans
definition: 将一个单件与拥有对一个单件当前法定所有权的一个个人关联起来。 @zh-hans
toolkit label: 当前拥有者个人 @zh-hans
toolkit definition: 拥有对一个单件当前法定所有权的一个个人 @zh-hans
label: mevcut sahip kişisi ile ilişkilidir @tr
definition: Bir kopyayı, bir kopyanın mevcut yasal mülkiyetine sahip olan bir kişiyle ilişkilendirir. @tr
toolkit label: şu anki sahibi olan kişi @tr
toolkit definition: Bir kopyanın mevcut yasal mülkiyetine sahip olan bir kişi. @tr

a pour historique de la garde d’un item
status: Published
label: has custodial history of item @en
definition: Relates an item to a record of previous ownership or custodianship of an item, including agent, place, and timespan. @en
type: Property
domain: C10003
lexical alias: custodialHistoryOfItem.en
instruction number: 2.18
toolkit label: custodial history of item @en
toolkit definition: A record of previous ownership or custodianship of an item, including agent, place, and timespan. @en
definition: Met un item en relation avec un enregistrement de la propriété ou de la garde antérieure d’un item, notamment un agent, un lieu et un laps de temps.
toolkit label: historique de la garde d’un item
toolkit definition: Enregistrement de la propriété ou de la garde antérieure d’un item, notamment un agent, un lieu et un laps de temps.
toolkit label: historia de la custodia del ítem @es
toolkit definition: Un registro de la propiedad anterior o custodia de un ítem. @es
label: có lịch sử giám hộ của bản @vi
definition: Liên kết bản với với hồ sơ về quyền sở hữu hoặc quyền giám hộ trước đây của bản. @vi
toolkit label: lịch sử giám hộ của bản @vi
toolkit definition: Với hồ sơ về quyền sở hữu hoặc quyền giám hộ trước đây của bản. @vi
label: har proveniens af eksemplar @da
definition: Relaterer et eksemplar til en optegnelse over tidligere ejerskab eller opbevaring af et eksemplar, inklusiv agent, sted og tidsperiode. @da
toolkit label: proveniens @da
toolkit definition: Optegnelse over tidligere ejerskab eller opbevaring af et eksemplar, inklusiv agent, sted og tidsperiode. @da
label: hat Besitzhistorie eines Exemplars @de
definition: Setzt ein Exemplar in Beziehung zu einem Bericht über frühere Eigentümerinnen/Eigentümer oder Verwahrerinnen/Verwahrer eines Exemplars, einschließlich eines Akteurs, eines Geografikums und eines Zeitraums. @de
toolkit label: Besitzhistorie eines Exemplars @de
toolkit definition: Ein Bericht über frühere Eigentümerinnen/Eigentümer oder Verwahrerinnen/Verwahrer eines Exemplars, einschließlich eines Akteurs, eines Geografikums und eines Zeitraums. @de
label: έχει ιστορία θεματοφύλακα του αντιτύπου @el
definition: Συνδέει ένα αντίτυπο με μια εγγραφή της προηγούμενης ιδιοκτησίας ή της θεματοφυλακής ενός αντιτύπου. @el
toolkit label: ιστορία του θεματοφύλακα του αντιτύπου @el
toolkit definition: Μια εγγραφή της προηγούμενης ιδιοκτησίας ή της θεματοφυλακής ενός αντιτύπου. @el
label: té com a història de custòdia d’un ítem @ca
definition: Relaciona un ítem amb un registre dels propietaris anteriors o de la custòdia prèvia d’un ítem, incloent-hi l’agent, el lloc i l’interval de temps. @ca
toolkit label: història de custòdia d’un ítem @ca
toolkit definition: Registre dels propietaris anteriors o de la custòdia prèvia d’un ítem, incloent-hi l’agent, el lloc i l’interval de temps. @ca
definition: Liittää kappaleen tietoihin kappaleen omistus- tai säilytyshistoriasta, mukaanlukien tiedot toimijoista, paikoista ja ajanjaksoista. @fi
toolkit label: kappaleen omistushistoria @fi
toolkit definition: Tiedot kappaleen omistus- tai säilytyshistoriasta, mukaanlukien tiedot toimijoista, paikoista ja ajanjaksoista. @fi
toolkit label: oppbevaringshistorikk for eksemplar @no
toolkit definition: En angivelse av tidligere eierforhold eller oppbevaring av et eksemplar, inkludert agent, sted og tidsrom. @no
has element type: 6
label: példány őrzési története a következő: @hu
definition: Hozzákapcsol egy példányt a példány korábbi tulajdoni vagy letéti őrzési feljegyzéséhez, amely tartalmaz ágenst, helyet és időtartamot. @hu
toolkit label: példány őrzési története: @hu
toolkit definition: A példány korábbi tulajdoni vagy letéti őrzési feljegyzése, amely tartalmaz ágenst, helyet és időtartamot. @hu
label: kappaleen omistushistoria @fi
label: har oppbevaringshistorikk for eksemplar @no
definition: Relaterer et eksemplar til en angivelse av tidligere eierforhold eller oppbevaring av et eksemplar, inkludert agent, sted og tidsrom. @no
label: heeft bewaargeschiedenis van item @nl
definition: Relateert een item aan een optekening van voormalig eigenaarschap of curatele van een item, inclusief actor, plaats en tijdspanne. @nl
toolkit label: bewaargeschiedenis van item @nl
toolkit definition: Een optekening van voormalig eigenaarschap of curatele van een item, inclusief actor, plaats en tijdspanne. @nl
label: له تاريخ وصاية على مفردة @ar
definition: يربط مفردة بسجل ملكية سابقة أو بوصاية على مفردة، تتضمن وكيلا، ومكانا، وفترة زمنية. @ar
toolkit label: تاريخ وصاية على مفردة @ar
toolkit definition: سجل ملكية أو وصاية سابقة لمفردة، تتضمن وكيلا، ومكانا، و فترة زمنية @ar
label: eksemplari hoiustamise ajalugu @et
definition: Seostab eksemplari andmetega eksemplari varasemate omanike ja vastutavate hoidjate kohta, sealhulgas andmed tegijatest, kohtadest ja ajavahemikest. @et
toolkit label: eksemplari hoiustamise ajalugu @et
toolkit definition: Andmed eksemplari varasemate omanike ja vastutavate hoidjate kohta, sealhulgas andmed tegijatest, kohtadest ja ajavahemikest. @et
label: ha come storia della custodia di item @it
definition: Correla un item a una registrazione di una precedente proprietà o custodia di un item, che comprende agente, luogo e arco di tempo. @it
toolkit label: storia della custodia di item @it
toolkit definition: Registrazione di una precedente proprietà o custodia di un item, che comprende agente, luogo e arco di tempo. @it
label: vienības pārvaldīšanas vēsture @lv
definition: Sasaista vienību ar ierakstu par vienības iepriekšējiem īpašniekiem vai glabātājiem, ieskaitot aģentu, vietu un laikposmu. @lv
toolkit label: vienības pārvaldīšanas vēsture @lv
toolkit definition: Ieraksts par vienības iepriekšējiem īpašniekiem vai glabātājiem, ieskaitot aģentu, vietu un laikposmu. @lv
has subproperty: P40026
label: 有单件的保管历史 @zh-hans
definition: 将一个单件与关于单件以往拥有或保管情况的记录（包括行为者、地点和时间段）关联起来。 @zh-hans
toolkit label: 单件的保管历史 @zh-hans
toolkit definition: 关于单件以往拥有或保管情况的记录（包括行为者、地点和时间段） @zh-hans
label: kopya koruma geçmişi ile ilişkilidir @tr
definition: Bir kopyayı, temsilci, yer ve zaman aralığı dahil olmak üzere bir öğenin önceki mülkiyeti veya velayet kaydıyla ilişkilendirir. @tr
toolkit label: kopyanın korunma geçmişi @tr
toolkit definition: Temsilci, yer ve zaman aralığı da dahil olmak üzere bir kopyanın önceki sahipliğinin veya gözetiminin bir kaydı. @tr

a pour agent dépositaire
status: Published
label: has custodian agent @en
definition: Relates an item to an agent who has legal custody of an item. @en
type: Property
domain: C10003
lexical alias: custodianAgent.en
instruction number: 22.3
toolkit label: custodian agent @en
toolkit definition: An agent who has legal custody of an item. @en
definition: Met un item en relation avec un agent à qui est confiée la garde légale d’un item.
toolkit label: agent dépositaire
toolkit definition: Agent à qui est confiée la garde légale d’un item.
toolkit label: custodio @es
toolkit definition: Una persona, familia o entidad corporativa que tiene la custodia legal de un ítem. @es
label: har förvaltare @sv
toolkit label: förvaltare @sv
sub property of: a pour agent en relation avec un item
label: có người giám hộ @vi
definition: Liên kết bản với tác nhân giám hộ theo pháp luật một bản. @vi
toolkit label: người giám hộ @vi
toolkit definition: Tác nhân giám hộ theo pháp luật một bản. @vi
label: har agent, som er forvalter @da
definition: Relaterer et eksemplar til en agent, som lovligt har et eksemplar i forvaring. @da
toolkit label: agent, som er forvalter @da
toolkit definition: Agent, der lovligt har et eksemplar i forvaring. @da
label: hat Verwahrerin/Verwahrer (Akteur) @de
definition: Setzt ein Exemplar in Beziehung zu einem Akteur, dem die rechtmäßige Verwahrung eines Exemplars obliegt. @de
toolkit label: Verwahrerin/Verwahrer (Akteur) @de
toolkit definition: Ein Akteur, dem die rechtmäßige Verwahrung eines Exemplars obliegt. @de
label: έχει θεματοφύλακα @el
definition: Συνδέει ένα αντίτυπο με έναν φορέα που έχει τη νόμιμη επιμέλεια φύλαξης ενός αντιτύπου. @el
toolkit label: θεματοφύλακας @el
toolkit definition: Ένας φορέας ο οποίος έχει τη νόμιμη επιμέλεια φύλαξης ενός αντιτύπου. @el
label: té com a agent dipositari @ca
definition: Relaciona un ítem amb un agent que té la custodia legal d’un ítem. @ca
toolkit label: agent dipositari @ca
toolkit definition: Agent que té la custodia legal d’un ítem. @ca
definition: Liittää kappaleen toimijaan, jolla on kappaleen laillinen säilyttämisoikeus. @fi
toolkit label: säilyttäjä (toimija) @fi
toolkit definition: Toimija, jolla on kappaleen laillinen säilyttämisoikeus. @fi
toolkit label: oppbevarer (agent) @no
toolkit definition: En agent som har et eksemplar i lovlig forvaring. @no
has element type: 2
label: letétkezelő ágense a következő: @hu
definition: Hozzákapcsol egy példányt egy ágenshez, amely egy példány törvényes megőrzője. @hu
toolkit label: letétkezelő ágense: @hu
toolkit definition: Egy ágens, amely egy példány törvényes megőrzője. @hu
alternative label: custodian @en
alternative label: dépositaire
alternative label: säilyttäjä @fi
label: säilyttäjä (toimija) @fi
label: har oppbevarer (agent) @no
definition: Relaterer et eksemplar til en agent som har et eksemplar i lovlig forvaring. @no
alternative label: oppbevarer @no
label: heeft curatele-actor @nl
definition: Relateert een item aan een actor die van rechtswege een item bewaart. @nl
toolkit label: curatele-actor @nl
toolkit definition: Een actor die van rechtswege een item bewaart. @nl
label: له وكيل وصى @ar
definition: يربط مفردة بوكيل لديه الوصاية القانونية على مفردة. @ar
alternative label: موصى @ar
toolkit label: وكيل وصى @ar
toolkit definition: وكيل لديه الوصاية القانونية على مفردة @ar
alternative label: dipositari @ca
alternative label: forvalter @da
label: vastutav hoidja (tegija) @et
definition: Seostab eksemplari tegijaga, kelle õiguspärasel vastutaval hoiul eksemplar on. @et
alternative label: vastutav hoidja @et
toolkit label: vastutav hoidja (tegija) @et
toolkit definition: Tegija, kelle õiguspärasel vastutaval hoiul eksemplar on. @et
alternative label: letétkezelője: @hu
label: ha come depositario agente @it
definition: Correla un item a un agente che ha la custodia giuridica di un item. @it
alternative label: depositario @it
toolkit label: depositario agente @it
toolkit definition: Agente che ha la custodia giuridica di un item. @it
label: pārvaldītājs (aģents) @lv
definition: Sasaista vienību ar aģentu, kas likumīgi glabā vienību. @lv
toolkit label: pārvaldītājs (aģents) @lv
toolkit definition: Aģents, kas likumīgi glabā vienību. @lv

a pour agent collectif dépositaire
status: Published
label: has custodian collective agent @en
lexical alias: custodianCollectiveAgent.en
definition: Relates an item to a collective agent who has legal custody of an item. @en
toolkit label: custodian collective agent @en
toolkit definition: A collective agent who has legal custody of an item. @en
type: Property
domain: C10003
has element type: 2
sub property of: a pour agent collectif en relation avec un item
sub property of: a pour agent dépositaire
definition: Met un item en relation avec un agent collectif à qui est confiée la garde légale d’un item.
toolkit label: agent collectif dépositaire
toolkit definition: Agent collectif à qui est confiée la garde légale d’un item.
label: säilyttäjä (yhteistoimija) @fi
definition: Liittää kappaleen yhteistoimijaan, jolla on kappaleen laillinen säilyttämisoikeus. @fi
toolkit label: säilyttäjä (yhteistoimija) @fi
toolkit definition: Yhteistoimija, jolla on kappaleen laillinen säilyttämisoikeus. @fi
label: har oppbevarer (kollektiv agent) @no
definition: Relaterer et eksemplar til en kollektiv agent som har et eksemplar i lovlig forvaring. @no
toolkit label: oppbevarer (kollektiv agent) @no
toolkit definition: En kollektiv agent som har et eksemplar i lovlig forvaring. @no
label: heeft curatele-collectieve actor @nl
definition: Relateert een item aan een collectieve actor die van rechtswege een item bewaart. @nl
toolkit label: curatele-collectieve actor @nl
toolkit definition: Een collectieve actor die van rechtswege een item bewaart. @nl
label: له وكيل جماعي وصي @ar
definition: يربط مفردة بوكيل جماعي لديه الوصاية القانونية على مفردة. @ar
toolkit label: وكيل جماعي وصى @ar
toolkit definition: وكيل جماعي لديه الوصاية القانونية على مفردة. @ar
label: té com a agent col·lectiu dipositari @ca
definition: Relaciona un ítem amb un agent col·lectiu que té la custodia legal d’un ítem. @ca
toolkit label: agent col·lectiu dipositari @ca
toolkit definition: Agent col·lectiu que té la custodia legal d’un ítem. @ca
label: har kollektiv agent, som er forvalter @da
definition: Relaterer et eksemplar til en kollektiv agent, som lovligt har et eksemplar i forvaring. @da
toolkit label: kollektiv agent, som er forvalter @da
toolkit definition: Kollektiv agent, som lovligt har et eksemplar i forvaring. @da
label: vastutav hoidja (kollektiiv) @et
definition: Seostab eksemplari kollektiiviga, kelle õiguspärasel vastutaval hoiul eksemplar on. @et
toolkit label: vastutav hoidja (kollektiiv) @et
toolkit definition: Kollektiiv, kelle õiguspärasel vastutaval hoiul eksemplar on. @et
label: hat Verwahrerin/Verwahrer (Gemeinschaftlicher Akteur) @de
definition: Setzt ein Exemplar in Beziehung zu einem gemeinschaftlichen Akteur, dem die rechtmäßige Verwahrung eines Exemplars obliegt. @de
toolkit label: Verwahrerin/Verwahrer (Gemeinschaftlicher Akteur) @de
toolkit definition: Ein gemeinschaftlicher Akteur, dem die rechtmäßige Verwahrung eines Exemplars obliegt. @de
label: letétkezelő kollektív ágense a következő: @hu
definition: Hozzákapcsol egy példányt egy kollektív ágenshez, amely egy példány törvényes megőrzője. @hu
toolkit label: letétkezelő kollektív ágense: @hu
toolkit definition: Egy kollektív ágen, amely egy példány törvényes megőrzője. @hu
label: ha come depositario agente collettivo @it
definition: Correla un item a un agente collettivo che detiene la custodia giuridica di un item. @it
toolkit label: depositario agente collettivo @it
toolkit definition: Agente collettivo che detiene la custodia giuridica di un item. @it
label: pārvaldītājs (grupa) @lv
definition: Sasaista vienību ar grupu, kas likumīgi glabā vienību. @lv
toolkit label: pārvaldītājs (grupa) @lv
toolkit definition: Grupa, kas likumīgi glabā vienību. @lv
has subproperty: a pour collectivité dépositaire
has subproperty: a pour famille dépositaire
has subproperty: P40119
label: 有保管者集体行为者 @zh-hans
definition: 将一个单件与对一个单件拥有合法保管权的一个集体行为者关联起来。 @zh-hans
toolkit label: 保管者集体行为者 @zh-hans
toolkit definition: 对一个单件拥有合法保管权的一个集体行为者 @zh-hans
label: koruyucu kolektif temsilcisi ile ilişkilidir @tr
definition: Bir kopyayı, bir kopyayı yasal velayetine sahip olan kolektif bir temsilciyle ilişkilendirir. @tr
toolkit label: koruyucu kolektif temsilci @tr
toolkit definition: Bir kopyanın yasal velayetini elinde bulunduran kolektif bir temsilci. @tr

a pour collectivité dépositaire
status: Published
label: has custodian corporate body @en
lexical alias: custodianCorporateBody.en
definition: Relates an item to a corporate body who has legal custody of an item. @en
toolkit label: custodian corporate body @en
toolkit definition: A corporate body who has legal custody of an item. @en
type: Property
domain: C10003
has element type: 2
sub property of: a pour collectivité en relation avec un item
sub property of: a pour agent collectif dépositaire
definition: Met un item en relation avec une collectivité à qui est confiée la garde légale d’un item.
toolkit label: collectivité dépositaire
toolkit definition: Collectivité à qui est confiée la garde légale d’un item.
label: säilyttäjä (yhteisö) @fi
definition: Liittää kappaleen yhteisöön, jolla on kappaleen laillinen säilyttämisoikeus. @fi
toolkit label: säilyttäjä (yhteisö) @fi
toolkit definition: Yhteisö, jolla on kappaleen laillinen säilyttämisoikeus. @fi
label: har oppbevarer (korporasjon) @no
definition: Relaterer et eksemplar til en korporasjon som har et eksemplar i lovlig forvaring. @no
toolkit label: oppbevarer (korporasjon) @no
toolkit definition: En korporasjon som har et eksemplar i lovlig forvaring. @no
label: heeft curatele-corporatie @nl
definition: Relateert een item aan een corporatie die van rechtswege een item bewaart. @nl
toolkit label: curatele-corporatie @nl
toolkit definition: Een corporatie die van rechtswege een item bewaart. @nl
label: له هيئة وصية @ar
definition: يربط مفردة بهيئة لديها الوصاية القانونية على مفردة. @ar
toolkit label: هيئة وصية @ar
toolkit definition: هيئة لديها الوصاية القانونية على مفردة. @ar
label: té com a entitat corporativa dipositària @ca
definition: Relaciona un ítem amb una entitat corporativa que té la custodia legal d’un ítem. @ca
toolkit label: entitat corporativa dipositària @ca
toolkit definition: Entitat corporativa que té la custodia legal d’un ítem. @ca
label: har korporation, som er forvalter @da
definition: Relaterer et eksemplar til en korporation, som lovligt har et eksemplar i forvaring. @da
toolkit label: korporation, som er forvalter @da
toolkit definition: Korporation, som lovligt har et eksemplar i forvaring. @da
label: vastutav hoidja (asutus) @et
definition: Seostab eksemplari asutusega, kelle õiguspärasel vastutaval hoiul eksemplar on. @et
toolkit label: vastutav hoidja (asutus) @et
toolkit definition: Asutus, kelle õiguspärasel vastutaval hoiul eksemplar on. @et
label: hat Verwahrerin/Verwahrer (Körperschaft) @de
definition: Setzt ein Exemplar in Beziehung zu einer Körperschaft, der die rechtmäßige Verwahrung eines Exemplars obliegt. @de
toolkit label: Verwahrerin/Verwahrer (Körperschaft) @de
toolkit definition: Eine Körperschaft, der die rechtmäßige Verwahrung eines Exemplars obliegt. @de
label: letétkezelő testülete a következő: @hu
definition: Egy példányt hozzákapcsol egy testülethez, amely a példány törvényes megőrzője. @hu
toolkit label: letétkezelő testülete: @hu
toolkit definition: Egy testület, amely egy példány törvényes megőrzője. @hu
label: ha come depositario ente @it
definition: Correla un item a un ente che detiene la custodia giuridica di un item. @it
toolkit label: depositario ente @it
toolkit definition: Ente che detiene la custodia giuridica di un item. @it
label: pārvaldītājs (institūcija) @lv
definition: Sasaista vienību ar institūciju, kas likumīgi glabā vienību. @lv
toolkit label: pārvaldītājs (institūcija) @lv
toolkit definition: Institūcija, kas likumīgi glabā vienību. @lv
has subproperty: P40135
label: 有保管者团体 @zh-hans
definition: 将一个单件与对一个单件拥有合法保管权的一个团体关联起来。 @zh-hans
toolkit label: 保管者团体 @zh-hans
toolkit definition: 对一个单件拥有合法保管权的一个团体 @zh-hans
label: koruyucu tüzel kişisi ile ilişkilidir @tr
definition: Bir kopyayı, bir kopyanın yasal velayetine sahip olan tüzel bir kişiyle ilişkilendirir. @tr
toolkit label: koruyucu tüzel kişi @tr
toolkit definition: Bir kopyanın yasal velayetine sahip olan tüzel kişi. @tr

a pour famille dépositaire
status: Published
label: has custodian family @en
lexical alias: custodianFamily.en
definition: Relates an item to a family who has legal custody of an item. @en
toolkit label: custodian family @en
toolkit definition: A family who has legal custody of an item. @en
type: Property
domain: C10003
has element type: 2
sub property of: a pour famille en relation avec un item
sub property of: a pour agent collectif dépositaire
definition: Met un item en relation avec une famille à qui est confiée la garde légale d’un item.
toolkit label: famille dépositaire
toolkit definition: Famille à qui est confiée la garde légale d’un item.
label: säilyttäjä (suku) @fi
definition: Liittää kappaleen sukuun, jolla on kappaleen laillinen säilyttämisoikeus. @fi
toolkit label: säilyttäjä (suku) @fi
toolkit definition: Suku, jolla on kappaleen laillinen säilyttämisoikeus. @fi
label: har oppbevarer (familie) @no
definition: Relaterer et eksemplar til en familie som har et eksemplar i lovlig forvaring. @no
toolkit label: oppbevarer (familie) @no
toolkit definition: En familie som har et eksemplar i lovlig forvaring. @no
label: heeft curatele-familie @nl
definition: Relateert een item aan een familie die van rechtswege een item bewaart. @nl
toolkit label: curatele-familie @nl
toolkit definition: Een familie die van rechtswege een item bewaart. @nl
label: له عائلة وصية @ar
definition: يربط مفردة بعائلة لديها الوصاية القانونية على مفردة @ar
toolkit label: عائلة وصية @ar
toolkit definition: عائلة لديها الوصاية القانونية على مفردة. @ar
label: té com a família dipositària @ca
definition: Relaciona un ítem amb una família que té la custodia legal d’un ítem. @ca
toolkit label: família dipositària @ca
toolkit definition: Família que té la custodia legal d’un ítem. @ca
label: har familie, som er forvalter @da
definition: Relaterer et eksemplar til en familie, som lovligt har et eksemplar i forvaring. @da
toolkit label: familie, som er forvalter @da
toolkit definition: Familie, som lovligt har et eksemplar i forvaring. @da
label: vastutav hoidja (perekond) @et
definition: Seostab eksemplari perekonnaga, kelle õiguspärasel vastutaval hoiul eksemplar on. @et
toolkit label: vastutav hoidja (perekond) @et
toolkit definition: Perekond, kelle õiguspärasel vastutaval hoiul eksemplar on. @et
label: hat Verwahrerin/Verwahrer (Familie) @de
definition: Setzt ein Exemplar in Beziehung zu einer Familie, der die rechtmäßige Verwahrung eines Exemplars obliegt. @de
toolkit label: Verwahrerin/Verwahrer (Familie) @de
toolkit definition: Eine Familie, der die rechtmäßige Verwahrung eines Exemplars obliegt. @de
label: letétkezelőcsaládja a következő: @hu
definition: Egy példányt hozzákapcsol egy családhoz, amely a példány törvényes megőrzője. @hu
toolkit label: letétkezető család @hu
toolkit definition: Egy család, amely egy példány törvényes megőrzője. @hu
label: ha come depositario famiglia @it
definition: Correla un item a una famiglia che detiene la custodia giuridica di un item. @it
toolkit label: depositario famiglia @it
toolkit definition: Famiglia che detiene la custodia giuridica di un item. @it
label: pārvaldītājs (dzimta/ģimene) @lv
definition: Sasaista vienību ar dzimtu/ģimeni, kas likumīgi glabā vienību. @lv
toolkit label: pārvaldītājs (dzimta/ģimene) @lv
toolkit definition: Dzimta/ģimene, kas likumīgi glabā vienību. @lv
has subproperty: P40151
label: 有保管者家族 @zh-hans
definition: 将一个单件与对一个单件拥有合法保管权的一个家族关联起来。 @zh-hans
toolkit label: 保管者家族 @zh-hans
toolkit definition: 对一个单件拥有合法保管权的一个家族 @zh-hans
label: koruyucu ailesi ile ilişkilidir @tr
definition: Bir kopyayı, bir kopyanın yasal velayetine sahip olan bir aileyle ilişkilendirir. @tr
toolkit label: koruyucu aile @tr
toolkit definition: Bir kopyanın yasal velayetine sahip olan bir aile. @tr

a pour personne dépositaire
status: Published
label: has custodian person @en
lexical alias: custodianPerson.en
definition: Relates an item to a person who has legal custody of an item. @en
toolkit label: custodian person @en
toolkit definition: A person who has legal custody of an item. @en
type: Property
domain: C10003
has element type: 2
sub property of: a pour personne en relation avec un item
sub property of: a pour agent dépositaire
definition: Met un item en relation avec une personne à qui est confiée la garde légale d’un item.
toolkit label: personne dépositaire
toolkit definition: Personne à qui est confiée la garde légale d’un item.
label: säilyttäjä (henkilö) @fi
definition: Liittää kappaleen henkilöön, jolla on kappaleen laillinen säilyttämisoikeus. @fi
toolkit label: säilyttäjä (henkilö) @fi
toolkit definition: Henkilö, jolla on kappaleen laillinen säilyttämisoikeus. @fi
label: har oppbevarer (person) @no
definition: Relaterer et eksemplar til en person som har et eksemplar i lovlig forvaring. @no
toolkit label: oppbevarer (person) @no
toolkit definition: En person som har et eksemplar i lovlig forvaring. @no
label: heeft curatele-persoon @nl
definition: Relateert een item aan een persoon die van rechtswege een item bewaart. @nl
toolkit label: curatele-persoon @nl
toolkit definition: Een persoon die van rechtswege een item bewaart. @nl
label: له شخص وصى @ar
definition: يربط مفردة بشخص لديه الوصاية القانونية على مفردة. @ar
toolkit label: شخص وصى @ar
toolkit definition: شخص لديه الوصاية القانونية على مفردة. @ar
label: té com a persona dipositària @ca
definition: Relaciona un ítem amb una persona que té la custodia legal d’un ítem. @ca
toolkit label: persona dipositària @ca
toolkit definition: Persona que té la custodia legal d’un ítem. @ca
label: har person, som er forvalter @da
definition: Relaterer et eksemplar til en person, som lovligt har et eksemplar i forvaring. @da
toolkit label: person, som er forvalter @da
toolkit definition: Person, som lovligt har et eksemplar i forvaring. @da
label: vastutav hoidja (isik) @et
definition: Seostab eksemplari isikuga, kelle õiguspärasel vastutaval hoiul eksemplar on. @et
toolkit label: vastutav hoidja (isik) @et
toolkit definition: Isik, kelle õiguspärasel vastutaval hoiul eksemplar on. @et
label: hat Verwahrerin/Verwahrer (Person) @de
definition: Setzt ein Exemplar in Beziehung zu einer Person, der die rechtmäßige Verwahrung eines Exemplars obliegt. @de
toolkit label: Verwahrerin/Verwahrer (Person) @de
toolkit definition: Eine Person, der die rechtmäßige Verwahrung eines Exemplars obliegt. @de
label: letétkezelő személye a következő: @hu
definition: Hozzákapcsol egy példányt egy személyhez, aki egy példány törvényes megőrzője. @hu
toolkit label: letétkezelő személye: @hu
toolkit definition: Egy személy, aki egy példány törvényes megőrzője. @hu
label: ha come depositario persona @it
definition: Correla un item a una persona che detiene la custodia giuridica di un item. @it
toolkit label: depositario persona @it
toolkit definition: Persona che detiene la custodia giuridica di un item. @it
label: pārvaldītājs (persona) @lv
definition: Sasaista vienību ar personu, kura likumīgi glabā vienību. @lv
toolkit label: pārvaldītājs (persona) @lv
toolkit definition: Persona, kura likumīgi glabā vienību. @lv
has subproperty: P40103
label: 有保管者个人 @zh-hans
definition: 将一个单件与对一个单件拥有合法保管权的一个个人关联起来。 @zh-hans
toolkit label: 保管者个人 @zh-hans
toolkit definition: 对一个单件拥有合法保管权的一个个人 @zh-hans
label: koruyucu kişisi ile ilişkilidir @tr
definition: Bir kopyayı, bir kopyanın yasal velayetine sahip olan bir kişiyle ilişkilendirir. @tr
toolkit label: koruyucu @tr
toolkit definition: Bir kopyanın yasal velayetini elinde bulunduran kişi. @tr

a pour agent dédicataire d’un item
status: Published
label: has dedicatee agent of item @en
definition: Relates an item to an agent to whom an item is dedicated. @en
type: Property
domain: C10003
sub property of: a pour agent en relation avec un item
lexical alias: dedicateeAgentOfItem.en
toolkit label: dedicatee agent of item @en
toolkit definition: An agent to whom an item is dedicated. @en
definition: Met un item en relation avec un agent à qui un item est dédié.
toolkit label: agent dédicataire d’un item
toolkit definition: Agent à qui un item est dédié.
toolkit label: destinatario de dedicatoria en el ítem @es
toolkit definition: Una persona, familia o entidad corporativa a la cual se dedica un ítem. @es
instruction number: 18.5
label: có người được đề tặng (bản) @vi
definition: Liên kết bản với tác nhân mà bản đề tặng. @vi
toolkit label: người được đề tặng (bản) @vi
toolkit definition: Tác nhân mà bản đề tặng. @vi
label: har agent, som er tilegnet i eksemplar @da
definition: Relaterer et eksemplar til en agent, som et eksemplar er tilegnet. @da
toolkit label: agent, som er tilegnet af eksemplar @da
toolkit definition: Agent, som et eksemplar er tilegnet. @da
label: hat Widmungsempfängerin/Widmungsempfänger eines Exemplars (Akteur) @de
definition: Setzt ein Exemplar in Beziehung zu einem Akteur, dem ein Exemplar gewidmet ist. @de
toolkit label: Widmungsempfängerin/Widmungsempfänger eines Exemplars (Akteur) @de
toolkit definition: Ein Akteur, dem ein Exemplar gewidmet ist. @de
label: έχει αποδέκτη αφιέρωσης (αντίτυπο) @el
definition: Συνδέει ένα αντίτυπο με έναν φορέα στον οποίο είναι αφιερωμένο ένα αντίτυπο. @el
toolkit label: αποδέκτης αφιέρωσης (αντίτυπο) @el
toolkit definition: Ένας φορέας στον οποίο είναι αφιερωμένο ένα αντίτυπο. @el
label: té com a agent dedicatari d’un ítem @ca
definition: Relaciona un ítem amb un agent a qui es dedica un ítem. @ca
toolkit label: agent dedicatari d’un ítem @ca
toolkit definition: Agent a qui es dedica un ítem. @ca
definition: Liittää kappaleen toimijaan, jolle kappale on omistettu. @fi
toolkit label: kappaleen omistuksen kohde (toimija) @fi
toolkit definition: Toimija, jolle kappale on omistettu. @fi
toolkit label: tilegnet agent for eksemplar @no
toolkit definition: En agent som et eksemplar er dedisert til. @no
has element type: 2
label: példány dedikált ágense a következő: @hu
definition: Hozzákapcsol egy példányt egy ágenshez, amelynek a példányt dedikálják. @hu
toolkit label: példány dedikált ágense: @hu
toolkit definition: Egy ágens, amelynek a példányt dedikálják. @hu
alternative label: dedicatee (item) @en
alternative label: dédicataire (item)
alternative label: kappale omistettu @fi
label: kappaleen omistuksen kohde (toimija) @fi
label: har tilegnet agent for eksemplar @no
definition: Relaterer et eksemplar til en agent som et eksemplar er dedisert til. @no
alternative label: tilegnelse for eksemplar @no
label: heeft opgedragene-actor van item @nl
definition: Relateert een item aan een actor aan wie een item is opgedragen. @nl
toolkit label: opgedragen-actor van item @nl
toolkit definition: Een actor aan wie een item is opgedragen. @nl
alternative label: dedicatari de (ítem) @ca
alternative label: tilegnet af eksemplar @da
label: eksemplari pühenduse saaja (tegija) @et
definition: Seostab eksemplari tegijaga, kellele eksemplar on pühendatud. @et
alternative label: eksemplari pühenduse saaja @et
alternative label: eksemplari dedikatsiooni saaja @et
toolkit label: eksemplari pühenduse saaja (tegija) @et
toolkit definition: Tegija, kellele eksemplar on pühendatud. @et
alternative label: dedikáltja (példány): @hu
label: ha come dedicatario agente di item @it
definition: Correla un item a un agente al quale un item è dedicato. @it
alternative label: dedicatario di item @it
toolkit label: dedicatario agente di item @it
toolkit definition: Agente al quale un item è dedicato. @it
label: veltījumvienība aģentam @lv
definition: Sasaista vienību ar aģentu, kam ir veltīta vienība. @lv
toolkit label: veltījumvienība aģentam @lv
toolkit definition: Aģents, kam ir veltīta vienība. @lv
label: له وكيل مُهدى إليه مفردة @ar
definition: يربط مفردة بوكيل أُهديت اليه مفردة. @ar
toolkit label: هو وكيل مُهدى إليه مفردة @ar
toolkit definition: وكيل أُهديت إليه مفردة. @ar
alternative label: مُهدى إليه (مفردة) @ar
has subproperty: a pour agent collectif dédicataire d’un item

a pour agent collectif dédicataire d’un item
status: Published
label: has dedicatee collective agent of item @en
lexical alias: dedicateeCollectiveAgentOfItem.en
definition: Relates an item to a collective agent to whom an item is dedicated. @en
toolkit label: dedicatee collective agent of item @en
toolkit definition: A collective agent to whom an item is dedicated. @en
type: Property
domain: C10003
has element type: 2
sub property of: a pour agent collectif en relation avec un item
sub property of: a pour agent dédicataire d’un item
definition: Met un item en relation avec un agent collectif à qui un item est dédié.
toolkit label: agent collectif dédicataire d’un item
toolkit definition: Agent collectif à qui un item est dédié.
label: kappaleen omistuksen kohde (yhteistoimija) @fi
definition: Liittää kappaleen yhteistoimijaan, jolle kappale on omistettu. @fi
toolkit label: kappaleen omistuksen kohde (yhteistoimija) @fi
toolkit definition: Yhteistoimija, jolle kappale on omistettu. @fi
label: har tilegnet kollektiv agent for eksemplar @no
definition: Relaterer et eksemplar til en kollektiv agent som et eksemplar er dedisert til. @no
toolkit label: tilegnet kollektiv agent for eksemplar @no
toolkit definition: En kollektiv agent som et eksemplar er dedisert til. @no
label: heeft opgedragene-collectieve actor van item @nl
definition: Relateert een item aan een collectieve actor aan wie een item is opgedragen. @nl
toolkit label: opgedragen-collectieve actor van item @nl
toolkit definition: Een collectieve actor aan wie een item is opgedragen. @nl
label: té com a agent col·lectiu dedicatari d’un ítem @ca
definition: Relaciona un ítem amb un agent col·lectiu a qui es dedica un ítem. @ca
toolkit label: agent col·lectiu dedicatari d’un ítem @ca
toolkit definition: Agent col·lectiu a qui es dedica un ítem. @ca
label: har kollektiv agent, som er tilegnet af eksemplar @da
definition: Relaterer et eksemplar til en kollektiv agent, som et eksemplar er tilegnet. @da
toolkit label: kollektiv agent, som er tilegnet af eksemplar @da
toolkit definition: Kollektiv agent, som et eksemplar er tilegnet. @da
label: eksemplari pühenduse saaja (kollektiiv) @et
definition: Seostab eksemplari kollektiiviga, kellele eksemplar on pühendatud. @et
toolkit label: eksemplari pühenduse saaja (kollektiiv) @et
toolkit definition: Kollektiiv, kellele eksemplar on pühendatud. @et
label: hat Widmungsempfängerin/Widmungsempfänger eines Exemplars (Gemeinschaftlicher Akteur) @de
definition: Setzt ein Exemplar in Beziehung zu einem gemeinschaftlichen Akteur, dem ein Exemplar gewidmet ist. @de
toolkit label: Widmungsempfängerin/Widmungsempfänger eines Exemplars (Gemeinschaftlicher Akteur) @de
toolkit definition: Ein gemeinschaftlicher Akteur, dem ein Exemplar gewidmet ist. @de
label: dedikált kollektív ágense a következő: @hu
definition: Hozzákapcsol egy példányt egy kollektív ágenshez, amelynek a példányt dedikálják. @hu
toolkit label: példány dedikált kollektív ágense: @hu
toolkit definition: Egy kollektív ágens, amelynek a példányt dedikálják. @hu
label: ha come dedicatario agente collettivo di item @it
definition: Correla un item a un agente collettivo al quale un item è dedicato. @it
toolkit label: agente collettivo dedicatario di item @it
toolkit definition: Agente collettivo al quale un item è dedicato. @it
label: veltījumvienība grupai @lv
definition: Sasaista vienību ar grupu, kam ir veltīta vienība. @lv
toolkit label: veltījumvienība grupai @lv
toolkit definition: Grupa, kam ir veltīta vienība. @lv
label: له وكيل جماعي مُهدى إليه مفردة @ar
definition: يربط مفردة بوكيل جماعي أُهديت اليه مفردة. @ar
toolkit label: وكيل جماعي مُهدى إليه مفردة @ar
toolkit definition: وكيل جماعي أُهديت إليه مفردة. @ar
has subproperty: a pour collectivité dédicataire d’un item
has subproperty: a pour famille dédicataire d’un item
has subproperty: P40113
label: 有单件的被题献者集体行为者 @zh-hans
definition: 将一个单件与一个单件被题献给的一个集体行为者关联起来。 @zh-hans
toolkit label: 单件的被题献者集体行为者 @zh-hans
toolkit definition: 一个单件被题献给的一个集体行为者 @zh-hans
label: kopyanın ithaf edilen kolektif temsilcisi ile ilişkilidir @tr
definition: Bir kopyayı, bir kopyanın ithaf edildiği kolektif bir temsilciyle ilişkilendirir. @tr
toolkit label: kopyanın adandığı kolektif temsilci @tr
toolkit definition: Bir kopyanın ithaf edildiği kolektif bir temsilci. @tr

a pour collectivité dédicataire d’un item
status: Published
label: has dedicatee corporate body of item @en
lexical alias: dedicateeCorporateBodyOfItem.en
definition: Relates an item to a corporate body to whom an item is dedicated. @en
toolkit label: dedicatee corporate body of item @en
toolkit definition: A corporate body to whom an item is dedicated. @en
type: Property
domain: C10003
has element type: 2
sub property of: a pour collectivité en relation avec un item
sub property of: a pour agent collectif dédicataire d’un item
definition: Met un item en relation avec une collectivité à qui un item est dédié.
toolkit label: collectivité dédicataire d’un item
toolkit definition: Collectivité à qui un item est dédié.
label: kappaleen omistuksen kohde (yhteisö) @fi
definition: Liittää kappaleen yhteisöön, jolle kappale on omistettu. @fi
toolkit label: kappaleen omistuksen kohde (yhteisö) @fi
toolkit definition: Yhteisö, jolle kappale on omistettu. @fi
label: har tilegnet korporasjon for eksemplar @no
definition: Relaterer et eksemplar til en korporasjon som et eksemplar er dedisert til. @no
toolkit label: tilegnet korporasjon for eksemplar @no
toolkit definition: En korporasjon som et eksemplar er dedisert til. @no
label: heeft opgedragene-corporatie van item @nl
definition: Relateert een item aan een corporatie aan wie een item is opgedragen. @nl
toolkit label: opgedragen-corporatie van item @nl
toolkit definition: Een corporatie aan wie een item is opgedragen. @nl
label: له هيئة مُهدى إليها مفردة @ar
definition: يربط مفردة بهيئة أُهديت اليها مفردة. @ar
toolkit label: هيئة مُهدى إليها مفردة @ar
toolkit definition: هيئة أُهديت اليها مفردة. @ar
label: té com a entitat corporativa dedicatària d’un ítem @ca
definition: Relaciona un ítem amb una entitat corporativa a qui es dedica un ítem. @ca
toolkit label: entitat corporativa dedicatària d’un ítem @ca
toolkit definition: Entitat corporativa a qui es dedica un ítem. @ca
label: har korporation, som er tilegnet af eksemplar @da
definition: Relaterer et eksemplar til en korporation, som et eksemplar er tilegnet. @da
toolkit label: korporation, som er tilegnet af eksemplar @da
toolkit definition: Korporation, som et eksemplar er tilegnet. @da
label: eksemplari pühenduse saaja (asutus) @et
definition: Seostab eksemplari asutusega, kellele eksemplar on pühendatud. @et
toolkit label: eksemplari pühenduse saaja (asutus) @et
toolkit definition: Asutus, kellele eksemplar on pühendatud. @et
label: hat Widmungsempfängerin/Widmungsempfänger eines Exemplars (Körperschaft) @de
definition: Setzt ein Exemplar in Beziehung zu einer Körperschaft, der ein Exemplar gewidmet ist. @de
toolkit label: Widmungsempfängerin/Widmungsempfänger eines Exemplars (Körperschaft) @de
toolkit definition: Eine Körperschaft, der ein Exemplar gewidmet ist. @de
label: példány dedikált testülete a következő: @hu
definition: Hozzákapcsol egy példányt egy testülethez, amelynek a példányt dedikálják. @hu
toolkit label: példány dedikált testülete @hu
toolkit definition: Egy testület, amelynek a példányt dedikálják. @hu
label: ha come dedicatario ente di item @it
definition: Correla un item a un ente al quale un item è dedicato. @it
toolkit label: dedicatario ente di item @it
toolkit definition: Ente al quale un item è dedicato. @it
label: veltījumvienība institūcijai @lv
definition: Sasaista vienību ar institūciju, kam ir veltīta vienība. @lv
toolkit label: veltījumvienība institūcijai @lv
toolkit definition: Institūcija, kam ir veltīta vienība. @lv
has subproperty: P40129
label: 有单件的被题献者团体 @zh-hans
definition: 将一个单件与一个单件被题献给的一个团体关联起来。 @zh-hans
toolkit label: 单件的被题献者团体 @zh-hans
toolkit definition: 一个单件被题献给的一个团体 @zh-hans
label: kopyanın ithaf edilen tüzel kişisi ile ilişkilidir @tr
definition: Bir kopyayı, bir kopyanın ithaf edildiği tüzel bir kişiyle ilişkilendirir. @tr
toolkit label: kopyanın adandığı tüzel kişi @tr
toolkit definition: Bir kopyanın ithaf edildiği tüzel kişi. @tr

a pour famille dédicataire d’un item
status: Published
label: has dedicatee family of item @en
lexical alias: dedicateeFamilyOfItem.en
definition: Relates an item to a family to whom an item is dedicated. @en
toolkit label: dedicatee family of item @en
toolkit definition: A family to whom an item is dedicated. @en
type: Property
domain: C10003
has element type: 2
sub property of: a pour famille en relation avec un item
sub property of: a pour agent collectif dédicataire d’un item
definition: Met un item en relation avec une famille à qui un item est dédié.
toolkit label: famille dédicataire d’un item
toolkit definition: Famille à qui un item est dédié.
label: kappaleen omistuksen kohde (suku) @fi
definition: Liittää kappaleen sukuun, jolle kappale on omistettu. @fi
toolkit label: kappaleen omistuksen kohde (suku) @fi
toolkit definition: Suku, jolle kappale on omistettu. @fi
label: har tilegnet familie for eksemplar @no
definition: Relaterer et eksemplar til en familie som et eksemplar er dedisert til. @no
toolkit label: tilegnet familie for eksemplar @no
toolkit definition: En familie som et eksemplar er dedisert til. @no
label: heeft opgedragene-familie van item @nl
definition: Relateert een item aan een familie aan wie een item is opgedragen. @nl
toolkit label: opgedragen-familie van item @nl
toolkit definition: Een familie aan wie een item is opgedragen. @nl
label: له عائلة مُهدى إليها مفردة @ar
definition: يربط مفردة بعائلة أُهديت اليها مفردة. @ar
toolkit label: عائلة مُهدى إليها مفردة @ar
toolkit definition: عائلة أُهديت اليها مفردة. @ar
label: té com a família dedicatària d’un ítem @ca
definition: Relaciona un ítem amb una família a qui es dedica un ítem. @ca
toolkit label: família dedicatària d’un ítem @ca
toolkit definition: Família a qui es dedica un ítem. @ca
label: har familie, som er tilegnet af eksemplar @da
definition: Relaterer et eksemplar til en familie, som et eksemplar er tilegnet. @da
toolkit label: familie, som er tilegnet af eksemplar @da
toolkit definition: Familie, som et eksemplar er tilegnet. @da
label: eksemplari pühenduse saaja (perekond) @et
definition: Seostab eksemplari perekonnaga, kellele eksemplar on pühendatud. @et
toolkit label: eksemplari pühenduse saaja (perekond) @et
toolkit definition: Perekond, kellele eksemplar on pühendatud. @et
label: hat Widmungsempfängerin/Widmungsempfänger eines Exemplars (Familie) @de
definition: Setzt ein Exemplar in Beziehung zu einer Familie, der ein Exemplar gewidmet ist. @de
toolkit label: Widmungsempfängerin/Widmungsempfänger eines Exemplars (Familie) @de
toolkit definition: Eine Familie, der ein Exemplar gewidmet ist. @de
label: példány dedikált családja a következő: @hu
definition: Hozzákapcsol egy példányt egy családhoz, amelynek a példányt dedikálják. @hu
toolkit label: példány dedikált családja @hu
toolkit definition: Egy család, amelynek a példányt dedikálják. @hu
label: ha come dedicatario famiglia di item @it
definition: Correla un item a una famiglia alla quale un item è dedicato. @it
toolkit label: famiglia dedicataria di item @it
toolkit definition: Famiglia alla quale un item è dedicato. @it
label: veltījumvienība dzintai/ģimenei @lv
definition: Sasaista vienību ar dzimtu/ģimeni, kam ir veltīta vienība. @lv
toolkit label: veltījumvienība dzintai/ģimenei @lv
toolkit definition: Dzimta/ģimene, kam ir veltīta vienība. @lv
has subproperty: P40145
label: 有单件的被题献者家族 @zh-hans
definition: 将一个单件与一个单件被题献给的一个家族关联起来。 @zh-hans
toolkit label: 单件的被题献者家族 @zh-hans
toolkit definition: 一个单件被题献给的一个家族 @zh-hans
label: kopyanın ithaf edilen ailesi ile ilişkilidir @tr
definition: Bir kopyayı, bir kopyayı ithaf edildiği bir aileyle ilişkilendirir. @tr
toolkit label: kopyanın adandığı aile @tr
toolkit definition: Bir kopyanın ithaf edildiği bir aile. @tr

a pour personne dédicataire d’un item
status: Published
label: has dedicatee person of item @en
lexical alias: dedicateePersonOfItem.en
definition: Relates an item to a person to whom an item is dedicated. @en
toolkit label: dedicatee person of item @en
toolkit definition: A person to whom an item is dedicated. @en
type: Property
domain: C10003
has element type: 2
sub property of: a pour personne en relation avec un item
sub property of: a pour agent dédicataire d’un item
definition: Met un item en relation avec une personne à qui un item est dédié.
toolkit label: personne dédicataire d’un item
toolkit definition: Personne à qui un item est dédié.
label: kappaleen omistuksen kohde (henkilö) @fi
definition: Liittää kappaleen henkilöön, jolle kappale on omistettu. @fi
toolkit label: kappaleen omistuksen kohde (henkilö) @fi
toolkit definition: Henkilö, jolle kappale on omistettu. @fi
label: har tilegnet person for eksemplar @no
definition: Relaterer et eksemplar til en person som et eksemplar er dedisert til. @no
toolkit label: tilegnet person for eksemplar @no
toolkit definition: En person som et eksemplar er dedisert til. @no
label: heeft opgedragene-persoon van item @nl
definition: Relateert een item aan een persoon aan wie een item is opgedragen. @nl
toolkit label: opgedragen-persoon van item @nl
toolkit definition: Een persoon aan wie een item is opgedragen. @nl
label: له شخص مُهدى إليه مفردة @ar
definition: يربط مفردة بشخص أُهديت إليه مفردة. @ar
toolkit label: شخص مُهدى إليه مفردة @ar
toolkit definition: شخص أُهديت اليه مفردة. @ar
label: té com a persona dedicatària d’un ítem @ca
definition: Relaciona un ítem amb una persona a qui es dedica un ítem. @ca
toolkit label: persona dedicatària d’un ítem @ca
toolkit definition: Persona a qui es dedica un ítem. @ca
label: har person, som er tilegnet af eksemplar @da
definition: Relaterer et eksemplar til en person, som et eksemplar er tilegnet. @da
toolkit label: person, som er tilegnet af eksemplar @da
toolkit definition: Person, som et eksemplar er tilegnet. @da
label: eksemplari pühenduse saaja (isik) @et
definition: Seostab eksemplari isikuga, kellele eksemplar on pühendatud. @et
toolkit label: eksemplari pühenduse saaja (isik) @et
toolkit definition: Isik, kellele eksemplar on pühendatud. @et
label: hat Widmungsempfängerin/Widmungsempfänger eines Exemplars (Person) @de
definition: Setzt ein Exemplar in Beziehung zu einer Person, der ein Exemplar gewidmet ist. @de
toolkit label: Widmungsempfängerin/Widmungsempfänger eines Exemplars (Person) @de
toolkit definition: Eine Person, der ein Exemplar gewidmet ist. @de
label: példány dedikált személye a következő: @hu
definition: Hozzákapcsol egy példányt egy személyhez, akinek a példányt dedikálják. @hu
toolkit label: példány dedikált személye: @hu
toolkit definition: Egy személy, akinek a példányt dedikálják. @hu
label: ha come dedicatario persona di item @it
definition: Correla un item a una persona alla quale un item è dedicato. @it
toolkit label: dedicatario di item persona @it
toolkit definition: Persona alla quale un item è dedicato . @it
label: veltījumvienība personai @lv
definition: Sasaista vienību ar personu, kurai ir veltīta vienība. @lv
toolkit label: veltījumvienība personai @lv
toolkit definition: Persona, kurai ir veltīta vienība. @lv
has subproperty: P40097
label: 有单件的被题献者个人 @zh-hans
definition: 将一个单件与一个单件被题献给的一个个人关联起来。 @zh-hans
toolkit label: 单件的被题献者个人 @zh-hans
toolkit definition: 一个单件被题献给的一个个人 @zh-hans
label: kopyanın ithaf edilen kişisi ile ilişkilidir @tr
definition: Bir kopyayı, bir kopyanın ithaf edildiği bir kişiyle ilişkilendirir. @tr
toolkit label: kopyanın adandığı kişi @tr
toolkit definition: Bir kopyanın ithaf edildiği kişi @tr

a pour agent déposant
status: Published
label: has depositor agent @en
definition: Relates an item to an agent who is a current owner of an item who deposits the item into the custody of another agent without transferring ownership. @en
type: Property
domain: C10003
sub property of: a pour agent propriétaire actuel
lexical alias: depositorAgent.en
toolkit label: depositor agent @en
toolkit definition: An agent who is a current owner of an item who deposits the item into the custody of another agent without transferring ownership. @en
definition: Met un item en relation avec un agent propriétaire actuel d’un item qui dépose l’item sous la garde d’un autre agent sans en transférer la propriété.
toolkit label: agent déposant
toolkit definition: Agent propriétaire actuel d’un item qui dépose l’item sous la garde d’un autre agent sans en transférer la propriété.
toolkit label: depositante @es
toolkit definition: Un propietario actual de un ítem que lo entrega en custodia a otra persona, familia o entidad corporativa, sin perder la propiedad del ítem. @es
instruction number: 18.5
label: có người gửi đồ vật @vi
definition: Liên kết bản với người chủ hiện tại của bản, người đã nộp bản đó cho sự chăm nom của tác nhân khác trong khi vẫn giữa quyền sở hữu. @vi
toolkit label: người gửi đồ vật @vi
toolkit definition: Người chủ hiện tại của bản, người đã nộp bản đó cho sự chăm nom của tác nhân khác trong khi vẫn giữa quyền sở hữu. @vi
label: har agent, som er udlåner @da
definition: Relaterer et eksemplar til en agent, som er nuværende ejer af et eksemplar, som deponerer eksemplaret til forvaring hos en anden agent, men uden at overgive ejerskab. @da
toolkit label: agent, som er udlåner @da
toolkit definition: Agent, som er nuværende ejer af et eksemplar, som deponerer eksemplaret til forvaring hos en anden agent, men uden at overgive ejerskab. @da
label: hat Leihgeberin/Leihgeber (Akteur) @de
definition: Setzt ein Exemplar in Beziehung zu einer gegenwärtigen Eigentümerin/einem gegenwärtigen Eigentümer (Akteur) eines Exemplars, die/der das Exemplar in die Obhut eines anderen Akteurs gibt, ohne das Eigentumsrecht zu übertragen. @de
toolkit label: Leihgeberin/Leihgeber (Akteur) @de
toolkit definition: Eine gegenwärtig Eigentümerin/Ein gegenwärtiger Eigentümer (Akteur) eines Exemplars, die/der das Exemplar in die Obhut eines anderen Akteurs gibt, ohne das Eigentumsrecht zu übertragen. @de
label: έχει καταθέτη @el
definition: Συνδέει ένα αντίτυπο με έναν τρέχοντα ιδιοκτήτη ενός αντιτύπου ο οποίος κατέθεσε το αντίτυπο υπό τη διαχειριστική επιτροπεία κάποιου άλλου φορέα, ενώ διατηρεί ακόμη την ιδιοκτησία. @el
toolkit label: καταθέτης @el
toolkit definition: Ένας τρέχων ιδιοκτήτης ενός αντιτύπου, ο οποίος κατέθεσε το αντίτυπο υπό τη διαχειριστική επιτροπεία κάποιου άλλου φορέα, ενώ διατηρεί ακόμη την ιδιοκτησία. @el
label: té com a agent dipositador @ca
definition: Relaciona un ítem amb un agent que és un propietari actual d’un ítem que el diposita sota la custòdia d’un altre agent sense transferir-li la propietat. @ca
toolkit label: agent dipositador @ca
toolkit definition: Agent que és un propietari actual d’un ítem que el diposita sota la custòdia d’un altre agent sense transferir-li la propietat. @ca
definition: Liittää kappaleen sen nykyiseen omistajaan, joka tallettaa kappaleen toisen toimijan huostaan omistajuudesta luopumatta. @fi
toolkit label: tallettaja (toimija) @fi
toolkit definition: Kappaleen nykyinen omistaja, joka tallettaa kappaleen toisen toimijan huostaan omistajuudesta luopumatta. @fi
toolkit label: deponent (agent) @no
toolkit definition: En agent som er en nåværende eier av et eksemplar som deponerer eksemplaret til forvaring til en annen agent uten at eierskapet blir overført. @no
has element type: 2
label: letétbe helyező ágense a következő: @hu
definition: Hozzákapcsol egy példányt egy ágenshez, amely egy példány jelenlegi tulajdonosa, és amely egy másik ágens megőrzésébe letétként helyezi el a példányt anélkül, hogy a tulajdonjogot átruházná. @hu
toolkit label: letétbe helyező ágens: @hu
toolkit definition: Egy ágens, amely egy példány jelenlegi tulajdonosa, és amely egy másik ágens megőrzésébe letétként helyezi el a példányt anélkül, hogy a tulajdonjogot átruházná. @hu
alternative label: depositor @en
alternative label: déposant
alternative label: tallettaja @fi
label: tallettaja (toimija) @fi
label: har deponent (agent) @no
definition: Relaterer et eksemplar til en agent som er en nåværende eier av et eksemplar som deponerer eksemplaret til forvaring til en annen agent uten at eierskapet blir overført. @no
alternative label: deponent @no
label: heeft bruikleen-actor @nl
definition: Relateert een item aan een actor die een huidige eigenaar is van een item die het item onderbrengt bij een andere actor zonder eigenaarschap over te dragen. @nl
toolkit label: bruikleen-actor @nl
toolkit definition: Een actor die een huidige eigenaar is van een item die het item onderbrengt bij een andere actor zonder eigenaarschap over te dragen. @nl
label: له وكيل مودِع @ar
definition: يربط مفردة بوكيل هو المالك الحالي لمفردة، يودعها تحت وصاية وكيل آخر دون نقل ملكيتها. @ar
alternative label: مودع @ar
toolkit label: وكيل مودع @ar
toolkit definition: وكيل هو المالك الحالي لمفردة، يودعها تحت وصاية وكيل آخر دون نقل ملكيتها. @ar
alternative label: dipositador @ca
alternative label: udlåner @da
label: deponeerija (tegija) @et
definition: Seostab eksemplari tegijaga, kes praeguse omanikuna deponeerib eksemplari teise tegija vastutavale hoiule ilma omandiõiguse üleminekuta. @et
alternative label: deponeerija @et
toolkit label: deponeerija (tegija) @et
toolkit definition: Tegija, kes praeguse omanikuna deponeerib eksemplari teise tegija vastutavale hoiule ilma omandiõiguse üleminekuta. @et
alternative label: letétbe helyező: @hu
label: ha come depositante agente @it
definition: Correla un item al proprietario attuale agente di un item che deposita l'item sotto la custodia di un altro agente senza trasferirne la proprietà. @it
alternative label: depositante @it
toolkit label: depositante agente @it
toolkit definition: Proprietario attuale agente di un item che deposita l'item sotto la custodia di un altro agente senza trasferirne la proprietà. @it
label: deponents (aģents) @lv
definition: Sasaista vienību ar aģentu, pašreizējais vienības īpašnieks, kurš deponējis vienību cita aģenta uzglabāšanā, vienlaikus saglabājot īpašumtiesības. @lv
toolkit label: deponents (aģents) @lv
toolkit definition: Aģents, pašreizējais vienības īpašnieks, kurš deponējis vienību cita aģenta uzglabāšanā, vienlaikus saglabājot īpašumtiesības. @lv
alternative label: Leihgeber @de
has subproperty: a pour agent collectif déposant

a pour agent collectif déposant
status: Published
label: has depositor collective agent @en
lexical alias: depositorCollectiveAgent.en
definition: Relates an item to a collective agent who is a current owner of an item who deposits the item into the custody of another agent without transferring ownership. @en
toolkit label: depositor collective agent @en
toolkit definition: A collective agent who is a current owner of an item who deposits the item into the custody of another agent without transferring ownership. @en
type: Property
domain: C10003
has element type: 2
sub property of: a pour agent collectif propriétaire actuel
sub property of: a pour agent déposant
definition: Met un item en relation avec un agent collectif propriétaire actuel d’un item qui dépose l’item sous la garde d’un autre agent sans en transférer la propriété.
toolkit label: agent collectif déposant
toolkit definition: Agent collectif propriétaire actuel d’un item qui dépose l’item sous la garde d’un autre agent sans en transférer la propriété.
label: tallettaja (yhteistoimija) @fi
definition: Liittää kappaleen sen nykyisenä omistajana olevaan yhteistoimijaan, joka tallettaa kappaleen toisen toimijan huostaan omistajuudesta luopumatta. @fi
toolkit label: tallettaja (yhteistoimija) @fi
toolkit definition: Kappaleen nykyisenä omistajana oleva yhteistoimija, joka tallettaa kappaleen toisen toimijan huostaan omistajuudesta luopumatta. @fi
label: har deponent (kollektiv agent) @no
definition: Relaterer et eksemplar til en kollektiv agent som er en nåværende eier av et eksemplar som deponerer eksemplaret til forvaring til en annen agent uten at eierskapet blir overført. @no
toolkit label: deponent (kollektiv agent) @no
toolkit definition: En kollektiv agent som er en nåværende eier av et eksemplar som deponerer eksemplaret til forvaring til en annen agent uten at eierskapet blir overført. @no
label: heeft bruikleen-collectieve actor @nl
definition: Relateert een item aan een collectieve actor die een huidige eigenaar is van een item die het item onderbrengt bij een andere actor zonder eigenaarschap over te dragen. @nl
toolkit label: bruikleen-collectieve actor @nl
toolkit definition: Een collectieve actor die een huidige eigenaar is van een item die het item onderbrengt bij een andere actor zonder eigenaarschap over te dragen. @nl
label: له وكيل جماعي مودع @ar
definition: يربط مفردة بوكيل جماعي هو المالك الحالي لمفردة، يقوم بإيداعها تحت وصاية وكيل آخر دون نقل ملكيتها. @ar
toolkit label: وكيل جماعي مودع @ar
toolkit definition: وكيل جماعي هو المالك الحالي لمفردة، يقوم بإيداعها تحت وصاية وكيل آخر دون نقل ملكيتها. @ar
label: té com a agent col·lectiu dipositador @ca
definition: Relaciona un ítem amb un agent col·lectiu que és un propietari actual d’un ítem que el diposita sota la custòdia d’un altre agent sense transferir-li la propietat. @ca
toolkit label: agent col·lectiu dipositador @ca
toolkit definition: Agent col·lectiu que és un propietari actual d’un ítem que el diposita sota la custòdia d’un altre agent sense transferir-li la propietat. @ca
label: har kollektiv agent, som er udlåner @da
definition: Relaterer et eksemplar til en kollektiv agent, som er nuværende ejer af et eksemplar, som deponerer eksemplaret til forvaring hos en anden agent, men uden at overgive ejerskab. @da
toolkit label: kollektiv agent, som er udlåner @da
toolkit definition: Kollektiv agent, som er nuværende ejer af et eksemplar, som deponerer eksemplaret til forvaring hos en anden agent, men uden at overgive ejerskab. @da
label: deponeerija (kollektiiv) @et
definition: Seostab eksemplari kollektiiviga, kes praeguse omanikuna deponeerib eksemplari teise tegija vastutavale hoiule ilma omandiõiguse üleminekuta. @et
toolkit label: deponeerija (kollektiiv) @et
toolkit definition: Kollektiiv, kes praeguse omanikuna deponeerib eksemplari teise tegija vastutavale hoiule ilma omandiõiguse üleminekuta. @et
label: hat Leihgeberin/Leihgeber (Gemeinschaftlicher Akteur) @de
definition: Setzt ein Exemplar in Beziehung zu einer gegenwärtigen Eigentümerin/einem gegenwärtigen Eigentümer (Gemeinschaftlicher Akteur) eines Exemplars, die/der das Exemplar in die Obhut eines anderen Akteurs gibt, ohne das Eigentumsrecht zu übertragen. @de
toolkit label: Leihgeberin/Leihgeber (Gemeinschaftlicher Akteur) @de
toolkit definition: Eine gegenwärtige Eigentümerin/Ein gegenwärtiger Eigentümer (Gemeinschaftlicher Akteur) eines Exemplars, die/der das Exemplar in die Obhut eines anderen Akteurs gibt, ohne das Eigentumsrecht zu übertragen. @de
label: letétbe helyező kollektív ágense a következő: @hu
definition: Hozzákapcsol egy példányt egy kollektív ágenshez, amely egy példány jelenlegi tulajdonosa, ás amely egy másik ágens megőrzésébe letétként helyezi el a példánytt anélkül, hogy a tulajdonjogot átruházná. @hu
toolkit label: letétbe helyező kollektív ágense: @hu
toolkit definition: Egy kollektív ágens, amely egy példány jelenlegi tulajdonosa, ás amely egy másik ágens megőrzésébe letétként helyezi el a példánytt anélkül, hogy a tulajdonjogot átruházná. @hu
label: ha come depositante agente collettivo @it
definition: Correla un item al proprietario attuale agente collettivo di un item che deposita l'item sotto la custodia di un altro agente senza trasferirne la proprietà. @it
toolkit label: depositante agente collettivo @it
toolkit definition: Proprietario attuale agente collettivo di un item che deposita l'item sotto la custodia di un altro agente senza trasferirne la proprietà. @it
label: deponents (grupa) @lv
definition: Sasaista vienību ar grupu, kas ir pašreizējais vienības īpašnieks, kurš deponējis vienību cita aģenta uzglabāšanā, vienlaikus saglabājot īpašumtiesības. @lv
toolkit label: deponents (grupa) @lv
toolkit definition: Grupa, pašreizējais vienības īpašnieks, kurš deponējis vienību cita aģenta uzglabāšanā, vienlaikus saglabājot īpašumtiesības. @lv
has subproperty: a pour collectivité déposante
has subproperty: a pour famille déposante
has subproperty: P40123
label: 有托存者集体行为者 @zh-hans
definition: 将一个单件与作为单件的当前拥有者将单件委托给另一个行为者保管但未转让所有权的一个集体行为者关联起来。 @zh-hans
toolkit label: 托存者集体行为者 @zh-hans
toolkit definition: 作为单件的当前拥有者将单件委托给另一个行为者保管但未转让所有权的一个集体行为者 @zh-hans
label: mevduatçı kolektif temsilcisi ile ilişkilidir @tr
definition: Bir kopyayı, mülkiyeti devretmeden başka bir temsilcinin gözetimine teslim eden, bir kopyanın mevcut sahibi olan kolektif bir temsilciyle ilişkilendirir. @tr
toolkit label: mevduatçı kolektif temsilci @tr
toolkit definition: Bir kopyanın mevcut sahibi olan ve mülkiyeti devretmeden kopyayı başka bir temsilcinin gözetimine bırakan kolektif bir temsilci. @tr

a pour collectivité déposante
status: Published
label: has depositor corporate body @en
lexical alias: depositorCorporateBody.en
definition: Relates an item to a corporate body who is a current owner of an item who deposits the item into the custody of another agent without transferring ownership. @en
toolkit label: depositor corporate body @en
toolkit definition: A corporate body who is a current owner of an item who deposits the item into the custody of another agent without transferring ownership. @en
type: Property
domain: C10003
has element type: 2
sub property of: a pour collectivité propriétaire actuelle
sub property of: a pour agent collectif déposant
definition: Met un item en relation avec une collectivité propriétaire actuelle d’un item qui dépose l’item sous la garde d’un autre agent sans en transférer la propriété.
toolkit label: collectivité déposante
toolkit definition: Collectivité propriétaire actuelle d’un item qui dépose l’item sous la garde d’un autre agent sans en transférer la propriété.
label: tallettaja (yhteisö) @fi
definition: Liittää kappaleen sen nykyiseen omistajayhteisöön, joka tallettaa kappaleen toisen toimijan huostaan omistajuudesta luopumatta. @fi
toolkit label: tallettaja (yhteisö) @fi
toolkit definition: Kappaleen nykyinen omistajayhteisö, joka tallettaa kappaleen toisen toimijan huostaan omistajuudesta luopumatta. @fi
label: har deponent (korporasjon) @no
definition: Relaterer et eksemplar til en korporasjon som er en nåværende eier av et eksemplar som deponerer eksemplaret til forvaring til en annen agent uten at eierskapet blir overført. @no
toolkit label: deponent (korporasjon) @no
toolkit definition: En korporasjon som er en nåværende eier av et eksemplar som deponerer eksemplaret til forvaring til en annen agent uten at eierskapet blir overført. @no
label: heeft bruikleen-corporatie @nl
definition: Relateert een item aan een corporatie die een huidige eigenaar is van een item die het item onderbrengt bij een andere actor zonder eigenaarschap over te dragen. @nl
toolkit label: bruikleen-corporatie @nl
toolkit definition: Een corporatie die een huidige eigenaar is van een item die het item onderbrengt bij een andere actor zonder eigenaarschap over te dragen. @nl
label: له هيئة مودعة @ar
definition: يربط مفردة بهيئة هي المالك الحالي لمفردة، قامت بإيداعها تحت وصاية وكيل آخر دون نقل ملكيتها. @ar
toolkit label: هيئة مودعة @ar
toolkit definition: هيئة هي المالك الحالي لمفردة، يودعها تحت وصاية وكيل آخر دون نقل ملكيتها. @ar
label: té com a entitat corporativa dipositadora @ca
definition: Relaciona un ítem amb una entitat corporativa que és un propietari actual d’un ítem que el diposita sota la custòdia d’un altre agent sense transferir-li la propietat. @ca
toolkit label: entitat corporativa dipositadora @ca
toolkit definition: Entitat corporativa que és un propietari actual d’un ítem que el diposita sota la custòdia d’un altre agent sense transferir-li la propietat. @ca
label: har korporation, som er udlåner @da
definition: Relaterer et eksemplar til en korporation, som er nuværende ejer af et eksemplar, som deponerer eksemplaret til forvaring hos en anden agent, men uden at overgive ejerskab. @da
toolkit label: korporation, som er udlåner @da
toolkit definition: Korporation, som er nuværende ejer af et eksemplar, som deponerer eksemplaret til forvaring hos en anden agent, men uden at overgive ejerskab. @da
label: deponeerija (asutus) @et
definition: Seostab eksemplari asutusega, kes praeguse omanikuna deponeerib eksemplari teise tegija vastutavale hoiule ilma omandiõiguse üleminekuta. @et
toolkit label: deponeerija (asutus) @et
toolkit definition: Asutus, kes praeguse omanikuna deponeerib eksemplari teise tegija vastutavale hoiule ilma omandiõiguse üleminekuta. @et
label: hat Leihgeberin/Leihgeber (Körperschaft) @de
definition: Setzt ein Exemplar in Beziehung zu einer gegenwärtigen Eigentümerin/einem gegenwärtigen Eigentümer (Körperschaft) eines Exemplars, die/der das Exemplar in die Obhut eines anderen Akteurs gibt, ohne das Eigentumsrecht zu übertragen. @de
toolkit label: Leihgeberin/Leihgeber (Körperschaft) @de
toolkit definition: Eine gegenwärtige Eigentümerin/Ein gegenwärtiger Eigentümer (Körperschaft) eines Exemplars, die/der das Exemplar in die Obhut eines anderen Akteurs gibt, ohne das Eigentumsrecht zu übertragen. @de
label: letétbe helyező testülete a következő: @hu
definition: Hozzákapcsol egy példányt egy testülethez, amely egy példány jelenlegi tulajdonosa, és amely egy másik ágens megőrzésébe letétként helyezi el a példányt anélkül, hogy a tulajdonjogot átruházná. @hu
toolkit label: letétbe helyező testülete: @hu
toolkit definition: Egy testület, amely egy példány jelenlegi tulajdonosa, és amely egy másik ágens megőrzésébe letétként helyezi el a példányt anélkül, hogy a tulajdonjogot átruházná. @hu
label: ha come depositante ente @it
definition: Correla un item al proprietario attuale ente di un item che deposita l'item sotto la custodia di un altro agente senza trasferirne la proprietà. @it
toolkit label: depositante ente @it
toolkit definition: Proprietario attuale ente di un item che deposita l'item sotto la custodia di un altro agente senza trasferirne la proprietà. @it
label: deponents (institūcija) @lv
definition: Sasaista vienību ar institūciju, kas ir pašreizējais vienības īpašnieks, kurš deponējis vienību cita aģenta uzglabāšanā, vienlaikus saglabājot īpašumtiesības. @lv
toolkit label: deponents (institūcija) @lv
toolkit definition: Institūcija, pašreizējais vienības īpašnieks, kurš deponējis vienību cita aģenta uzglabāšanā, vienlaikus saglabājot īpašumtiesības. @lv
has subproperty: P40139
label: 有托存者团体 @zh-hans
definition: 将一个单件与作为单件的当前拥有者将单件委托给另一个行为者保管但未转让所有权的一个团体关联起来。 @zh-hans
toolkit label: 托存者团体 @zh-hans
toolkit definition: 作为单件的当前拥有者将单件委托给另一个行为者保管但未转让所有权的一个团体 @zh-hans
label: mevduatçı tüzel kişisi ile ilişkilidir @tr
definition: Bir kopyayı, bir kopyanın mevcut sahibi olan ve mülkiyeti devretmeden eşyayı başka bir temsilcinin emanetine bırakan tüzel bir kişiyle ilişkilendirir. @tr
toolkit label: mevduatçı tüzel kişi @tr
toolkit definition: Bir kopyayı mevcut sahibi olan ve mülkiyeti devretmeden kopyayı başka bir temsilcinin gözetimine emanet eden bir tüzel kişi. @tr

a pour famille déposante
status: Published
label: has depositor family @en
lexical alias: depositorFamily.en
definition: Relates an item to a family who is a current owner of an item who deposits the item into the custody of another agent without transferring ownership. @en
toolkit label: depositor family @en
toolkit definition: A family who is a current owner of an item who deposits the item into the custody of another agent without transferring ownership. @en
type: Property
domain: C10003
has element type: 2
sub property of: a pour famille propriétaire actuelle
sub property of: a pour agent collectif déposant
definition: Met un item en relation avec une famille propriétaire actuelle d’un item qui dépose l’item sous la garde d’un autre agent sans en transférer la propriété.
toolkit label: famille déposante
toolkit definition: Famille propriétaire actuelle d’un item qui dépose l’item sous la garde d’un autre agent sans en transférer la propriété.
label: tallettaja (suku) @fi
definition: Liittää kappaleen sen nykyiseen omistajasukuun, joka tallettaa kappaleen toisen toimijan huostaan omistajuudesta luopumatta. @fi
toolkit label: tallettaja (suku) @fi
toolkit definition: Kappaleen nykyinen omistajasuku, joka tallettaa kappaleen toisen toimijan huostaan omistajuudesta luopumatta. @fi
label: har deponent (familie) @no
definition: Relaterer et eksemplar til en familie som er en nåværende eier av et eksemplar som deponerer eksemplaret til forvaring til en annen agent uten at eierskapet blir overført. @no
toolkit label: deponent (familie) @no
toolkit definition: En familie som er en nåværende eier av et eksemplar som deponerer eksemplaret til forvaring til en annen agent uten at eierskapet blir overført. @no
label: heeft bruikleen-familie @nl
definition: Relateert een item aan een familie die een huidige eigenaar is van een item die het item onderbrengt bij een andere actor zonder eigenaarschap over te dragen. @nl
toolkit label: bruikleen-familie @nl
toolkit definition: Een familie die een huidige eigenaar is van een item die het item onderbrengt bij een andere actor zonder eigenaarschap over te dragen. @nl
label: له عائلة مودعة @ar
definition: يربط مفردة بعائلة هي المالك الحالي لمفردة، قامت بإيداعها تحت وصاية وكيل آخر دون نقل ملكيتها. @ar
toolkit label: عائلة مودعة @ar
toolkit definition: عائلة هي المالك الحالي لمفردة، قامت بإيداعها تحت وصاية وكيل آخر دون نقل ملكيتها. @ar
label: té com a família dipositadora @ca
definition: Relaciona un ítem amb una família que és un propietari actual d’un ítem que el diposita sota la custòdia d’un altre agent sense transferir-li la propietat. @ca
toolkit label: família dipositadora @ca
toolkit definition: Família que és un propietari actual d’un ítem que el diposita sota la custòdia d’un altre agent sense transferir-li la propietat. @ca
label: har familie, som er udlåner @da
definition: Relaterer et eksemplar til en familie, som er nuværende ejer af et eksemplar, som deponerer eksemplaret til forvaring hos en anden agent, men uden at overgive ejerskab. @da
toolkit label: familie, som er udlåner @da
toolkit definition: Familie, som er nuværende ejer af et eksemplar, som deponerer eksemplaret til forvaring hos en anden agent, men uden at overgive ejerskab. @da
label: deponeerija (perekond) @et
definition: Seostab eksemplari perekonnaga, kes praeguse omanikuna deponeerib eksemplari teise tegija vastutavale hoiule ilma omandiõiguse üleminekuta. @et
toolkit label: deponeerija (perekond) @et
toolkit definition: Perekond, kes praeguse omanikuna deponeerib eksemplari teise tegija vastutavale hoiule ilma omandiõiguse üleminekuta. @et
label: hat Leihgeberin/Leihgeber (Familie) @de
definition: Setzt ein Exemplar in Beziehung zu einer gegenwärtigen Eigentümerin/einem gegenwärtigen Eigentümer (Familie) eines Exemplars, die das Exemplar in die Obhut eines anderen Akteurs gibt, ohne das Eigentumsrecht zu übertragen. @de
toolkit label: Leihgeberin/Leihgeber (Familie) @de
toolkit definition: Eine gegenwärtige Eigentümerin/Ein gegenwärtiger Eigentümer (Familie) eines Exemplars, die das Exemplar in die Obhut eines anderen Akteurs gibt, ohne das Eigentumsrecht zu übertragen. @de
label: letétbe helyező családja a következő: @hu
definition: Hozzákapcsol egy példányt egy családhoz, amely egy példány jelenlegi tulajdonosa, és amely egy másik ágens megőrzésébe letétként helyezi el a példányt anélkül, hogy a tulajdonjogot átruházná. @hu
toolkit label: letétbe helyező család @hu
toolkit definition: Egy család, amely egy példány jelenlegi tulajdonosa, és amely egy másik ágens megőrzésébe letétként helyezi el a példányt anélkül, hogy a tulajdonjogot átruházná. @hu
label: ha come depositante famiglia @it
definition: Correla un item al proprietario attuale famiglia di un item che deposita l'item sotto la custodia di un altro agente senza trasferirne la proprietà. @it
toolkit label: depositante famiglia @it
toolkit definition: Proprietario attuale famiglia di un item che deposita l'item sotto la custodia di un altro agente senza trasferirne la proprietà @it
label: deponents (dzimta/ģimene) @lv
definition: Sasaista vienību ar dzimtu/ģimeni, kas ir pašreizējais vienības īpašnieks, kurš deponējis vienību cita aģenta uzglabāšanā, vienlaikus saglabājot īpašumtiesības. @lv
toolkit label: deponents (dzimta/ģimene) @lv
toolkit definition: Dzimta/ģimene, pašreizējais vienības īpašnieks, kurš deponējis vienību cita aģenta uzglabāšanā, vienlaikus saglabājot īpašumtiesības. @lv
has subproperty: P40155
label: 有托存者家族 @zh-hans
definition: 将一个单件与作为单件的当前拥有者将单件委托给另一个行为者保管但未转让所有权的一个家族关联起来。 @zh-hans
toolkit label: 托存者家族 @zh-hans
toolkit definition: 作为单件的当前拥有者将单件委托给另一个行为者保管但未转让所有权的一个家族 @zh-hans
label: mevduatçı ailesi ile ilişkilidir @tr
definition: Bir kopyayı, bir kopyanın mevcut sahibi olan ve mülkiyeti devretmeden eşyayı başka bir temsilcinin emanetine bırakan bir aileyle ilişkilendirir. @tr
toolkit label: mevduatçı aile @tr
toolkit definition: Bir kopyanın şu anki sahibi olan ve mülkiyeti devretmeden kopyayı başka bir temsilcinin gözetimine teslim eden bir aile. @tr

a pour personne déposante
status: Published
label: has depositor person @en
lexical alias: depositorPerson.en
definition: Relates an item to a person who is a current owner of an item who deposits the item into the custody of another agent without transferring ownership. @en
toolkit label: depositor person @en
toolkit definition: A person who is a current owner of an item who deposits the item into the custody of another agent without transferring ownership. @en
type: Property
domain: C10003
has element type: 2
sub property of: a pour personne propriétaire actuelle
sub property of: a pour agent déposant
definition: Met un item en relation avec une personne propriétaire actuelle d’un item qui dépose l’item sous la garde d’un autre agent sans en transférer la propriété.
toolkit label: personne déposante
toolkit definition: Personne propriétaire actuelle d’un item qui dépose l’item sous la garde d’un autre agent sans en transférer la propriété.
label: tallettaja (henkilö) @fi
definition: Liittää kappaleen sen nykyiseen henkilöomistajaan, joka tallettaa kappaleen toisen toimijan huostaan omistajuudesta luopumatta. @fi
toolkit label: tallettaja (henkilö) @fi
toolkit definition: Kappaleen nykyinen henkilöomistaja, joka tallettaa kappaleen toisen toimijan huostaan omistajuudesta luopumatta. @fi
label: har deponent (person) @no
definition: Relaterer et eksemplar til en person som er en nåværende eier av et eksemplar som deponerer eksemplaret til forvaring til en annen agent uten at eierskapet blir overført. @no
toolkit label: deponent (person) @no
toolkit definition: En person som er en nåværende eier av et eksemplar som deponerer eksemplaret til forvaring til en annen agent uten at eierskapet blir overført. @no
label: heeft bruikleen-persoon @nl
definition: Relateert een item aan een persoon die een huidige eigenaar is van een item die het item onderbrengt bij een andere actor zonder eigenaarschap over te dragen. @nl
toolkit label: bruikleen-persoon @nl
toolkit definition: Een persoon die een huidige eigenaar is van een item die het item onderbrengt bij een andere actor zonder eigenaarschap over te dragen. @nl
label: له شخص مودِع @ar
definition: يربط مفردة بشخص هو المالك الحالي لمفردة، يودعها تحت وصاية وكيل آخر دون نقل ملكيتها. @ar
toolkit label: شخص مودع @ar
toolkit definition: شخص هو المالك الحالي لمفردة، يودعها تحت وصاية وكيل آخر دون نقل ملكيتها. @ar
label: té com a persona dipositadora @ca
definition: Relaciona un ítem amb una persona que és un propietari actual d’un ítem que el diposita sota la custòdia d’un altre agent sense transferir-li la propietat. @ca
toolkit label: persona dipositadora @ca
toolkit definition: Persona que és un propietari actual d’un ítem que el diposita sota la custòdia d’un altre agent sense transferir-li la propietat. @ca
label: har person, som er udlåner @da
definition: Relaterer et eksemplar til en person, som er nuværende ejer af et eksemplar, som deponerer eksemplaret til forvaring hos en anden agent, men uden at overgive ejerskab. @da
toolkit label: person, som er udlåner @da
toolkit definition: Person, som er nuværende ejer af et eksemplar, som deponerer eksemplaret til forvaring hos en anden agent, men uden at overgive ejerskab. @da
label: deponeerija (isik) @et
definition: Seostab eksemplari isikuga, kes praeguse omanikuna deponeerib eksemplari teise tegija vastutavale hoiule ilma omandiõiguse üleminekuta. @et
toolkit label: deponeerija (isik) @et
toolkit definition: Isik, kes praeguse omanikuna deponeerib eksemplari teise tegija vastutavale hoiule ilma omandiõiguse üleminekuta. @et
label: hat Leihgeberin/Leihgeber (Person) @de
definition: Setzt ein Exemplar in Beziehung zu einer gegenwärtigen Eigentümerin/einem gegenwärtigen Eigentümer (Person) eines Exemplars, die/der das Exemplar in die Obhut eines anderen Akteurs gibt, ohne das Eigentumsrecht zu übertragen. @de
toolkit label: Leihgeberin/Leihgeber (Person) @de
toolkit definition: Eine gegenwärtige Eigentümerin/Ein gegenwärtiger Eigentümer (Person) eines Exemplars, die/der das Exemplar in die Obhut eines anderen Akteurs gibt, ohne das Eigentumsrecht zu übertragen. @de
label: letétbe helyező személye a következő: @hu
definition: Hozzákapcsol egy példányt egy személyhez, aki egy példány jelenlegi tulajdonosa, és aki egy másik ágens megőrzésébe letétként helyezi el a példányt anélkül, hogy a tulajdonjogot átruházná. @hu
toolkit label: letétbe helyező személye: @hu
toolkit definition: Egy személy, aki egy példány jelenlegi tulajdonosa, és aki egy másik ágens megőrzésébe letétként helyezi el a példányt anélkül, hogy a tulajdonjogot átruházná. @hu
label: ha come depositante persona @it
definition: Correla un item al proprietario attuale persona di un item che deposita l'item sotto la custodia di un altro agente senza trasferirne la proprietà. @it
toolkit label: depositante persona @it
toolkit definition: Proprietario attuale persona di un item che deposita l'item sotto la custodia di un altro agente senza trasferirne la proprietà. @it
label: deponents (persona) @lv
definition: Sasaista vienību ar personu, kura ir pašreizējais vienības īpašnieks, kurš deponējis vienību cita aģenta uzglabāšanā, vienlaikus saglabājot īpašumtiesības. @lv
toolkit label: deponents (persona) @lv
toolkit definition: Persona, pašreizējais vienības īpašnieks, kurš deponējis vienību cita aģenta uzglabāšanā, vienlaikus saglabājot īpašumtiesības. @lv
has subproperty: P40107
label: 有托存者个人 @zh-hans
definition: 将一个单件与作为单件的当前拥有者将单件委托给另一个行为者保管但未转让所有权的一个个人关联起来。 @zh-hans
toolkit label: 托存者个人 @zh-hans
toolkit definition: 作为单件的当前拥有者将单件委托给另一个行为者保管但未转让所有权的一个个人 @zh-hans
label: mevduatçı kişisi ile ilişkilidir @tr
definition: Bir kopyayı, mülkiyeti devretmeden başka bir temsilcinin gözetimine emanet eden, bir kopyanın mevcut sahibi olan bir kişiyle ilişkilendirir. @tr
toolkit label: mevduatçı @tr
toolkit definition: Bir kopyanın mevcut sahibi olan ve mülkiyeti devretmeden kopyayı başka bir temsilcinin gözetimine bırakan kişi. @tr

is description of (item) (Deprecated)
status: Deprecated
type: Property
sub property of: has descriptive item relationship with (Deprecated)
toolkit definition: An item described by a describing work. (Deprecated) @en
toolkit label: description of (item) (Deprecated) @en
definition: Relates a work to an item described by a describing work. (Deprecated) @en
lexical alias: descriptionOfItem.en
domain: C10001
instruction number: 24.5
has subproperty: is analysis of (item) (Deprecated)
has subproperty: is commentary on (item) (Deprecated)
has subproperty: is critique of (item) (Deprecated)
has subproperty: is evaluation of (item) (Deprecated)
has subproperty: is review of (item) (Deprecated)

a pour transfert numérique (item)
status: Deprecated
type: Property
domain: C10003
definition: Met un item en relation avec un item en format numérique qui résulte du transfert d’un item dans un format numérique différent.
toolkit label: transfert numérique (item)
toolkit definition: Item en format numérique qui résulte du transfert d’un item dans un format numérique différent.
toolkit label: transferencia digital (ítem) @es
toolkit definition: Un ítem en un formato digital que resulta de la transferencia de un ítem en otro formato digital. @es
sub property of: est reproduit comme (item)
instruction number: 24.5
label: có chuyển kỹ thuật số (bản) @vi
definition: Liên kết bản với bản dưới định dạng số là kết quả của việc chuyển ạng của bản dưới định dạng số khác. @vi
toolkit label: chuyển kỹ thuật số (bản) @vi
toolkit definition: Bản dưới định dạng số là kết quả của việc chuyển ạng của bản dưới định dạng số khác. @vi
label: har digital overførsel (eksemplar) @da
definition: Relaterer et eksemplar til et eksemplar i et digitalt format, der er resultatet af overførsel af et eksemplar i et andet digitalt format. @da
toolkit label: digital overførsel (eksemplar) @da
toolkit definition: Eksemplar i et digitalt format, der er resultatet af overførsel af et eksemplar i et andet digitalt format. @da
label: hat digitale Übertragung (Exemplar) @de
definition: Setzt ein Exemplar mit einem Exemplar in einem digitalen Format, das aus der Übertragung eines Exemplars in ein anderes digitales Format resultiert, in Beziehung. @de
toolkit label: Digitale Übertragung (Exemplar) @de
toolkit definition: Ein Exemplar in einem digitalen Format, das aus der Übertragung eines Exemplars in ein anderes digitales Format resultiert. @de
label: έχει ψηφιακή μεταφορά (αντίτυπο) @el
definition: Συνδέει ένα αντίτυπο με ένα αντίτυπο σε ένα ψηφιακό μορφότυπο το οποίο προκύπτει από τη μεταφορά ενός αντιτύπου σε ένα άλλο ψηφιακό μορφότυπο. @el
toolkit label: ψηφιακή μεταφορά (αντίτυπο) @el
toolkit definition: Ένα αντίτυπο σε ψηφιακό μορφότυπο το οποίο προκύπτει από τη μεταφορά ενός αντιτύπου σε ένα άλλο ψηφιακό μορφότυπο. @el
label: té com a transferència digital (ítem) @ca
definition: Relaciona un item amb un ítem en un format digital que és el resultat de la transferència d’un ítem en un altre format digital. @ca
toolkit label: transferència digital (ítem) @ca
toolkit definition: Ítem en un format digital que és el resultat de la transferència d’un ítem en un altre format digital. @ca
label: konvertoituna (kappale) @fi
definition: Liittää kappaleen digitaalisessa muodossa olevaan kappaleeseen, joka syntyy toisen digitaalisessa muodossa olevan kappaleen digitoinnin tuloksena. @fi
toolkit label: konvertoituna (kappale) @fi
toolkit definition: Digitaalisessa muodossa oleva kappale, joka syntyy toisen digitaalisessa muodossa olevan kappaleen digitoinnin tuloksena. @fi
toolkit label: digital overføring (eksemplar) @no
toolkit definition: Et eksemplar i digitalt format som er resultatet av overføring av et eksemplar fra et annet digitalt format. @no
lexical alias: digitalTransferItem.en
has subproperty: P40056

a pour transfert numérique d’un item
status: Published
label: has digital transfer of item @en
type: Property
lexical alias: digitalTransferOfItem.en
definition: Relates an item to a manifestation in a digital format that results from the transfer of an item in another digital format. @en
domain: C10003
sub property of: est reproduit comme un item
toolkit label: digital transfer of item @en
toolkit definition: A manifestation in a digital format that results from the transfer of an item in another digital format. @en
has element type: 2
definition: Met un item en relation avec une manifestation en format numérique qui résulte du transfert d’un item dans un format numérique différent.
toolkit label: transfert numérique d’un item
toolkit definition: Manifestation en format numérique qui résulte du transfert d’un item dans un format numérique différent.
alternative label: digital transfer (item) @en
label: konvertoinnin tulos (kappale) @fi
definition: Liittää kappaleen digitaalisessa muodossa olevaan manifestaatioon, joka on tulosta toisessa digitaalisessa muodossa olevan kappaleen muunnoksesta. @fi
toolkit label: konvertoinnin tulos (kappale) @fi
toolkit definition: Digitaalisessa muodossa oleva manifestaatio, joka on tulosta toisessa digitaalisessa muodossa olevan kappaleen muunnoksesta. @fi
label: har digital overføring av eksemplar @no
definition: Relaterer et eksemplar til en manifestasjon i et digitalt format som er resultatet av overføringen av et eksemplar i et annet digitalt format. @no
toolkit label: digital overføring av eksemplar @no
toolkit definition: En manifestasjon i et digitalt format som er resultatet av overføringen av et eksemplar i et annet digitalt format. @no
label: heeft digitale kopie van item @nl
definition: Relateert een item aan een manifestatie in een digitaal formaat die het resultaat is van een kopie van een item in een ander digitaal formaat. @nl
toolkit label: digitale kopie van item @nl
toolkit definition: Een manifestatie in een digitaal formaat die het resultaat is van een kopie van een item in een ander digitaal formaat. @nl
label: له تحويل رقمي لمفردة @ar
definition: يربط مفردة بتجسيدة في شكل رقمي نتجت عن تحويل مفردة إلى شكل رقمي آخر. @ar
toolkit label: تحويل رقمي لمفردة @ar
toolkit definition: تجسيدة في شكل رقمي نتج عن تحويل مفردة إلى شكل رقمي آخر. @ar
label: té com a transferència digital d’un ítem @ca
definition: Relaciona un ítem amb una manifestació en un format digital que és el resultat de la transferència d’un ítem en un altre format digital. @ca
toolkit label: transferència digital d’un ítem @ca
toolkit definition: Manifestació en un format digital que és el resultat de la transferència d’un ítem en un altre format digital. @ca
label: har digital overførsel af eksemplar @da
definition: Relaterer et eksemplar til en manifestation i et digitalt format, som er resultatet af en overførsel af et eksemplar i et andet digitalt format. @da
toolkit label: digital overførsel af eksemplar @da
toolkit definition: Manifestation i et digitalt format, som er resultatet af en overførsel af et eksemplar i et andet digitalt format. @da
label: eksemplari digitaalne konversioon @et
definition: Seostab eksemplari digitaalse kehastusega, mis on muus digitaalvormingus oleva eksemplari konversiooni tulemus. @et
toolkit label: eksemplari digitaalne konversioon @et
toolkit definition: Digitaalne kehastus, mis on muus digitaalvormingus oleva eksemplari konversiooni tulemus. @et
label: hat digitale Übertragung eines Exemplars @de
definition: Setzt ein Exemplar in Beziehung zu einer Manifestation in einem digitalen Format, die durch die Übertragung eines Exemplars in ein anderes digitales Format entsteht. @de
toolkit label: Digitale Übertragung eines Exemplars @de
toolkit definition: Eine Manifestation in einem digitalen Format, die durch die Übertragung eines Exemplars in ein anderes digitales Format entsteht. @de
label: példány digitális átvitele a következő: @hu
definition: Hozzákapcsol egy példányt egy digitális formátumú megjelenési formához, amely egy másik digitális formátumú példány átviteléből származik. @hu
toolkit label: példány digitális átvitele: @hu
toolkit definition: Egy digitális formátumú megjelenési forma, amely egy másik digitális formátumú példány átviteléből származik. @hu
label: ha come trasferimento digitale di item @it
definition: Correla un item a una manifestazione in un formato digitale che risulta dal trasferimento di un item in un altro formato digitale. @it
toolkit label: trasferimento digitale di item @it
toolkit definition: Manifestazione in un formato digitale che risulta dal trasferimento di un item in un altro formato digitale. @it
label: vienības digitāls pārveidojums @lv
definition: Sasaista vienību ar manifestāciju digitālā formātā, kas ir cita digitāla formāta vienības transformācijas rezultāts. @lv
toolkit label: vienības digitāls pārveidojums @lv
toolkit definition: Manifestācija digitālā formātā, kas ir cita digitāla formāta vienības transformācijas rezultāts. @lv
alternative label: تحويل رقمي (مفردة) @ar
alternative label: Digitale Übertragung (Exemplar) @de
alternative label: transferència digital (ítem) @ca
has subproperty: P40087
alternative label: 数字转储（单件） @zh-hans
label: 有单件的数字转储 @zh-hans
definition: 将一个单件与从另一种数字格式的单件转储为一种数字格式而形成的载体表现关联起来。 @zh-hans
toolkit label: 单件的数字转储 @zh-hans
toolkit definition: 从另一种数字格式的单件转储为一种数字格式而形成的载体表现 @zh-hans
alternative label: transferencia digital (ítem) @es
alternative label: transfert numérique (item)
alternative label: digitális átvitele (példány): @hu
alternative label: dijital aktarım (kopya) @tr
label: kopyanın dijital aktarımı ile ilişkilidir @tr
definition: Bir kopyayı, başka bir dijital formattaki bir kopyanın aktarımından kaynaklanan dijital formattaki bir gösterimle ilişkilendirir. @tr
toolkit label: kopyanın dijital aktarımı @tr
toolkit definition: Bir kopyanın başka bir dijital formatta aktarılmasından kaynaklanan dijital formattaki bir gösterim. @tr

est un transfert numérique de (item)
status: Deprecated
type: Property
domain: C10003
sub property of: est une reproduction de (item)
definition: Met un item en relation avec un item en format numérique qui a été transféré dans un format numérique différent.
toolkit label: transfert numérique de (item)
toolkit definition: Item en format numérique qui a été transféré dans un format numérique différent.
toolkit label: transferencia digital de (ítem) @es
toolkit definition: Un ítem en un formato digital que es transferido a otro formato digital. @es
instruction number: 24.5
label: là bản chuyền điện tử của (bản) @vi
definition: Liên kết bản với bản dưới định dạng số được chuyển sang định dạng số khác. @vi
toolkit label: bản chuyền điện tử của (bản) @vi
toolkit definition: Bản dưới định dạng số được chuyển sang định dạng số khác. @vi
label: er digital overførsel af (eksemplar) @da
definition: Relaterer et eksemplar til et eksemplar i et digitalt format, der er overført til et andet digitalt format. @da
toolkit label: digital overførsel af (eksemplar) @da
toolkit definition: Eksemplar i et digitalt format, der er overført til et andet digitalt format. @da
label: ist digitale Übertragung von (Exemplar) @de
definition: Setzt ein Exemplar mit einem Exemplar in einem digitalen Format, das in ein anderes digitales Format übertragen wurde, in Beziehung. @de
toolkit label: Digitale Übertragung von (Exemplar) @de
toolkit definition: Ein Exemplar in einem digitalen Format, das in ein anderes digitales Format übertragen wurde. @de
label: είναι ψηφιακή μεταφορά του (αντίτυπο) @el
definition: Συνδέει ένα αντίτυπο με ένα αντίτυπο σε ένα ψηφιακό μορφότυπο που μεταφέρεται σε ένα άλλο ψηφιακό μορφότυπο. @el
toolkit label: ψηφιακή μεταφορά του (αντίτυπο) @el
toolkit definition: Ένα αντίτυπο σε ένα ψηφιακό μορφότυπο που μεταφέρεται σε ένα άλλο ψηφιακό μορφότυπο. @el
label: és transferència digital de (ítem) @ca
definition: Relaciona un item amb un ítem en un format digital que es transfereix a un altre format digital. @ca
toolkit label: transferència digital de (ítem) @ca
toolkit definition: Ítem en un format digital que es transfereix a un altre format digital. @ca
label: konvertoitu kappaleesta @fi
definition: Liittää kappaleen digitaalisessa muodossa olevaan kappaleeseen, jota on muunnettu toiseen digitaaliseen muotoon. @fi
toolkit label: konvertoitu kappaleesta @fi
toolkit definition: Digitaalisessa muodossa oleva kappale, jota on muunnettu toiseen digitaaliseen muotoon. @fi
toolkit label: digital overføring av (eksemplar) @no
toolkit definition: Et eksemplar i et digitalt format som overføres til et annet digitalt format. @no
lexical alias: digitalTransferOfItem.en
has subproperty: P40039

a pour agent donateur
status: Published
label: has donor agent @en
definition: Relates an item to an agent who is a former owner of an item who donates the item to another owner. @en
type: Property
domain: C10003
sub property of: a pour ancien agent propriétaire
lexical alias: donorAgent.en
toolkit label: donor agent @en
toolkit definition: An agent who is a former owner of an item who donates the item to another owner. @en
definition: Met un item en relation avec un ancien agent propriétaire d’un item qui fait don de cet item à un autre propriétaire.
toolkit label: agent donateur
toolkit definition: Ancien agent propriétaire d’un item qui fait don de cet item à un autre propriétaire.
toolkit label: donante @es
toolkit definition: Un propietario anterior de un ítem que lo donó a otro propietario. @es
instruction number: 18.5
label: có người tặng @vi
definition: Liên kết bản với người chủ trước đây của bản, người đã tặng bản đó cho người chủ khác. @vi
toolkit label: người tặng @vi
toolkit definition: Người chủ trước đây của bản, người đã tặng bản đó cho người chủ khác. @vi
label: har agent, som er donor @da
definition: Relaterer et eksemplar til en agent, som er tidligere ejer af et eksemplar, som har doneret dette eksemplar til en anden ejer. @da
toolkit label: agent, som er donor @da
toolkit definition: Agent, som er tidligere ejer af et eksemplar, som har doneret dette eksemplar til en anden ejer. @da
label: hat Stifterin/Stifter (Akteur) @de
definition: Setzt ein Exemplar in Beziehung zu einer früheren Eigentümerin/einem früheren Eigentümer (Akteur) eines Exemplars, die/der das Exemplar einer anderen Eigentümerin/einem anderen Eigentümer überlässt. @de
toolkit label: Stifterin/Stifter (Akteur) @de
toolkit definition: Eine frühere Eigentümerin/Ein früherer Eigentümer (Akteur) eines Exemplars, die/der das Exemplar einer anderen Eigentümerin/einem anderen Eigentümer überlässt. @de
label: έχει δωρητή @el
definition: Συνδέει ένα αντίτυπο με έναν προηγούμενο ιδιοκτήτη ενός αντιτύπου ο οποίος δώρισε αυτό το αντίτυπο σε κάποιον άλλον ιδιοκτήτη. @el
toolkit label: δωρητής @el
toolkit definition: Ένας προηγούμενος ιδιοκτήτης ενός αντιτύπου, ο οποίος δώρισε αυτό το αντίτυπο σε κάποιον άλλον ιδιοκτήτη. @el
label: té com a agent donant @ca
definition: Relaciona un ítem amb un agent que és un propietari anterior d’un ítem que dona l’ítem a un altre propietari. @ca
toolkit label: agent donant @ca
toolkit definition: Agent que és un propietari anterior d’un ítem que dona l’ítem a un altre propietari. @ca
definition: Liittää kappaleen sen aiempaan omistajaan, joka lahjoittaa sen toiselle omistajalle. @fi
toolkit label: lahjoittaja (toimija) @fi
toolkit definition: Kappaleen aiempi omistaja, joka lahjoittaa kappaleen toiselle omistajalle. @fi
toolkit label: giver (agent) @no
toolkit definition: En agent som er en tidligere eier av et eksemplar som har gitt eksemplaret til en annen eier. @no
has element type: 2
label: adományozó ágense a következő: @hu
definition: Hozzákapcsol egy példányt egy ágenshez, egy példány korábbi tulajdonosához, amely a példányt egy másik tulajdonosnak adományozta. @hu
toolkit label: adományozó ágens: @hu
toolkit definition: Egy ágens, egy példány korábbi tulajdonosa, amely a példányt egy másik tulajdonosnak adományozta. @hu
alternative label: donor @en
alternative label: donateur
alternative label: lahjoittaja @fi
label: lahjoittaja (toimija) @fi
label: har giver (agent) @no
definition: Relaterer et eksemplar til en agent som er en tidligere eier av et eksemplar som har gitt eksemplaret til en annen eier. @no
alternative label: giver @no
label: heeft schenker-actor @nl
definition: Relateert een item aan een actor die een voormalige eigenaar is van een item die het item schenkt aan een andere eigenaar. @nl
toolkit label: schenker-actor @nl
toolkit definition: Een actor die een voormalige eigenaar is van een item die het item schenkt aan een andere eigenaar. @nl
label: له وكيل متبرع @ar
definition: يربط مفردة بوكيل هو المالك السابق لمفردة، تبرع بها لمالك آخر. @ar
alternative label: متبرع @ar
toolkit label: وكيل متبرع @ar
toolkit definition: وكيل هو المالك السابق لمفردة، تبرع بها لمالك آخر. @ar
alternative label: donant @ca
label: annetaja (tegija) @et
definition: Seostab eksemplari tegijaga, kes eksemplari endise omanikuna on kinkinud selle teisele omanikule. @et
alternative label: annetaja @et
toolkit label: annetaja (tegija) @et
toolkit definition: Tegija, kes eksemplari endise omanikuna on kinkinud selle teisele omanikule. @et
alternative label: adományozó: @hu
label: ziedotājs (aģents) @lv
definition: Sasaista vienību ar aģentu, agrākais vienības īpašnieks, kurš ziedojis šo vienību citam īpašniekam. @lv
toolkit label: ziedotājs (aģents) @lv
toolkit definition: Aģents, agrākais vienības īpašnieks, kurš ziedojis šo vienību citam īpašniekam. @lv
alternative label: Stifter @de
has subproperty: a pour agent collectif donateur
has subproperty: a pour personne donatrice
has subproperty: P40007
alternative label: 捐赠者 @zh-hans
label: 有捐赠者行为者 @zh-hans
definition: 将一个单件与作为先前拥有者将单件捐赠给另一个拥有者的一个行为者关联起来。 @zh-hans

a pour agent collectif donateur
status: Published
label: has donor collective agent @en
lexical alias: donorCollectiveAgent.en
definition: Relates an item to a collective agent who is a former owner of an item who donates the item to another owner. @en
toolkit label: donor collective agent @en
toolkit definition: A collective agent who is a former owner of an item who donates the item to another owner. @en
type: Property
domain: C10003
has element type: 2
sub property of: a pour ancien agent collectif propriétaire
sub property of: a pour agent donateur
definition: Met un item en relation avec un ancien agent collectif propriétaire d’un item qui fait don de cet item à un autre propriétaire.
toolkit label: agent collectif donateur
toolkit definition: Ancien agent collectif propriétaire d’un item qui fait don de cet item à un autre propriétaire.
label: lahjoittaja (yhteistoimija) @fi
definition: Liittää kappaleen sen aiempana omistajana olevaan yhteistoimijaan, joka lahjoittaa sen toiselle omistajalle. @fi
toolkit label: lahjoittaja (yhteistoimija) @fi
toolkit definition: Kappaleen aiempana omistajana oleva yhteistoimija, joka lahjoittaa sen toiselle omistajalle. @fi
label: har giver (kollektiv agent) @no
definition: Relaterer et eksemplar til en kollektiv agent som er en tidligere eier av et eksemplar som har gitt eksemplaret til en annen eier. @no
toolkit label: giver (kollektiv agent) @no
toolkit definition: En kollektiv agent som er en tidligere eier av et eksemplar som har gitt eksemplaret til en annen eier. @no
label: heeft schenker-collectieve actor @nl
definition: Relateert een item aan een collectieve actor die een voormalige eigenaar is van een item die het item schenkt aan een andere eigenaar. @nl
toolkit label: schenker-collectieve actor @nl
toolkit definition: Een collectieve actor die een voormalige eigenaar is van een item die het item schenkt aan een andere eigenaar. @nl
label: له وكيل جماعي متبرع @ar
definition: يربط مفردة بوكيل جماعي هو المالك السابق لمفردة، تبرع بها لمالك آخر. @ar
toolkit label: وكيل جماعي متبرع @ar
toolkit definition: وكيل جماعي هو المالك السابق لمفردة، تبرع بها لمالك آخر. @ar
label: té com a agent col·lectiu donant @ca
definition: Relaciona un ítem amb un agent col·lectiu que és un propietari anterior d’un ítem que dona l’ítem a un altre propietari. @ca
toolkit label: agent col·lectiu donant @ca
toolkit definition: Agent col·lectiu que és un propietari anterior d’un ítem que dona l’ítem a un altre propietari. @ca
label: har kollektiv agent, som er donor @da
definition: Relaterer et eksemplar til en kollektiv agent, som er tidligere ejer af et eksemplar, som har doneret dette eksemplar til en anden ejer. @da
toolkit label: kollektiv agent, som er donor @da
toolkit definition: Kollektiv agent, som er tidligere ejer af et eksemplar, som har doneret dette eksemplar til en anden ejer. @da
label: annetaja (kollektiiv) @et
definition: Seostab eksemplari kollektiiviga, kes eksemplari endise omanikuna on kinkinud selle teisele omanikule. @et
toolkit label: annetaja (kollektiiv) @et
toolkit definition: Kollektiiv, kes eksemplari endise omanikuna on kinkinud selle teisele omanikule. @et
label: hat Stifterin/Stifter (Gemeinschaftlicher Akteur) @de
definition: Setzt ein Exemplar in Beziehung zu einer früheren Eigentümerin/einem früheren Eigentümer (Gemeinschaftlicher Akteur) eines Exemplars, die/der das Exemplar einer anderen Eigentümerin/einem anderen Eigentümer überlässt. @de
toolkit label: Stifterin/Stifter (Gemeinschaftlicher Akteur) @de
toolkit definition: Eine frühere Eigentümerin/Ein früherer Eigentümer (Gemeinschaftlicher Akteur) eines Exemplars, die/der das Exemplar einer anderen Eigentümerin/einem anderen Eigentümer überlässt. @de
label: adományozó kollektív ágense a következő: @hu
definition: Hozzákapcsol egy példányt egy kollektív ágenshez, amely egy példány korábbi tulajdonosa, és amely a példányt egy másik tulajdonosnak adományozza. @hu
toolkit label: adományozó kollektív ágense: @hu
toolkit definition: Egy kollektív ágens, amely egy példány korábbi tulajdonosa, és aki a példányt egy másik tulajdonosnak adományozza. @hu
label: ha come donatore agente collettivo @it
definition: Correla un item all'agente collettivo precedente proprietario di un item che ha donato l'item a un altro proprietario. @it
toolkit label: donatore agente collettivo @it
toolkit definition: Agente collettivo precedente proprietario di un item che ha donato l'item a un altro proprietario. @it
label: ziedotājs (grupa) @lv
definition: Sasaista vienību ar grupu, kas ir agrākais vienības īpašnieks, kurš ziedojis šo vienību citam īpašniekam. @lv
toolkit label: ziedotājs (grupa) @lv
toolkit definition: Aģents grupa, agrākais vienības īpašnieks, kurš ziedojis šo vienību citam īpašniekam. @lv
has subproperty: a pour collectivité donatrice
has subproperty: a pour famille donatrice
has subproperty: P40124
label: 有捐赠者集体行为者 @zh-hans
definition: 将一个单件与作为先前拥有者将单件捐赠给另一个拥有者的一个集体行为者关联起来。 @zh-hans
toolkit label: 捐赠者集体行为者 @zh-hans
toolkit definition: 作为先前拥有者将单件捐赠给另一个拥有者的一个集体行为者 @zh-hans
label: bağışçı kolektif temsilcisi ile ilişkilidir @tr
definition: Bir kopyayı, bir kopyanın eski sahibi olan ve kopyayı başka bir sahibine bağışlayan kolektif bir temsilciyle ilişkilendirir. @tr
toolkit label: bağışçı kolektif temsilci @tr
toolkit definition: Bir kopyanın eski sahibi olan ve kopyayı başka bir sahibine bağışlayan kolektif bir temsilci. @tr

a pour collectivité donatrice
status: Published
label: has donor corporate body @en
lexical alias: donorCorporateBody.en
definition: Relates an item to a corporate body who is a former owner of an item who donates the item to another owner. @en
toolkit label: donor corporate body @en
toolkit definition: A corporate body who is a former owner of an item who donates the item to another owner. @en
type: Property
domain: C10003
has element type: 2
sub property of: a pour ancienne collectivité propriétaire
sub property of: a pour agent collectif donateur
definition: Met un item en relation avec une ancienne collectivité propriétaire d’un item qui fait don de cet item à un autre propriétaire.
toolkit label: collectivité donatrice
toolkit definition: Ancienne collectivité propriétaire d’un item qui fait don de cet item à un autre propriétaire.
label: lahjoittaja (yhteisö) @fi
definition: Liittää kappaleen sen aiempaan omistajayhteisöön, joka lahjoittaa sen toiselle omistajalle. @fi
toolkit label: lahjoittaja (yhteisö) @fi
toolkit definition: Kappaleen aiempi omistajayhteisö, joka lahjoittaa sen toiselle omistajalle. @fi
label: har giver (korporasjon) @no
definition: Relaterer et eksemplar til en korporasjon som er en tidligere eier av et eksemplar som har gitt eksemplaret til en annen eier. @no
toolkit label: giver (korporasjon) @no
toolkit definition: En korporasjon som er en tidligere eier av et eksemplar som har gitt eksemplaret til en annen eier. @no
label: heeft schenker-corporatie @nl
definition: Relateert een item aan een corporatie die een voormalige eigenaar is van een item die het item schenkt aan een andere eigenaar. @nl
toolkit label: schenker-corporatie @nl
toolkit definition: Een corporatie die een voormalige eigenaar is van een item die het item schenkt aan een andere eigenaar. @nl
label: té com a entitat corporativa donant @ca
definition: Relaciona un ítem amb una entitat corporativa que és un propietari anterior d’un ítem que dona l’ítem a un altre propietari. @ca
toolkit label: entitat corporativa donant @ca
toolkit definition: Entitat corporativa que és un propietari anterior d’un ítem que dona l’ítem a un altre propietari. @ca
label: har korporation, som er donor @da
definition: Relaterer et eksemplar til en korporation, som er tidligere ejer af et eksemplar, som har doneret dette eksemplar til en anden ejer. @da
toolkit label: korporation, som er donor @da
toolkit definition: Korporation, som er tidligere ejer af et eksemplar, som har doneret dette eksemplar til en anden ejer. @da
label: annetaja (asutus) @et
definition: Seostab eksemplari asutusega, kes eksemplari endise omanikuna on kinkinud selle teisele omanikule. @et
toolkit label: annetaja (asutus) @et
toolkit definition: Asutus, kes eksemplari endise omanikuna on kinkinud selle teisele omanikule. @et
label: hat Stifterin/Stifter (Körperschaft) @de
definition: Setzt ein Exemplar in Beziehung zu einer früheren Eigentümerin/einem früheren Eigentümer (Körperschaft) eines Exemplars, die/der das Exemplar einer anderen Eigentümerin/einem anderen Eigentümer überlässt. @de
toolkit label: Stifterin/Stifter (Körperschaft) @de
toolkit definition: Eine frühere Eigentümerin/Ein früherer Eigentümer (Körperschaft) eines Exemplars, die/der das Exemplar einer anderen Eigentümerin/einem anderen Eigentümer überlässt. @de
label: adományozó testülete a következő: @hu
definition: Egy példányt hozzákapcsol egy testülethez, amely egy példány korábbi tulajdonosa, és amely a példányt egy másik tulajdonosnak adományozza. @hu
toolkit label: adományozó testülete: @hu
toolkit definition: Egy testület, amely egy példány korábbi tulajdonosa, és amely a példányt egy másik tulajdonosnak adományozza. @hu
label: ha come donatore ente @it
definition: Correla un item all'ente proprietario precedente di un item, che ha donato l'item a un altro proprietario. @it
toolkit label: donatore ente @it
toolkit definition: Ente proprietario precedente di un item che ha donato l'item a un altro proprietario. @it
label: ziedotājs (institūcija) @lv
definition: Sasaista vienību ar institūciju, kas ir agrākais vienības īpašnieks, kurš ziedojis šo vienību citam īpašniekam. @lv
toolkit label: ziedotājs (institūcija) @lv
toolkit definition: Institūcija, agrākais vienības īpašnieks, kurš ziedojis šo vienību citam īpašniekam. @lv
label: له هيئة متبرع @ar
definition: يربط مفردة بهيئة هي المالك السابق لمفردة تبرعت بها لمالك آخر. @ar
toolkit label: هيئة متبرعة @ar
toolkit definition: هيئة هي مالك سابق لمفردة تبرعت بها لمالك آخر. @ar
has subproperty: P40140
label: 有捐赠者团体 @zh-hans
definition: 将一个单件与作为先前拥有者将单件捐赠给另一个拥有者的一个团体关联起来。 @zh-hans
toolkit label: 捐赠者团体 @zh-hans
toolkit definition: 作为先前拥有者将单件捐赠给另一个拥有者的一个团体 @zh-hans
label: bağışçı tüzel kişisi ile ilişkilidir @tr
definition: Bir kopyayı, bir kopyanın eski sahibi olan ve kopyayı başka bir sahibine bağışlayan tüzel bir kişiyle ilişkilendirir. @tr
toolkit label: bağışçı tüzel kişi @tr
toolkit definition: Bir kopyanın eski sahibi olan ve kopyayı başka bir sahibine bağışlayan bir tüzel kişi. @tr

a pour famille donatrice
status: Published
label: has donor family @en
lexical alias: donorFamily.en
definition: Relates an item to a family who is a former owner of an item who donates the item to another owner. @en
toolkit label: donor family @en
toolkit definition: A family who is a former owner of an item who donates the item to another owner. @en
type: Property
domain: C10003
has element type: 2
sub property of: a pour ancienne famille propriétaire
sub property of: a pour agent collectif donateur
definition: Met un item en relation avec une ancienne famille propriétaire d’un item qui fait don de cet item à un autre propriétaire.
toolkit label: famille donatrice
toolkit definition: Ancienne famille propriétaire d’un item qui fait don de cet item à un autre propriétaire.
label: lahjoittaja (suku) @fi
definition: Liittää kappaleen sen aiempaan omistajasukuun, joka lahjoittaa sen toiselle omistajalle. @fi
toolkit label: lahjoittaja (suku) @fi
toolkit definition: Kappaleen aiempi omistajasuku, joka lahjoittaa sen toiselle omistajalle. @fi
label: har giver (familie) @no
definition: Relaterer et eksemplar til en familie som er en tidligere eier av et eksemplar som har gitt eksemplaret til en annen eier. @no
toolkit label: giver (familie) @no
toolkit definition: En familie som er en tidligere eier av et eksemplar som har gitt eksemplaret til en annen eier. @no
label: heeft schenker-familie @nl
definition: Relateert een item aan een familie die een voormalige eigenaar is van een item die het item schenkt aan een andere eigenaar. @nl
toolkit label: schenker-familie @nl
toolkit definition: Een familie die een voormalige eigenaar is van een item die het item schenkt aan een andere eigenaar. @nl
label: له عائلة متبرعة @ar
definition: يربط مفردة بعائلة هي المالك السابق لمفردة تبرعت بها لمالك آخر. @ar
toolkit label: عائلة متبرعة @ar
toolkit definition: عائلة هي المالك السابق لمفردة تبرعت بها لمالك آخر. @ar
label: té com a família donant @ca
definition: Relaciona un ítem amb una família que és un propietari anterior d’un ítem que dona l’ítem a un altre propietari. @ca
toolkit label: família donant @ca
toolkit definition: Família que és un propietari anterior d’un ítem que dona l’ítem a un altre propietari. @ca
label: har familie, som er donor @da
definition: Relaterer et eksemplar til en familie, som er tidligere ejer af et eksemplar, som har doneret dette eksemplar til en anden ejer. @da
toolkit label: familie, som er donor @da
toolkit definition: Familie, som er tidligere ejer af et eksemplar, som har doneret dette eksemplar til en anden ejer. @da
label: annetaja (perekond) @et
definition: Seostab eksemplari perekonnaga, kes eksemplari endise omanikuna on kinkinud selle teisele omanikule. @et
toolkit label: annetaja (perekond) @et
toolkit definition: Perekond, kes eksemplari endise omanikuna on kinkinud selle teisele omanikule. @et
label: hat Stifterin/Stifter (Familie) @de
definition: Setzt ein Exemplar in Beziehung zu einer früheren Eigentümerin/einem früheren Eigentümer (Familie) eines Exemplars, die das Exemplar einer anderen Eigentümerin/einem anderen Eigentümer überlässt. @de
toolkit label: Stifterin/Stifter (Familie) @de
toolkit definition: Eine frühere Eigentümerin/Ein früherer Eigentümer (Familie) eines Exemplars, die das Exemplar einer anderen Eigentümerin/einem anderen Eigentümer überlässt. @de
label: adományozó családja a következő: @hu
definition: Hozzákapcsol egy példányt egy családhoz, amely egy példány korábbi tulajdonosa, és amely a példányt egy másik tulajdonosnak adományozta. @hu
toolkit label: adományozó család @hu
toolkit definition: Egy család, amely egy példány korábbi tulajdonosa, és amely a példányt egy másik tulajdonosnak adományozta. @hu
label: ha come donatore famiglia @it
definition: Correla un item alla famiglia proprietario precedente di un item che ha donato l'item a un altro proprietario. @it
toolkit label: donatore famiglia @it
toolkit definition: Famiglia proprietario precedente di un item che ha donato l'item a un altro proprietario. @it
label: ziedotājs (dzimta/ģimene) @lv
definition: Sasaista vienību ar dzimtu/ģimeni, kas ir agrākais vienības īpašnieks, kurš ziedojis šo vienību citam īpašniekam. @lv
toolkit label: ziedotājs (dzimta/ģimene) @lv
toolkit definition: Dzimta/ģimene, agrākais vienības īpašnieks, kurš ziedojis šo vienību citam īpašniekam. @lv
has subproperty: P40156
label: 有捐赠者家族 @zh-hans
definition: 将一个单件与作为先前拥有者将单件捐赠给另一个拥有者的一个家族关联起来。 @zh-hans
toolkit label: 捐赠者家族 @zh-hans
toolkit definition: 作为先前拥有者将单件捐赠给另一个拥有者的一个家族 @zh-hans
label: bağışçı ailesi ile ilişkilidir @tr
definition: Bir kopyayı, bir kopyanın eski sahibi olan ve kopyayı başka bir sahibine bağışlayan bir aileyle ilişkilendirir. @tr
toolkit label: bağışçı aile @tr
toolkit definition: Bir kopyanın eski sahibi olan ve kopyayı başka bir sahibine bağışlayan bir aile. @tr

a pour personne donatrice
status: Published
label: has donor person @en
lexical alias: donorPerson.en
definition: Relates an item to a person who is a former owner of an item who donates the item to another owner. @en
toolkit label: donor person @en
toolkit definition: A person who is a former owner of an item who donates the item to another owner. @en
type: Property
domain: C10003
has element type: 2
sub property of: a pour ancienne personne propriétaire
sub property of: a pour agent donateur
definition: Met un item en relation avec une ancienne personne propriétaire d’un item qui fait don de cet item à un autre propriétaire.
toolkit label: personne donatrice
toolkit definition: Ancienne personne propriétaire d’un item qui fait don de cet item à un autre propriétaire.
label: lahjoittaja (henkilö) @fi
definition: Liittää kappaleen sen aiempaan henkilöomistajaan, joka lahjoittaa sen toiselle omistajalle. @fi
toolkit label: lahjoittaja (henkilö) @fi
toolkit definition: Kappaleen aiempi henkilöomistaja, joka lahjoittaa sen toiselle omistajalle. @fi
label: har giver (person) @no
definition: Relaterer et eksemplar til en person som er en tidligere eier av et eksemplar som har gitt eksemplaret til en annen eier. @no
toolkit label: giver (person) @no
toolkit definition: En person som er en tidligere eier av et eksemplar som har gitt eksemplaret til en annen eier. @no
label: heeft schenker-persoon @nl
definition: Relateert een item aan een persoon die een voormalige eigenaar is van een item die het item schenkt aan een andere eigenaar. @nl
toolkit label: schenker-persoon @nl
toolkit definition: Een persoon die een voormalige eigenaar is van een item die het item schenkt aan een andere eigenaar. @nl
label: له شخص متبرع @ar
definition: يربط مفردة بشخص هو المالك السابق لمفردة، تبرع بها لمالك آخر. @ar
toolkit label: شخص متبرع @ar
toolkit definition: شخص هو المالك السابق لمفردة، تبرع بها لمالك آخر. @ar
label: té com a persona donant @ca
definition: Relaciona un ítem amb una persona que és un propietari anterior d’un ítem que dona l’ítem a un altre propietari. @ca
toolkit label: persona donant @ca
toolkit definition: Persona que és un propietari anterior d’un ítem que dona l’ítem a un altre propietari. @ca
label: har person, som er donor @da
definition: Relaterer et eksemplar til en person, som er tidligere ejer af et eksemplar, som har doneret dette eksemplar til en anden ejer. @da
toolkit label: person, som er donor @da
toolkit definition: Person, som er tidligere ejer af et eksemplar, som har doneret dette eksemplar til en anden ejer. @da
label: annetaja (isik) @et
definition: Seostab eksemplari isikuga, kes eksemplari endise omanikuna on kinkinud selle teisele omanikule. @et
toolkit label: annetaja (isik) @et
toolkit definition: Isik, kes eksemplari endise omanikuna on kinkinud selle teisele omanikule. @et
label: hat Stifterin/Stifter (Person) @de
definition: Setzt ein Exemplar in Beziehung zu einer früheren Eigentümerin/einem früheren Eigentümer (Person) eines Exemplars, die/der das Exemplar einer anderen Eigentümerin/einem anderen Eigentümer überlässt. @de
toolkit label: Stifterin/Stifter (Person) @de
toolkit definition: Eine frühere Eigentümerin/Ein früherer Eigentümer (Person) eines Exemplars, die/der das Exemplar einer anderen Eigentümerin/einem anderen Eigentümer überlässt. @de
label: adományozó személye a következő: @hu
definition: Hozzákapcsol egy példányt egy személyhez, aki egy példány korábbi tulajdonosa, és aki a példányt egy másik tulajdonosnak adományozta. @hu
toolkit label: adományozó személye: @hu
toolkit definition: Egy személy, aki egy példány korábbi tulajdonosa, és aki a példányt egy másik tulajdonosnak adományozta. @hu
label: ha come donatore persona @it
definition: Correla un item al proprietario precedente persona di un item che ha donato l'item a un altro possessore. @it
toolkit label: donatore persona @it
toolkit definition: Proprietario precedente persona di un item che ha donato l'item a un altro possessore. @it
label: ziedotājs (persona) @lv
definition: Sasaista vienību ar personu, kura ir agrākais vienības īpašnieks, kurš ziedojis šo vienību citam īpašniekam. @lv
toolkit label: ziedotājs (persona) @lv
toolkit definition: Persona, agrākais vienības īpašnieks, kurš ziedojis šo vienību citam īpašniekam. @lv
has subproperty: P40108
label: 有捐赠者个人 @zh-hans
definition: 将一个单件与作为先前拥有者将单件捐赠给另一个拥有者的一个个人关联起来。 @zh-hans
toolkit label: 捐赠者个人 @zh-hans
toolkit definition: 作为先前拥有者将单件捐赠给另一个拥有者的一个个人 @zh-hans
label: bağışçı kişisi ile ilişkilidir @tr
definition: Bir kopyayı, bir kopyanın eski sahibi olan ve kopyayı başka bir sahibine bağışlayan bir kişiyle ilişkilendirir. @tr
toolkit label: bağışçı @tr
toolkit definition: Bir kopyanın eski sahibi olan ve kopyayı başka bir sahibine bağışlayan kişi. @tr

a pour reproduction électronique (item)
status: Deprecated
type: Property
domain: C10003
definition: Met un item en relation avec un item en format numérique qui résulte du transfert d’un item sur support analogique.
toolkit label: reproduction électronique (item)
toolkit definition: Item en format numérique qui résulte du transfert d’un item sur support analogique.
toolkit label: reproducción electrónica (ítem) @es
toolkit definition: Un ítem en un formato digital que es el resultado de la transferencia de un ítem en un formato analógico. @es
sub property of: est reproduit comme (item)
instruction number: 24.5
label: có sao chép điện tử (bản) @vi
definition: Liên kết bản với bản dưới định dạng số là kết quả của việc chuyển ạng của bản dưới định dạng tương tự. @vi
toolkit label: sao chép điện tử (bản) @vi
toolkit definition: Bản dưới định dạng số là kết quả của việc chuyển ạng của bản dưới định dạng tương tự. @vi
label: har elektronisk reproduktion (eksemplar) @da
definition: Relaterer et eksemplar til et eksemplar i et digitalt format, der er resultatet af overførsel af et eksemplar i analogt format. @da
toolkit label: elektronisk reproduktion (eksemplar) @da
toolkit definition: Eksemplar i et digitalt format, der er resultatet af overførsel af et eksemplar i analogt format. @da
label: hat elektronische Reproduktion (Exemplar) @de
definition: Setzt ein Exemplar mit einem Exemplar in einem digitalen Format, das das Ergebnis der Übertragung eines Exemplars in einem analogen Format ist, in Beziehung. @de
toolkit label: Elektronische Reproduktion (Exemplar) @de
toolkit definition: Ein Exemplar in einem digitalen Format, das das Ergebnis der Übertragung eines Exemplars in einem analogen Format ist. @de
label: έχει ηλεκτρονική αναπαραγωγή (αντίτυπο) @el
definition: Συνδέει ένα αντίτυπο με ένα αντίτυπο σε ένα ψηφιακό μορφότυπο η οποία προκύπτει από τη μεταφορά ενός αντιτύπου σε αναλογικό μορφότυπο. @el
toolkit label: ηλεκτρονική αναπαραγωγή (αντίτυπο) @el
toolkit definition: Ένα αντίτυπο σε ένα ψηφιακό μορφότυπο το οποίο προκύπτει από τη μεταφορά ενός αντιτύπου σε αναλογικό μορφότυπο. @el
label: té com a reproducció electrònica (ítem) @ca
definition: Relaciona un item amb un ítem en un format digital que és el resultat de la transferència d’un ítem en format analògic. @ca
toolkit label: reproducció electrònica (ítem) @ca
toolkit definition: Ítem en un format digital que és el resultat de la transferència d’un ítem en format analògic. @ca
label: digitoituna (kappale) @fi
definition: Liittää kappaleen digitaalisessa muodossa olevaan kappaleeseen, joka syntyi analogisessa muodossa olevan kappaleen digitoinnin tuloksena. @fi
toolkit label: digitoituna (kappale) @fi
toolkit definition: Digitaalisessa muodossa oleva kappale, joka syntyi analogisessa muodossa olevan kappaleen digitoinnin tuloksena. @fi
toolkit label: elektronisk reproduksjon (eksemplar) @no
toolkit definition: Et eksemplar i digitalt format som er resultatet av overføring av et eksemplar fra analogt format. @no
lexical alias: electronicReproductionItem.en
has subproperty: P40057

a pour reproduction électronique d’un item
status: Published
label: has electronic reproduction of item @en
type: Property
lexical alias: electronicReproductionOfItem.en
definition: Relates an item to a manifestation in a digital format that is the result of the transfer of an item in analog format. @en
domain: C10003
sub property of: est reproduit comme un item
toolkit label: electronic reproduction of item @en
toolkit definition: A manifestation in a digital format that is the result of the transfer of an item in analog format. @en
has element type: 2
definition: Met un item en relation avec une manifestation en format numérique qui est le résultat du transfert d’un item sur support analogique.
toolkit label: reproduction électronique d’un item
toolkit definition: Manifestation en format numérique qui est le résultat du transfert d’un item sur support analogique.
alternative label: electronic reproduction (item) @en
label: kappaleen digitoitu jäljenne @fi
definition: Liittää kappaleen digitaalisessa muodossa olevaan manifestaatioon, joka analogisen kappaleen muunnoksen tulos. @fi
toolkit label: kappaleen digitoitu jäljenne @fi
toolkit definition: Digitaalisessa muodossa oleva manifestaatio, joka analogisen kappaleen muunnoksen tulos. @fi
label: har elektronisk reproduksjon av eksemplar @no
definition: Relaterer et eksemplar til en manifestasjon i et digitalt format som er resultatet av overføringen av et eksemplar i et analogt format. @no
toolkit label: elektronisk reproduksjon av eksemplar @no
toolkit definition: En manifestasjon i et digitalt format som er resultatet av overføringen av et eksemplar i et analogt format. @no
label: heeft elektronische reproductie van item @nl
definition: Relateert een item aan een manifestatie in een digitaal formaat die het resultaat is van een kopie van een item in analoog formaat. @nl
toolkit label: elektronische reproductie van item @nl
toolkit definition: Een manifestatie in een digiteel formaat die het resultaat is van een kopie van een item in analoog formaat. @nl
alternative label: digitoitu jäljenne (kappale) @fi
label: té com a reproducció electrònica d’un ítem @ca
definition: Relaciona un ítem amb una manifestació en un format digital que és el resultat de la transferència d’un ítem en format analògic. @ca
toolkit label: reproducció electrònica d’un ítem @ca
toolkit definition: Manifestació en un format digital que és el resultat de la transferència d’un ítem en format analògic. @ca
label: har elektronisk reproduktion af eksemplar @da
definition: Relaterer et eksemplar til en manifestation i et digitalt format, som er resultatet af en overførsel af en manifestation i et analogt format. @da
toolkit label: elektronisk reproduktion af eksemplar @da
toolkit definition: Manifestation i et digitalt format, som er resultatet af en overførsel af en manifestation i et analogt format. @da
label: eksemplari elektrooniline reproduktsioon @et
definition: Seostab eksemplari digitaalvormis kehastusega, mis on saadud analoogvormis eksemplari digiteerimise teel. @et
toolkit label: eksemplari elektrooniline reproduktsioon @et
toolkit definition: Digitaalvormis kehastus, mis on saadud analoogvormis eksemplari digiteerimise teel. @et
label: hat elektronische Reproduktion eines Exemplars @de
definition: Setzt ein Exemplar in Beziehung zu einer Manifestation in einem digitalen Format, die das Ergebnis der Übertragung eines Exemplars in einem analogen Format ist. @de
toolkit label: Elektronische Reproduktion eines Exemplars @de
toolkit definition: Eine Manifestation in einem digitalen Format, die das Ergebnis der Übertragung eines Exemplars in einem analogen Format ist. @de
label: példány elektronikus másolata a következő: @hu
definition: Hozzákapcsol egy példányt egy digitális formátumban lévő megjelenési formához, amely egy példány analóg formátumból történő átviteléből ered. @hu
toolkit label: példány elektronikus másolata: @hu
toolkit definition: Egy digitális formátumban lévő megjelenési forma, amely egy példány analóg formátumból történő átviteléből ered. @hu
label: ha come riproduzione elettronica di item @it
definition: Correla un item a una manifestazione in formato digitale che risulta dal trasferimento di un item in un formato analogo. @it
toolkit label: riproduzione elettronica di item @it
toolkit definition: Manifestazione in formato digitale che risulta dal trasferimento di un item in un formato analogo. @it
label: vienības digitāla reprodukcija @lv
definition: Sasaista vienību ar manifestāciju digitālā formātā, kas ir analoga formāta vienības transformācijas rezultāts. @lv
toolkit label: vienības digitāla reprodukcija @lv
toolkit definition: Manifestācija digitālā formātā, kas ir analoga formāta vienības transformācijas rezultāts. @lv
label: له استنساخ إلكتروني لمفردة @ar
definition: يربط مفردة بتجسيدة في شكل رقمي نتج عن تحويل مفردة في شكل تناظري. @ar
toolkit label: استنساخ إلكتروني لمفردة @ar
toolkit definition: تجسيدة في شكل رقمي نتج عن تحويل مفردة في شكل تناظري. @ar
alternative label: استنساخ إلكتروني (مفردة) @ar
alternative label: elektronisk reproduktion (eksemplar) @da
alternative label: Elektronische Reproduktion (Exemplar) @de
alternative label: reproducció electrònica (ítem) @ca
has subproperty: P40088
alternative label: 电子复制品（单件） @zh-hans
label: 有单件的电子复制品 @zh-hans
definition: 将一个单件与从模拟格式的单件转储为一种数字格式而形成的载体表现关联起来。 @zh-hans
toolkit label: 单件的电子复制品 @zh-hans
toolkit definition: 从模拟格式的单件转储为一种数字格式而形成的载体表现 @zh-hans
alternative label: reproducción electrónica (ítem) @es
alternative label: reproduction électronique (item)
alternative label: elektronikus másolata (példány): @hu
alternative label: elektronik yeniden üretim (kopya) @tr
label: kopyanın elektronik yeniden üretimi ile ilişkilidir @tr
definition: Bir kopyayı, analog formattaki bir kopyanın aktarımının sonucu olan dijital formattaki bir gösterimle ilişkilendirir. @tr
toolkit label: kopyanın elektronik olarak yeniden üretimi @tr
toolkit definition: Analog formatta bir kopyanın aktarımının sonucu olan dijital formatta bir gösterim. @tr

est une reproduction électronique de (item)
status: Deprecated
type: Property
domain: C10003
sub property of: est une reproduction de (item)
definition: Met un item en relation avec un item sur support analogique qui a été transféré dans un format numérique.
toolkit label: reproduction électronique de (item)
toolkit definition: Item sur support analogique qui a été transféré dans un format numérique.
toolkit label: reproducción electrónica (ítem) @es
toolkit definition: Un ítem en un formato digital que es el resultado de la transferencia de un ítem en un formato analógico. @es
instruction number: 24.5
label: là phiên bản điện tử của (bản) @vi
definition: Liên kết bản với bản dưới định dạng tương tự được chuyển sang định dạng số @vi
toolkit label: phiên bản điện tử của (bản) @vi
toolkit definition: Bản dưới định dạng tương tự được chuyển sang định dạng số @vi
label: er elektronisk reproduktion af (eksemplar) @da
definition: Relaterer et eksemplar til et eksemplar i et analogt format, der er overført til et digitalt format. @da
toolkit label: elektronisk reproduktion af (eksemplar) @da
toolkit definition: Eksemplar i et analogt format, der er overført til et digitalt format. @da
label: ist elektronische Reproduktion von (Exemplar) @de
definition: Setzt ein Exemplar mit einem Exemplar in einem analogen Format, das in ein digitales Format übertragen wurde, in Beziehung. @de
toolkit label: Elektronische Reproduktion von (Exemplar) @de
toolkit definition: Ein Exemplar in einem analogen Format, das in ein digitales Format übertragen wurde. @de
label: είναι ηλεκτρονική αναπαραγωγή του (αντίτυπο) @el
definition: Συνδέει ένα αντίτυπο με ένα αντίτυπο σε ένα αναλογικό μορφότυπο το οποίο μεταφέρεται σε ένα ψηφιακό μορφότυπο. @el
toolkit label: ηλεκτρονική αναπαραγωγή του (αντίτυπο) @el
toolkit definition: Ένα αντίτυπο σε ένα αναλογικό μορφότυπο το οποίο μεταφέρεται σε ένα ψηφιακό μορφότυπο. @el
label: és reproducció electrònica de (ítem) @ca
definition: Relaciona un item amb un ítem en un format analògic que es transfereix a un format digital. @ca
toolkit label: reproducció electrònica de (ítem) @ca
toolkit definition: Ítem en un format analògic que es transfereix a un format digital. @ca
label: digitoitu kappaleesta @fi
definition: Liittää kappaleen analogisessa muodossa olevaan kappaleeseen, josta kuvailun kohde on digitoitu. @fi
toolkit label: digitoitu kappaleesta @fi
toolkit definition: Analogisessa muodossa oleva kappale, joka on muunnettu digitaaliseen muotoon. @fi
toolkit label: elektronisk reproduksjon av (eksemplar) @no
toolkit definition: Et eksemplar i et analogt format som overføres til et digitalt format. @no
lexical alias: electronicReproductionOfItem.en
has subproperty: P40027

a pour item équivalent
status: Published
label: has equivalent item @en
definition: Relates an item to an item that exemplifies a manifestation that embodies the same expression of a work. @en
type: Property
domain: C10003
sub property of: a pour item en relation avec un item
lexical alias: equivalentItem.en
toolkit label: equivalent item @en
toolkit definition: An item that exemplifies a manifestation that embodies the same expression of a work. @en
definition: Met un item en relation avec un item qui exemplifie une manifestation matérialisant la même expression d’une œuvre.
toolkit label: item équivalent
toolkit definition: Item qui exemplifie une manifestation matérialisant la même expression d’une œuvre.
toolkit label: equivalente (ítem) @es
toolkit definition: Un ítem que ejemplifica una manifestación que materializa la misma expresión de una obra. @es
instruction number: 24.5
label: là tương đương (bản) @vi
definition: Liên kết bản với thể hiện biểu thị là hiện thấn của cùng biểu hiện của tác phẩm. @vi
toolkit label: tương đương (bản) @vi
toolkit definition: Thể hiện biểu thị là hiện thấn của cùng biểu hiện của tác phẩm. @vi
label: har tilsvarende eksemplar @da
definition: Relaterer et eksemplar til et eksemplar, der eksemplificerer en manifestation, som indeholder det samme udtryk af et værk. @da
toolkit label: tilsvarende eksemplar @da
toolkit definition: Eksemplar, der eksemplificerer en manifestation, som indeholder det samme udtryk af et værk. @da
label: hat Äquivalent (Exemplar) @de
definition: Setzt ein Exemplar in Beziehung zu einem Exemplar, das eine Manifestation darstellt, die dieselbe Expression eines Werks verkörpert. @de
toolkit label: Äquivalent (Exemplar) @de
toolkit definition: Ein Exemplar, das eine Manifestation darstellt, die dieselbe Expression eines Werks verkörpert. @de
label: είναι ισοδύναμο (αντίτυπο) @el
definition: Συνδέει ένα αντίτυπο με ένα αντίτυπο το οποίο αποτελεί παράδειγμα υλοποίησης μιας εκδήλωσης που ενσωματώνει την ίδια έκφραση ενός έργου. @el
toolkit label: ισοδύναμο (αντίτυπο) @el
toolkit definition: Ένα αντίτυπο το οποίο αποτελεί παράδειγμα υλοποίησης μιας εκδήλωσης που ενσωματώνει την ίδια έκφραση ενός έργου. @el
label: té com a ítem equivalent @ca
definition: Relaciona un ítem amb un ítem que exemplifica una manifestació que materialitza la mateixa expressió d’una obra. @ca
toolkit label: ítem equivalent @ca
toolkit definition: Ítem que exemplifica una manifestació que materialitza la mateixa expressió d’una obra. @ca
definition: Liittää kappaleen kappaleeseen, joka edustaa teoksen saman ekspression manifestaatiota. @fi
toolkit label: vastaava kappale @fi
toolkit definition: Kappale, joka edustaa teoksen saman ekspression manifestaatiota. @fi
toolkit definition: Et eksemplar som er et eksempel på en manifestasjon som gis form til det samme uttrykket av et verk. @no
has element type: 3
label: egyenértékű példánya a következő: @hu
definition: Hozzákapcsol egy példányt egy megjelenési forma példányához, amely megjelenési forma egy mű ugyanazon kifejezési formáját testesíti meg. @hu
toolkit label: ekvivalens példány: @hu
toolkit definition: Egy megjelenési forma példánya, amely megjelenési forma egy mű ugyanazon kifejezési formáját testesíti meg. @hu
alternative label: equivalent item relationship @en
label: vastaava kappale @fi
definition: Relaterer et eksemplar til et eksemplar som er et eksempel på en manifestasjon som gis form til det samme uttrykket av et verk. @no
label: heeft equivalent item @nl
definition: Relateert een item aan een item dat een manifestatie voorstelt die dezelfde expressie van een werk belichaamt. @nl
toolkit definition: Een item dat een manifestatie voorstelt die dezelfde expressie van een werk belichaamt. @nl
label: لها مفردة مكافئة @ar
definition: يربط مفردة بمفردة تمثل تجسيدة تجسد تعبيرة العمل نفسها. @ar
toolkit label: مفردة مكافئة @ar
toolkit definition: مفردة تمثل تجسيدة تجسد تعبيرة العمل نفسها. @ar
label: ekvivalentne eksemplar @et
definition: Seostab eksemplari eksemplariga, mis esindab teose sama väljenduse kehastust. @et
toolkit label: ekvivalentne eksemplar @et
toolkit definition: Eksemplar, mis esindab teose sama väljenduse kehastust. @et
label: ha come item equivalente @it
definition: Correla un item a un item che esemplifica una manifestazione che materializza la stessa espressione di un'opera. @it
toolkit label: item equivalente @it
toolkit definition: Item che esemplifica una manifestazione che materializza la stessa espressione di un'opera. @it
label: ekvivalenta vienība @lv
definition: Sasaista vienību ar vienību, kura pārstāv manifestāciju, kas ietver to pašu darba izteiksmi. @lv
toolkit label: ekvivalenta vienība @lv
toolkit definition: Vienība, kura pārstāv manifestāciju, kas ietver to pašu darba izteiksmi. @lv
alternative label: vastaavan kappaleen suhde @fi
alternative label: علاقة مفردة مكافِئة @ar
alternative label: tilsvarende eksemplar-relation @da
alternative label: Äquivalenzbeziehungen auf Exemplarebene @de
alternative label: relació d’ítem equivalent @ca
has subproperty: est reproduit comme (item)
has subproperty: est une reproduction de (item)
has subproperty: P40031
alternative label: 等同单件关系 @zh-hans
label: 有等同单件 @zh-hans
definition: 将一个单件与例证具体化一种作品同一种内容表达的一种载体表现的一个单件关联起来。 @zh-hans
toolkit label: 等同单件 @zh-hans
toolkit definition: 例证具体化一种作品同一种内容表达的一种载体表现的一个单件 @zh-hans

a pour relation d’item équivalent
status: Deprecated
type: Property
domain: C10003
sub property of: a pour item en relation avec un item
lexical alias: equivalentItemRelationship.en
definition: Met un item en relation avec un item qui est équivalent à un autre item.
toolkit label: relation d’item équivalent
toolkit definition: Item qui est équivalent à un autre item.
toolkit label: relaciones de ítem equivalente @es
toolkit definition: Un ítem que es equivalente al ítem. @es
instruction number: 18.5
label: có mối quan hệ bản tương đương với @vi
definition: Liên kết bản với bản tương đương với bản khác. @vi
toolkit label: mối quan hệ bản tương đương @vi
toolkit definition: Bản tương đương với bản khác. @vi
label: har ækvivalent eksemplarrelation med @da
definition: Relaterer et eksemplar til et eksemplar der er ækvivalent til et eksemplar. @da
toolkit label: ækvivalent eksemplarrelation @da
toolkit definition: Eksemplar der er ækvivalent til et eksemplar. @da
label: hat Äquivalenzbeziehung auf Exemplarebene @de
definition: Setzt ein Exemplar mit einem Exemplar, das mit einem anderen Exemplar äquivalent ist, in Beziehung. @de
toolkit label: Äquivalenzbeziehung auf Exemplarebene @de
toolkit definition: Ein Exemplar, das mit einem anderen Exemplar äquivalent ist. @de
label: έχει ισοδύναμη σχέση του αντιτύπου με @el
definition: Συνδέει ένα αντίτυπο με ένα αντίτυπο το οποίο είναι ισοδύναμο με κάποιο άλλο αντίτυπο. @el
toolkit label: ισοδύναμη σχέση του αντιτύπου @el
toolkit definition: Ένα αντίτυπο το οποίο είναι ισοδύναμο με κάποιο άλλο αντίτυπο. @el
label: té com a relació d’ítem equivalent @ca
definition: Relaciona un item amb un ítem que és equivalent a un altre ítem. @ca
toolkit label: relació d’ítem equivalent @ca
toolkit definition: Ítem que és equivalent a un altre ítem. @ca
label: suhde vastaavaan kappaleeseen @fi
definition: Liittää kappaleen kappaleeseen, joka vastaa toista kappaletta. @fi
toolkit label: suhde vastaavaan kappaleeseen @fi
toolkit definition: Kappale, joka vastaa toista kappaletta. @fi
toolkit label: ekvivalent eksemplar: relasjonstype @no
toolkit definition: Et eksemplar som tilsvarer et annet eksemplar. @no
has subproperty: P40053

is evaluation of (item) (Deprecated)
status: Deprecated
type: Property
sub property of: is description of (item) (Deprecated)
toolkit definition: An item that is examined or judged. (Deprecated) @en
toolkit label: evaluation of (item) (Deprecated) @en
definition: Relates a work to an item that is examined or judged. (Deprecated) @en
lexical alias: evaluationOfItem.en
domain: C10001
instruction number: 24.5

a pour fac-similé (item)
status: Deprecated
type: Property
domain: C10003
definition: Met un item en relation avec un item qui reproduit exactement un autre item.
toolkit label: fac-similé (item)
toolkit definition: Item qui reproduit exactement un autre item.
toolkit label: facsímil (ítem) @es
toolkit definition: Un ítem que reproduce exactamente un ítem. @es
sub property of: est reproduit comme (item)
instruction number: 24.5
label: có sao chép (bản) @vi
definition: Liên kết bản với bản tạo lại chính xác bản khác. @vi
toolkit label: sao chép (bản) @vi
toolkit definition: Bản tạo lại chính xác bản khác. @vi
label: har faksimile (eksemplar) @da
definition: Relaterer et eksemplar til et eksemplar, der er en nøjagtig reproduktion af et andet eksemplar. @da
toolkit label: faksimile (eksemplar) @da
toolkit definition: Eksemplar, der er en nøjagtig reproduktion af et andet eksemplar. @da
label: hat Faksimile (Exemplar) @de
definition: Setzt ein Exemplar mit einem Exemplar, das ein anderes Exemplar exakt reproduziert, in Beziehung. @de
toolkit label: Faksimile (Exemplar) @de
toolkit definition: Ein Exemplar, das ein anderes Exemplar exakt reproduziert. @de
label: έχει ομοιότυπο (αντίτυπο) @el
definition: Συνδέει ένα αντίτυπο με ένα αντίτυπο το οποίο αναπαράγει ακριβώς κάποιο άλλο αντίτυπο. @el
toolkit label: ομοιότυπο (αντίτυπο) @el
toolkit definition: Ένα αντίτυπο το οποίο αναπαράγει ακριβώς κάποιο άλλο αντίτυπο. @el
label: té com a facsímil (ítem) @ca
definition: Relaciona un item amb un ítem que reprodueix exactament un ítem. @ca
toolkit definition: Ítem que reprodueix exactament un ítem. @ca
label: näköispainos (kappale) @fi
definition: Liittää kappaleen kappaleeseen, joka on toisen kappaleen täysin identtinen jäljennös. @fi
toolkit label: näköispainos (kappale) @fi
toolkit definition: Kappale, joka on toisen kappaleen täysin identtinen jäljennös. @fi
toolkit definition: Et eksemplar som er en tro kopi av et annet eksemplar. @no
lexical alias: facsimileItem.en
has subproperty: a pour fac-similé de conservation (item)
has subproperty: P40058

a pour fac-similé d’un item
status: Published
label: has facsimile of item @en
type: Property
lexical alias: facsimileOfItem.en
definition: Relates an item to a manifestation that exactly reproduces an item that exemplifies another manifestation. @en
domain: C10003
sub property of: est reproduit comme un item
toolkit label: facsimile of item @en
toolkit definition: A manifestation that exactly reproduces an item that exemplifies another manifestation. @en
has element type: 2
definition: Met un item en relation avec une manifestation qui reproduit exactement un item exemplifiant une autre manifestation.
toolkit label: fac-similé d’un item
toolkit definition: Manifestation qui reproduit exactement un item exemplifiant une autre manifestation.
alternative label: facsimile (item) @en
label: kappaleen näköispainos @fi
definition: Liittää kappaleen manifestaatioon, joka jäljentää tarkalleen toista manifestaatiota edustavan kappaleen. @fi
toolkit label: kappaleen näköispainos @fi
toolkit definition: Manifestaatio, joka jäljentää tarkalleen toista manifestaatiota edustavan kappaleen. @fi
label: har faksimile av eksemplar @no
definition: Relaterer et eksemplar til en manifestasjon som er en nøyaktig reproduksjon av et eksemplar som eksemplifiserer en annen manifestasjon. @no
toolkit label: faksimile av eksemplar @no
toolkit definition: En manifestasjon som er en nøyaktig reproduksjon av et eksemplar som eksemplifiserer en annen manifestasjon. @no
label: heeft facsimile van item @nl
definition: Relateert een item aan een manifestatie die een item exact reproduceert dat een andere manifestatie voorstelt. @nl
toolkit label: facsimile van item @nl
toolkit definition: Een manifestatie die een item exact reproduceert dat een andere manifestatie voorstelt. @nl
alternative label: näköispainos (kappale) @fi
label: لها نسخة طبق الأصل من مفردة @ar
definition: يربط مفردة بتجسيدة هي استنساخ تام من مفردة تمثل تجسيدة أخرى. @ar
toolkit label: نسخة طبق الأصل من مفردة @ar
toolkit definition: تجسيدة مستنسخة تماما من مفردة تمثل تجسيدة أخرى. @ar
label: té com a facsímil d’un ítem @ca
definition: Relaciona un ítem amb una manifestació que reprodueix exactament un ítem que exemplifica una altra manifestació. @ca
toolkit label: facsímil d’un ítem @ca
toolkit definition: Manifestació que reprodueix exactament un ítem que exemplifica una altra manifestació. @ca
label: har faksimile af eksemplar @da
definition: Relaterer et eksemplar til en manifestation, som nøjagtigt gengiver et eksemplar, som eksemplificerer en anden manifestation. @da
toolkit label: faksimile af eksemplar @da
toolkit definition: Manifestation, som nøjagtigt gengiver et eksemplar, som eksemplificerer en anden manifestation. @da
label: eksemplari faksiimile @et
definition: Seostab eksemplari kehastusega, mis on teist kehastust esindava eksemplari täpne reproduktsioon. @et
toolkit label: eksemplari faksiimile @et
toolkit definition: Kehastus, mis on teist kehastust esindava eksemplari täpne reproduktsioon. @et
label: hat Faksimile eines Exemplars @de
definition: Setzt ein Exemplar in Beziehung zu einer Manifestation, die ein Exemplar exakt reproduziert, welches eine andere Manifestation darstellt. @de
toolkit label: Faksimile eines Exemplars @de
toolkit definition: Eine Manifestation, die ein Exemplar exakt reproduziert, welches eine andere Manifestation darstellt. @de
label: példány hasonmása a következő: @hu
definition: Hozzákapcsol egy példányt egy megjelenési formához, amely egy másik megjelenési forma egy példányának pontos másolata. @hu
toolkit label: példány hasonmása: @hu
toolkit definition: Egy megjelenési forma, amely egy másik megjelenési forma egy példányának pontos másolata. @hu
label: ha come facsimile di item @it
definition: Correla un item a una manifestazione che riproduce esattamente un item che esemplifica un'altra manifestazione. @it
toolkit label: facsimile di item @it
toolkit definition: Manifestazione che riproduce esattamente un item che esemplifica un'altra manifestazione. @it
label: vienības faksimils @lv
definition: Sasaista vienību ar manifestāciju, kas precīzi reproducē vienību, kas ir kā piemērs citai manifestācijai. @lv
toolkit label: vienības faksimils @lv
toolkit definition: Manifestācija, kas precīzi reproducē vienību, kas ir kā piemērs citai manifestācijai. @lv
alternative label: نسخة طبق الأصل (مفردة) @ar
alternative label: faksimile (eksemplar) @da
alternative label: Faksimile (Exemplar) @de
alternative label: facsímil (ítem) @ca
has subproperty: a pour fac-similé de conservation d’un item
has subproperty: P40089
alternative label: 摹真品（单件） @zh-hans
label: 有单件的摹真品 @zh-hans
definition: 将一个单件与精确复制例证另一种载体表现的单件的一种载体表现关联起来。 @zh-hans
toolkit label: 单件的摹真品 @zh-hans
toolkit definition: 精确复制例证另一种载体表现的单件的一种载体表现 @zh-hans
alternative label: fac-similé (item)
alternative label: hasonmása (példány): @hu
alternative label: tıpkıbasım (kopya) @tr
label: kopyanın tıpkıbasımı ile ilişkilidir @tr
definition: Bir kopyayı, başka bir gösterimden kopya edilmiş bir kopyayı tam olarak yeniden üreten bir gösterimle ilişkilendirir. @tr
toolkit label: kopyanın tıpkıbasımı @tr
toolkit definition: Başka bir gösterimi örnekleyen bir kopyayı tam olarak yeniden üreten bir gösterim. @tr

est un fac-un similé de (item)
status: Deprecated
type: Property
domain: C10003
sub property of: est une reproduction de (item)
definition: Met un item en relation avec un item qui sert de base à une reproduction exacte.
toolkit label: fac-similé de (item)
toolkit definition: Item qui sert de base à une reproduction exacte.
toolkit label: facsímil de (ítem) @es
toolkit definition: Un ítem utilizado como base para una reproducción exacta. @es
instruction number: 24.5
label: là bản sao của (bản) @vi
definition: Liên kết bản với bản được sử dụng như là cơ sở cho sản xuất lại chính xác. @vi
toolkit label: bản sao của (bản) @vi
toolkit definition: Bản được sử dụng như là cơ sở cho sản xuất lại chính xác. @vi
label: er faksimile af (eksemplar) @da
definition: Relaterer et eksemplar til et eksemplar, der er anvendt som grundlag for en nøjagtig reproduktion. @da
toolkit label: faksimile af (eksemplar) @da
toolkit definition: Eksemplar, der er anvendt som grundlag for en nøjagtig reproduktion. @da
label: ist Faksimile von (Exemplar) @de
definition: Setzt ein Exemplar mit einem Exemplar, das als Grundlage für eine exakte Reproduktion verwendet wurde, in Beziehung. @de
toolkit label: Faksimile von (Exemplar) @de
toolkit definition: Ein Exemplar, das als Grundlage für eine exakte Reproduktion verwendet wurde. @de
label: είναι ομοιότυπο του (αντίτυπο) @el
definition: Συνδέει ένα αντίτυπο με ένα αντίτυπο το οποίο χρησιμοποιείται ως η βάση για μια αναπαραγωγή ακριβείας. @el
toolkit label: ομοιότυπο του (αντίτυπο) @el
toolkit definition: Ένα αντίτυπο το οποίο χρησιμοποιείται ως η βάση για μια αναπαραγωγή ακριβείας. @el
label: és facsímil de (ítem) @ca
definition: Relaciona un item amb un ítem que s’usa com a base d’una reproducció exacta. @ca
toolkit definition: Ítem que s’usa com a base d’una reproducció exacta. @ca
label: näköispainoksen alkuperä (kappale) @fi
definition: Liittää kappaleen kappaleeseen, jota on käytetty täysin identtisen jäljennöksen perustana. @fi
toolkit label: näköispainoksen alkuperä (kappale) @fi
toolkit definition: Kappale, jota on käytetty täysin identtisen jäljennöksen perustana. @fi
toolkit label: faksimile av (eksemplar) @no
toolkit definition: Et eksemplar som brukes som utgangspunkt for en eksakt reproduksjon. @no
lexical alias: facsimileOfItem.en
has subproperty: est un fac-similé de conservation de (item)
has subproperty: P40045

est filmé avec un item
status: Published
label: is filmed with item @en
definition: Relates an item to an item that is contained on the same microform as an item. @en
type: Property
domain: C10003
sub property of: est conservé avec
lexical alias: filmedWithItem.en
toolkit label: filmed with item @en
toolkit definition: An item that is contained on the same microform as an item. @en
definition: Met un item en relation avec un item qui est contenu sur la même microforme qu’un item.
toolkit label: filmé avec un item
toolkit definition: Item qui est contenu sur la même microforme qu’un item.
toolkit label: filmado con (ítem) @es
toolkit definition: Un ítem que se incluye en la misma microforma que el ítem descrito. @es
instruction number: 24.5
label: được làm phim với (bản) @vi
definition: Liên kết bản với bản được chứa trên cùng vi phim với bản đang được mô tả. @vi
toolkit label: được làm phim với (bản) @vi
toolkit definition: Bản được chứa trên cùng vi phim với bản đang được mô tả. @vi
label: er optaget sammen med eksemplar @da
definition: Relaterer et eksemplar til et eksemplar, som er indeholdt på samme mikroform som et andet eksemplar. @da
toolkit label: optaget sammen med eksemplar @da
toolkit definition: Eksemplar, som er indeholdt på samme mikroform som et andet eksemplar. @da
label: ist verfilmt mit (Exemplar) @de
definition: Setzt ein Exemplar in Beziehung zu einem Exemplar, das auf derselben Mikroform enthalten ist, wie ein Exemplar. @de
toolkit label: Verfilmt mit (Exemplar) @de
toolkit definition: Ein Exemplar, das auf derselben Mikroform enthalten ist, wie ein Exemplar. @de
label: είναι κινηματογραφημένο μαζί με (αντίτυπο) @el
definition: Συνδέει ένα αντίτυπο με ένα αντίτυπο το οποίο περιέχεται στην ίδια μικροφόρμα με ένα περιγραφόμενο αντίτυπο. @el
toolkit label: κινηματογραφημένο μαζί με (αντίτυπο) @el
toolkit definition: Ένα αντίτυπο το οποίο περιέχεται στην ίδια μικροφόρμα με ένα περιγραφόμενο αντίτυπο. @el
label: és filmat amb un ítem @ca
definition: Relaciona un ítem amb un ítem que s’inclou en la mateixa microforma com un ítem. @ca
toolkit label: filmat amb un ítem @ca
toolkit definition: Ítem que s’inclou en la mateixa microforma com un ítem. @ca
definition: Liittää kappaleen kappaleeseen, joka on samalla mikromuotoisella tallenteella toisen kappaleen kanssa. @fi
toolkit label: mikrofilmillä myös (kappale) @fi
toolkit definition: Kappale, joka on samalla mikromuotoisella tallenteella toisen kappale kanssa. @fi
toolkit label: på film med eksemplar @no
toolkit definition: Et eksemplar som befinner seg på samme mikroform som et eksemplar. @no
has element type: 2
label: filmezve a következő példánnyal: @hu
definition: Hozzákapcsol egy példányt egy példányhoz, amely ugyanazon a mikroformátumú hordozón található, mint a példány. @hu
toolkit label: filmezve példánnyal: @hu
toolkit definition: Egy példány, amely ugyanazon a mikroformátumú hordozón található, mint a példány. @hu
label: mikrofilmillä myös (kappale) @fi
label: er på film med eksemplar @no
definition: Relaterer et eksemplar til et eksemplar som befinner seg på samme mikroform som et eksemplar. @no
label: is gefilmd met item @nl
definition: Relateert een item aan een item dat gehouden wordt op dezelfde microvorm als een item. @nl
toolkit label: gefilmd met item @nl
toolkit definition: Een item dat gehouden wordt op dezelfde microvorm als een item. @nl
label: هي مُصورَة مع مفردة @ar
definition: يربط مفردة بمفردة توجد على الميكروفورم نفسه كمفردة. @ar
toolkit label: مُصورَة مع مفردة @ar
toolkit definition: مفردة توجد على الميكروفورم نفسه كمفردة. @ar
label: mikrovormil ka eksemplar @et
definition: Seostab eksemplari eksemplariga, mis sisaldub eksemplariga samal mikrovormil. @et
toolkit label: mikrovormil ka eksemplar @et
toolkit definition: Eksemplar, mis sisaldub eksemplariga samal mikrovormil. @et
label: è su pellicola con item @it
definition: Correla un item a un item contenuto come item nella stessa microforma. @it
toolkit label: su pellicola con item @it
toolkit definition: Item a un item contenuto come item nella stessa microforma. @it
label: ir izdots mikroformā kopā ar vienību @lv
definition: Sasaista vienību ar vienību, kas ir ietverta tajā pašā mikroformā kopā ar aprakstāmo vienību. @lv
toolkit label: izdots mikroformā kopā ar vienību @lv
toolkit definition: Vienība, kas ir ietverta tajā pašā mikroformā kopā ar aprakstāmo vienību. @lv
has subproperty: P40036
label: 与单件合拍 @zh-hans
definition: 将一个单件与和一个单件一起包含在同一缩微品中的一个单件关联起来。 @zh-hans
toolkit label: 与单件合拍 @zh-hans
toolkit definition: 和一个单件一起包含在同一缩微品中的一个单件 @zh-hans
label: kopya ile birlikte çekilmiştir @tr
definition: Bir kopyayı, bir kopyala aynı mikroformda bulunan bir kopyayla ilişkilendirir. @tr
toolkit label: kopya ile filme alınan @tr
toolkit definition: Bir kopyayla aynı mikro formda bulunan bir kopya. @tr

a pour ancien agent propriétaire
status: Published
label: has former owner agent @en
definition: Relates an item to an agent who has former legal possession of an item. @en
type: Property
domain: C10003
sub property of: a pour agent propriétaire
lexical alias: formerOwnerAgent.en
toolkit label: former owner agent @en
toolkit definition: An agent who has former legal possession of an item. @en
definition: Met un item en relation avec un agent qui a auparavant possédé légalement un item.
toolkit label: ancien agent propriétaire
toolkit definition: Agent qui a auparavant possédé légalement un item.
toolkit label: propietario anterior @es
toolkit definition: Una persona, familia o entidad corporativa que tuvo anteriormente la posesión legal de un ítem. @es
instruction number: 18.5
label: có người chủ trước đây @vi
definition: Liên kết bản với tác nhân trước đây đã sở hữu theo pháp luật một bản. @vi
toolkit label: người chủ trước đây @vi
toolkit definition: Tác nhân trước đây đã sở hữu theo pháp luật một bản. @vi
label: har agent, som er tidligere ejer @da
definition: Relaterer et eksemplar til en agent, som tidligere har været i lovlig besiddelse af et eksemplar. @da
toolkit label: agent, som er tidligere ejer @da
toolkit definition: Agent, som tidligere har været i lovlig besiddelse af et eksemplar. @da
label: hat frühere Eigentümerin/früheren Eigentümer (Akteur) @de
definition: Setzt ein Exemplar in Beziehung zu einem Akteur, der früher im rechtmäßigen Besitz eines Exemplars war. @de
toolkit label: Frühere Eigentümerin/Früherer Eigentümer (Akteur) @de
toolkit definition: Ein Akteur, der früher im rechtmäßigen Besitz eines Exemplars war. @de
label: έχει προηγούμενο ιδιοκτήτη @el
definition: Συνδέει ένα αντίτυπο με έναν φορέα που είχε προηγούμενα τη νόμιμη κατοχή ενός αντιτύπου. @el
toolkit label: προηγούμενος ιδιοκτήτης @el
toolkit definition: Ένας φορέας ο οποίος είχε προηγούμενα τη νόμιμη κατοχή ενός αντιτύπου. @el
label: té com a agent propietari anterior @ca
definition: Relaciona un ítem amb un agent que té la propietat legal anterior d’un ítem. @ca
toolkit label: agent propietari anterior @ca
toolkit definition: Agent que té la propietat legal anterior d’un ítem. @ca
definition: Liittää kappaleen toimijaan, joka on aiemmin laillisesti omistanut kappaleen. @fi
toolkit label: aiempi omistaja (toimija) @fi
toolkit definition: Toimija, joka on aiemmin laillisesti omistanut kappaleen. @fi
toolkit label: tidligere eier (agent) @no
toolkit definition: En agent som tidligere var den rettmessige eieren av et eksemplar. @no
has element type: 2
label: korábbi tulajdonos ágense a következő: @hu
definition: Hozzákapcsol egy példányt egy ágenshez, amelynek jelenleg jogszerű tulajdonában van egy példány. @hu
toolkit label: korábbi tulajdonos ágense: @hu
toolkit definition: Egy ágens, amelynek jelenleg jogszerű tulajdonában van egy példány. @hu
alternative label: former owner @en
alternative label: ancien propriétaire
alternative label: aikaisempi omistaja @fi
label: aiempi omistaja (toimija) @fi
label: har tidligere eier (agent) @no
definition: Relaterer et eksemplar til en agent som tidligere var den rettmessige eieren av et eksemplar. @no
alternative label: tidligere eier @no
label: heeft voormalige eigenaar-actor @nl
definition: Relateert een item aan een actor die voormalig wettelijk bezit heeft van een item. @nl
toolkit label: voormalige eigenaar-actor @nl
toolkit definition: Een actor die voormalig wettelijk bezit heeft van een item. @nl
label: له وكيل مالك سابق @ar
definition: يربط مفردة بوكيل لديه سابقا الملكية القانونية لمفردة. @ar
alternative label: مالك سابق @ar
toolkit label: وكيل مالك سابق @ar
toolkit definition: وكيل لديه سابقا ملكية قانونية لمفردة @ar
alternative label: propietari anterior @ca
alternative label: tidligere ejer @da
label: endine omanik (tegija) @et
definition: Seostab eksemplari tegijaga, kellele eksemplar varem õiguspäraselt kuulus. @et
alternative label: endine omanik @et
toolkit label: endine omanik (tegija) @et
toolkit definition: Tegija, kellele eksemplar varem õiguspäraselt kuulus. @et
alternative label: korábbi tulajdonosa: @hu
label: ha come proprietario precedente agente @it
definition: Correla un item a un agente che ha detenuto in precedenza la proprietà giuridica di un item. @it
alternative label: proprietario precedente @it
toolkit label: proprietario precedente agente @it
toolkit definition: Agente che ha detenuto in precedenza la proprietà giuridica di un item. @it
label: agrākais īpašnieks (aģents) @lv
definition: Sasaista vienību ar aģentu, kam vienība iepriekš ir bijusi juridiskā īpašumā. @lv
toolkit label: agrākais īpašnieks (aģents) @lv
toolkit definition: Aģents, kam vienība iepriekš ir bijusi juridiskā īpašumā. @lv
alternative label: Früherer Eigentümer @de
has subproperty: a pour agent donateur

a pour ancien agent collectif propriétaire
status: Published
label: has former owner collective agent @en
lexical alias: formerOwnerCollectiveAgent.en
definition: Relates an item to a collective agent who has former legal possession of an item. @en
toolkit label: former owner collective agent @en
toolkit definition: A collective agent who has former legal possession of an item. @en
type: Property
domain: C10003
has element type: 2
sub property of: a pour agent collectif propriétaire
sub property of: a pour ancien agent propriétaire
definition: Met un item en relation avec un agent collectif qui a auparavant possédé légalement un item.
toolkit label: ancien agent collectif propriétaire
toolkit definition: Agent collectif qui a auparavant possédé légalement un item.
label: aiempi omistaja (yhteistoimija) @fi
definition: Liittää kappaleen yhteistoimijaan, joka on aiemmin laillisesti omistanut kappaleen. @fi
toolkit label: aiempi omistaja (yhteistoimija) @fi
toolkit definition: Yhteistoimija, joka on aiemmin laillisesti omistanut kappaleen. @fi
label: har tidligere eier (kollektiv agent) @no
definition: Relaterer et eksemplar til en kollektiv agent som tidligere var den rettmessige eieren av et eksemplar. @no
toolkit label: tidligere eier (kollektiv agent) @no
toolkit definition: En kollektiv agent som tidligere var den rettmessige eieren av et eksemplar. @no
label: heeft voormalige eigenaar-collectieve actor @nl
definition: Relateert een item aan een collectieve actor die voormalig wettelijk bezit had van een item. @nl
toolkit label: voormalige eigenaar-collectieve actor @nl
toolkit definition: Een collectieve actor die voormalig wettelijk bezit had van een item. @nl
label: له وكيل جماعي مالك سابق @ar
definition: يربط مفردة بوكيل جماعي لديه سابقا الملكية القانونية لمفردة. @ar
toolkit label: وكيل جماعي مالك سابق @ar
toolkit definition: وكيل جماعي لديه سابقا الملكية القانونية لمفردة. @ar
label: té com a agent col·lectiu propietari anterior @ca
definition: Relaciona un ítem amb un agent col·lectiu que té la propietat legal anterior d’un ítem. @ca
toolkit label: agent col·lectiu propietari anterior @ca
toolkit definition: Agent col·lectiu que té la propietat legal anterior d’un ítem. @ca
label: har kollektiv agent, som er tidligere ejer @da
definition: Relaterer et eksemplar til en kollektiv agent, som tidligere har været i lovlig besiddelse af et eksemplar. @da
toolkit label: kollektiv agent, som er tidligere ejer @da
toolkit definition: Kollektiv agent, som tidligere har været i lovlig besiddelse af et eksemplar. @da
label: endine omanik (kollektiiv) @et
definition: Seostab eksemplari kollektiiviga, kellele eksemplar varem õiguspäraselt kuulus. @et
toolkit label: endine omanik (kollektiiv) @et
toolkit definition: Kollektiiv, kellele eksemplar varem õiguspäraselt kuulus. @et
label: hat frühere Eigentümerin/früheren Eigentümer (Gemeinschaftlicher Akteur) @de
definition: Setzt ein Exemplar in Beziehung zu einem gemeinschaftlichen Akteur, der früher im rechtmäßigen Besitz eines Exemplars war. @de
toolkit label: Frühere Eigentümerin/früherer Eigentümer (Gemeinschaftlicher Akteur) @de
toolkit definition: Ein gemeinschaftlicher Akteur, der früher im rechtmäßigen Besitz eines Exemplars war. @de
label: korábbi tulajdonos kollektív ágense a következő: @hu
definition: Hozzákapcsol egy példányt egy testülethez, amely korábban törvényesen birtokolt egy példányt. @hu
toolkit label: korábbi tulajdonos kollektív ágense: @hu
toolkit definition: Egy kollektív ágens, amely korábban törvényesen birtokolt egy példányt. @hu
label: ha come proprietario precedente agente collettivo @it
definition: Correla un item a un agente collettivo che ha detenuto in precedenza la proprietà giuridca di un item. @it
toolkit label: proprietario precedente agente collettivo @it
toolkit definition: Agente collettivo che ha detenuto in precedenza la proprietà giuridca di un item. @it
label: agrākais īpašnieks (grupa) @lv
definition: Sasaista vienību ar grupu, kam vienība iepriekš ir bijusi juridiskā īpašumā. @lv
toolkit label: agrākais īpašnieks (grupa) @lv
toolkit definition: Grupa, kam vienība iepriekš ir bijusi juridiskā īpašumā. @lv
has subproperty: a pour agent collectif donateur
has subproperty: a pour ancienne collectivité propriétaire
has subproperty: a pour ancienne famille propriétaire
has subproperty: a pour agent collectif vendeur
has subproperty: P40118
label: 有先前拥有者集体行为者 @zh-hans
definition: 将一个单件与拥有对一个单件先前法定所有权的一个集体行为者关联起来。 @zh-hans
toolkit label: 先前拥有者集体行为者 @zh-hans
toolkit definition: 拥有对一个单件先前法定所有权的一个集体行为者 @zh-hans
label: eski sahip kolektif temsilcisi ile ilişkilidir @tr
definition: Bir kopyayı, bir kopyanın daha önce yasal mülkiyetine sahip olan bir kolektif temsilciyle ilişkilendirir. @tr
toolkit label: önceki sahibi olan kolektif temsilci @tr
toolkit definition: Bir kopyanın daha önce yasal mülkiyetine sahip olan kolektif bir temsilci. @tr

a pour ancienne collectivité propriétaire
status: Published
label: has former owner corporate body @en
lexical alias: formerOwnerCorporateBody.en
definition: Relates an item to a corporate body who has former legal possession of an item. @en
toolkit label: former owner corporate body @en
toolkit definition: A corporate body who has former legal possession of an item. @en
type: Property
domain: C10003
has element type: 2
sub property of: a pour collectivité propriétaire
sub property of: a pour ancien agent collectif propriétaire
definition: Met un item en relation avec une collectivité qui a auparavant possédé légalement un item.
toolkit label: ancienne collectivité propriétaire
toolkit definition: Collectivité qui a auparavant possédé légalement un item.
label: aiempi omistaja (yhteisö) @fi
definition: Liittää kappaleen yhteisöön, joka on aiemmin laillisesti omistanut kappaleen. @fi
toolkit label: aiempi omistaja (yhteisö) @fi
toolkit definition: Yhteisö, joka on aiemmin laillisesti omistanut kappaleen. @fi
label: har tidligere eier (korporasjon) @no
definition: Relaterer et eksemplar til en korporasjon som tidligere var den rettmessige eieren av et eksemplar. @no
toolkit label: tidligere eier (korporasjon) @no
toolkit definition: En korporasjon som tidligere var den rettmessige eieren av et eksemplar. @no
label: heeft voormalige eigenaar-corporatie @nl
definition: Relateert een item aan een corporatie die voormalig wettelijk bezit had van een item. @nl
toolkit label: voormalige eigenaar-corporatie @nl
toolkit definition: Een corporatie die voormalig wettelijk bezit had van een item. @nl
label: له هيئة مالكة سابقة @ar
definition: يربط مفردة بهيئة لديها سابقا الملكية القانونية لمفردة. @ar
toolkit label: هيئة المالك السابق @ar
toolkit definition: هيئة لديها سابقا الملكية القانونية لمفردة. @ar
label: té com a entitat corporativa propietària anterior @ca
definition: Relaciona un ítem amb una entitat corporativa que té la propietat legal anterior d’un ítem. @ca
toolkit label: entitat corporativa propietària anterior @ca
toolkit definition: Entitat corporativa que té la propietat legal anterior d’un ítem. @ca
label: har korporation, som er tidligere ejer @da
definition: Relaterer et eksemplar til en korporation, som tidligere har været i lovlig besiddelse af et eksemplar. @da
toolkit label: korporation, som er tidligere ejer @da
toolkit definition: Korporation, som tidligere har været i lovlig besiddelse af et eksemplar. @da
label: endine omanik (asutus) @et
definition: Seostab eksemplari asutusega, kellele eksemplar varem õiguspäraselt kuulus. @et
toolkit label: endine omanik (asutus) @et
toolkit definition: Asutus, kellele eksemplar varem õiguspäraselt kuulus. @et
label: hat frühere Eigentümerin/früheren Eigentümer (Körperschaft) @de
definition: Setzt ein Exemplar in Beziehung zu einer Körperschaft, die früher im rechtmäßigen Besitz eines Exemplars war. @de
toolkit label: frühere Eigentümerin/Früherer Eigentümer (Körperschaft) @de
toolkit definition: Eine Körperschaft, die früher im rechtmäßigen Besitz eines Exemplars war. @de
label: korábbi tulajdonos testülete a következő: @hu
definition: Egy példányt hozzákapcsol egy testülethez, amely korábban törvényesen birtokolta a példányt. @hu
toolkit label: korábbi tulajdonos testülete: @hu
toolkit definition: Egy testület, amely egy példányt jelenleg törvényesen birtokol. @hu
label: ha come proprietario precedente ente @it
definition: Correla un item a un ente che ha detenuto in precedenza la proprietà giuridica di un item. @it
toolkit label: proprietario precedente ente @it
toolkit definition: Ente che ha detenuto in precedenza la proprietà giuridica di un item. @it
label: agrākais īpašnieks (institūcija) @lv
definition: Sasaista vienību ar institūciju, kam vienība iepriekš ir bijusi juridiskā īpašumā. @lv
toolkit label: agrākais īpašnieks (institūcija) @lv
toolkit definition: Institūcija, kam vienība iepriekš ir bijusi juridiskā īpašumā. @lv
has subproperty: a pour collectivité donatrice
has subproperty: a pour collectivité vendeuse
has subproperty: P40134
label: 有先前拥有者团体 @zh-hans
definition: 将一个单件与拥有对一个单件先前法定所有权的一个团体关联起来。 @zh-hans
toolkit label: 先前拥有者团体 @zh-hans
toolkit definition: 拥有对一个单件先前法定所有权的一个团体 @zh-hans
label: eski sahip tüzel kişisi ile ilişkilidir @tr
definition: Bir kopyayı, bir kopyanın daha önce yasal mülkiyetine sahip olan tüzel bir kişiyle ilişkilendirir. @tr
toolkit label: önceki sahibi olan tüzel kişi @tr
toolkit definition: Bir kopyanın daha önce yasal mülkiyetine sahip olan bir tüzel kişi. @tr

a pour ancienne famille propriétaire
status: Published
label: has former owner family @en
lexical alias: formerOwnerFamily.en
definition: Relates an item to a family who has former legal possession of an item. @en
toolkit label: former owner family @en
toolkit definition: A family who has former legal possession of an item. @en
type: Property
domain: C10003
has element type: 2
sub property of: a pour famille propriétaire
sub property of: a pour ancien agent collectif propriétaire
definition: Met un item en relation avec une famille qui a auparavant possédé légalement un item.
toolkit label: ancienne famille propriétaire
toolkit definition: Famille qui a auparavant possédé légalement un item.
label: aiempi omistaja (suku) @fi
definition: Liittää kappaleen sukuun, joka on aiemmin laillisesti omistanut kappaleen. @fi
toolkit label: aiempi omistaja (suku) @fi
toolkit definition: Suku, joka on aiemmin laillisesti omistanut kappaleen. @fi
label: har tidligere eier (familie) @no
definition: Relaterer et eksemplar til en familie som tidligere var den rettmessige eieren av et eksemplar. @no
toolkit label: tidligere eier (familie) @no
toolkit definition: En familie som tidligere var den rettmessige eieren av et eksemplar. @no
label: heeft voormalige eigenaar-familie @nl
definition: Relateert een item aan een familie die voormalig wettelijk bezit had van een item. @nl
toolkit label: voormalige eigenaar-familie @nl
toolkit definition: Een familie die voormalig wettelijk bezit had van een item. @nl
label: له عائلة مالكة سابقا @ar
definition: يربط مفردة بعائلة لديها سابقا الملكية القانونية لمفردة. @ar
toolkit label: عائلة مالكة سابقا @ar
toolkit definition: عائلة لديها سابقا الملكية القانونية لمفردة. @ar
label: té com a família propietària anterior @ca
definition: Relaciona un ítem amb una família que té la propietat legal anterior d’un ítem. @ca
toolkit label: família propietària anterior @ca
toolkit definition: Família que té la propietat legal anterior d’un ítem. @ca
label: har familie, som er tidligere ejer @da
definition: Relaterer et eksemplar til en familie, som tidligere har været i lovlig besiddelse af et eksemplar. @da
toolkit label: familie, som er tidligere ejer @da
toolkit definition: Familie, som tidligere har været i lovlig besiddelse af et eksemplar. @da
label: endine omanik (perekond) @et
definition: Seostab eksemplari perekonnaga, kellele eksemplar varem õiguspäraselt kuulus. @et
toolkit label: endine omanik (perekond) @et
toolkit definition: Perekond, kellele eksemplar varem õiguspäraselt kuulus. @et
label: hat frühere Eigentümerin/früheren Eigentümer (Familie) @de
definition: Setzt ein Exemplar in Beziehung zu einer Familie, die früher im rechtmäßigen Besitz eines Exemplars war. @de
toolkit label: Frühere Eigentümerin/Früherer Eigentümer (Familie) @de
toolkit definition: Eine Familie, die früher im rechtmäßigen Besitz eines Exemplars war. @de
label: korábbi tulajdonos családja a következő: @hu
definition: Egy példányt hozzákapcsol egy családhoz, amely korábban törvényesen birtokolta a példányt. @hu
toolkit label: korábbi tulajdonos családja: @hu
toolkit definition: Egy család, amely korábban törvényesen birtokolt egy példányt. @hu
label: ha come proprietario precedente famiglia @it
definition: Correla un item a una famiglia che ha detenuto in precedenza la proprietà giuridica di un item. @it
toolkit label: proprietario precedente famiglia @it
toolkit definition: Famiglia che ha detenuto in precedenza la proprietà giuridica di un item. @it
label: agrākais īpašnieks (dzimta/ģimene) @lv
definition: Sasaista vienību ar dzimtu/ģimeni, kam vienība iepriekš ir bijusi juridiskā īpašumā. @lv
toolkit label: agrākais īpašnieks (dzimta/ģimene) @lv
toolkit definition: Dzimta/ģimene, kam vienība iepriekš ir bijusi juridiskā īpašumā. @lv
has subproperty: a pour famille donatrice
has subproperty: a pour famille vendeuse
has subproperty: P40150
label: 有先前拥有者家族 @zh-hans
definition: 将一个单件与拥有对一个单件先前法定所有权的一个家族关联起来。 @zh-hans
toolkit label: 先前拥有者家族 @zh-hans
toolkit definition: 拥有对一个单件先前法定所有权的一个家族 @zh-hans
label: eski sahip ailesi ile ilişkilidir @tr
definition: Bir kopyayı, bir kopyanın daha önce yasal mülkiyetine sahip olan bir ailyle ilişkilendirir. @tr
toolkit label: önceki sahibi olan aile @tr
toolkit definition: Bir kopyanın daha önce yasal mülkiyetine sahip olan bir aile. @tr

a pour ancienne personne propriétaire
status: Published
label: has former owner person @en
lexical alias: formerOwnerPerson.en
definition: Relates an item to a person who has former legal possession of an item. @en
toolkit label: former owner person @en
toolkit definition: A person who has former legal possession of an item. @en
type: Property
domain: C10003
has element type: 2
sub property of: a pour personne propriétaire
sub property of: a pour ancien agent propriétaire
definition: Met un item en relation avec une personne qui a auparavant possédé légalement un item.
toolkit label: ancienne personne propriétaire
toolkit definition: Personne qui a auparavant possédé légalement un item.
label: aiempi omistaja (henkilö) @fi
definition: Liittää kappaleen henkilöön, joka on aiemmin laillisesti omistanut kappaleen. @fi
toolkit label: aiempi omistaja (henkilö) @fi
toolkit definition: Henkilö, joka on aiemmin laillisesti omistanut kappaleen. @fi
label: har tidligere eier (person) @no
definition: Relaterer et eksemplar til en person som tidligere var den rettmessige eieren av et eksemplar. @no
toolkit label: tidligere eier (person) @no
toolkit definition: En person som tidligere var den rettmessige eieren av et eksemplar. @no
label: heeft voormalige eigenaar-persoon @nl
definition: Relateert een item aan een persoon die voormalig wettelijk bezit had van een item. @nl
toolkit label: voormalige eigenaar-persoon @nl
toolkit definition: Een persoon die voormalig wettelijk bezit had van een item. @nl
label: له شخص مالك سابق @ar
definition: يربط مفردة بشخص لديه سابقا الملكية القانونية لمفردة. @ar
toolkit label: شخص مالك سابق @ar
toolkit definition: شخص لديه سابقا الملكية القانونية لمفردة. @ar
label: té com a persona propietària anterior @ca
definition: Relaciona un ítem amb una persona que té la propietat legal anterior d’un ítem. @ca
toolkit label: persona propietària anterior @ca
toolkit definition: Persona que té la propietat legal anterior d’un ítem. @ca
label: har person, som er tidligere ejer @da
definition: Relaterer et eksemplar til en person, som tidligere har været i lovlig besiddelse af et eksemplar. @da
toolkit label: person, som er tidligere ejer @da
toolkit definition: Person, som tidligere har været i lovlig besiddelse af et eksemplar. @da
label: endine omanik (isik) @et
definition: Seostab eksemplari isikuga, kellele eksemplar varem õiguspäraselt kuulus. @et
toolkit label: endine omanik (isik) @et
toolkit definition: Isik, kellele eksemplar varem õiguspäraselt kuulus. @et
label: hat frühere Eigentümerin/früheren Eigentümer (Person) @de
definition: Setzt ein Exemplar in Beziehung zu einer Person, die früher im rechtmäßigen Besitz eines Exemplars war. @de
toolkit label: Frühere Eigentümerin/Früherer Eigentümer (Person) @de
toolkit definition: Eine Person, die früher im rechtmäßigen Besitz eines Exemplars war. @de
label: korábbi tulajdonos személye a következő: @hu
definition: Hozzákapcsol egy példányt egy személyhez, aki korábban törvényesen birtokolt egy példányt. @hu
toolkit label: korábbi tulajdonos személye: @hu
toolkit definition: Egy személy, aki korábban törvényesen birtokolt egy példányt. @hu
label: ha come proprietario precedente persona @it
definition: Correla un item a una persona che ha detenuto in precedenza la proprietà giuridica di un item. @it
toolkit label: proprietario precedente persona @it
toolkit definition: Persona che ha detenuto in precedenza la proprietà giuridica di un item. @it
label: agrākais īpašnieks (persona) @lv
definition: Sasaista vienību ar personu, kurai vienība iepriekš ir bijusi juridiskā īpašumā. @lv
toolkit label: agrākais īpašnieks (persona) @lv
toolkit definition: Persona, kurai vienība iepriekš ir bijusi juridiskā īpašumā. @lv
has subproperty: a pour personne donatrice
has subproperty: a pour personne vendeuse
has subproperty: P40102
label: 有先前拥有者个人 @zh-hans
definition: 将一个单件与拥有对一个单件先前法定所有权的一个个人关联起来。 @zh-hans
toolkit label: 先前拥有者个人 @zh-hans
toolkit definition: 拥有对一个单件先前法定所有权的一个个人 @zh-hans
label: eski sahip kişisi ile ilişkilidir @tr
definition: Bir kopyayı, bir kopyanın daha önce yasal mülkiyetine sahip olan bir kişiyle ilişkilendirir. @tr
toolkit label: önceki sahibi olan kişi @tr
toolkit definition: Bir kopyanın daha önce yasal mülkiyetine sahip olan bir kişi. @tr

has descriptive item relationship with (Deprecated)
status: Deprecated
type: Property
sub property of: a pour item en relation avec un item
toolkit definition: A work that is a description of the item. (Deprecated) @en
toolkit label: descriptive item relationship (Deprecated) @en
definition: Relates an item to a work that is a description of the item. (Deprecated) @en
lexical alias: descriptiveItemRelationship.en
domain: C10003
instruction number: 24.5
has subproperty: is description of (item) (Deprecated)

a pour agent honoré d’un item
status: Published
label: has honouree agent of item @en
definition: Relates an item to an agent who is honoured by an item. @en
type: Property
domain: C10003
sub property of: a pour agent en relation avec un item
lexical alias: honoureeAgentOfItem.en
alternative label: honoree of item @en
toolkit label: honouree agent of item @en
toolkit definition: An agent who is honoured by an item. @en
definition: Met un item en relation avec un agent qui est honoré par un item.
toolkit label: agent honoré d’un item
toolkit definition: Agent qui est honoré par un item.
toolkit label: homenajeado en el ítem @es
toolkit definition: Una persona, familia o entidad corporativa en cuyo honor se realiza un ítem, por ej., una persona a la cual se le brinda una copia. @es
instruction number: 18.5
label: có người kính trọng của bản @vi
definition: Liên kết bản với tác nhân được thể hiện kính trong bởi một bản. @vi
toolkit label: người kính trọng (bản) @vi
toolkit definition: Tác nhân được thể hiện kính trong bởi một bản. @vi
label: har agent, som er beæret i eksemplar @da
definition: Relaterer et eksemplar til en agent, som er hædret i et eksemplar. @da
toolkit label: agent, som er beæret i eksemplar @da
toolkit definition: Agent, som er hædret i et eksemplar. @da
label: hat Gefeierte/Gefeierten eines Exemplars (Akteur) @de
definition: Setzt ein Exemplar in Beziehung zu einem Akteur, der durch ein Exemplar geehrt wird. @de
toolkit label: Gefeierte/Gefeierter eines Exemplars (Akteur) @de
toolkit definition: Ein Akteur, der durch ein Exemplar geehrt wird. @de
label: έχει τιμώμενο πρόσωπο (αντίτυπο) @el
definition: Συνδέει ένα αντίτυπο με έναν φορέα τιμώμενο σε ένα αντίτυπο. @el
toolkit label: τιμώμενο πρόσωπο (αντίτυπο) @el
toolkit definition: Ένας φορέας τιμώμενος σε ένα αντίτυπο. @el
label: té com a agent homenatjat d’un ítem @ca
definition: Relaciona un ítem amb un agent que és homenatjat en un ítem. @ca
toolkit label: agent homenatjat d’un ítem @ca
toolkit definition: Agent que és homenatjat en un ítem. @ca
definition: Liittää kappaleen toimijaan, jota kappaleella kunnioitetaan. @fi
toolkit label: kappaleella kunnioitettu toimija @fi
toolkit definition: Toimija, jota kappaleella kunnioitetaan. @fi
toolkit label: agent beæret av eksemplar @no
toolkit definition: En agent som beæres av et eksemplar. @no
has element type: 2
label: példány méltatott ágense a következő: @hu
definition: Hozzákapcsol egy példányt egy ágenshez, amelyet egy példány méltat. @hu
toolkit label: példány méltatott ágense a következő: @hu
toolkit definition: Egy ágens, amelyet egy példány méltat. @hu
alternative label: agent honoré (item)
alternative label: honouree (item) @en
label: kappaleella kunnioitettu toimija @fi
label: har agent beæret av eksemplar @no
definition: Relaterer et eksemplar til en agent som beæres av et eksemplar. @no
alternative label: beæret av eksemplar @no
label: heeft geëerde-actor van item @nl
definition: Relateert een item aan een actor die geëerd wordt door een item. @nl
toolkit label: geëerde-actor van item @nl
toolkit definition: Een actor die geëerd wordt door een item. @nl
label: له وكيل مكرم بمفردة @ar
definition: يربط مفردة بوكيل مُكُرم بمفردة. @ar
alternative label: مُكرَم (مفردة) @ar
toolkit label: وكيل مكرم بمفردة @ar
toolkit definition: وكيل هو مُكرم بمفردة. @ar
alternative label: hædersperson i eksemplar @da
label: eksemplari austusavalduse saaja (tegija) @et
definition: Seostab eksemplari tegijaga, keda eksemplariga austatakse. @et
alternative label: eksemplari austusavalduse saaja @et
toolkit label: eksemplari austusavalduse saaja (tegija) @et
toolkit definition: Tegija, keda eksemplariga austatakse. @et
label: ha come onorato agente di item @it
definition: Correla un item a un agente onorato da un item. @it
alternative label: onorato da item @it
toolkit label: onorato agente da item @it
toolkit definition: Agente onorato da un item. @it
label: ar vienību godinātais aģents @lv
definition: Sasaista vienību ar aģentu, kas godināts ar vienību. @lv
toolkit label: ar vienību godinātais aģents @lv
toolkit definition: Aģents, kas godināts ar vienību. @lv
alternative label: Gefeierter (Exemplar) @de
has subproperty: a pour agent collectif honoré d’un item
has subproperty: a pour personne honorée d’un item

a pour agent collectif honoré d’un item
status: Published
label: has honouree collective agent of item @en
lexical alias: honoureeCollectiveAgentOfItem.en
definition: Relates an item to a collective agent who is honoured by an item. @en
toolkit label: honouree collective agent of item @en
toolkit definition: A collective agent who is honoured by an item. @en
type: Property
domain: C10003
has element type: 2
sub property of: a pour agent collectif en relation avec un item
sub property of: a pour agent honoré d’un item
definition: Met un item en relation avec un agent collectif qui est honoré par un item.
toolkit label: agent collectif honoré d’un item
toolkit definition: Agent collectif qui est honoré par un item.
label: kappaleella kunnioitettu yhteistoimija @fi
definition: Liittää kappaleen yhteistoimijaan, jota kappaleella kunnioitetaan. @fi
toolkit label: kappaleella kunnioitettu yhteistoimija @fi
toolkit definition: Yhteistoimija, jota kappaleella kunnioitetaan. @fi
label: har kollektiv agent beæret av eksemplar @no
definition: Relaterer et eksemplar til en kollektiv agent som beæres av et eksemplar. @no
toolkit label: kollektiv agent beæret av eksemplar @no
toolkit definition: En kollektiv agent som beæres av et eksemplar. @no
label: heeft geëerde-collectieve actor van item @nl
definition: Relateert een item aan een collectieve actor die geëerd wordt door een item. @nl
toolkit label: geëerde-collectieve actor van item @nl
toolkit definition: Een collectieve actor die geëerd wordt door een item. @nl
label: له وكيل جماعي مكرم بمفردة @ar
definition: يربط مفردة بوكيل جماعي مُكُرم بمفردة. @ar
toolkit label: وكيل جماعي مُكُرم بمفردة. @ar
toolkit definition: وكيل جماعي هو كُرِّم بمفردة. @ar
label: té com a agent col·lectiu homenatjat d’un ítem @ca
definition: Relaciona un ítem amb un agent col·lectiu que és homenatjat en un ítem. @ca
toolkit label: agent col·lectiu homenatjat d’un ítem @ca
toolkit definition: Agent col·lectiu que és homenatjat en un ítem. @ca
label: har kollektiv agent, som er beæret i eksemplar @da
definition: Relaterer et eksemplar til en kollektiv agent, som er hædret i et eksemplar. @da
toolkit label: kollektiv agent, som er beæret i eksemplar @da
toolkit definition: Kollektiv agent, som er hædret i et eksemplar. @da
label: eksemplari austusavalduse saaja (kollektiiv) @et
definition: Seostab eksemplari kollektiiviga, keda eksemplariga austatakse. @et
toolkit label: eksemplari austusavalduse saaja (kollektiiv) @et
toolkit definition: Kollektiiv, keda eksemplariga austatakse. @et
label: hat Gefeierte/Gefeierten eines Exemplars (Gemeinschaftlicher Akteur) @de
definition: Setzt ein Exemplar in Beziehung zu einem gemeinschaftlichen Akteur, der durch ein Exemplar geehrt wird. @de
toolkit label: Gefeierte/Gefeierter eines Exemplars (Gemeinschaftlicher Akteur) @de
toolkit definition: Ein gemeinschaftlicher Akteur, der durch ein Exemplar geehrt wird. @de
label: példány méltatott kollektív ágense a következő: @hu
definition: Hozzákapcsol egy példányt egy kollektív ágenshez, amelyet a példány méltat. @hu
toolkit label: példány méltatott kollektív ágense @hu
toolkit definition: Egy kollektív ágens, amelyet a példány méltat. @hu
label: ha come onorato agente collettivo di item @it
definition: Correla un item all'agente collettivo onorato da un item. @it
toolkit label: onorato di item agente collettivo @it
toolkit definition: Agente collettivo onorato da un item. @it
label: ar vienību godinātā grupa @lv
definition: Sasaista vienību ar grupu, kas godināta ar vienību. @lv
toolkit label: ar vienību godinātā grupa @lv
toolkit definition: Grupa, kas godināta ar vienību. @lv
has subproperty: a pour collectivité honorée d’un item
has subproperty: a pour famille honorée d’un item
has subproperty: P40126
label: 有单件的被纪念者集体行为者 @zh-hans
definition: 将一个单件与被一个单件纪念的一个集体行为者关联起来。 @zh-hans
toolkit label: 单件的被纪念者集体行为者 @zh-hans
toolkit definition: 被一个单件纪念的一个集体行为者 @zh-hans
label: kopyanın onurlandırılan kolektif temsilcisi ile ilişkilidir @tr
definition: Bir kopyayı, bir kopya tarafından onurlandırılan kolektif temsilciyle ilişkilendirir. @tr
toolkit label: kopyanın onurlandırılan kolektif temsilcisi ile ilişkilidir @tr
toolkit definition: Bir kopya ile onurlandırılan kolektif temsilci. @tr

a pour collectivité honorée d’un item
status: Published
label: has honouree corporate body of item @en
lexical alias: honoureeCorporateBodyOfItem.en
definition: Relates an item to a corporate body who is honoured by an item. @en
toolkit label: honouree corporate body of item @en
toolkit definition: A corporate body who is honoured by an item. @en
type: Property
domain: C10003
has element type: 2
sub property of: a pour collectivité en relation avec un item
sub property of: a pour agent collectif honoré d’un item
definition: Met un item en relation avec une collectivité qui est honorée par un item.
toolkit label: collectivité honorée d’un item
toolkit definition: Collectivité qui est honorée par un item.
label: kappaleella kunnioitettu yhteisö @fi
definition: Liittää kappaleen yhteisöön, jota kappaleella kunnioitetaan. @fi
toolkit label: kappaleella kunnioitettu yhteisö @fi
toolkit definition: Yhteisö, jota kappaleella kunnioitetaan. @fi
label: har korporasjon beæret av eksemplar @no
definition: Relaterer et eksemplar til en korporasjon som beæres av et eksemplar. @no
toolkit label: korporasjon beæret av eksemplar @no
toolkit definition: En korporasjon som beæres av et eksemplar. @no
label: heeft geëerde-corporatie van item @nl
definition: Relateert een item aan een corporatie die geëerd wordt door een item. @nl
toolkit label: geëerde-corporatie van item @nl
toolkit definition: Een corporatie die geëerd wordt door een item. @nl
label: له هيئة مكرمة بمفردة @ar
definition: يربط مفردة بهيئة مُكَرمة بمفردة. @ar
toolkit label: هيئة مكرَمة بمفردة @ar
toolkit definition: هيئة تم تكريمها بمفردة. @ar
label: té com a entitat corporativa homenatjada d’un ítem @ca
definition: Relaciona un ítem amb una entitat corporativa que és homenatjada en un ítem. @ca
toolkit label: entitat corporativa homenatjada d’un ítem @ca
toolkit definition: Entitat corporativa que és homenatjada en un ítem. @ca
label: har korporation, som er beæret i eksemplar @da
definition: Relaterer et eksemplar til en korporation, som er hædret i et eksemplar. @da
toolkit label: korporation, som er beæret i eksemplar @da
toolkit definition: Korporation, som er hædret i et eksemplar. @da
label: eksemplari austusavalduse saaja (asutus) @et
definition: Seostab eksemplari asutusega, keda eksemplariga austatakse. @et
toolkit label: eksemplari austusavalduse saaja (asutus) @et
toolkit definition: Asutus, keda eksemplariga austatakse. @et
label: hat Gefeierte/Gefeierten eines Exemplars (Körperschaft) @de
definition: Setzt ein Exemplar in Beziehung zu einer Körperschaft, die durch ein Exemplar geehrt wird. @de
toolkit label: Gefeierte/Gefeierter eines Exemplars (Körperschaft) @de
toolkit definition: Eine Körperschaft, die durch ein Exemplar geehrt wird. @de
label: példány méltatott testülete a következő: @hu
definition: Hozzákapcsol egy példányt egy testülethez, amelyet a példány méltat. @hu
toolkit label: példány méltatott testülete @hu
toolkit definition: Egy testület, amelyet a példány méltat. @hu
label: ha come onorato ente di item @it
definition: Correla un item all'ente onorato da un item. @it
toolkit label: ente onorato di item @it
toolkit definition: Ente onorato da un item. @it
label: ar vienību godinātā institūcija @lv
definition: Sasaista vienību ar institūciju, kas godināta ar vienību. @lv
toolkit label: ar vienību godinātā institūcija @lv
toolkit definition: Institūcija, kas godināta ar vienību. @lv
has subproperty: P40142
label: 有单件的被纪念者团体 @zh-hans
definition: 将一个单件与被一个单件纪念的一个团体关联起来。 @zh-hans
toolkit label: 单件的被纪念者团体 @zh-hans
toolkit definition: 被一个单件纪念的一个团体 @zh-hans
label: kopyanın onurlandırılan tüzel kişisi ile ilişkilidir @tr
definition: Bir kopyayı, bir kopyayla onurlandırılan tüzel bir kişiyle ilişkilendirir. @tr
toolkit label: kopyanın onurlandırılan tüzel kişisi ile ilişkilidir @tr
toolkit definition: Bir kopya tarafından onurlandırılan bir tüzel kişi. @tr

a pour famille honorée d’un item
status: Published
label: has honouree family of item @en
lexical alias: honoureeFamilyOfItem.en
definition: Relates an item to a family who is honoured by an item. @en
toolkit label: honouree family of item @en
toolkit definition: A family who is honoured by an item. @en
type: Property
domain: C10003
has element type: 2
sub property of: a pour famille en relation avec un item
sub property of: a pour agent collectif honoré d’un item
definition: Met un item en relation avec une famille qui est honorée par un item.
toolkit label: famille honorée d’un item
toolkit definition: Famille qui est honorée par un item.
label: kappaleella kunnioitettu suku @fi
definition: Liittää kappaleen sukuun, jota kappaleella kunnioitetaan. @fi
toolkit label: kappaleella kunnioitettu suku @fi
toolkit definition: Suku, jota kappaleella kunnioitetaan. @fi
label: har familie beæret av eksemplar @no
definition: Relaterer et eksemplar til en familie som beæres av et eksemplar. @no
toolkit label: familie beæret av eksemplar @no
toolkit definition: En familie som beæres av et eksemplar. @no
label: heeft geëerde-familie van item @nl
definition: Relateert een item aan een familie die geëerd wordt door een item. @nl
toolkit label: geëerde-familie van item @nl
toolkit definition: Een familie die geëerd wordt door een item. @nl
label: له عائلة مكرَمة بمفردة @ar
definition: يربط مفردة بعائلة مكرمة بمفردة. @ar
toolkit label: عائلة مكرمة بمفردة. @ar
toolkit definition: عائلة كُرمت بمفردة. @ar
label: té com a família homenatjada d’un ítem @ca
definition: Relaciona un ítem amb una família que és homenatjada en un ítem. @ca
toolkit label: família homenatjada d’un ítem @ca
toolkit definition: Família que és homenatjada en un ítem. @ca
label: har familie, som er beæret i eksemplar @da
definition: Relaterer et eksemplar til en familie, som er hædret i et eksemplar. @da
toolkit label: familie, som er beæret i eksemplar @da
toolkit definition: Familie, som er hædret i et eksemplar. @da
label: eksemplari austusavalduse saaja (perekond) @et
definition: Seostab eksemplari perekonnaga, keda eksemplariga austatakse. @et
toolkit label: eksemplari austusavalduse saaja (perekond) @et
toolkit definition: Perekond, keda eksemplariga austatakse. @et
label: hat Gefeierte/Gefeierten eines Exemplars (Familie) @de
definition: Setzt ein Exemplar in Beziehung zu einer Familie, die durch ein Exemplar geehrt wird. @de
toolkit label: Gefeierte/Gefeierter eines Exemplars (Familie) @de
toolkit definition: Eine Familie, die durch ein Exemplar geehrt wird. @de
label: példány méltatott családja a következő: @hu
definition: Hozzákapcsol egy példányt egy családhoz, amelyet a példány méltat. @hu
toolkit label: példány méltatott családja @hu
toolkit definition: Egy család, amelyet a példány méltat. @hu
label: ha come onorato famiglia di item @it
definition: Correla un item alla famiglia onorata da un item. @it
toolkit label: famiglia onorata di item @it
toolkit definition: Famiglia onorata da un item. @it
label: ar vienību godinātā dzimta/ģimene @lv
definition: Sasaista vienību ar dzimtu/ģimeni, kas godināta ar vienību. @lv
toolkit label: ar vienību godinātā dzimta/ģimene @lv
toolkit definition: Dzimta/ģimene, kas godināta ar vienību. @lv
has subproperty: P40158
label: 有单件的被纪念者家族 @zh-hans
definition: 将一个单件与被一个单件纪念的一个家族关联起来。 @zh-hans
toolkit label: 单件的被纪念者家族 @zh-hans
toolkit definition: 被一个单件纪念的一个家族 @zh-hans
label: kopyanın onurlandırılan ailesi ile ilişkilidir @tr
definition: Bir kopyayı, bir kopyayla onurlandırılan bir aileyle ilişkilendirir. @tr
toolkit label: kopyanın onurlandırılan ailesi ile ilişkilidir @tr
toolkit definition: Bir kopya ile onurlandırılan bir aile. @tr

a pour personne honorée d’un item
status: Published
label: has honouree person of item @en
lexical alias: honoureePersonOfItem.en
definition: Relates an item to a person who is honoured by an item. @en
toolkit label: honouree person of item @en
toolkit definition: A person who is honoured by an item. @en
type: Property
domain: C10003
has element type: 2
sub property of: a pour personne en relation avec un item
sub property of: a pour agent honoré d’un item
definition: Met un item en relation avec une personne qui est honorée par un item.
toolkit label: personne honorée d’un item
toolkit definition: Personne qui est honorée par un item.
label: kappaleella kunnioitettu henkilö @fi
definition: Liittää kappaleen henkilöön, jota kappaleella kunnioitetaan. @fi
toolkit label: kappaleella kunnioitettu henkilö @fi
toolkit definition: Henkilö, jota kappaleella kunnioitetaan. @fi
label: har person beæret av eksemplar @no
definition: Relaterer et eksemplar til en person som beæres av et eksemplar. @no
toolkit label: person beæret av eksemplar @no
toolkit definition: En person som beæres av et eksemplar. @no
label: heeft geëerde-persoon van item @nl
definition: Relateert een item aan een persoon die geëerd wordt door een item. @nl
toolkit label: geëerde-persoon van item @nl
toolkit definition: Een persoon die geëerd wordt door een item. @nl
label: له شخص مكرَم بمفردة @ar
definition: يربط مفردة بشخص مُكُرم بمفردة. @ar
toolkit label: شخص مكرم بمفردة @ar
toolkit definition: شخص هو مُكُرم بمفردة. @ar
label: té com a persona homenatjada d’un ítem @ca
definition: Relaciona un ítem amb una persona que és homenatjada en un ítem. @ca
toolkit label: persona homenatjada d’un ítem @ca
toolkit definition: Persona que és homenatjada en un ítem. @ca
label: har person, som er beæret i eksemplar @da
definition: Relaterer et eksemplar til en person, som er hædret i et eksemplar. @da
toolkit label: person, som er beæret i eksemplar @da
toolkit definition: Person, som er hædret i et eksemplar. @da
label: eksemplari austusavalduse saaja (isik) @et
definition: Seostab eksemplari isikuga, keda eksemplariga austatakse. @et
toolkit label: eksemplari austusavalduse saaja (isik) @et
toolkit definition: Isik, keda eksemplariga austatakse. @et
label: hat Gefeierte/Gefeierten eines Exemplars (Person) @de
definition: Setzt ein Exemplar in Beziehung zu einer Person, die durch ein Exemplar geehrt wird. @de
toolkit label: Gefeierte/Gefeierter eines Exemplars (Person) @de
toolkit definition: Eine Person, die durch ein Exemplar geehrt wird. @de
label: példány méltatott személye a következő: @hu
definition: Hozzákapcsol egy példányt egy személyhez, akit a példány méltat. @hu
toolkit label: példány méltatott személye: @hu
toolkit definition: Egy személy, akit a példány méltat. @hu
label: ha come onorato persona di item @it
definition: Correla un item alla persona onorata da un item. @it
toolkit label: persona onorata di item @it
toolkit definition: Persona onorata da un item. @it
label: ar vienību godinātā persona @lv
definition: Sasaista vienību ar personu, kura godināta ar vienību. @lv
toolkit label: ar vienību godinātā persona @lv
toolkit definition: Persona, kura godināta ar vienību. @lv
has subproperty: P40110
label: 有单件的被纪念者个人 @zh-hans
definition: 将一个单件与被一个单件纪念的一个个人关联起来。 @zh-hans
toolkit label: 单件的被纪念者个人 @zh-hans
toolkit definition: 被一个单件纪念的一个个人 @zh-hans
label: kopyanın onurlandırılan kişisi ile ilişkilidir @tr
definition: Bir kopyayı, bir kopyayla onurlandırılan bir kişiyle ilişkilendirir. @tr
toolkit label: kopyanın onurlandırılan kişi ile ilişkilidir @tr
toolkit definition: Bir kopya ile onurlandırılan kişi. @tr

a pour identifiant d’item
status: Published
label: has identifier for item @en
definition: Relates an item to a nomen that is an appellation of item that consists of a code, number, or other string, usually independent of natural language and social naming conventions, used to identify an item. @en
type: Property
domain: C10003
lexical alias: identifierForItem.en
toolkit label: identifier for item @en
toolkit definition: A nomen that is an appellation of item that consists of a code, number, or other string, usually independent of natural language and social naming conventions, used to identify an item. @en
definition: Met un item en relation avec un nomen qui est une appellation d’item consistant en un code, un nombre ou une autre chaîne, généralement indépendante du langage naturel et des conventions sociales de dénomination, utilisée pour identifier un item.
toolkit label: identifiant d’item
toolkit definition: Nomen qui est une appellation d’item consistant en un code, un nombre ou une autre chaîne, généralement indépendante du langage naturel et des conventions sociales de dénomination, utilisée pour identifier un item.
toolkit label: identificador del ítem @es
toolkit definition: Una cadena de caracteres asociada con un ítem que sirve para diferenciar ese ítem de otros ítems @es
label: har identifikator för exemplaret @sv
toolkit label: identifikator för exemplaret @sv
label: có chỉ số nhận dạng của bản @vi
definition: Liên kết bản với chuỗi ký tự liên quan với bản phục vụ để phân biệt một bản với các bản khác. @vi
toolkit label: chỉ số nhận dạng của bản @vi
toolkit definition: Chuỗi ký tự liên quan với bản phục vụ để phân biệt một bản với các bản khác. @vi
label: har identifikator for eksemplar @da
definition: Relaterer et eksemplar til en benævnelse på eksemplar, som består af en kode, nummer eller anden streng, ofte uafhængig af normalsprog og navngivningskonventioner brugt til at identificere et eksemplar. @da
toolkit label: identifikator for eksemplar @da
toolkit definition: Benævnelse på eksemplar, som består af en kode, nummer eller anden streng, ofte uafhængig af normalsprog og navngivningskonventioner brugt til at identificere et eksemplar @da
label: hat Identifikator für ein Exemplar @de
definition: Setzt ein Exemplar in Beziehung zu einer Bezeichnung für ein Exemplar, die aus einem Code, einer Nummer oder einer anderen Zeichenkette besteht, der/die normalerweise nicht in natürlicher Sprache und unabhängig von den sozialen Benennungskonventionen ist und zur Identifizierung eines Exemplars verwendet wird. @de
toolkit label: Identifikator für ein Exemplar @de
toolkit definition: Eine Bezeichnung für ein Exemplar, die aus einem Code, einer Nummer oder einer anderen Zeichenkette besteht, der/die normalerweise nicht in natürlicher Sprache und unabhängig von den sozialen Benennungskonventionen ist und zur Identifizierung eines Exemplars verwendet wird. @de
label: έχει αναγνωριστικό για αντίτυπο @el
definition: Συνδέει ένα αντίτυπο με έναν αλφαριθμητικό χαρακτήρα συνδεδεμένο με ένα αντίτυπο με σκοπό τη διαφοροποίηση ενός αντιτύπου από άλλα αντίτυπα. @el
toolkit label: αναγνωριστικό για αντίτυπο @el
toolkit definition: Ένας αλφαριθμητικός χαρακτήρας συνδεδεμένος με ένα αντίτυπο με σκοπό τη διαφοροποίηση ενός αντιτύπου από άλλα αντίτυπα. @el
label: té com a identificador d’ítem @ca
definition: Relaciona un ítem amb un nomen que és una apel·lació d’ítem que consisteix en un codi, un número o qualsevol altra cadena, normalment independent del llenguatge natural i de les convencions socials de denominació, usada per identificar un ítem. @ca
toolkit label: identificador d’ítem @ca
toolkit definition: Nomen que és una apel·lació d’ítem que consisteix en un codi, un número o qualsevol altra cadena, normalment independent del llenguatge natural i de les convencions socials de denominació, usada per identificar un ítem. @ca
definition: Liittää kappaleen nomeniin, joka on kappeleen nimitys, joka koostuu koodista, numerosta tm. merkkijonosta ja joka yleensä on luonnollisesta kielestä ja kielen sosiaalisista konventioista riippumaton kappaleen tunnistamiskeino. @fi
toolkit label: kappaleen tunniste @fi
toolkit definition: Kappaleen nimitys, joka koostuu koodista, numerosta tm. merkkijonosta ja joka yleensä on luonnollisesta kielestä ja kielen sosiaalisista konventioista riippumaton kappaleen tunnistamiskeino. @fi
toolkit definition: En betegnelse for eksemplar som består av en kode, et nummer eller en annen streng, vanligvis uavhengig av naturlig språk eller sosiale navnekonvensjoner, som er brukt for å identifisere et eksemplar. @no
sub property of: a pour appellation d’item
has element type: 3
label: azonosító példányhoz a következő: @hu
definition: Hozzákapcsol egy példányt egy nomenhez, egy példány megnevezéséhez, amely egy kód-, szám-, vagy más típusú karakterláncból áll, amely általában független a természetes nyelvektől és társadalmi névkonvencióktól, és egy példány azonosítására használják. @hu
toolkit label: azonosító példány számára: @hu
toolkit definition: Egy nomen, egy példány megnevezése, amely egy kód-, szám-, vagy más típusú karakterláncból áll, amely általában független a természetes nyelvektől és társadalmi névkonvencióktól, és egy példány azonosítására használják. @hu
sub property of: P00018
instruction number: 2.2
label: kappaleen tunniste @fi
definition: Relaterer et eksemplar til en betegnelse for eksemplar som består av en kode, et nummer eller en annen streng, vanligvis uavhengig av naturlig språk eller sosiale navnekonvensjoner, som er brukt for å identifisere et eksemplar. @no
label: heeft identificatie voor item @nl
definition: Relateert een item aan een nomen dat is een benaming van item die bestaat uit een code, nummer of andere tekenreeks, meestal onafhankelijk van natuurlijke taal of sociale naamgeving, gebruikt om een item te identificeren. @nl
toolkit label: identificatie voor item @nl
toolkit definition: Een nomen dat is een benaming van item die bestaat uit een code, nummer of andere tekenreeks, meestal onafhankelijk van natuurlijke taal of sociale naamgeving, gebruikt om een item te identificeren. @nl
label: eksemplari identifikaator @et
definition: Seostab eksemplari eksemplari nimetusega, mis koosneb eksemplari identifitseerivast koodist, numbrist või muust loomulikust keelest ja üldtuntud nimetamistavadest sõltumatust stringist. @et
toolkit label: eksemplari identifikaator @et
toolkit definition: Eksemplari nimetus, mis koosneb eksemplari identifitseerivast koodist, numbrist või muust loomulikust keelest ja üldtuntud nimetamistavadest sõltumatust stringist. @et
label: vienības identifikators @lv
definition: Sasaista vienību ar nomenu, kas ir vienības apzīmējums, kas sastāv no koda, skaitļa vai citas virknes, kas parasti ir neatkarīgs no dabiskas valodas vai sabiedrībā pieņemtām nosaukšanas tradīcijām, ko izmanto, lai identificētu vienību. @lv
toolkit label: vienības identifikators @lv
toolkit definition: Vienības apzīmējums, kas sastāv no koda, skaitļa vai citas virknes, kas parasti ir neatkarīgs no dabiskas valodas vai sabiedrībā pieņemtām nosaukšanas tradīcijām, ko izmanto, lai identificētu vienību. @lv
label: له معرِّف لمفردة @ar
definition: يربط مفردة بتسمية هي اسم وكيل يتكون من رمز، أو رقم، أو سلسلة تمثيلات أخرى، عادة ما تكون مختلفة عن اللغة الطبيعية وعن التسميات المتعارف عليها اجتماعيا، المستخدمة في تعريف مفردة. @ar
toolkit label: معرِّف لمفردة @ar
toolkit definition: تسمية هي اسم مفردة تتكون من رمز، أو رقم، أو سلسلة تمثيلات أخرى، عادة ما تكون مختلفة عن اللغة الطبيعية وعن التسميات المتعارف عليها اجتماعيا، المستخدمة في مفردة. @ar
has subproperty: P40001
label: 有单件的标识符 @zh-hans
definition: 将一个单件与作为一个由代码、数字、或其他字符串构成、通常独立于自然语言和社会命名惯例、用以标识单件的单件称谓的命名关联起来。 @zh-hans
toolkit label: 单件的标识符 @zh-hans
toolkit definition: 作为一个由代码、数字、或其他字符串构成、通常独立于自然语言和社会命名惯例、用以标识单件的单件称谓的命名 @zh-hans
label: kopyanın tanımlayıcısı ile ilişkilidir @tr
definition: Bir kopyayı, bir kopyayı tanımlamak için kullanılan, genellikle doğal dil ve sosyal adlandırma kurallarından bağımsız bir kod, sayı veya başka bir dizgeden oluşan bir kopya unvanı olan bir isimle ilişkilendirir. @tr
toolkit label: kopyanın tanımlayıcısı ile ilişkilidir @tr
toolkit definition: Bir kopyayı tanımlamak için kullanılan, genellikle doğal dil ve sosyal adlandırma kurallarından bağımsız bir kod, sayı veya başka bir dizeden oluşan bir kopya unvanı olan bir isim. @tr

a pour agent enlumineur
status: Published
label: has illuminator agent @en
definition: Relates an item to an agent who decorates a specific item using precious metals or colour, often with elaborate designs and motifs. @en
type: Property
domain: C10003
sub property of: a pour agent modificateur
lexical alias: illuminatorAgent.en
toolkit label: illuminator agent @en
toolkit definition: An agent who decorates a specific item using precious metals or colour, often with elaborate designs and motifs. @en
definition: Met un item en relation avec un agent qui orne un item spécifique en utilisant des métaux précieux ou de la couleur, souvent avec des dessins et des motifs élaborés.
toolkit label: agent enlumineur
toolkit definition: Agent qui orne un item spécifique en utilisant des métaux précieux ou de la couleur, souvent avec des dessins et des motifs élaborés.
toolkit label: iluminador @es
toolkit definition: Una persona que proporciona la decoración de un ítem específico utilizando metales preciosos, o color, a menudo con diseños y motivos elaborados. @es
instruction number: 18.5
label: có người tô màu @vi
definition: Liên kết bản với cá nhân trang trí cho bản cụ thể sử dụng kim loại quý hoặc màu, thường thiết kế và kiểu dáng tỷ mỷ. @vi
toolkit label: người tô màu @vi
toolkit definition: Cá nhân trang trí cho bản cụ thể sử dụng kim loại quý hoặc màu, thường thiết kế và kiểu dáng tỷ mỷ. @vi
label: har agent, som er illuminator @da
definition: Relaterer et eksemplar til en agent, som udsmykker et særligt eksemplar med ædelmetal eller farve, ofte med detaljerige mønstre og motiver. @da
toolkit label: agent, som er illuminator @da
toolkit definition: Agent, som udsmykker et særligt eksemplar med ædelmetal eller farve, ofte med detaljerige mønstre og motiver. @da
label: hat Illuminatorin/Illuminator (Akteur) @de
definition: Setzt ein Exemplar in Beziehung zu einem Akteur, der ein bestimmtes Exemplar durch Edelmetalle oder Farben, häufig mit kunstvollen Mustern und Motiven, (aus-)gestaltet. @de
toolkit label: Illuminatorin/Illuminator (Akteur) @de
toolkit definition: Ein Akteur, der ein bestimmtes Exemplar durch Edelmetalle oder Farben, häufig mit kunstvollen Mustern und Motiven, (aus-)gestaltet. @de
label: έχει φωτιστή @el
definition: Συνδέει ένα αντίτυπο με ένα φυσικό πρόσωπο που διακοσμεί ένα συγκεκριμένο αντίτυπο χρησιμοποιώντας πολύτιμα μέταλλα ή χρώματα, συχνά με περίτεχνα σχέδια και μοτίβα. @el
toolkit label: φωτιστής @el
toolkit definition: Ένα φυσικό πρόσωπο που διακοσμεί ένα συγκεκριμένο αντίτυπο χρησιμοποιώντας πολύτιμα μέταλλα ή χρώματα, συχνά με περίτεχνα σχέδια και μοτίβα. @el
label: té com a agent il·luminador @ca
definition: Relaciona un ítem amb un agent que decora un ítem concret amb metalls preciosos o amb color, sovint amb dissenys i motius elaborats. @ca
toolkit label: agent il·luminador @ca
toolkit definition: Agent que decora un ítem concret amb metalls preciosos o amb color, sovint amb dissenys i motius elaborats. @ca
definition: Liittää kappaleen toimijaan, joka koristelee yksittäisen kappaleen käyttäen jalometalleja tai värejä, usein yksityiskohtaisissa kuvioissa tai motiiveissa. @fi
toolkit label: illuminoinnin tekijä (toimija) @fi
toolkit definition: Toimija, joka koristelee yksittäisen kappaleen käyttäen jalometalleja tai värejä, usein yksityiskohtaisissa kuvioissa tai motiiveissa. @fi
toolkit label: illuminator (agent) @no
toolkit definition: En agent som dekorerer et bestemt eksemplar med edle metaller eller farger, gjerne med intrikate former og motiver. @no
has element type: 2
label: illuminátor ágense a következő: @hu
definition: Hozzákapcsol egy példányt egy ágenshez, amely egy adott példányt nemesfémekkel vagy színekkel díszít, gyakran gondosan kidolgozott kivitelezéssel és motívumok használával. @hu
toolkit label: illuminátor ágense: @hu
toolkit definition: Egy ágens, amely egy adott példányt nemesfémekkel vagy színekkel díszít, gyakran gondosan kidolgozott kivitelezéssel és motívumok használával. @hu
alternative label: illuminator @en
alternative label: enlumineur
alternative label: illuminoinnin tekijä @fi
label: illuminoinnin tekijä (toimija) @fi
label: har illuminator (agent) @no
definition: Relaterer et eksemplar til en agent som dekorerer et bestemt eksemplar med edle metaller eller farger, gjerne med intrikate former og motiver. @no
label: heeft verluchter-actor @nl
definition: Relateert een item aan een actor die een specifiek item decoreert met edelmetalen of kleur, vaak met uitgebreide ontwerpen en motieven. @nl
toolkit label: verluchter-actor @nl
toolkit definition: Een actor die een specifiek item decoreert met edelmetalen of kleur, vaak met uitgebreide ontwerpen en motieven. @nl
label: له وكيل مزخرف @ar
definition: يربط مفردة بوكيل يزين مفردة محددة باستخدام معادن ثمينة أو ألوان، غالبًا بتصاميم وزخارف منمقة. @ar
alternative label: مزخرف @ar
toolkit label: وكيل مزخرف @ar
toolkit definition: وكيل يزين مفردة محددة باستخدام معادن ثمينة أو ألوان، غالبًا بتصاميم وزخارف منمقة. @ar
alternative label: il·luminador @ca
label: illumineerija (tegija) @et
definition: Seostab eksemplari tegijaga, kes kaunistab väärismetallide ja värvidega kindlat eksemplari, kasutades sageli keerulisi kujundeid ja motiive. @et
alternative label: illumineerija @et
toolkit label: illumineerija (tegija) @et
toolkit definition: Tegija, kes kaunistab väärismetallide ja värvidega kindlat eksemplari, kasutades sageli keerulisi kujundeid ja motiive. @et
alternative label: illuminátora: @hu
label: ha come miniatore agente @it
definition: Correla un item a un agente che decora uno specifico item utilizzando metalli o colori preziosi, spesso con progetti e motivi elaborati. @it
alternative label: miniatore @it
toolkit label: miniatore agente @it
toolkit definition: Agente che decora uno specifico item utilizzando metalli o colori preziosi, spesso con progetti e motivi elaborati. @it
label: iluminators (aģents) @lv
definition: Sasaista vienību ar aģentu, kas izgrezno konkrēto vienību, izmantojot krāsu un/vai dārgmetālus, bieži ar izsmalcinātiem un filigrāniem zīmējumiem, burtiem un motīviem. @lv
toolkit label: iluminators (aģents) @lv
toolkit definition: Aģents, kas izgrezno konkrēto vienību, izmantojot krāsu un/vai dārgmetālus, bieži ar izsmalcinātiem un filigrāniem zīmējumiem, burtiem un motīviem. @lv
alternative label: Illuminator @de
has subproperty: a pour agent collectif enlumineur
has subproperty: a pour personne enlumineuse

a pour agent collectif enlumineur
status: Published
label: has illuminator collective agent @en
lexical alias: illuminatorCollectiveAgent.en
definition: Relates an item to a collective agent who decorates a specific item using precious metals or colour, often with elaborate designs and motifs. @en
toolkit label: illuminator collective agent @en
toolkit definition: A collective agent who decorates a specific item using precious metals or colour, often with elaborate designs and motifs. @en
type: Property
domain: C10003
has element type: 2
sub property of: a pour agent collectif modificateur
sub property of: a pour agent enlumineur
definition: Met un item en relation avec un agent collectif qui orne un item spécifique en utilisant des métaux précieux ou de la couleur, souvent avec des dessins et des motifs élaborés.
toolkit label: agent collectif enlumineur
toolkit definition: Agent collectif qui orne un item spécifique en utilisant des métaux précieux ou de la couleur, souvent avec des dessins et des motifs élaborés.
label: illuminoinnin tekijä (yhteistoimija) @fi
definition: Liittää kappaleen yhteistoimijaan, joka koristelee yksittäisen kappaleen käyttäen jalometalleja tai värejä, usein yksityiskohtaisissa kuvioissa tai motiiveissa. @fi
toolkit label: illuminoinnin tekijä (yhteistoimija) @fi
toolkit definition: Yhteistoimija, joka koristelee yksittäisen kappaleen käyttäen jalometalleja tai värejä, usein yksityiskohtaisissa kuvioissa tai motiiveissa. @fi
label: har illuminator (kollektiv agent) @no
definition: Relaterer et eksemplar til en kollektiv agent som dekorerer et bestemt eksemplar med edle metaller eller farger, gjerne med intrikate former og motiver. @no
toolkit label: illuminator (kollektiv agent) @no
toolkit definition: En kollektiv agent som dekorerer et bestemt eksemplar med edle metaller eller farger, gjerne med intrikate former og motiver. @no
label: heeft verluchter-collectieve actor @nl
definition: Relateert een item aan een collectieve actor die een specifiek item decoreert met edelmetalen of kleur, vaak met uitgebreide ontwerpen en motieven. @nl
toolkit label: verluchter-collectieve actor @nl
toolkit definition: Een collectieve actor die een specifiek item decoreert met edelmetalen of kleur, vaak met uitgebreide ontwerpen en motieven. @nl
label: له وكيل جماعي مزخرف @ar
definition: يربط مفردة بوكيل جماعي يزين مفردة محددة باستخدام معادن ثمينة أو ألوان، غالبًا بتصاميم وزخارف منمقة. @ar
toolkit label: وكيل جماعي مزخرف @ar
toolkit definition: وكيل جماعي يزين مفردة محددة باستخدام معادن ثمينة أو ألوان، غالبًا بتصاميم وزخارف منمقة. @ar
label: té com a agent col·lectiu il·luminador @ca
definition: Relaciona un ítem amb un agent col·lectiu que decora un ítem concret amb metalls preciosos o amb color, sovint amb dissenys i motius elaborats. @ca
toolkit label: agent col·lectiu il·luminador @ca
toolkit definition: Agent col·lectiu que decora un ítem concret amb metalls preciosos o amb color, sovint amb dissenys i motius elaborats. @ca
label: har kollektiv agent, som er illuminator @da
definition: Relaterer et eksemplar til en kollektiv agent, som udsmykker et særligt eksemplar med ædelmetal eller farve, ofte med detaljerige mønstre og motiver. @da
toolkit label: kollektiv agent, som er illuminator @da
toolkit definition: Kollektiv agent, som udsmykker et særligt eksemplar med ædelmetal eller farve, ofte med detaljerige mønstre og motiver. @da
label: illumineerija (kollektiiv) @et
definition: Seostab eksemplari kollektiiviga, kes kaunistab väärismetallide ja värvidega üksikut eksemplari, sageli keeruliste kujundite ja motiividega. @et
toolkit label: illumineerija (kollektiiv) @et
toolkit definition: Kollektiiv, kes kaunistab väärismetallide ja värvidega üksikut eksemplari, sageli keeruliste kujundite ja motiividega. @et
label: hat Illuminatorin/Illuminator (Gemeinschaftlicher Akteur) @de
definition: Setzt ein Exemplar in Beziehung zu einem gemeinschaftlichen Akteur, der ein bestimmtes Exemplar durch Edelmetalle oder Farben, häufig mit kunstvollen Mustern und Motiven, (aus-)gestaltet. @de
toolkit label: Illuminatorin/Illuminator (Gemeinschaftlicher Akteur) @de
toolkit definition: Ein gemeinschaftlicher Akteur, der ein bestimmtes Exemplar durch Edelmetalle oder Farben, häufig mit kunstvollen Mustern und Motiven, (aus-)gestaltet. @de
label: illuminátor kollektív ágense a következő: @hu
definition: Hozzákapcsol egy példányt egy kollektív ágenshez, amely egy adott példányt nemesfémekkel vagy színekkel díszít, gyakran gondosan kidolgozott kivitelezéssel és motívumok használával. @hu
toolkit label: illuminátor kollektív ágense: @hu
toolkit definition: Egy kollektív ágens, amely egy adott példányt nemesfémekkel vagy színekkel díszít, gyakran gondosan kidolgozott kivitelezéssel és motívumok használával. @hu
label: ha come miniatore agente collettivo @it
definition: Correla un item a un agente collettivo che decora uno specifico item utilizzando metalli o colori preziosi, spesso con progetti e motivi elaborati. @it
toolkit label: miniatore agente collettivo @it
toolkit definition: Agente collettivo che decora uno specifico item utilizzando metalli o colori preziosi, spesso con progetti e motivi elaborati. @it
label: iluminators (grupa) @lv
definition: Sasaista vienību ar grupu, kas izgreznojusi konkrēto vienību, izmantojot krāsu un/vai dārgmetālus, bieži ar izsmalcinātiem un filigrāniem zīmējumiem, burtiem un motīviem. @lv
toolkit label: iluminators (grupa) @lv
toolkit definition: Grupa, kas izgreznojusi konkrēto vienību, izmantojot krāsu un/vai dārgmetālus, bieži ar izsmalcinātiem un filigrāniem zīmējumiem, burtiem un motīviem. @lv
has subproperty: a pour collectivité enlumineuse
has subproperty: a pour famille enlumineuse
has subproperty: P40116
label: 有彩饰者集体行为者 @zh-hans
definition: 将一个单件与对特定单件用贵重的金属或色彩（通常有精心的设计和图案）进行装饰的一个集体行为者关联起来。 @zh-hans
toolkit label: 彩饰者集体行为者 @zh-hans
toolkit definition: 对特定单件用贵重的金属或色彩（通常有精心的设计和图案）进行装饰的一个集体行为者 @zh-hans
label: tezhip sanatçısı kolektif temsilcisi ile ilişkilidir @tr
definition: Bir kopyayı, belirli bir kopyayı değerli metaller veya renkler kullanarak, genellikle ayrıntılı tasarımlar ve motiflerle süsleyen kolektif bir temsilciyle ilişkilendirir. @tr
toolkit label: tezhip sanatçısı kolektif temsilcisi ile ilişkilidir @tr
toolkit definition: Belirli bir kopyayı değerli metaller veya renkler kullanarak, genellikle özenle hazırlanmış tasarımlar ve motiflerle süsleyen kolektif bir temsilci. @tr

a pour collectivité enlumineuse
status: Published
label: has illuminator corporate body @en
lexical alias: illuminatorCorporateBody.en
definition: Relates an item to a corporate body who decorates a specific item using precious metals or colour, often with elaborate designs and motifs. @en
toolkit label: illuminator corporate body @en
toolkit definition: A corporate body who decorates a specific item using precious metals or colour, often with elaborate designs and motifs. @en
type: Property
domain: C10003
has element type: 2
sub property of: a pour collectivité modificatrice
sub property of: a pour agent collectif enlumineur
definition: Met un item en relation avec une collectivité qui orne un item spécifique en utilisant des métaux précieux ou de la couleur, souvent avec des dessins et des motifs élaborés.
toolkit label: collectivité enlumineuse
toolkit definition: Collectivité qui orne un item spécifique en utilisant des métaux précieux ou de la couleur, souvent avec des dessins et des motifs élaborés.
label: illuminoinnin tekijä (yhteisö) @fi
definition: Liittää kappaleen yhteisöön, joka koristelee yksittäisen kappaleen käyttäen jalometalleja tai värejä, usein yksityiskohtaisissa kuvioissa tai motiiveissa. @fi
toolkit label: illuminoinnin tekijä (yhteisö) @fi
toolkit definition: Yhteisö, joka koristelee yksittäisen kappaleen käyttäen jalometalleja tai värejä, usein yksityiskohtaisissa kuvioissa tai motiiveissa. @fi
label: har illuminator (korporasjon) @no
definition: Relaterer et eksemplar til en korporasjon som dekorerer et bestemt eksemplar med edle metaller eller farger, gjerne med intrikate former og motiver. @no
toolkit label: illuminator (korporasjon) @no
toolkit definition: En korporasjon som dekorerer et bestemt eksemplar med edle metaller eller farger, gjerne med intrikate former og motiver. @no
label: heeft verluchter-corporatie @nl
definition: Relateert een item aan een corporatie die een specifiek item decoreert met edelmetalen of kleur, vaak met uitgebreide ontwerpen en motieven. @nl
toolkit label: verluchter-corporatie @nl
toolkit definition: Een corporatie die een specifiek item decoreert met edelmetalen of kleur, vaak met uitgebreide ontwerpen en motieven. @nl
label: له هيئة مزخرفة @ar
definition: يربط مفردة بهيئة تزين مفردة محددة باستخدام معادن ثمينة أو ألوان، غالبًا بتصاميم وزخارف منمقة. @ar
toolkit label: هيئة مزخرفة @ar
toolkit definition: هيئة تزين مفردة محددة باستخدام معادن ثمينة أو ألوان، غالبًا بتصاميم وزخارف منمقة. @ar
label: té com a entitat corporativa il·luminadora @ca
definition: Relaciona un ítem amb una entitat corporativa que decora un ítem concret amb metalls preciosos o amb color, sovint amb dissenys i motius elaborats. @ca
toolkit label: entitat corporativa il·luminadora @ca
toolkit definition: Entitat corporativa que decora un ítem concret amb metalls preciosos o amb color, sovint amb dissenys i motius elaborats. @ca
label: har korporation, som er illuminator @da
definition: Relaterer et eksemplar til en korporation, som udsmykker et særligt eksemplar med ædelmetal eller farve, ofte med detaljerige mønstre og motiver. @da
toolkit label: korporation, som er illuminator @da
toolkit definition: Korporation, som udsmykker et særligt eksemplar med ædelmetal eller farve, ofte med detaljerige mønstre og motiver. @da
label: illumineerija (asutus) @et
definition: Seostab eksemplari asutusega, kes kaunistab väärismetallide ja värvidega üksikut eksemplari, sageli keeruliste kujundite ja motiividega. @et
toolkit label: illumineerija (asutus) @et
toolkit definition: Asutus, kes kaunistab väärismetallide ja värvidega üksikut eksemplari, sageli keeruliste kujundite ja motiividega. @et
label: hat Illuminatorin/Illuminator (Körperschaft) @de
definition: Setzt ein Exemplar in Beziehung zu einer Körperschaft, die ein bestimmtes Exemplar durch Edelmetalle oder Farben, häufig mit kunstvollen Mustern und Motiven, (aus-)gestaltet. @de
toolkit label: Illuminatorin/Illuminator (Körperschaft) @de
toolkit definition: Eine Körperschaft, die ein bestimmtes Exemplar durch Edelmetalle oder Farben, häufig mit kunstvollen Mustern und Motiven, (aus-)gestaltet. @de
label: illuminátor testülete a következő: @hu
definition: Hozzákapcsol egy példányt egy testülethez, amely egy adott példányt nemesfémekkel vagy színekkel díszít, gyakran gondosan kidolgozott kivitelezéssel és motívumok használával. @hu
toolkit label: illuminátor testülete: @hu
toolkit definition: Egy testület, amely egy adott példányt nemesfémekkel vagy színekkel díszít, gyakran gondosan kidolgozott kivitelezéssel és motívumok használával. @hu
label: ha come miniatore ente @it
definition: Correla un item a un ente che decora uno specifico item utilizzando metalli o colori preziosi, spesso con progetti e motivi elaborati. @it
toolkit label: miniatore ente @it
toolkit definition: Ente che decora uno specifico item utilizzando metalli o colori preziosi, spesso con progetti e motivi elaborati. @it
label: iluminators (institūcija) @lv
definition: Sasaista vienību ar institūciju, kas izgreznojusi konkrēto vienību, izmantojot krāsu un/vai dārgmetālus, bieži ar izsmalcinātiem un filigrāniem zīmējumiem, burtiem un motīviem. @lv
toolkit label: iluminators (institūcija) @lv
toolkit definition: Institūcija, kas izgreznojusi konkrēto vienību, izmantojot krāsu un/vai dārgmetālus, bieži ar izsmalcinātiem un filigrāniem zīmējumiem, burtiem un motīviem. @lv
has subproperty: P40132
label: 有彩饰者团体 @zh-hans
definition: 将一个单件与对特定单件用贵重的金属或色彩（通常有精心的设计和图案）进行装饰的一个团体关联起来。 @zh-hans
toolkit label: 彩饰者团体 @zh-hans
toolkit definition: 对特定单件用贵重的金属或色彩（通常有精心的设计和图案）进行装饰的一个团体 @zh-hans
label: tezhip sanatçısı tüzel kişisi ile ilişkilidir @tr
definition: Bir kopyayı, belirli bir kopyanın değerli metaller veya renkler kullanarak, genellikle özenle hazırlanmış tasarımlar ve motiflerle süsleyen tüzel bir kişiyle ilişkilendirir. @tr
toolkit label: tezhip sanatçısı tüzel kişi ile ilişkilidir @tr
toolkit definition: Belirli bir kopyayı, değerli metaller veya renkler kullanarak, genellikle özenle hazırlanmış tasarımlar ve motiflerle süsleyen tüzel bir kişi. @tr

a pour famille enlumineuse
status: Published
label: has illuminator family @en
lexical alias: illuminatorFamily.en
definition: Relates an item to a family who decorates a specific item using precious metals or colour, often with elaborate designs and motifs. @en
toolkit label: illuminator family @en
toolkit definition: A family who decorates a specific item using precious metals or colour, often with elaborate designs and motifs. @en
type: Property
domain: C10003
has element type: 2
sub property of: a pour famille modificatrice
sub property of: a pour agent collectif enlumineur
definition: Met un item en relation avec une famille qui orne un item spécifique en utilisant des métaux précieux ou de la couleur, souvent avec des dessins et des motifs élaborés.
toolkit label: famille enlumineuse
toolkit definition: Famille qui orne un item spécifique en utilisant des métaux précieux ou de la couleur, souvent avec des dessins et des motifs élaborés.
label: illuminoinnin tekijä (suku) @fi
definition: Liittää kappaleen sukuun, joka koristelee yksittäisen kappaleen käyttäen jalometalleja tai värejä, usein yksityiskohtaisissa kuvioissa tai motiiveissa. @fi
toolkit label: illuminoinnin tekijä (suku) @fi
toolkit definition: Suku, joka koristelee yksittäisen kappaleen käyttäen jalometalleja tai värejä, usein yksityiskohtaisissa kuvioissa tai motiiveissa. @fi
label: har illuminator (familie) @no
definition: Relaterer et eksemplar til en familie som dekorerer et bestemt eksemplar med edle metaller eller farger, gjerne med intrikate former og motiver. @no
toolkit label: illuminator (familie) @no
toolkit definition: En familie som dekorerer et bestemt eksemplar med edle metaller eller farger, gjerne med intrikate former og motiver. @no
label: heeft verluchter-familie @nl
definition: Relateert een item aan een familie die een specifiek item decoreert met edelmetalen of kleur, vaak met uitgebreide ontwerpen en motieven. @nl
toolkit label: verluchter-familie @nl
toolkit definition: Een familie die een specifiek item decoreert met edelmetalen of kleur, vaak met uitgebreide ontwerpen en motieven. @nl
label: له عائلة مزخرفة @ar
definition: يربط مفردة بعائلة تزين مفردة محددة باستخدام معادن ثمينة أو ألوان، غالبًا بتصاميم وزخارف منمقة. @ar
toolkit label: عائلة مزخرفة @ar
toolkit definition: عائلة تزين مفردة محددة باستخدام معادن ثمينة أو ألوان، غالبًا بتصاميم وزخارف منمقة. @ar
label: té com a família il·luminadora @ca
definition: Relaciona un ítem amb una família que decora un ítem concret amb metalls preciosos o amb color, sovint amb dissenys i motius elaborats. @ca
toolkit label: família il·luminadora @ca
toolkit definition: Família que decora un ítem concret amb metalls preciosos o amb color, sovint amb dissenys i motius elaborats. @ca
label: har familie, som er illuminator @da
definition: Relaterer et eksemplar til en familie, som udsmykker et særligt eksemplar med ædelmetal eller farve, ofte med detaljerige mønstre og motiver. @da
toolkit label: familie, som er illuminator @da
toolkit definition: Familie, som udsmykker et særligt eksemplar med ædelmetal eller farve, ofte med detaljerige mønstre og motiver. @da
label: illumineerija (perekond) @et
definition: Seostab eksemplari perekonnaga, kes kaunistab väärismetallide ja värvidega üksikut eksemplari, sageli keeruliste kujundite ja motiividega. @et
toolkit label: illumineerija (perekond) @et
toolkit definition: Perekond, kes kaunistab väärismetallide ja värvidega üksikut eksemplari, sageli keeruliste kujundite ja motiividega. @et
label: hat Illuminatorin/Illuminator (Familie) @de
definition: Setzt ein Exemplar in Beziehung zu einer Familie, die ein bestimmtes Exemplar durch Edelmetalle oder Farben, häufig mit kunstvollen Mustern und Motiven, (aus-)gestaltet. @de
toolkit label: Illuminatorin/Illuminator (Familie) @de
toolkit definition: Eine Familie, die ein bestimmtes Exemplar durch Edelmetalle oder Farben, häufig mit kunstvollen Mustern und Motiven, (aus-)gestaltet. @de
label: illuminátor családja a következő: @hu
definition: Hozzákapcsol egy példányt egy családhoz, amely egy adott példányt nemesfémekkel vagy színekkel díszít, gyakran gondosan kidolgozott kivitelezéssel és motívumok használával. @hu
toolkit label: illuminátor család @hu
toolkit definition: Egy család, amely egy adott példányt nemesfémekkel vagy színekkel díszít, gyakran gondosan kidolgozott kivitelezéssel és motívumok használával. @hu
label: ha come miniatore famiglia @it
definition: Correla un item a una famiglia che decora uno specifico item utilizzando metalli o colori preziosi, spesso con progetti e motivi elaborati. @it
toolkit label: miniatore famiglia @it
toolkit definition: Famiglia che decora uno specifico item utilizzando metalli o colori preziosi, spesso con progetti e motivi elaborati. @it
label: iluminators (dzimta/ģimene) @lv
definition: Sasaista vienību ar dzimtu/ģimeni, kas izgreznojusi konkrēto vienību, izmantojot krāsu un/vai dārgmetālus, bieži ar izsmalcinātiem un filigrāniem zīmējumiem, burtiem un motīviem. @lv
toolkit label: iluminators (dzimta/ģimene) @lv
toolkit definition: Dzimta/ģimene, kas izgreznojusi konkrēto vienību, izmantojot krāsu un/vai dārgmetālus, bieži ar izsmalcinātiem un filigrāniem zīmējumiem, burtiem un motīviem. @lv
has subproperty: P40148
label: 有彩饰者家族 @zh-hans
definition: 将一个单件与对特定单件用贵重的金属或色彩（通常有精心的设计和图案）进行装饰的一个家族关联起来。 @zh-hans
toolkit label: 彩饰者家族 @zh-hans
toolkit definition: 对特定单件用贵重的金属或色彩（通常有精心的设计和图案）进行装饰的一个家族 @zh-hans
label: tezhip sanatçısı ailesi ile ilişkilidir @tr
definition: Bir kopyayı, belirli bir kopyayı değerli metaller veya renkler kullanarak, genellikle ayrıntılı tasarımlar ve motiflerle süsleyen bir aileyle ilişkilendirir. @tr
toolkit label: tezhip sanatçısı ailesi ile ilişkilidir @tr
toolkit definition: Belirli bir kopyayı değerli metaller veya renkler kullanarak, genellikle özenle hazırlanmış tasarımlar ve motiflerle süsleyen bir aile. @tr

a pour personne enlumineuse
status: Published
label: has illuminator person @en
lexical alias: illuminatorPerson.en
definition: Relates an item to a person who decorates a specific item using precious metals or colour, often with elaborate designs and motifs. @en
toolkit label: illuminator person @en
toolkit definition: A person who decorates a specific item using precious metals or colour, often with elaborate designs and motifs. @en
type: Property
domain: C10003
has element type: 2
sub property of: a pour personne modificatrice
sub property of: a pour agent enlumineur
definition: Met un item en relation avec une personne qui orne un item spécifique en utilisant des métaux précieux ou de la couleur, souvent avec des dessins et des motifs élaborés.
toolkit label: personne enlumineuse
toolkit definition: Personne qui orne un item spécifique en utilisant des métaux précieux ou de la couleur, souvent avec des dessins et des motifs élaborés.
label: illuminoinnin tekijä (henkilö) @fi
definition: Liittää kappaleen henkilöön, joka koristelee yksittäisen kappaleen käyttäen jalometalleja tai värejä, usein yksityiskohtaisissa kuvioissa tai motiiveissa. @fi
toolkit label: illuminoinnin tekijä (henkilö) @fi
toolkit definition: Henkilö, joka koristelee yksittäisen kappaleen käyttäen jalometalleja tai värejä, usein yksityiskohtaisissa kuvioissa tai motiiveissa. @fi
label: har illuminator (person) @no
definition: Relaterer et eksemplar til en person som dekorerer et bestemt eksemplar med edle metaller eller farger, gjerne med intrikate former og motiver. @no
toolkit label: illuminator (person) @no
toolkit definition: En person som dekorerer et bestemt eksemplar med edle metaller eller farger, gjerne med intrikate former og motiver. @no
label: heeft verluchter-persoon @nl
definition: Relateert een item aan een persoon die een specifiek item decoreert met edelmetalen of kleur, vaak met uitgebreide ontwerpen en motieven. @nl
toolkit label: verluchter-persoon @nl
toolkit definition: Een persoon die een specifiek item decoreert met edelmetalen of kleur, vaak met uitgebreide ontwerpen en motieven. @nl
label: له شخص مزخرف @ar
definition: يربط مفردة بشخص يزين مفردة محددة باستخدام معادن ثمينة أو ألوان، غالبًا بتصاميم وزخارف منمقة. @ar
toolkit label: شخص مزخرف @ar
toolkit definition: شخص يزين مفردة محددة باستخدام معادن ثمينة أو ألوان، غالبًا بتصاميم وزخارف منمقة. @ar
label: té com a persona il·luminadora @ca
definition: Relaciona un ítem amb una persona que decora un ítem concret amb metalls preciosos o amb color, sovint amb dissenys i motius elaborats. @ca
toolkit label: persona il·luminadora @ca
toolkit definition: Persona que decora un ítem concret amb metalls preciosos o amb color, sovint amb dissenys i motius elaborats. @ca
label: har person, som er illuminator @da
definition: Relaterer et eksemplar til en person, som udsmykker et særligt eksemplar med ædelmetal eller farve, ofte med detaljerige mønstre og motiver. @da
toolkit label: person, som er illuminator @da
toolkit definition: Person, som udsmykker et særligt eksemplar med ædelmetal eller farve, ofte med detaljerige mønstre og motiver. @da
label: illumineerija (isik) @et
definition: Seostab eksemplari isikuga, kes kaunistab väärismetallide ja värvidega üksikut eksemplari, sageli keeruliste kujundite ja motiividega. @et
toolkit label: illumineerija (isik) @et
toolkit definition: Isik, kes kaunistab väärismetallide ja värvidega üksikut eksemplari, sageli keeruliste kujundite ja motiividega. @et
label: hat Illuminatorin/Illuminator (Person) @de
definition: Setzt ein Exemplar in Beziehung zu einer Person, die ein bestimmtes Exemplar durch Edelmetalle oder Farben, häufig mit kunstvollen Mustern und Motiven, (aus-)gestaltet. @de
toolkit label: Illuminatorin/Illuminator (Person) @de
toolkit definition: Eine Person, die ein bestimmtes Exemplar durch Edelmetalle oder Farben, häufig mit kunstvollen Mustern und Motiven, (aus-)gestaltet. @de
label: illuminator személye a következő: @hu
definition: Hozzákapcsol egy példányt egy személyhez, aki egy adott példányt nemesfémekkel vagy színekkel díszít, gyakran gondosan kidolgozott kivitelezéssel és motívumok használával. @hu
toolkit label: illuminátor személye: @hu
toolkit definition: Egy személy, aki egy adott példányt nemesfémekkel vagy színekkel díszít, gyakran gondosan kidolgozott kivitelezéssel és motívumok használával @hu
label: ha come miniatore persona @it
definition: Correla un item a una persona che decora uno specifico item utilizzando metalli o colori preziosi, spesso con progetti e motivi elaborati. @it
toolkit label: miniatore persona @it
toolkit definition: Persona che decora uno specifico item utilizzando metalli o colori preziosi, spesso con progetti e motivi elaborati. @it
label: iluminators (persona) @lv
definition: Sasaista vienību ar personu, kura izgreznojusi konkrēto vienību, izmantojot krāsu un/vai dārgmetālus, bieži ar izsmalcinātiem un filigrāniem zīmējumiem, burtiem un motīviem. @lv
toolkit label: iluminators (persona) @lv
toolkit definition: Persona, kura izgreznojusi konkrēto vienību, izmantojot krāsu un/vai dārgmetālus, bieži ar izsmalcinātiem un filigrāniem zīmējumiem, burtiem un motīviem. @lv
has subproperty: P40100
label: 有彩饰者个人 @zh-hans
definition: 将一个单件与对特定单件用贵重的金属或色彩（通常有精心的设计和图案）进行装饰的一个个人关联起来。 @zh-hans
toolkit label: 彩饰者个人 @zh-hans
toolkit definition: 对特定单件用贵重的金属或色彩（通常有精心的设计和图案）进行装饰的一个个人 @zh-hans
label: tezhip sanatçısı kişisi ile ilişkilidir @tr
definition: Bir kopyayı, belirli bir kopyayı değerli metaller veya renkler kullanarak, genellikle ayrıntılı tasarımlar ve motiflerle süsleyen bir kişiyle ilişkilendirir. @tr
toolkit label: tezhip sanatçısı kişisi ile ilişkilidir @tr
toolkit definition: Belirli bir öğeyi değerli metaller veya renkler kullanarak, genellikle özenle hazırlanmış desenler ve motiflerle süsleyen kişi. @tr

a pour source immédiate d’acquisition d’un item
status: Published
label: has immediate source of acquisition of item @en
definition: Relates an item to the circumstances under which an item is directly acquired, including a method, source, and date of acquisition. @en
type: Property
domain: C10003
lexical alias: immediateSourceOfAcquisitionOfItem.en
instruction number: 2.19
toolkit label: immediate source of acquisition of item @en
toolkit definition: The circumstances under which an item is directly acquired, including a method, source, and date of acquisition. @en
definition: Met un item en relation avec des circonstances dans lesquelles un item a été directement acquis, notamment une méthode, une source et une date d’acquisition.
toolkit label: source immédiate d’acquisition d’un item
toolkit definition: Circonstances dans lesquelles un item a été directement acquis, notamment une méthode, une source et une date d’acquisition.
toolkit label: fuente inmediata de acquisición del ítem @es
toolkit definition: La fuente de la cual la agencia adquirió directamente un ítem y las circunstancias bajo las cuales se recibió. @es
label: har senaste förvärvskälla @sv
toolkit label: senaste förvärvskälla @sv
label: có nguồn bổ sung trực tiếp của bản @vi
definition: Liên kết bản với nguồn mà từ đó cơ quan bổ sung trực tiếp bản và điều kiện quy định để nhận được nó. @vi
toolkit label: nguồn bổ sung trực tiếp của bản @vi
toolkit definition: Nguồn mà từ đó cơ quan bổ sung trực tiếp bản và điều kiện quy định để nhận được nó. @vi
label: har direkte anskaffelseskilde for eksemplar @da
definition: Relaterer et eksemplar til de omstændigheder, hvorunder et eksemplar anskaffes, samt metode, kilde og dato for anskaffelse. @da
toolkit label: direkte anskaffelseskilde for eksemplar @da
toolkit definition: Omstændigheder, hvorunder et eksemplar anskaffes, samt metode, kilde og dato for anskaffelse. @da
label: hat Bezugsquelle eines Exemplars @de
definition: Setzt ein Exemplar in Beziehung zu den Umständen, unter denen ein Exemplar direkt erworben wird. Darunter fallen Erwerbungsmethoden, Erwerbungsquellen und Erwerbungsdaten. @de
toolkit label: Bezugsquelle eines Exemplars @de
toolkit definition: Die Umstände, unter denen ein Exemplar direkt erworben wird. Darunter fallen Erwerbungsmethoden, Erwerbungsquellen und Erwerbungsdaten. @de
label: έχει άμεση πηγή της πρόσκτησης του αντιτύπου @el
definition: Συνδέει ένα αντίτυπο με μια πηγή από την οποία ένας φορέας απέκτησε άμεσα ένα αντίτυπο και τις συνθήκες υπό τις οποίες το παρέλαβε. @el
toolkit label: άμεση πηγή της πρόσκτησης του αντιτύπου @el
toolkit definition: Μια πηγή από την οποία ένας φορέας απέκτησε άμεσα ένα αντίτυπο και οι συνθήκες υπό τις οποίες το παρέλαβε. @el
label: té com a font immediata d’adquisició d’un ítem @ca
definition: Relaciona un ítem amb les circumstàncies sota les quals un ítem és adquirit directament, inclòs un mètode, una font i una data d’adquisició. @ca
toolkit label: font immediata d’adquisició d’un ítem @ca
toolkit definition: Circumstàncies sota les quals un ítem és adquirit directament, inclòs un mètode, una font i una data d’adquisició. @ca
definition: Liittää kappaleen kappaleen hankintaolosuhteisiin, kuten hankintatapaan, -lähteeseen ja -ajankohtaan. @fi
toolkit label: kappaleen hankintalähde @fi
toolkit definition: Kappaleen hankintaolosuhteet, kuten hankintatapa, -lähde ja -ajankohta. @fi
toolkit label: direkte kilde for anskaffelse av eksemplar @no
toolkit definition: Omstendighetene som et eksemplar direkte blir anskaffet under, inkludert metode, kilde og dato for akvisisjon. @no
has element type: 6
label: példány közvetlen beszerzési forrása a következő: @hu
definition: Hozzákapcsol egy példányt azokhoz a körülményekhez, amelyek keretében egy példányt közvetlenül beszereznek, beleértve a beszerzés módszerét, forrását és időpontját. @hu
toolkit label: példány közvetlen beszerzési forrása: @hu
toolkit definition: Azok a körülmények, amelyek keretében egy példányt közvetlenül beszereznek, beleértve a beszerzés módszerét, forrását és időpontját. @hu
label: kappaleen hankintalähde @fi
label: har direkte kilde for anskaffelse av eksemplar @no
definition: Relaterer et eksemplar til omstendighetene som et eksemplar direkte blir anskaffet under, inkludert metode, kilde og dato for akvisisjon. @no
label: heeft directe bron van verwerving van item @nl
definition: Relateert een item aan de omstandigheden waaronder een item direct verworven is, waaronder een methode, bron en datum van verwerving. @nl
toolkit label: directe bron van verwerving van item @nl
toolkit definition: De omstandigheden waaronder een item direct verworven is, waaronder een methode, bron en datum van verwerving. @nl
label: له مصدر مباشر لاقتناء مفردة @ar
definition: يربط مفردة بظروف اقتناء مفردة بصورة مباشرة، ويشمل ذلك طريقة الاقتناء، مصدره، تاريخه. @ar
toolkit label: مصدر مباشر لاقتناء مفردة @ar
toolkit definition: ظروف اقتناء مفردة بصورة مباشرة، ويشمل ذلك طريقة الاقتناء، مصدره، تاريخه. @ar
label: eksemplari hankeallikas @et
definition: Seostab eksemplari eksemplari hankimise asjaoludega, nagu hankimise viis, allikas ja daatum. @et
toolkit label: eksemplari hankeallikas @et
toolkit definition: Eksemplari hankimise asjaolud, nagu hankimise viis, allikas ja daatum. @et
label: ha come fonte immediata di acquisizione di item @it
definition: Correla un item alle circostanze nelle quali l'item è stato direttamente acquisito, inclusi metodo, fonte e data di acquisizione. @it
toolkit label: fonte immediata di acquisizione di item @it
toolkit definition: Circostanze nelle quali l'item è stato direttamente acquisito, inclusi metodo, fonte e data di acquisizione. @it
label: tiešais vienības komplektēšanas avots @lv
definition: Sasaista vienību ar avotu, no kura aģentūra tieši iegūst resursu, un nosacījumiem tā saņemšanai. @lv
toolkit label: tiešais vienības komplektēšanas avots @lv
toolkit definition: Avots, no kura aģentūra tieši iegūst resursu un nosacījumi tā saņemšanai. @lv
has subproperty: P40050
label: 有单件的直接获取来源 @zh-hans
definition: 将一个单件与单件直接被获取的环境（包括获取的方法、来源和日期）关联起来。 @zh-hans
toolkit label: 单件的直接获取来源 @zh-hans
toolkit definition: 单件直接被获取的环境（包括获取的方法、来源和日期） @zh-hans
label: kopyanın doğrudan sağlandığı kaynak ile ilişkilidir @tr
definition: Bir kopyayı, yöntem, kaynak ve edinim tarihi de dahil olmak üzere, bir kopyanın doğrudan edinildiği koşullarla ilişkilendirir. @tr
toolkit label: kopyanın doğrudan edinildiği kaynak ile ilişkilidir @tr
toolkit definition: Yöntem, kaynak ve edinme tarihi de dahil olmak üzere, bir öğenin doğrudan edinildiği koşullar. @tr

a pour dédicateur d’un item
status: Published
label: has inscriber @en
definition: Relates an item to a person who writes a statement of dedication or gift on an item. @en
type: Property
domain: C10003
sub property of: a pour personne modificatrice
lexical alias: inscriber.en
toolkit label: inscriber @en
toolkit definition: A person who writes a statement of dedication or gift on an item. @en
definition: Met un item en relation avec une personne qui écrit une dédicace ou une mention de don sur un item.
toolkit label: dédicateur d’un item
toolkit definition: Personne qui écrit une dédicace ou une mention de don sur un item.
toolkit label: autor de dedicatoria @es
toolkit definition: Una persona que ha escrito una mención de dedicatoria o donación en un ítem. @es
instruction number: 18.5
label: có người khắc @vi
definition: Liên kết bản với cá nhân người viết thông tin đề tặng hoặc quà biếu trên bản. @vi
toolkit label: người ghi @vi
toolkit definition: Cá nhân người viết thông tin đề tặng hoặc quà biếu trên bản. @vi
label: har indskriver @da
definition: Relaterer et eksemplar til en person, som skriver en dedikation eller gavetilegnelse på et eksemplar. @da
toolkit label: indskriver @da
toolkit definition: Person, som skriver en dedikation eller gavetilegnelse på et eksemplar. @da
label: hat beschriftende Person @de
definition: Setzt ein Exemplar in Beziehung zu einer Person, die eine Widmung oder einen Schenkungsvermerk in ein Exemplar schreibt. @de
toolkit label: Beschriftende Person @de
toolkit definition: Eine Person, die eine Widmung oder einen Schenkungsvermerk in ein Exemplar schreibt. @de
label: έχει χαράκτη @el
definition: Συνδέει ένα αντίτυπο με ένα φυσικό πρόσωπο το οποίο έχει γράψει μια αφιέρωση ή δήλωση δωρεάς σε ένα αντίτυπο. @el
toolkit label: χαράκτης @el
toolkit definition: Ένα φυσικό πρόσωπο το οποίο έχει γράψει μια αφιέρωση ή δήλωση δωρεάς σε ένα αντίτυπο. @el
label: té com a inscriptor @ca
definition: Relaciona un ítem amb una persona que ha escrit una menció de dedicatòria o de regal en un ítem. @ca
toolkit label: inscriptor @ca
toolkit definition: Persona que ha escrit una menció de dedicatòria o de regal en un ítem. @ca
definition: Liittää kappaleen henkilöön, joka kirjoittaa kappaleeseen omistuskirjoituksen tai merkinnön lahjoituksesta. @fi
toolkit label: omistuskirjoituksen kirjoittaja @fi
toolkit definition: Henkilö, joka kirjoittaa kappaleeseen omistuskirjoituksen tai merkinnön lahjoituksesta. @fi
toolkit label: person som tilegner @no
toolkit definition: En person som skriver en angivelse av dedikasjon eller gave på et eksemplar. @no
has element type: 2
label: beírója a következő: @hu
definition: Hozzákapcsol egy példányt egy személyhez, aki elkötelezettségi vagy ajándékozási nyilatkozatot ír egy példányra. @hu
toolkit label: beírója: @hu
toolkit definition: Egy személy, aki elkötelezettségi vagy ajándékozási nyilatkozatot ír egy példányra. @hu
label: omistuskirjoituksen kirjoittaja @fi
label: har person som tilegner @no
definition: Relaterer et eksemplar til en person som skriver en angivelse av dedikasjon eller gave på et eksemplar. @no
label: heeft opdrachtschrijver @nl
definition: Relateert een item aan een persoon die een vermelding van opdracht of geschenk schrijft op een item. @nl
toolkit label: opdrachtschrijver @nl
toolkit definition: Een persoon die een vermelding van opdracht of geschenk schrijft op een item. @nl
label: له حفار @ar
definition: يربط مفردة بشخص يكتب جملة اهداء على مفردة. @ar
toolkit label: حفَّار @ar
toolkit definition: شخص يكتب جملة اهداء أو هبة على مفردة. @ar
label: pühenduse kirjutaja @et
definition: Seostab eksemplari isikuga, kes kirjutab eksemplarisse või eksemplarile pühenduse või märke kinkimise kohta. @et
toolkit label: pühenduse kirjutaja @et
toolkit definition: Isik, kes kirjutab eksemplarisse või eksemplarile pühenduse või märke kinkimise kohta. @et
label: ha come dedicante @it
definition: Correla un item a una persona che scrive una dichiarazione di dedica o di dono su un item. @it
toolkit label: dedicante @it
toolkit definition: Persona che scrive una dichiarazione di dedica o di dono su un item. @it
label: veltījuma ieraksta autors @lv
definition: Sasaista vienību ar personu, kura konkrētā vienībā ir ierakstījusi veltījumu. @lv
toolkit label: veltījuma ieraksta autors @lv
toolkit definition: Persona, kura konkrētā vienībā ir ierakstījusi veltījumu. @lv
alternative label: auteur d’un envoi
has subproperty: P40014
label: 有题写者 @zh-hans
definition: 将一个单件与在单件上书写题词或赠与文字的个人关联起来。 @zh-hans
toolkit label: 题写者 @zh-hans
toolkit definition: 在单件上书写题词或赠与文字的个人 @zh-hans
label: armağan notu yazarı ile ilişkilidir @tr
definition: Bir kopyayı, bir kopyaya hediye veya ithaf beyanı yazan bir kişi ile ilişkilendirir. @tr
toolkit label: armağan notu yazarı ile ilişkilidir @tr
toolkit definition: Bir kopya üzerine, hediye veya ithaf beyanı yazan kişi. @tr

est un item analysé dans
status: Published
type: Property
label: is item analysed in @en
lexical alias: itemAnalysedIn.en
definition: Relates an item to a work that describes the structure and composition of an item. @en
domain: C10003
toolkit label: item analysed in @en
toolkit definition: A work that describes the structure and composition of an item. @en
definition: Met un item en relation avec une œuvre qui décrit la structure et la composition d’un item.
toolkit label: item analysé dans
toolkit definition: Œuvre qui décrit la structure et la composition d’un item.
toolkit label: analizada en (ítem) @es
toolkit definition: Una obra que examina el ítem fuente para identificar sus componentes y sus relaciones. @es
sub property of: est un item décrit par
instruction number: 23.5
label: được phân tích trong (bản) @vi
definition: Liên kết bản với tác phẩm kiểm tra bản nguồn để nhận dạng các thành phần của nó và quan hệ của chúng. @vi
toolkit label: được phân tích trong (bản) @vi
toolkit definition: Tác phẩm kiểm tra bản nguồn để nhận dạng các thành phần của nó và quan hệ của chúng. @vi
label: er eksemplar analyseret i @da
definition: Relaterer et eksemplar til et værk, som beskriver et eksemplars struktur og sammensætning. @da
toolkit label: eksemplar analyseret i @da
toolkit definition: Værk, som beskriver et eksemplars struktur og sammensætning. @da
label: ist Exemplar analysiert in @de
definition: Setzt ein Exemplar in Beziehung zu einem Werk, das den Aufbau und die Zusammensetzung eines Exemplars beschreibt. @de
toolkit label: Exemplar analysiert in @de
toolkit definition: Ein Werk, das den Aufbau und die Zusammensetzung eines Exemplars beschreibt. @de
label: αναλύεται στο (αντίτυπο) @el
definition: Συνδέει ένα αντίτυπο με ένα έργο που εξετάζει ένα αντίτυπο-πηγή για την ταύτιση των συστατικών του και των σχέσεων τους. @el
toolkit label: αναλύεται στο (αντίτυπο) @el
toolkit definition: Ένα έργο που εξετάζει ένα αντίτυπο-πηγή για την ταύτιση των συστατικών του και των σχέσεων τους. @el
label: és ítem analitzat en @ca
definition: Relaciona un ítem amb una obra que descriu l’estructura i la composició d’un ítem. @ca
toolkit label: ítem analitzat en @ca
toolkit definition: Obra que descriu l’estructura i la composició d’un ítem. @ca
definition: Liittää kappaleen teokseen, joka kuvailee kappaleen rakennetta ja kokoonpanoa. @fi
toolkit label: kappaleen analyysi @fi
toolkit definition: Teos, joka kuvailee kappaleen rakennetta ja kokoonpanoa. @fi
toolkit label: analysert i eksemplar @no
toolkit definition: Et verk som beskriver strukturen og komposisjonen av et eksemplar. @no
has element type: 2
alternative label: analysed in (item) @en
label: példány elemezve a következőben: @hu
definition: Hozzákapcsol egy példányt egy műhöz, amely egy példányt vizsgál, hogy leírhassa annak alkotóelemeit és azok viszonyait. @hu
toolkit label: példány elemezve a következőben: @hu
toolkit definition: Egy mű, amely egy példányt vizsgál, hogy leírhassa annak alkotóelemeit és azok viszonyait. @hu
alternative label: analysé dans (item)
label: kappaleen analyysi @fi
label: er analysert i eksemplar @no
definition: Relaterer et eksemplar til et verk som beskriver strukturen og komposisjonen av et eksemplar. @no
alternative label: analysert i (eksemplar) @no
label: is item geanalyseerd in @nl
definition: Relateert een item aan een werk dat de structuur en compositie van een item beschrijft. @nl
toolkit label: item geanalyseerd in @nl
toolkit definition: Een werk dat de structuur en compositie van een item beschrijft. @nl
label: هي مفردة تم تحليلها في @ar
definition: يربط مفردة بعمل يصف هيكل مفردة وتركيبها. @ar
alternative label: تم تحليلها في (مفردة) @ar
toolkit label: مفردة تم تحليلها في @ar
toolkit definition: عمل يصف هيكل مفردة وتركيبها @ar
alternative label: analitzat en (ítem) @ca
alternative label: analyseret i (eksemplar) @da
label: eksemplari analüüs @et
definition: Seostab eksemplari teosega, milles kirjeldatakse eksemplari struktuuri ja kompositsiooni @et
toolkit label: eksemplari analüüs @et
toolkit definition: Teos, milles kirjeldatakse eksemplari struktuuri ja kompositsiooni @et
alternative label: Analysiert in (Exemplar) @de
alternative label: elemezve a következőben (példány): @hu
label: è item analizzato in @it
definition: Correla un item a un'opera che descrive la struttura e la composizione di un item. @it
alternative label: analizzato in (item) @it
toolkit label: analizzato in @it
toolkit definition: Opera che descrive la struttura e la composizione di un item. @it
label: ir vienības analīze @lv
definition: Sasaista vienību ar darbu, kas analizē pamatvienības sastāvdaļas un to attiecības. @lv
toolkit label: vienības analīze @lv
toolkit definition: Darbs, kas analizē pamatvienības sastāvdaļas un to attiecības. @lv
has subproperty: P40063
alternative label: 被分析于（单件） @zh-hans

est un item commenté dans
status: Published
type: Property
label: is item commentary in @en
lexical alias: itemCommentaryIn.en
definition: Relates an item to a work that is a set of explanatory or critical notes on an item. @en
domain: C10003
toolkit label: item commentary in @en
toolkit definition: A work that is a set of explanatory or critical notes on an item. @en
definition: Met un item en relation avec une œuvre qui consiste en un ensemble de notes explicatives ou critiques sur un item.
toolkit label: item commenté dans
toolkit definition: Œuvre qui consiste en un ensemble de notes explicatives ou critiques sur un item.
toolkit label: comentario en (ítem) @es
toolkit definition: Una obra que contiene un conjunto de notas explicativas o críticas sobre el ítem descrito. @es
sub property of: est un item décrit par
instruction number: 23.5
label: là bình luận trong (bản) @vi
definition: Liên kết bản với tác phẩm có chứa chuỗi các ghi chú giải thích hoặc phê bình về bản được mô tả. @vi
toolkit label: bình luận trong (bản) @vi
toolkit definition: Tác phẩm có chứa chuỗi các ghi chú giải thích hoặc phê bình về bản được mô tả. @vi
label: er eksemplar kommentar i @da
definition: Relaterer et eksemplar til et værk, som indeholder forklarende eller kritiske noter om et eksemplar. @da
toolkit label: eksemplar kommentar i @da
toolkit definition: Værk, som indeholder forklarende eller kritiske noter om et eksemplar. @da
label: ist Exemplar kommentiert in @de
definition: Setzt ein Exemplar in Beziehung zu einem Werk, bei dem es sich um eine Reihe von erläuternden oder kritischen Anmerkungen zu einem Exemplar handelt. @de
toolkit label: Exemplar kommentiert in @de
toolkit definition: Ein Werk, bei dem es sich um eine Reihe von erläuternden oder kritischen Anmerkungen zu einem Exemplar handelt. @de
label: είναι σχόλια στο (αντίτυπο) @el
definition: Συνδέει ένα αντίτυπο με ένα έργο που περιέχει ένα σύνολο επεξηγηματικών ή κριτικών σημειώσεων σε ένα περιγραφόμενο αντίτυπο. @el
toolkit label: σχόλια στο (αντίτυπο) @el
toolkit definition: Ένα έργο που περιέχει ένα σύνολο επεξηγηματικών ή κριτκών σημειώσεων σε ένα περιγραφόμενο αντίτυπο. @el
label: és comentari d’ítem en @ca
definition: Relaciona un ítem amb una obra que és un conjunt de notes explicatives o crítiques sobre un ítem. @ca
toolkit label: comentari d’ítem en @ca
toolkit definition: Obra que és un conjunt de notes explicatives o crítiques sobre un ítem. @ca
definition: Liittää kappaleen teokseen, joka on selittävä tai kriittinen huomautus kappaleesta. @fi
toolkit label: kappaleen kommentaari @fi
toolkit definition: Teos, joka on selittävä tai kriittinen huomautus kappaleesta. @fi
toolkit label: kommentert i eksemplar @no
toolkit definition: Et verk som inneholder et sett med forklarende eller kritiske noter til et eksemplar. @no
has element type: 2
alternative label: commentary in (item) @en
label: példány kommentálva a következőben: @hu
definition: Hozzákapcsol egy példányt egy műhöz, amely egy példány magyarázó vagy kritikai jegyzeteinek a halmaza. @hu
toolkit label: példány kommentálva a következőben: @hu
toolkit definition: Egy mű, amely egy példány magyarázó vagy kritikai jegyzeteinek a halmaza. @hu
alternative label: commentaire dans (item)
label: kappaleen kommentaari @fi
label: er kommentert i eksemplar @no
definition: Relaterer et eksemplar til et verk som inneholder et sett med forklarende eller kritiske noter til et eksemplar. @no
alternative label: kommentert i (eksemplar) @no
label: is item becommentarieerd in @nl
definition: Relateert een item aan een werk dat is een verzameling van verklarende of kritische noten over een item. @nl
toolkit label: item becommentarieerd in @nl
toolkit definition: Een werk dat is een verzameling van verklarende of kritische noten over een item. @nl
label: هو تعليق على مفردة في @ar
definition: يربط مفردة بعمل يتضمن مجموعة تبصرات توضيحية أو نقدية عن مفردة. @ar
alternative label: تعليق في (مفردة) @ar
toolkit label: تعليق على مفردة في @ar
toolkit definition: عمل هو مجموعة تبصرات توضيحية أو نقدية عن مفردة. @ar
alternative label: comentari en (ítem) @ca
alternative label: kommentar i (eksemplar) @da
label: eksemplari kommentaar @et
definition: Seostab eksemplari teosega, mis sisaldab kogumi selgitavaid või kriitilisi märkusi eksemplari kohta. @et
toolkit label: eksemplari kommentaar @et
toolkit definition: Teos, mis sisaldab kogumi selgitavaid või kriitilisi märkusi eksemplari kohta. @et
alternative label: Kommentar in (Exemplar) @de
alternative label: kommentálva a következőben (példány): @hu
label: è item commentato in @it
definition: Correla un item a un'opera che contiene un insieme di note esplicative o critiche su un item. @it
alternative label: commento a (item) @it
toolkit label: item commentato in @it
toolkit definition: Opera che contiene un insieme di note esplicative o critiche su un item. @it
label: ir vienības komentārs @lv
definition: Sasaista vienību ar darbu, kas satur skaidrojošu vai kritisku piezīmju kopumu par aprakstīto objektu. @lv
toolkit label: vienības komentārs @lv
toolkit definition: Darbs, kas satur skaidrojošu vai kritisku piezīmju kopumu par aprakstīto objektu. @lv
has subproperty: P40064
alternative label: 在……中的评注（单件） @zh-hans

est un item critiqué dans
type: Property
label: is item critiqued in (Deprecated) @en
lexical alias: itemCritiquedIn.en
definition: Relates an item to a work that is a critical evaluation of an item. (Deprecated) @en
domain: C10003
toolkit label: item critiqued in (Deprecated) @en
toolkit definition: A work that is a critical evaluation of an item. (Deprecated) @en
definition: Met un item en relation avec une œuvre qui consiste en une évaluation critique d’un item.
toolkit label: item critiqué dans
toolkit definition: Œuvre qui consiste en une évaluation critique d’un item.
toolkit label: criticada en (ítem) @es
toolkit definition: Una obra que contiene una evaluación crítica del ítem descrito. @es
sub property of: est un item décrit par
instruction number: 23.5
label: được phê bình trong (bản) @vi
definition: Liên kết bản với tác phẩm có chứa đánh giá phê bình về bản được mô tả. @vi
toolkit label: được phê bình trong (bản) @vi
toolkit definition: Tác phẩm có chứa đánh giá phê bình về bản được mô tả. @vi
label: er eksemplar kritiseret i @da
definition: Relaterer et eksemplar til et værk, som indeholder kritisk evaluering af et eksemplar. @da
toolkit label: eksemplar kritiseret i @da
toolkit definition: Værk, som indeholder kritisk evaluering af et eksemplar. @da
label: ist Kritik eines Exemplars in @de
definition: Setzt ein Exemplar in Beziehung zu einem Werk, bei dem es sich um eine kritische Untersuchung eines Exemplars handelt. @de
toolkit label: Kritik eines Exemplars in @de
toolkit definition: Ein Werk, bei dem es sich um eine kritische Untersuchung eines Exemplars handelt. @de
label: κρίνεται στο (αντίτυπο) @el
definition: Συνδέει ένα αντίτυπο με ένα έργο που περιέχει μια κριτική αξιολόγηση ενός περιγραφόμενου αντιτύπου. @el
toolkit label: κρίνεται στο (αντίτυπο) @el
toolkit definition: Ένα έργο που περιέχει μια κριτική αξιολόγηση ενός περιγραφόμενου αντιτύπου. @el
label: és ítem criticat en @ca
definition: Relaciona un ítem amb una obra que és una avaluació crítica d’un ítem. @ca
toolkit label: ítem criticat en @ca
toolkit definition: Obra que és una avaluació crítica d’un ítem. @ca
definition: Liittää kappaleen teokseen, joka on kriittinen arviointi kappaleesta. @fi
toolkit label: kappaleen kritiikki @fi
toolkit definition: Teos, joka sisältää kriittinen arviointi kappaleesta. @fi
toolkit label: kritisert i eksemplar @no
toolkit definition: Et verk som inneholder en kritisk evaluering av et eksemplar. @no
has element type: 2
alternative label: critiqued in (item) @en
label: példány bírálva a következőben: @hu
definition: Hozzákapcsol egy példányt egy műhöz, amely egy példány kritikai értékelése. @hu
toolkit label: példány bírálva a következőben: @hu
toolkit definition: Egy mű, amely egy példány kritikai értékelése. @hu
alternative label: critiqué dans (item)
label: kappaleen kritiikki @fi
label: er kritisert i eksemplar @no
definition: Relaterer et eksemplar til et verk som inneholder en kritisk evaluering av et eksemplar. @no
alternative label: kritisert i (eksemplar) @no
label: is item bekritiseerd in @nl
definition: Relateert een item aan een werk dat is een kritische beschouwing van een item. @nl
toolkit label: item bekritiseerd in @nl
toolkit definition: Een werk dat is een kritische beschouwing van een item. @nl
label: هي مفردة منتقدة في @ar
definition: يربط مفردة بعمل يتضمن تقييما نقديا لمفردة. @ar
alternative label: منتقدة في (مفردة) @ar
toolkit label: مفردة منتَقدة في @ar
toolkit definition: عمل يتضمن تقييما نقديا لمفردة. @ar
alternative label: criticat en (ítem) @ca
alternative label: kritiseret i (eksemplar) @da
label: eksemplari arvustus @et
definition: Seostab eksemplari teosega, mis sisaldab kriitilist hinnangut eksemplarile. @et
toolkit label: eksemplari arvustus @et
toolkit definition: Teos, mis sisaldab kriitilist hinnangut eksemplarile. @et
alternative label: Kritik in (Exemplar) @de
alternative label: bírálva a következőben (példány): @hu
label: è item sottoposto a critica in @it
definition: Correla un item a un'opera che contiene una valutazione critica di un item. @it
alternative label: sottoposto a critica (item) @it
toolkit label: item sottoposto a critica in @it
toolkit definition: Opera che contiene una valutazione critica di un item. @it
status: Deprecated
label: ir vienības kritika @lv
definition: Sasaista vienību ar darbu, kas satur aprakstītās vienības kritisku novērtējumu. @lv
toolkit label: vienības kritika @lv
toolkit definition: Darbs, kas satur aprakstītās vienības kritisku novērtējumu @lv
has subproperty: P40065

est un item décrit par
status: Published
type: Property
label: is item described by @en
definition: Relates an item to a work that is a description of an item. @en
domain: C10003
toolkit label: item described by @en
toolkit definition: A work that is a description of an item. @en
definition: Met un item en relation avec une œuvre qui consiste en une description d’un item.
toolkit label: item décrit par
toolkit definition: Œuvre qui consiste en une description d’un item.
toolkit label: descrita en (ítem) @es
toolkit definition: Una obra que describe un ítem descrito. @es
sub property of: est un item sujet de
instruction number: 23.5
label: được mô tả trong (bản) @vi
definition: Liên kết bản với tác phẩm mô tả bản được mô tả. @vi
toolkit label: được mô tả trong (bản) @vi
toolkit definition: Tác phẩm mô tả bản được mô tả. @vi
label: er eksemplar beskrevet i @da
definition: Relaterer et eksemplar til et værk, som beskriver et eksemplar. @da
toolkit label: eksemplar beskrevet i @da
toolkit definition: Værk, som beskriver et eksemplar. @da
label: ist Exemplar beschrieben in @de
definition: Setzt ein Exemplar in Beziehung zu einem Werk, das ein Exemplar beschreibt. @de
toolkit label: Exemplar beschrieben in @de
toolkit definition: Ein Werk, das ein Exemplar beschreibt. @de
label: περιγράφεται στο (αντίτυπο) @el
definition: Συνδέει ένα αντίτυπο με ένα έργο που περιγράφει ένα περιγραφόμενο αντίτυπο. @el
toolkit label: περιγράφεται στο (αντίτυπο) @el
toolkit definition: Ένα έργο που περιγράφει ένα περιγραφόμενο αντίτυπο. @el
label: és ítem descrit per @ca
definition: Relaciona un ítem amb una obra que es una descripció d’un ítem. @ca
toolkit label: ítem descrit per @ca
toolkit definition: Obra que es una descripció d’un ítem. @ca
definition: Liittää kappaleen teokseen, joka kuvaa kappaletta. @fi
toolkit label: kappaletta kuvaava teos @fi
toolkit definition: Teos, joka kuvaa kappaletta. @fi
toolkit label: beskrevet i eksemplar @no
toolkit definition: Et verk som beskriver et eksemplar. @no
has element type: 2
alternative label: described in (item) @en
label: példány leírva a következőben: @hu
definition: Hozzákapcsol egy példányt egy műhöz, amely egy példányt ír le. @hu
toolkit label: példány leírva a következőben: @hu
toolkit definition: Egy mű, amely egy példányt ír le. @hu
alternative label: kappaleen kuvaus @fi
label: kappaletta kuvaava teos @fi
label: er beskrevet i eksemplar @no
definition: Relaterer et eksemplar til et verk som beskriver et eksemplar. @no
alternative label: beskrevet i (eksemplar) @no
label: is item beschreven in @nl
definition: Relateert een item aan een werk dat een item beschrijft. @nl
toolkit label: item beschreven in @nl
toolkit definition: Een werk dat een item beschrijft. @nl
label: هي مفردة موصوفة في @ar
definition: يربط مفردة بعمل يصف مفردة. @ar
alternative label: موصوف في(مفردة) @ar
toolkit label: مفردة موصوفة في @ar
toolkit definition: عمل يصف مفردة @ar
alternative label: descrit en (ítem) @ca
label: eksemplari kirjeldus @et
definition: Seostab eksemplari teosega, milles kirjeldatakse eksemplari. @et
toolkit label: eksemplari kirjeldus @et
toolkit definition: Teos, milles kirjeldatakse eksemplari. @et
alternative label: Beschrieben in (Exemplar) @de
alternative label: leírva a következőben (példány): @hu
label: è item descritto in @it
definition: Correla un item a un'opera che descrive un item. @it
alternative label: descritto in (item) @it
toolkit label: item descritto in @it
toolkit definition: Opera che descrive un item. @it
lexical alias: itemDescribedBy.en
label: ir vienības apraksts @lv
definition: Sasaista vienību ar darbu, kurā aprakstīta konkrētā vienība. @lv
toolkit label: vienības apraksts @lv
toolkit definition: Darbs, kurā aprakstīta konkrētā vienība. @lv
has subproperty: est un item analysé dans
has subproperty: est un item commenté dans
has subproperty: est un item critiqué dans

est un item évalué dans
type: Property
label: is item evaluated in (Deprecated) @en
lexical alias: itemEvaluatedIn.en
definition: Relates an item to a work that examines or judges an item. (Deprecated) @en
domain: C10003
toolkit label: item evaluated in (Deprecated) @en
toolkit definition: A work that examines or judges an item. (Deprecated) @en
definition: Met un item en relation avec une œuvre qui examine ou juge un item.
toolkit label: item évalué dans
toolkit definition: Œuvre qui examine ou juge un item.
toolkit label: evaluada en (ítem) @es
toolkit definition: Una obra que examina o juzga el ítem descrito. @es
sub property of: est un item décrit par
instruction number: 23.5
label: được đánh giá trong (bản) @vi
definition: Liên kết bản với tác phẩm kiểm tra hoặc đánh giá bản đang được mô tả. @vi
toolkit label: được đánh giá trong (bản) @vi
toolkit definition: Tác phẩm kiểm tra hoặc đánh giá bản đang được mô tả. @vi
label: er eksemplar evalueret i @da
definition: Relaterer et eksemplar til et værk, som undersøger eller bedømmer et eksemplar. @da
toolkit label: eksemplar evalueret i @da
toolkit definition: Værk, som undersøger eller bedømmer et eksemplar. @da
label: ist Exemplar evaluiert in @de
definition: Setzt ein Exemplar in Beziehung zu einem Werk, das ein Exemplar untersucht oder beurteilt. @de
toolkit label: Exemplar evaluiert in @de
toolkit definition: Ein Werk, das ein Exemplar untersucht oder beurteilt. @de
label: αξιολογείται στο (αντίτυπο) @el
definition: Συνδέει ένα αντίτυπο με ένα έργο που εξετάζει ή κρίνει ένα περιγραφόμενο αντίτυπο. @el
toolkit label: αξιολογείται στο (αντίτυπο) @el
toolkit definition: Ένα έργο που εξετάζει ή κρίνει ένα περιγραφόμενο αντίτυπο. @el
label: és ítem avaluat en @ca
definition: Relaciona un ítem amb una obra que examina o jutja un ítem. @ca
toolkit label: ítem avaluat en @ca
toolkit definition: Obra que examina o jutja un ítem. @ca
definition: Liittää kappaleen teokseen, joka tutkii ja arvioi kappaletta. @fi
toolkit label: kappaleen arviointi @fi
toolkit definition: Teos, joka tutkii ja arvioi kappaletta. @fi
toolkit label: evaluert i eksemplar @no
toolkit definition: Et verk som utforsker eller vurderer et eksemplar. @no
has element type: 2
alternative label: evaluated in (item) @en
label: példány értékelve a következőben: @hu
definition: Hozzákapcsol egy példányt egy műhöz, amely egy példányt vizsgál és ítél meg. @hu
toolkit label: példány értékelve a következőben: @hu
toolkit definition: Egy mű, amely egy példányt vizsgál és ítél meg. @hu
alternative label: évalué dans (item)
label: kappaleen arviointi @fi
label: er evaluert i eksemplar @no
definition: Relaterer et eksemplar til et verk som utforsker eller vurderer et eksemplar. @no
alternative label: evaluert i (eksemplar) @no
label: is item beschouwd in @nl
definition: Relateert een item aan een werk dat een item onderzoekt of beoordeelt. @nl
toolkit label: item beschouwd in @nl
toolkit definition: Een werk dat een item onderzoekt of beoordeelt. @nl
label: هي مفردة مُقيَّمة في @ar
definition: يربط مفردة بعمل يفحص أو يحكم على مفردة. @ar
alternative label: مقيَّمة في (مفردة) @ar
toolkit label: مفردة مقيَّمة في @ar
toolkit definition: عمل يفحص أو يحكم على مفردة. @ar
alternative label: avaluat en (ítem) @ca
alternative label: evalueret i (eksemplar) @da
label: eksemplari hinnang @et
definition: Seostab eksemplari teosega, milles kontrollitakse või hinnatakse eksemplari. @et
toolkit label: eksemplari hinnang @et
toolkit definition: Teos, milles kontrollitakse või hinnatakse eksemplari. @et
alternative label: Evaluiert in (Exemplar) @de
alternative label: értékelve a következőben (példány): @hu
label: è item valutato in @it
definition: Correla un item a un'opera che esamina o giudica un item. @it
alternative label: valutato in (item) @it
toolkit label: item valutato in @it
toolkit definition: Opera che esamina o giudica un item. @it
status: Deprecated
label: ir vienības novērtējums @lv
definition: Sasaista vienību ar darbu, kas analizē vai novērtē konkrēto vienību. @lv
toolkit label: vienības novērtējums @lv
toolkit definition: Darbs, kas analizē vai novērtē konkrēto vienību. @lv
has subproperty: P40066

est un item recensé dans
type: Property
label: is item reviewed in (Deprecated) @en
lexical alias: itemReviewedIn.en
definition: Relates an item to a work that is a brief evaluation of an item. (Deprecated) @en
domain: C10003
toolkit label: item reviewed in (Deprecated) @en
toolkit definition: A work that is a brief evaluation of an item. (Deprecated) @en
definition: Met un item en relation avec une œuvre qui consiste en est une brève évaluation d’un item.
toolkit label: item recensé dans
toolkit definition: Œuvre qui consiste en une brève évaluation d’un item.
toolkit label: reseñada en (ítem) @es
toolkit definition: Una obra que contiene una evaluación breve del ítem descrito. @es
sub property of: est un item décrit par
instruction number: 23.5
label: được tổng quan trong (bản) @vi
definition: Liên kết bản với tác phẩm có chứa đánh giá vắn tắt về bản đang được mô tả. @vi
toolkit label: được tổng quan trong (bản) @vi
toolkit definition: Tác phẩm có chứa đánh giá vắn tắt về bản đang được mô tả. @vi
label: er eksemplar anmeldt i @da
definition: Relaterer et eksemplar til et værk, som indeholder en kort kritik af et eksemplar. @da
toolkit label: eksemplar anmeldt i @da
toolkit definition: Værk, som indeholder en kort kritik af et eksemplar. @da
label: ist Exemplar rezensiert in @de
definition: Setzt ein Exemplar in Beziehung zu einem Werk, bei dem es sich um eine kurze Untersuchung eines Exemplars handelt. @de
toolkit label: Exemplar rezensiert in @de
toolkit definition: Ein Werk, bei dem es sich um eine kurze Untersuchung eines Exemplars handelt. @de
label: εξετάζεται στο (αντίτυπο) @el
definition: Συνδέει ένα αντίτυπο με ένα έργο που περιέχει μια σύντομη αξιολόγηση ενός περιγραφόμενου αντιτύπου. @el
toolkit label: εξετάζεται στο (αντίτυπο) @el
toolkit definition: Ένα έργο που περιέχει μια σύντομη αξιολόγηση ενός περιγραφόμενου αντιτύπου. @el
label: és ítem revisat en @ca
definition: Relaciona un ítem amb una obra que és una avaluació breu d’un ítem. @ca
toolkit label: ítem revisat en @ca
toolkit definition: Obra que és una avaluació breu d’un ítem. @ca
definition: Liittää kappaleen teokseen, joka on lyhyt arviointi kappaleesta. @fi
toolkit label: kappaleen arvostelu @fi
toolkit definition: Teos, joka on lyhyt arviointi kappaleesta. @fi
toolkit label: anmeldt i eksemplar @no
toolkit definition: Et verk som inneholder en kortfattet evaluering av et eksemplar. @no
has element type: 2
alternative label: reviewed in (item) @en
label: példány szemlézve a következőben: @hu
definition: Hozzákapcsol egy példányt egy műhöz, amely egy példány rövid értékelése. @hu
toolkit label: példány szemlézve a következőben: @hu
toolkit definition: Egy mű, amely egy példány rövid értékelése. @hu
alternative label: recensé dans (item)
label: kappaleen arvostelu @fi
label: er anmeldt i eksemplar @no
definition: Relaterer et eksemplar til et verk som inneholder en kortfattet evaluering av et eksemplar. @no
alternative label: anmeldt i (eksemplar) @no
label: is item gerecenseerd in @nl
definition: Relateert een item aan een werk dat is een korte beschouwing van een item. @nl
toolkit label: item gerecenseerd in @nl
toolkit definition: Een werk dat is een korte beschouwing van een item. @nl
label: هي مفردة قيد المراجعة في @ar
definition: يربط مفردة بعمل يتضمن تقييما مختصرا لمفردة. @ar
alternative label: معروض في (مفردة) @ar
toolkit label: مفردة قيد المراجعة في @ar
toolkit definition: عمل يتضمن تقييما مختصرا لمفردة @ar
alternative label: revisat en (ítem) @ca
label: eksemplari ülevaade @et
definition: Seostab eksemplari teosega, mis sisaldab lühikest hinnangut eksemplarile. @et
toolkit label: eksemplari ülevaade @et
toolkit definition: Teos, mis sisaldab lühikest hinnangut eksemplarile. @et
alternative label: Rezensiert in (Exemplar) @de
alternative label: szemlézve a következőben (példány): @hu
label: è item recensito in @it
definition: Correla un item a un'opera che contiene una breve valutazione di un item. @it
alternative label: recensito in (item) @it
toolkit label: item recensito in @it
toolkit definition: Opera che contiene una breve valutazione di un item. @it
status: Deprecated
label: ir vienības recenzija @lv
definition: Sasaista vienību ar darbu, kas satur īsu aprakstītās vienības novērtējumu. @lv
toolkit label: vienības recenzija @lv
toolkit definition: Darbs, kas satur īsu aprakstītās vienības novērtējumu. @lv
has subproperty: P40067

has item-specific carrier characteristic of early printed resource (Deprecated)
status: Deprecated
definition: Relates an item to a characteristic that applies to the carrier or carriers of the specific early printed item being described and is assumed not to apply to other items exemplifying the same manifestation. includes rubrication, illumination, and other hand colouring, manuscript additions, and binding. (Deprecated) @en
lexical alias: itemSpecificCarrierCharacteristicOfEarlyPrintedResource.en
domain: C10003
type: Property

a pour manifestation exemplifiée
status: Published
label: has manifestation exemplified @en
definition: Relates an item to a manifestation that is exemplified by an item. @en
type: Property
domain: C10003
lexical alias: manifestationExemplified.en
instruction number: 17.12
toolkit label: manifestation exemplified @en
toolkit definition: A manifestation that is exemplified by an item. @en
definition: Met un item en relation avec une manifestation qui est exemplifiée par un item.
toolkit label: manifestation exemplifiée
toolkit definition: Manifestation qui est exemplifiée par un item.
toolkit label: manifestación ejemplificada @es
toolkit definition: La manifestación ejemplificada en un ítem. @es
label: har exemplar av manifestationen @sv
toolkit label: exemplar av manifestation @sv
label: có biểu thị được ví dụ @vi
definition: Liên kết bản với biểu thị được thể hiện bởi bản. @vi
toolkit label: biểu thị được thể hiện @vi
toolkit definition: Biểu thị được thể hiện bởi bản. @vi
label: har eksemplificeret manifestation @da
definition: Relaterer et eksemplar til en manifestation, som er eksemplificeret af et eksemplar. @da
toolkit label: eksemplificeret manifestation @da
toolkit definition: Manifestation, som er eksemplificeret af et eksemplar. @da
label: hat im Exemplar vorliegende Manifestation @de
definition: Setzt ein Exemplar in Beziehung zu einer Manifestation, die durch ein Exemplar beispielhaft dargestellt wird. @de
toolkit label: im Exemplar vorliegende Manifestation @de
toolkit definition: Eine Manifestation, die durch ein Exemplar beispielhaft dargestellt wird. @de
label: έχει υλοποιημένη εκδήλωση @el
definition: Συνδέει ένα αντίτυπο με μια εκδήλωση που υλοποιείται από ένα αντίτυπο. @el
toolkit label: υλοποιημένη εκδήλωση @el
toolkit definition: Μια εκδήλωση που υλοποιείται από ένα αντίτυπο. @el
label: té com a manifestació exemplificada @ca
definition: Relaciona un ítem amb una manifestació que s’exemplifica per un ítem. @ca
toolkit label: manifestació exemplificada @ca
toolkit definition: Manifestació que s’exemplifica per un ítem. @ca
definition: Liittää kappaleen manifestaatioon, jota kappale edustaa. @fi
toolkit label: kappaleen edustama manifestaatio @fi
toolkit definition: Manifestaatio, jota kappale edustaa. @fi
toolkit label: manifestasjon eksemplifisert @no
toolkit definition: En manifestasjonen som er eksemplifisert ved et eksemplar. @no
sub property of: a pour manifestation en relation avec un item
has element type: 3
label: megjelenési forma példája a következő: @hu
definition: Hozzákapcsol egy példányt egy megjelenési formához, amelyet egy példány szemléltet. @hu
toolkit label: megjelenési forma példája: @hu
toolkit definition: Egy megjelenési forma, amelyet egy példány szemléltet. @hu
label: kappaleen edustama manifestaatio @fi
label: har manifestasjon eksemplifisert @no
definition: Relaterer et eksemplar til en manifestasjonen som er eksemplifisert ved et eksemplar. @no
label: heeft manifestatie voorgesteld @nl
definition: Relateert een item aan een manifestatie die voorgesteld wordt door een item. @nl
toolkit label: manifestatie voorgesteld @nl
toolkit definition: Een manifestatie die voorgesteld wordt door een item. @nl
label: له تجسيدة ممثلة @ar
definition: يربط مفردة بتجسيدة ممثلة في مفردة. @ar
toolkit label: تجسيدة ممثلة @ar
toolkit definition: تجسيدة ممثلة في مفردة @ar
label: esindab kehastust @et
definition: Seostab eksemplari kehastusega, mida eksemplar esindab. @et
toolkit label: esindab kehastust @et
toolkit definition: Kehastus, mida eksemplar esindab. @et
label: ha come manifestazione esemplificata @it
definition: Correla un item a una manifestazione esemplificata da un item. @it
toolkit label: manifestazione esemplificata @it
toolkit definition: Manifestazione esemplificata da un item. @it
label: paraugeksemplārs manifestācijai @lv
definition: Sasaista vienību ar manifestāciju, kas ir izmantota par paraugu vienībai. @lv
toolkit label: paraugeksemplārs manifestācijai @lv
toolkit definition: Manifestācija, kas ir izmantota par paraugu vienībai. @lv
has subproperty: P40049
label: 有被例证的载体表现 @zh-hans
definition: 将一个单件与被一个单件例证的一种载体表现关联起来。 @zh-hans
toolkit label: 被例证的载体表现 @zh-hans
toolkit definition: 被一个单件例证的一种载体表现 @zh-hans
alternative label: manifestation représentée
label: örneklenen gösterim ile ilişkilidir @tr
definition: Bir kopyayı, bir kopya tarafından kopya edilmiş bir gösterimle ilişkilendirir. @tr
toolkit label: Kopya edilmiş gösterim @tr

a pour autre agent associé à un item
status: Deprecated
label: has other agent associated with item (Deprecated) @en
definition: Relates an item to an agent other than an owner or custodian who is associated with an item. (Deprecated) @en
type: Property
domain: C10003
lexical alias: otherAgentItem.en
instruction number: 22.4
toolkit label: other agent associated with item (Deprecated) @en
toolkit definition: An agent other than an owner or custodian who is associated with an item. (Deprecated) @en
definition: Met un item en relation avec un agent, autre qu’un propriétaire ou un dépositaire, associé à un item.
scope note: Sont inclus les conservateurs, les relieurs, les restaurateurs, etc.
toolkit label: autre agent associé à un item
toolkit definition: Agent, autre qu’un propriétaire ou un dépositaire, associé à un item.
toolkit label: otra persona, familia o entidad corporativa asociada con un ítem @es
toolkit definition: Una persona, familia o entidad corporativa (diferente a un propietario o custodio), asociada con un ítem. @es
scope note: Curators, binders, restorationists, etc., are included. (Deprecated) @en
label: har övrig person, familj/släkt eller institution knuten till ett exemplar @sv
toolkit label: övrig person, familj/släkt eller institution knuten till ett exemplar @sv
sub property of: a pour agent en relation avec un item
label: có tác nhân khác của bản @vi
definition: Liên kết bản với tác nhân liên quan tới bản, khác với người chủ hoặc người giám hộ. @vi
scope note: Người trông nom, người đóng sách, người phục chế, v.v..., được bao gồm. @vi
toolkit label: tác nhân khác của bản @vi
toolkit definition: Tác nhân liên quan tới bản, khác với người chủ hoặc người giám hộ. @vi
label: har anden person, familie eller korporation knyttet til et eksemplar @da
definition: Relaterer et eksemplar til en agent bortset fra en ejer eller forvalter, der er knyttet til et eksemplar. @da
scope note: Kuratorer, bogbindere, konservatorer etc, er omfattet. @da
toolkit label: anden agent knyttet til et eksemplar @da
toolkit definition: Agent bortset fra en ejer eller forvalter, der er knyttet til et eksemplar. @da
label: hat sonstigen Akteur, der mit einem Exemplar in Verbindung steht @de
definition: Setzt ein Exemplar mit einem Akteur, der mit einem Exemplar in Verbindung steht, aber nicht der Eigentümer oder der Verwahrer ist, in Beziehung. @de
scope note: Dazu gehören Kuratoren, Buchbinder, Restauratoren usw. @de
toolkit label: Sonstiger Akteur der mit einem Exemplar in Verbindung steht @de
toolkit definition: Ein Akteur, der mit einem Exemplar in Verbindung steht, aber nicht der Eigentümer oder der Verwahrer ist. @de
label: έχει άλλον φορέα συνδεδεμένο με το αντίτυπο @el
definition: Συνδέει ένα αντίτυπο με έναν φορέα άλλον από τον ιδιοκτήτη ή τον θεματοφύλακα ο οποίος συνδέεται με ένα αντίτυπο. @el
scope note: Περιλαμβάνονται επιμελητές έκθεσης, βιβλιοδέτες, συντηρητές κ.λπ. @el
toolkit label: άλλος φορέας συνδεδεμένος με το αντίτυπο @el
toolkit definition: Ένας φορέας άλλος από τον ιδιοκτήτη ή τον θεματοφύλακα ο οποίος συνδέεται με ένα αντίτυπο. @el
label: té com a altre agent associat amb un ítem @ca
definition: Relaciona un item amb un agent diferent d’un propietari o un dipositari associat amb un ítem. @ca
scope note: Inclou els conservadors, els enquadernadors, els restauradors, etc. @ca
toolkit label: altre agent associat amb un ítem @ca
toolkit definition: Agent diferent d’un propietari o un dipositari associat amb un ítem. @ca
label: kappaleeseen liittyvä muu toimija @fi
definition: Liittää kappaleen muuhun toimijaan, joka ei ole kappaleen omistaja tai säilyttäjä. @fi
scope note: Kappaleeseen liittyviin muihin toimijoihin kuuluvat kuraattorit, kirjansitojat, restauroijat jne. @fi
toolkit label: kappaleeseen liittyvä muu toimija @fi
toolkit definition: Kappaleeseen liittyvä muu toimija, joka ei ole kappaleen omistaja tai säilyttäjä. @fi
toolkit label: annen agent som forbindes med eksemplar @no
toolkit definition: En agent som forbindes med et eksemplar og som ikke er en eier eller oppbevarer. @no
has element type: 3
label: van más, a példányhoz kötődő ágense @hu
definition: Egy példányt hozzákapcsol egy ágenshez (személyhez, családhoz vagy testülethez), aki/amely más, mint a példányhoz kötődő tulajdonos vagy őrző. @hu
scope note: Kurátorok, könyvkötők, restaurátorok stb. beletartoznak. @hu
toolkit label: példányhoz kötődő másik ágens @hu
toolkit definition: Egy ágens (személy, család vagy testület), aki/amely nem a tulajdonos vagy az őrző, aki/amely kötődik egy példányhoz. @hu
has subproperty: P40023

a pour modification d’un item
status: Published
label: has modification of item @en
definition: Relates an item to a modification that is specific to an item and is assumed not to apply to other items exemplifying the same manifestation. @en
type: Property
domain: C10003
lexical alias: modificationOfItem.en
instruction number: 3.22
toolkit label: modification of item @en
toolkit definition: A modification that is specific to an item and is assumed not to apply to other items exemplifying the same manifestation. @en
definition: Met un item en relation avec une modification qui est particulière à un item et qui est censée ne pas concerner les autres items exemplifiant la même manifestation.
toolkit label: modification d’un item
toolkit definition: Modification qui est particulière à un item et qui est censée ne pas concerner les autres items exemplifiant la même manifestation.
toolkit label: nota sobre la característica del soporte de ítem específico @es
toolkit definition: Una nota que proporciona información sobre las características del soporte que son específicas al ítem descrito y se asume que no aplican a otros ítems que ejemplifican la misma manifestación. @es
label: har anmärkning om exemplarspecifika bäraregenskaper @sv
toolkit label: anmärkning om exemplarspecifika bäraregenskaper @sv
label: có ghi chú đặc trưng vật mang bản cụ thể @vi
definition: Liên kết bản với ghi chú cung cấp thông tin phụ trợ về đặc trưng vật mang tin đối với bản cụ thể đang được mô tả và được thừa nhận không áp dụng đối với các bản khác sao chép từ cùng biểu thị. @vi
toolkit label: ghi chú đặc trưng vật mang bản cụ thể @vi
toolkit definition: Ghi chú cung cấp thông tin phụ trợ về đặc trưng vật mang tin đối với bản cụ thể đang được mô tả và được thừa nhận không áp dụng đối với các bản khác sao chép từ cùng biểu thị. @vi
label: har modificering af eksemplar @da
definition: Relaterer et eksemplar til en modificering, som er specifik for et eksemplar, og som antages ikke at gælde for andre eksemplarer, som eksemplificerer den samme manifestation. @da
toolkit label: modificering af eksemplar @da
toolkit definition: Modificering, som er specifik for et eksemplar, og som antages ikke at gælde for andre eksemplarer, som eksemplificerer den samme manifestation. @da
label: hat Variante eines Exemplars @de
definition: Setzt ein Exemplar in Beziehung zu einer Variante, die spezifisch für ein Exemplar ist und von der angenommen wird, dass sie nicht auf andere Exemplare zutrifft, die dieselbe Manifestation verkörpern. @de
toolkit label: Variante eines Exemplars @de
toolkit definition: Eine Variante, die spezifisch für ein Exemplar ist und von der angenommen wird, dass sie nicht auf andere Exemplare zutrifft, die dieselbe Manifestation verkörpern. @de
label: έχει σημείωση σε συγκεκριμένο αντίτυπο των χαρακτηριστικών του φορέα αποθήκευσης @el
definition: Συνδέει ένα αντίτυπο με μια σημείωση που παρέχει πρόσθετες πληροφορίες σχετικά με τα χαρακτηριστικά του φορέα αποθήκευσης, τα οποία αναφέρονται σε ένα συγκεκριμένο περιγραφόμενο αντίτυπο και θεωρούνται ότι δεν βρίσκουν εφαρμογή σε άλλα αντίτυπα τα οποία υλοποιούν την ίδια εκδήλωση. @el
toolkit label: σημείωση σε συγκεκριμένο αντίτυπο των χαρακτηριστικών του φορέα αποθήκευσης @el
toolkit definition: Μια σημείωση που παρέχει πρόσθετες πληροφορίες σχετικά με τα χαρακτηριστικά του φορέα αποθήκευσης, τα οποία αναφέρονται σε ένα συγκεκριμένο περιγραφόμενο αντίτυπο και θεωρούνται ότι δεν βρίσκουν εφαρμογή σε άλλα αντίτυπα τα οποία υλοποιούν την ίδια εκδήλωση. @el
label: té com a modificació d’un ítem @ca
definition: Relaciona un ítem amb una modificació que és específica d’un ítem i se suposa que no s’aplica a altres ítems que exemplifiquen la mateixa manifestació. @ca
toolkit label: modificació d’un ítem @ca
toolkit definition: Modificació que és específica d’un ítem i se suposa que no s’aplica a altres ítems que exemplifiquen la mateixa manifestació. @ca
definition: Liittää kappaleen sille ominaiseen muunnokseen, jonka ei oleteta sisältyvän muihin samaa manifestaatiota edustaviin kappaleisin. @fi
toolkit label: kappaleen muunnos @fi
toolkit definition: Kappaleen muunnos, jonka ei oleteta sisältyvän muihin samaa manifestaatiota edustaviin kappaleisin. @fi
toolkit label: endring for eksemplar @no
toolkit definition: En endring som er spesifikk for et eksemplar og som ikke antas å gjelde for andre eksemplarer som eksemplifiserer den samme manifestasjonen. @no
has element type: 6
label: példány módosítása a következő: @hu
definition: Hozzákapcsol egy példányt egy példányra jellemző módosításhoz, amely feltételezhetően nem vonatkozik más, ugyanazt a megjelenési formát példázó példányokra. @hu
toolkit label: példány módosítása: @hu
toolkit definition: Egy példányra jellemző módosítás, amely feltételezhetően nem vonatkozik más, ugyanazt a megjelenési formát példázó példányokra. @hu
alternative label: note on item-specific carrier characteristic @en
sub property of: a pour note sur un item
alternative label: note sur les caractéristiques du support matériel d’un item particulier
alternative label: huomautus kappalekohtaisen tallenteen ominaisuudesta @fi
label: kappaleen muunnos @fi
label: har endring for eksemplar @no
definition: Relaterer et eksemplar til en endring som er spesifikk for et eksemplar og som ikke antas å gjelde for andre eksemplarer som eksemplifiserer den samme manifestasjonen. @no
alternative label: note om eksemplarspesifikke kjennetegn @no
label: heeft aanpassing voor item @nl
definition: Relateert een item aan een aanpassing die specifiek voor een item is en waarvan aangenomen niet van toepassing te zijn op andere items die dezelfde manifestatie voorstellen. @nl
toolkit label: aanpassing voor item @nl
toolkit definition: Een aanpassing die specifiek voor een item is en waarvan aangenomen niet van toepassing te zijn op andere items die dezelfde manifestatie voorstellen. @nl
label: له تعديل لمفردة @ar
definition: يربط مفردة بتعديل مخصص لمفردة، ويُفترض أنه لا ينطبق على المفردات الأخرى التي تمثل التجسيدة نفسها. @ar
alternative label: تبصرة عن خصائص حامل مفردة محدد @ar
toolkit label: تعديل لمفردة @ar
toolkit definition: تعديل مخصص لمفردة، ويُفترض أنه لا ينطبق على المفردات الأخرى التي تمثل التجسيدة نفسها. @ar
alternative label: nota sobre característiques de suport físic específiques d’un ítem concret @ca
alternative label: note om eksemplarspecifikke bærerkarakteristika @da
label: eksemplari erijoon @et
definition: Seostab eksemplari eksemplarile omase muudatusega, mis eeldatavasti ei ole omane teistele sama kehastust esindavatele eksemplaridele. @et
alternative label: märkus eksemplari spetsiifilise kandjatunnuse kohta @et
toolkit label: eksemplari erijoon @et
toolkit definition: Eksemplarile omane muudatus, mis eeldatavasti ei ole omane teistele sama kehastust esindavatele eksemplaridele. @et
alternative label: Anmerkung zu einer exemplarspezifischen Datenträgereigenschaft @de
alternative label: megjegyzés példányspecifikus hordozójellemzőkről: @hu
label: vienības modificējums @lv
definition: Sasaista vienību ar modifikāciju, kas raksturīga vienībai un tiek pieņemts, ka tādas nav tās pašas manifestācijas citām vienībām. @lv
toolkit label: vienības modificējums @lv
toolkit definition: Modifikācija, kas raksturīga vienībai un tiek pieņemts, ka tādas nav tās pašas manifestācijas citām vienībām. @lv
has subproperty: P40003
alternative label: 关于单件特有载体特征的附注 @zh-hans
label: 有单件的修改 @zh-hans
toolkit label: 单件的修改 @zh-hans

a pour agent modificateur
status: Published
label: has modifier agent @en
type: Property
lexical alias: modifierAgent.en
domain: C10003
has element type: 2
toolkit label: modifier agent @en
definition: Relates an item to an agent that makes changes to an item without creating a new manifestation. @en
toolkit definition: An agent who makes changes to an item without creating a new manifestation. @en
sub property of: a pour agent en relation avec un item
alternative label: modifier @en
definition: Met un item en relation avec un agent qui apporte des modifications à un item sans créer une nouvelle manifestation.
alternative label: modificateur
toolkit label: agent modificateur
toolkit definition: Agent qui apporte des modifications à un item sans créer une nouvelle manifestation.
label: muokkaaja (toimija) @fi
definition: Liittää kappaleen toimijaan, joka tekee muutoksia kappaleeseen luomatta uutta manifestaatiota. @fi
alternative label: muokkaaja @fi
toolkit label: muokkaaja (toimija) @fi
toolkit definition: Toimija, joka tekee muutoksia kappaleeseen luomatta uutta manifestaatiota. @fi
label: har tilpasser (agent) @no
definition: Relaterer et eksemplar til en agent som gjør endringer på et eksemplar uten å skape en ny manifestasjon. @no
toolkit label: tilpasser (agent) @no
toolkit definition: En agent som gjør endringer på et eksemplar uten å skape en ny manifestasjon. @no
label: heeft aanpasser-actor @nl
definition: Relateert een item aan een actor die veranderingen aanbrengt aan een item zonder een nieuwe manifestatie te creëren. @nl
toolkit label: aanpasser-actor @nl
toolkit definition: Een actor die veranderingen aanbrengt aan een item zonder een nieuwe manifestatie te creëren. @nl
label: له وكيل مُعدِّل @ar
definition: يربط مفردة بوكيل يجري تغييرات على مفردة دون أن ينشئ تجسيدة جديدة. @ar
alternative label: معدِّل @ar
toolkit label: وكيل مُعدِّل @ar
toolkit definition: وكيل يقوم يجري تغييرات على مفردة دون أن ينشئ تجسيدة جديدة. @ar
label: té com a agent modificador @ca
definition: Relaciona un ítem amb un agent que fa canvis a un ítem sense crear una manifestació nova. @ca
alternative label: modificador @ca
toolkit label: agent modificador @ca
toolkit definition: Agent que fa canvis a un ítem sense crear una manifestació nova. @ca
label: har agent, som er tilpasser @da
definition: Relaterer et eksemplar til en agent, som ændrer i et eksemplar uden at skabe en ny manifestation. @da
alternative label: tilpasser @da
toolkit label: agent, som er tilpasser @da
toolkit definition: Agent, som ændrer i et eksemplar uden at skabe en ny manifestation. @da
label: muutja (tegija) @et
definition: Seostab eksemplari tegijaga, kes muudab eksemplari, loomata uut kehastust. @et
alternative label: muutja @et
toolkit label: muutja (tegija) @et
toolkit definition: Tegija, kes muudab eksemplari, loomata uut kehastust. @et
label: hat Bearbeiterin/Bearbeiter eines Exemplars (Akteur) @de
definition: Setzt ein Exemplar in Beziehung zu einem Akteur, der Änderungen an einem Exemplar vornimmt, ohne eine neue Manifestation zu erstellen. @de
toolkit label: Bearbeiterin/Bearbeiter eines Exemplars (Akteur) @de
toolkit definition: Ein Akteur, der Änderungen an einem Exemplar vornimmt, ohne eine neue Manifestation zu erschaffen. @de
label: módosító ágense a következő: @hu
definition: módosító ágense: @hu
alternative label: módosítója: @hu
toolkit label: Hozzákapcsol egy példányt egy ágenshez, amely új megjelenési forma létrehozása nélkül idéz elő változást a példányban. @hu
toolkit definition: Egy ágens, amely új megjelenési forma létrehozása nélkül idéz elő változást a példányban. @hu
label: ha come modificatore agente @it
definition: Correla un item a un agente che apporta modifiche a un item senza creare una nuova manifestazione. @it
alternative label: modificatore (?) @it
toolkit label: modificatore agente @it
toolkit definition: Agente che apporta modifiche a un item senza creare una nuova manifestazione. @it
label: modificētājs (aģents) @lv
toolkit label: modificētājs (aģents) @lv
definition: Sasaista vienību ar aģentu, kas veicis izmaiņas vienībā, neradot jaunu manifestāciju. @lv
toolkit definition: Aģents, kas veicis izmaiņas vienībā, neradot jaunu manifestāciju. @lv
has subproperty: a pour agent relieur
has subproperty: a pour agent enlumineur
has subproperty: a pour agent collectif modificateur
has subproperty: a pour personne modificatrice
has subproperty: a pour agent restaurateur d’un item
has subproperty: P40093
alternative label: 修改者 @zh-hans
label: 有修改者行为者 @zh-hans
toolkit label: 修改者行为者 @zh-hans
definition: 将一个单件与对一个单件作修改而不创建一个新的载体表现的一个行为者关联起来。 @zh-hans
toolkit definition: 对一个单件作修改而不创建一个新的载体表现的一个行为者 @zh-hans
alternative label: Dönüştürücü @tr
label: düzenleyici temsilcisi ile ilişkilidir @tr

a pour agent collectif modificateur
status: Published
label: has modifier collective agent @en
lexical alias: modifierCollectiveAgent.en
definition: Relates an item to a collective agent that makes changes to an item without creating a new manifestation. @en
toolkit label: modifier collective agent @en
toolkit definition: A collective agent who makes changes to an item without creating a new manifestation. @en
type: Property
domain: C10003
has element type: 2
sub property of: a pour agent collectif en relation avec un item
sub property of: a pour agent modificateur
definition: Met un item en relation avec un agent collectif qui apporte des modifications à un item sans créer une nouvelle manifestation.
toolkit label: agent collectif modificateur
toolkit definition: Agent collectif qui apporte des modifications à un item sans créer une nouvelle manifestation.
label: muokkaaja (yhteistoimija) @fi
definition: Liittää kappaleen yhteistoimijaan, joka tekee muutoksia kappaleeseen luomatta uutta manifestaatiota. @fi
toolkit label: muokkaaja (yhteistoimija) @fi
toolkit definition: Yhteistoimija, joka tekee muutoksia kappaleeseen luomatta uutta manifestaatiota. @fi
label: har tilpasser (kollektiv agent) @no
definition: Relaterer et eksemplar til en kollektiv agent som gjør endringer på et eksemplar uten å skape en ny manifestasjon. @no
toolkit label: tilpasser (kollektiv agent) @no
toolkit definition: En kollektiv agent som gjør endringer på et eksemplar uten å skape en ny manifestasjon. @no
label: heeft aanpasser-collectieve actor @nl
definition: Relateert een item aan een collectieve actor die veranderingen aanbrengt aan een item zonder een nieuwe manifestatie te creëren. @nl
toolkit label: aanpasser-collectieve actor @nl
toolkit definition: Een collectieve actor die veranderingen aanbrengt aan een item zonder een nieuwe manifestatie te creëren. @nl
label: له وكيل جماعي مُعدِّل @ar
definition: يربط مفردة بوكيل جماعي يقوم بإجراء تغييرات على مفردة دون أن ينشئ تجسيدة جديدة. @ar
toolkit label: وكيل جماعي مُعدِّل @ar
toolkit definition: وكيل جماعي يجري تغييرات على مفردة دون أن ينشئ تجسيدة جديدة. @ar
label: té com a agent col·lectiu modificador @ca
definition: Relaciona un ítem amb un agent col·lectiu que fa canvis a un ítem sense crear una manifestació nova. @ca
toolkit label: agent col·lectiu modificador @ca
toolkit definition: Agent col·lectiu que fa canvis a un ítem sense crear una manifestació nova. @ca
label: har kollektiv agent, som er tilpasser @da
definition: Relaterer et eksemplar til en kollektiv agent, som ændrer i et eksemplar uden at skabe en ny manifestation. @da
toolkit label: kollektiv agent, som er tilpasser @da
toolkit definition: Kollektiv agent, som ændrer i et eksemplar uden at skabe en ny manifestation. @da
label: muutja (kollektiiv) @et
definition: Seostab eksemplari kollektiiviga, kes muudab eksemplari, loomata uut kehastust. @et
toolkit label: muutja (kollektiiv) @et
toolkit definition: Kollektiiv, kes muudab eksemplari, loomata uut kehastust. @et
label: hat Bearbeiterin/Bearbeiter eines Exemplars (Gemeinschaftlicher Akteur) @de
definition: Setzt ein Exemplar in Beziehung zu einem gemeinschaftlichen Akteur, der Änderungen an einem Exemplar vornimmt, ohne eine neue Manifestation zu erstellen. @de
toolkit label: Bearbeiterin/Bearbeiter eines Exemplars (Gemeinschaftlicher Akteur) @de
toolkit definition: Ein gemeinschaftlicher Akteur, der Änderungen an einem Exemplar vornimmt, ohne eine neue Manifestation zu erstellen. @de
label: módosító kollektív ágense a következő: @hu
definition: Hozzákapcsol egy példányt egy kollektív ágenshez, amely új megjelenési forma létrehozása nélkül idéz elő változást a példányban. @hu
toolkit label: módosító kollektív ágense: @hu
toolkit definition: Egy kollektív ágens, amely új megjelenési forma létrehozása nélkül idéz elő változást a példányban. @hu
label: ha come modificatore agente collettivo @it
definition: Correla un item a un agente collettivo che apporta modifiche a un item senza creare una nuova manifestazione. @it
toolkit label: modificatore agente collettivo @it
toolkit definition: Agente collettivo che apporta modifiche a un item senza creare una nuova manifestazione. @it
label: modificētājs (grupa) @lv
definition: Sasaista vienību ar grupu, kas veikusi izmaiņas vienībā, neradot jaunu manifestāciju. @lv
toolkit label: modificētājs (grupa) @lv
toolkit definition: Grupa, kas veikusi izmaiņas vienībā, neradot jaunu manifestāciju. @lv
has subproperty: a pour agent collectif relieur
has subproperty: a pour agent collectif enlumineur
has subproperty: a pour collectivité modificatrice
has subproperty: a pour famille modificatrice
has subproperty: a pour agent collectif restaurateur d’un item
has subproperty: P40128
label: 有修改者集体行为者 @zh-hans
definition: 将一个单件与对一个单件作修改而不创建一个新的载体表现的一个集体行为者关联起来。 @zh-hans
toolkit label: 修改者集体行为者 @zh-hans
toolkit definition: 对一个单件作修改而不创建一个新的载体表现的一个集体行为者 @zh-hans
label: düzenleyici kolektif temsilcisi ile ilişkilidir @tr
definition: Bir kopyayı, yeni bir gösterim oluşturmadan bir kopyada değişiklik yapan kolektif bir temsilciyle ilişkilendirir. @tr
toolkit label: Dönüştüren kolektif temsilci @tr
toolkit definition: Yeni bir gösterim oluşturmadan bir kopyada değişiklik yapan kolektif bir temsilci. @tr

a pour collectivité modificatrice
status: Published
label: has modifier corporate body @en
lexical alias: modifierCorporateBody.en
definition: Relates an item to a corporate body that makes changes to an item without creating a new manifestation. @en
toolkit label: modifier corporate body @en
toolkit definition: A corporate body who makes changes to an item without creating a new manifestation. @en
type: Property
domain: C10003
has element type: 2
sub property of: a pour collectivité en relation avec un item
sub property of: a pour agent collectif modificateur
definition: Met un item en relation avec une collectivité qui apporte des modifications à un item sans créer une nouvelle manifestation.
toolkit label: collectivité modificatrice
toolkit definition: Collectivité qui apporte des modifications à un item sans créer une nouvelle manifestation.
label: muokkaaja (yhteisö) @fi
definition: Liittää kappaleen yhteisöön, joka tekee muutoksia kappaleeseen luomatta uutta manifestaatiota. @fi
toolkit label: muokkaaja (yhteisö) @fi
toolkit definition: Yhteisö, joka tekee muutoksia kappaleeseen luomatta uutta manifestaatiota. @fi
label: har tilpasser (korporasjon) @no
definition: Relaterer et eksemplar til en korporasjon som gjør endringer på et eksemplar uten å skape en ny manifestasjon. @no
toolkit label: tilpasser (korporasjon) @no
toolkit definition: En korporasjon som gjør endringer på et eksemplar uten å skape en ny manifestasjon. @no
label: heeft aanpasser-corporatie @nl
definition: Relateert een item aan een corporatie die veranderingen aanbrengt aan een item zonder een nieuwe manifestatie te creëren. @nl
toolkit label: aanpasser-corporatie @nl
toolkit definition: Een corporatie die veranderingen aanbrengt aan een item zonder een nieuwe manifestatie te creëren. @nl
label: له هيئة مُعدِّلة @ar
definition: يربط مفردة بهيئة تجري تغييرات على مفردة دون أن تنشئ تجسيدة جديدة. @ar
toolkit label: هيئة مُعدِّلة @ar
toolkit definition: هيئة تُجري تغييرات على مفردة دون أن تنشئ تجسيدة جديدة. @ar
label: té com a entitat corporativa modificadora @ca
definition: Relaciona un ítem amb una entitat corporativa que fa canvis a un ítem sense crear una manifestació nova. @ca
toolkit label: entitat corporativa modificadora @ca
toolkit definition: Entitat corporativa que fa canvis a un ítem sense crear una manifestació nova. @ca
label: har korporation, som er tilpasser @da
definition: Relaterer et eksemplar til en korporation, som ændrer i et eksemplar uden at skabe en ny manifestation. @da
toolkit label: korporation, som er tilpasser @da
toolkit definition: Korporation, som ændrer i et eksemplar uden at skabe en ny manifestation. @da
label: muutja (asutus) @et
definition: Seostab eksemplari asutusega, kes muudab eksemplari, loomata uut kehastust. @et
toolkit label: muutja (asutus) @et
toolkit definition: Asutus, kes muudab eksemplari, loomata uut kehastust. @et
label: hat Bearbeiterin/Bearbeiter eines Exemplars (Körperschaft) @de
definition: Setzt ein Exemplar in Beziehung zu einer Körperschaft, die Änderungen an einem Exemplar vornimmt, ohne eine neue Manifestation zu erstellen. @de
toolkit label: Bearbeiterin/Bearbeiter eines Exemplars (Körperschaft) @de
toolkit definition: Eine Körperschaft, die Änderungen an einem Exemplar vornimmt, ohne eine neue Manifestation zu erstellen. @de
label: módosító testülete a következő: @hu
definition: Hozzákapcsol egy példányt egy testülethez, amely új megjelenési forma létrehozása nélkül idéz elő változást a példányban. @hu
toolkit label: módosító testülete: @hu
toolkit definition: Egy testület, amely új megjelenési forma létrehozása nélkül idéz elő változást a példányban. @hu
label: ha come modificatore ente @it
definition: Correla un item a un ente che apporta modifiche a un item senza creare una nuova manifestazione. @it
toolkit label: modificatore ente @it
toolkit definition: Ente che apporta modifiche a un item senza creare una nuova manifestazione. @it
label: modificētājs (institūcija) @lv
definition: Sasaista vienību ar institūciju, kas veikusi izmaiņas vienībā, neradot jaunu manifestāciju. @lv
toolkit label: modificētājs (institūcija) @lv
toolkit definition: Institūcija, kas veikusi izmaiņas vienībā, neradot jaunu manifestāciju. @lv
has subproperty: a pour collectivité relieuse
has subproperty: a pour collectivité enlumineuse
has subproperty: a pour collectivité restauratrice d’un item
has subproperty: P40144
label: 有修改者团体 @zh-hans
definition: 将一个单件与对一个单件作修改而不创建一个新的载体表现的一个团体关联起来。 @zh-hans
toolkit label: 修改者团体 @zh-hans
toolkit definition: 对一个单件作修改而不创建一个新的载体表现的一个团体 @zh-hans
label: düzenleyici tüzel kişisi ile ilişkilidir @tr
definition: Bir kopyayı, yeni bir görünüm oluşturmadan bir kopyada değişiklik yapan tüzel bir kişiyle ilişkilendirir. @tr
toolkit label: Dönüştürücü tüzel kişi @tr
toolkit definition: Yeni bir görünüm oluşturmadan bir kopyada değişiklik yapan bir tüzel kişi. @tr

a pour famille modificatrice
status: Published
label: has modifier family @en
lexical alias: modifierFamily.en
definition: Relates an item to a family that makes changes to an item without creating a new manifestation. @en
toolkit label: modifier family @en
toolkit definition: A family who makes changes to an item without creating a new manifestation. @en
type: Property
domain: C10003
has element type: 2
sub property of: a pour famille en relation avec un item
sub property of: a pour agent collectif modificateur
definition: Met un item en relation avec une famille qui apporte des modifications à un item sans créer une nouvelle manifestation.
toolkit label: famille modificatrice
toolkit definition: Famille qui apporte des modifications à un item sans créer une nouvelle manifestation.
label: muokkaaja (suku) @fi
definition: Liittää kappaleen sukuun, joka tekee muutoksia kappaleeseen luomatta uutta manifestaatiota. @fi
toolkit label: muokkaaja (suku) @fi
toolkit definition: Suku, joka tekee muutoksia kappaleeseen luomatta uutta manifestaatiota. @fi
label: har tilpasser (familie) @no
definition: Relaterer et eksemplar til en familie som gjør endringer på et eksemplar uten å skape en ny manifestasjon. @no
toolkit label: tilpasser (familie) @no
toolkit definition: En familie som gjør endringer på et eksemplar uten å skape en ny manifestasjon. @no
label: heeft aanpasser-familie @nl
definition: Relateert een item aan een familie die veranderingen aanbrengt aan een item zonder een nieuwe manifestatie te creëren. @nl
toolkit label: aanpasser-familie @nl
toolkit definition: Een familie die veranderingen aanbrengt aan een item zonder een nieuwe manifestatie te creëren. @nl
label: له عائلة مسئولة عن التعديل @ar
definition: يربط مفردة بعائلة تُجري تغييرات على مفردة دون أن تنشئ تجسيدة جديدة. @ar
toolkit label: عائلة مسئولة عن التعديل @ar
toolkit definition: عائلة تُجري تغييرات على مفردة دون أن تنشئ تجسيدة جديدة. @ar
label: té com a família modificadora @ca
definition: Relaciona un ítem amb una família que fa canvis a un ítem sense crear una manifestació nova. @ca
toolkit label: família modificadora @ca
toolkit definition: Família que fa canvis a un ítem sense crear una manifestació nova. @ca
label: har familie, som er tilpasser @da
definition: Relaterer et eksemplar til en familie, som ændrer i et eksemplar uden at skabe en ny manifestation. @da
toolkit label: familie, som er tilpasser @da
toolkit definition: Familie, som ændrer i et eksemplar uden at skabe en ny manifestation. @da
label: muutja (perekond) @et
definition: Seostab eksemplari perekonnaga, kes muudab eksemplari, loomata uut kehastust. @et
toolkit label: muutja (perekond) @et
toolkit definition: Perekond, kes muudab eksemplari, loomata uut kehastust. @et
label: hat Bearbeiterin/Bearbeiter eines Exemplars (Familie) @de
definition: Setzt ein Exemplar in Beziehung zu einer Familie, die Änderungen an einem Exemplar vornimmt, ohne eine neue Manifestation zu erstellen. @de
toolkit label: Bearbeiterin/Bearbeiter eines Exemplars (Familie) @de
toolkit definition: Eine Familie, die Änderungen an einem Exemplar vornimmt, ohne eine neue Manifestation zu erstellen. @de
label: módosító családja a következő: @hu
definition: Hozzákapcsol egy példányt egy családhoz, amely új megjelenési forma létrehozása nélkül idéz elő változást a példányban. @hu
toolkit label: módosító család @hu
toolkit definition: Egy család, amely új megjelenési forma létrehozása nélkül idéz elő változást a példányban @hu
label: ha come modificatore famiglia @it
definition: Correla un item a una famiglia che apporta modifiche a un item senza creare una nuova manifestazione. @it
toolkit label: modificatore famiglia @it
toolkit definition: Famiglia che apporta modifiche a un item senza creare una nuova manifestazione. @it
label: modificētājs (dzimta/ģimene) @lv
definition: Sasaista vienību ar dzimtu/ģimeni, kas veikusi izmaiņas vienībā, neradot jaunu manifestāciju. @lv
toolkit label: modificētājs (dzimta/ģimene) @lv
toolkit definition: Dzimta/ģimene, kas veikusi izmaiņas vienībā, neradot jaunu manifestāciju. @lv
has subproperty: a pour famille relieuse
has subproperty: a pour famille enlumineuse
has subproperty: a pour famille restauratrice d’un item
has subproperty: P40160
label: 有修改者家族 @zh-hans
definition: 将一个单件与对一个单件作修改而不创建一个新的载体表现的一个家族关联起来。 @zh-hans
toolkit label: 修改者家族 @zh-hans
toolkit definition: 对一个单件作修改而不创建一个新的载体表现的一个家族 @zh-hans
label: düzenleyici ailesi ile ilişkilidir @tr
definition: Bir kopyayı, yeni bir gösterim oluşturmadan bir kopyada değişiklik yapan bir aileyle ilişkilendirir. @tr
toolkit label: Dönüştürücü aile @tr
toolkit definition: Yeni bir görünüm oluşturmadan bir kopyada değişiklik yapan bir aile. @tr

a pour personne modificatrice
status: Published
label: has modifier person @en
lexical alias: modifierPerson.en
definition: Relates an item to a person that makes changes to an item without creating a new manifestation. @en
toolkit label: modifier person @en
toolkit definition: A person who makes changes to an item without creating a new manifestation. @en
type: Property
domain: C10003
has element type: 2
sub property of: a pour personne en relation avec un item
sub property of: a pour agent modificateur
definition: Met un item en relation avec une personne qui apporte des modifications à un item sans créer une nouvelle manifestation.
toolkit label: personne modificatrice
toolkit definition: Personne qui apporte des modifications à un item sans créer une nouvelle manifestation.
label: muokkaaja (henkilö) @fi
definition: Liittää kappaleen henkilöön, joka tekee muutoksia kappaleeseen luomatta uutta manifestaatiota. @fi
toolkit label: muokkaaja (henkilö) @fi
toolkit definition: Henkilö, joka tekee muutoksia kappaleeseen luomatta uutta manifestaatiota. @fi
label: har tilpasser (person) @no
definition: Relaterer et eksemplar til en person som gjør endringer på et eksemplar uten å skape en ny manifestasjon. @no
toolkit label: tilpasser (person) @no
toolkit definition: En person som gjør endringer på et eksemplar uten å skape en ny manifestasjon. @no
label: heeft bewerker-persoon @nl
definition: Relateert een item aan een persoon die veranderingen aanbrengt aan een item zonder een nieuwe manifestatie te creëren. @nl
toolkit label: bewerker-persoon @nl
toolkit definition: Een persoon die veranderingen aanbrengt aan een item zonder een nieuwe manifestatie te creëren. @nl
label: له شخص مُعدِّل @ar
definition: يربط مفردة بشخص يقوم بإجراء تغييرات على مفردة دون أن ينشئ تجسيدة جديدة. @ar
toolkit label: شخص مُعدِّل @ar
toolkit definition: شخص يقوم بإجراء تغييرات على مفردة دون أن ينشئ تجسيدة جديدة. @ar
label: té com a persona modificadora @ca
definition: Relaciona un ítem amb una persona que fa canvis a un ítem sense crear una manifestació nova. @ca
toolkit label: persona modificadora @ca
toolkit definition: Persona que fa canvis a un ítem sense crear una manifestació nova. @ca
label: har person, som er tilpasser @da
definition: Relaterer et eksemplar til en person, som ændrer i et eksemplar uden at skabe en ny manifestation. @da
toolkit label: person, som er tilpasser @da
toolkit definition: Person, som ændrer i et eksemplar uden at skabe en ny manifestation. @da
label: muutja (isik) @et
definition: Seostab eksemplari isikuga, kes muudab eksemplari, loomata uut kehastust. @et
toolkit label: muutja (isik) @et
toolkit definition: Isik, kes muudab eksemplari, loomata uut kehastust. @et
label: hat Bearbeiterin/Bearbeiter eines Exemplars (Person) @de
definition: Setzt ein Exemplar in Beziehung zu einer Person, die Änderungen an einem Exemplar vornimmt, ohne eine neue Manifestation zu erstellen. @de
toolkit label: Bearbeiterin/Bearbeiter eines Exemplars (Person) @de
toolkit definition: Eine Person, die Änderungen an einem Exemplar vornimmt, ohne eine neue Manifestation zu erstellen. @de
label: módosító személye a következő: @hu
definition: Hozzákapcsol egy példányt egy személyhez, aki új megjelenési létrehozása nélkül idéz elő változást a példányban. @hu
toolkit label: módosító személye: @hu
toolkit definition: Egy személy, aki új megjelenési létrehozása nélkül idéz elő változást a példányban. @hu
label: ha come modificatore persona @it
definition: Correla un item alla persona che apporta modifiche a un item senza creare una nuova manifestazione. @it
toolkit label: modificatore persona @it
toolkit definition: Persona che apporta modifiche a un item senza creare una nuova manifestazione. @it
label: modificētājs (persona) @lv
definition: Sasaista vienību ar personu, kura veikusi izmaiņas vienībā, neradot jaunu manifestāciju. @lv
toolkit label: modificētājs (persona) @lv
toolkit definition: Persona, kura veikusi izmaiņas vienībā, neradot jaunu manifestāciju. @lv
has subproperty: a pour annotateur
has subproperty: a pour signataire autographe
has subproperty: a pour personne relieuse
has subproperty: a pour personne enlumineuse
has subproperty: a pour dédicateur d’un item
has subproperty: a pour personne restauratrice d’un item
has subproperty: P40112
label: 有修改者个人 @zh-hans
definition: 将一个单件与对一个单件作修改而不创建一个新的载体表现的一个个人关联起来。 @zh-hans
toolkit label: 修改者个人 @zh-hans
toolkit definition: 对一个单件作修改而不创建一个新的载体表现的一个个人 @zh-hans
label: düzenleyici kişisi ile ilişkilidir @tr
definition: Bir kopyayı, yeni bir gösterim oluşturmadan bir kopyada değişiklik yapan bir kişiyle ilişkilendirir. @tr
toolkit label: Dönüştüren kişi @tr
toolkit definition: Yeni bir gösterim yaratmadan bir kopya üzerinde değişiklik yapan kişi. @tr

a pour note sur les dimensions d’un item
status: Published
label: has note on dimensions of item @en
definition: Relates an item to a note on item that provides information on the dimensions of an item. @en
type: Property
domain: C10003
lexical alias: noteOnDimensionsOfItem.en
instruction number: 3.22.3
toolkit label: note on dimensions of item @en
toolkit definition: A note on item that provides information on the dimensions of an item. @en
definition: Met un item en relation avec une note sur un item qui fournit de l’information sur les dimensions d’un item.
toolkit label: note sur les dimensions d’un item
toolkit definition: Note sur un item qui fournit de l’information sur les dimensions d’un item.
toolkit label: nota sobre dimensiones del ítem @es
toolkit definition: Una nota que proporciona información sobre las dimensiones del ítem específico descrito que no esta registrado como parte del elemento dimensiones. @es
sub property of: a pour note sur un item
label: har anmärkning om exemplarets mått @sv
toolkit label: anmärkning om exemplarets mått @sv
label: có ghi chú về kích thước của bản @vi
definition: Liên kết bản với ghi chú cung cấp thông tin về kích thước của bản cụ thể đang được mô tả nhưng không được ghi như là phần của yếu tố kích thước. @vi
toolkit label: ghi chú về kích thước của bản @vi
toolkit definition: Ghi chú cung cấp thông tin về kích thước của bản cụ thể đang được mô tả nhưng không được ghi như là phần của yếu tố kích thước. @vi
label: har note om eksemplars størrelse @da
definition: Relaterer et eksemplar til en note om eksemplar, som giver information om et eksemplars størrelse. @da
toolkit label: note om eksemplars størrelse @da
toolkit definition: Note om eksemplar, som giver information om et eksemplars størrelse. @da
label: hat Anmerkung zu Maßen eines Exemplars @de
definition: Setzt ein Exemplar in Beziehung zu einer Anmerkung zum Exemplar, die Informationen über die Maße eines Exemplars enthält. @de
toolkit label: Anmerkung zu Maßen eines Exemplars @de
toolkit definition: Eine Anmerkung zum Exemplar, die Informationen über die Maße eines Exemplars enthält. @de
label: έχει σημείωση στις διαστάσεις του αντιτύπου @el
definition: Συνδέει ένα ανίτυπο με μια σημείωση που παρέχει πληροφορίες αναφορικά με τις διαστάσεις ενός συγκεκριμένου περιγραφόμενου αντιτύπου οι οποίες δεν καταχωρίζονται ως μέρος του στοιχείου των διαστάσεων. @el
toolkit label: σημείωση στις διαστάσεις του αντιτύπου @el
toolkit definition: Μια σημείωση που παρέχει πληροφορίες αναφορικά με τις διαστάσεις ενός συγκεκριμένου περιγραφόμενου αντιτύπου, οι οποίες δεν καταχωρίζονται ως μέρος του στοιχείου των διαστάσεων. @el
label: té com a nota sobre dimensions d’un ítem @ca
definition: Relaciona un ítem amb una nota sobre l’ítem que proporciona la informació sobre les dimensions d’un ítem. @ca
toolkit label: nota sobre dimensions d’un ítem @ca
toolkit definition: Nota sobre l’ítem que proporciona la informació sobre les dimensions d’un ítem. @ca
definition: Liittää kappaleen huomautukseen, joka antaa tietoa kappaleen koosta. @fi
toolkit label: huomautus kappaleen koosta @fi
toolkit definition: Huomautus, joka antaa tietoa kappaleen koosta. @fi
toolkit label: note om eksemplarets størrelse @no
toolkit definition: En note om eksemplar som gir informasjon om størrelsen til et eksemplar. @no
has element type: 6
label: a példány méretéről szóló megjegyzése a következő: @hu
definition: Hozzákapcsol egy példányt egy példányra tett megjegyzéshez, amely információt nyújt egy példány méretéről. @hu
toolkit label: példány méretéről szóló megjegyzése: @hu
toolkit definition: Egy példányra tett megjegyzés, amely információt nyújt egy példány méretéről. @hu
label: huomautus kappaleen koosta @fi
label: har note om eksemplarets størrelse @no
definition: Relaterer et eksemplar til en note om eksemplar som gir informasjon om størrelsen til et eksemplar. @no
label: heeft noot bij afmetingen van item @nl
definition: Relateert een item aan een noot bij item die informatie geeft over de afmetingen van een item. @nl
toolkit label: noot bij afmetingen van item @nl
toolkit definition: Een noot bij item die informatie geeft over de afmetingen van een item. @nl
label: له تبصرة عن أبعاد مفردة @ar
definition: يربط مفردة بتبصرة عن مفردة توفر معلومات عن أبعاد مفردة. @ar
toolkit label: تبصرة عن أبعاد مفردة @ar
toolkit definition: تبصرة عن مفردة توفر معلومات عن أبعاد مفردة @ar
label: märkus eksemplari mõõtmete kohta @et
definition: Seostab eksemplari märkusega, mis sisaldab infot eksemplari mõõtmete kohta. @et
toolkit label: märkus eksemplari mõõtmete kohta @et
toolkit definition: Märkus, mis sisaldab infot eksemplari mõõtmete kohta. @et
label: piezīme par vienības izmēriem @lv
definition: Sasaista vienību ar piezīmi par vienību, kurā ir ziņas par vienības izmēriem. @lv
toolkit label: piezīme par vienības izmēriem @lv
toolkit definition: Piezīme par vienību, kurā ir ziņas par vienības izmēriem. @lv
has subproperty: P40010
label: 有关于单件尺寸的附注 @zh-hans
definition: 将一个单件与提供关于单件尺寸信息的一个关于单件的附注关联起来。 @zh-hans
toolkit label: 关于单件尺寸的附注 @zh-hans
toolkit definition: 提供关于单件尺寸信息的一个关于单件的附注 @zh-hans
label: kopyanın boyutları hakkında not ile ilişkilidir @tr
definition: Bir kopyayı, kopyanın boyutları hakkında bilgi sağlayan kopya üzerindeki bir notla ilişkilendirir. @tr
toolkit label: Kopyanın boyutları hakkında not @tr
toolkit definition: Bir kopyanın boyutları hakkında bilgi sağlayan kopya üzerine bir not @tr

a pour note sur l’étendue d’un item
status: Published
label: has note on extent of item @en
definition: Relates an item to a note on item that provides information on the extent of an item. @en
type: Property
domain: C10003
lexical alias: noteOnExtentOfItem.en
instruction number: 3.22.2
toolkit label: note on extent of item @en
toolkit definition: A note on item that provides information on the extent of an item. @en
definition: Met un item en relation avec une note sur un item qui fournit de l’information sur l’étendue d’un item.
toolkit label: note sur l’étendue d’un item
toolkit definition: Note sur un item qui fournit de l’information sur l’étendue d’un item.
toolkit label: nota sobre la extensión del ítem @es
toolkit definition: Una nota que proporciona información sobre la extensión del ítem específico descrito que está registrado como parte del elemento extensión @es
sub property of: a pour note sur un item
label: har anmärkning om exemplarets omfång @sv
toolkit label: anmärkning om exemplarets omfång @sv
label: có ghi chú về quy mô của bản @vi
definition: Liên kết bản với ghi chú cung cấp thông tin về quy mô của bản cụ thể đang được mô tả nhưng không được ghi như là phần của yếu tố quy mô. @vi
toolkit label: ghi chú về quy mô của bản @vi
toolkit definition: Ghi chú cung cấp thông tin về quy mô của bản cụ thể đang được mô tả nhưng không được ghi như là phần của yếu tố quy mô. @vi
label: har note om omfang af eksemplar @da
definition: Relaterer et eksemplar til en note om eksemplar, som giver information om et eksemplars omfang. @da
toolkit label: note om omfang af eksemplar @da
toolkit definition: Note om eksemplar, som giver information om et eksemplars omfang. @da
label: hat Anmerkung zum Umfang eines Exemplars @de
definition: Setzt ein Exemplar in Beziehung zu einer Anmerkung zum Exemplar, die Informationen über den Umfang eines Exemplars enthält. @de
toolkit label: Anmerkung zum Umfang eines Exemplars @de
toolkit definition: Eine Anmerkung zum Exemplar, die Informationen über den Umfang eines Exemplars enthält. @de
label: έχει σημείωση στην έκταση του αντιτύπου @el
definition: Συνδέει ένα αντίτυπο με μια σημείωση που παρέχει πληροφορίες αναφορικά με την έκταση ενός συγκεκριμένου περιγραφόμενου αντιτύπου η οποία δεν καταχωρίζεται ως μέρος του στοιχείου της έκτασης. @el
toolkit label: σημείωση στην έκταση του αντιτύπου @el
toolkit definition: Μια σημείωση που παρέχει πληροφορίες αναφορικά με την έκταση ενός συγκεκριμένου περιγραφόμενου αντιτύπου η οποία δεν καταχωρίζεται ως μέρος του στοιχείου της έκτασης. @el
label: té com a nota sobre extensió d’un ítem @ca
definition: Relaciona un ítem amb una nota sobre l’ítem que proporciona la informació sobre l’extensió d’un ítem. @ca
toolkit label: nota sobre extensió d’un ítem @ca
toolkit definition: Nota sobre l’ítem que proporciona la informació sobre l’extensió d’un ítem. @ca
definition: Liittää kappaleen huomautukseen, joka antaa tietoa kappaleen laajuudesta. @fi
toolkit label: huomautus kappaleen laajuudesta @fi
toolkit definition: Huomautus, joka antaa tietoa kappaleen laajuudesta. @fi
toolkit label: note om eksemplarets omfang @no
toolkit definition: En note om eksemplar som gir informasjon om omfanget til et eksemplar. @no
has element type: 6
label: a példány terjedelméről szóló megjegyzése a következő: @hu
definition: Hozzákapcsol egy példányt egy példányra tett megjegyzéshez, amely információt nyújt egy példány terjedelméről. @hu
toolkit label: példány terjedelméről szóló megjegyzése: @hu
toolkit definition: Egy példányra tett megjegyzés, amely információt nyújt egy példány terjedelméről. @hu
label: huomautus kappaleen laajuudesta @fi
label: har note om eksemplarets omfang @no
definition: Relaterer et eksemplar til en note om eksemplar som gir informasjon om omfanget til et eksemplar. @no
label: heeft noot bij omvang van item @nl
definition: Relateert een item aan een noot bij item die informatie geeft over de omvang van een item. @nl
toolkit label: noot bij omvang van item @nl
toolkit definition: Een noot bij item die informatie geeft over de omvang van een item. @nl
label: له تبصرة عن امتداد مفردة @ar
definition: يربط مفردة بتبصرة عن مفردة توفر معلومات عن امتداد مفردة. @ar
toolkit label: تبصرة عن امتداد مفردة @ar
toolkit definition: تبصرة عن مفردة توفر معلومات عن امتداد مفردة. @ar
label: märkus eksemplari mahu kohta @et
definition: Seostab eksemplari märkusega, mis sisaldab infot eksemplari mahu kohta. @et
toolkit label: märkus eksemplari mahu kohta @et
toolkit definition: Märkus, mis sisaldab infot eksemplari mahu kohta. @et
label: ha come nota su estensione dell'item @it
definition: Correla un item a una nota sull'item che fornisce informazioni sull'estensione di un item. @it
toolkit label: ha come nota su estensione dell'item @it
toolkit definition: Nota sull'item che fornisce informazioni sull'estensione dell'item @it
label: piezīme par vienības apjomu @lv
definition: Sasaista vienību ar piezīmi par vienību, kurā ir ziņas par vienības apjomu. @lv
toolkit label: piezīme par vienības apjomu @lv
toolkit definition: Piezīme par vienību, kurā ir ziņas par vienības apjomu. @lv
has subproperty: P40011
label: 有关于单件数量的附注 @zh-hans
definition: 将一个单件与提供关于单件数量信息的一个关于单件的附注关联起来。 @zh-hans
toolkit label: 关于单件数量的附注 @zh-hans
toolkit definition: 提供关于单件数量信息的一个关于单件的附注 @zh-hans
label: gösterimin kapsamı hakkında not ile ilişkilidir @tr
definition: Bir kopyayı, kopyanın kapsamı hakkında bilgi sağlayan kopya üzerindeki bir notla ilişkilendirir. @tr
toolkit label: İfadenin kapsamı hakkında not @tr
toolkit definition: Bir kopyanın kapsamı hakkında bilgi sağlayan kopya hakkında bir not @tr

a pour note sur un item
status: Published
label: has note on item @en
definition: Relates an item to a broad unstructured description of one or more attributes of an item. @en
type: Property
domain: C10003
lexical alias: noteOnItem.en
instruction number: 2.21
toolkit label: note on item @en
toolkit definition: A broad unstructured description of one or more attributes of an item. @en
definition: Met un item en relation avec une description non structurée générale d’un ou plusieurs attributs d’un item.
toolkit label: note sur un item
toolkit definition: Description non structurée générale d’un ou plusieurs attributs d’un item.
toolkit label: nota sobre el ítem @es
toolkit definition: Una nota que proporciona información sobre los atributos del ítem. @es
label: har anmärkning om exemplaret @sv
toolkit label: anmärkning om exemplaret @sv
label: có ghi chú về bản @vi
definition: Liên kết bản với ghi chú cung cấp thông tin về các thuộc tính của bản. @vi
toolkit label: ghi chú về bản @vi
toolkit definition: Ghi chú cung cấp thông tin về các thuộc tính của bản. @vi
label: har note om eksemplar @da
definition: Relaterer et eksemplar til en bred, ustruktureret beskrivelse af en eller flere af et eksemplars attributter. @da
toolkit label: note om eksemplar @da
toolkit definition: Bred, ustruktureret beskrivelse af en eller flere af et eksemplars attributter. @da
label: hat Anmerkung zum Exemplar @de
definition: Setzt ein Exemplar in Beziehung zu einer umfassenden, unstrukturierten Beschreibung eines Merkmals oder mehrerer Merkmale eines Exemplars. @de
toolkit label: Anmerkung zum Exemplar @de
toolkit definition: Eine umfassende, unstrukturierte Beschreibung eines Merkmals oder mehrerer Merkmale eines Exemplars. @de
label: έχει σημείωση στο αντίτυπο @el
definition: Συνδέει ένα αντίτυπο με μια σημείωση που παρέχει πληροφορίες σχετικά με τις ιδιότητες ενός αντιτύπου. @el
toolkit label: σημείωση στο αντίτυπο @el
toolkit definition: Μια σημείωση που παρέχει πληροφορίες σχετικά με τις ιδιότητες ενός αντιτύπου. @el
label: té com a nota sobre un ítem @ca
definition: Relaciona un ítem amb una descripció no estructurada àmplia d’un o més atributs d’un ítem. @ca
toolkit label: nota sobre un ítem @ca
toolkit definition: Descripció no estructurada àmplia d’un o més atributs d’un ítem. @ca
definition: Liittää kappaleen yleisluonteiseen rakenteistamattomaan kuvailuun, joka sisältää kappaleen yhden tai useamman attribuutin. @fi
toolkit label: huomautus kappaleesta @fi
toolkit definition: Yleisluonteinen rakenteistamaton kuvailu, joka sisältää kappaleen yhden tai useamman attribuutin. @fi
toolkit definition: En bred, ustrukturert beskrivelse av ett eller flere attributter for et eksemplar. @no
has element type: 6
sub property of: P00015
label: példányra vonatkozó megjegyzése a következő: @hu
definition: Hozzákapcsol egy példányt egy példány egy vagy több ismérvének átfogó strukturálatlan leírásához. @hu
toolkit label: példányra vonatkozó megjegyzése: @hu
toolkit definition: Egy példány egy vagy több ismérvének átfogó strukturálatlan leírása. @hu
label: huomautus kappaleesta @fi
definition: Relaterer et eksemplar til en bred, ustrukturert beskrivelse av ett eller flere attributter for et eksemplar. @no
label: heeft noot bij item @nl
definition: Relateert een item aan een algemene ongestructureerde beschrijving van één of meer attributen van een item. @nl
toolkit label: noot bij item @nl
toolkit definition: Een algemene ongestructureerde beschrijving van één of meer attributen van een item. @nl
label: لديه تبصرة لمفردة @ar
definition: يربط مفردة بوصف واسع غير محدد لخاصية أو أكثر من خصائص مفردة. @ar
toolkit label: تبصرة عن مفردة @ar
toolkit definition: وصف واسع غير محدد لخصائص مفردة. @ar
label: märkus eksemplari kohta @et
definition: Seostab eksemplari üldise struktureerimata kirjeldusega, mis iseloomustab üht või mitut eksemplari omadust. @et
toolkit label: märkus eksemplari kohta @et
toolkit definition: Üldine struktureerimata kirjeldus, mis iseloomustab üht või mitut eksemplari omadust. @et
label: ha come nota su item @it
definition: Correla un item a un'ampia descrizione non strutturata di uno o più attributi di un item. @it
toolkit label: nota su item @it
toolkit definition: Ampia descrizione non strutturata di uno o più attributi di un item. @it
label: piezīme par vienību @lv
definition: Sasaista vienību ar plašu nestrukturētu vienības viena vai vairāku atribūtu aprakstu. @lv
toolkit label: piezīme par vienību @lv
toolkit definition: Plašs nestrukturēts vienības viena vai vairāku atribūtu apraksts. @lv
has subproperty: a pour modification d’un item
has subproperty: a pour note sur les dimensions d’un item
has subproperty: a pour note sur l’étendue d’un item
has subproperty: P40028
label: 有关于单件的附注 @zh-hans
definition: 将一个单件与关于一个单件的一个或多个属性的宽泛的非结构化的描述关联起来。 @zh-hans
toolkit label: 关于单件的附注 @zh-hans
toolkit definition: 关于一个单件的一个或多个属性的宽泛的非结构化的描述 @zh-hans
label: kopya hakkında not ile ilişkilidir @tr
definition: Bir kopyayı, bir kopyanın bir veya daha fazla özelliğinin geniş, yapılandırılmamış açıklamasıyla ilişkilendirir. @tr
toolkit label: Ürün hakkında not @tr

est sur le disque avec un item
status: Published
label: is on disc with item @en
definition: Relates an item to an item that is contained on the same disc as an item. @en
type: Property
domain: C10003
sub property of: est conservé avec
lexical alias: onDiscWithItem.en
toolkit label: on disc with item @en
toolkit definition: An item that is contained on the same disc as an item. @en
definition: Met un item en relation avec un item qui est contenu sur le même disque qu’un item.
toolkit label: sur le disque avec un item
toolkit definition: Item qui est contenu sur le même disque qu’un item.
toolkit label: en disco con (ítem) @es
toolkit definition: Un ítem que se incluye en el mismo disco que el ítem descrito. @es
instruction number: 24.5
label: là trên đĩa với (bản) @vi
definition: Liên kết bản với bản được chứa trên cùng đĩa với bản đang được mô tả @vi
toolkit label: trên đĩa với (bản) @vi
toolkit definition: Bản được chứa trên cùng đĩa với bản đang được mô tả @vi
label: er på disk sammen med eksemplar @da
definition: Relaterer et eksemplar til et eksemplar, som er indeholdt på samme disk som et andet eksemplar. @da
toolkit label: på disk sammen med eksemplar @da
toolkit definition: Eksemplar, som er indeholdt på samme disk som et andet eksemplar. @da
label: ist auf Disk mit (Exemplar) @de
definition: Setzt ein Exemplar in Beziehung zu einem Exemplar, das auf derselben Disk enthalten ist, wie ein Exemplar. @de
toolkit label: Auf Disk mit (Exemplar) @de
toolkit definition: Ein Exemplar, das auf derselben Disk enthalten ist, wie ein Exemplar. @de
label: είναι στον δίσκο μαζί με (αντίτυπο) @el
definition: Συνδέει ένα αντίτυπο με ένα αντίτυπο το οποίο περιέχεται στον ίδιο δίσκο με ένα περιγραφόμενο αντίτυπο. @el
toolkit label: στον δίσκο μαζί με (αντίτυπο) @el
toolkit definition: Ένα αντίτυπο το οποίο περιέχεται στον ίδιο δίσκο με ένα περιγραφόμενο αντίτυπο. @el
label: és en un disc amb un ítem @ca
definition: Relaciona un ítem amb un ítem que s’inclou en el mateix disc com un ítem. @ca
toolkit label: en un disc amb un ítem @ca
toolkit definition: Ítem que s’inclou en el mateix disc com un ítem. @ca
definition: Liittää kappaleen kappaleeseen, joka on samalla levyllä toisen kappaleen kanssa. @fi
toolkit label: levyllä myös (kappale) @fi
toolkit definition: Kappale, joka on samalla levyllä toisen kappale kanssa. @fi
toolkit label: på plate med eksemplar @no
toolkit definition: Et eksemplar som befinner seg på samme plate som et eksemplar. @no
has element type: 2
label: azonos lemezen a következő példánnyal: @hu
definition: Hozzákapcsol egy példányt egy példányhoz, amely ugyanazon a lemezen található, mint a példány. @hu
toolkit label: azonos lemezen a következő példánnyal: @hu
toolkit definition: Egy példány, amely ugyanazon a lemezen található, mint a példány. @hu
label: levyllä myös (kappale) @fi
label: er på plate med eksemplar @no
definition: Relaterer et eksemplar til et eksemplar som befinner seg på samme plate som et eksemplar. @no
label: is op schijf met item @nl
definition: Relateert een item aan een item dat gehouden wordt op dezelfde disk als een item. @nl
toolkit label: op schijf met item @nl
toolkit definition: Een item dat gehouden wordt op dezelfde disk als een item. @nl
label: هي على قرص مع مفردة @ar
definition: يربط مفردة بمفردة توجد على القرص نفسه كمفردة. @ar
toolkit label: على قرص مع مفردة @ar
toolkit definition: مفردة موجودة على القرص نفسه كمفردة. @ar
label: plaadil ka eksemplar @et
definition: Seostab eksemplari eksemplariga, mis sisaldub eksemplariga samal plaadil. @et
toolkit label: plaadil ka eksemplar @et
toolkit definition: Eksemplar, mis sisaldub eksemplariga samal plaadil. @et
label: è su disco con item @it
definition: Correla un item a un item contenuto come item nello stesso disco. @it
toolkit label: su disco con item @it
toolkit definition: Item a un item contenuto come item nello stesso disco. @it
label: ir izdots diskā kopā ar vienību @lv
definition: Sasaista vienību ar vienību, kas ir ietverta tajā pašā diskā kopā ar aprakstāmo vienību. @lv
toolkit label: izdots diskā kopā ar vienību @lv
toolkit definition: Vienība, kas ir ietverta tajā pašā diskā kopā ar aprakstāmo vienību. @lv
has subproperty: P40035
label: 与单件合盘 @zh-hans
definition: 将一个单件与和一个单件一起包含在同一片盘中的一个单件关联起来。 @zh-hans
toolkit label: 与单件合盘 @zh-hans
toolkit definition: 和一个单件一起包含在同一片盘中的一个单件 @zh-hans
label: kopya ile aynı disk üzerinde yer alır @tr
definition: Bir kopyayı, bir kopyayla aynı diskte bulunan bir kopyayla ilişkilendirir. @tr
toolkit label: kopya ile diskte @tr
toolkit definition: Bir kopyayla aynı diskte bulunan bir kopya. @tr

a pour agent propriétaire
status: Published
label: has owner agent @en
definition: Relates an item to an agent who has current or former legal possession of an item. @en
type: Property
domain: C10003
lexical alias: ownerAgent.en
instruction number: 22.2
toolkit label: owner agent @en
toolkit definition: An agent who has current or former legal possession of an item. @en
definition: Met un item en relation avec un agent qui possède actuellement ou a auparavant possédé légalement un item.
toolkit label: agent propriétaire
toolkit definition: Agent qui possède actuellement ou a auparavant possédé légalement un item.
toolkit label: propietario @es
toolkit definition: Una persona, familia o entidad corporativa que detenta la posesión legal de un ítem (es decir, una copia específica o una instancia de un recurso). @es
label: har ägare @sv
toolkit label: ägare @sv
sub property of: a pour agent en relation avec un item
label: có người chủ @vi
definition: Liên kết bản với tác nhân sở hữu theo pháp luật một bản. @vi
toolkit label: người chủ @vi
toolkit definition: Tác nhân sở hữu theo pháp luật một bản. @vi
label: har agent, som er ejer @da
definition: Relaterer et eksemplar til en agent, som er i lovlig besiddelse af et eksemplar. @da
toolkit label: agent, som er ejer @da
toolkit definition: Agent, som er i lovlig besiddelse af et eksemplar. @da
label: hat Eigentümerin/Eigentümer (Akteur) @de
definition: Setzt ein Exemplar in Beziehung zu einem Akteur, der gegenwärtig oder früher im rechtmäßigen Besitz eines Exemplars ist/war. @de
toolkit label: Eigentümerin/Eigentümer (Akteur) @de
toolkit definition: Ein Akteur, der gegenwärtig oder früher im rechtmäßigen Besitz eines Exemplars ist/war. @de
label: έχει ιδιοκτήτη @el
definition: Συνδέει ένα αντίτυπο με έναν φορέα που έχει τη νόμιμη κατοχή ενός αντιτύπου. @el
toolkit label: ιδιοκτήτης @el
toolkit definition: Ένας φορέας που έχει τη νόμιμη κατοχή ενός αντιτύπου. @el
label: té com a agent propietari @ca
definition: Relaciona un ítem amb un agent que té la propietat legal actual o anterior d’un ítem. @ca
toolkit label: agent propietari @ca
toolkit definition: Agent que té la propietat legal actual o anterior d’un ítem. @ca
definition: Liittää kappaleen toimijaan, jolla on kappaleen nykyinen tai aiempi laillinen omistusoikeus. @fi
toolkit label: omistaja (toimija) @fi
toolkit definition: Toimija, jolla on kappaleen laillinen omistusoikeus. @fi
toolkit label: eier (agent) @no
toolkit definition: En agent som er den rettmessige eieren av et eksemplar. @no
has element type: 2
label: tulajdonos ágense a következő: @hu
definition: Hozzákapcsol egy példányt egy ágenshez, amely törvényesen birtokol egy példányt. @hu
toolkit label: tulajdonos ágense: @hu
toolkit definition: Egy ágens, amely törvényesen birtokol egy példányt. @hu
alternative label: owner @en
alternative label: propriétaire
alternative label: omistaja @fi
label: omistaja (toimija) @fi
label: har eier (agent) @no
definition: Relaterer et eksemplar til en agent som er den rettmessige eieren av et eksemplar. @no
alternative label: eier @no
label: heeft eigenaar-actor @nl
definition: Relateert een item aan een actor die huidig of voormalig wettelijk bezit heeft van een item. @nl
toolkit label: eigenaar-actor @nl
toolkit definition: Een actor die huidig of voormalig wettelijk bezit heeft van een item. @nl
label: له وكيل مالك @ar
definition: يربط مفردة بوكيل لديه الملكية القانونية لمفردة. @ar
alternative label: مالك @ar
toolkit label: وكيل مالك @ar
toolkit definition: وكيل لديه حاليا الملكية القانونية لمفردة. @ar
alternative label: propietari @ca
alternative label: ejer @da
label: omanik (tegija) @et
definition: Seostab eksemplari tegijaga, kellele eksemplar praegu õiguspäraselt kuulub või varem kuulus. @et
alternative label: omanik @et
toolkit label: omanik (tegija) @et
toolkit definition: Tegija, kellele eksemplar praegu õiguspäraselt kuulub või varem kuulus. @et
alternative label: tulajdonosa: @hu
label: ha come proprietario agente @it
definition: Correla un item a un agente che ha la proprietà giuridica di un item. @it
alternative label: proprietario @it
toolkit label: proprietario agente @it
toolkit definition: Agente che ha la proprietà giuridica di un item. @it
label: īpašnieks (aģents) @lv
definition: Sasaista vienību ar aģentu, kam ir vai ir bijušas likumīgas tiesības uz īpašumu. @lv
toolkit label: īpašnieks (aģents) @lv
toolkit definition: Aģents, kam ir vai ir bijušas likumīgas tiesības uz īpašumu. @lv

a pour agent collectif propriétaire
status: Published
label: has owner collective agent @en
lexical alias: ownerCollectiveAgent.en
definition: Relates an item to a collective agent who has current or former legal possession of an item. @en
toolkit label: owner collective agent @en
toolkit definition: A collective agent who has current or former legal possession of an item. @en
type: Property
domain: C10003
has element type: 2
sub property of: a pour agent collectif en relation avec un item
sub property of: a pour agent propriétaire
definition: Met un item en relation avec un agent collectif qui possède actuellement ou a auparavant possédé légalement un item.
toolkit label: agent collectif propriétaire
toolkit definition: Agent collectif qui possède actuellement ou a auparavant possédé légalement un item.
label: omistaja (yhteistoimija) @fi
definition: Liittää kappaleen yhteistoimijaan, jolla on kappaleen nykyinen tai aiempi laillinen omistusoikeus. @fi
toolkit label: omistaja (yhteistoimija) @fi
toolkit definition: Yhteistoimija, jolla on kappaleen nykyinen tai aiempi laillinen omistusoikeus. @fi
label: har eier (kollektiv agent) @no
definition: Relaterer et eksemplar til en kollektiv agent som er den rettmessige eieren av et eksemplar. @no
toolkit label: eier (kollektiv agent) @no
toolkit definition: En kollektiv agent som er den rettmessige eieren av et eksemplar. @no
label: heeft eigenaar-collectieve actor @nl
definition: Relateert een item aan een collectieve actor die huidig of voormalig wettelijk bezit heeft van een item. @nl
toolkit label: eigenaar-collectieve actor @nl
toolkit definition: Een collectieve actor die huidig of voormalig wettelijk bezit heeft van een item. @nl
label: له وكيل جماعي مالك @ar
definition: يربط مفردة بوكيل جماعي لديه الملكية القانونية لمفردة. @ar
toolkit label: وكيل جماعي مالك @ar
toolkit definition: وكيل جماعي لديه الملكية القانونية لمفردة. @ar
label: té com a agent col·lectiu propietari @ca
definition: Relaciona un ítem amb un agent col·lectiu que té la propietat legal actual o anterior d’un ítem. @ca
toolkit label: agent col·lectiu propietari @ca
toolkit definition: Agent col·lectiu que té la propietat legal actual o anterior d’un ítem. @ca
label: har kollektiv agent, som er ejer @da
definition: Relaterer et eksemplar til en kollektiv agent, som er i lovlig besiddelse af et eksemplar. @da
toolkit label: kollektiv agent, som er ejer @da
toolkit definition: Kollektiv agent, som er i lovlig besiddelse af et eksemplar. @da
label: omanik (kollektiiv) @et
definition: Seostab eksemplari kollektiiviga, kellele eksemplar praegu õiguspäraselt kuulub või varem kuulus. @et
toolkit label: omanik (kollektiiv) @et
toolkit definition: Kollektiiv, kellele eksemplar praegu õiguspäraselt kuulub või varem kuulus. @et
label: hat Eigentümerin/Eigentümer (Gemeinschaftlicher Akteur) @de
definition: Setzt ein Exemplar in Beziehung zu einem gemeinschaftlichen Akteur, der gegenwärtig oder früher im rechtmäßigen Besitz eines Exemplars ist/war. @de
toolkit label: Eigentümerin/Eigentümer (Gemeinschaftlicher Akteur) @de
toolkit definition: Ein gemeinschaftlicher Akteur, der gegenwärtig oder früher im rechtmäßigen Besitz eines Exemplars ist/war. @de
label: tulajdonos kollektív ágense a következő: @hu
definition: Hozzákapcsol egy példányt egy kollektív ágenshez, amely törvényesen birtokol egy példányt. @hu
toolkit label: tulajdonos kollektív ágense: @hu
toolkit definition: Egy kollektív ágens, amely törvényesen birtokol egy példányt. @hu
label: ha come proprietario agente collettivo @it
definition: Correla un item a un agente collettivo che detiene la proprietà giuridica di un item. @it
toolkit label: proprietario agente collettivo @it
toolkit definition: Agente collettivo che detiene la proprietà giuridica di un item. @it
label: īpašnieks (grupa) @lv
definition: Sasaista vienību ar grupu, kam ir vai ir bijušas likumīgas tiesības uz īpašumu. @lv
toolkit label: īpašnieks (grupa) @lv
toolkit definition: Grupa, kam ir vai ir bijušas likumīgas tiesības uz īpašumu. @lv
has subproperty: a pour agent collectif propriétaire actuel
has subproperty: a pour ancien agent collectif propriétaire
has subproperty: a pour collectivité propriétaire
has subproperty: a pour famille propriétaire
has subproperty: P40120
label: 有拥有者集体行为者 @zh-hans
definition: 将一个单件与拥有对一个单件当前或先前法定所有权的一个集体行为者关联起来。 @zh-hans
toolkit label: 拥有者集体行为者 @zh-hans
toolkit definition: 拥有对一个单件当前或先前法定所有权的一个集体行为者 @zh-hans
label: sahip kolektif temsilcisi ile ilişkilidir @tr
definition: Bir kopyayı, bir kopyanın şu anda veya daha önce yasal mülkiyetine sahip olan kolektif bir temsilciyle ilişkilendirir. @tr
toolkit label: Sahip olan kolektif temsilci @tr
toolkit definition: Bir kopyanın mevcut veya eski yasal mülkiyetine sahip olan kolektif bir temsilci. @tr

a pour collectivité propriétaire
status: Published
label: has owner corporate body @en
lexical alias: ownerCorporateBody.en
definition: Relates an item to a corporate body who has current or former legal possession of an item. @en
toolkit label: owner corporate body @en
toolkit definition: A corporate body who has current or former legal possession of an item. @en
type: Property
domain: C10003
has element type: 2
sub property of: a pour collectivité en relation avec un item
sub property of: a pour agent collectif propriétaire
definition: Met un item en relation avec une collectivité qui possède actuellement ou a auparavant possédé légalement un item.
toolkit label: collectivité propriétaire
toolkit definition: Collectivité qui possède actuellement ou a auparavant possédé légalement un item.
label: omistaja (yhteisö) @fi
definition: Liittää kappaleen yhteisöön, jolla on kappaleen nykyinen tai aiempi laillinen omistusoikeus. @fi
toolkit label: omistaja (yhteisö) @fi
toolkit definition: Yhteisö, jolla on kappaleen nykyinen tai aiempi laillinen omistusoikeus. @fi
label: har eier (korporasjon) @no
definition: Relaterer et eksemplar til en korporasjon som er den rettmessige eieren av et eksemplar. @no
toolkit label: eier (korporasjon) @no
toolkit definition: En korporasjon som er den rettmessige eieren av et eksemplar. @no
label: heeft eigenaar-corporatie @nl
definition: Relateert een item aan een corporatie die huidig of voormalig wettelijk bezit heeft van een item. @nl
toolkit label: eigenaar-corporatie @nl
toolkit definition: Een corporatie die huidig of voormalig wettelijk bezit heeft van een item. @nl
label: له هيئة مالكة @ar
definition: يربط مفردة بهيئة لديها الملكية القانونية حاليا أو سابقا لمفردة. @ar
toolkit label: هيئة مالكة @ar
toolkit definition: هيئة لديها الملكية القانونية حاليا أو سابقا لمفردة. @ar
label: té com a entitat corporativa propietària @ca
definition: Relaciona un ítem amb una entitat corporativa que té la propietat legal actual o anterior d’un ítem. @ca
toolkit label: entitat corporativa propietària @ca
toolkit definition: Entitat corporativa que té la propietat legal actual o anterior d’un ítem. @ca
label: har korporation, som er ejer @da
definition: Relaterer et eksemplar til en korporation, som er i lovlig besiddelse af et eksemplar. @da
toolkit label: korporation, som er ejer @da
toolkit definition: Korporation, som er i lovlig besiddelse af et eksemplar. @da
label: omanik (asutus) @et
definition: Seostab eksemplari asutusega, kellele eksemplar praegu õiguspäraselt kuulub või varem kuulus. @et
toolkit label: omanik (asutus) @et
toolkit definition: Asutus, kellele eksemplar praegu õiguspäraselt kuulub või varem kuulus. @et
label: hat Eigentümerin/Eigentümer (Körperschaft) @de
definition: Setzt ein Exemplar in Beziehung zu einer Körperschaft, die gegenwärtig oder früher im rechtmäßigen Besitz eines Exemplars ist/war. @de
toolkit label: Eigentümerin/Eigentümer (Körperschaft) @de
toolkit definition: Eine Körperschaft, die gegenwärtig oder früher im rechtmäßigen Besitz eines Exemplars ist/war. @de
label: tulajdonos testülete a következő: @hu
definition: Egy példányt hozzákapcsol egy testülethez, amely törvényesen birtokolja a példányt. @hu
toolkit label: tulajdonos testülete: @hu
toolkit definition: Egy testület, amely törvényesen birtokol egy példányt. @hu
label: ha come proprietario ente @it
definition: Correla un item a un ente che detiene la proprietà giuridica di un item. @it
toolkit label: proprietario ente @it
toolkit definition: Ente che detiene la proprietà giuridica di un item. @it
label: īpašnieks (institūcija) @lv
definition: Sasaista vienību ar institūciju, kam ir vai ir bijušas likumīgas tiesības uz īpašumu. @lv
toolkit label: īpašnieks (institūcija) @lv
toolkit definition: Institūcija, kam ir vai ir bijušas likumīgas tiesības uz īpašumu. @lv
has subproperty: a pour collectivité propriétaire actuelle
has subproperty: a pour ancienne collectivité propriétaire
has subproperty: P40136
label: 有拥有者团体 @zh-hans
definition: 将一个单件与拥有对一个单件当前或先前法定所有权的一个团体关联起来。 @zh-hans
toolkit label: 拥有者团体 @zh-hans
toolkit definition: 拥有对一个单件当前或先前法定所有权的一个团体 @zh-hans
label: sahip tüzel kişisi ile ilişkilidir @tr
definition: Bir kopyayı, bir kopyayı mevcut veya eski yasal mülkiyetine sahip olan tüzel bir kişiyle ilişkilendirir. @tr
toolkit label: sahip olan tüzel kişi @tr
toolkit definition: Bir kopyanın mevcut veya eski yasal mülkiyetine sahip olan bir tüzel kişi. @tr

a pour famille propriétaire
status: Published
label: has owner family @en
lexical alias: ownerFamily.en
definition: Relates an item to a family who has current or former legal possession of an item. @en
toolkit label: owner family @en
toolkit definition: A family who has current or former legal possession of an item. @en
type: Property
domain: C10003
has element type: 2
sub property of: a pour famille en relation avec un item
sub property of: a pour agent collectif propriétaire
definition: Met un item en relation avec une famille qui possède actuellement ou a auparavant possédé légalement un item.
toolkit label: famille propriétaire
toolkit definition: Famille qui possède actuellement ou a auparavant possédé légalement un item.
label: omistaja (suku) @fi
definition: Liittää kappaleen sukuun, jolla on kappaleen nykyinen tai aiempi laillinen omistusoikeus. @fi
toolkit label: omistaja (suku) @fi
toolkit definition: Suku, jolla on kappaleen nykyinen tai aiempi laillinen omistusoikeus. @fi
label: har eier (familie) @no
definition: Relaterer et eksemplar til en familie som er den rettmessige eieren av et eksemplar. @no
toolkit label: eier (familie) @no
toolkit definition: En familie som er den rettmessige eieren av et eksemplar. @no
label: heeft eigenaar-familie @nl
definition: Relateert een item aan een familie die huidig of voormalig wettelijk bezit heeft van een item. @nl
toolkit label: eigenaar-familie @nl
toolkit definition: Een familie die huidig of voormalig wettelijk bezit heeft van een item. @nl
label: له عائلة مالكة @ar
definition: يربط مفردة بعائلة لديها حاليا الملكية القانونية لمفردة @ar
toolkit label: عائلة مالكة @ar
toolkit definition: عائلة لديها حاليا الملكية القانونية لمفردة @ar
label: té com a família propietària @ca
definition: Relaciona un ítem amb una família que té la propietat legal actual o anterior d’un ítem. @ca
toolkit label: família propietària @ca
toolkit definition: Família que té la propietat legal actual o anterior d’un ítem. @ca
label: har familie, som er ejer @da
definition: Relaterer et eksemplar til en familie, som er i lovlig besiddelse af et eksemplar. @da
toolkit label: familie, som er ejer @da
toolkit definition: Familie, som er i lovlig besiddelse af et eksemplar. @da
label: omanik (perekond) @et
definition: Seostab eksemplari perekonnaga, kellele eksemplar praegu õiguspäraselt kuulub või varem kuulus. @et
toolkit label: omanik (perekond) @et
toolkit definition: Perekond, kellele eksemplar praegu õiguspäraselt kuulub või varem kuulus. @et
label: hat Eigentümerin/Eigentümer (Familie) @de
definition: Setzt ein Exemplar in Beziehung zu einer Familie, die gegenwärtig oder früher im rechtmäßigen Besitz eines Exemplars ist/war. @de
toolkit label: Eigentümerin/Eigentümer (Familie) @de
toolkit definition: Eine Familie, die gegenwärtig oder früher im rechtmäßigen Besitz eines Exemplars ist/war. @de
label: tulajdonos családja a következő: @hu
definition: Egy példányt hozzákapcsol egy családhoz, amely törvényesen birtokol egy példányt. @hu
toolkit label: tulajdonos család @hu
toolkit definition: Egy család, amely törvényesen birtokol egy példányt. @hu
label: ha come proprietario famiglia @it
definition: Correla un item con una famiglia che detiene la proprietà giuridica di un item. @it
toolkit label: proprietario famiglia @it
toolkit definition: Famiglia che detiene la proprietà giuridica di un item. @it
label: īpašnieks (dzimta/ģimene) @lv
definition: Sasaista vienību ar dzimtu/ģimeni, kam ir vai ir bijušas likumīgas tiesības uz īpašumu. @lv
toolkit label: īpašnieks (dzimta/ģimene) @lv
toolkit definition: Dzimta/ģimene, kam ir vai ir bijušas likumīgas tiesības uz īpašumu. @lv
has subproperty: a pour famille propriétaire actuelle
has subproperty: a pour ancienne famille propriétaire
has subproperty: P40152
label: 有拥有者家族 @zh-hans
definition: 将一个单件与拥有对一个单件当前或先前法定所有权的一个家族关联起来。 @zh-hans
toolkit label: 拥有者家族 @zh-hans
toolkit definition: 拥有对一个单件当前或先前法定所有权的一个家族 @zh-hans
label: sahip ailesi ile ilişkilidir @tr
definition: Bir kopyayı, bir kopyanın mevcut veya daha önce yasal mülkiyetine sahip olan bir aileyle ilişkilendirir. @tr
toolkit label: Sahip aile @tr
toolkit definition: Bir kopyanın mevcut veya eski yasal mülkiyetine sahip olan bir aile. @tr

a pour personne propriétaire
status: Published
label: has owner person @en
lexical alias: ownerPerson.en
definition: Relates an item to a person who has current or former legal possession of an item. @en
toolkit label: owner person @en
toolkit definition: A person who has current or former legal possession of an item. @en
type: Property
domain: C10003
has element type: 2
sub property of: a pour personne en relation avec un item
sub property of: a pour agent propriétaire
definition: Met un item en relation avec une personne qui possède actuellement ou a auparavant possédé légalement un item.
toolkit label: personne propriétaire
toolkit definition: Personne qui possède actuellement ou a auparavant possédé légalement un item.
label: omistaja (henkilö) @fi
definition: Liittää kappaleen henkilöön, jolla on kappaleen nykyinen tai aiempi laillinen omistusoikeus. @fi
toolkit label: omistaja (henkilö) @fi
toolkit definition: Henkilö, jolla on kappaleen nykyinen tai aiempi laillinen omistusoikeus. @fi
label: har eier (person) @no
definition: Relaterer et eksemplar til en person som er den rettmessige eieren av et eksemplar. @no
toolkit label: eier (person) @no
toolkit definition: En person som er den rettmessige eieren av et eksemplar. @no
label: heeft eigenaar-persoon @nl
definition: Relateert een item aan een persoon die huidig of voormalig wettelijk bezit heeft van een item. @nl
toolkit label: eigenaar-persoon @nl
toolkit definition: Een persoon die huidig of voormalig wettelijk bezit heeft van een item. @nl
label: له شخص مالك @ar
definition: يربط مفردة بشخص لديه الملكية القانونية لمفردة. @ar
toolkit label: شخص مالك @ar
toolkit definition: شخص لديه حاليا أو سابقا الملكية القانونية لمفردة @ar
label: té com a persona propietària @ca
definition: Relaciona un ítem amb una persona que té la propietat legal actual o anterior d’un ítem. @ca
toolkit label: persona propietària @ca
toolkit definition: Persona que té la propietat legal actual o anterior d’un ítem. @ca
label: har person, som er ejer @da
definition: Relaterer et eksemplar til en person, som er i lovlig besiddelse af et eksemplar. @da
toolkit label: person, som er ejer @da
toolkit definition: Person, som er i lovlig besiddelse af et eksemplar. @da
label: omanik (isik) @et
definition: Seostab eksemplari isikuga, kellele eksemplar praegu õiguspäraselt kuulub või varem kuulus. @et
toolkit label: omanik (isik) @et
toolkit definition: Isik, kellele eksemplar praegu õiguspäraselt kuulub või varem kuulus. @et
label: hat Eigentümerin/Eigentümer (Person) @de
definition: Setzt ein Exemplar in Beziehung zu einer Person, die gegenwärtig oder früher im rechtmäßigen Besitz eines Exemplars ist/war. @de
toolkit label: Eigentümerin/Eigentümer (Person) @de
toolkit definition: Eine Person, die gegenwärtig oder früher im rechtmäßigen Besitz eines Exemplars ist/war. @de
label: tulajdonos személye a következő: @hu
definition: Hozzákapcsol egy példányt egy személyhez, aki törvényesen birtokol egy példányt. @hu
toolkit label: tulajdonos személye: @hu
toolkit definition: Egy személy, aki törvényesen birtokol egy példányt . @hu
label: ha come proprietario persona @it
definition: Correla un item a una persona che detiene la proprietà giuridica di un item. @it
toolkit label: proprietario persona @it
toolkit definition: Persona che detiene la proprietà giuridica di un item. @it
label: īpašnieks (persona) @lv
definition: Sasaista vienību ar personu, kurai ir vai ir bijušas likumīgas tiesības uz īpašumu. @lv
toolkit label: īpašnieks (persona) @lv
toolkit definition: Persona, kurai ir vai ir bijušas likumīgas tiesības uz īpašumu. @lv
has subproperty: a pour personne propriétaire actuelle
has subproperty: a pour ancienne personne propriétaire
has subproperty: P40104
label: 有拥有者个人 @zh-hans
definition: 将一个单件与拥有对一个单件当前或先前法定所有权的一个个人关联起来。 @zh-hans
toolkit label: 拥有者个人 @zh-hans
toolkit definition: 拥有对一个单件当前或先前法定所有权的一个个人 @zh-hans
label: sahip kişisi ile ilişkilidir @tr
definition: Bir kopyayı, bir kopyanın mevcut veya daha önce yasal mülkiyetine sahip olan bir kişiyle ilişkilendirir. @tr
toolkit label: sahip olan kişi @tr
toolkit definition: Bir kopyanın mevcut veya eski yasal mülkiyetine sahip olan bir kişi. @tr

a pour titre privilégié d’un item
status: Published
type: Property
label: has preferred title of item @en
lexical alias: preferredTitleOfItem.en
definition: Relates an item to a nomen that is a title of item that is selected for preference in a specific application or context. @en
domain: C10003
toolkit label: preferred title of item @en
toolkit definition: A nomen that is a title of item that is selected for preference in a specific application or context. @en
sub property of: a pour titre d’item
has element type: 3
sub property of: P00021
definition: Met un item en relation avec un nomen qui est un titre d’item faisant l’objet d’un choix privilégié dans une application ou un contexte spécifiques.
toolkit label: titre privilégié d’un item
toolkit definition: Nomen qui est un titre d’item faisant l’objet d’un choix privilégié dans une application ou un contexte spécifiques.
label: kappaleen ensisijainen nimeke @fi
definition: Liittää kappaleen nomeniin, joka on kappaleen nimeke, joka on valittu ensisijaiseksi tietyssä sovelluksessa tai kontekstissa. @fi
toolkit label: kappaleen ensisijainen nimeke @fi
toolkit definition: Nomen, joka on kappaleen nimeke, joka on valittu ensisijaiseksi tietyssä sovelluksessa tai kontekstissa. @fi
label: har foretrukket tittel for eksemplar @no
definition: Relaterer et eksemplar til en tittel for eksemplar som er valgt som foretrukket tittel i en spesifikk applikasjon eller kontekst. @no
toolkit label: foretrukket tittel for eksemplar @no
toolkit definition: En tittel for eksemplar som er valgt som foretrukket tittel i en spesifikk applikasjon eller kontekst. @no
label: heeft geprefereerde titel van item @nl
definition: Relateert een item aan een nomen dat is een titel van item die als voorkeursterm geselecteerd is in een specifieke toepassing of context. @nl
toolkit label: geprefereerde titel van item @nl
toolkit definition: Een nomen dat is een titel van item die als voorkeursterm geselecteerd is in een specifieke toepassing of context. @nl
label: له عنوان مفردة مفضل @ar
definition: يربط مفردة بتسمية هي عنوان مفردة اختير للتفضيل في تطبيق أو في سياق محدد. @ar
toolkit label: عنوان مفردة مفضل @ar
toolkit definition: عنوان مفردة اختير للتفضيل في تطبيق أو في سياق محدد. @ar
label: té com a títol preferit d’ítem @ca
definition: Relaciona un ítem amb nomen que és un títol d’ítem que se selecciona com a preferent en una aplicació o un context específic. @ca
toolkit label: títol preferit d’ítem @ca
toolkit definition: Nomen que és un títol d’ítem que se selecciona com a preferent en una aplicació o un context específic. @ca
label: har foretrukken titel på eksemplar @da
definition: Relaterer et eksemplar til en titel på eksemplar, som er valgt som præference i en specifik anvendelse eller kontekst. @da
toolkit label: foretrukken titel på eksemplar @da
toolkit definition: Titel på eksemplar, som er valgt som præference i en specifik anvendelse eller kontekst. @da
label: eksemplari eelispealkiri @et
definition: Seostab eksemplari eksemplari pealkirjaga, mis kindlas rakenduses või kontekstis on valitud eelistatuks. @et
toolkit label: eksemplari eelispealkiri @et
toolkit definition: Eksemplari pealkiri, mis kindlas rakenduses või kontekstis on valitud eelistatuks. @et
label: hat bevorzugten Titel eines Exemplars @de
definition: Setzt ein Exemplar in Beziehung zu einem Titel eines Exemplars, der in einer bestimmten Anwendung oder in einem bestimmten Kontext als Vorzugsform bestimmt wird. @de
toolkit label: bevorzugter Titel eines Exemplars @de
toolkit definition: Ein Titel eines Exemplars, der in einer bestimmten Anwendung oder in einem bestimmten Kontext als Vorzugsform bestimmt wird. @de
label: példány előnyben részesített címe a következő: @hu
definition: Hozzákapcsol egy példány egy nomenhez, amely egy példány olyan címe, amelyet egy adott alkalmazásban vagy kontextusban előnyben részesítenek. @hu
toolkit label: példány előnyben részesített címe: @hu
toolkit definition: Egy nomen, amely egy példány olyan címe, amelyet egy adott alkalmazásban vagy kontextusban előnyben részesítenek. @hu
label: ha come titolo preferito di item @it
definition: Correla un item a un titolo di item, selezionato come preferito in un'applicazione o contesto specifici. @it
toolkit label: titolo preferito di item @it
toolkit definition: Titolo di item, selezionato come preferito in un'applicazione o contesto specifici. @it
label: vienības prioritārais nosaukums @lv
definition: Sasaista vienību ar nomenu, kas ir vienības nosaukums, kas ir izvēlēts noteiktam lietojumam vai noteiktā kontekstā. @lv
toolkit label: vienības prioritārais nosaukums @lv
toolkit definition: Vienības nosaukums, kas ir izvēlēts noteiktam lietojumam vai noteiktā kontekstā. @lv
has subproperty: P40085
label: 有单件的首选检索点 @zh-hans
definition: 将一个单件与作为单件的一个题名并在一个特定的应用或语境下被首选的一个命名关联起来。 @zh-hans
toolkit label: 单件的首选检索点 @zh-hans
toolkit definition: 作为单件的一个题名并在一个特定的应用或语境下被首选的一个命名 @zh-hans
label: tercih edilen kopya başlığı ile ilişkilidir @tr
definition: Bir kopyayı, belirli bir uygulama veya bağlamda tercih edilmek üzere seçilen bir kopya başlığı olan bir isimle ilişkilendirir. @tr
toolkit label: Öğenin tercih edilen başlığı @tr
toolkit definition: Belirli bir uygulama veya bağlamda tercih için seçilen bir kopyanın başlığı olan bir isim. @tr

a pour fac-similé de conservation (item)
status: Deprecated
type: Property
domain: C10003
definition: Met un item en relation avec un item qui consiste en une reproduction exacte sur un support de qualité conservation, tel qu’un papier permanent sans acide ou un papier d’archivage.
toolkit label: fac-similé de conservation (item)
toolkit definition: Item qui consiste en une reproduction exacte sur un support de qualité conservation, tel qu’un papier permanent sans acide ou un papier d’archivage.
toolkit label: facsímil de preservación (ítem) @es
toolkit definition: Un ítem que consiste en una reproducción exacta sobre un medio con calidad de preservación, tal como papel libre de ácido o papel de archivo. @es
sub property of: a pour fac-similé (item)
instruction number: 24.5
label: có sao chép bảo quản (bản) @vi
definition: Liên kết bản với bản gồm có bản tạo lại chính xác trên phương tiện chất lượng bảo quản, như là giấy vĩnh cửu phi axit hoặc giấy lưu trữ. @vi
toolkit label: bản sao chép bản quản (bản) @vi
toolkit definition: Bản gồm có bản tạo lại chính xác trên phương tiện chất lượng bảo quản, như là giấy vĩnh cửu phi axit hoặc giấy lưu trữ. @vi
label: har bevaringsfaksimile (eksemplar) @da
definition: Relaterer et eksemplar til et eksemplar, der består af en nøjagtig reproduktion på et medium af bevaringskvalitet, såsom syrefrit permanent- eller arkivpapir. @da
toolkit label: bevaringsfaksimile eksemplar @da
toolkit definition: Eksemplar, der består af en nøjagtig reproduktion på et medium af bevaringskvalitet, såsom syrefrit permanent- eller arkivpapir. @da
label: hat Bestandserhaltungsfaksimile (Exemplar) @de
definition: Setzt ein Exemplar mit einem Exemplar, das aus einer exakten Reproduktion auf bestandserhaltenden Medien, wie z. B. säurefreiem oder Archivpapier, besteht, in Beziehung. @de
toolkit label: Bestandserhaltungsfaksimile (Exemplar) @de
toolkit definition: Ein Exemplar, das aus einer exakten Reproduktion auf bestandserhaltenden Medien, wie z. B. säurefreiem oder Archivpapier, besteht. @de
label: έχει διατήρηση ομοιότυπου (αντίτυπο) @el
definition: Συνδέει ένα αντίτυπο με ένα αντίτυπο το οποίο συνίσταται από μια ακριβή αναπαραγωγή πάνω σε μέσα διατήρησης της ποιότητας, όπως αντιόξινο μόνιμο ή αρχειακό χαρτί. @el
toolkit label: διατήρηση ομοιότυπου (αντίτυπο) @el
toolkit definition: Ένα αντίτυπο το οποίο συνίσταται από μια ακριβή αναπαραγωγή πάνω σε μέσα διατήρησης της ποιότητας, όπως αντιόξινο μόνιμο ή αρχειακό χαρτί. @el
label: té com a facsímil de preservació (ítem) @ca
definition: Relaciona un item amb un ítem que consisteix en una reproducció exacta en un suport de preservació de qualitat, com ara paper permanent no àcid o paper d’arxiu. @ca
toolkit label: facsímil de preservació (ítem) @ca
toolkit definition: Ítem que consisteix en una reproducció exacta en un suport de preservació de qualitat, com ara paper permanent no àcid o paper d’arxiu. @ca
label: säilytyskopio (kappale) @fi
definition: Liittää kappaleen kappaleeseen, joka on arkistokelpoinen (kuten hapoton arkistopaperi), täysin identtinen jäljennös. @fi
toolkit label: säilytyskopio (kappale) @fi
toolkit definition: Kappale, joka on arkistokelpoinen (kuten hapoton arkistopaperi), täysin identtinen jäljennös. @fi
toolkit label: bevaringskopi (eksemplar) @no
toolkit definition: Et eksemplar som består av en eksakt reproduksjon på et medium av bevaringskvalitet, for eksempel syrefritt pergament eller arkivpapir. @no
lexical alias: preservationFacsimileItem.en
has subproperty: P40059

a pour fac-similé de conservation d’un item
status: Published
label: has preservation facsimile of item @en
type: Property
lexical alias: preservationFacsimileOfItem.en
definition: Relates an item to a manifestation that consists of an exact reproduction of an item on preservation-quality media, such as acid-free permanent or archival paper. @en
domain: C10003
sub property of: a pour fac-similé d’un item
toolkit label: preservation facsimile of item @en
toolkit definition: A manifestation that consists of an exact reproduction of an item on preservation-quality media, such as acid-free permanent or archival paper. @en
has element type: 2
definition: Met un item en relation avec une manifestation qui consiste en une reproduction exacte d’un item sur un support de qualité conservation, tel qu’un papier permanent sans acide ou un papier d’archivage.
toolkit label: fac-similé de conservation d’un item
toolkit definition: Manifestation qui consiste en une reproduction exacte d’un item sur un support de qualité conservation, tel qu’un papier permanent sans acide ou un papier d’archivage.
alternative label: preservation facsimile (item) @en
label: kappaleen säilytyskopio @fi
definition: Liittää kappaleen manifestaatioon, joka koostuu kappaleen täsmällisestä jäljennöksestä. Jäljennöksen valmistuksessa on käytetty arkistokelpoista materiaalia, esim. arkistopaperia. @fi
toolkit label: kappaleen säilytyskopio @fi
toolkit definition: Manifestaatio, joka koostuu kappaleen täsmällisestä jäljennöksestä. Jäljennöksen valmistuksessa on käytetty arkistokelpoista materiaalia, esim. arkistopaperia. @fi
label: har bevaringskopi av eksemplar @no
definition: Relaterer et eksemplar til en manifestasjon som består av en nøyaktig reproduksjon av et eksemplar på et medium av bevaringskvalitet, som for eksempel syrefritt papir eller arkivpapir. @no
toolkit label: bevaringskopi av eksemplar @no
toolkit definition: En manifestasjon som består av en nøyaktig reproduksjon av et eksemplar på et medium av bevaringskvalitet, som for eksempel syrefritt papir eller arkivpapir. @no
label: heeft conservatiefacsimile van item @nl
definition: Relateert een item aan een manifestatie die bestaat uit een exacte reproductie van een item op een medium van conserveringskwaliteit, zoals zuurvrij permanent- of archiefpapier. @nl
toolkit label: conservatiefacsimile van item @nl
toolkit definition: Een manifestatie die bestaat uit een exacte reproductie van een item op een medium van conserveringskwaliteit, zoals zuurvrij permanent- of archiefpapier. @nl
alternative label: säilytyskopio (kappale) @fi
label: له حفظ لنسخة طبق الأصل من مفردة @ar
definition: يربط مفردة بتجسيدة تتكون من استنساخ تام لمفردة على وسيط حفظ عالي الجودة، مثل ورق خال من الأحماض @ar
toolkit label: حفظ نسخة طبق الأصل من مفردة @ar
toolkit definition: تجسيدة تتكون من استنساخ كامل لمفردة على وسيط حفظ عالي الجودة، مثل ورق خال من الأحماض. @ar
label: té com a facsímil de preservació d’un ítem @ca
definition: Relaciona un ítem amb una manifestació que consisteix en una reproducció exacta d’un ítem en un suport de preservació de qualitat, com ara paper permanent no àcid o paper d’arxiu. @ca
toolkit label: facsímil de preservació d’un ítem @ca
toolkit definition: Manifestació que consisteix en una reproducció exacta d’un ítem en un suport de preservació de qualitat, com ara paper permanent no àcid o paper d’arxiu. @ca
label: har bevaringsfaksimile af eksemplar @da
definition: Relaterer et eksemplar til en manifestation, som består af en nøjagtig reproduktion af et eksemplar på et medium af bevaringskvalitet, såsom syrefrit permanent- eller arkivpapir. @da
toolkit label: bevaringsfaksimile af eksemplar @da
toolkit definition: Manifestation, som består af en nøjagtig reproduktion af et eksemplar på et medium af bevaringskvalitet, såsom syrefrit permanent- eller arkivpapir. @da
label: eksemplari säilituskoopia @et
definition: Seostab eksemplari kehastusega, mis on eksemplari täpne reproduktsioon arhiivikvaliteediga meediumil, nt happevabal vananemiskindlal ehk arhiivipaberil. @et
toolkit label: eksemplari säilituskoopia @et
toolkit definition: Kehastus, mis on eksemplari täpne reproduktsioon arhiivikvaliteediga meediumil, nt happevabal vananemiskindlal ehk arhiivipaberil. @et
label: hat Bestandserhaltungsfaksimile eines Exemplars @de
definition: Setzt ein Exemplar in Beziehung zu einer Manifestation, die aus einer exakten Reproduktion eines Exemplars auf bestandserhaltenden Medien, wie zum Beispiel säurefreiem Papier oder Archivpapier, besteht. @de
toolkit label: Bestandserhaltungsfaksimile eines Exemplars @de
toolkit definition: Eine Manifestation, die aus einer exakten Reproduktion eines Exemplars auf bestandserhaltenden Medien, wie zum Beispiel säurefreiem Papier oder Archivpapier, besteht. @de
label: példány megőrzési hasonmása a következő: @hu
definition: Hozzákapcsol egy példányt egy megjelenési formához, amely egy példány pontos újraalkotása olyan megőrzés-minőségű médiumon, mint például a savmentes tartós vagy archiváló papír. @hu
toolkit label: példány megőrzési hasonmása: @hu
toolkit definition: Egy megjelenési forma, amely egy példány pontos újraalkotása olyan megőrzés-minőségű médiumon, mint például a savmentes tartós vagy archiváló papír. @hu
label: ha come facsmile per la conservazione di item @it
definition: Correla un item a una manifestazione che consiste di una riproduzione esatta di un item su supporto destinato alla conservazione, come come carta non acida permanente o carta da archivio. @it
toolkit label: facsimile per la conservazione di item @it
toolkit definition: Mmanifestazione che consiste di una riproduzione esatta di un item su supporto destinato alla conservazione, come come carta non acida permanente o carta da archivio. @it
label: vienības arhīvfaksimils @lv
definition: Sasaista vienību ar manifestāciju, kas ir precīza vienības reprodukcija saglabāšanai piemērotas kvalitātes vidē, piemēram, uz skābi nesaturoša papīra vai arhīvpapīra. @lv
toolkit label: vienības arhīvfaksimils @lv
toolkit definition: Manifestācija - precīza vienības reprodukcija saglabāšanai piemērotas kvalitātes vidē, piemēram, uz skābi nesaturoša papīra vai arhīvpapīra. @lv
alternative label: حفظ نسخة طبق الأصل ( مفردة) @ar
alternative label: bevaringsfaksimile (eksemplar) @da
alternative label: Bestandserhaltungsfaksimile (Exemplar) @de
alternative label: facsímil de preservació (ítem) @ca
has subproperty: P40090
alternative label: 保存摹真品（单件） @zh-hans
label: 有单件的保存摹真品 @zh-hans
definition: 将一个单件与由在诸如脱酸的永久用纸或档案纸等具有保存品质的媒介上的精确复制品组成的载体表现关联起来。 @zh-hans
toolkit label: 单件的保存摹真品 @zh-hans
toolkit definition: 由在诸如脱酸的永久用纸或档案纸等具有保存品质的媒介上的精确复制品组成的载体表现 @zh-hans
alternative label: facsímil de preservación (ítem) @es
alternative label: fac-similé de conservation (item)
alternative label: megőrzési hasonmása (példány): @hu
alternative label: Tıpkı basımın koruma kopyası @tr
label: kopyanın koruma kopyası ile ilişkilidir @tr
definition: Bir kopyayı, bir kopyanın asitsiz kalıcı veya arşiv kağıdı gibi koruma kalitesinde ortam üzerinde tam olarak çoğaltılmasından oluşan bir gösterimle ilişkilendirir. @tr
toolkit label: kopyanın korunan tıpkı basımı @tr
toolkit definition: Asitsiz kalıcı kağıt veya arşiv kağıdı gibi koruma kalitesinde ortamlarda bir kopyanın tam olarak çoğaltılmasından oluşan bir gösterim. @tr

est un fac-similé de conservation de (item)
status: Deprecated
type: Property
domain: C10003
sub property of: est un fac-un similé de (item)
definition: Met un item en relation avec un item qui sert de base à une reproduction exacte sur un support de qualité conservation, tel qu’un papier permanent sans acide ou un papier d’archivage.
toolkit label: fac-similé de conservation de (item)
toolkit definition: Item qui sert de base à une reproduction exacte sur un support de qualité conservation, tel qu’un papier permanent sans acide ou un papier d’archivage.
toolkit label: facsímil de preservación de (ítem) @es
toolkit definition: Un ítem utilizado como base para una reproducción exacta sobre un medio con calidad de preservación, tal como papel libre de ácido o papel de archivo. @es
instruction number: 24.5
label: là bản sao bảo quản của (bản) @vi
definition: Liên kết bản với bản được sử dụng như là cơ sở cho sản xuất lại chính xác trên phương tiện chất lượng bảo quản, như là giấy vĩnh cửu phi axit hoặc giấy lưu trữ. @vi
toolkit label: bảo quản trên bản sao của (bản) @vi
toolkit definition: Bản được sử dụng như là cơ sở cho sản xuất lại chính xác trên phương tiện chất lượng bảo quản, như là giấy vĩnh cửu phi axit hoặc giấy lưu trữ. @vi
label: er bevaringsfaksimile af (eksemplar) @da
definition: Relaterer et eksemplar til et eksemplar, der er anvendt som grundlag for en nøjagtig reproduktion på et medium af bevaringskvalitet, såsom syrefrit permanent- eller arkivpapir. @da
toolkit label: bevaringsfaksimile af eksemplar @da
toolkit definition: Eksemplar, der er anvendt som grundlag for en nøjagtig reproduktion på et medium af bevaringskvalitet, såsom syrefrit permanent- eller arkivpapir. @da
label: ist Bestandserhaltungsfaksimile von (Exemplar) @de
definition: Setzt ein Exemplar mit einem Exemplar, das als Grundlage für eine exakte Reproduktion auf bestandserhaltenden Medien, wie z. B. säurefreiem oder Archivpapier, verwendet wurde, in Beziehung. @de
toolkit label: Bestandserhaltungsfaksimile von (Exemplar) @de
toolkit definition: Ein Exemplar, das als Grundlage für eine exakte Reproduktion auf bestandserhaltenden Medien, wie z. B. säurefreiem oder Archivpapier, verwendet wurde. @de
label: είναι διατηρημένο ομοιότυπο του (αντίτυπο) @el
definition: Συνδέει ένα αντίτυπο με ένα αντίτυπο το οποίο χρησιμοποιείται ως η βάση για μια αναπαραγωγή ακριβείας σε μέσα διατήρησης της ποιότητας, όπως μόνιμο αντιόξινο ή αρχειακό χαρτί. @el
toolkit label: διατηρημένο ομοιότυπο του (αντίτυπο) @el
toolkit definition: Ένα αντίτυπο το οποίο χρησιμοποιείται ως η βάση για μια αναπαραγωγή ακριβείας σε μέσα διατήρησης της ποιότητας, όπως μόνιμο αντιόξινο ή αρχειακό χαρτί. @el
label: és facsímil de preservació de (ítem) @ca
definition: Relaciona un item amb un ítem que s’usa com a base d’una reproducció exacta en un suport de preservació de qualitat, com ara paper permanent no àcid o paper d’arxiu. @ca
toolkit label: facsímil de preservació de (ítem) @ca
toolkit definition: Ítem que s’usa com a base d’una reproducció exacta en un suport de preservació de qualitat, com ara paper permanent no àcid o paper d’arxiu. @ca
label: säilytyskopio kappaleesta @fi
definition: Liittää kappaleen kappaleeseen, jota on käytetty arkistokelpoisen (kuten hapottoman arkistopaperin), täysin identtisen jäljennöksen perustana. @fi
toolkit label: säilytyskopio kappaleesta @fi
toolkit definition: Kappale, jota on käytetty arkistokelpoisen (kuten hapottoman arkistopaperin), täysin identtisen jäljennöksen perustana. @fi
toolkit label: bevaringskopi av (eksemplar) @no
toolkit definition: Et eksemplar som brukes som utgangspunkt for en eksakt reproduksjon på et medium av bevaringskvalitet, for eksempel syrefritt pergament eller arkivpapir. @no
lexical alias: preservationFacsimileOfItem.en
has subproperty: P40044

a pour agent en relation avec un item
status: Published
sub property of: a pour entité RDA en relation avec un item
type: Property
label: has related agent of item @en
lexical alias: relatedAgentOfItem.en
definition: Relates an item to an agent who is associated with an item. @en
domain: C10003
label: có tác nhân có liên quan (bản) @vi
definition: Liên kết bản với tác nhân liên quan với bản đang được mô tả. @vi
label: har agent relateret til eksemplar @da
definition: Relaterer et eksemplar til en agent, som er knyttet til et eksemplar. @da
label: έχει σχετικό φορέα (αντίτυπο) @el
definition: Συνδέει ένα αντίτυπο με έναν φορέα που συνδέεται με ένα περιγραφόμενο αντίτυπο. @el
label: té com a agent relacionat amb un ítem @ca
definition: Relaciona un ítem amb un agent que s’associa amb un ítem. @ca
definition: Met un item en relation avec un agent qui est associé à un item.
toolkit label: related agent of item @en
toolkit definition: An agent who is associated with an item. @en
has element type: 1
sub property of: P00006
label: példány kapcsolódó ágense a következő: @hu
definition: Hozzákapcsol egy példányt egy példányhoz kapcsolódó ágenshez. @hu
toolkit label: agent en relation avec un item
toolkit definition: Agent qui est associé à un item.
alternative label: other agent associated with item @en
definition: Liittää kappaleen toimijaan, joka liittyy kappaleeseen. @fi
toolkit label: kappaleeseen liittyvä toimija @fi
toolkit definition: Toimija, joka liittyy kappaleeseen. @fi
label: kappaleeseen liittyvä toimija @fi
label: har agent relatert til eksemplar @no
definition: Relaterer et eksemplar til en agent som forbindes med et eksemplar. @no
toolkit label: agent relatert til eksemplar @no
toolkit definition: En agent som forbindes med et eksemplar. @no
label: heeft gerelateerde actor van item @nl
definition: Relateert een item aan een actor die geassocieerd is met een item. @nl
toolkit label: gerelateerde actor van item @nl
toolkit definition: Een actor die geassocieerd is met een item. @nl
label: له وكيل مرتبط بمفردة @ar
definition: يربط مفردة بوكيل ذي صلة بمفردة. @ar
toolkit label: وكيل مرتبط بمفردة @ar
toolkit definition: وكيل ذو صلة بمفردة @ar
toolkit label: agent relacionat amb un ítem @ca
toolkit definition: Agent que s’associa amb un ítem. @ca
toolkit label: agent relateret til eksemplar @da
toolkit definition: Agent, som er knyttet til et eksemplar. @da
label: eksemplariga seotud tegija @et
definition: Seostab eksemplari eksemplariga seotud tegijaga. @et
toolkit label: eksemplariga seotud tegija @et
toolkit definition: Eksemplariga seotud tegija. @et
label: hat mit Exemplar in Beziehung stehenden Akteur @de
definition: Setzt ein Exemplar in Beziehung zu einem Akteur, der mit einem Exemplar in Verbindung steht. @de
toolkit label: mit Exemplar in Beziehung stehender Akteur @de
toolkit definition: Ein Akteur, der mit einem Exemplar in Verbindung steht. @de
toolkit label: példány kapcsolódó ágense: @hu
toolkit definition: Egy példányhoz kapcsolódó ágens. @hu
label: ha come agente correlato di item @it
definition: Correla un item a un agente associato a un item. @it
toolkit label: agente correlato di item @it
toolkit definition: Agente associato a un item. @it
label: ar vienību saistītais aģents @lv
definition: Sasaista vienību ar aģentu, kas saistīts ar vienību. @lv
toolkit label: ar vienību saistītais aģents @lv
toolkit definition: Aģents, kas saistīts ar vienību. @lv
alternative label: kappaleeseen liittyvä muu toimija @fi
alternative label: وكيل آخر ذو صلة بمفردة @ar
alternative label: Sonstiger Akteur, der mit einem Exemplar in Verbindung steht @de
alternative label: altre agent associat amb un ítem @ca
has subproperty: a pour agent conservateur
has subproperty: a pour agent dépositaire
has subproperty: a pour agent dédicataire d’un item
has subproperty: a pour agent honoré d’un item
has subproperty: a pour autre agent associé à un item
has subproperty: a pour agent modificateur
has subproperty: a pour agent propriétaire
has subproperty: a pour agent collectif en relation avec un item
has subproperty: a pour personne en relation avec un item
has subproperty: P40072
alternative label: 和单件有关的其他行为者 @zh-hans
label: 有单件的关联行为者 @zh-hans

a pour agent collectif en relation avec un item
status: Published
sub property of: a pour agent en relation avec un item
type: Property
label: has related collective agent of item @en
lexical alias: relatedCollectiveAgentOfItem.en
definition: Relates an item to a collective agent who is associated with an item. @en
domain: C10003
label: có tác nhân tập thể có liên quan (bản) @vi
definition: Liên kết bản với tác nhân tập thể liên quan với bản đang được mô tả. @vi
label: har kollektiv agent relateret til eksemplar @da
definition: Relaterer et eksemplar til en kollektiv agent, som er knyttet til et eksemplar. @da
label: έχει σχετικό συλλογικό φορέα (αντίτυπο) @el
definition: Συνδέει ένα αντίτυπο με έναν συλλογικό φορέα που συνδέεται με ένα περιγραφόμενο αντίτυπο. @el
label: té com a agent col·lectiu relacionat amb un ítem @ca
definition: Relaciona un ítem amb un agent col·lectiu que s’associa amb un ítem. @ca
definition: Met un item en relation avec un agent collectif qui est associé à un item.
toolkit label: related collective agent of item @en
toolkit definition: A collective agent who is associated with an item. @en
has element type: 1
sub property of: P00012
label: példány kapcsolódó kollektív ágense a következő: @hu
definition: Hozzákapcsol egy példányt egy példányhoz kapcsolódó kollektív ágenshez. @hu
toolkit label: agent collectif en relation avec un item
toolkit definition: Agent collectif qui est associé à un item.
definition: Liittää kappaleen yhteistoimijaan, joka liitttyy kappaleeseen. @fi
toolkit label: kappaleeseen liittyvä yhteistoimija @fi
toolkit definition: Yhteistoimija, joka liitttyy kappaleeseen. @fi
label: kappaleeseen liittyvä yhteistoimija @fi
label: har kollektiv agent relatert til eksemplar @no
definition: Relaterer et eksemplar til en kollektiv agent som forbindes med et eksemplar. @no
toolkit label: kollektiv agent relatert til eksemplar @no
toolkit definition: En kollektiv agent som forbindes med et eksemplar. @no
label: heeft gerelateerde collectieve actor van item @nl
definition: Relateert een item aan een collectieve actor die geassocieerd is met een item. @nl
toolkit label: gerelateerde collectieve actor van item @nl
toolkit definition: Een collectieve actor die geassocieerd is met een item. @nl
label: له وكيل جماعي مرتبط بمفردة @ar
definition: يربط مفردة بوكيل جماعي ذي صلة بمفردة. @ar
toolkit label: وكيل جماعي مرتبط بمفردة @ar
toolkit definition: وكيل جماعي ذو صلة بمفردة @ar
toolkit label: agent col·lectiu relacionat amb un ítem @ca
toolkit definition: Agent col·lectiu que s’associa amb un ítem. @ca
toolkit label: kollektiv agent relateret til eksemplar @da
toolkit definition: Kollektiv agent, som er knyttet til et eksemplar. @da
label: eksemplariga seotud kollektiiv @et
definition: Seostab eksemplari eksemplariga seotud kollektiiviga. @et
toolkit label: eksemplariga seotud kollektiiv @et
toolkit definition: Eksemplariga seotud kollektiiv. @et
label: hat mit Exemplar in Beziehung stehenden gemeinschaftlichen Akteur @de
definition: Setzt ein Exemplar in Beziehung zu einem gemeinschaftlichen Akteur, der mit einem Exemplar in Verbindung steht. @de
toolkit label: mit Exemplar in Beziehung stehender gemeinschaftlicher Akteur @de
toolkit definition: Ein gemeinschaftlicher Akteur, der mit einem Exemplar in Verbindung steht. @de
toolkit label: példány kapcsolódó kollektív ágense: @hu
toolkit definition: Egy példányhoz kapcsolódó kollektív ágens. @hu
label: ha come agente collettivo correlato di item @it
definition: Correla un item a un agente collettivo associato a un item. @it
toolkit label: agente collettivo correlato di item @it
toolkit definition: Agente collettivo associato a un item. @it
label: ar vienību saistītā grupa @lv
definition: Sasaista vienību ar grupu, kas saistīta ar vienību. @lv
toolkit label: ar vienību saistītā grupa @lv
toolkit definition: Grupa, kas saistīta ar vienību. @lv
has subproperty: a pour agent collectif conservateur
has subproperty: a pour agent collectif dépositaire
has subproperty: a pour agent collectif dédicataire d’un item
has subproperty: a pour agent collectif honoré d’un item
has subproperty: a pour agent collectif modificateur
has subproperty: a pour agent collectif propriétaire
has subproperty: a pour collectivité en relation avec un item
has subproperty: a pour famille en relation avec un item
has subproperty: P40076
label: 有单件的关联集体行为者 @zh-hans
definition: 将一个单件与和一个单件有关的一个集体行为者关联起来。 @zh-hans
toolkit label: 单件的关联集体行为者 @zh-hans
toolkit definition: 和一个单件有关的一个集体行为者 @zh-hans
label: kopyanın ilgili kolektif temsilcisi ile ilişkilidir @tr
definition: Bir kopyayı, bir kopyanın bağlantılı olan kolektif bir temsilciyle ilişkilendirir. @tr
toolkit label: Kopyanın kolektif temsilciyle ilişkisi @tr
toolkit definition: Bir kopys ile ilişkililendirilen kolektif bir temsilci. @tr

a pour collectivité en relation avec un item
status: Published
sub property of: a pour agent collectif en relation avec un item
type: Property
label: has related corporate body of item @en
lexical alias: relatedCorporateBodyOfItem.en
definition: Relates an item to a corporate body who is associated with an item. @en
domain: C10003
label: có tập thể có liên quan (bản) @vi
definition: Liên kết bản với tập thể liên quan với bản đang được mô tả. @vi
label: har korporation relateret til eksemplar @da
definition: Relaterer et eksemplar til en korporation, som er knyttet til et eksemplar. @da
label: έχει σχετικό συλλογικό όργανο (αντίτυπο) @el
definition: Συνδέει ένα αντίτυπο με ένα συλλογικό όργανο που συνδέεται με ένα περιγραφόμενο αντίτυπο. @el
label: té com a entitat corporativa relacionada amb un ítem @ca
definition: Relaciona un ítem amb una entitat corporativa que s’associa amb un ítem. @ca
definition: Met un item en relation avec une collectivité qui est associée à un item.
toolkit label: related corporate body of item @en
toolkit definition: A corporate body who is associated with an item. @en
has element type: 1
sub property of: P00009
label: példány kapcsolódó testülete a következő: @hu
definition: Hozzákapcsol egy példányt egy példányhoz kapcsolódó testülethez. @hu
toolkit label: collectivité en relation avec un item
toolkit definition: Collectivité qui est associée à un item.
definition: Liittää kappaleen yhteisöön, joka liittyy kappaleeseen. @fi
toolkit label: kappaleeseen liittyvä yhteisö @fi
toolkit definition: Yhteisö, joka liittyy kappaleeseen. @fi
label: kappaleeseen liittyvä yhteisö @fi
label: har korporasjon relatert til eksemplar @no
definition: Relaterer et eksemplar til en korporasjon som forbindes med et eksemplar. @no
toolkit label: korporasjon relatert til eksemplar @no
toolkit definition: En korporasjon som forbindes med et eksemplar. @no
label: heeft gerelateerde corporatie van item @nl
definition: Relateert een item aan een corporatie die geassocieerd is met een item. @nl
toolkit label: gerelateerde corporatie van item @nl
toolkit definition: Een corporatie die geassocieerd is met een item. @nl
label: له هيئة مرتبطة بمفردة @ar
definition: يربط مفردة بهيئة ذات صلة بمفردة. @ar
toolkit label: هيئة مرتبطة بمفردة @ar
toolkit definition: هيئة ذات صلة بمفردة @ar
toolkit label: entitat corporativa relacionada amb un ítem @ca
toolkit definition: Entitat corporativa que s’associa amb un ítem. @ca
toolkit label: korporation relateret til eksemplar @da
toolkit definition: Korporation, som er knyttet til et eksemplar. @da
label: eksemplariga seotud asutus @et
definition: Seostab eksemplari eksemplariga seotud asutusega. @et
toolkit label: eksemplariga seotud asutus @et
toolkit definition: Eksemplariga seotud asutus. @et
label: hat mit Exemplar in Beziehung stehende Körperschaft @de
definition: Setzt ein Exemplar in Beziehung zu einer Körperschaft, die mit einem Exemplar in Verbindung steht. @de
toolkit label: mit Exemplar in Beziehung stehende Körperschaft @de
toolkit definition: Eine Körperschaft, die mit einem Exemplar in Verbindung steht. @de
toolkit label: példány kapcsolódó testülete: @hu
toolkit definition: Egy példányhoz kapcsolódó testület. @hu
label: ha come ente correlato di item @it
definition: Correla un item a un ente associato a un item. @it
toolkit label: ente correlato di item @it
toolkit definition: Ente associato a un item. @it
label: ar vienību saistītā institūcija @lv
definition: Sasaista vienību ar institūciju, kas saistīta ar vienību. @lv
toolkit label: ar vienību saistītā institūcija @lv
toolkit definition: Institūcija, kas saistīta ar vienību. @lv
has subproperty: a pour collectivité conservatrice
has subproperty: a pour collectivité dépositaire
has subproperty: a pour collectivité dédicataire d’un item
has subproperty: a pour collectivité honorée d’un item
has subproperty: a pour collectivité modificatrice
has subproperty: a pour collectivité propriétaire
has subproperty: P40075
label: 有单件的关联团体 @zh-hans
definition: 将一个单件与和一个单件有关的一个团体关联起来。 @zh-hans
toolkit label: 单件的关联团体 @zh-hans
toolkit definition: 和一个单件有关的一个团体 @zh-hans
label: kopyanın ilgili tüzel kişisi ile ilişkilidir @tr
definition: Bir kopyayı, bir kopya ile bağlantılı olan tüzel bir kişiyle ilişkilendirir. @tr
toolkit label: Kopyanın tüzel kişiyle ilişkisi @tr
toolkit definition: Bir kopya ile ilişkili bir tüzel kişi. @tr

a pour entité en relation avec un item
status: Published
label: has related entity of item @en
lexical alias: relatedEntityOfItem.en
definition: Relates an item to an entity that is associated with an item. @en
toolkit label: related entity of item @en
toolkit definition: An entity that is associated with an item. @en
type: Property
domain: C10003
has element type: 1
sub property of: P00028
definition: Met un item en relation avec une entité qui est associée à un item.
toolkit label: entité en relation avec un item
toolkit definition: Entité qui est associée à un item.
label: kappaleeseen liittyvä entiteetti @fi
definition: Liittää kappaleen entiteettiin, joka liittyy kappaleeseen. @fi
toolkit label: kappaleeseen liittyvä entiteetti @fi
toolkit definition: Entiteetti, joka liittyy kappaleeseen. @fi
label: har relatert entiet for eksemplar @no
definition: Relaterer et eksemplar til en entitet som forbindes med et eksemplar. @no
toolkit label: relatert entiet for eksemplar @no
toolkit definition: En entitet som forbindes med et eksemplar. @no
label: heeft gerelateerde entiteit van item @nl
definition: Relateert een item aan een entiteit die geassocieerd is met een item. @nl
toolkit label: gerelateerde entiteit van item @nl
toolkit definition: Een entiteit die geassocieerd is met een item. @nl
label: له كيان مرتبط بمفردة @ar
definition: يربط مفردة بكيان هو مرتبط بمفردة. @ar
toolkit label: كيان مرتبط بمفردة @ar
toolkit definition: كيان هو مرتبط بمفردة @ar
label: té com a entitat relacionada amb un ítem @ca
definition: Relaciona un ítem amb una entitat que s’associa amb un ítem. @ca
toolkit label: entitat relacionada amb un ítem @ca
toolkit definition: Entitat que s’associa amb un ítem. @ca
label: har entitet relateret til eksemplar @da
definition: Relaterer et eksemplar til en entitet, som er knyttet til et eksemplar. @da
toolkit label: entitet relateret til eksemplar @da
toolkit definition: Entitet, som er knyttet til et eksemplar. @da
label: eksemplariga seotud olem @et
definition: Seostab eksemplari eksemplariga seotud olemiga. @et
toolkit label: eksemplariga seotud olem @et
toolkit definition: Eksemplariga seotud olem. @et
label: hat mit Exemplar in Beziehung stehende Entität @de
definition: Setzt ein Exemplar in Beziehung zu einer Entität, die mit einem Exemplar in Verbindung steht. @de
toolkit label: mit Exemplar in Beziehung stehende Entität @de
toolkit definition: Eine Entität, die mit einem Exemplar in Verbindung steht. @de
label: példány kapcsolódó entitása a következő: @hu
definition: Hozzákapcsol egy példányt egy entitáshoz, amelyet egy példányhoz társítanak. @hu
toolkit label: példány kapcsolódó entitása: @hu
toolkit definition: Egy entitás, amelyet egy példányhoz társítanak. @hu
label: ha come entità correlata di item @it
definition: Correla un item a un'entità associata a un item. @it
toolkit label: entità correlata di item @it
toolkit definition: Entità associata a un item. @it
label: ar vienību saistītā entīte @lv
definition: Sasaista vienību ar entīti, kas saistīta ar vienību. @lv
toolkit label: ar vienību saistītā entīte @lv
toolkit definition: Entīte, kas saistīta ar vienību. @lv
has subproperty: a pour entité RDA en relation avec un item
has subproperty: P40095
label: 有单件的关联实体 @zh-hans
definition: 将一个单件与和一个单件有关的一个实体关联起来。 @zh-hans
toolkit label: 单件的关联实体 @zh-hans
toolkit definition: 和一个单件有关的一个实体 @zh-hans
label: kopyanın ilgili varlığı ile ilişkilidir @tr
definition: Bir kopyayı, bir kopyayla bağlantılı olan bir varlıkla ilişkilendirir. @tr
toolkit label: Kopyanın ilişkili olduğu varlığı @tr
toolkit definition: Bir kopya ile bağlantılı olan bir varlık. @tr

a pour expression en relation avec un item
status: Published
sub property of: a pour entité RDA en relation avec un item
type: Property
label: has related expression of item @en
lexical alias: relatedExpressionOfItem.en
definition: Relates an item to an expression that is associated with an item. @en
domain: C10003
label: có biểu hiện có liên quan (bản) @vi
definition: Liên kết bản với biểu hiện liên quan với bản đang được mô tả. @vi
label: har udtryk relateret til eksemplar @da
definition: Relaterer et eksemplar til et udtryk, som er knyttet til et eksemplar. @da
label: έχει σχετική έκφραση (αντίτυπο) @el
definition: Συνδέει ένα αντίτυπο με μια έκφραση συνδεδεμένη με ένα περιγραφόμενο αντίτυπο. @el
label: té com a expressió relacionada amb un ítem @ca
definition: Relaciona un ítem amb una expressió que s’associa amb un ítem. @ca
definition: Met un item en relation avec une expression qui est associée à un item.
toolkit label: related expression of item @en
toolkit definition: An expression that is associated with an item. @en
has element type: 1
sub property of: P00003
label: példány kapcsolódó kifejezési formája a következő: @hu
definition: Hozzákapcsol egy példányt egy kifejezési formához, amelyet egy példányhoz társítanak. @hu
toolkit label: expression en relation avec un item
toolkit definition: Expression qui est associée à un item.
definition: Liittää kappaleen ekspressioon, joka liittyy kappaleeseen. @fi
toolkit label: kappaleeseen liittyvä ekspressio @fi
toolkit definition: Ekspressio, joka liittyy kappaleeseen. @fi
label: kappaleeseen liittyvä ekspressio @fi
label: har uttrykk relatert til eksemplar @no
definition: Relaterer et eksemplar til et uttrykk som forbindes med et eksemplar. @no
toolkit label: uttrykk relatert til eksemplar @no
toolkit definition: Et uttrykk som forbindes med et eksemplar. @no
label: heeft gerelateerde expressie van item @nl
definition: Relateert een item aan een expressie die geassocieerd is met een item. @nl
toolkit label: gerelateerde expressie van item @nl
toolkit definition: Een expressie die geassocieerd is met een item. @nl
label: له تعبيرة ذات صلة بمفردة @ar
definition: يربط مفردة بتعبيرة ذات صلة بمفردة. @ar
toolkit label: تعبيرة مرتبطة بمفردة @ar
toolkit definition: تعبيرة ذات صلة بمفردة @ar
toolkit label: expressió relacionada amb un ítem @ca
toolkit definition: Expressió que s’associa amb un ítem. @ca
toolkit label: udtryk relateret til eksemplar @da
toolkit definition: Udtryk, som er knyttet til et eksemplar. @da
label: eksemplariga seotud väljendus @et
definition: Seostab eksemplari eksemplariga seotud väljendusega. @et
toolkit label: eksemplariga seotud väljendus @et
toolkit definition: Eksemplariga seotud väljendus. @et
label: hat mit Exemplar in Beziehung stehende Expression @de
definition: Setzt ein Exemplar in Beziehung zu einer Expression, die mit einem Exemplar in Verbindung steht. @de
toolkit label: mit Exemplar in Beziehung stehende Expression @de
toolkit definition: Eine Expression, die mit einem Exemplar in Verbindung steht. @de
toolkit label: példányhoz kapcsolódó kifejezési forma: @hu
toolkit definition: Egy kifejezési forma, amelyet egy példányhoz társítanak. @hu
label: ha come espressione correlata di item @it
definition: Correla un item a un'espressione associata a un item. @it
toolkit label: espressione correlata di item @it
toolkit definition: Espressione associata a un item. @it
label: ar vienību saistītā izteiksme @lv
definition: Sasaista vienību ar izteiksmi, kas ir saistīta ar vienību. @lv
toolkit label: ar vienību saistītā izteiksme @lv
toolkit definition: Izteiksme, kas ir saistīta ar vienību. @lv
has subproperty: P40070
label: 有单件的关联内容表达 @zh-hans
definition: 将一个单件与和一个单件有关的一种内容表达关联起来。 @zh-hans
toolkit label: 单件的关联内容表达 @zh-hans
toolkit definition: 和一个单件有关的一种内容表达 @zh-hans
label: kopyanın ilgili anlatımı ile ilişkilidir @tr
definition: Bir kopyayı, bir kopyayla bağlantılı bir anlatımla ilişkilendirir. @tr
toolkit label: Kopyanın ilişkili anlatımı @tr
toolkit definition: Bir öğeyle bağlantılı olan bir anlatım. @tr

a pour famille en relation avec un item
status: Published
sub property of: a pour agent collectif en relation avec un item
type: Property
label: has related family of item @en
lexical alias: relatedFamilyOfItem.en
definition: Relates an item to a family who is associated with an item. @en
domain: C10003
label: có gia đình có liên quan (bản) @vi
definition: Liên kết bản với gia đình liên quan với bản đang được mô tả. @vi
label: har familie relateret til eksemplar @da
definition: Relaterer et eksemplar til en familie, som er knyttet til et eksemplar. @da
label: έχει σχετική οικογένεια (αντίτυπο) @el
definition: Συνδέει ένα αντίτυπο με μια οικογένεια που συνδέεται με ένα περιγραφόμενο αντίτυπο. @el
label: té com a família relacionada amb un ítem @ca
definition: Relaciona un ítem amb una família que s’associa amb un ítem. @ca
definition: Met un item en relation avec une famille qui est associée à un item.
toolkit label: related family of item @en
toolkit definition: A family who is associated with an item. @en
has element type: 1
sub property of: P00008
label: példány kapcsolódó családja a következő: @hu
definition: Hozzákapcsol egy példányt egy példányhoz kapcsolódó családhoz. @hu
toolkit label: famille en relation avec un item
toolkit definition: Famille qui est associée à un item.
definition: Liittää kappaleen sukuun, joka liittyy kappaleeseen. @fi
toolkit label: kappaleeseen liittyvä suku @fi
toolkit definition: Suku, joka liittyy kappaleeseen. @fi
label: kappaleeseen liittyvä suku @fi
label: har familie relatert til eksemplar @no
definition: Relaterer et eksemplar til en familie som forbindes med et eksemplar. @no
toolkit label: familie relatert til eksemplar @no
toolkit definition: En familie som forbindes med et eksemplar. @no
label: heeft gerelateerde familie van item @nl
definition: Relateert een item aan een familie die geassocieerd is met een item. @nl
toolkit label: gerelateerde familie van item @nl
toolkit definition: Een familie die geassocieerd is met een item. @nl
label: له عائلة مرتبطة بمفردة @ar
definition: يربط مفردة بعائلة ذات صلة بمفردة. @ar
toolkit label: عائلة مرتبطة بمفردة @ar
toolkit definition: عائلة ذات صلة بمفردة @ar
toolkit label: família relacionada amb un ítem @ca
toolkit definition: Família que s’associa amb un ítem. @ca
toolkit label: familie relateret til eksemplar @da
toolkit definition: Familie, som er knyttet til et eksemplar. @da
label: eksemplariga seotud perekond @et
definition: Seostab eksemplari eksemplariga seotud perekonnaga. @et
toolkit label: eksemplariga seotud perekond @et
toolkit definition: Eksemplariga seotud perekond. @et
label: hat mit Exemplar in Beziehung stehende Familie @de
definition: Setzt ein Exemplar in Beziehung zu einer Familie, die mit einem Exemplar in Verbindung steht. @de
toolkit label: mit Exemplar in Beziehung stehende Familie @de
toolkit definition: Eine Familie, die mit einem Exemplar in Verbindung steht. @de
toolkit label: példányhoz kapcsolódó család: @hu
toolkit definition: Egy példányhoz kapcsolódó család. @hu
label: ha come famiglia correlata di item @it
definition: Correla un item a una famiglia associata a un item. @it
toolkit label: famiglia correlata di item @it
toolkit definition: Famiglia associata a un item. @it
label: ar vienību saistītā dzimta/ģimene @lv
definition: Sasaista vienību ar dzimtu/ģimeni, kas saistīta ar vienību. @lv
toolkit label: ar vienību saistītā dzimta/ģimene @lv
toolkit definition: Dzimta/ģimene, kas saistīta ar vienību. @lv
has subproperty: a pour famille conservatrice
has subproperty: a pour famille dépositaire
has subproperty: a pour famille dédicataire d’un item
has subproperty: a pour famille honorée d’un item
has subproperty: a pour famille modificatrice
has subproperty: a pour famille propriétaire
has subproperty: P40074
label: 有单件的关联家族 @zh-hans
definition: 将一个单件与和一个单件有关的一个家族关联起来。 @zh-hans
toolkit label: 单件的关联家族 @zh-hans
toolkit definition: 和一个单件有关的一个家族 @zh-hans
label: kopyanın ilgili ailesi ile ilişkilidir @tr
definition: Bir kopyayı, bir kopyayla bağlantılı olan bir aileyle ilişkilendirir. @tr
toolkit label: Kopyayla ilişkili aile @tr
toolkit definition: Bir kopya ile bağlantılı olan bir aile. @tr

a pour item en relation avec un item
status: Published
label: has related item of item @en
definition: Relates an item to an item that is associated with an item. @en
type: Property
domain: C10003
lexical alias: relatedItemOfItem.en
label: har relaterat exemplar @sv
toolkit label: relaterat exemplar @sv
sub property of: a pour entité RDA en relation avec un item
label: có bản có liên quan (bản) @vi
definition: Liên kết bản với bản liên quan tới bản đang được mô tả. @vi
label: har eksemplar relateret til eksemplar @da
definition: Relaterer et eksemplar til et eksemplar, som er knyttet til et eksemplar. @da
label: έχει σχετικό αντίτυπο (αντίτυπο) @el
definition: Συνδέει ένα αντίτυπο με ένα αντίτυπο που συνδέεται με το περιγραφόμενο αντίτυπο. @el
label: té com a ítem relacionat amb un ítem @ca
definition: Relaciona un ítem amb un ítem que s’associa amb un ítem. @ca
definition: Liittää kappaleen kappaleeseen, joka liittyy kappaleeseen. @fi
definition: Met un item en relation avec un item qui est associé à un item.
toolkit label: related item of item @en
toolkit definition: An item that is associated with an item. @en
has element type: 1
sub property of: P00005
label: példány kapcsolódó példánya a következő: @hu
definition: Hozzákapcsol egy példányt egy példányhoz, amelyet egy példányhoz társítanak. @hu
toolkit label: item en relation avec un item
toolkit definition: Item qui est associé à un item.
alternative label: whole-part item relationship @en
toolkit label: kappaleeseen liittyvä kappale @fi
toolkit definition: Kappale, joka liittyy kappaleeseen. @fi
label: kappaleeseen liittyvä kappale @fi
label: har relatert eksemplar av eksemplar @no
definition: Relaterer et eksemplar til et eksemplar som forbindes med et eksemplar. @no
toolkit label: relatert eksemplar av eksemplar @no
toolkit definition: Et eksemplar som forbindes med et eksemplar. @no
label: heeft gerelateerd item van item @nl
definition: Relateert een item aan een item dat geassocieerd is met een item. @nl
toolkit label: gerelateerd item van item @nl
toolkit definition: Een item dat geassocieerd is met een item. @nl
label: له مفردة مرتبطة بمفردة @ar
definition: يربط مفردة بمفردة مرتبطة بمفردة. @ar
toolkit label: مفردة مرتبطة بمفردة @ar
toolkit definition: مفردة ذات صلة بمفردة @ar
toolkit label: ítem relacionat amb un ítem @ca
toolkit definition: Ítem que s’associa amb un ítem. @ca
toolkit label: eksemplar relateret til eksemplar @da
toolkit definition: Eksemplar, som er knyttet til et eksemplar. @da
label: eksemplariga seotud eksemplar @et
definition: Seostab eksemplari eksemplariga seotud eksemplariga. @et
toolkit label: eksemplariga seotud eksemplar @et
toolkit definition: Eksemplariga seotud eksemplar. @et
label: hat mit Exemplar in Beziehung stehendes Exemplar @de
definition: Setzt ein Exemplar in Beziehung zu einem Exemplar, das mit einem Exemplar in Verbindung steht. @de
toolkit label: mit Exemplar in Beziehung stehendes Exemplar @de
toolkit definition: Ein Exemplar, das mit einem Exemplar in Verbindung steht. @de
toolkit label: példány kapcsolódó példánya: @hu
toolkit definition: Egy példány, amelyet egy példányhoz társítanak. @hu
label: ha come item correlato di item @it
definition: Correla un item a un item associato a un item. @it
toolkit label: item correlato di item @it
toolkit definition: Item associato a un item. @it
label: ar vienību saistītā vienība @lv
definition: Sasaista vienību ar vienību, kas ir saistīta ar vienību. @lv
toolkit label: ar vienību saistītā vienība @lv
toolkit definition: Vienība, kas ir saistīta ar vienību. @lv
alternative label: kappaleen osa-kokonaisuus-suhde @fi
alternative label: علاقة الجزء بالكل لمفردة @ar
alternative label: helhed-del-eksemplar-relation @da
alternative label: Teil-Ganzes-Beziehungen auf Exemplarebene @de
alternative label: relació d’ítem tot-part @ca
has subproperty: est conservé avec
has subproperty: a pour relation d’item d’accompagnement
has subproperty: est contenu dans un item
has subproperty: est un conteneur d’un item
has subproperty: a pour item équivalent
has subproperty: a pour relation d’item équivalent
has subproperty: has descriptive item relationship with (Deprecated)
has subproperty: a pour relation d’item tout-partie
has subproperty: est sur une manifestation avec

a pour manifestation en relation avec un item
status: Published
sub property of: a pour entité RDA en relation avec un item
type: Property
label: has related manifestation of item @en
lexical alias: relatedManifestationOfItem.en
definition: Relates an item to a manifestation that is associated with an item. @en
domain: C10003
label: có biểu thị có liên quan (bản) @vi
definition: Liên kết bản với thực biểu hiện liên quan với bản đang được mô tả. @vi
label: har manifestation relateret til eksemplar @da
definition: Relaterer et eksemplar til en manifestation, som er knyttet til et eksemplar. @da
label: έχει σχετική εκδήλωση (αντίτυπο) @el
definition: Συνδέει ένα αντίτυπο με μια εκδήλωση που συνδέεται με ένα περιγραφόμενο αντίτυπο. @el
label: té com a manifestació relacionada amb un ítem @ca
definition: Relaciona un ítem amb una manifestació que s’associa amb un ítem. @ca
definition: Met un item en relation avec une manifestation qui est associée à un item.
toolkit label: related manifestation of item @en
toolkit definition: A manifestation that is associated with an item. @en
has element type: 1
sub property of: P00004
label: példány kapcsolódó megjelenési formája a következő: @hu
definition: Hozzákapcsol egy példányt egy megjelenési formához, amelyet egy példányhoz társítanak. @hu
toolkit label: manifestation en relation avec un item
toolkit definition: Manifestation qui est associée à un item.
definition: Liittää kappaleen manifestaatioon, joka liittyy kappaleeseen. @fi
toolkit label: kappaleeseen liittyvä manifestaatio @fi
toolkit definition: Manifestaatio, joka liittyy kappaleeseen. @fi
label: kappaleeseen liittyvä manifestaatio @fi
label: har manifestasjon relatert til eksemplar @no
definition: Relaterer et eksemplar til en manifestasjon som forbindes med et eksemplar. @no
toolkit label: manifestasjon relatert til eksemplar @no
toolkit definition: En manifestasjon som forbindes med et eksemplar. @no
label: heeft gerelateerde manifestatie van item @nl
definition: Relateert een item aan een manifestatie die geassocieerd is met een item. @nl
toolkit label: gerelateerde manifestatie van item @nl
toolkit definition: Een manifestatie die geassocieerd is met een item. @nl
label: له تجسيدة مرتبطة بمفردة @ar
definition: يربط مفردة بتجسيدة ذات صلة بمفردة. @ar
toolkit label: تجسيدة مرتبطة بمفردة @ar
toolkit definition: تجسيدة ذات صلة بمفردة @ar
toolkit label: manifestació relacionada amb un ítem @ca
toolkit definition: Manifestació que s’associa amb un ítem. @ca
toolkit label: manifestation relateret til eksemplar @da
toolkit definition: Manifestation, som er knyttet til et eksemplar. @da
label: eksemplariga seotud kehastus @et
definition: Seostab eksemplari eksemplariga seotud kehastusega. @et
toolkit label: eksemplariga seotud kehastus @et
toolkit definition: Eksemplariga seotud kehastus. @et
label: hat mit Exemplar in Beziehung stehende Manifestation @de
definition: Setzt ein Exemplar in Beziehung zu einer Manifestation, die mit einem Exemplar in Verbindung steht. @de
toolkit label: mit Exemplar in Beziehung stehende Manifestation @de
toolkit definition: Eine Manifestation, die mit einem Exemplar in Verbindung steht. @de
toolkit label: példányhoz kapcsolódó megjelenési forma: @hu
toolkit definition: Egy megjelenési forma, amelyet egy példányhoz társítanak. @hu
label: ha come manifestazione correlata di item @it
definition: Correla un item a una manifestazione associata a un item. @it
toolkit label: manifestazione correlata di item @it
toolkit definition: Manifestazione associata a un item. @it
label: ar vienību saistītā manifestācija @lv
definition: Sasaista vienību ar manifestāciju, kas ir saistīta ar vienību. @lv
toolkit label: ar vienību saistītā manifestācija @lv
toolkit definition: Manifestācija, kas ir saistīta ar vienību. @lv
has subproperty: a pour manifestation exemplifiée
has subproperty: est reproduit comme un item
has subproperty: est conservé par
has subproperty: P40071
label: 有单件的关联载体表现 @zh-hans
definition: 将一个单件与和一个单件有关的一种载体表现关联起来。 @zh-hans
toolkit label: 单件的关联载体表现 @zh-hans
toolkit definition: 和一个单件有关的一种载体表现 @zh-hans
label: kopyanın ilgili gösterimi ile ilişkilidir @tr
definition: Bir kopyayı, bir kopyayla bağlantılı olan bir gösterimle ilişkilendirir. @tr
toolkit label: Kopyanın ilişkili gösterimi @tr
toolkit definition: Bir kopya ile bağlantılı olan bir gösterim. @tr

a pour nomen en relation avec un item
status: Published
sub property of: a pour entité RDA en relation avec un item
type: Property
label: has related nomen of item @en
lexical alias: relatedNomenOfItem.en
definition: Relates an item to a nomen that is associated with an item. @en
domain: C10003
label: có danh pháp có liên quan (bản) @vi
definition: Liên kết bản với danh pháp liên quan với bản đang được mô tả. @vi
label: har nomen relateret til eksemplar @da
definition: Relaterer et eksemplar til et nomen, som er knyttet til et eksemplar. @da
label: έχει σχετικό όνομα (αντίτυπο) @el
definition: Συνδέει ένα αντίτυπο με ένα όνομα που συνδέεται με ένα περιγραφόμενο αντίτυπο. @el
label: té com a nomen relacionat amb un ítem @ca
definition: Relaciona un ítem amb un nomen que s’associa amb un ítem. @ca
definition: Met un item en relation avec un nomen qui est associé à un item.
toolkit label: related nomen of item @en
toolkit definition: A nomen that is associated with an item. @en
has element type: 1
sub property of: P00013
label: példány kapcsolódó nomene a következő: @hu
definition: Hozzákapcsol egy példányt egy nomenhez, amelyet egy példányhoz társítanak. @hu
toolkit label: nomen en relation avec un item
toolkit definition: Nomen qui est associé à un item.
definition: Liittää kappaleen nomeniin, joka liittyy kappaleeseen. @fi
toolkit label: kappaleeseen liittyvä nomen @fi
toolkit definition: Nomen, joka liittyy kappaleeseen. @fi
label: kappaleeseen liittyvä nomen @fi
label: har nomen relatert til eksemplar @no
definition: Relaterer et eksemplar til et nomen som forbindes med et eksemplar. @no
toolkit label: nomen relatert til eksemplar @no
toolkit definition: Et nomen som forbindes med et eksemplar. @no
label: heeft gerelateerde nomen van item @nl
definition: Relateert een item aan een nomen dat geassocieerd is met een item. @nl
toolkit label: gerelateerde nomen van item @nl
toolkit definition: Een nomen dat geassocieerd is met een item. @nl
label: له تسمية مرتبطة بمفردة @ar
definition: يربط مفردة بتسمية ذات صلة بمفردة. @ar
toolkit label: تسمية مرتبطة بمفردة @ar
toolkit definition: تسمية ذات صلة بمفردة @ar
toolkit label: nomen relacionat amb un ítem @ca
toolkit definition: Nomen que s’associa amb un ítem. @ca
toolkit label: nomen relateret til eksemplar @da
toolkit definition: Nomen, som er knyttet til et eksemplar. @da
label: eksemplariga seotud nomen @et
definition: Seostab eksemplari eksemplariga seotud nomen'iga. @et
toolkit label: eksemplariga seotud nomen @et
toolkit definition: Eksemplariga seotud nomen. @et
label: hat mit Exemplar in Beziehung stehendes Nomen @de
definition: Setzt ein Exemplar in Beziehung zu einem Nomen, das mit einem Exemplar in Verbindung steht. @de
toolkit label: mit Exemplar in Beziehung stehendes Nomen @de
toolkit definition: Ein Nomen, das mit einem Exemplar in Verbindung steht. @de
toolkit label: példány kapcsolódó nomene: @hu
toolkit definition: Egy nomen, amelyet egy példányhoz társítanak. @hu
label: ha come nomen correlato di item @it
definition: Correla un item a un nomen associato a un item. @it
toolkit label: nomen correlato di item @it
toolkit definition: Nomen associato con un item. @it
label: ar vienību saistītais nomens @lv
definition: Sasaista vienību ar nomenu, kas saistīts ar vienību. @lv
toolkit label: ar vienību saistītais nomens @lv
toolkit definition: Nomens, kas saistīts ar vienību. @lv
has subproperty: a pour appellation d’item
has subproperty: P40079
label: 有单件的关联命名 @zh-hans
definition: 将一个单件与和一个单件有关的一个命名关联起来。 @zh-hans
toolkit label: 单件的关联命名 @zh-hans
toolkit definition: 和一个单件有关的一个命名 @zh-hans
label: kopyanın ilgili ismi ile ilişkilidir @tr
definition: Bir kopyayı, bir kopyayla bağlantılı olan bir isimle ilişkilendirir. @tr
toolkit label: Kopyanın ilişkili ismi @tr
toolkit definition: Bir kopya ile bağlantılı olan bir isim. @tr

a pour personne en relation avec un item
status: Published
sub property of: a pour agent en relation avec un item
type: Property
label: has related person of item @en
lexical alias: relatedPersonOfItem.en
definition: Relates an item to a person who is associated with an item. @en
domain: C10003
label: có cá nhân có liên quan (bản) @vi
definition: Liên kết bản với cá nhân liên quan với bản đang được mô tả. @vi
label: har person relateret til eksemplar @da
definition: Relaterer et eksemplar til en person, som er knyttet til et eksemplar. @da
label: έχει σχετικό φυσικό πρόσωπο (αντίτυπο) @el
definition: Συνδέει ένα αντίτυπο με ένα φυσικό πρόσωπο που συνδέεται με ένα περιγραφόμενο αντίτυπο. @el
label: té com a persona relacionada amb un ítem @ca
definition: Relaciona un ítem amb una persona que s’associa amb un ítem. @ca
definition: Met un item en relation avec une personne qui est associée à un item.
toolkit label: related person of item @en
toolkit definition: A person who is associated with an item. @en
has element type: 1
sub property of: P00007
label: példány kapcsolódó személye a következő: @hu
definition: Hozzákapcsol egy példányt egy példányhoz kapcsolódó személyhez. @hu
toolkit label: personne en relation avec un item
toolkit definition: Personne qui est associée à un item.
definition: Liittää kappaleen henkilöön, joka liittyy kappaleeseen. @fi
toolkit label: kappaleeseen liittyvä henkilö @fi
toolkit definition: Henkilö, joka liittyy kappaleeseen. @fi
label: kappaleeseen liittyvä henkilö @fi
label: har person relatert til eksemplar @no
definition: Relaterer et eksemplar til en person som forbindes med et eksemplar. @no
toolkit label: person relatert til eksemplar @no
toolkit definition: En person som forbindes med et eksemplar. @no
label: heeft gerelateerde persoon van item @nl
definition: Relateert een item aan een persoon die geassocieerd is met een item. @nl
toolkit label: gerelateerde persoon van item @nl
toolkit definition: Een persoon die geassocieerd is met een item. @nl
label: له شخص مرتبط بمفردة @ar
definition: يربط مفردة بشخص ذي صلة بمفردة. @ar
toolkit label: شخص مرتبط بمفردة @ar
toolkit definition: شخص ذو صلة بمفردة @ar
toolkit label: persona relacionada amb un ítem @ca
toolkit definition: Persona que s’associa amb un ítem. @ca
toolkit label: person relateret til eksemplar @da
toolkit definition: Person, som er knyttet til et eksemplar. @da
label: eksemplariga seotud isik @et
definition: Seostab eksemplari eksemplariga seotud isikuga. @et
toolkit label: eksemplariga seotud isik @et
toolkit definition: Eksemplariga seotud isik. @et
label: hat mit Exemplar in Beziehung stehende Person @de
definition: Setzt ein Exemplar in Beziehung zu einer Person, die mit einem Exemplar in Verbindung steht. @de
toolkit label: mit Exemplar in Beziehung stehende Person @de
toolkit definition: Eine Person, die mit einem Exemplar in Verbindung steht. @de
toolkit label: példányhoz kapcsolódó személy: @hu
toolkit definition: Egy példányhoz kapcsolódó személy. @hu
label: ha come persona correlata di item @it
definition: Correla un item a una persona associata a un item. @it
toolkit label: persona correlata di item @it
toolkit definition: Persona associata a un item. @it
label: ar vienību saistītā persona @lv
definition: Sasaista vienību ar personu, kura saistīta ar vienību. @lv
toolkit label: ar vienību saistītā persona @lv
toolkit definition: Persona, kura saistīta ar vienību. @lv
has subproperty: a pour personne conservatrice
has subproperty: a pour personne dépositaire
has subproperty: a pour personne dédicataire d’un item
has subproperty: a pour personne honorée d’un item
has subproperty: a pour personne modificatrice
has subproperty: a pour personne propriétaire
has subproperty: P40073
label: 有单件的关联个人 @zh-hans
definition: 将一个单件与和一个单件有关的一个个人关联起来。 @zh-hans
toolkit label: 单件的关联个人 @zh-hans
toolkit definition: 和一个单件有关的一个个人 @zh-hans
label: kopyanın ilgili kişisi ile ilişkilidir @tr
definition: Bir kopyayı, bir kopyayla bağlantılı olan bir kişiyle ilişkilendirir. @tr
toolkit label: Kopyayla ilişkili kişi @tr
toolkit definition: Bir kopya ile bağlantılı olan bir kişi. @tr

a pour lieu en relation avec un item
status: Published
sub property of: a pour entité RDA en relation avec un item
type: Property
label: has related place of item @en
lexical alias: relatedPlaceOfItem.en
definition: Relates an item to a place that is associated with an item. @en
domain: C10003
label: có địa điểm có liên quan (bản) @vi
definition: Liên kết bản với địa điểm liên quan với bản đang được mô tả. @vi
label: har sted relateret til eksemplar @da
definition: Relaterer et eksemplar til et sted, som er knyttet til et eksemplar. @da
label: έχει σχετικό τόπο (αντίτυπο) @el
definition: Συνδέει ένα αντίτυπο με έναν τόπο που συνδέεται με ένα περιγραφόμενο αντίτυπο. @el
label: té com a lloc relacionat amb un ítem @ca
definition: Relaciona un ítem amb un lloc que s’associa amb un ítem. @ca
definition: Met un item en relation avec un lieu qui est associé à un item.
toolkit label: related place of item @en
toolkit definition: A place that is associated with an item. @en
has element type: 1
sub property of: P00010
label: példány kapcsolódó helye a következő: @hu
definition: Hozzákapcsol egy példányt egy helyhez, amelyet egy példányhoz társítanak. @hu
toolkit label: lieu en relation avec un item
toolkit definition: Lieu qui est associé à un item.
definition: Liittää kappaleen paikkaan, joka liitttyy kappaleeseen. @fi
toolkit label: kappaleeseen liittyvä paikka @fi
toolkit definition: Paikka, joka liittyy kappaleeseen. @fi
label: kappaleeseen liittyvä paikka @fi
label: har sted relatert til eksemplar @no
definition: Relaterer et eksemplar til et sted som forbindes med et eksemplar. @no
toolkit label: sted relatert til eksemplar @no
toolkit definition: Et sted som forbindes med et eksemplar. @no
label: heeft gerelateerde plaats van item @nl
definition: Relateert een item aan een plaats die geassocieerd is met een item. @nl
toolkit label: gerelateerde plaats van item @nl
toolkit definition: Een plaats die geassocieerd is met een item. @nl
label: له مكان مرتبط بمفردة @ar
definition: يربط مفردة بمكان ذي صلة بمفردة. @ar
toolkit label: مكان مرتبط بمفردة @ar
toolkit definition: مكان ذو صلة بمفردة @ar
toolkit label: lloc relacionat amb un ítem @ca
toolkit definition: Lloc que s’associa amb un ítem. @ca
toolkit label: sted relateret til eksemplar @da
toolkit definition: Sted, som er knyttet til et eksemplar. @da
label: eksemplariga seotud koht @et
definition: Seostab eksemplari eksemplariga seotud kohaga. @et
toolkit label: eksemplariga seotud koht @et
toolkit definition: Eksemplariga seotud koht. @et
label: hat mit Exemplar in Beziehung stehendes Geografikum @de
definition: Setzt ein Exemplar in Beziehung zu einem Geografikum, das mit einem Exemplar in Verbindung steht. @de
toolkit label: mit Exemplar in Beziehung stehendes Geografikum @de
toolkit definition: Ein Geografikum, das mit einem Exemplar in Verbindung steht. @de
toolkit label: példány kapcsolódó helye: @hu
toolkit definition: Egy hely, amelyet egy példányhoz társítanak. @hu
label: ha come luogo correlato di item @it
definition: Correla un item a un luogo associato a un item. @it
toolkit label: luogo correlato di item @it
toolkit definition: Luogo associato a un item. @it
label: ar vienību saistītā vieta @lv
definition: Sasaista vienību ar vietu, kas saistīta ar vienību. @lv
toolkit label: ar vienību saistītā vieta @lv
toolkit definition: Vieta, kas saistīta ar vienību. @lv
has subproperty: a pour emplacement d’un item
has subproperty: P40077
label: 有单件的关联地点 @zh-hans
definition: 将一个单件与和一个单件有关的一个地点关联起来。 @zh-hans
toolkit label: 单件的关联地点 @zh-hans
toolkit definition: 和一个单件有关的一个地点 @zh-hans
label: kopyanın ilgili yeri ile ilişkilidir @tr
definition: Bir kopyayı, bir kopyayla bağlantılı olan bir yerle ilişkilendirir. @tr
toolkit label: Kopyayla ilişkili yer @tr
toolkit definition: Bir kopya ile bağlantılı olan bir yer. @tr

a pour entité RDA en relation avec un item
status: Published
sub property of: a pour entité en relation avec un item
type: Property
label: has related RDA entity of item @en
lexical alias: relatedRDAEntityOfItem.en
definition: Relates an item to an RDA entity that is associated with an item. @en
domain: C10003
label: có thực thể có liên quan (bản) @vi
definition: Liên kết bản với thực thể liên quan với bản đang được mô tả. @vi
label: har RDA-entitet relateret til eksemplar @da
definition: Relaterer et eksemplar til en RDA-entitet, som er knyttet til et eksemplar. @da
label: έχει σχετική οντότητα στο (αντίτυπο) @el
definition: Συνδέει ένα αντίτυπο με μια οντότητα που συνδέεται με ένα περιγραφόμενο αντίτυπο. @el
label: té com a entitat RDA relacionada amb un ítem @ca
definition: Relaciona un ítem amb una entitat RDA que s’associa amb un ítem. @ca
definition: Met un item en relation avec une entité RDA qui est associée à un item.
toolkit label: related RDA entity of item @en
toolkit definition: An RDA entity that is associated with an item. @en
has element type: 1
label: példány kapcsolódó RDA-entitása a következő: @hu
definition: Hozzákapcsol egy példányt egy RDA-entitáshoz, amelyet egy példányhoz társítanak. @hu
sub property of: P00001
toolkit label: entité RDA en relation avec un item
toolkit definition: Entité RDA qui est associée à un item.
definition: Liittää kappaleen RDA-entiteettiin, joka liittyy kappaleeseen. @fi
toolkit label: kappaleeseen liittyvä RDA-entiteetti @fi
toolkit definition: RDA-entiteetti, joka liittyy kappaleeseen. @fi
label: kappaleeseen liittyvä RDA-entiteetti @fi
label: har RDA-entitet relatert til eksemplar @no
definition: Relaterer et eksemplar til en RDA-entitet som forbindes med et eksemplar. @no
toolkit label: RDA-entitet relatert til eksemplar @no
toolkit definition: En RDA-entitet som forbindes med et eksemplar. @no
label: heeft gerelateerde RDA-entiteit van item @nl
definition: Relateert een item aan een RDA-entiteit die geassocieerd is met een item. @nl
toolkit label: gerelateerde RDA-entiteit van item @nl
toolkit definition: Een RDA-entiteit die geassocieerd is met een item. @nl
toolkit label: entitat RDA relacionada amb un ítem @ca
toolkit definition: Entitat RDA que s’associa amb un ítem. @ca
toolkit label: RDA-entitet relateret til eksemplar @da
toolkit definition: RDA-entitet, som er knyttet til et eksemplar. @da
label: eksemplariga seotud RDA olem @et
definition: Seostab eksemplari eksemplariga seotud RDA olemiga. @et
toolkit label: eksemplariga seotud RDA olem @et
toolkit definition: Eksemplariga seotud RDA olem. @et
label: hat mit Exemplar in Beziehung stehende RDA-Entität @de
definition: Setzt ein Exemplar in Beziehung zu einer RDA-Entität, die mit einem Exemplar in Verbindung steht. @de
toolkit label: mit Exemplar in Beziehung stehende RDA-Entität @de
toolkit definition: Eine RDA-Entität, die mit einem Exemplar in Verbindung steht. @de
toolkit label: példányhoz kapcsolódó RDA-entitás: @hu
toolkit definition: Egy RDA-entitás, amelyet egy példányhoz társítanak. @hu
label: ha come entità RDA correlata di item @it
definition: Correla un item a un'entità RDA associata a un item. @it
toolkit label: entità RDA correlata di item @it
toolkit definition: Entità RDA associata a un item. @it
label: ar vienību saistītā RDA entīte @lv
definition: Sasaista vienību ar RDA entīti, kas saistīta ar vienību. @lv
toolkit label: ar vienību saistītā RDA entīte @lv
toolkit definition: RDA entīte, kas saistīta ar vienību. @lv
label: لها كيان "وام" مرتبط بمفردة @ar
definition: يربط مفردة بكيان "وام" ذي الصلة بمفردة. @ar
toolkit label: له كيان "وام" مرتبط بمفردة @ar
toolkit definition: كيان "وام" ذو الصلة بمفردة. @ar
has subproperty: a pour agent en relation avec un item
has subproperty: a pour expression en relation avec un item
has subproperty: a pour item en relation avec un item
has subproperty: a pour manifestation en relation avec un item
has subproperty: a pour nomen en relation avec un item
has subproperty: a pour lieu en relation avec un item
has subproperty: a pour laps de temps en relation avec un item
has subproperty: a pour œuvre en relation avec un item
has subproperty: P40068
label: 有关联的RDA单间实体 @zh-hans
definition: 将一个单件与和一个单件有关的一个RDA实体关联起来。 @zh-hans
toolkit label: 关联的RDA单间实体 @zh-hans
toolkit definition: 和一个单件有关的一个RDA实体 @zh-hans
label: kopyanın ilgili RDA varlığı ile ilişkilidir @tr
definition: Bir kopyayı, bir kopyayla bağlantılı olan bir RDA varlığıyla ilişkilendirir. @tr
toolkit label: Kopyanın RDA varlığyla ilişkisi @tr
toolkit definition: Bir kopyayla bağlantılı olan bir RDA varlığı. @tr

a pour laps de temps en relation avec un item
status: Published
sub property of: a pour entité RDA en relation avec un item
type: Property
label: has related timespan of item @en
lexical alias: relatedTimespanOfItem.en
definition: Relates an item to a timespan that is associated with an item. @en
domain: C10003
label: có khoảng thời gian có liên quan (bản) @vi
definition: Liên kết bản với khoảng thời gian liên quan với bản đang được mô tả. @vi
label: har tidsperiode relateret til eksemplar @da
definition: Relaterer et eksemplar til en tidsperiode, som er knyttet til et eksemplar. @da
label: έχει σχετικό χρονικό διάστημα (αντίτυπο) @el
definition: Συνδέει ένα αντίτυπο με το χρονικό διάστημα που συνδέεται με ένα περιγραφόμενο αντίτυπο. @el
label: té com a interval de temps relacionat amb un ítem @ca
definition: Relaciona un ítem amb un interval de temps que s’associa amb un ítem. @ca
definition: Met un item en relation avec un laps de temps qui est associé à un item.
toolkit label: related timespan of item @en
toolkit definition: A timespan that is associated with an item. @en
has element type: 1
sub property of: P00011
label: példány kapcsolódó időtartama a következő: @hu
definition: Hozzákapcsol egy példány egy időtartamhoz, amelyet egy példányhoz társítanak. @hu
toolkit label: laps de temps en relation avec un item
toolkit definition: Laps de temps qui est associé à un item.
definition: Liittää kappaleen ajanjaksoon, joka liittyy kappaleeseen. @fi
toolkit label: kappaleeseen liittyvä ajanjakso @fi
toolkit definition: Ajanjakso, joka liittyy kappaleeseen. @fi
label: kappaleeseen liittyvä ajanjakso @fi
label: har tidsrom relatert til eksemplar @no
definition: Relaterer et eksemplar til et tidsrom som forbindes med et eksemplar. @no
toolkit label: tidsrom relatert til eksemplar @no
toolkit definition: Et tidsrom som forbindes med et eksemplar. @no
label: heeft gerelateerde tijdspanne van item @nl
definition: Relateert een item aan een tijdspanne die geassocieerd is met een item. @nl
toolkit label: gerelateerde tijdspanne van item @nl
toolkit definition: Een tijdspanne die geassocieerd is met een item. @nl
label: له فترة زمنية مرتبطة بمفردة @ar
definition: يربط مفردة بفترة زمنية ذات صلة بمفردة. @ar
toolkit label: فترة زمنية مرتبطة بمفردة @ar
toolkit definition: فترة زمنية ذات صلة بمفردة @ar
toolkit label: interval de temps relacionat amb un ítem @ca
toolkit definition: Interval de temps que s’associa amb un ítem. @ca
toolkit label: tidsperiode relateret til eksemplar @da
toolkit definition: Tidsperiode, som er knyttet til et eksemplar. @da
label: eksemplariga seotud ajavahemik @et
definition: Seostab eksemplari eksemplariga seotud ajavahemikuga. @et
toolkit label: eksemplariga seotud ajavahemik @et
toolkit definition: Eksemplariga seotud ajavahemik. @et
label: hat mit Exemplar in Beziehung stehenden Zeitraum @de
definition: Setzt ein Exemplar in Beziehung zu einem Zeitraum, der mit einem Exemplar in Verbindung steht. @de
toolkit label: mit Exemplar in Beziehung stehender Zeitraum @de
toolkit definition: Ein Zeitraum, der mit einem Exemplar in Verbindung steht. @de
toolkit label: példány kapcsolódó időtartama: @hu
toolkit definition: Egy időtartam, amelyet egy példányhoz társítanak. @hu
label: ha come arco di tempo correlato di item @it
definition: Correla un item a un arco di tempo associato a un item. @it
toolkit label: arco di tempo correlato di item @it
toolkit definition: Arco di tempo associato a un item. @it
label: ar vienību saistītais laikposms @lv
definition: Sasaista vienību ar laikposmu, kas saistīts ar vienību. @lv
toolkit label: ar vienību saistītais laikposms @lv
toolkit definition: Laikposms, kas saistīts ar vienību. @lv
has subproperty: P40078
label: 有单件的关联时间段 @zh-hans
definition: 将一个单件与和一个单件有关的一个时间段关联起来。 @zh-hans
toolkit label: 单件的关联时间段 @zh-hans
toolkit definition: 和一个单件有关的一个时间段 @zh-hans
label: kopyanın ilgili zaman aralığı ile ilişkilidir @tr
definition: Bir kopyayı, bir kopyayla bağlantılı olan bir zaman aralığıyla ilişkilendirir. @tr
toolkit label: Kopyanın zaman aralığıyla ilişkisi @tr
toolkit definition: Bir kopya ile bağlantılı olan bir zaman aralığı. @tr

a pour œuvre en relation avec un item
status: Published
sub property of: a pour entité RDA en relation avec un item
type: Property
label: has related work of item @en
lexical alias: relatedWorkOfItem.en
definition: Relates an item to a work that is associated with an item. @en
domain: C10003
label: có tác phẩm có liên quan (bản) @vi
definition: Liên kết bản với tác phẩm liên quan với bản đang được mô tả. @vi
label: har værk relateret til eksemplar @da
definition: Relaterer et eksemplar til et værk, som er knyttet til et eksemplar. @da
label: έχει σχετικό έργο (αντίτυπο) @el
definition: Συνδέει ένα αντίτυπο με ένα έργο που συνδέεται με ένα περιγραφόμενο αντίτυπο. @el
label: té com a obra relacionada amb un ítem @ca
definition: Relaciona un ítem amb una obra que s’associa amb un ítem. @ca
definition: Met un item en relation avec une œuvre qui est associée à un item.
toolkit label: related work of item @en
toolkit definition: A work that is associated with an item. @en
has element type: 1
sub property of: P00002
label: példány kapcsolódó műve a következő: @hu
definition: Hozzákapcsol egy példányt egy műhöz, amelyet egy példányhoz társítanak. @hu
toolkit label: œuvre en relation avec un item
toolkit definition: Œuvre qui est associée à un item.
definition: Liittää kappaleen teokseen, joka liittyy kappaleeseen. @fi
toolkit label: kappaleeseen liittyvä teos @fi
toolkit definition: Teos, joka liittyy kappaleeseen. @fi
label: kappaleeseen liittyvä teos @fi
label: har verk relatert til eksemplar @no
definition: Relaterer et eksemplar til et verk som forbindes med et eksemplar. @no
toolkit label: verk relatert til eksemplar @no
toolkit definition: Et verk som forbindes med et eksemplar. @no
label: heeft gerelateerd werk van item @nl
definition: Relateert een item aan een werk dat geassocieerd is met een item. @nl
toolkit label: gerelateerd werk van item @nl
toolkit definition: Een werk dat geassocieerd is met een item. @nl
label: له عمل مرتبط بمفردة @ar
definition: يربط مفردة بعمل ذي صلة بمفردة. @ar
toolkit label: عمل مرتبط بمفردة @ar
toolkit definition: عمل ذو صلة بمفردة @ar
toolkit label: obra relacionada amb un ítem @ca
toolkit definition: Obra que s’associa amb un ítem. @ca
toolkit label: værk relateret til eksemplar @da
toolkit definition: Værk, som er knyttet til et eksemplar. @da
label: eksemplariga seotud teos @et
definition: Seostab eksemplari eksemplariga seotud teosega. @et
toolkit label: eksemplariga seotud teos @et
toolkit definition: Eksemplariga seotud teos. @et
label: hat mit Exemplar in Beziehung stehendes Werk @de
definition: Setzt ein Exemplar in Beziehung zu einem Werk, das mit einem Exemplar in Verbindung steht. @de
toolkit label: mit Exemplar in Beziehung stehendes Werk @de
toolkit definition: Ein Werk, das mit einem Exemplar in Verbindung steht. @de
toolkit label: példányhoz kapcsolódó mű: @hu
toolkit definition: Egy mű, amelyet egy példányhoz társítanak. @hu
label: ha come opera correlata di item @it
definition: Correla un item un'opera associata a un item. @it
toolkit label: opera correlata di item @it
toolkit definition: Opera associata a un item. @it
label: ar vienību saistītais darbs @lv
definition: Sasaista vienību ar darbu, kas saistīts ar vienību. @lv
toolkit label: ar vienību saistītais darbs @lv
toolkit definition: Darbs, kas saistīts ar vienību. @lv
has subproperty: a pour reliure d’un item
has subproperty: est un item sujet de
has subproperty: P40069
label: 有单件的关联作品 @zh-hans
definition: 将一个单件与和一个单件有关的一种作品关联起来。 @zh-hans
toolkit label: 单件的关联作品 @zh-hans
toolkit definition: 和一个单件有关的一种作品 @zh-hans
label: kopyanın ilgili eseri ile ilişkilidir @tr
definition: Bir kopyayı, bir kopyayla bağlantılı olan bir eserle ilişkilendirir. @tr
toolkit label: Kopyayla ilişkili eser @tr
toolkit definition: Bir kopya ile bağlantılı olan bir eser. @tr

est réimprimé comme un item
status: Published
label: is reprinted as item @en
type: Property
lexical alias: reprintedAsItem.en
domain: C10003
definition: Relates an item to a manifestation that is a reissue of an item that exemplifies another printed manifestation. @en
sub property of: est reproduit comme un item
toolkit label: reprinted as item @en
toolkit definition: A manifestation that is a reissue of an item that exemplifies another printed manifestation. @en
has element type: 2
definition: Met un item en relation avec une manifestation qui consiste en une réédition d’un item exemplifiant une autre manifestation imprimée.
toolkit label: réimprimé comme un item
toolkit definition: Manifestation qui consiste en une réédition d’un item exemplifiant une autre manifestation imprimée.
label: kappaleen uusintapainos @fi
definition: Liittää kappaleen manifestaatioon, joka on uusintajulkaisu toista painettua manifestaatiota edustavasta kappaleesta. @fi
toolkit label: kappaleen uusintapainos @fi
toolkit definition: Manifestaatio, joka on uusintajulkaisu toista painettua manifestaatiota edustavasta kappaleesta. @fi
label: er opptrykk av eksemplar @no
definition: Relaterer et eksemplar til en manifestasjon som er et opptrykk av et eksemplar som eksemplifiserer en annen trykt manifestasjon. @no
toolkit label: opptrykk av eksemplar @no
toolkit definition: En manifestasjon som er et opptrykk av et eksemplar som eksemplifiserer en annen trykt manifestasjon. @no
label: is herdrukt als item @nl
definition: Relateert een item aan een manifestatie die een heruitgave is van een item dat een andere gedrukte manifestatie voorstelt. @nl
toolkit label: herdrukt als item @nl
toolkit definition: Een manifestatie die een heruitgave is van een item dat een andere gedrukte manifestatie voorstelt. @nl
label: أُعيد طبعها كمفردة @ar
definition: يربط مفردة بتجسيدة هى اعادة اصدار لمفردة تمثل تجسيدة أخرى مطبوعة. @ar
toolkit label: أُعيد طبعها كمفردة @ar
toolkit definition: تجسيدة هي إعادة اصدار لمفردة تُمثل تجسيدة أخرى مطبوعة. @ar
label: és reimprès com a ítem @ca
definition: Relaciona un ítem amb una manifestació que és una reimpressió d’un ítem que exemplifica una altra manifestació impresa. @ca
toolkit label: reimprès com a ítem @ca
toolkit definition: Manifestació que és una reimpressió d’un ítem que exemplifica una altra manifestació impresa. @ca
label: er genoptrykt som eksemplar @da
definition: Relaterer et eksemplar til en manifestation, som er en genudgivelse af et eksemplar, som eksemplificerer en anden trykt manifestation. @da
toolkit label: genoptrykt som eksemplar @da
toolkit definition: Manifestation, som er en genudgivelse af et eksemplar, som eksemplificerer en anden trykt manifestation. @da
label: eksemplari kordustrükk @et
definition: Seostab eksemplari kehastusega, mis on teist trükitud kehastust esindava eksemplari kordustrükk. @et
toolkit label: eksemplari kordustrükk @et
toolkit definition: Kehastus, mis on teist trükitud kehastust esindava eksemplari kordustrükk. @et
label: ist nachgedruckt als Exemplar @de
definition: Setzt ein Exemplar in Beziehung zu einer Manifestation, die eine Neuauflage eines Exemplars ist, das eine andere gedruckte Manifestation darstellt. @de
toolkit label: Nachgedruckt als Exemplar @de
toolkit definition: Eine Manifestation, die eine Neuauflage eines Exemplars ist, das eine andere gedruckte Manifestation darstellt. @de
label: reprint példánya a következőnek: @hu
definition: Hozzákapcsol egy példányt egy megjelenési formához, amely egy példány kiadása, amely egy másik nyomtatott megjelenési formát példáz. @hu
toolkit label: reprint példány: @hu
toolkit definition: Egy megjelenési forma, amely egy példány kiadása, amely egy másik nyomtatott megjelenési formát példáz. @hu
label: è ristampato come item @it
definition: Correla un itema una manifestazione che è una riemissione di un item che esemplifica un'altra manifestazione a stampa. @it
toolkit label: ristampato come item @it
toolkit definition: Manifestazione che è una riemissione di un item che esemplifica un'altra manifestazione a stampa. @it
label: ir vienības reprints @lv
definition: Sasaista vienību ar manifestāciju, kas ir vienības, kas ir citas drukātas manifestācijas paraugeksemplārs, reprints. @lv
toolkit label: vienības reprints @lv
toolkit definition: Manifestācija, kas ir vienības, kas ir citas drukātas manifestācijas paraugeksemplārs, reprints. @lv
has subproperty: P40091
label: 被重印为单件 @zh-hans
definition: 将一个单件与作为例证另一个印刷载体表现的一个单件的重新发行本的一种载体表现关联起来。 @zh-hans
toolkit label: 被重印为单件 @zh-hans
toolkit definition: 作为例证另一个印刷载体表现的一个单件的重新发行本的一种载体表现 @zh-hans
label: kopya olarak yeniden basılmıştır @tr
definition: Bir kopyayı, başka bir basılı gösterimden kopya edilen bir kopyanın yeniden yayımı olan bir gösterimle ilişkilendirir. @tr
toolkit label: kopya olarak yeniden basılmış @tr
toolkit definition: Başka bir basılı gösterimi örnekleyen bir kopyanın yeniden basımı olan bir gösterim. @tr

est réimprimé comme (item)
status: Deprecated
type: Property
domain: C10003
definition: Met un item en relation avec un item qui est une réédition d’un item représentant une autre manifestation imprimée.
toolkit label: réimprimé comme (item)
toolkit definition: Item qui est une réédition d’un item représentant une autre manifestation imprimée.
toolkit label: reimpreso como (ítem) @es
toolkit definition: Un ítem que es una reedición de un ítem que ejemplifica otra manifestación impresa. @es
sub property of: est reproduit comme (item)
instruction number: 24.5
label: được in lại như là (bản) @vi
definition: Liên kết bản với bản là bản công bố lại của bản thể hiện biểu thị được in khác. @vi
toolkit label: được in lại như là (bản) @vi
toolkit definition: Bản là bản công bố lại của bản thể hiện biểu thị được in khác. @vi
label: er genoptryk som (eksemplar) @da
definition: Relaterer et eksemplar til et eksemplar, der er en genudgivelse af et eksemplar, som eksemplificerer en anden trykt manifestation. @da
toolkit label: genoptrykt som (eksemplar) @da
toolkit definition: Eksemplar, der er en genudgivelse af et eksemplar, som eksemplificerer en anden trykt manifestation. @da
label: ist nachgedruckt als (Exemplar) @de
definition: Setzt ein Exemplar mit einem Exemplar, das eine Neuausgabe eines Exemplars ist, das eine andere gedruckte Manifestation darstellt, in Beziehung. @de
toolkit label: Nachgedruckt als (Exemplar) @de
toolkit definition: Ein Exemplar, das eine Neuausgabe eines Exemplars ist, das eine andere gedruckte Manifestation darstellt. @de
label: είναι ανατυπωμένο ως (αντίτυπο) @el
definition: Συνδέει ένα αντίτυπο με ένα αντίτυπο το οποίο είναι επανέκδοση ενός αντιτύπου που υλοποιεί κάποια άλλη έντυπη εκδήλωση. @el
toolkit label: ανατυπωμένο ως (αντίτυπο) @el
toolkit definition: Ένα αντίτυπο το οποίο είναι επανέκδοση ενός αντιτύπου που υλοποιεί κάποια άλλη έντυπη εκδήλωση. @el
label: és reimprès com (ítem) @ca
definition: Relaciona un item amb un ítem que és una reimpressió d’un ítem que exemplifica una altra manifestació impresa. @ca
toolkit label: reimprès com (ítem) @ca
toolkit definition: Ítem que és una reimpressió d’un ítem que exemplifica una altra manifestació impresa. @ca
label: uusintapainos (kappale) @fi
definition: Liittää kappaleen kappaleeseen, joka on uusi painos toisesta samansisältöisestä manifestaatiosta. @fi
toolkit label: uusintapainos (kappale) @fi
toolkit definition: Kappale, joka on uusi painos toisesta samansisältöisestä manifestaatiosta. @fi
toolkit label: opptrykt som (eksemplar) @no
toolkit definition: Et eksemplar som er et opptrykk av et eksemplar som er et eksempel på en annen trykt manifestasjon. @no
lexical alias: reprintedAsItem.en
has subproperty: P40060

est une réimpression de (item)
status: Deprecated
type: Property
domain: C10003
sub property of: est une reproduction de (item)
definition: Met un item en relation avec un item qui représente une manifestation imprimée servant de base à une réédition d’une manifestation.
toolkit label: réimpression de (item)
toolkit definition: Item qui représente une manifestation imprimée servant de base à une réédition d’une manifestation.
toolkit label: reimpresión de (ítem) @es
toolkit definition: Un ítem que ejemplifica una manifestación impresa que se usa como base para una reedición de una manifestación. @es
instruction number: 24.5
label: là tái bản của (bản) @vi
definition: Liên kết bản với bản thể hiện biểu thị đã được in, được sử dụng như là cơ sở cho công bố lại biểu thị. @vi
toolkit label: tái bản của (bản) @vi
toolkit definition: Bản thể hiện biểu thị đã được in, được sử dụng như là cơ sở cho công bố lại biểu thị. @vi
label: er genudgivelse af (eksemplar) @da
definition: Relaterer et eksemplar til et eksemplar, der eksemplificerer en trykt manifestation, der er anvendt som grundlag for et genoptryk af en manifestation. @da
toolkit label: genudgivelse af (eksemplar) @da
toolkit definition: Eksemplar, der eksemplificerer en trykt manifestation, der er anvendt som grundlag for et genoptryk af en manifestation. @da
label: ist Nachdruck von (Exemplar) @de
definition: Setzt ein Exemplar mit einem Exemplar, das eine gedruckte Manifestation darstellt, die als Grundlage für eine Neuausgabe einer Manifestation verwendet wurde, in Beziehung. @de
toolkit label: Nachdruck von (Exemplar) @de
toolkit definition: Ein Exemplar, das eine gedruckte Manifestation darstellt, die als Grundlage für eine Neuausgabe einer Manifestation verwendet wurde. @de
label: είναι ανατύπωση του (αντίτυπο) @el
definition: Συνδέει ένα αντίτυπο με ένα αντίτυπο το οποίο αποτελεί παράδειγμα υλοποίησης μιας έντυπης εκδήλωσης η οποία χρησιμοποιείται ως η βάση για την επανέκδοση μιας εκδήλωσης. @el
toolkit label: ανατύπωση του (αντίτυπο) @el
toolkit definition: Ένα αντίτυπο το οποίο αποτελεί παράδειγμα υλοποίησης μιας έντυπης εκδήλωσης, η οποία χρησιμοποιείται ως η βάση για την επανέκδοση μιας εκδήλωσης. @el
label: és reimpressió de (ítem) @ca
definition: Relaciona un item amb un ítem que exemplifica una manifestació impresa que s’usa com a base d’una reimpressió d’una manifestació. @ca
toolkit label: reimpressió de (ítem) @ca
toolkit definition: Ítem que exemplifica una manifestació impresa que s’usa com a base d’una reimpressió d’una manifestació. @ca
label: alkuperäinen painos (kappale) @fi
definition: Liittää kappaleen kappaleeseen, joka edustaa julkaistua manifestaatiota, jonka pohjalta manifestaation uusi painos on tehty. @fi
toolkit label: alkuperäinen painos (kappale) @fi
toolkit definition: Kappale, joka edustaa julkaistua manifestaatiota, jonka pohjalta manifestaation uusi painos on tehty. @fi
toolkit label: opptrykk av (eksemplar) @no
toolkit definition: Et eksemplar som er et eksempel på en trykt manifestasjon som brukes som utgangspunkt for et opptrykk av en manifestasjon. @no
lexical alias: reprintOfItem.en
has subproperty: P40038

est reproduit comme un item
status: Published
label: is reproduced as item @en
type: Property
lexical alias: reproducedAsItem.en
definition: Relates an item to a manifestation that reproduces an item that exemplifies another manifestation. @en
domain: C10003
sub property of: a pour manifestation en relation avec un item
toolkit label: reproduced as item @en
toolkit definition: A manifestation that reproduces an item that exemplifies another manifestation. @en
has element type: 2
definition: Met un item en relation avec une manifestation qui reproduit un item exemplifiant une autre manifestation.
toolkit label: reproduit comme un item
toolkit definition: Manifestation qui reproduit un item exemplifiant une autre manifestation.
label: kappaleen jäljenne @fi
definition: Liittää kappaleen manifestaatioon, joka on jäljenne toista manifestaatiota edustavasta kappaleesta. @fi
toolkit label: kappaleen jäljenne @fi
toolkit definition: Manifestaatio, joka on jäljenne toista manifestaatiota edustavasta kappaleesta. @fi
label: er reproduksjon av eksemplar @no
definition: Relaterer et eksemplar til en manifestasjon som reproduserer et eksemplar som eksemplifiserer en annen manifestasjon. @no
toolkit label: reproduksjon av eksemplar @no
toolkit definition: En manifestasjon som reproduserer et eksemplar som eksemplifiserer en annen manifestasjon. @no
label: is gereproduceerd als item @nl
definition: Relateert een item aan een manifestatie die een item reproduceert dat een andere manifestatie voorstelt. @nl
toolkit label: gereproduceerd als item @nl
toolkit definition: Een manifestatie die een item reproduceert dat een andere manifestatie voorstelt. @nl
label: هي مستنسخة كمفردة @ar
definition: يربط مفردة بتجسيدة تستنسخ مفردة تمثل تجسيدة أخرى. @ar
toolkit label: مستنسخة كمفردة @ar
toolkit definition: تجسيدة تستنسخ مفردة تمثل تجسيدة أخرى. @ar
label: és reproduït com a ítem @ca
definition: Relaciona un ítem amb una manifestació que reprodueix un ítem que exemplifica una altra manifestació. @ca
toolkit label: reproduït com a ítem @ca
toolkit definition: Manifestació que reprodueix un ítem que exemplifica una altra manifestació. @ca
label: er reproduceret som eksemplar @da
definition: Relaterer et eksemplar til en manifestation, som gengiver et eksemplar, som eksemplificerer en anden manifestation. @da
toolkit label: reproduceret som eksemplar @da
toolkit definition: Manifestation, som gengiver et eksemplar, som eksemplificerer en anden manifestation. @da
label: eksemplari reproduktsioon @et
definition: Seostab eksemplari kehastusega, mis on teist kehastust esindava eksemplari reproduktsioon. @et
toolkit label: eksemplari reproduktsioon @et
toolkit definition: Kehastus, mis on teist kehastust esindava eksemplari reproduktsioon. @et
label: ist reproduziert als Exemplar @de
definition: Setzt ein Exemplar in Beziehung zu einer Manifestation, die ein Exemplar reproduziert, welches eine andere Manifestation darstellt. @de
toolkit label: Reproduziert als Exemplar @de
toolkit definition: Eine Manifestation, die ein Exemplar reproduziert, welches eine andere Manifestation darstellt. @de
label: reprodukált példánya a következőnek: @hu
definition: Hozzákapcsol egy példányt egy megjelenési formához, amely reprodukál egy példányt, amely egy másik megjelenési formát példáz. @hu
toolkit label: reprodukciós példány: @hu
toolkit definition: Egy megjelenési forma, amely reprodukál egy példányt, amely egy másik megjelenési formát példáz. @hu
label: è riprodotto come item @it
definition: Correla un item a una manifestazione che riproduce un item che esemplifica un'altra manifestazione. @it
toolkit label: riprodotto come item @it
toolkit definition: Manifestazione che riproduce un item che esemplifica un'altra manifestazione. @it
label: ir vienības reprodukcija @lv
definition: Sasaista vienību ar manifestāciju, kas atveido citu manifestāciju pārstāvošu vienību. @lv
toolkit label: vienības reprodukcija @lv
toolkit definition: Manifestācija, kas atveido citu manifestāciju pārstāvošu vienību. @lv
has subproperty: a pour transfert numérique d’un item
has subproperty: a pour reproduction électronique d’un item
has subproperty: a pour fac-similé d’un item
has subproperty: est réimprimé comme un item
has subproperty: P40092
label: 被复制为单件 @zh-hans
definition: 将一个单件与复制例证另一种载体表现的一个单件的一种载体表现关联起来。 @zh-hans
toolkit label: 被复制为单件 @zh-hans
toolkit definition: 复制例证另一种载体表现的一个单件的一种载体表现 @zh-hans
label: kopya olarak yeniden yapılmıştır @tr
definition: Bir kopyayı, başka bir gösterimden kopya edilen bir kopyayı yeniden üreten bir gösterimle ilişkilendirir. @tr
toolkit label: kopya olarak yeniden üretilmiş @tr
toolkit definition: Başka bir gösterimi örnekleyen bir kopyayı yeniden üreten bir gösterim. @tr

est reproduit comme (item)
status: Deprecated
type: Property
domain: C10003
definition: Met un item en relation avec un item qui reproduit un autre item.
toolkit label: reproduit comme (item)
toolkit definition: Item qui reproduit un autre item.
toolkit label: reproducida como (ítem) @es
toolkit definition: Un ítem que reproduce otro ítem. @es
sub property of: a pour item équivalent
instruction number: 24.5
label: được sao chép như là (bản) @vi
definition: Liên kết bản với bản tạo lại bản khác. @vi
toolkit label: được sao chép như là (bản) @vi
toolkit definition: Bản tạo lại bản khác. @vi
label: er reproduceret som (eksemplar) @da
definition: Relaterer et eksemplar til et eksemplar, der reproducerer et andet eksemplar. @da
toolkit label: reproduceret som (eksemplar) @da
toolkit definition: Eksemplar, der reproducerer et andet eksemplar. @da
label: ist reproduziert als (Exemplar) @de
definition: Setzt ein Exemplar mit einem Exemplar, das ein anderes Exemplar reproduziert, in Beziehung. @de
toolkit label: Reproduziert als (Exemplar) @de
toolkit definition: Ein Exemplar, das ein anderes Exemplar reproduziert. @de
label: έχει αναπαραχθεί ως (αντίτυπο) @el
definition: Συνδέει ένα αντίτυπο με ένα αντίτυπο που αναπαράγει κάποιο άλλο αντίτυπο. @el
toolkit label: έχει αναπαραχθεί ως (αντίτυπο) @el
toolkit definition: Ένα αντίτυπο που αναπαράγει κάποιο άλλο αντίτυπο. @el
label: és reproduït com (ítem) @ca
definition: Relaciona un item amb un ítem que reprodueix un altre ítem. @ca
toolkit label: reproduït com (ítem) @ca
toolkit definition: Ítem que reprodueix un altre ítem. @ca
label: jäljenteenä (kappale) @fi
definition: Liittää kappaleen kappaleeseen, joka on jäljenne toisesta kappaleesta. @fi
toolkit label: jäljenteenä (kappale) @fi
toolkit definition: Kappale, joka on jäljenne toisesta kappaleesta. @fi
toolkit label: reprodusert som (eksemplar) @no
toolkit definition: Et eksemplar som reproduserer et annet eksemplar. @no
lexical alias: reproducedAsItem.en
has subproperty: a pour transfert numérique (item)
has subproperty: a pour reproduction électronique (item)
has subproperty: a pour fac-similé (item)
has subproperty: est réimprimé comme (item)
has subproperty: P40055

est une reproduction de (item)
status: Deprecated
type: Property
domain: C10003
sub property of: a pour item équivalent
definition: Met un item en relation avec un item qui sert de base à une reproduction.
toolkit label: reproduction de (item)
toolkit definition: Item qui sert de base à une reproduction.
toolkit label: reproducción de (ítem) @es
toolkit definition: Un ítem que es usado como base para una reproducción. @es
instruction number: 24.5
label: là sao chép của (bản) @vi
definition: Liên kết bản với bản được sử dụng như là cơ sở cho sản xuất lại. @vi
toolkit label: sao chép của (bản) @vi
toolkit definition: Bản được sử dụng như là cơ sở cho sản xuất lại. @vi
label: er reproduktion af (eksemplar) @da
definition: Relaterer et eksemplar til et eksemplar, der er anvendt som grundlag for en reproduktion. @da
toolkit label: reproduktion af (eksemplar) @da
toolkit definition: Eksemplar, der er anvendt som grundlag for en reproduktion. @da
label: ist Reproduktion von (Exemplar) @de
definition: Setzt ein Exemplar mit einem Exemplar, das als Grundlage für eine Reproduktion verwendet wurde, in Beziehung. @de
toolkit label: Reproduktion von (Exemplar) @de
toolkit definition: Ein Exemplar, das als Grundlage für eine Reproduktion verwendet wurde. @de
label: είναι αναπαραγωγή του (αντίτυπο) @el
definition: Συνδέει ένα αντίτυπο με ένα αντίτυπο το οποίο χρησιμοποιείται ως η βάση για μια αναπαραγωγή. @el
toolkit label: αναπαραγωγή του (αντίτυπο) @el
toolkit definition: Ένα αντίτυπο το οποίο χρησιμοποιείται ως η βάση για μια αναπαραγωγή. @el
label: és reproducció de (ítem) @ca
definition: Relaciona un item amb un ítem que s’usa com a base d’una reproducció. @ca
toolkit label: reproducció de (ítem) @ca
toolkit definition: Ítem que s’usa com a base d’una reproducció. @ca
label: jäljenne kappaleesta @fi
definition: Liittää kappaleen jäljentämisen perustana käytettyyn kappaleeseen. @fi
toolkit label: jäljenne kappaleesta @fi
toolkit definition: Jäljentämisen perustana käytetty kappale. @fi
toolkit label: reproduksjon av (eksemplar) @no
toolkit definition: Et eksemplar som brukes som utgangspunkt for en reproduksjon. @no
lexical alias: reproductionOfItem.en
has subproperty: est un transfert numérique de (item)
has subproperty: est une reproduction électronique de (item)
has subproperty: est un fac-un similé de (item)
has subproperty: est une réimpression de (item)
has subproperty: P40042

a pour agent restaurateur d’un item
status: Published
label: has restorationist agent of item @en
definition: Relates an item to an agent who is responsible for the set of technical, editorial, and intellectual procedures aimed at compensating for the degradation of an item by bringing it back to a state as close as possible to its original condition. @en
type: Property
domain: C10003
sub property of: a pour agent modificateur
lexical alias: restorationistAgentOfItem.en
toolkit label: restorationist agent of item @en
toolkit definition: An agent who is responsible for the set of technical, editorial, and intellectual procedures aimed at compensating for the degradation of an item by bringing it back to a state as close as possible to its original condition. @en
definition: Met un item en relation avec un agent qui est responsable de l’ensemble des procédures techniques, éditoriales et intellectuelles destinées à compenser la dégradation d’un item en le ramenant à un état aussi près que possible de sa condition originelle.
toolkit label: agent restaurateur d’un item
toolkit definition: Agent qui est responsable de l’ensemble des procédures techniques, éditoriales et intellectuelles destinées à compenser la dégradation d’un item en le ramenant à un état aussi près que possible de sa condition originelle.
toolkit label: restaurador @es
toolkit definition: Una persona, familia o entidad corporativa responsable del conjunto de procedimientos técnicos, editoriales e intelectuales orientados a compensar la degradación de un ítem devolviéndolo a un estado lo más cercano posible a su estado original. @es
instruction number: 18.5
label: có người phục chế (bản) @vi
definition: Liên kết bản với tác nhân có trách nhiệm tới chuỗi các quy trình kỹ thuật, biên tập, và trí tuệ trong việc khắc phục sự xuống cấp của bản bằng cách đưa nó về trạng thái gần giống nhất có thể với điều kiện nguyên gốc. @vi
toolkit label: người phục chế (bản) @vi
toolkit definition: Tác nhân có trách nhiệm tới chuỗi các quy trình kỹ thuật, biên tập, và trí tuệ trong việc khắc phục sự xuống cấp của bản bằng cách đưa nó về trạng thái gần giống nhất có thể với điều kiện nguyên gốc. @vi
label: har agent, som er konservator af eksemplar @da
definition: Relaterer et eksemplar til en agent, som er ansvarlig for en række af tekniske, redaktionelle og intellektuelle procedurer, som forsøger at kompensere for nedslidningen af et eksemplar ved at føre det tilbage til en tilstand, der er så tæt som muligt på dets oprindelige tilstand. @da
toolkit label: agent, som er konservator af eksemplar @da
toolkit definition: Agent, som er ansvarlig for en række af tekniske, redaktionelle og intellektuelle procedurer, som forsøger at kompensere for nedslidningen af et eksemplar ved at føre det tilbage til en tilstand, der er så tæt som muligt på dets oprindelige tilstand. @da
label: hat Restauratorin/Restaurator eines Exemplars (Akteur) @de
definition: Setzt ein Exemplar in Beziehung zu einem Akteur, der für die technischen, redaktionellen und intellektuellen Verfahren verantwortlich ist, die darauf abzielen, die Zersetzung eines Exemplars auszugleichen, indem es in einen Zustand zurückversetzt wird, der seiner ursprünglichen Beschaffenheit möglichst nahe kommt. @de
toolkit label: Restauratorin/Restaurator eines Exemplars (Akteur) @de
toolkit definition: Ein Akteur, der für die technischen, redaktionellen und intellektuellen Verfahren verantwortlich ist, die darauf abzielen, die Zersetzung eines Exemplars auszugleichen, indem es in einen Zustand zurückversetzt wird, der seiner ursprünglichen Beschaffenheit möglichst nahe kommt. @de
label: έχει συντηρητή (αντίτυπο) @el
definition: Συνδέει ένα αντίτυπο με έναν φορέα υπεύθυνο για το σύνολο των τεχνικών, συντακτικών και διανοητικών διαδικασιών που στοχεύουν στην αποκατάσταση της αποδόμησης ενός αντιτύπου επαναφέροντάς το όσο το δυνατόν εγγύτερα στην αρχική του κατάσταση. @el
toolkit label: συντηρητής (αντίτυπο) @el
toolkit definition: Ένας φορέας υπεύθυνος για το σύνολο των τεχνικών, συντακτικών και διανοητικών διαδικασιών που στοχεύουν στην αποκατάσταση της αποδόμησης ενός αντιτύπου επαναφέροντάς το όσο το δυνατόν εγγύτερα στην αρχική του κατάσταση. @el
label: té com a agent restaurador d’un ítem @ca
definition: Relaciona un ítem amb un agent que és responsable del conjunt de procediments tècnics, editorials i intel·lectuals destinats a compensar la degradació d’un ítem retornant-lo a un estat que s’aproximi al màxim a la seva condició original. @ca
toolkit label: agent restaurador d’un ítem @ca
toolkit definition: Agent que és responsable del conjunt de procediments tècnics, editorials i intel·lectuals destinats a compensar la degradació d’un ítem retornant-lo a un estat que s’aproximi al màxim a la seva condició original. @ca
definition: Liittää kappaleen toimijaan, joka vastaa teknisistä, toimituksellisista ja tiedollisista toimenpiteistä, joiden tarkoitus on palauttaa huonokuntoinen kappale mahdollisimman lähelle sen alkuperäistä kuntoa. @fi
toolkit label: kappaleen entisöijä (toimija) @fi
toolkit definition: Toimija, joka vastaa teknisistä, toimituksellisista ja tiedollisista toimenpiteistä, joiden tarkoitus on palauttaa huonokuntoinen kappale mahdollisimman lähelle sen alkuperäistä kuntoa. @fi
toolkit label: konservator for eksemplar (agent) @no
toolkit definition: En agent som har ansvar for de tekniske og intellektuelle metodene som brukes for å kompensere for nedbrytningen av et eksemplar ved å restaurere det til en tilstand som er så lik originaltilstanden som mulig. @no
has element type: 2
label: példány restaurátor ágense a következő: @hu
definition: Hozzákapcsol egy példányt egy ágenshez, amely felelős technikai, szerkesztői és intellektuális eljárások összességéért, amelyek célja egy példány romlásának ellensúlyozása, amivel azt az eredeti állapotához a lehető legközelebb képesek visszahozni. @hu
toolkit label: példány restaurátor ágense: @hu
toolkit definition: Egy ágens, amely felelős technikai, szerkesztői és intellektuális eljárások összességéért, amelyek célja egy példány romlásának ellensúlyozása, amivel azt az eredeti állapotához a lehető legközelebb képesek visszahozni. @hu
alternative label: restorationist (item) @en
alternative label: restaurateur (item)
alternative label: entisöijä (kappale) @fi
label: kappaleen entisöijä (toimija) @fi
label: har konservator for eksemplar (agent) @no
definition: Relaterer et eksemplar til en agent som har ansvar for de tekniske og intellektuelle metodene som brukes for å kompensere for nedbrytningen av et eksemplar ved å restaurere det til en tilstand som er så lik originaltilstanden som mulig. @no
alternative label: konservator for eksemplar @no
label: heeft restaurator-actor van item @nl
definition: Relateert een item aan een actor die verantwoordelijk is voor de verzameling van technische, redactionele en intellectuele procedures gericht op het corrigeren van de achteruitgang van een item door het zo goed mogelijk terug te brengen tot de oorspronkelijke staat. @nl
toolkit label: restaurator-actor van item @nl
toolkit definition: Een actor die verantwoordelijk is voor de verzameling van technische, redactionele en intellectuele procedures gericht op het corrigeren van de achteruitgang van een item door het zo goed mogelijk terug te brengen tot de oorspronkelijke staat. @nl
label: له وكيل مرمم لمفردة @ar
definition: يربط مفردة بوكيل مسئول عن مجموعة الإجراءاتالفنية، والتحريرية، والفكرية التي تهدف إلى إصلاح التدهور الذي لحق بمفردة وإعادتها إلى حالة أقرب ما تكون إلى حالتها الأصلية. @ar
alternative label: مُرمم (مفردة) @ar
toolkit label: وكيل مرمم لمفردة @ar
toolkit definition: وكيل مسئول عن مجموعة الإجراءات الفنية، والتحريرية، والفكرية التي تهدف إلى إصلاح التدهور الذي لحق بمفردة وإعادتها إلى حالة أقرب ما تكون إلى حالتها الأصلية. @ar
alternative label: restaurador de (ítem) @ca
alternative label: konservator af eksemplar @da
label: eksemplari restaureerija (tegija) @et
definition: Seostab eksemplari tegijaga, kes vastutab rea tehniliste, toimetuslike ja intellektuaalsete toimingute eest, mille eesmärk on taastada kahjustatud eksemplari seisund võimalikult originaalseisundi lähedaseks. @et
alternative label: eksemplari restaureerija @et
alternative label: eksemplari ennistaja @et
toolkit label: eksemplari restaureerija (tegija) @et
toolkit definition: Tegija, kes vastutab rea tehniliste, toimetuslike ja intellektuaalsete toimingute eest, mille eesmärk on taastada kahjustatud eksemplari seisund võimalikult originaalseisundi lähedaseks. @et
alternative label: példány restaurátora @hu
label: ha come restauratore agente di item @it
definition: Correla un item all'agente responsabile dell'insieme delle procedure tecniche, di cura e intellettuali finalizzate al risarcimento di un item in seguito alla sua degradazione, riportandolo a uno stato il più possibile vicino alla condizione originale. @it
alternative label: restauratore di item @it
toolkit label: restauratore di item agente @it
toolkit definition: Agente responsabile dell'insieme delle procedure tecniche, di cura e intellettuali finalizzate al risarcimento di un item in seguito alla sua degradazione, riportandolo a uno stato il più possibile vicino alla condizione originale. @it
label: vienības restaurators (aģents) @lv
definition: Sasaista vienību ar aģentu, kas ir atbildīgs par tehnisko, redakcionālo un intelektuālo procedūru kopumu, kuru mērķis ir kompensēt vienības pakāpenisko bojāeju, atgriežot to, cik vien iespējams, tuvu tās sākotnējam stāvoklim. @lv
toolkit label: vienības restaurators (aģents) @lv
toolkit definition: Aģents, kas ir atbildīgs par tehnisko, redakcionālo un intelektuālo procedūru kopumu, kuru mērķis ir kompensēt vienības pakāpenisko bojāeju, atgriežot to, cik vien iespējams, tuvu tās sākotnējam stāvoklim. @lv
has subproperty: a pour agent collectif restaurateur d’un item

a pour agent collectif restaurateur d’un item
status: Published
label: has restorationist collective agent of item @en
lexical alias: restorationistCollectiveAgentOfItem.en
definition: Relates an item to a collective agent who is responsible for the set of technical, editorial, and intellectual procedures aimed at compensating for the degradation of an item by bringing it back to a state as close as possible to its original condition. @en
toolkit label: restorationist collective agent of item @en
toolkit definition: A collective agent who is responsible for the set of technical, editorial, and intellectual procedures aimed at compensating for the degradation of an item by bringing it back to a state as close as possible to its original condition. @en
type: Property
domain: C10003
has element type: 2
sub property of: a pour agent collectif modificateur
sub property of: a pour agent restaurateur d’un item
definition: Met un item en relation avec un agent collectif qui est responsable de l’ensemble des procédures techniques, éditoriales et intellectuelles destinées à compenser la dégradation d’un item en le ramenant à un état aussi près que possible de sa condition originelle.
toolkit label: agent collectif restaurateur d’un item
toolkit definition: Agent collectif qui est responsable de l’ensemble des procédures techniques, éditoriales et intellectuelles destinées à compenser la dégradation d’un item en le ramenant à un état aussi près que possible de sa condition originelle.
label: kappaleen entisöijä (yhteistoimija) @fi
definition: Liittää kappaleen yhteistoimijaan, joka vastaa teknisistä, toimituksellisista ja tiedollisista toimenpiteistä, joiden tarkoitus on palauttaa huonokuntoinen kappale mahdollisimman lähelle sen alkuperäistä kuntoa. @fi
toolkit label: kappaleen entisöijä (yhteistoimija) @fi
toolkit definition: Yhteistoimija, joka vastaa teknisistä, toimituksellisista ja tiedollisista toimenpiteistä, joiden tarkoitus on palauttaa huonokuntoinen kappale mahdollisimman lähelle sen alkuperäistä kuntoa. @fi
label: har konservator for eksemplar (kollektiv agent) @no
definition: Relaterer et eksemplar til en kollektiv agent som har ansvar for de tekniske og intellektuelle metodene som brukes for å kompensere for nedbrytningen av et eksemplar ved å restaurere det til en tilstand som er så lik originaltilstanden som mulig. @no
toolkit label: konservator for eksemplar (kollektiv agent) @no
toolkit definition: En kollektiv agent som har ansvar for de tekniske og intellektuelle metodene som brukes for å kompensere for nedbrytningen av et eksemplar ved å restaurere det til en tilstand som er så lik originaltilstanden som mulig. @no
label: heeft restaurator-collectieve actor van item @nl
definition: Relateert een item aan een collectieve actor die verantwoordelijk is voor de verzameling van technische, redactionele en intellectuele procedures gericht op het corrigeren van de achteruitgang van een item door het zo goed mogelijk terug te brengen tot de oorspronkelijke staat. @nl
toolkit label: restaurator-collectieve actor van item @nl
toolkit definition: Een collectieve actor die verantwoordelijk is voor de verzameling van technische, redactionele en intellectuele procedures gericht op het corrigeren van de achteruitgang van een item door het zo goed mogelijk terug te brengen tot de oorspronkelijke staat. @nl
label: له وكيل جماعي مرمم لمفردة @ar
definition: يربط مفردة بوكيل جماعي مسئول عن مجموعة الإجراءات لفنية، والتحريرية، والفكرية التي تهدف إلى إصلاح التدهور الذي لحق بمفردة وإعادتها إلى حالة أقرب ما تكون إلى حالتها الأصلية. @ar
toolkit label: وكيل جماعي مرمم لمفردة @ar
toolkit definition: وكيل جماعي مسئول عن مجموعة الإجراءات الفنية، والتحريرية، والفكرية التي تهدف إلى إصلاح التدهور الذي لحق بمفردة وإعادتها إلى حالة أقرب ما تكون إلى حالتها الأصلية. @ar
label: té com a agent col·lectiu restaurador d’un ítem @ca
definition: Relaciona un ítem amb un agent col·lectiu que és responsable del conjunt de procediments tècnics, editorials i intel·lectuals destinats a compensar la degradació d’un ítem retornant-lo a un estat que s’aproximi al màxim a la seva condició original. @ca
toolkit label: agent col·lectiu restaurador d’un ítem @ca
toolkit definition: Agent col·lectiu que és responsable del conjunt de procediments tècnics, editorials i intel·lectuals destinats a compensar la degradació d’un ítem retornant-lo a un estat que s’aproximi al màxim a la seva condició original. @ca
label: har kollektiv agent, som er konservator af eksemplar @da
definition: Relaterer et eksemplar til en kollektiv agent, som er ansvarlig for en række af tekniske, redaktionelle og intellektuelle procedurer, som forsøger at kompensere for nedslidningen af et eksemplar ved at føre det tilbage til en tilstand, der er så tæt som muligt på dets oprindelige tilstand. @da
toolkit label: kollektiv agent, som er konservator af eksemplar @da
toolkit definition: Kollektiv agent, som er ansvarlig for en række af tekniske, redaktionelle og intellektuelle procedurer, som forsøger at kompensere for nedslidningen af et eksemplar ved at føre det tilbage til en tilstand, der er så tæt som muligt på dets oprindelige tilstand. @da
label: eksemplari restaureerija (kollektiiv) @et
definition: Seostab eksemplari kollektiiviga, kes vastutab rea tehniliste, toimetuslike ja intellektuaalsete toimingute eest, mille eesmärk on taastada kahjustatud eksemplari seisund võimalikult originaalseisundi lähedaseks. @et
toolkit label: eksemplari restaureerija (kollektiiv) @et
toolkit definition: Kollektiiv, kes vastutab rea tehniliste, toimetuslike ja intellektuaalsete toimingute eest, mille eesmärk on taastada kahjustatud eksemplari seisund võimalikult originaalseisundi lähedaseks. @et
label: hat Restauratorin/Restaurator eines Exemplars (Gemeinschaftlicher Akteur) @de
definition: Setzt ein Exemplar in Beziehung zu einem gemeinschaftlichen Akteur, der für die technischen, redaktionellen und intellektuellen Verfahren verantwortlich ist, die darauf abzielen, die Zersetzung eines Exemplars auszugleichen, indem es in einen Zustand zurückversetzt wird, der seiner ursprünglichen Beschaffenheit möglichst nahe kommt. @de
toolkit label: Restauratorin/Restaurator eines Exemplars (Gemeinschaftlicher Akteur) @de
toolkit definition: Ein gemeinschaftlicher Akteur, der für die technischen, redaktionellen und intellektuellen Verfahren verantwortlich ist, die darauf abzielen, die Zersetzung eines Exemplars auszugleichen, indem es in einen Zustand zurückversetzt wird, der seiner ursprünglichen Beschaffenheit möglichst nahe kommt. @de
label: példány restaurátor kollektív ágense a következő: @hu
definition: Hozzákapcsol egy példányt egy kollektív ágenshez, amely felelős technikai, szerkesztői és intellektuális eljárások összességéért, amelyek célja egy példány romlásának ellensúlyozása, amivel azt az eredeti állapotához a lehető legközelebb képesek visszahozni. @hu
toolkit label: példány restaurátor kollektív ágense @hu
toolkit definition: Egy kollektív ágens, amely felelős technikai, szerkesztői és intellektuális eljárások összességéért, amelyek célja egy példány romlásának ellensúlyozása, amivel azt az eredeti állapotához a lehető legközelebb képesek visszahozni. @hu
label: ha come restauratore di item agente collettivo @it
definition: Correla un item all'agente collettivo responsabile dell'insieme delle procedure tecniche, di cura e intellettuali finalizzate al risarcimento di un item in seguito alla sua degradazione, riportandolo a uno stato il più possibile vicino alla condizione originale. @it
toolkit label: restauratore di item agente collettivo @it
toolkit definition: Agente collettivo responsabile dell'insieme delle procedure tecniche, di cura e intellettuali finalizzate al risarcimento di un item in seguito alla sua degradazione, riportandolo a uno stato il più possibile vicino alla condizione originale. @it
label: vienības restaurators (grupa) @lv
definition: Sasaista vienību ar grupu, kas ir atbildīga par tehnisko, redakcionālo un intelektuālo procedūru kopumu, kuru mērķis ir kompensēt vienības pakāpenisko bojāeju, atgriežot to, cik vien iespējams, tuvu tās sākotnējam stāvoklim. @lv
toolkit label: vienības restaurators (grupa) @lv
toolkit definition: Grupa, kas ir atbildīga par tehnisko, redakcionālo un intelektuālo procedūru kopumu, kuru mērķis ir kompensēt vienības pakāpenisko bojāeju, atgriežot to, cik vien iespējams, tuvu tās sākotnējam stāvoklim. @lv
has subproperty: a pour collectivité restauratrice d’un item
has subproperty: a pour famille restauratrice d’un item
has subproperty: P40127
label: 有单件的修复者集体行为者 @zh-hans
definition: 将一个单件与负责为弥补单件的损毁而担负一系列技术、编辑和智力操作、使之尽可能恢复到原始状态的一个集体行为者关联起来。 @zh-hans
toolkit label: 单件的修复者集体行为者 @zh-hans
toolkit definition: 负责为弥补单件的损毁而担负一系列技术、编辑和智力操作、使之尽可能恢复到原始状态的一个集体行为者 @zh-hans
label: kopyanın restorasyon uzmanı kolektif temsilcisi ile ilişkilidir @tr
definition: Bir kopyayı, orijinal durumuna mümkün olduğu kadar yakın bir duruma geri getirerek bir kopyanın bozulmasını telafi etmeyi amaçlayan teknik, yayın ve entelektüel prosedürler dizisinden sorumlu olan kolektif bir temsilciyle ilişkilendirir. @tr
toolkit label: kopyanın restorasyon uzmanı kolektif temsilcisi @tr
toolkit definition: Bir kopyanın bozulmasını orijinal durumuna mümkün olduğu kadar yakın bir duruma geri getirerek telafi etmeyi amaçlayan teknik, editoryal ve entelektüel prosedürler dizisinden sorumlu olan kolektif bir temsilci. @tr

a pour collectivité restauratrice d’un item
status: Published
label: has restorationist corporate body of item @en
lexical alias: restorationistCorporateBodyOfItem.en
definition: Relates an item to a corporate body who is responsible for the set of technical, editorial, and intellectual procedures aimed at compensating for the degradation of an item by bringing it back to a state as close as possible to its original condition. @en
toolkit label: restorationist corporate body of item @en
toolkit definition: A corporate body who is responsible for the set of technical, editorial, and intellectual procedures aimed at compensating for the degradation of an item by bringing it back to a state as close as possible to its original condition. @en
type: Property
domain: C10003
has element type: 2
sub property of: a pour collectivité modificatrice
sub property of: a pour agent collectif restaurateur d’un item
definition: Met un item en relation avec une collectivité qui est responsable de l’ensemble des procédures techniques, éditoriales et intellectuelles destinées à compenser la dégradation d’un item en le ramenant à un état aussi près que possible de sa condition originelle.
toolkit label: collectivité restauratrice d’un item
toolkit definition: Collectivité qui est responsable de l’ensemble des procédures techniques, éditoriales et intellectuelles destinées à compenser la dégradation d’un item en le ramenant à un état aussi près que possible de sa condition originelle.
label: kappaleen entisöijä (yhteisö) @fi
definition: Liittää kappaleen yhteisöön, joka vastaa teknisistä, toimituksellisista ja tiedollisista toimenpiteistä, joiden tarkoitus on palauttaa huonokuntoinen kappale mahdollisimman lähelle sen alkuperäistä kuntoa. @fi
toolkit label: kappaleen entisöijä (yhteisö) @fi
toolkit definition: Yhteisö, joka vastaa teknisistä, toimituksellisista ja tiedollisista toimenpiteistä, joiden tarkoitus on palauttaa huonokuntoinen kappale mahdollisimman lähelle sen alkuperäistä kuntoa. @fi
label: har konservator for eksemplar (korporasjon) @no
definition: Relaterer et eksemplar til en korporasjon som har ansvar for de tekniske og intellektuelle metodene som brukes for å kompensere for nedbrytningen av et eksemplar ved å restaurere det til en tilstand som er så lik originaltilstanden som mulig. @no
toolkit label: konservator for eksemplar (korporasjon) @no
toolkit definition: En korporasjon som har ansvar for de tekniske og intellektuelle metodene som brukes for å kompensere for nedbrytningen av et eksemplar ved å restaurere det til en tilstand som er så lik originaltilstanden som mulig. @no
label: heeft restaurator-corporatie van item @nl
definition: Relateert een item aan een corporatie die verantwoordelijk is voor de verzameling van technische, redactionele en intellectuele procedures gericht op het corrigeren van de achteruitgang van een item door het zo goed mogelijk terug te brengen tot de oorspronkelijke staat. @nl
toolkit label: restaurator-corporatie van item @nl
toolkit definition: Een corporatie die verantwoordelijk is voor de verzameling van technische, redactionele en intellectuele procedures gericht op het corrigeren van de achteruitgang van een item door het zo goed mogelijk terug te brengen tot de oorspronkelijke staat. @nl
label: له هيئة مرممة لمفردة @ar
definition: يربط مفردة بهيئة مسئولة عن مجموعة الإجراءات الفنية، والتحريرية، والفكرية التي تهدف إلى إصلاح التدهور الذي لحق بمفردة، وإعادتها إلى حالة أقرب ما تكون إلى حالتها الأصلية. @ar
toolkit label: هيئة مُرممة لمفردة @ar
toolkit definition: هيئة مسئولة عن مجموعة الإجراءات الفنية، والتحريرية، والفكرية التي تهدف إلى إصلاح التدهور الذي لحق بمفردة، وإعادتها إلى حالة أقرب ما تكون إلى حالتها الأصلية. @ar
label: té com a entitat corporativa restauradora d’un ítem @ca
definition: Relaciona un ítem amb una entitat corporativa que és responsable del conjunt de procediments tècnics, editorials i intel·lectuals destinats a compensar la degradació d’un ítem retornant-lo a un estat que s’aproximi al màxim a la seva condició original. @ca
toolkit label: entitat corporativa restauradora d’un ítem @ca
toolkit definition: Entitat corporativa que és responsable del conjunt de procediments tècnics, editorials i intel·lectuals destinats a compensar la degradació d’un ítem retornant-lo a un estat que s’aproximi al màxim a la seva condició original. @ca
label: har korporation, som er konservator af eksemplar @da
definition: Relaterer et eksemplar til en korporation, som er ansvarlig for en række af tekniske, redaktionelle og intellektuelle procedurer, som forsøger at kompensere for nedslidningen af et eksemplar ved at føre det tilbage til en tilstand, der er så tæt som muligt på dets oprindelige tilstand. @da
toolkit label: korporation, som er konservator af eksemplar @da
toolkit definition: Korporation, som er ansvarlig for en række af tekniske, redaktionelle og intellektuelle procedurer, som forsøger at kompensere for nedslidningen af et eksemplar ved at føre det tilbage til en tilstand, der er så tæt som muligt på dets oprindelige tilstand. @da
label: eksemplari restaureerija (asutus) @et
definition: Seostab eksemplari asutusega, kes vastutab rea tehniliste, toimetuslike ja intellektuaalsete toimingute eest, mille eesmärk on taastada kahjustatud eksemplari seisund võimalikult originaalseisundi lähedaseks. @et
toolkit label: eksemplari restaureerija (asutus) @et
toolkit definition: Asutus, kes vastutab rea tehniliste, toimetuslike ja intellektuaalsete toimingute eest, mille eesmärk on taastada kahjustatud eksemplari seisund võimalikult originaalseisundi lähedaseks. @et
label: hat Restauratorin/Restaurator eines Exemplars (Körperschaft) @de
definition: Setzt ein Exemplar in Beziehung zu einer Körperschaft, die für die technischen, redaktionellen und intellektuellen Verfahren verantwortlich ist, die darauf abzielen, die Zersetzung eines Exemplars auszugleichen, indem es in einen Zustand zurückversetzt wird, der seiner ursprünglichen Beschaffenheit möglichst nahe kommt. @de
toolkit label: Restauratorin/Restaurator eines Exemplars (Körperschaft) @de
toolkit definition: Eine Körperschaft, die für die technischen, redaktionellen und intellektuellen Verfahren verantwortlich ist, die darauf abzielen, die Zersetzung eines Exemplars auszugleichen, indem es in einen Zustand zurückversetzt wird, der seiner ursprünglichen Beschaffenheit möglichst nahe kommt. @de
label: példány restaurátor testülete a következő: @hu
definition: Hozzákapcsol egy példányt egy testülethez, amely felelős technikai, szerkesztői és intellektuális eljárások összességéért, amelyek célja egy példány romlásának ellensúlyozása, amivel azt az eredeti állapotához a lehető legközelebb képesek visszahozni. @hu
toolkit label: példány restaurátor testülete @hu
toolkit definition: Egy testület, amely felelős technikai, szerkesztői és intellektuális eljárások összességéért, amelyek célja egy példány romlásának ellensúlyozása, amivel azt az eredeti állapotához a lehető legközelebb képesek visszahozni. @hu
label: ha come restauratore ente di item @it
definition: Correla un item all'ente responsabile dell'insieme delle procedure tecniche, di cura e intellettuali finalizzate al risarcimento di un item in seguito alla sua degradazione, riportandolo a uno stato il più possibile vicino alla condizione originale. @it
toolkit label: ente restauratore di item @it
toolkit definition: Ente responsabile dell'insieme delle procedure tecniche, di cura e intellettuali finalizzate al risarcimento di un item in seguito alla sua degradazione, riportandolo a uno stato il più possibile vicino alla condizione originale. @it
label: vienības restaurators (institūcija) @lv
definition: Sasaista vienību ar institūciju, kas ir atbildīga par tehnisko, redakcionālo un intelektuālo procedūru kopumu, kuru mērķis ir kompensēt vienības pakāpenisko bojāeju, atgriežot to, cik vien iespējams, tuvu tās sākotnējam stāvoklim. @lv
toolkit label: vienības restaurators (institūcija) @lv
toolkit definition: Institūcija, kas ir atbildīga par tehnisko, redakcionālo un intelektuālo procedūru kopumu, kuru mērķis ir kompensēt vienības pakāpenisko bojāeju, atgriežot to, cik vien iespējams, tuvu tās sākotnējam stāvoklim. @lv
has subproperty: P40143
label: 有单件的修复者团体 @zh-hans
definition: 将一个单件与负责为弥补单件的损毁而担负一系列技术、编辑和智力操作、使之尽可能恢复到原始状态的一个团体关联起来。 @zh-hans
toolkit label: 单件的修复者团体 @zh-hans
toolkit definition: 负责为弥补单件的损毁而担负一系列技术、编辑和智力操作、使之尽可能恢复到原始状态的一个团体 @zh-hans
label: kopyanın restorasyon uzmanı tüzel kişisi ile ilişkilidir @tr
definition: Bir kopyayı, orijinal durumuna mümkün olduğu kadar yakın bir duruma geri getirerek bir kopyanın bozulmasını telafi etmeyi amaçlayan teknik, yayın ve entelektüel prosedürler dizisinden sorumlu olan tüzel bir kişiyle ilişkilendirir. @tr
toolkit label: kopyanın restorasyon uzmanı tüzel kişisi @tr
toolkit definition: Bir kopyanın bozulmasını orijinal durumuna mümkün olduğunca yakın bir duruma geri getirerek telafi etmeyi amaçlayan bir dizi teknik, editoryal ve entelektüel prosedürden sorumlu olan bir tüzel kişi. @tr

a pour famille restauratrice d’un item
status: Published
label: has restorationist family of item @en
lexical alias: restorationistFamilyOfItem.en
definition: Relates an item to a family who is responsible for the set of technical, editorial, and intellectual procedures aimed at compensating for the degradation of an item by bringing it back to a state as close as possible to its original condition. @en
toolkit label: restorationist family of item @en
toolkit definition: A family who is responsible for the set of technical, editorial, and intellectual procedures aimed at compensating for the degradation of an item by bringing it back to a state as close as possible to its original condition. @en
type: Property
domain: C10003
has element type: 2
sub property of: a pour famille modificatrice
sub property of: a pour agent collectif restaurateur d’un item
definition: Met un item en relation avec une famille qui est responsable de l’ensemble des procédures techniques, éditoriales et intellectuelles destinées à compenser la dégradation d’un item en le ramenant à un état aussi près que possible de sa condition originelle.
toolkit label: famille restauratrice d’un item
toolkit definition: Famille qui est responsable de l’ensemble des procédures techniques, éditoriales et intellectuelles destinées à compenser la dégradation d’un item en le ramenant à un état aussi près que possible de sa condition originelle.
label: kappaleen entisöijä (suku) @fi
definition: Liittää kappaleen sukuun, joka vastaa teknisistä, toimituksellisista ja tiedollisista toimenpiteistä, joiden tarkoitus on palauttaa huonokuntoinen kappale mahdollisimman lähelle sen alkuperäistä kuntoa. @fi
toolkit label: kappaleen entisöijä (suku) @fi
toolkit definition: Suku, joka vastaa teknisistä, toimituksellisista ja tiedollisista toimenpiteistä, joiden tarkoitus on palauttaa huonokuntoinen kappale mahdollisimman lähelle sen alkuperäistä kuntoa. @fi
label: har konservator for eksemplar (familie) @no
definition: Relaterer et eksemplar til en familie som har ansvar for de tekniske og intellektuelle metodene som brukes for å kompensere for nedbrytningen av et eksemplar ved å restaurere det til en tilstand som er så lik originaltilstanden som mulig. @no
toolkit label: konservator for eksemplar (familie) @no
toolkit definition: En familie som har ansvar for de tekniske og intellektuelle metodene som brukes for å kompensere for nedbrytningen av et eksemplar ved å restaurere det til en tilstand som er så lik originaltilstanden som mulig. @no
label: heeft restaurator-familie van item @nl
definition: Relateert een item aan een familie die verantwoordelijk is voor de verzameling van technische, redactionele en intellectuele procedures gericht op het corrigeren van de achteruitgang van een item door het zo goed mogelijk terug te brengen tot de oorspronkelijke staat. @nl
toolkit label: restaurator-familie van item @nl
toolkit definition: Een familie die verantwoordelijk is voor de verzameling van technische, redactionele en intellectuele procedures gericht op het corrigeren van de achteruitgang van een item door het zo goed mogelijk terug te brengen tot de oorspronkelijke staat. @nl
label: له عائلة مرممة لمفردة @ar
definition: يربط مفردة بعائلة مسئولة عن مجموعة الإجراءات الفنية، والتحريرية، والفكرية التي تهدف إلى إصلاح التدهور الذي لحق بمفردة، وإعادتها إلى حالة أقرب ما تكون إلى حالتها الأصلية. @ar
toolkit label: عائلة مرممة لمفردة @ar
toolkit definition: عائلة مسؤولة عن مجموعة الإجراءات الفنية، والتحريرية، والفكرية التي تهدف إلى إصلاح التدهور الذي لحق بمفردة، وإعادتها إلى حالة أقرب ما تكون إلى حالتها الأصلية. @ar
label: té com a família restauradora d’un ítem @ca
definition: Relaciona un ítem amb una família que és responsable del conjunt de procediments tècnics, editorials i intel·lectuals destinats a compensar la degradació d’un ítem retornant-lo a un estat que s’aproximi al màxim a la seva condició original. @ca
toolkit label: família restauradora d’un ítem @ca
toolkit definition: Família que és responsable del conjunt de procediments tècnics, editorials i intel·lectuals destinats a compensar la degradació d’un ítem retornant-lo a un estat que s’aproximi al màxim a la seva condició original. @ca
label: har familie, som er konservator af eksemplar @da
definition: Relaterer et eksemplar til en familie, som er ansvarlig for en række af tekniske, redaktionelle og intellektuelle procedurer, som forsøger at kompensere for nedslidningen af et eksemplar ved at føre det tilbage til en tilstand, der er så tæt som muligt på dets oprindelige tilstand. @da
toolkit label: familie, som er konservator af eksemplar @da
toolkit definition: Familie, som er ansvarlig for en række af tekniske, redaktionelle og intellektuelle procedurer, som forsøger at kompensere for nedslidningen af et eksemplar ved at føre det tilbage til en tilstand, der er så tæt som muligt på dets oprindelige tilstand. @da
label: eksemplari restaureerija (perekond) @et
definition: Seostab eksemplari perekonnaga, kes vastutab rea tehniliste, toimetuslike ja intellektuaalsete toimingute eest, mille eesmärk on taastada kahjustatud eksemplari seisund võimalikult originaalseisundi lähedaseks. @et
toolkit label: eksemplari restaureerija (perekond) @et
toolkit definition: Perekond, kes vastutab rea tehniliste, toimetuslike ja intellektuaalsete toimingute eest, mille eesmärk on taastada kahjustatud eksemplari seisund võimalikult originaalseisundi lähedaseks. @et
label: hat Restauratorin/Restaurator eines Exemplars (Familie) @de
definition: Setzt ein Exemplar in Beziehung zu einer Familie, die für die technischen, redaktionellen und intellektuellen Verfahren verantwortlich ist, die darauf abzielen, die Zersetzung eines Exemplars auszugleichen, indem es in einen Zustand zurückversetzt wird, der seiner ursprünglichen Beschaffenheit möglichst nahe kommt. @de
toolkit label: Restauratorin/Restaurator eines Exemplars (Familie) @de
toolkit definition: Eine Familie, die für die technischen, redaktionellen und intellektuellen Verfahren verantwortlich ist, die darauf abzielen, die Zersetzung eines Exemplars auszugleichen, indem es in einen Zustand zurückversetzt wird, der seiner ursprünglichen Beschaffenheit möglichst nahe kommt. @de
label: példány restaurátor családja a következő: @hu
definition: Hozzákapcsol egy példányt egy családhoz, amely felelős technikai, szerkesztői és intellektuális eljárások összességéért, amelyek célja egy példány romlásának ellensúlyozása, amivel azt az eredeti állapotához a lehető legközelebb képesek visszahozni. @hu
toolkit label: példány restaurátor családja @hu
toolkit definition: Egy család, amely felelős technikai, szerkesztői és intellektuális eljárások összességéért, amelyek célja egy példány romlásának ellensúlyozása, amivel azt az eredeti állapotához a lehető legközelebb képesek visszahozni. @hu
label: ha come famiglia restauratrice di item @it
definition: Correla un item alla famiglia responsabile dell'insieme delle procedure tecniche, di cura e intellettuali finalizzate al risarcimento di un item in seguito alla sua degradazione, riportandolo a uno stato il più possibile vicino alla condizione originale. @it
toolkit label: famiglia restauratore di item @it
toolkit definition: Famiglia responsabile dell'insieme delle procedure tecniche, di cura e intellettuali finalizzate al risarcimento di un item in seguito alla sua degradazione, riportandolo a uno stato il più possibile vicino alla condizione originale. @it
label: vienības restaurators (dzimta/ģimene) @lv
definition: Sasaista vienību ar dzimtu/ģimeni, kas ir atbildīga par tehnisko, redakcionālo un intelektuālo procedūru kopumu, kuru mērķis ir kompensēt vienības pakāpenisko bojāeju, atgriežot to, cik vien iespējams, tuvu tās sākotnējam stāvoklim. @lv
toolkit label: vienības restaurators (dzimta/ģimene) @lv
toolkit definition: Dzimta/ģimene, kas ir atbildīga par tehnisko, redakcionālo un intelektuālo procedūru kopumu, kuru mērķis ir kompensēt vienības pakāpenisko bojāeju, atgriežot to, cik vien iespējams, tuvu tās sākotnējam stāvoklim. @lv
has subproperty: P40159
label: 有单件的修复者家族 @zh-hans
definition: 将一个单件与负责为弥补单件的损毁而担负一系列技术、编辑和智力操作、使之尽可能恢复到原始状态的一个家族关联起来。 @zh-hans
toolkit label: 单件的修复者家族 @zh-hans
toolkit definition: 负责为弥补单件的损毁而担负一系列技术、编辑和智力操作、使之尽可能恢复到原始状态的一个家族 @zh-hans
label: kopyanın restorasyon uzmanı ailesi ile ilişkilidir @tr
definition: Bir kopyayı, orijinal durumuna mümkün olduğu kadar yakın bir duruma geri getirerek bir kopyanın bozulmasını telafi etmeyi amaçlayan teknik, yayın ve entelektüel prosedürler dizisinden sorumlu olan bir aileyle ilişkilendirir. @tr
toolkit label: kopyanın restorasyon uzmanı ailesi @tr
toolkit definition: Bir kopyanın bozulmasını orijinal durumuna mümkün olduğunca yakın bir duruma geri getirerek telafi etmeyi amaçlayan bir dizi teknik, editoryal ve entelektüel prosedürden sorumlu olan bir aile. @tr

a pour personne restauratrice d’un item
status: Published
label: has restorationist person of item @en
lexical alias: restorationistPersonOfItem.en
definition: Relates an item to a person who is responsible for the set of technical, editorial, and intellectual procedures aimed at compensating for the degradation of an item by bringing it back to a state as close as possible to its original condition. @en
toolkit label: restorationist person of item @en
toolkit definition: A person who is responsible for the set of technical, editorial, and intellectual procedures aimed at compensating for the degradation of an item by bringing it back to a state as close as possible to its original condition. @en
type: Property
domain: C10003
has element type: 2
sub property of: a pour personne modificatrice
sub property of: a pour agent restaurateur d’un item
definition: Met un item en relation avec une personne qui est responsable de l’ensemble des procédures techniques, éditoriales et intellectuelles destinées à compenser la dégradation d’un item en le ramenant à un état aussi près que possible de sa condition originelle.
toolkit label: personne restauratrice d’un item
toolkit definition: Personne qui est responsable de l’ensemble des procédures techniques, éditoriales et intellectuelles destinées à compenser la dégradation d’un item en le ramenant à un état aussi près que possible de sa condition originelle.
label: kappaleen entisöijä (henkilö) @fi
definition: Liittää kappaleen henkilöön, joka vastaa teknisistä, toimituksellisista ja tiedollisista toimenpiteistä, joiden tarkoitus on palauttaa huonokuntoinen kappale mahdollisimman lähelle sen alkuperäistä kuntoa. @fi
toolkit label: kappaleen entisöijä (henkilö) @fi
toolkit definition: Henkilö, joka vastaa teknisistä, toimituksellisista ja tiedollisista toimenpiteistä, joiden tarkoitus on palauttaa huonokuntoinen kappale mahdollisimman lähelle sen alkuperäistä kuntoa. @fi
label: har konservator for eksemplar (person) @no
definition: Relaterer et eksemplar til en person som har ansvar for de tekniske og intellektuelle metodene som brukes for å kompensere for nedbrytningen av et eksemplar ved å restaurere det til en tilstand som er så lik originaltilstanden som mulig. @no
toolkit label: konservator for eksemplar (person) @no
toolkit definition: En person som har ansvar for de tekniske og intellektuelle metodene som brukes for å kompensere for nedbrytningen av et eksemplar ved å restaurere det til en tilstand som er så lik originaltilstanden som mulig. @no
label: heeft restaurator-persoon van item @nl
definition: Relateert een item aan een persoon die verantwoordelijk is voor de verzameling van technische, redactionele en intellectuele procedures gericht op het corrigeren van de achteruitgang van een item door het zo goed mogelijk terug te brengen tot de oorspronkelijke staat. @nl
toolkit label: restaurator-persoon van item @nl
toolkit definition: Een persoon die verantwoordelijk is voor de verzameling van technische, redactionele en intellectuele procedures gericht op het corrigeren van de achteruitgang van een item door het zo goed mogelijk terug te brengen tot de oorspronkelijke staat. @nl
label: له شخص مرمم لمفردة @ar
definition: يربط مفردة بشخص مسئول عن مجموعة الإجراءاتالفنية، والتحريرية، والفكرية التي تهدف إلى إصلاح التدهور الذي لحق بمفردة، وإعادتها إلى حالة أقرب ما تكون إلى حالتها الأصلية. @ar
toolkit label: شخص مرمم لمفردة @ar
toolkit definition: شخص مسؤول عن مجموعة الإجراءاتالفنية، والتحريرية، والفكرية التي تهدف إلى إصلاح التدهور الذي لحق بمفردة، وإعادتها إلى حالة أقرب ما تكون إلى حالتها الأصلية. @ar
label: té com a persona restauradora d’un ítem @ca
definition: Relaciona un ítem amb una persona que és responsable del conjunt de procediments tècnics, editorials i intel·lectuals destinats a compensar la degradació d’un ítem retornant-lo a un estat que s’aproximi al màxim a la seva condició original. @ca
toolkit label: persona restauradora d’un ítem @ca
toolkit definition: Persona que és responsable del conjunt de procediments tècnics, editorials i intel·lectuals destinats a compensar la degradació d’un ítem retornant-lo a un estat que s’aproximi al màxim a la seva condició original. @ca
label: har person, som er konservator af eksemplar @da
definition: Relaterer et eksemplar til en person, som er ansvarlig for en række af tekniske, redaktionelle og intellektuelle procedurer, som forsøger at kompensere for nedslidningen af et eksemplar ved at føre det tilbage til en tilstand, der er så tæt som muligt på dets oprindelige tilstand. @da
toolkit label: person, som er konservator af eksemplar @da
toolkit definition: Person, som er ansvarlig for en række af tekniske, redaktionelle og intellektuelle procedurer, som forsøger at kompensere for nedslidningen af et eksemplar ved at føre det tilbage til en tilstand, der er så tæt som muligt på dets oprindelige tilstand. @da
label: eksemplari restaureerija (isik) @et
definition: Seostab eksemplari isikuga, kes vastutab rea tehniliste, toimetuslike ja intellektuaalsete toimingute eest, mille eesmärk on taastada kahjustatud eksemplari seisund võimalikult originaalseisundi lähedaseks. @et
toolkit label: eksemplari restaureerija (isik) @et
toolkit definition: Isik, kes vastutab rea tehniliste, toimetuslike ja intellektuaalsete toimingute eest, mille eesmärk on taastada kahjustatud eksemplari seisund võimalikult originaalseisundi lähedaseks. @et
label: hat Restauratorin/Restaurator eines Exemplars (Person) @de
definition: Setzt ein Exemplar in Beziehung zu einer Person, die für die technischen, redaktionellen und intellektuellen Verfahren verantwortlich ist, die darauf abzielen, die Zersetzung eines Exemplars auszugleichen, indem es in einen Zustand zurückversetzt wird, der seiner ursprünglichen Beschaffenheit möglichst nahe kommt. @de
toolkit label: Restauratorin/Restaurator eines Exemplars (Person) @de
toolkit definition: Eine Person, die für die technischen, redaktionellen und intellektuellen Verfahren verantwortlich ist, die darauf abzielen, die Zersetzung eines Exemplars auszugleichen, indem es in einen Zustand zurückversetzt wird, der seiner ursprünglichen Beschaffenheit möglichst nahe kommt. @de
label: példány restaurátor személye a következő: @hu
definition: Hozzákapcsol egy példányt egy személyhez, aki felelős technikai, szerkesztői és intellektuális eljárások összességéért, amelyek célja egy példány romlásának ellensúlyozása, amivel azt az eredeti állapotához a lehető legközelebb képesek visszahozni. @hu
toolkit label: példány restaurátor személye: @hu
toolkit definition: Egy személy, aki felelős technikai, szerkesztői és intellektuális eljárások összességéért, amelyek célja egy példány romlásának ellensúlyozása, amivel azt az eredeti állapotához a lehető legközelebb képesek visszahozni. @hu
label: ha come restauratore di item persona @it
definition: Correla un item alla persona responsabile dell'insieme delle procedure tecniche, di cura e intellettuali finalizzate al risarcimento di un item in seguito alla sua degradazione, riportandolo a uno stato il più possibile vicino alla condizione originale. @it
toolkit label: persona restauratore di item @it
toolkit definition: Persona responsabile dell'insieme delle procedure tecniche, di cura e intellettuali finalizzate al risarcimento di un item in seguito alla sua degradazione, riportandolo a uno stato il più possibile vicino alla condizione originale. @it
label: vienības restaurators (persona) @lv
definition: Sasaista vienību ar personu, kura ir atbildīga par tehnisko, redakcionālo un intelektuālo procedūru kopumu, kuru mērķis ir kompensēt vienības pakāpenisko bojāeju, atgriežot to, cik vien iespējams, tuvu tās sākotnējam stāvoklim. @lv
toolkit label: vienības restaurators (persona) @lv
toolkit definition: Persona, kura ir atbildīga par tehnisko, redakcionālo un intelektuālo procedūru kopumu, kuru mērķis ir kompensēt vienības pakāpenisko bojāeju, atgriežot to, cik vien iespējams, tuvu tās sākotnējam stāvoklim. @lv
has subproperty: P40111
label: 有单件的修复者个人 @zh-hans
definition: 将一个个人与负责为弥补单件的损毁而担负一系列技术、编辑和智力操作、使之尽可能恢复到原始状态的一个个人关联起来。 @zh-hans
toolkit label: 单件的修复者个人 @zh-hans
toolkit definition: 负责为弥补单件的损毁而担负一系列技术、编辑和智力操作、使之尽可能恢复到原始状态的一个个人 @zh-hans
label: kopyanın restorasyon uzmanı kişisi ile ilişkilidir @tr
definition: Bir kopyayı, orijinal durumuna mümkün olduğunca yakın bir duruma getirerek bozulmasını telafi etmeyi amaçlayan bir dizi teknik, yayın ve entelektüel prosedür dizisinden sorumlu olan bir kişiyle ilişkilendirir. @tr
toolkit label: kopyanın restoraston uzmanı kişisi @tr
toolkit definition: Bir kopyayı orijinal durumuna mümkün olduğunca yakın bir duruma getirerek bozulmasını telafi etmeyi amaçlayan bir dizi teknik, editoryal ve entelektüel prosedürden sorumlu olan kişi. @tr

a pour restriction d’accès à un item
status: Published
label: has restriction on access to item @en
definition: Relates an item to a limitation placed on access to an item. @en
type: Property
domain: C10003
lexical alias: restrictionOnAccessToItem.en
instruction number: 4.4
toolkit label: restriction on access to item @en
toolkit definition: A limitation placed on access to an item. @en
definition: Met un item en relation avec une limitation imposée sur l’accès à un item.
toolkit label: restriction d’accès à un item
toolkit definition: Limitation imposée sur l’accès à un item.
toolkit label: restricciones de acceso @es
toolkit definition: Limitaciones establecidas para el acceso a un recurso. @es
label: har åtkomstrestriktioner @sv
toolkit label: åtkomstrestriktioner @sv
label: có cấm truy cập vào bản @vi
definition: Liên kết bản với giới hạn được đặt ra về truy cấp tới bản. @vi
toolkit label: cấm truy cập vào bản @vi
toolkit definition: Giới hạn được đặt ra về truy cấp tới bản. @vi
label: har restriktion på adgang til eksemplar @da
definition: Relaterer et eksemplar til en begrænsning af adgangen til et eksemplar. @da
toolkit label: restriktion på adgang til eksemplar @da
toolkit definition: Begrænsning af adgangen til et eksemplar. @da
label: hat Zugangsbeschränkung zu einem Exemplar @de
definition: Setzt ein Exemplar in Beziehung zu einer Beschränkung des Zugangs zu einem Exemplar. @de
toolkit label: Zugangsbeschränkung zu einem Exemplar @de
toolkit definition: Eine Beschränkung des Zugangs zu einem Exemplar. @de
label: έχει περιορισμό στην πρόσβαση στο αντίτυπο @el
definition: Συνδέει ένα αντίτυπο με έναν περιορισμό που ανατίθεται στην πρόσβαση σε ένα αντίτυπο. @el
toolkit label: περιορισμός στην πρόσβαση στο αντίτυπο @el
toolkit definition: Ένας περιορισμός που ανατίθεται στην πρόσβαση σε ένα αντίτυπο. @el
label: té com a restricció d’accés a un ítem @ca
definition: Relaciona un ítem amb una limitació imposada sobre l’accés a un ítem. @ca
toolkit label: restricció d’accés a un ítem @ca
toolkit definition: Limitació imposada sobre l’accés a un ítem. @ca
definition: Liittää kappaleen kappaleen saatavuudelle asetettuihin rajoituksiin. @fi
toolkit label: kappaleen saatavuuden rajoitukset @fi
toolkit definition: Kappaleen saatavuudelle asetetut rajoitukset. @fi
toolkit label: adgangsbegrensning for eksemplar @no
toolkit definition: En begrensning for tilgangen til en ressurs. @no
label: példány hozzáférési korlátozása a következő: @hu
definition: Hozzákapcsol példányt egy korlátozáshoz, amelyet egy példányhoz való hozzáféréshez rendelnek. @hu
toolkit label: példány hozzáférési korlátozása: @hu
toolkit definition: Egy korlátozás, amelyet egy példányhoz való hozzáféréshez rendelnek. @hu
label: kappaleen saatavuuden rajoitukset @fi
label: har adgangsbegrensning for eksemplar @no
definition: Relaterer et eksemplar til en begrensning for tilgangen til en ressurs. @no
label: heeft beperking op toegang tot item @nl
definition: Relateert een item aan een begrenzing geplaatst op de toegang tot een item. @nl
toolkit label: beperking op toegang tot item @nl
toolkit definition: Een begrenzing geplaatst op de toegang tot een item. @nl
label: له قيد على الوصول لمفردة @ar
definition: يربط مفردة بقيد على الوصول لمفردة. @ar
toolkit label: قيد على الوصول لمفردة @ar
toolkit definition: قيد وضع على الوصول لمفردة @ar
label: eksemplari juurdepääsupiirang @et
definition: Seostab eksemplari piiranguga, mis on kehtestatud eksemplari juurdepääsule. @et
toolkit label: eksemplari juurdepääsupiirang @et
toolkit definition: Piirang, mis on kehtestatud eksemplari juurdepääsule. @et
label: ha come limitazione di accesso ad item @it
definition: Correla un item a una limitazione di accesso a un item. @it
toolkit label: limitazione di accesso ad item @it
toolkit definition: Limitazione di accesso a un item. @it
label: vienības piekļuves ierobežojums @lv
definition: Sasaista vienību ar ierobežojumu, kas noteikts vienības piekļuvei. @lv
toolkit label: vienības piekļuves ierobežojums @lv
toolkit definition: Ierobežojums, kas noteikts vienības piekļuvei. @lv
has element type: 5
has subproperty: P40047
label: 有单件的获取限制 @zh-hans
definition: 将一个单件与对单件获取设置的限制关联起来。 @zh-hans
toolkit label: 单件的获取限制 @zh-hans
toolkit definition: 对单件获取设置的限制 @zh-hans
label: kopyaya erişim kısıtlaması ile ilişkilidir @tr
definition: Bir kopyayı, bir kopyaya getirilen erişim kısıtlamasıyla ilişkilendirir. @tr
toolkit label: kopyaya erişim kısıtlaması @tr
toolkit definition: Bir kopyanın erişimine getirilen bir sınırlama. @tr

a pour restriction d’usage d’un item
status: Published
label: has restriction on use of item @en
definition: Relates an item to a limitation placed on reproduction, publication, exhibition, etc., of an item. @en
type: Property
domain: C10003
lexical alias: restrictionOnUseOfItem.en
instruction number: 4.5
toolkit label: restriction on use of item @en
toolkit definition: A limitation placed on reproduction, publication, exhibition, etc., of an item. @en
definition: Met un item en relation avec une limitation imposée sur la reproduction, la publication, l’exposition, etc. d’un item.
toolkit label: restriction d’usage d’un item
toolkit definition: Limitation imposée sur la reproduction, la publication, l’exposition, etc. d’un item.
toolkit label: restricciones sobre el uso @es
toolkit definition: Limitaciones establecidas sobre los usos, tales como reproducción, publicación, exhibición, etc. @es
label: har användningsrestriktioner @sv
toolkit label: användningsrestriktioner @sv
label: có cấm sử dụng bản @vi
definition: Liên kết bản với giới hạn được đặt ra về sản xuất lại, xuất bản, triển lãm, v.v..., của bản. @vi
toolkit label: cấm sử dụng bản @vi
toolkit definition: Giới hạn được đặt ra về sản xuất lại, xuất bản, triển lãm, v.v..., của bản. @vi
label: har restriktion på brug af eksemplar @da
definition: Relaterer en manifestation til en begrænsning af reproduktion, publicering, udstilling etc. af et eksemplar. @da
toolkit label: restriktion på brug af eksemplar @da
toolkit definition: Begrænsning af reproduktion, publicering, udstilling etc. af et eksemplar. @da
label: hat Benutzungsbeschränkung für ein Exemplar @de
definition: Setzt ein Exemplar in Beziehung zu einer Beschränkung der Verwendungsart eines Exemplars, wie zum Beispiel Reproduktion, Veröffentlichung, Ausstellung und so weiter. @de
toolkit label: Benutzungsbeschränkung für ein Exemplar @de
toolkit definition: Beschränkung der Verwendungsart eines Exemplars, wie zum Beispiel Reproduktion, Veröffentlichung, Ausstellung und so weiter. @de
label: έχει περιορισμό στη χρήση του αντιτύπου @el
definition: Συνδέει ένα αντίτυπο με έναν περιορισμό που ανατίθεται στην αναπαραγωγή, τη δημοσίευση, την έκθεση κ.λπ. ενός αντιτύπου. @el
toolkit label: περιορισμός στη χρήση του αντιτύπου @el
toolkit definition: Ένας περιορισμός που ανατίθεται στην αναπαραγωγή, τη δημοσίευση, την έκθεση κ.λπ. ενός αντιτύπου. @el
label: té com a restricció d’ús d’un ítem @ca
definition: Relaciona un ítem amb una limitació imposada sobre la reproducció, la publicació, l’exposició, etc., d’un ítem. @ca
toolkit label: restricció d’ús d’un ítem @ca
toolkit definition: Limitació imposada sobre la reproducció, la publicació, l’exposició, etc., d’un ítem. @ca
definition: Liittää kappaleen rajoituksiin koskien kappaleen jäljentämistä, julkaisemista, näytteille asettamista tms. @fi
toolkit label: kappaleen käyttöehdot @fi
toolkit definition: Rajoitukset, jotka koskevat kappaleen jäljentämistä, julkaisua, näytteille asettamista tms. @fi
toolkit label: restriksjoner for bruk av eksemplar @no
toolkit definition: En begrensning for reproduksjon, utgivelse, utstilling etc. av en ressurs. @no
label: példány felhasználási korlátozása a következő: @hu
definition: Hozzákapcsol egy példányt egy korlátozáshoz, amelyet egy példány másolásához, publikálásához, kiállításához stb. rendelnek. @hu
toolkit label: példány felhasználási korlátozása: @hu
toolkit definition: Egy korlátozás, amelyet egy példány másolásához, publikálásához, kiállításához stb. rendelnek. @hu
label: kappaleen käyttöehdot @fi
label: har restriksjoner for bruk av eksemplar @no
definition: Relaterer et eksemplar til en begrensning for reproduksjon, utgivelse, utstilling etc. av en ressurs. @no
label: heeft beperking op gebruik van item @nl
definition: Relateert een item aan een begrenzing geplaatst op reproductie, publicatie, tentoonstelling etc. van een item. @nl
toolkit label: beperking op gebruik van item @nl
toolkit definition: Een begrenzing geplaatst op reproductie, publicatie, tentoonstelling etc. van een item. @nl
label: له قيد على استخدام مفردة @ar
definition: يربط مفردة بقيد لمنع استنساخ مفردة، أو نشرها، أو عرضها، الخ. @ar
toolkit label: قيد على استخدام مفردة @ar
toolkit definition: قيد لمنع استنساخ مفردة، أو نشرها، أو عرضها، الخ. @ar
label: eksemplari kasutuspiirang @et
definition: Seostab eksemplari piiranguga, mis on kehtestatud eksemplari reprodutseerimisele, avaldamisele, eksponeerimisele jms. @et
toolkit label: eksemplari kasutuspiirang @et
toolkit definition: Piirang, mis on kehtestatud eksemplari reprodutseerimisele, avaldamisele, eksponeerimisele jms. @et
label: ha come limitazione di uso di item @it
definition: Correla un item a una limitazione posta alla riproduzione, pubblicazione, esposizione, etc. di un item. @it
toolkit label: limitazione di uso di item @it
toolkit definition: Limitazione posta alla riproduzione, pubblicazione, esposizione, etc. di un item. @it
label: vienības izmantošanas ierobežojums @lv
definition: Sasaista vienību ar vienības izmantošanas ierobežojumiem pavairošanā, izgatavošanā, izrādīšanā u.tml. @lv
toolkit label: vienības izmantošanas ierobežojums @lv
toolkit definition: Vienības izmantošanas ierobežojumi pavairošanā, izgatavošanā, izrādīšanā u.tml. @lv
has element type: 5
has subproperty: P40048
label: 有对单件使用的限制 @zh-hans
definition: 将一个单件与对单件的复制、出版、展览等设置的限制关联起来。 @zh-hans
toolkit label: 单件使用的限制 @zh-hans
toolkit definition: 对单件的复制、出版、展览等设置的限制 @zh-hans
label: kopyanın kullanım kısıtlaması ile ilişkilidir @tr
definition: Bir kopyayı, bir kopyanın çoğaltılmasına, yayınlanmasına, sergilenmesine vb. konulan bir kısıtlamayla ilişkilendirir. @tr
toolkit label: kopyanın kullanımına ilişkin kısıtlama @tr
toolkit definition: Bir kopyanın çoğaltılmasına, yayınlanmasına, sergilenmesine vb. getirilen bir sınırlama. @tr

is review of (item) (Deprecated)
status: Deprecated
type: Property
sub property of: is description of (item) (Deprecated)
toolkit definition: An item used as the basis for a brief evaluation. (Deprecated) @en
toolkit label: review of (item) (Deprecated) @en
definition: Relates a work to an item used as the basis for a brief evaluation. (Deprecated) @en
lexical alias: reviewOfItem.en
domain: C10001
instruction number: 24.5

a pour agent vendeur
status: Published
label: has seller agent @en
definition: Relates an item to an agent who is a former owner of an item who sells the item to another owner. @en
type: Property
domain: C10003
sub property of: a pour ancien agent propriétaire
lexical alias: sellerAgent.en
toolkit label: seller agent @en
toolkit definition: An agent who is a former owner of an item who sells the item to another owner. @en
definition: Met un item en relation avec un ancien agent propriétaire d’un item qui vend cet item à un autre propriétaire.
toolkit label: agent vendeur
toolkit definition: Ancien agent propriétaire d’un item qui vend cet item à un autre propriétaire.
toolkit label: vendedor @es
toolkit definition: Un propietario anterior de un ítem que lo vendió a otro propietario. @es
instruction number: 18.5
label: có người bán @vi
definition: Liên kết bản với người chủ trước đây của bản, người đã bán bản đó cho người chủ khác. @vi
toolkit label: người bán @vi
toolkit definition: Người chủ trước đây của bản, người đã bán bản đó cho người chủ khác. @vi
label: har agent, som er sælger @da
definition: Relaterer et eksemplar til en agent, som er tidligere ejer af et eksemplar, som har solgt dette eksemplar til en anden ejer. @da
toolkit label: agent, som er sælger @da
toolkit definition: Agent, som er tidligere ejer af et eksemplar, som har solgt dette eksemplar til en anden ejer. @da
label: hat Verkäuferin/Verkäufer (Akteur) @de
definition: Setzt ein Exemplar in Beziehung zu einer früheren Eigentümerin/einem früheren Eigentümer (Akteur) eines Exemplars, die/der das Exemplar an eine andere Eigentümerin/einen anderen Eigentümer verkauft. @de
toolkit label: Verkäuferin/Verkäufer (Akteur) @de
toolkit definition: Eine frühere Eigentümerin/Ein früherer Eigentümer (Akteur) eines Exemplars, die/der das Exemplar an eine andere Eigentümerin/einen anderen Eigentümer verkauft. @de
label: έχει πωλητή @el
definition: Συνδέει ένα αντίτυπο με έναν προηγούμενο ιδιοκτήτη ενός αντιτύπου ο οποίος πούλησε αυτό το αντίτυπο σε κάποιον άλλον ιδιοκτήτη. @el
toolkit label: πωλητής @el
toolkit definition: Ένας προηγούμενος ιδιοκτήτης ενός αντιτύπου, ο οποίος πούλησε αυτό το αντίτυπο σε κάποιον άλλον ιδιοκτήτη. @el
label: té com a agent venedor @ca
definition: Relaciona un ítem amb un agent que és un propietari anterior d’un ítem que ven l’ítem a un altre propietari. @ca
toolkit label: agent venedor @ca
toolkit definition: Agent que és un propietari anterior d’un ítem que ven l’ítem a un altre propietari. @ca
definition: Liittää kappaleen sen aiempaan omistajaan, joka myy kappaleen toiselle omistajalle. @fi
toolkit label: myyjä (toimija) @fi
toolkit definition: Kappaleen aiempi omistaja, joka myy kappaleen toiselle omistajalle. @fi
toolkit label: selger (agent) @no
toolkit definition: En agent som er en tidligere eier av et eksemplar, som har solgt eksemplaret til en annen eier. @no
has element type: 2
label: értékesítő ágense a következő: @hu
definition: Hozzákapcsol egy példányt egy ágenshez, amely egy példány korábbi tulajdonosa, és amely a példányt egy másik tulajdonosnak adja el. @hu
toolkit label: értékesítő ágense: @hu
toolkit definition: Egy ágens, amely egy példány korábbi tulajdonosa, és amely a példányt egy másik tulajdonosnak adja el. @hu
alternative label: seller @en
alternative label: vendeur
alternative label: myyjä @fi
label: myyjä (toimija) @fi
label: har selger (agent) @no
definition: Relaterer et eksemplar til en agent som er en tidligere eier av et eksemplar, som har solgt eksemplaret til en annen eier. @no
alternative label: selger @no
label: heeft verkoper-actor @nl
definition: Relateert een item aan een actor die een voormalige eigenaar is van een item die het item verkoopt aan een andere eigenaar. @nl
toolkit label: verkoper-actor @nl
toolkit definition: Een actor die een voormalige eigenaar is van een item die het item verkoopt aan een andere eigenaar. @nl
label: له وكيل بائع @ar
definition: يربط مفردة بوكيل هو المالك السابق لمفردة قام ببيعها لمالك آخر. @ar
alternative label: بائع @ar
toolkit label: وكيل بائع @ar
toolkit definition: وكيل هو المالك السابق لمفردة قام ببيعها لمالك آخر. @ar
alternative label: venedor @ca
alternative label: sælger @da
label: müüja (tegija) @et
definition: Seostab eksemplari tegijaga, kes eksemplari endise omanikuna on müünud selle teisele omanikule. @et
alternative label: müüja @et
toolkit label: müüja (tegija) @et
toolkit definition: Tegija, kes eksemplari endise omanikuna on müünud selle teisele omanikule. @et
alternative label: értékesítője: @hu
label: pārdevējs (aģents) @lv
definition: Sasaista vienību ar aģentu - vienības agrākais īpašnieks, kurš pārdod šo vienību citam īpašniekam. @lv
toolkit label: pārdevējs (aģents) @lv
toolkit definition: Aģents - vienības agrākais īpašnieks, kurš pārdod šo vienību citam īpašniekam. @lv
alternative label: Verkäufer @de
has subproperty: a pour agent collectif vendeur
has subproperty: a pour personne vendeuse
has subproperty: P40008
alternative label: 出售者 @zh-hans
label: 有出售者行为者 @zh-hans

a pour agent collectif vendeur
status: Published
label: has seller collective agent @en
lexical alias: sellerCollectiveAgent.en
definition: Relates an item to a collective agent who is a former owner of an item who sells the item to another owner. @en
toolkit label: seller collective agent @en
toolkit definition: A collective agent who is a former owner of an item who sells the item to another owner. @en
type: Property
domain: C10003
has element type: 2
sub property of: a pour ancien agent collectif propriétaire
sub property of: a pour agent vendeur
definition: Met un item en relation avec un ancien agent collectif propriétaire d’un item qui vend cet item à un autre propriétaire.
toolkit label: agent collectif vendeur
toolkit definition: Ancien agent collectif propriétaire d’un item qui vend cet item à un autre propriétaire.
label: myyjä (yhteistoimija) @fi
definition: Liittää kappaleen sen aiempana omistajana olevaan yhteistoimijaan, joka myy kappaleen toiselle omistajalle. @fi
toolkit label: myyjä (yhteistoimija) @fi
toolkit definition: Kappaleen aiempana omistajana oleva yhteistoimija, joka myy kappaleen toiselle omistajalle. @fi
label: har selger (kollektiv agent) @no
definition: Relaterer et eksemplar til en kollektiv agent som er en tidligere eier av et eksemplar, som har solgt eksemplaret til en annen eier. @no
toolkit label: selger (kollektiv agent) @no
toolkit definition: En kollektiv agent som er en tidligere eier av et eksemplar, som har solgt eksemplaret til en annen eier. @no
label: heeft verkoper-collecteve actor @nl
definition: Relateert een item aan een collectieve actor die een voormalige eigenaar is van een item die het item verkoopt aan een andere eigenaar. @nl
toolkit label: verkoper-collecteve actor @nl
toolkit definition: Een collectieve actor die een voormalige eigenaar is van een item die het item verkoopt aan een andere eigenaar. @nl
label: له وكيل جماعي بائع @ar
definition: يربط مفردة بوكيل جماعي هو المالك السابق لمفردة قام ببيعها لمالك آخر. @ar
toolkit label: وكيل جماعي بائع @ar
toolkit definition: وكيل جماعي هو المالك السابق لمفردة قام ببيعها لمالك آخر. @ar
label: té com a agent col·lectiu venedor @ca
definition: Relaciona un ítem amb un agent col·lectiu que és un propietari anterior d’un ítem que ven l’ítem a un altre propietari. @ca
toolkit label: agent col·lectiu venedor @ca
toolkit definition: Agent col·lectiu que és un propietari anterior d’un ítem que ven l’ítem a un altre propietari. @ca
label: har kollektiv agent, som er sælger @da
definition: Relaterer et eksemplar til en kollektiv agent, som er tidligere ejer af et eksemplar, som har solgt dette eksemplar til en anden ejer. @da
toolkit label: kollektiv agent, som er sælger @da
toolkit definition: Kollektiv agent, som er tidligere ejer af et eksemplar, som har solgt dette eksemplar til en anden ejer. @da
label: müüja (kollektiiv) @et
definition: Seostab eksemplari kollektiiviga, kes eksemplari endise omanikuna on müünud selle teisele omanikule. @et
toolkit label: müüja (kollektiiv) @et
toolkit definition: Kollektiiv, kes eksemplari endise omanikuna on müünud selle teisele omanikule. @et
label: hat Verkäuferin/Verkäufer (Gemeinschaftlicher Akteur) @de
definition: Setzt ein Exemplar in Beziehung zu einer früheren Eigentümerin/einem früheren Eigentümer (Gemeinschaftlicher Akteur) eines Exemplars, die/der das Exemplar an eine andere Eigentümerin/einen anderen Eigentümer verkauft. @de
toolkit label: Verkäuferin/Verkäufer (Gemeinschaftlicher Akteur) @de
toolkit definition: Eine frühere Eigentümerin/Ein früherer Eigentümer (Gemeinschaftlicher Akteur) eines Exemplars, die/der das Exemplar an eine andere Eigentümerin/einen anderen Eigentümer verkauft. @de
label: értékesítő kollektív ágense a következő: @hu
definition: Hozzákapcsol egy példányt egy kollektív ágenshez, amely a példány korábbi tulajdonosa, és amely a példányt másik tulajdonosnak adja el. @hu
toolkit label: értékesítő kollektív ágense: @hu
toolkit definition: Egy kollektív ágens, amely egy példány korábbi tulajdonosa, és amely a példányt másik tulajdonosnak adja el. @hu
label: ha come venditore agente collettivo @it
definition: Correla un item all'agente collettivo precedente proprietario di un item che ha venduto l'item a un altro proprietario. @it
toolkit label: venditore agente collettivo @it
toolkit definition: Agente collettivo precedente proprietario di un item che ha venduto l'item a un altro proprietario. @it
label: pārdevējs (grupa) @lv
definition: Sasaista vienību ar grupu, kas ir vienības agrākais īpašnieks, kura pārdod šo vienību citam īpašniekam. @lv
toolkit label: pārdevējs (grupa) @lv
toolkit definition: Grupa - vienības agrākais īpašnieks, kura pārdod šo vienību citam īpašniekam. @lv
has subproperty: a pour collectivité vendeuse
has subproperty: a pour famille vendeuse
has subproperty: P40125
label: 有出售者集体行为者 @zh-hans
definition: 将一个单件与作为先前拥有者将单件出售给另一个拥有者的一个集体行为者关联起来。 @zh-hans
toolkit label: 出售者集体行为者 @zh-hans
toolkit definition: 作为先前拥有者将单件出售给另一个拥有者的一个集体行为者 @zh-hans
label: satıcı kolektif temsilcisi ile ilişkilidir @tr
definition: Bir kopyayı, bir kopyanın eski sahibi olan ve kopyayı başka bir sahibe satan kolektif bir temsilciyle ilişkilendirir. @tr
toolkit label: satıcı kolektif temsilci @tr
toolkit definition: Bir kopyanın eski sahibi olan ve kopyayı başka bir sahibine satan kolektif bir temsilci. @tr

a pour collectivité vendeuse
status: Published
label: has seller corporate body @en
lexical alias: sellerCorporateBody.en
definition: Relates an item to a corporate body who is a former owner of an item who sells the item to another owner. @en
toolkit label: seller corporate body @en
toolkit definition: A corporate body who is a former owner of an item who sells the item to another owner. @en
type: Property
domain: C10003
has element type: 2
sub property of: a pour ancienne collectivité propriétaire
sub property of: a pour agent collectif vendeur
definition: Met un item en relation avec une ancienne collectivité propriétaire d’un item qui vend cet item à un autre propriétaire.
toolkit label: collectivité vendeuse
toolkit definition: Ancienne collectivité propriétaire d’un item qui vend cet item à un autre propriétaire.
label: myyjä (yhteisö) @fi
definition: Liittää kappaleen sen aiempaan omistajayhteisöön, joka myy kappaleen toiselle omistajalle. @fi
toolkit label: myyjä (yhteisö) @fi
toolkit definition: Kappaleen aiempi omistajayhteisö, joka myy kappaleen toiselle omistajalle. @fi
label: har selger (korporasjon) @no
definition: Relaterer et eksemplar til en korporasjon som er en tidligere eier av et eksemplar, som har solgt eksemplaret til en annen eier. @no
toolkit label: selger (korporasjon) @no
toolkit definition: En korporasjon som er en tidligere eier av et eksemplar, som har solgt eksemplaret til en annen eier. @no
label: heeft verkoper-corporatie @nl
definition: Relateert een item aan een corporatie die een voormalige eigenaar is van een item die het item verkoopt aan een andere eigenaar. @nl
toolkit label: verkoper-corporatie @nl
toolkit definition: Een corporatie die een voormalige eigenaar is van een item die het item verkoopt aan een andere eigenaar. @nl
label: له هيئة بائعة @ar
definition: يربط مفردة بهيئة هي مالك سابق لمفردة قامت ببيعها لمالك آخر. @ar
toolkit label: هيئة بائعة @ar
toolkit definition: هيئة هي مالك سابق لمفردة قامت ببيعها لمالك آخر. @ar
label: té com a entitat corporativa venedora @ca
definition: Relaciona un ítem amb una entitat corporativa que és un propietari anterior d’un ítem que ven l’ítem a un altre propietari. @ca
toolkit label: entitat corporativa venedora @ca
toolkit definition: Entitat corporativa que és un propietari anterior d’un ítem que ven l’ítem a un altre propietari. @ca
label: har korporation, som er sælger @da
definition: Relaterer et eksemplar til en korporation, som er tidligere ejer af et eksemplar, som har solgt dette eksemplar til en anden ejer. @da
toolkit label: korporation, som er sælger @da
toolkit definition: Korporation, som er tidligere ejer af et eksemplar, som har solgt dette eksemplar til en anden ejer. @da
label: müüja (asutus) @et
definition: Seostab eksemplari asutusega, kes eksemplari endise omanikuna on müünud selle teisele omanikule. @et
toolkit label: müüja (asutus) @et
toolkit definition: Asutus, kes eksemplari endise omanikuna on müünud selle teisele omanikule. @et
label: hat Verkäuferin/Verkäufer (Körperschaft) @de
definition: Setzt ein Exemplar in Beziehung zu einer früheren Eigentümerin/einem früheren Eigentümer (Körperschaft) eines Exemplars, die/der das Exemplar an eine andere Eigentümerin/einen anderen Eigentümer verkauft. @de
toolkit label: Verkäuferin/Verkäufer (Körperschaft) @de
toolkit definition: Eine frühere Eigentümerin/Ein früherer Eigentümer (Körperschaft) eines Exemplars, die/der das Exemplar an eine andere Eigentümerin/einen anderen Eigentümer verkauft. @de
label: értékesítő testülete a következő: @hu
definition: Egy példányt hozzákapcsol egy testülethez, amely a példány korábbi tulajdonosa, és amely a példányt másik tulajdonosnak adja el. @hu
toolkit label: értékesítő testülete: @hu
toolkit definition: Egy testület, amely egy példány korábbi tulajdonosa, és amely a példányt másik tulajdonosnak adja el. @hu
label: ha come venditore ente @it
definition: Correla un item all'ente proprietario precedente di un item, che ha venduto l'item a un altro proprietario. @it
toolkit label: venditore ente @it
toolkit definition: Ente proprietario precedente di un item che ha venduto l'item a un altro proprietario. @it
label: pārdevējs (institūcija) @lv
definition: Sasaista vienību ar institūciju, kas ir vienības agrākais īpašnieks, kura pārdod šo vienību citam īpašniekam. @lv
toolkit label: pārdevējs (institūcija) @lv
toolkit definition: Institūcija - vienības agrākais īpašnieks, kura pārdod šo vienību citam īpašniekam. @lv
has subproperty: P40141
label: 有出售者团体 @zh-hans
definition: 将一个单件与作为先前拥有者将单件出售给另一个拥有者的一个团体关联起来。 @zh-hans
toolkit label: 出售者团体 @zh-hans
toolkit definition: 作为先前拥有者将单件出售给另一个拥有者的一个团体 @zh-hans
label: satıcı tüzel kişisi ile ilişkilidir @tr
definition: Bir kopyayı, bir kopyayı başka bir sahibe satan bir kopyanın eski sahibi olan tüzel bir kişiyle ilişkilendirir. @tr
toolkit label: satıcı tüzel kişi @tr
toolkit definition: Bir kopyanın eski sahibi olan ve kopyayı başka bir sahibine satan bir tüzel kişi. @tr

a pour famille vendeuse
status: Published
label: has seller family @en
lexical alias: sellerFamily.en
definition: Relates an item to a family who is a former owner of an item who sells the item to another owner. @en
toolkit label: seller family @en
toolkit definition: A family who is a former owner of an item who sells the item to another owner. @en
type: Property
domain: C10003
has element type: 2
sub property of: a pour ancienne famille propriétaire
sub property of: a pour agent collectif vendeur
definition: Met un item en relation avec une ancienne famille propriétaire d’un item qui vend cet item à un autre propriétaire.
toolkit label: famille vendeuse
toolkit definition: Ancienne famille propriétaire d’un item qui vend cet item à un autre propriétaire.
label: myyjä (suku) @fi
definition: Liittää kappaleen sen aiempaan omistajasukuun, joka myy kappaleen toiselle omistajalle. @fi
toolkit label: myyjä (suku) @fi
toolkit definition: Kappaleen aiempi omistajasuku, joka myy kappaleen toiselle omistajalle. @fi
label: har selger (familie) @no
definition: Relaterer et eksemplar til en familie som er en tidligere eier av et eksemplar, som har solgt eksemplaret til en annen eier. @no
toolkit label: selger (familie) @no
toolkit definition: En familie som er en tidligere eier av et eksemplar, som har solgt eksemplaret til en annen eier. @no
label: heeft verkoper-familie @nl
definition: Relateert een item aan een familie die een voormalige eigenaar is van een item die het item verkoopt aan een andere eigenaar. @nl
toolkit label: verkoper-familie @nl
toolkit definition: Een familie die een voormalige eigenaar is van een item die het item verkoopt aan een andere eigenaar. @nl
label: له عائلة بائعة @ar
definition: يربط مفردة بعائلة هي المالك السابق لمفردة قامت ببيعها لمالك آخر. @ar
toolkit label: عائلة بائعة @ar
toolkit definition: عائلة هي المالك السابق لمفردة قامت ببيعها لمالك آخر. @ar
label: té com a família venedora @ca
definition: Relaciona un ítem amb una família que és un propietari anterior d’un ítem que ven l’ítem a un altre propietari. @ca
toolkit label: família venedora @ca
toolkit definition: Família que és un propietari anterior d’un ítem que ven l’ítem a un altre propietari. @ca
label: har familie, som er sælger @da
definition: Relaterer et eksemplar til en familie, som er tidligere ejer af et eksemplar, som har solgt dette eksemplar til en anden ejer. @da
toolkit label: familie, som er sælger @da
toolkit definition: Familie, som er tidligere ejer af et eksemplar, som har solgt dette eksemplar til en anden ejer. @da
label: müüja (perekond) @et
definition: Seostab eksemplari perekonnaga, kes eksemplari endise omanikuna on müünud selle teisele omanikule. @et
toolkit label: müüja (perekond) @et
toolkit definition: Perekond, kes eksemplari endise omanikuna on müünud selle teisele omanikule. @et
label: hat Verkäuferin/Verkäufer (Familie) @de
definition: Setzt ein Exemplar in Beziehung zu einer früheren Eigentümerin/einem früheren Eigentümer (Familie) eines Exemplars, die das Exemplar an eine andere Eigentümerin/einen anderen Eigentümer verkauft. @de
toolkit label: Verkäuferin/Verkäufer (Familie) @de
toolkit definition: Eine frühere Eigentümerin/Ein früherer Eigentümer (Familie) eines Exemplars, die das Exemplar an eine andere Eigentümerin/einen anderen Eigentümer verkauft. @de
label: értékesítő családja a következő: @hu
definition: Egy példányt hozzákapcsol egy családhoz, amely a példány korábbi tulajdonosa, és amely a példányt másik tulajdonosnak adja el. @hu
toolkit label: értékesítő család @hu
toolkit definition: Egy család, amely egy példány korábbi tulajdonosa, és amely a példányt másik tulajdonosnak adja el. @hu
label: ha come venditore famiglia @it
definition: Correla un item alla famiglia proprietario precedente di un item che ha venduto l'item a un altro proprietario. @it
toolkit label: venditore famiglia @it
toolkit definition: Famiglia proprietario precedente di un item che ha donato l'item a un altro proprietario. @it
label: pārdevējs (dzimta/ģimene) @lv
definition: Sasaista vienību ar dzimtu/ģimeni, kas ir vienības agrākais īpašnieks, kura pārdod šo vienību citam īpašniekam. @lv
toolkit label: pārdevējs (dzimta/ģimene) @lv
toolkit definition: Dzimta/ģimene - vienības agrākais īpašnieks, kura pārdod šo vienību citam īpašniekam. @lv
has subproperty: P40157
label: 有出售者家族 @zh-hans
definition: 将一个的单件与作为先前拥有者将单件出售给另一个拥有者的一个家族关联起来。 @zh-hans
toolkit label: 出售者家族 @zh-hans
toolkit definition: 作为先前拥有者将单件出售给另一个拥有者的一个家族 @zh-hans
label: satıcı ailesi ile ilişkilidir @tr
definition: Bir kopyayı, bir kopyayı başka bir sahibine satan bir kopyanın eski sahibi olan bir aileyle ilişkilendirir. @tr
toolkit label: satıcı aile @tr
toolkit definition: Bir kopyanın eski sahibi olan ve kopyayı başka bir sahibine satan bir aile. @tr

a pour personne vendeuse
status: Published
label: has seller person @en
lexical alias: sellerPerson.en
definition: Relates an item to a person who is a former owner of an item who sells the item to another owner. @en
toolkit label: seller person @en
toolkit definition: A person who is a former owner of an item who sells the item to another owner. @en
type: Property
domain: C10003
has element type: 2
sub property of: a pour ancienne personne propriétaire
sub property of: a pour agent vendeur
definition: Met un item en relation avec une ancienne personne propriétaire d’un item qui vend cet item à un autre propriétaire.
toolkit label: personne vendeuse
toolkit definition: Ancienne personne propriétaire d’un item qui vend cet item à un autre propriétaire.
label: myyjä (henkilö) @fi
definition: Liittää kappaleen sen aiempaan henkilöomistajaan, joka myy kappaleen toiselle omistajalle. @fi
toolkit label: myyjä (henkilö) @fi
toolkit definition: Kappaleen aiempi henkilöomistaja, joka myy kappaleen toiselle omistajalle. @fi
label: har selger (person) @no
definition: Relaterer et eksemplar til en person som er en tidligere eier av et eksemplar, som har solgt eksemplaret til en annen eier. @no
toolkit label: selger (person) @no
toolkit definition: En person som er en tidligere eier av et eksemplar, som har solgt eksemplaret til en annen eier. @no
label: heeft verkoper-persoon @nl
definition: Relateert een item aan een persoon die een voormalige eigenaar is van een item die het item verkoopt aan een andere eigenaar. @nl
toolkit label: verkoper-persoon @nl
toolkit definition: Een persoon die een voormalige eigenaar is van een item die het item verkoopt aan een andere eigenaar. @nl
label: له شخص بائع @ar
definition: يربط مفردة بشخص هو مالك سابق لمفردة قام ببيعها لمالك آخر. @ar
toolkit label: شخص بائع @ar
toolkit definition: شخص هو مالك سابق لمفردة قام ببيعها لمالك آخر. @ar
label: té com a persona venedora @ca
definition: Relaciona un ítem amb una persona que és un propietari anterior d’un ítem que ven l’ítem a un altre propietari. @ca
toolkit label: persona venedora @ca
toolkit definition: Persona que és un propietari anterior d’un ítem que ven l’ítem a un altre propietari. @ca
label: har person, som er sælger @da
definition: Relaterer et eksemplar til en person, som er tidligere ejer af et eksemplar, som har solgt dette eksemplar til en anden ejer. @da
toolkit label: person, som er sælger @da
toolkit definition: Person, som er tidligere ejer af et eksemplar, som har solgt dette eksemplar til en anden ejer. @da
label: müüja (isik) @et
definition: Seostab eksemplari isikuga, kes eksemplari endise omanikuna on müünud selle teisele omanikule. @et
toolkit label: müüja (isik) @et
toolkit definition: Isik, kes eksemplari endise omanikuna on müünud selle teisele omanikule. @et
label: hat Verkäuferin/Verkäufer (Person) @de
definition: Setzt ein Exemplar in Beziehung zu einer früheren Eigentümerin/einem früheren Eigentümer (Person) eines Exemplars, die/der das Exemplar an eine andere Eigentümerin/einen anderen Eigentümer verkauft. @de
toolkit label: Verkäuferin/Verkäufer (Person) @de
toolkit definition: Eine frühere Eigentümerin/Ein früherer Eigentümer (Person) eines Exemplars, die/der das Exemplar an eine andere Eigentümerin/einen anderen Eigentümer verkauft. @de
label: értékesítő személye a következő: @hu
definition: Hozzákapcsol egy példányt egy személyhez, aki egy példány korábbi tulajdonosa, és aki a példányt egy másik tulajdonosnak adja el. @hu
toolkit label: értékesítő személye: @hu
toolkit definition: Egy személy, aki egy példány korábbi tulajdonosa, és aki a példányt egy másik tulajdonosnak adja el. @hu
label: ha come venditore persona @it
definition: Correla un item al proprietario precedente persona di un item che ha venduto l'item a un altro proprietario. @it
toolkit label: venditore persona @it
toolkit definition: Proprietario precedente persona di un item che ha venduto l'item a un altro proprietario. @it
label: pārdevējs (persona) @lv
definition: Sasaista vienību ar personu, kura ir vienības agrākais īpašnieks, kura pārdod šo vienību citam īpašniekam. @lv
toolkit label: pārdevējs (persona) @lv
toolkit definition: Persona - vienības agrākais īpašnieks, kura pārdod šo vienību citam īpašniekam. @lv
has subproperty: P40109
label: 有出售者个人 @zh-hans
definition: 将一个单件与作为先前拥有者将单件出售给另一个拥有者的一个个人关联起来。 @zh-hans
toolkit label: 出售者个人 @zh-hans
toolkit definition: 作为先前拥有者将单件出售给另一个拥有者的一个个人 @zh-hans
label: satıcı kişisi ile ilişkilidir @tr
definition: Bir kopyayı, bir kopyanın eski sahibi olan ve o kopyayı başka bir sahibine satan bir kişiyle ilişkilendirir. @tr
toolkit label: satıcı kişi @tr
toolkit definition: Bir kopyanın eski sahibi olan ve kopyayı başka bir sahibine satan kişi. @tr

est un item sujet de
status: Published
type: Property
label: is subject item of @en
lexical alias: subjectItemOf.en
definition: Relates an item to a work that is about an item. @en
domain: C10003
toolkit label: subject item of @en
toolkit definition: A work that is about an item. @en
sub property of: a pour œuvre en relation avec un item
label: là chủ đề của (bản) @vi
definition: Liên kết bản với tác phẩm về bản. @vi
toolkit label: chủ đề của (bản) @vi
toolkit definition: Tác phẩm về bản. @vi
label: er eksemplar, som er subjekt af @da
definition: Relaterer et eksemplar til et værk, som handler om et eksemplar. @da
toolkit label: eksemplar, som er subjekt af @da
toolkit definition: Værk, som handler om et eksemplar. @da
label: ist Thema von (Exemplar) @de
definition: Setzt ein Exemplar in Beziehung zu einem Werk, das von einem Exemplar handelt. @de
toolkit label: Thema von (Exemplar) @de
toolkit definition: Ein Werk, das von einem Exemplar handelt. @de
label: είναι θέμα του (αντίτυπο) @el
definition: Συνδέει ένα αντίτυπο με ένα έργο σχετικά με ένα αντίτυπο. @el
toolkit label: θέμα του (αντίτυπο) @el
toolkit definition: Ένα έργο σχετικά με ένα αντίτυπο. @el
label: és ítem de matèria de @ca
definition: Relaciona un ítem amb una obra que tracta d’un ítem. @ca
toolkit label: ítem de matèria de @ca
toolkit definition: Obra que tracta d’un ítem. @ca
definition: Liittää kappaleen kappaleesta kertovaan teokseen. @fi
toolkit label: kappale aiheena teoksessa @fi
toolkit definition: Kappaleesta kertova teos. @fi
definition: Met un item en relation avec une œuvre qui traite d’un item.
toolkit definition: Œuvre qui traite d’un item.
toolkit label: item sujet de
toolkit label: emne for eksemplar @no
toolkit definition: Et verk som handler om et eksemplar. @no
sub property of: P00014
has element type: 2
alternative label: subject of (item) @en
label: példány-tárgya a következőnek: @hu
definition: Hozzákapcsol egy példányt egy műhöz, ami egy példányról szól. @hu
toolkit label: példány-tárgya: @hu
toolkit definition: Egy mű, ami egy példányról szól. @hu
alternative label: sujet de (item)
label: kappale aiheena teoksessa @fi
label: er emne for eksemplar @no
definition: Relaterer et eksemplar til et verk som handler om et eksemplar. @no
alternative label: emne for (eksemplar) @no
label: is onderwerp-item van @nl
definition: Relateert een item aan een werk dat over een item gaat. @nl
toolkit label: onderwerp-item van @nl
toolkit definition: Een werk dat over een item gaat. @nl
label: هي مفردة موضوع لـ @ar
definition: يربط مفردة بعمل عن مفردة. @ar
alternative label: موضوع (لمفردة) @ar
toolkit label: مفردة لموضوع عن @ar
toolkit definition: عمل عن مفردة @ar
alternative label: matèria de (ítem) @ca
alternative label: genstand for (eksemplar) @da
label: käsitletud teoses (eksemplar) @et
definition: Seostab eksemplari teosega, mis on eksemplari kohta. @et
toolkit label: käsitletud teoses (eksemplar) @et
toolkit definition: Teos, mis on eksemplari kohta. @et
alternative label: Thema von (Exemplar) @de
alternative label: tárgya (példány): @hu
label: è item soggetto di @it
definition: Correla un item a un'opera che tratta di un item. @it
alternative label: soggetto di (item) @it
toolkit label: item soggetto di @it
toolkit definition: Opera che tratta di un item. @it
label: ir temats (vienība) @lv
definition: Sasaista vienību ar darbu, kura temats ir vienība. @lv
toolkit label: ir temats (vienība) @lv
toolkit definition: Darbs, kura temats ir vienība. @lv
has subproperty: est un item décrit par
has subproperty: P40061
alternative label: ……的主题（单件） @zh-hans
label: 是……的主题单件 @zh-hans
toolkit label: ……的主题单件 @zh-hans

a pour titre d’item
status: Published
type: Property
label: has title of item @en
lexical alias: titleOfItem.en
definition: Relates an item to a nomen that is an appellation of item in natural language and phrasing used in common discourse. @en
domain: C10003
toolkit label: title of item @en
toolkit definition: A nomen that is an appellation of item in natural language and phrasing used in common discourse. @en
sub property of: a pour appellation d’item
has element type: 3
sub property of: P00019
definition: Met un item en relation avec un nomen qui est une appellation d’item exprimée dans un langage et une formulation naturels et utilisée dans le langage courant.
toolkit label: titre d’item
toolkit definition: Nomen qui est une appellation d’item exprimée dans un langage et une formulation naturels et utilisée dans le langage courant.
label: kappaleen nimeke @fi
definition: Liittää kappaleen nomeniin, joka on kappaleen nimitys, joka on luonnollisen kielen ja yleisen diskurssin sanamuodon mukainen. @fi
toolkit label: kappaleen nimeke @fi
toolkit definition: Nomen, joka on kappaleen nimitys, joka on luonnollisen kielen ja yleisen diskurssin sanamuodon mukainen. @fi
label: har tittel for eksemplar @no
definition: Relaterer et eksemplar til en betegnelse på eksemplar med et naturlig språk og med en frasering brukt i alminnelig diskurs. @no
toolkit label: tittel for eksemplar @no
toolkit definition: En betegnelse på eksemplar med et naturlig språk og med en frasering brukt i alminnelig diskurs. @no
label: heeft titel van item @nl
definition: Relateert een item aan een nomen dat is een benaming van item in natuurlijke taal en terminologie in gebruikelijke bewoording. @nl
toolkit label: titel van item @nl
toolkit definition: Een nomen dat is een benaming van item in natuurlijke taal en terminologie in gebruikelijke bewoording. @nl
label: له عنوان مفردة @ar
definition: يربط مفردة بتسمية هي اسم مفردة في لغة طبيعية وفي العبارات المستخدمة في الخطاب العام. @ar
toolkit label: عنوان لمفردة @ar
toolkit definition: تسمية هي اسم مفردة في لغة طبيعية وفي العبارات المستخدمة في الخطاب العام. @ar
label: té com a títol d’ítem @ca
definition: Relaciona un ítem amb un nomen que és una apel·lació d’ítem en llenguatge i frases naturals usada en el discurs comú. @ca
toolkit label: títol d’ítem @ca
toolkit definition: Nomen que és una apel·lació d’ítem en llenguatge i frases naturals usada en el discurs comú. @ca
label: har titel på eksemplar @da
definition: Relaterer et eksemplar til en benævnelse på eksemplar på normalsprog og med formuleringer, som bruges alment. @da
toolkit label: titel på eksemplar @da
toolkit definition: Benævnelse på eksemplar på normalsprog og med formuleringer, som bruges alment. @da
label: eksemplari pealkiri @et
definition: Seostab eksemplari eksemplari nimetusega loomulikus keeles ja sõnastuses, mida kasutatakse ühises diskursuses. @et
toolkit label: eksemplari pealkiri @et
toolkit definition: Eksemplari nimetus loomulikus keeles ja sõnastuses, mida kasutatakse ühises diskursuses. @et
label: hat Titel eines Exemplars @de
definition: Setzt eine Exemplar in Beziehung zu einer Bezeichnung für ein Exemplar in natürlicher Sprache und Ausdrucksweise, die beim normalen Sprechen und Schreiben verwendet wird. @de
toolkit label: Titel eines Exemplars @de
toolkit definition: Eine Bezeichnung für ein Exemplar in natürlicher Sprache und Ausdrucksweise, die beim normalen Sprechen und Schreiben verwendet wird. @de
label: példány címe a következő: @hu
definition: Hozzákapcsol egy példányt egy nomenhez, amely egy példány természetes nyelvű megnevezése és a közbeszédben használt megfogalmazása. @hu
toolkit label: példány címe: @hu
toolkit definition: Egy nomen, amely egy példány természetes nyelvű megnevezése és a közbeszédben használt megfogalmazása. @hu
label: ha come titolo di item @it
definition: Correla un item a una denominazione di item in linguaggio e frasi naturali usati nel discorso comune. @it
toolkit label: titolo di item @it
toolkit definition: Denominazione di item in linguaggio e frasi naturali usati nel discorso comune. @it
label: vienības nosaukums @lv
definition: Sasaista vienību ar nomenu, kas ir vienības apzīmējums dabiskā valodā un frāzēs, kas tiek lietots savstarpējā saziņā. @lv
toolkit label: vienības nosaukums @lv
toolkit definition: Vienības apzīmējums dabiskā valodā un frāzēs, kas tiek lietots savstarpējā saziņā. @lv
has subproperty: a pour titre privilégié d’un item
has subproperty: a pour variante de titre d’item
has subproperty: P40082
label: 有单件的题名 @zh-hans
definition: 将一个单件与作为用自然语言和普通话语措词表达的单件的称谓的一个命名关联起来。 @zh-hans
toolkit label: 单件的题名 @zh-hans
toolkit definition: 作为用自然语言和普通话语措词表达的单件的称谓的一个命名 @zh-hans
label: kopya başlığı ile ilişkilidir @tr
definition: Bir kopyayı, kopyanın doğal dildeki adı ve ortak söylemde kullanılan ifade biçimi olan bir isimle ilişkilendirir. @tr
toolkit label: kopyanın başlığı @tr
toolkit definition: Doğal dilde ve ortak söylemde kullanılan ifadelerde bir kopyanın unvanı olan bir isim. @tr

a pour variante de point d’accès d’un item
status: Published
type: Property
label: has variant access point for item @en
lexical alias: variantAccessPointForItem.en
definition: Relates an item to a nomen that is an access point of item that is not selected for preference in a specific vocabulary encoding scheme. @en
domain: C10003
toolkit label: variant access point for item @en
toolkit definition: A nomen that is an access point of item that is not selected for preference in a specific vocabulary encoding scheme. @en
sub property of: a pour point d’accès d’un item
has element type: 3
sub property of: P00022
definition: Met un item en relation avec un nomen qui est un point d’accès d’un item ne faisant pas l’objet d’un choix privilégié dans un schéma d’encodage de vocabulaire spécifique.
toolkit label: variante de point d’accès d’un item
toolkit definition: Nomen qui est un point d’accès d’un item ne faisant pas l’objet d’un choix privilégié dans un schéma d’encodage de vocabulaire spécifique.
label: kappaleen varianttihakutieto @fi
definition: Liittää kappaleen nomeniin, joka on kappaleen hakutieto, jota ei ole valittu ensisijaiseksi tietyssä sanaston merkintäjärjestelmässä. @fi
toolkit label: kappaleen varianttihakutieto @fi
toolkit definition: Nomen, joka on kappaleen hakutieto, jota ei ole valittu ensisijaiseksi tietyssä sanaston merkintäjärjestelmässä. @fi
label: har alternativ søkeinngang for eksemplar @no
definition: Relaterer et eksemplar til en søkeinngang for eksemplar som ikke er en foretrukket søkeinngang i et bestemt kodeskjema for vokabular. @no
toolkit label: alternativ søkeinngang for eksemplar @no
toolkit definition: En søkeinngang for eksemplar som ikke er en foretrukket søkeinngang i et bestemt kodeskjema for vokabular. @no
label: heeft variant ingang voor item @nl
definition: Relateert een item aan een nomen dat is een ingang van item die niet als voorkeursterm geselecteerd is in een specifiek vocabulair coderingssysteem. @nl
toolkit label: variant ingang voor item @nl
toolkit definition: Een nomen dat is een ingang van item die niet als voorkeursterm geselecteerd is in een specifiek vocabulair coderingssysteem. @nl
label: له نقطة وصول مختلفة لمفردة @ar
definition: يربط مفردة بتسمية هي نقطة وصول لمفردة لم تُختر للتفضيل في خطة ترميز مفردات. @ar
toolkit label: نقطة وصول مختلفة لمفردة @ar
toolkit definition: تسمية هي نقطة وصول لمفردة لم تُختر للتفضيل في خطة ترميز مفردات محددة. @ar
label: té com a variant de punt d’accés d’ítem @ca
definition: Relaciona un ítem amb un nomen que és un punt d’accés d’ítem que no se selecciona com a preferent en un esquema de codificació de vocabulari específic. @ca
toolkit label: variant de punt d’accés d’ítem @ca
toolkit definition: Nomen que és un punt d’accés d’ítem que no se selecciona com a preferent en un esquema de codificació de vocabulari específic. @ca
label: har variant af søgeindgang for eksemplar @da
definition: Relaterer et eksemplar til en søgeindgang for eksemplar, som ikke er valgt som præference i et specifikt vokabularkodningsskema. @da
toolkit label: variant af søgeindgang for eksemplar @da
toolkit definition: Søgeindgang for eksemplar, som ikke er valgt som præference i et specifikt vokabularkodningsskema. @da
label: eksemplari otsielemendi variant @et
definition: Seostab eksemplari eksemplari otsielemendiga, mis ei ole valitud eelistatuks vastavas leksikaalses märkimissüsteemis. @et
toolkit label: eksemplari otsielemendi variant @et
toolkit definition: Eksemplari otsielement, mis ei ole valitud eelistatuks vastavas leksikaalses märkimissüsteemis. @et
label: hat zusätzlichen Sucheinstieg für ein Exemplar @de
definition: Setzt ein Exemplar in Beziehung zu einem Sucheinstieg für ein Exemplar, der in einem bestimmten Vocabulary Encoding Scheme nicht als Vorzugsform bestimmt wird. @de
toolkit label: Zusätzlicher Sucheinstieg für ein Exemplar @de
toolkit definition: Ein Sucheinstieg für ein Exemplar, der in einem bestimmten Vocabulary Encoding Scheme nicht als Vorzugsform bestimmt wird. @de
label: példány hozzáférésipont-változata a következő: @hu
definition: Hozzákapcsol példány egy nomenhez, amely egy példány olyan hozzáférési pontja, amelyet egy adott szótárkódolási sémában nem részesítenek előnyben. @hu
toolkit label: példány hozzáférésipont-változata: @hu
toolkit definition: Egy nomen, amely egy példány olyan hozzáférési pontja, amelyet egy adott szótárkódolási sémában nem részesítenek előnyben. @hu
label: ha come punto d'accesso variante per item @it
definition: Correla un item a un punto d'accesso di item non selezionato come preferito in uno specifico schema di codifica di vocabolario. @it
toolkit label: punto d'accesso variante per item @it
toolkit definition: Punto d'accesso di item non selezionato come preferito in uno specifico schema di codifica di vocabolario. @it
label: vienības papildforma @lv
definition: Sasaista vienību ar nomenu, kas ir piekļuves punkts vienībai, kas nav izvēlēta kā prioritāra noteiktai kontrolētas vārdnīcas shēmai. @lv
toolkit label: vienības papildforma @lv
toolkit definition: Piekļuves punkts vienībai, kas nav izvēlēta kā prioritāra noteiktai kontrolētas vārdnīcas shēmai. @lv
has subproperty: P40084
label: 有单件的变异检索点 @zh-hans
definition: 将一个单件与作为一个单件的检索点、并没有在一个特定的词表编码体系中被首选的一个命名关联起来。 @zh-hans
toolkit label: 单件的变异检索点 @zh-hans
toolkit definition: 作为一个单件的检索点、并没有在一个特定的词表编码体系中被首选的一个命名 @zh-hans
label: kopya için alternatif erişim noktası ile ilişkilidir @tr
definition: Bir kopyayı, belirli bir kelime kodlama şemasında tercih için seçilmeyen bir kopyanın erişim noktası olan bir isimle ilişkilendirir. @tr
toolkit label: kopya için alternatif erişim noktası @tr
toolkit definition: Belirli bir kelime kodlama şemasında tercih için seçilmemiş bir kopyanın erişim noktası olan bir isim. @tr

a pour variante de titre d’item
status: Published
type: Property
label: has variant title of item @en
lexical alias: variantTitleOfItem.en
definition: Relates an item to a nomen that is a title of item that is not selected for preference in a specific application or context. @en
domain: C10003
toolkit label: variant title of item @en
toolkit definition: A nomen that is a title of item that is not selected for preference in a specific application or context. @en
sub property of: a pour titre d’item
has element type: 3
sub property of: P00023
definition: Met un item en relation avec un nomen qui est un titre d’item ne faisant pas l’objet d’un choix privilégié dans une application ou un contexte spécifiques.
toolkit label: variante de titre d’item
toolkit definition: Nomen qui est un titre d’item ne faisant pas l’objet d’un choix privilégié dans une application ou un contexte spécifiques.
label: kappaleen varianttinimeke @fi
definition: Liittää kappaleen nomeniin, joka on kappaleen nimeke, jota ei ole valittu ensisijaiseksi tietyssä sovelluksessa tai kontekstissa. @fi
toolkit label: kappaleen varianttinimeke @fi
toolkit definition: Nomen, joka on kappaleen nimeke, jota ei ole valittu ensisijaiseksi tietyssä sovelluksessa tai kontekstissa. @fi
label: har tittelvariant for eksemplar @no
definition: Relaterer et eksemplar til en tittel for eksemplar som ikke er valgt som foretrukket tittel i en spesifikk applikasjon eller kontekst. @no
toolkit label: tittelvariant for eksemplar @no
toolkit definition: En tittel for eksemplar som ikke er valgt som foretrukket tittel i en spesifikk applikasjon eller kontekst. @no
label: heeft variant titel van item @nl
definition: Relateert een item aan een nomen dat is een titel van item die niet als voorkeursterm geselecteerd is in een specifieke toepassing of context. @nl
toolkit label: variant titel van item @nl
toolkit definition: Een nomen dat is een titel van item die niet als voorkeursterm geselecteerd is in een specifieke toepassing of context. @nl
label: له عنوان مفردة مختلف @ar
definition: يربط مفردة بعنوان مفردة لم يُختر للتفضيل في تطبيق أو في سياق محدد. @ar
toolkit label: عنوان مفردة مختلف @ar
toolkit definition: عنوان مفردة لم يُختر للتفضيل في تطبيق أو في سياق محدد. @ar
label: té com a variant de títol d’ítem @ca
definition: Relaciona un ítem amb nomen que és un títol d’ítem que no se selecciona com a preferent en una aplicació o un context específic. @ca
toolkit label: variant de títol d’ítem @ca
toolkit definition: Nomen que és un títol d’ítem que no se selecciona com a preferent en una aplicació o un context específic. @ca
label: har variant af titel på eksemplar @da
definition: Relaterer et eksemplar til en titel på eksemplar, som ikke er valgt som præference i en specifik anvendelse eller kontekst. @da
toolkit label: variant af titel på eksemplar @da
toolkit definition: Titel på eksemplar, som ikke er valgt som præference i en specifik anvendelse eller kontekst. @da
label: eksemplari variantpealkiri @et
definition: Seostab eksemplari eksemplari pealkirjaga, mis kindlas rakenduses või kontekstis ei ole valitud eelistatuks. @et
toolkit label: eksemplari variantpealkiri @et
toolkit definition: Eksemplari pealkiri, mis kindlas rakenduses või kontekstis ei ole valitud eelistatuks. @et
label: hat abweichenden Titel eines Exemplars @de
definition: Setzt ein Exemplar in Beziehung zu einem Titel eines Exemplars, der in einer bestimmten Anwendung oder in einem bestimmten Kontext nicht als Vorzugsform bestimmt wird. @de
toolkit label: abweichender Titel eines Exemplars @de
toolkit definition: Ein Titel eines Exemplars, der in einer bestimmten Anwendung oder in einem bestimmten Kontext nicht als Vorzugsform bestimmt wird. @de
label: példány címváltozata a következő: @hu
definition: Hozzákapcsol egy példány egy nomenhez, amely egy példány olyan címe, amelyet egy adott alkalmazásban vagy kontextusban nem részesítenek előnyben. @hu
toolkit label: példány címváltozata: @hu
toolkit definition: Egy nomen, amely egy példány olyan címe, amelyet egy adott alkalmazásban vagy kontextusban nem részesítenek előnyben. @hu
label: ha come titolo variante di item @it
definition: Correla un item a un titolo di item non selezionato come preferito in un'applicazione o contesto specifici. @it
toolkit label: titolo variante di item @it
toolkit definition: Titolo di item, non selezionato come preferito in un'applicazione o contesto specifici. @it
label: vienības cits nosaukums @lv
definition: Sasaista vienību ar nomenu, kas ir vienīibas nosaukums, kas nav izvēlēts kā prioritārs noteiktā lietojumprogrammā vai kontekstā. @lv
toolkit label: vienības cits nosaukums @lv
toolkit definition: Vienīibas nosaukums, kas nav izvēlēts kā prioritārs noteiktā lietojumprogrammā vai kontekstā. @lv
has subproperty: P40086
label: 有单件的变异题名 @zh-hans
definition: 将一个单件与作为一个单件的题名、并没有在一个特定的应用或语境中被首选的一个命名关联起来。 @zh-hans
toolkit label: 单件的变异题名 @zh-hans
toolkit definition: 作为一个单件的题名、并没有在一个特定的应用或语境中被首选的一个命名 @zh-hans
label: kopyanın alternatif başlığı ile ilişkilidir @tr
definition: Bir kopyayı, belirli bir uygulama veya bağlamda tercih için seçilmeyen bir kopya başlığı olan bir isimle ilişkilendirir. @tr
toolkit label: kopyanın alternatif başlığı @tr
toolkit definition: Belirli bir uygulama veya bağlamda tercih için seçilmemiş bir kopyanın başlığı olan bir isim. @tr

a pour relation d’item tout-partie
status: Deprecated
type: Property
domain: C10003
definition: Met un item en relation avec un item qui contient ou est contenu dans un autre item.
toolkit label: relation d’item tout-partie
toolkit definition: Item qui contient ou est contenu dans un autre item.
toolkit label: relación del ítem todo-parte @es
toolkit definition: Un ítem que es incluido en, o contiene el ítem. @es
sub property of: a pour item en relation avec un item
instruction number: 24.5
label: có mối quan hệ bản toàn bộ-phần với @vi
definition: Liên kết bản với bản được chứa trong hoặc có chứa bản khác. @vi
toolkit label: mối quan hệ bản toàn bộ phần @vi
toolkit definition: Bản được chứa trong hoặc có chứa bản khác. @vi
label: har helhed-del-eksemplarrelation med @da
definition: Relaterer et eksemplar til et eksemplar der indgår i, eller indeholder et eksemplar. @da
toolkit label: helhed-del-eksemplarrelation @da
toolkit definition: Eksemplar der indgår i, eller indeholder et eksemplar. @da
label: hat Teil-Ganzes-Beziehung auf Exemplarebene @de
definition: Setzt ein Exemplar mit einem Exemplar, das in einem anderen Exemplar enthalten ist oder eins enthält, in Beziehung. @de
toolkit label: Teil-Ganzes-Beziehung auf Exemplarebene @de
toolkit definition: Ein Exemplar, das in einem anderen Exemplar enthalten ist oder eins enthält. @de
label: έχει σχέση συνόλου-τμήματος του αντιτύπου με @el
definition: Συνδέει ένα αντίτυπο με ένα αντίτυπο το οποίο περιέχεται σε ή περιέχει κάποιο άλλο αντίτυπο. @el
toolkit label: σχέση συνόλου-τμήματος του αντιτύπου @el
toolkit definition: Ένα αντίτυπο το οποίο περιέχεται σε ή περιέχει κάποιο άλλο αντίτυπο. @el
label: té com a relació d’ítem tot-part @ca
definition: Relaciona un item amb un ítem que és contingut o conté un altre ítem. @ca
toolkit label: relació d’ítem tot-part @ca
toolkit definition: Ítem que és contingut o conté un altre ítem. @ca
label: osa-kokonaissuhde kappaleeseen @fi
definition: Liittää kappaleen kappaleeseen, joka sisältyy toiseen kappaleeseen tai sisältää toisen kappaleen. @fi
toolkit label: osa-kokonaissuhde kappaleeseen @fi
toolkit definition: Kappale, joka sisältyy toiseen kappaleeseen tai sisältää toisen kappaleen. @fi
toolkit label: relasjonstypen hel/del av eksemplar @no
toolkit definition: Et eksemplar som omfattes av eller selv omfatter et annet eksemplar. @no
lexical alias: wholePartItemRelationship.en
has subproperty: P40054

Published
type: Concept

Deprecated
type: Concept

est conservé par
status: Published
label: is holding of @en
definition: Relates an item to a manifestation of a collection work that includes the item. @en
type: Property
domain: C10003
lexical alias: holdingOf.en
has element type: 2
toolkit label: holding of @en
toolkit definition: A manifestation of a collection work that includes the item. @en
sub property of: a pour manifestation en relation avec un item
toolkit definition: Kokoelmateoksen manifestaatio, joka sisältää kappaleen. @fi
toolkit label: kappale kokoelmassa @fi
definition: Liittää kappaleen kokoelmateoksen manifestaatioon, joka sisältää kappaleen. @fi
label: kappale kokoelmassa @fi
has subproperty: P40161
label: 是……的馆藏 @zh-hans
definition: 将一个单件与包含该单件的一种收藏作品的一种载体表现关联起来。 @zh-hans
toolkit label: ……的馆藏 @zh-hans
toolkit definition: 包含该单件的一种收藏作品的一种载体表现 @zh-hans
label: és fons de @ca
definition: Relaciona un ítem amb una manifestació d’una obra de col·lecció de recursos que inclou l'ítem. @ca
toolkit label: fons de @ca
definition: Met un item en relation avec une manifestation d’une œuvre de collection de ressources qui comprend l’item.
toolkit label: conservé par
toolkit definition: Manifestation d’une œuvre de collection de ressources qui comprend l’item.
label: koleksiyonda bulunan kopyasıdır @tr
definition: Bir kopyayı, kopyayı içeren bir koleksiyon eserinin gösterimiyle ilişkilendirir. @tr
toolkit label: koleksiyonunda bulunan kopyasıdır @tr
toolkit definition: Kopyayı içeren bir koleksiyon eserinin gösterimi. @tr

a pour emplacement d’un item
status: Published
label: has location of item @en
definition: Relates an item to a place where an item is held, stored, or made available for access. @en
type: Property
domain: C10003
lexical alias: locationOfItem.en
has element type: 2
toolkit label: location of item @en
toolkit definition: A place where an item is held, stored, or made available for access. @en
sub property of: a pour lieu en relation avec un item
toolkit definition: Paikka, jossa kappale säilytetään tai asetetaan saataville. @fi
toolkit label: kappaleen sijainti @fi
definition: Liittää kappaleen paikkaan, jossa kappale säilytetään tai asetetaan saataville. @fi
label: kappaleen sijainti @fi
has subproperty: P40162
label: 有单件的位置 @zh-hans
definition: 将一个单件与一个单件被收藏、储存或提供存取的一个地点关联起来。 @zh-hans
toolkit label: 单件的位置 @zh-hans
toolkit definition: 一个单件被收藏、储存或提供存取的一个地点 @zh-hans
label: té localització d’ítem @ca
definition: Relaciona un ítem amb un lloc on un ítem és aplegat, emmagatzemat o fet disponible per a l'accés. @ca
toolkit label: localització d’ítem @ca
toolkit definition: Lloc on un ítem és aplegat, emmagatzemat o fet disponible per a l'accés. @ca
definition: Met un item en relation avec un lieu où un item est conservé, entreposé ou rendu accessible.
toolkit label: emplacement d’un item
toolkit definition: Lieu où un item est conservé, entreposé ou rendu accessible.
label: kopyanın konumu ile ilişkilidir @tr
definition: Bir kopyayı, bir kopyanın tutulduğu, saklandığı veya erişim için hazırlandığı bir yerle ilişkilendirir. @tr
toolkit label: Kopyanın konumu @tr
toolkit definition: Bir kopyanın tutulduğu, saklandığı veya erişim için hazır hale getirildiği yer. @tr

est un item décrit avec des métadonnées par
status: Published
label: is item described with metadata by @en
definition: Relates an item to a work that is a metadata work for an item. @en
type: Property
domain: C10003
lexical alias: itemDescribedWithMetadataBy.en
has element type: 2
toolkit label: item described with metadata by @en
toolkit definition: A work that is a metadata work for an item. @en
sub property of: est un item décrit par
toolkit definition: Teos, joka on kappaleen metatietoteos. @fi
toolkit label: kappaletta metatiedoilla kuvaileva teos @fi
definition: Liittää kappaleen teokseen, joka on kappaleen metatietoteos. @fi
label: kappaletta metatiedoilla kuvaileva teos @fi
has subproperty: P40164
label: 是被……用元数据描述的单件 @zh-hans
definition: 将一个单件与作为一个单件的一种元数据作品的一种作品关联起来。 @zh-hans
toolkit label: 被……用元数据描述的单件 @zh-hans
toolkit definition: 作为一个单件的一种元数据作品的一种作品 @zh-hans
label: és ítem descrit amb metadades per @ca
definition: Relaciona un ítem amb una obra que és una obra de metadades per a un ítem. @ca
toolkit label: ítem descrit amb metadades per @ca
toolkit definition: Una obra que és una obra de metadades per a un ítem. @ca
definition: Met un item en relation avec une œuvre qui consiste en une œuvre de métadonnées pour un item.
toolkit label: item décrit avec des métadonnées par
toolkit definition: Œuvre qui consiste en une œuvre de métadonnées pour un item.
label: tarafından üstveri ile tanımlanan kopyadır @tr
definition: Bir kopyayı, bir kopya için üstveri eseri olan bir eserle ilişkilendirir. @tr
toolkit label: tarafından üst verilerle açıklanan kopya @tr
toolkit definition: Bir kopya için üstveri çalışması olan bir eser. @tr

est sur une manifestation avec
status: Published
label: is on manifestation with @en
definition: Relates an item to an item that is reproduced on the same manifestation as an item. @en
type: Property
domain: C10003
lexical alias: onManifestationWith.en
has element type: 2
toolkit label: on manifestation with @en
toolkit definition: An item that is reproduced on the same manifestation as an item. @en
sub property of: a pour item en relation avec un item
label: manifestaatiossa toisen kappaleen kanssa @fi
definition: Liittää kappaleen kappaleeseen, joka on jäljenteenä samassa manifestaatiossa kuin toinen kappale. @fi
toolkit label: manifestaatiossa toisen kappaleen kanssa @fi
toolkit definition: Kappale, joka on jäljenteenä samassa manifestaatiossa kuin toinen kappale. @fi
has subproperty: P40163
label: 在和……同一种载体表现上 @zh-hans
definition: 将一个单件与被复制于和一个单件的同一种载体表现上的一个单件关联起来。 @zh-hans
toolkit label: 在和……同一种载体表现上 @zh-hans
toolkit definition: 被复制于和一个单件的同一种载体表现上的一个单件 @zh-hans
label: és en manifestació amb @ca
definition: Relaciona un ítem amb un ítem que es reprodueix a la mateixa manifestació com un ítem. @ca
toolkit label: en manifestació amb @ca
toolkit definition: Ítem que es reprodueix a la mateixa manifestació com un ítem. @ca
definition: Met un item en relation avec un item qui est reproduit sur la même manifestation qu’un item.
toolkit label: sur une manifestation avec
toolkit definition: Item qui est reproduit sur la même manifestation qu’un item.
label: ile aynı gösterimde yer alır @tr
definition: Bir kopyayı, bir kopyayla aynı görünümde yeniden üretilmiş bir kopyayla ilişkilendirir. @tr
toolkit label: ile gösterim üzerine @tr
toolkit definition: Bir kopyayla aynı gösterimde yeniden üretilen bir kopya. @tr