Published
type: Concept

Deprecated
type: Concept

Item properties
licence: deed.en US
contributor: RSC Technical Working Group
creator: RDA Steering Committee
description: Properties that represent the attribute and relationship elements of the RDA Item entity. @en
description: RDA-elementeistä johdetut ominaisuudet RDA:n kappaleen määrittelyjoukossa. @fi
issued: 2014-01-18
modified: 2025-07-07
publisher: ALA Digital Reference
rights: Copyright © 2020 American Library Association, Canadian Federation of Library Associations, and CILIP: Chartered Institute of Library and Information Professionals @en
title: RDA:n kappaleen ominaisuudet @fi
type: http://rdaregistry.info/termList/RDALinkedDataWork/1003
preferred namespace prefix: rdai
type: Ontology
version info: v5.4.6

a pour identifiant d’item
has element type: 3
instruction number: 2.2
toolkit definition: A nomen that is an appellation of item that consists of a code, number, or other string, usually independent of natural language and social naming conventions, used to identify an item. @en
toolkit definition: Benævnelse på eksemplar, som består af en kode, nummer eller anden streng, ofte uafhængig af normalsprog og navngivningskonventioner brugt til at identificere et eksemplar @da
toolkit definition: Bir kopyayı tanımlamak için kullanılan, genellikle doğal dil ve sosyal adlandırma kurallarından bağımsız bir kod, sayı veya başka bir dizeden oluşan bir kopya unvanı olan bir isim. @tr
toolkit definition: Chuỗi ký tự liên quan với bản phục vụ để phân biệt một bản với các bản khác. @vi
toolkit definition: Een nomen dat is een benaming van item die bestaat uit een code, nummer of andere tekenreeks, meestal onafhankelijk van natuurlijke taal of sociale naamgeving, gebruikt om een item te identificeren. @nl
toolkit definition: Egy nomen, egy példány megnevezése, amely egy kód-, szám-, vagy más típusú karakterláncból áll, amely általában független a természetes nyelvektől és társadalmi névkonvencióktól, és egy példány azonosítására használják. @hu
toolkit definition: Eine Bezeichnung für ein Exemplar, die aus einem Code, einer Nummer oder einer anderen Zeichenkette besteht, der/die normalerweise nicht in natürlicher Sprache und unabhängig von den sozialen Benennungskonventionen ist und zur Identifizierung eines Exemplars verwendet wird. @de
toolkit definition: Eksemplari nimetus, mis koosneb eksemplari identifitseerivast koodist, numbrist või muust loomulikust keelest ja üldtuntud nimetamistavadest sõltumatust stringist. @et
toolkit definition: En betegnelse for eksemplar som består av en kode, et nummer eller en annen streng, vanligvis uavhengig av naturlig språk eller sosiale navnekonvensjoner, som er brukt for å identifisere et eksemplar. @no
toolkit definition: Kappaleen nimitys, joka koostuu koodista, numerosta tm. merkkijonosta ja joka yleensä on luonnollisesta kielestä ja kielen sosiaalisista konventioista riippumaton kappaleen tunnistamiskeino. @fi
toolkit definition: Nomen que és una apel·lació d’ítem que consisteix en un codi, un número o qualsevol altra cadena, normalment independent del llenguatge natural i de les convencions socials de denominació, usada per identificar un ítem. @ca
toolkit definition: Nomen qui est une appellation d’item consistant en un code, un nombre ou une autre chaîne, généralement indépendante du langage naturel et des conventions sociales de dénomination, utilisée pour identifier un item.
toolkit definition: Una cadena de caracteres asociada con un ítem que sirve para diferenciar ese ítem de otros ítems @es
toolkit definition: Vienības apzīmējums, kas sastāv no koda, skaitļa vai citas virknes, kas parasti ir neatkarīgs no dabiskas valodas vai sabiedrībā pieņemtām nosaukšanas tradīcijām, ko izmanto, lai identificētu vienību. @lv
toolkit definition: Ένας αλφαριθμητικός χαρακτήρας συνδεδεμένος με ένα αντίτυπο με σκοπό τη διαφοροποίηση ενός αντιτύπου από άλλα αντίτυπα. @el
toolkit definition: تسمية هي اسم مفردة تتكون من رمز، أو رقم، أو سلسلة تمثيلات أخرى، عادة ما تكون مختلفة عن اللغة الطبيعية وعن التسميات المتعارف عليها اجتماعيا، المستخدمة في مفردة. @ar
toolkit definition: 作为一个由代码、数字、或其他字符串构成、通常独立于自然语言和社会命名惯例、用以标识单件的单件称谓的命名 @zh-hans
toolkit label: Identifikator für ein Exemplar @de
toolkit label: azonosító példány számára: @hu
toolkit label: chỉ số nhận dạng của bản @vi
toolkit label: eksemplari identifikaator @et
toolkit label: identifiant d’item
toolkit label: identificador del ítem @es
toolkit label: identificador d’ítem @ca
toolkit label: identificatie voor item @nl
toolkit label: identifier for item @en
toolkit label: identifikator for eksemplar @da
toolkit label: identifikator för exemplaret @sv
toolkit label: kappaleen tunniste @fi
toolkit label: kopyanın tanımlayıcısı ile ilişkilidir @tr
toolkit label: vienības identifikators @lv
toolkit label: αναγνωριστικό για αντίτυπο @el
toolkit label: معرِّف لمفردة @ar
toolkit label: 单件的标识符 @zh-hans
has subproperty: P40001
lexical alias: identifierForItem.en
status: Published
type: Property
domain: C10003
label: azonosító példányhoz a következő: @hu
label: có chỉ số nhận dạng của bản @vi
label: eksemplari identifikaator @et
label: har identifikator for eksemplar @da
label: har identifikator för exemplaret @sv
label: has identifier for item @en
label: hat Identifikator für ein Exemplar @de
label: heeft identificatie voor item @nl
label: kappaleen tunniste @fi
label: kopyanın tanımlayıcısı ile ilişkilidir @tr
label: té com a identificador d’ítem @ca
label: vienības identifikators @lv
label: έχει αναγνωριστικό για αντίτυπο @el
label: له معرِّف لمفردة @ar
label: 有单件的标识符 @zh-hans
sub property of: a pour appellation d’item
sub property of: P00018
definition: Bir kopyayı, bir kopyayı tanımlamak için kullanılan, genellikle doğal dil ve sosyal adlandırma kurallarından bağımsız bir kod, sayı veya başka bir dizgeden oluşan bir kopya unvanı olan bir isimle ilişkilendirir. @tr
definition: Hozzákapcsol egy példányt egy nomenhez, egy példány megnevezéséhez, amely egy kód-, szám-, vagy más típusú karakterláncból áll, amely általában független a természetes nyelvektől és társadalmi névkonvencióktól, és egy példány azonosítására használják. @hu
definition: Liittää kappaleen nomeniin, joka on kappeleen nimitys, joka koostuu koodista, numerosta tm. merkkijonosta ja joka yleensä on luonnollisesta kielestä ja kielen sosiaalisista konventioista riippumaton kappaleen tunnistamiskeino. @fi
definition: Liên kết bản với chuỗi ký tự liên quan với bản phục vụ để phân biệt một bản với các bản khác. @vi
definition: Met un item en relation avec un nomen qui est une appellation d’item consistant en un code, un nombre ou une autre chaîne, généralement indépendante du langage naturel et des conventions sociales de dénomination, utilisée pour identifier un item.
definition: Relaciona un ítem amb un nomen que és una apel·lació d’ítem que consisteix en un codi, un número o qualsevol altra cadena, normalment independent del llenguatge natural i de les convencions socials de denominació, usada per identificar un ítem. @ca
definition: Relateert een item aan een nomen dat is een benaming van item die bestaat uit een code, nummer of andere tekenreeks, meestal onafhankelijk van natuurlijke taal of sociale naamgeving, gebruikt om een item te identificeren. @nl
definition: Relaterer et eksemplar til en benævnelse på eksemplar, som består af en kode, nummer eller anden streng, ofte uafhængig af normalsprog og navngivningskonventioner brugt til at identificere et eksemplar. @da
definition: Relaterer et eksemplar til en betegnelse for eksemplar som består av en kode, et nummer eller en annen streng, vanligvis uavhengig av naturlig språk eller sosiale navnekonvensjoner, som er brukt for å identifisere et eksemplar. @no
definition: Relates an item to a nomen that is an appellation of item that consists of a code, number, or other string, usually independent of natural language and social naming conventions, used to identify an item. @en
definition: Sasaista vienību ar nomenu, kas ir vienības apzīmējums, kas sastāv no koda, skaitļa vai citas virknes, kas parasti ir neatkarīgs no dabiskas valodas vai sabiedrībā pieņemtām nosaukšanas tradīcijām, ko izmanto, lai identificētu vienību. @lv
definition: Seostab eksemplari eksemplari nimetusega, mis koosneb eksemplari identifitseerivast koodist, numbrist või muust loomulikust keelest ja üldtuntud nimetamistavadest sõltumatust stringist. @et
definition: Setzt ein Exemplar in Beziehung zu einer Bezeichnung für ein Exemplar, die aus einem Code, einer Nummer oder einer anderen Zeichenkette besteht, der/die normalerweise nicht in natürlicher Sprache und unabhängig von den sozialen Benennungskonventionen ist und zur Identifizierung eines Exemplars verwendet wird. @de
definition: Συνδέει ένα αντίτυπο με έναν αλφαριθμητικό χαρακτήρα συνδεδεμένο με ένα αντίτυπο με σκοπό τη διαφοροποίηση ενός αντιτύπου από άλλα αντίτυπα. @el
definition: يربط مفردة بتسمية هي اسم وكيل يتكون من رمز، أو رقم، أو سلسلة تمثيلات أخرى، عادة ما تكون مختلفة عن اللغة الطبيعية وعن التسميات المتعارف عليها اجتماعيا، المستخدمة في تعريف مفردة. @ar
definition: 将一个单件与作为一个由代码、数字、或其他字符串构成、通常独立于自然语言和社会命名惯例、用以标识单件的单件称谓的命名关联起来。 @zh-hans

has item-specific carrier characteristic of early printed resource (Deprecated)
lexical alias: itemSpecificCarrierCharacteristicOfEarlyPrintedResource.en
status: Deprecated
type: Property
domain: C10003
definition: Relates an item to a characteristic that applies to the carrier or carriers of the specific early printed item being described and is assumed not to apply to other items exemplifying the same manifestation. includes rubrication, illumination, and other hand colouring, manuscript additions, and binding. (Deprecated) @en

a pour modification d’un item
has element type: 6
instruction number: 3.22
toolkit definition: A modification that is specific to an item and is assumed not to apply to other items exemplifying the same manifestation. @en
toolkit definition: Bir kopyaya özgü olan ve aynı gösterimi örnekleyen diğer kopyalar için geçerli olmadığı varsayılan bir değişiklik. @tr
toolkit definition: Een aanpassing die specifiek voor een item is en waarvan aangenomen niet van toepassing te zijn op andere items die dezelfde manifestatie voorstellen. @nl
toolkit definition: Egy példányra jellemző módosítás, amely feltételezhetően nem vonatkozik más, ugyanazt a megjelenési formát példázó példányokra. @hu
toolkit definition: Eine Variante, die spezifisch für ein Exemplar ist und von der angenommen wird, dass sie nicht auf andere Exemplare zutrifft, die dieselbe Manifestation verkörpern. @de
toolkit definition: Eksemplarile omane muudatus, mis eeldatavasti ei ole omane teistele sama kehastust esindavatele eksemplaridele. @et
toolkit definition: En endring som er spesifikk for et eksemplar og som ikke antas å gjelde for andre eksemplarer som eksemplifiserer den samme manifestasjonen. @no
toolkit definition: Ghi chú cung cấp thông tin phụ trợ về đặc trưng vật mang tin đối với bản cụ thể đang được mô tả và được thừa nhận không áp dụng đối với các bản khác sao chép từ cùng biểu thị. @vi
toolkit definition: Kappaleen muunnos, jonka ei oleteta sisältyvän muihin samaa manifestaatiota edustaviin kappaleisin. @fi
toolkit definition: Modificació que és específica d’un ítem i se suposa que no s’aplica a altres ítems que exemplifiquen la mateixa manifestació. @ca
toolkit definition: Modification qui est particulière à un item et qui est censée ne pas concerner les autres items exemplifiant la même manifestation.
toolkit definition: Modificering, som er specifik for et eksemplar, og som antages ikke at gælde for andre eksemplarer, som eksemplificerer den samme manifestation. @da
toolkit definition: Modifikācija, kas raksturīga vienībai un tiek pieņemts, ka tādas nav tās pašas manifestācijas citām vienībām. @lv
toolkit definition: Una nota que proporciona información sobre las características del soporte que son específicas al ítem descrito y se asume que no aplican a otros ítems que ejemplifican la misma manifestación. @es
toolkit definition: Μια σημείωση που παρέχει πρόσθετες πληροφορίες σχετικά με τα χαρακτηριστικά του φορέα αποθήκευσης, τα οποία αναφέρονται σε ένα συγκεκριμένο περιγραφόμενο αντίτυπο και θεωρούνται ότι δεν βρίσκουν εφαρμογή σε άλλα αντίτυπα τα οποία υλοποιούν την ίδια εκδήλωση. @el
toolkit definition: تعديل مخصص لمفردة، ويُفترض أنه لا ينطبق على المفردات الأخرى التي تمثل التجسيدة نفسها. @ar
toolkit definition: 作为一个单件特有并被认为不适用于例证同一载体表现之其他单件的一个修改 @zh-hans
toolkit label: Kopyanın değiştirilmesi @tr
toolkit label: Variante eines Exemplars @de
toolkit label: aanpassing voor item @nl
toolkit label: anmärkning om exemplarspecifika bäraregenskaper @sv
toolkit label: eksemplari erijoon @et
toolkit label: endring for eksemplar @no
toolkit label: ghi chú đặc trưng vật mang bản cụ thể @vi
toolkit label: kappaleen muunnos @fi
toolkit label: modificació d’un ítem @ca
toolkit label: modification d’un item
toolkit label: modification of item @en
toolkit label: modificering af eksemplar @da
toolkit label: nota sobre la característica del soporte de ítem específico @es
toolkit label: példány módosítása: @hu
toolkit label: vienības modificējums @lv
toolkit label: σημείωση σε συγκεκριμένο αντίτυπο των χαρακτηριστικών του φορέα αποθήκευσης @el
toolkit label: تعديل لمفردة @ar
toolkit label: 单件的修改 @zh-hans
has subproperty: P40003
lexical alias: modificationOfItem.en
status: Published
type: Property
domain: C10003
label: có ghi chú đặc trưng vật mang bản cụ thể @vi
label: eksemplari erijoon @et
label: har anmärkning om exemplarspecifika bäraregenskaper @sv
label: har endring for eksemplar @no
label: har modificering af eksemplar @da
label: has modification of item @en
label: hat Variante eines Exemplars @de
label: heeft aanpassing voor item @nl
label: kappaleen muunnos @fi
label: kopyanın düzenlenmesi ile ilişkilidir @tr
label: példány módosítása a következő: @hu
label: té com a modificació d’un ítem @ca
label: vienības modificējums @lv
label: έχει σημείωση σε συγκεκριμένο αντίτυπο των χαρακτηριστικών του φορέα αποθήκευσης @el
label: له تعديل لمفردة @ar
label: 有单件的修改 @zh-hans
sub property of: a pour note sur un item
alternative label: Anmerkung zu einer exemplarspezifischen Datenträgereigenschaft @de
alternative label: huomautus kappalekohtaisen tallenteen ominaisuudesta @fi
alternative label: megjegyzés példányspecifikus hordozójellemzőkről: @hu
alternative label: märkus eksemplari spetsiifilise kandjatunnuse kohta @et
alternative label: nota sobre característica de soporte específica de ítem @es
alternative label: nota sobre característiques de suport físic específiques d’un ítem concret @ca
alternative label: note om eksemplarspecifikke bærerkarakteristika @da
alternative label: note om eksemplarspesifikke kjennetegn @no
alternative label: note on item-specific carrier characteristic @en
alternative label: note sur les caractéristiques du support matériel d’un item particulier
alternative label: ürünün taşıyıcı özelli̇kleri̇ne i̇li̇şki̇n not @tr
alternative label: تبصرة عن خصائص حامل مفردة محدد @ar
alternative label: 关于单件特有载体特征的附注 @zh-hans
definition: Bir kopyayı, bir kopyaya özgü olan ve aynı gösterimi örnekleyen diğer kopyalar için geçerli olmadığı varsayılan bir değişiklikle ilişkilendirir. @tr
definition: Hozzákapcsol egy példányt egy példányra jellemző módosításhoz, amely feltételezhetően nem vonatkozik más, ugyanazt a megjelenési formát példázó példányokra. @hu
definition: Liittää kappaleen sille ominaiseen muunnokseen, jonka ei oleteta sisältyvän muihin samaa manifestaatiota edustaviin kappaleisin. @fi
definition: Liên kết bản với ghi chú cung cấp thông tin phụ trợ về đặc trưng vật mang tin đối với bản cụ thể đang được mô tả và được thừa nhận không áp dụng đối với các bản khác sao chép từ cùng biểu thị. @vi
definition: Met un item en relation avec une modification qui est particulière à un item et qui est censée ne pas concerner les autres items exemplifiant la même manifestation.
definition: Relaciona un ítem amb una modificació que és específica d’un ítem i se suposa que no s’aplica a altres ítems que exemplifiquen la mateixa manifestació. @ca
definition: Relateert een item aan een aanpassing die specifiek voor een item is en waarvan aangenomen niet van toepassing te zijn op andere items die dezelfde manifestatie voorstellen. @nl

a pour agent collectionneur
has element type: 2
instruction number: 18.5
toolkit definition: Agent conservateur qui rassemble des items de diverses sources qui sont arrangés, décrits et catalogués comme une collection.
toolkit definition: Agent que és un conservador que aplega ítems de diverses fonts que s’arrangen, es descriuen o es cataloguen com una col·lecció. @ca
toolkit definition: Agent, som er kurator, som indsamler eksemplarer fra forskellige kilder, som bliver arrangeret, beskrevet eller katalogiseret som en samling. @da
toolkit definition: Agente curatore, che riunisce da fonti diverse item organizzati, descritti o catalogati come una raccolta. @it
toolkit definition: An agent who is a curator who brings together items from various sources that are arranged, described, or catalogued as a collection. (Deprecated) @en
toolkit definition: Aģents, kas apkopo vienības no dažādiem avotiem, kas ir sakārtotas, aprakstītas vai kataloģizētas kā kolekcija. @lv
toolkit definition: Een actor die een curator is die items samenbrengt uit diverse bronnen die gerangschikt, beschreven of gecatalogiseerd zijn als een collectie. @nl
toolkit definition: Egy kurátor ágens, amely különböző forrásokból származó, gyűjteményként rendezett, leírt és katalogizált példányokat fog össze. @hu
toolkit definition: Eine Kuratorin/Ein Kurator (Akteur), die/der Materialien aus unterschiedlichen Quellen zusammenträgt, die dann als Sammlung geordnet, beschrieben oder katalogisiert werden. @de
toolkit definition: En agent som er en kurator som setter sammen eksemplarer fra ulike kilder og som er arrangert, beskrevet eller katalogisert som en samling. @no
toolkit definition: Kuraattori, joka kokoaa eri lähteistä järjestettävät, kuvailtavat ja luetteloitavat kappaleet kokoelmaksi. @fi
toolkit definition: Người thu thập gop góp các bản từ các nguồn khác nhau sau đó sắp xếp, mô tả, và lập mục lục như là bộ sưu tập. @vi
toolkit definition: Tegija, kes kuraatorina kogub eri allikatest kokku eksemplarid, mis korrastatakse, kirjeldatakse või kataloogitakse koguna. @et
toolkit definition: Un conservador que reúne ítems de varias fuentes que luego se arreglan, describen y catalogan como una colección. @es
toolkit definition: Ένας έφορος που συγκεντρώνει αντίτυπα από διάφορες πηγές, τα οποία κατόπιν οργανώνονται, περιγράφονται και καταλογογραφούνται ως συλλογή. @el
toolkit definition: وكيل هو أمين متحف يجمع مفردات معاً من مصادر مختلفة رتُبت، أو وُصفت، أو فُهرست كمجموعة. @ar
toolkit label: Sammlerin/Sammler (Akteur) @de
toolkit label: agent collectionneur
toolkit label: agent col·leccionista @ca
toolkit label: agent, som er samler @da
toolkit label: coleccionista @es
toolkit label: collector agent (Deprecated) @en
toolkit label: collezionista agente @it
toolkit label: kogu moodustaja (tegija) @et
toolkit label: kokoelman muodostaja (toimija) @fi
toolkit label: kolekcionārs (aģents) @lv
toolkit label: kollektor ágens: @hu
toolkit label: người thu thập @vi
toolkit label: samler (agent) @no
toolkit label: verzamelaar-actor @nl
toolkit label: συλλέκτης @el
toolkit label: وكيل جامع @ar
has subproperty: a pour personne collectionneuse
has subproperty: a pour agent collectif collectionneur
has subproperty: P40004
lexical alias: collectorAgent.en
status: Deprecated
type: Property
domain: C10003
label: Ha come collezionista agente @it
label: có người thu thập @vi
label: har agent, som er samler @da
label: har samler (agent) @no
label: has collector agent (Deprecated) @en
label: hat Sammlerin/Sammler (Akteur) @de
label: heeft verzamelaar-actor @nl
label: kogu moodustaja (tegija) @et
label: kokoelman muodostaja (toimija) @fi
label: kolekcionārs (aģents) @lv
label: kollektor ágense a következő: @hu
label: té com a agent col·leccionista @ca
label: έχει συλλέκτη @el
label: له وكيل جامع @ar
sub property of: a pour agent conservateur
alternative label: Sammler @de
alternative label: collectionneur
alternative label: collector @en
alternative label: collezionista @it
alternative label: col·leccionista @ca
alternative label: kogu moodustaja @et
alternative label: koguja @et
alternative label: kokoelman muodostaja @fi
alternative label: kollektor: @hu
alternative label: samler @da
alternative label: جامع @ar
definition: Correla un item all'agente curatore che raccoglie item da varie fonti, che sono organizzati, descritti o catalogati come una collezione. @it
definition: Hozzákapcsol egy példányt egy kurátor ágenshez, amely különböző forrásokból származó, gyűjteményként rendezett, leírt és katalogizált példányokat fog össze. @hu
definition: Liittää kappaleen kuraattoriin, joka kokoaa eri lähteistä järjestettävät, kuvailtavat ja luetteloitavat kappaleet kokoelmaksi. @fi
definition: Liên kết bản với người thu thập gop góp các bản từ các nguồn khác nhau sau đó sắp xếp, mô tả, và lập mục lục như là bộ sưu tập. @vi
definition: Met un item en relation avec un agent conservateur qui rassemble des items de diverses sources qui sont arrangés, décrits et catalogués comme une collection.
definition: Relaciona un ítem amb un agent que és un conservador que aplega ítems de diverses fonts que s’arrangen, es descriuen o es cataloguen com una col·lecció. @ca
definition: Relateert een item aan een actor die een curator is die items samenbrengt uit diverse bronnen die gerangschikt, beschreven of gecatalogiseerd zijn als een collectie. @nl
definition: Relaterer et eksemplar til en agent som er en kurator som setter sammen eksemplarer fra ulike kilder og som er arrangert, beskrevet eller katalogisert som en samling. @no
definition: Relaterer et eksemplar til en agent, som er kurator, som indsamler eksemplarer fra forskellige kilder, som bliver arrangeret, beskrevet eller katalogiseret som en samling. @da
definition: Relates an item to an agent who is a curator who brings together items from various sources that are arranged, described, or catalogued as a collection. @en
definition: Sasaista vienību ar aģentu, kas apkopo vienības no dažādiem avotiem, kas ir sakārtotas, aprakstītas vai kataloģizētas kā kolekcija. @lv
definition: Seostab eksemplari tegijaga, kes kuraatorina kogub eri allikatest kokku eksemplarid, mis korrastatakse, kirjeldatakse või kataloogitakse koguna. @et

a pour agent catalogueur d’une collection de ressources
has element type: 2
instruction number: 18.5
toolkit definition: Agent conservateur qui dresse une liste ou un inventaire des items faisant partie d’un agrégat par regroupement.
toolkit definition: Agent que és un conservador que llista o inventaria els ítems en una col·lecció agregada. @ca
toolkit definition: Agent, som er kurator, som listefører eller opgører en inventarliste over eksemplarer i et samlingsaggregat. @da
toolkit definition: An agent who is a curator who lists or inventories items in a collection aggregate. (Deprecated) @en
toolkit definition: Aģents, kas kolekciju apkopojumā uzskaita vai inventarizē vienības. @lv
toolkit definition: Een actor die een curator is die een lijst of inventaris aanlegt van items in een collectie-aggregaat. @nl
toolkit definition: Egy kurátor ágens, amely példányokat sorol fel vagy leltároz egy gyűjteményi aggregátumban. @hu
toolkit definition: Eine Kuratorin/Ein Kurator (Akteur), die/der die Exemplare eines Sammlungsaggregats verzeichnet oder inventarisiert. @de
toolkit definition: En agent som er en kurator som lager lister eller oversikter over eksemplarene i en aggregert samling. @no
toolkit definition: Kuraattori, joka luetteloi tai inventoi kokoelma-aggregaatin kappaleet. @fi
toolkit definition: Người giữ bộ sưu tập, người lập danh mục hoặc bản kê trong một tác phẩm gộp chung như là bộ sưu tập của các bản hoặc tác phẩm. @vi
toolkit definition: Tegija, kes kuraatorina loetleb või inventeerib liitumit moodustava kogu eksemplarid. @et
toolkit definition: Un conservador que lista o hace inventarios de ítems en una obra agregada tal como una colección de ítems u obras. @es
toolkit definition: Ένας έφορος που απαριθμεί ή καταγράφει τα αντίτυπα σε ένα συγκεντρωτικό έργο, όπως μια συλλογή αντιτύπων ή έργων. @el
toolkit definition: وكيل هو أمين متحف يقوم بتسجيل قوائم مفردات أو جردها لمجموعة مجمعة. @ar
toolkit label: Registrarin/Registrar (Akteur) @de
toolkit label: agent catalogueur d’une collection de ressources
toolkit label: agent conservador de col·leccions de recursos @ca
toolkit label: agent, som er samlingsregistrator @da
toolkit label: collectieregistrator-actor @nl
toolkit label: collection registrar agent (Deprecated) @en
toolkit label: conservador de colección @es
toolkit label: gyűjtemény-nyilvántartó ágens: @hu
toolkit label: kogu registreerija (tegija) @et
toolkit label: kokoelman luetteloija (toimija) @fi
toolkit label: kolekcijas reģistrētājs (aģents) @lv
toolkit label: người giữ bộ sưu tập @vi
toolkit label: samlingsregistrator (agent) @no
toolkit label: υπεύθυνος γραμματείας της συλλογής @el
toolkit label: وكيل مُسجل جامع @ar
has subproperty: a pour personne catalogueuse d’une collection de ressources
has subproperty: a pour agent collectif catalogueur d’une collection de ressources
has subproperty: P40005
lexical alias: collectionRegistrarAgent.en
status: Deprecated
type: Property
domain: C10003
label: có người giữ bộ sưu tập @vi
label: gyűjtemény-nyilvántartó ágense a következő: @hu
label: har agent, som er samlingsregistrator @da
label: har samlingsregistrator (agent) @no
label: has collection registrar agent (Deprecated) @en
label: hat Registrarin/Registrar (Akteur) @de
label: heeft collectieregistrator-actor @nl
label: kogu registreerija (tegija) @et
label: kokoelman luetteloija (toimija) @fi
label: kolekcijas reģistrētājs (aģents) @lv
label: té com a agent conservador de col·leccions de recursos @ca
label: έχει υπεύθυνο γραμματείας της συλλογής @el
label: له وكيل مسجل المجموعات @ar
sub property of: a pour agent conservateur
alternative label: Registrar @de
alternative label: agent conservateur d’une collection de ressources
alternative label: collection registrar @en
alternative label: conservador de col·leccions de recursos @ca
alternative label: gyűjtemény-nyilvántartó: @hu
alternative label: kogu registreerija @et
alternative label: kokoelman luetteloija @fi
alternative label: samlingsregistrator @da
alternative label: مُسجل مجموعة @ar
definition: Hozzákapcsol egy példányt egy kurátor ágenshez, amely példányokat sorol fel vagy leltároz egy gyűjteményi aggregátumban. @hu
definition: Liittää kappaleen kuraattoriin, joka luetteloi tai inventoi kokoelma-aggregaatin kappaleet. @fi
definition: Liên kết bản với người giữ bộ sưu tập, người lập danh mục hoặc bản kê trong một tác phẩm gộp chung như là bộ sưu tập của các bản hoặc tác phẩm. @vi
definition: Met un item en relation avec un agent conservateur qui dresse une liste ou un inventaire des items faisant partie d’un agrégat par regroupement.
definition: Relaciona un ítem amb un agent que és un conservador que llista o inventaria els ítems en una col·lecció agregada. @ca
definition: Relateert een item aan een actor die een curator is die een lijst of inventaris aanlegt van items in een collectie-aggregaat. @nl
definition: Relaterer et eksemplar til en agent som er en kurator som lager lister eller oversikter over eksemplarene i en aggregert samling. @no
definition: Relaterer et eksemplar til en agent, som er kurator, som listefører eller opgører en inventarliste over eksemplarer i et samlingsaggregat. @da
definition: Relates an item to an agent who is a curator who lists or inventories items in a collection aggregate. (Deprecated) @en
definition: Sasaista vienību ar aģentu, kas kolekciju apkopojumā uzskaita vai inventarizē vienības. @lv
definition: Seostab eksemplari tegijaga, kes kuraatorina loetleb või inventeerib liitumit moodustava kogu eksemplarid. @et
definition: Setzt ein Exemplar in Beziehung zu einer Kuratorin/einem Kurator (Akteur), die/der die Exemplare eines Sammlungsaggregats verzeichnet oder inventarisiert. @de
definition: Συνδέει ένα αντίτυπο με έναν έφορο ο οποίος απαριθμεί ή καταγράφει τα αντίτυπα σε ένα συγκεντρωτικό έργο, όπως μια συλλογή αντιτύπων ή έργων. @el
definition: يربط مفردة بوكيل هو أمين متحف يقوم بتسجيل قوائم مفردات أو جردها لمجموعة مجمعة. @ar

a pour agent déposant
has element type: 2
instruction number: 18.5
toolkit definition: Agent propriétaire actuel d’un item qui dépose l’item sous la garde d’un autre agent sans en transférer la propriété.
toolkit definition: Agent que és un propietari actual d’un ítem que el diposita sota la custòdia d’un altre agent sense transferir-li la propietat. @ca
toolkit definition: Agent, som er nuværende ejer af et eksemplar, som deponerer eksemplaret til forvaring hos en anden agent, men uden at overgive ejerskab. @da
toolkit definition: An agent who is a current owner of an item who deposits the item into the custody of another agent without transferring ownership. @en
toolkit definition: Aģents, pašreizējais vienības īpašnieks, kurš deponējis vienību cita aģenta uzglabāšanā, vienlaikus saglabājot īpašumtiesības. @lv
toolkit definition: Bir öğenin mevcut sahibi olan ve mülkiyet devri olmaksızın öğeyi başka bir temsilcinin emanetine bırakan bir temsilci. @tr
toolkit definition: Een actor die een huidige eigenaar is van een item die het item onderbrengt bij een andere actor zonder eigenaarschap over te dragen. @nl
toolkit definition: Egy ágens, amely egy példány jelenlegi tulajdonosa, és amely egy másik ágens megőrzésébe letétként helyezi el a példányt anélkül, hogy a tulajdonjogot átruházná. @hu
toolkit definition: Eine gegenwärtig Eigentümerin/Ein gegenwärtiger Eigentümer (Akteur) eines Exemplars, die/der das Exemplar in die Obhut eines anderen Akteurs gibt, ohne das Eigentumsrecht zu übertragen. @de
toolkit definition: En agent som er en nåværende eier av et eksemplar som deponerer eksemplaret til forvaring til en annen agent uten at eierskapet blir overført. @no
toolkit definition: Kappaleen nykyinen omistaja, joka tallettaa kappaleen toisen toimijan huostaan omistajuudesta luopumatta. @fi
toolkit definition: Người chủ hiện tại của bản, người đã nộp bản đó cho sự chăm nom của tác nhân khác trong khi vẫn giữa quyền sở hữu. @vi
toolkit definition: Proprietario attuale agente di un item che deposita l'item sotto la custodia di un altro agente senza trasferirne la proprietà. @it
toolkit definition: Tegija, kes praeguse omanikuna deponeerib eksemplari teise tegija vastutavale hoiule ilma omandiõiguse üleminekuta. @et
toolkit definition: Un propietario actual de un ítem que lo entrega en custodia a otra persona, familia o entidad corporativa, sin perder la propiedad del ítem. @es
toolkit definition: Ένας τρέχων ιδιοκτήτης ενός αντιτύπου, ο οποίος κατέθεσε το αντίτυπο υπό τη διαχειριστική επιτροπεία κάποιου άλλου φορέα, ενώ διατηρεί ακόμη την ιδιοκτησία. @el
toolkit definition: وكيل هو المالك الحالي لمفردة، يودعها تحت وصاية وكيل آخر دون نقل ملكيتها. @ar
toolkit definition: 作为单件的当前拥有者将单件委托给另一个行为者保管但未转让所有权的一个行为者 @zh-hans
toolkit label: Leihgeberin/Leihgeber (Akteur) @de
toolkit label: agent dipositador @ca
toolkit label: agent déposant
toolkit label: agent, som er udlåner @da
toolkit label: bruikleen-actor @nl
toolkit label: deponeerija (tegija) @et
toolkit label: deponent (agent) @no
toolkit label: deponents (aģents) @lv
toolkit label: depositante @es
toolkit label: depositante agente @it
toolkit label: depositor agent @en
toolkit label: letétbe helyező ágens: @hu
toolkit label: mevduatçı temsilci @tr
toolkit label: người gửi đồ vật @vi
toolkit label: tallettaja (toimija) @fi
toolkit label: καταθέτης @el
toolkit label: وكيل مودع @ar
toolkit label: 托存者行为者 @zh-hans
has subproperty: a pour personne déposante
has subproperty: a pour agent collectif déposant
has subproperty: P40006
lexical alias: depositorAgent.en
status: Published
type: Property
domain: C10003
label: có người gửi đồ vật @vi
label: deponeerija (tegija) @et
label: deponents (aģents) @lv
label: ha come depositante agente @it
label: har agent, som er udlåner @da
label: har deponent (agent) @no
label: has depositor agent @en
label: hat Leihgeberin/Leihgeber (Akteur) @de
label: heeft bruikleen-actor @nl
label: letétbe helyező ágense a következő: @hu
label: mevduatçı temsilcisi ile ilişkilidir @tr
label: tallettaja (toimija) @fi
label: té com a agent dipositador @ca
label: έχει καταθέτη @el
label: له وكيل مودِع @ar
label: 有托存者行为者 @zh-hans
sub property of: a pour agent propriétaire actuel
alternative label: Leihgeber @de
alternative label: deponeerija @et
alternative label: deponent @no
alternative label: depositante @es
alternative label: depositor @en
alternative label: dipositador @ca
alternative label: déposant
alternative label: letétbe helyező: @hu
alternative label: mevduatçı @tr
alternative label: tallettaja @fi
alternative label: udlåner @da
alternative label: مودع @ar
alternative label: 托存者 @zh-hans
definition: Bir kopyayı, bir kopyanın mevcut sahibi olan ve mülkiyeti devretmeden kopyayı başka bir temsilcinin gözetimine bırakan bir temsilciyle ilişkilendirir. @tr
definition: Correla un item al proprietario attuale agente di un item che deposita l'item sotto la custodia di un altro agente senza trasferirne la proprietà. @it
definition: Hozzákapcsol egy példányt egy ágenshez, amely egy példány jelenlegi tulajdonosa, és amely egy másik ágens megőrzésébe letétként helyezi el a példányt anélkül, hogy a tulajdonjogot átruházná. @hu
definition: Liittää kappaleen sen nykyiseen omistajaan, joka tallettaa kappaleen toisen toimijan huostaan omistajuudesta luopumatta. @fi

a pour agent donateur
has element type: 2
instruction number: 18.5
toolkit definition: Agent que és un propietari anterior d’un ítem que dona l’ítem a un altre propietari. @ca
toolkit definition: Agent, som er tidligere ejer af et eksemplar, som har doneret dette eksemplar til en anden ejer. @da
toolkit definition: An agent who is a former owner of an item who donates the item to another owner. @en
toolkit definition: Ancien agent propriétaire d’un item qui fait don de cet item à un autre propriétaire.
toolkit definition: Aģents, agrākais vienības īpašnieks, kurš ziedojis šo vienību citam īpašniekam. @lv
toolkit definition: Bir öğenin bir önceki sahibi olan ve öğeyi başka bir sahibine bağışlayan bir temsilci. @tr
toolkit definition: Een actor die een voormalige eigenaar is van een item die het item schenkt aan een andere eigenaar. @nl
toolkit definition: Egy ágens, egy példány korábbi tulajdonosa, amely a példányt egy másik tulajdonosnak adományozta. @hu
toolkit definition: Eine frühere Eigentümerin/Ein früherer Eigentümer (Akteur) eines Exemplars, die/der das Exemplar einer anderen Eigentümerin/einem anderen Eigentümer überlässt. @de
toolkit definition: En agent som er en tidligere eier av et eksemplar som har gitt eksemplaret til en annen eier. @no
toolkit definition: Kappaleen aiempi omistaja, joka lahjoittaa kappaleen toiselle omistajalle. @fi
toolkit definition: Người chủ trước đây của bản, người đã tặng bản đó cho người chủ khác. @vi
toolkit definition: Tegija, kes eksemplari endise omanikuna on kinkinud selle teisele omanikule. @et
toolkit definition: Un propietario anterior de un ítem que lo donó a otro propietario. @es
toolkit definition: Ένας προηγούμενος ιδιοκτήτης ενός αντιτύπου, ο οποίος δώρισε αυτό το αντίτυπο σε κάποιον άλλον ιδιοκτήτη. @el
toolkit definition: وكيل هو المالك السابق لمفردة، تبرع بها لمالك آخر. @ar
toolkit definition: 作为先前拥有者将单件捐赠给另一个拥有者的一个行为者 @zh-hans
toolkit label: Stifterin/Stifter (Akteur) @de
toolkit label: adományozó ágens: @hu
toolkit label: agent donant @ca
toolkit label: agent donateur
toolkit label: agent, som er donor @da
toolkit label: annetaja (tegija) @et
toolkit label: bağışçı temsilci @tr
toolkit label: donante @es
toolkit label: donor agent @en
toolkit label: giver (agent) @no
toolkit label: lahjoittaja (toimija) @fi
toolkit label: người tặng @vi
toolkit label: schenker-actor @nl
toolkit label: ziedotājs (aģents) @lv
toolkit label: δωρητής @el
toolkit label: وكيل متبرع @ar
toolkit label: 捐赠者行为者 @zh-hans
has subproperty: a pour personne donatrice
has subproperty: a pour agent collectif donateur
has subproperty: P40007
lexical alias: donorAgent.en
status: Published
type: Property
domain: C10003
label: adományozó ágense a következő: @hu
label: annetaja (tegija) @et
label: bağışçı temsilcisi ile ilişkilidir @tr
label: có người tặng @vi
label: har agent, som er donor @da
label: har giver (agent) @no
label: has donor agent @en
label: hat Stifterin/Stifter (Akteur) @de
label: heeft schenker-actor @nl
label: lahjoittaja (toimija) @fi
label: té com a agent donant @ca
label: ziedotājs (aģents) @lv
label: έχει δωρητή @el
label: له وكيل متبرع @ar
label: 有捐赠者行为者 @zh-hans
sub property of: a pour ancien agent propriétaire
alternative label: Stifter @de
alternative label: adományozó: @hu
alternative label: annetaja @et
alternative label: bağışçı @tr
alternative label: donador @es
alternative label: donant @ca
alternative label: donateur
alternative label: donor @da
alternative label: giver @no
alternative label: lahjoittaja @fi
alternative label: متبرع @ar
alternative label: 捐赠者 @zh-hans
definition: Bir kopyayı, kopyanın bir önceki sahibi olan ve kopyayı başka bir sahibine bağışlayan bir temsilciyle ilişkilendirir. @tr
definition: Hozzákapcsol egy példányt egy ágenshez, egy példány korábbi tulajdonosához, amely a példányt egy másik tulajdonosnak adományozta. @hu
definition: Liittää kappaleen sen aiempaan omistajaan, joka lahjoittaa sen toiselle omistajalle. @fi
definition: Liên kết bản với người chủ trước đây của bản, người đã tặng bản đó cho người chủ khác. @vi
definition: Met un item en relation avec un ancien agent propriétaire d’un item qui fait don de cet item à un autre propriétaire.
definition: Relaciona un ítem amb un agent que és un propietari anterior d’un ítem que dona l’ítem a un altre propietari. @ca
definition: Relateert een item aan een actor die een voormalige eigenaar is van een item die het item schenkt aan een andere eigenaar. @nl
definition: Relaterer et eksemplar til en agent som er en tidligere eier av et eksemplar som har gitt eksemplaret til en annen eier. @no

a pour agent vendeur
has element type: 2
instruction number: 18.5
toolkit definition: Agent que és un propietari anterior d’un ítem que ven l’ítem a un altre propietari. @ca
toolkit definition: Agent, som er tidligere ejer af et eksemplar, som har solgt dette eksemplar til en anden ejer. @da
toolkit definition: An agent who is a former owner of an item who sells the item to another owner. @en
toolkit definition: Ancien agent propriétaire d’un item qui vend cet item à un autre propriétaire.
toolkit definition: Aģents - vienības agrākais īpašnieks, kurš pārdod šo vienību citam īpašniekam. @lv
toolkit definition: Bir öğenin bir önceki sahibi olan ve öğeyi başka bir sahibine satan bir temsilci. @tr
toolkit definition: Een actor die een voormalige eigenaar is van een item die het item verkoopt aan een andere eigenaar. @nl
toolkit definition: Egy ágens, amely egy példány korábbi tulajdonosa, és amely a példányt egy másik tulajdonosnak adja el. @hu
toolkit definition: Eine frühere Eigentümerin/Ein früherer Eigentümer (Akteur) eines Exemplars, die/der das Exemplar an eine andere Eigentümerin/einen anderen Eigentümer verkauft. @de
toolkit definition: En agent som er en tidligere eier av et eksemplar, som har solgt eksemplaret til en annen eier. @no
toolkit definition: Kappaleen aiempi omistaja, joka myy kappaleen toiselle omistajalle. @fi
toolkit definition: Người chủ trước đây của bản, người đã bán bản đó cho người chủ khác. @vi
toolkit definition: Tegija, kes eksemplari endise omanikuna on müünud selle teisele omanikule. @et
toolkit definition: Un propietario anterior de un ítem que lo vendió a otro propietario. @es
toolkit definition: Ένας προηγούμενος ιδιοκτήτης ενός αντιτύπου, ο οποίος πούλησε αυτό το αντίτυπο σε κάποιον άλλον ιδιοκτήτη. @el
toolkit definition: وكيل هو المالك السابق لمفردة قام ببيعها لمالك آخر. @ar
toolkit definition: 作为先前拥有者将单件出售给另一个拥有者的一个行为者 @zh-hans
toolkit label: Verkäuferin/Verkäufer (Akteur) @de
toolkit label: agent vendeur
toolkit label: agent venedor @ca
toolkit label: agent, som er sælger @da
toolkit label: myyjä (toimija) @fi
toolkit label: müüja (tegija) @et
toolkit label: người bán @vi
toolkit label: pārdevējs (aģents) @lv
toolkit label: satıcı temsilcisi @tr
toolkit label: selger (agent) @no
toolkit label: seller agent @en
toolkit label: vendedor @es
toolkit label: verkoper-actor @nl
toolkit label: értékesítő ágense: @hu
toolkit label: πωλητής @el
toolkit label: وكيل بائع @ar
toolkit label: 出售者行为者 @zh-hans
has subproperty: a pour personne vendeuse
has subproperty: a pour agent collectif vendeur
has subproperty: P40008
lexical alias: sellerAgent.en
status: Published
type: Property
domain: C10003
label: có người bán @vi
label: har agent, som er sælger @da
label: har selger (agent) @no
label: has seller agent @en
label: hat Verkäuferin/Verkäufer (Akteur) @de
label: heeft verkoper-actor @nl
label: myyjä (toimija) @fi
label: müüja (tegija) @et
label: pārdevējs (aģents) @lv
label: satıcı temsilcisi ile ilişkilidir @tr
label: té com a agent venedor @ca
label: értékesítő ágense a következő: @hu
label: έχει πωλητή @el
label: له وكيل بائع @ar
label: 有出售者行为者 @zh-hans
sub property of: a pour ancien agent propriétaire
alternative label: Verkäufer @de
alternative label: myyjä @fi
alternative label: müüja @et
alternative label: satıcı @tr
alternative label: selger @no
alternative label: seller @en
alternative label: sælger @da
alternative label: vendedor @es
alternative label: vendeur
alternative label: venedor @ca
alternative label: értékesítője: @hu
alternative label: بائع @ar
alternative label: 出售者 @zh-hans
definition: Bir kopyayı, bir kopyanın önceki sahibi olan ve kopyayı başka bir sahibine satan bir temsilciyle ilişkilendirir. @tr
definition: Hozzákapcsol egy példányt egy ágenshez, amely egy példány korábbi tulajdonosa, és amely a példányt egy másik tulajdonosnak adja el. @hu
definition: Liittää kappaleen sen aiempaan omistajaan, joka myy kappaleen toiselle omistajalle. @fi
definition: Liên kết bản với người chủ trước đây của bản, người đã bán bản đó cho người chủ khác. @vi
definition: Met un item en relation avec un ancien agent propriétaire d’un item qui vend cet item à un autre propriétaire.
definition: Relaciona un ítem amb un agent que és un propietari anterior d’un ítem que ven l’ítem a un altre propietari. @ca
definition: Relateert een item aan een actor die een voormalige eigenaar is van een item die het item verkoopt aan een andere eigenaar. @nl

est contenu dans un item
has element type: 2
instruction number: 24.5
toolkit definition: An item that is a larger item of which an item is a discrete component. @en
toolkit definition: Bir kopyanın ayrı bir bileşeni olduğu daha büyük olan bir kopya. @tr
toolkit definition: Bản lớn hơn trong đó một bản là một bộ phần cấu thành tách biệt. @vi
toolkit definition: Een item dat is een groter item waarvan een item een afzonderlijk onderdeel is. @nl
toolkit definition: Egy nagyobb példány, amelynek egy példány különálló alkotóeleme. @hu
toolkit definition: Ein größeres Exemplar, von dem ein Exemplar ein eigenständiger Bestandteil ist. @de
toolkit definition: Et større eksemplar der et eksemplar er en avgrenset bestanddel. @no
toolkit definition: Item qui consiste en un item plus vaste dont un item forme une composante distincte.
toolkit definition: Kappale, joka on laajempi kappale, jonka itsenäinen osa kappale on. @fi
toolkit definition: Mahukam eksemplar, mille iseseisev osa eksemplar on. @et
toolkit definition: Større eksemplar, som eksemplaret udgør en adskilt komponent af. @da
toolkit definition: Un ítem mayor del cual una parte es un componente separado. @es
toolkit definition: Vienība, kas ir lielāka vienība, kuras atsevišķs komponents ir aprakstāmā vienība. @lv
toolkit definition: Ítem que és un ítem més ampli del qual un ítem és un component discret. @ca
toolkit definition: Ένα μεγαλύτερο αντίτυπο του οποίου ένα αντίτυπο συνιστά διακριτό συστατικό. @el
toolkit definition: مفردة أكبر تتضمن مفردة تشكل جزءا منفصلا عنها. @ar
toolkit definition: 作为包含独立组成部分单件的较大单件的一个单件 @zh-hans
toolkit label: Enthalten in (Exemplar) @de
toolkit label: a következő példány tartalmazza: @hu
toolkit label: contained in item @en
toolkit label: contenido en (ítem) @es
toolkit label: contenu dans un item
toolkit label: contingut en un ítem @ca
toolkit label: ietverts vienībā @lv
toolkit label: indeholdt i eksemplar @da
toolkit label: içinde bulunan kopya @tr
toolkit label: omfattes av eksemplar @no
toolkit label: opgenomen in item @nl
toolkit label: sisaldub eksemplaris @et
toolkit label: sisältyy kappaleeseen @fi
toolkit label: được chứa trong (bản) @vi
toolkit label: περιέχεται σε (αντίτυπο) @el
toolkit label: حاوية لمفردة @ar
toolkit label: 被包含于单件中 @zh-hans
has subproperty: P40009
lexical alias: containedInItem.en
status: Published
type: Property
domain: C10003
label: a következő példány tartalmazza: @hu
label: blir omfattet av eksemplar @no
label: er indeholdt i eksemplar @da
label: ir ietverts vienībā @lv
label: is contained in item @en
label: is opgenomen in item @nl
label: ist enthalten in (Exemplar) @de
label: kopyada yer almaktadır @tr
label: sisaldub eksemplaris @et
label: sisältyy kappaleeseen @fi
label: és contingut en un ítem @ca
label: được chứa trong (bản) @vi
label: περιέχεται σε (αντίτυπο) @el
label: هي حاوية لمفردة @ar
label: 被包含于单件中 @zh-hans
sub property of: a pour item en relation avec un item
definition: Bir kopyayı, bir kopyanın ayrık bir bileşeni olduğu daha büyük bir kopya olan bir kopyayla ilişkilendirir. @tr
definition: Hozzákapcsol egy példányt egy nagyobb példányhoz, amelynek egy példány különálló alkotóeleme. @hu
definition: Liittää kappaleen kappaleeseen, joka on laajempi kappale, jonka itsenäinen osa kappale on. @fi
definition: Liên kết bản với bản lớn hơn trong đó một bản là một bộ phần cấu thành tách biệt. @vi
definition: Met un item en relation avec un item qui consiste en un item plus vaste dont un item forme une composante distincte.
definition: Relaciona un ítem amb un ítem que és un ítem més ampli del qual un ítem és un component discret. @ca
definition: Relateert een item aan een item dat is een groter item waarvan een item een afzonderlijk onderdeel is. @nl
definition: Relaterer et eksemplar til et større eksemplar der et eksemplar er en avgrenset bestanddel. @no
definition: Relaterer et eksemplar til et større eksemplar, som eksemplaret udgør en adskilt komponent af. @da
definition: Relates an item to an item that is a larger item of which an item is a discrete component. @en
definition: Sasaista vienību ar vienību, kas ir lielāka vienība, kuras atsevišķs komponents ir aprakstāmā vienība. @lv
definition: Seostab eksemplari mahukama eksemplariga, mille iseseisev osa eksemplar on. @et
definition: Setzt ein Exemplar in Beziehung zu einem größeren Exemplar, von dem ein Exemplar ein eigenständiger Bestandteil ist. @de
definition: Συνδέει ένα αντίτυπο με ένα μεγαλύτερο αντίτυπο του οποίου ένα αντίτυπο συνιστά διακριτό συστατικό. @el
definition: يربط مفردة بمفردة هي ضمن تشكيل أكبر، وتشكل جزءا منفصلا عنه. @ar
definition: 将一个单件与作为包含独立组成部分单件的较大单件的一个单件关联起来。 @zh-hans

a pour note sur les dimensions d’un item
has element type: 6
instruction number: 3.22.3
toolkit definition: A note on item that provides information on the dimensions of an item. @en
toolkit definition: Bir kopyanın boyutları hakkında bilgi sağlayan kopya üzerine bir not @tr
toolkit definition: Een noot bij item die informatie geeft over de afmetingen van een item. @nl
toolkit definition: Egy példányra tett megjegyzés, amely információt nyújt egy példány méretéről. @hu
toolkit definition: Eine Anmerkung zum Exemplar, die Informationen über die Maße eines Exemplars enthält. @de
toolkit definition: En note om eksemplar som gir informasjon om størrelsen til et eksemplar. @no
toolkit definition: Ghi chú cung cấp thông tin về kích thước của bản cụ thể đang được mô tả nhưng không được ghi như là phần của yếu tố kích thước. @vi
toolkit definition: Huomautus, joka antaa tietoa kappaleen koosta. @fi
toolkit definition: Märkus, mis sisaldab infot eksemplari mõõtmete kohta. @et
toolkit definition: Nota sobre l’ítem que proporciona la informació sobre les dimensions d’un ítem. @ca
toolkit definition: Note om eksemplar, som giver information om et eksemplars størrelse. @da
toolkit definition: Note sur un item qui fournit de l’information sur les dimensions d’un item.
toolkit definition: Piezīme par vienību, kurā ir ziņas par vienības izmēriem. @lv
toolkit definition: Una nota que proporciona información sobre las dimensiones del ítem específico descrito que no esta registrado como parte del elemento dimensiones. @es
toolkit definition: Μια σημείωση που παρέχει πληροφορίες αναφορικά με τις διαστάσεις ενός συγκεκριμένου περιγραφόμενου αντιτύπου, οι οποίες δεν καταχωρίζονται ως μέρος του στοιχείου των διαστάσεων. @el
toolkit definition: تبصرة عن مفردة توفر معلومات عن أبعاد مفردة @ar
toolkit definition: 提供关于单件尺寸信息的一个关于单件的附注 @zh-hans
toolkit label: Anmerkung zu Maßen eines Exemplars @de
toolkit label: Kopyanın boyutları hakkında not @tr
toolkit label: anmärkning om exemplarets mått @sv
toolkit label: ghi chú về kích thước của bản @vi
toolkit label: huomautus kappaleen koosta @fi
toolkit label: märkus eksemplari mõõtmete kohta @et
toolkit label: noot bij afmetingen van item @nl
toolkit label: nota sobre dimensiones del ítem @es
toolkit label: nota sobre dimensions d’un ítem @ca
toolkit label: note om eksemplarets størrelse @no
toolkit label: note om eksemplars størrelse @da
toolkit label: note on dimensions of item @en
toolkit label: note sur les dimensions d’un item
toolkit label: piezīme par vienības izmēriem @lv
toolkit label: példány méretéről szóló megjegyzése: @hu
toolkit label: σημείωση στις διαστάσεις του αντιτύπου @el
toolkit label: تبصرة عن أبعاد مفردة @ar
toolkit label: 关于单件尺寸的附注 @zh-hans
has subproperty: P40010
lexical alias: noteOnDimensionsOfItem.en
status: Published
type: Property
domain: C10003
label: a példány méretéről szóló megjegyzése a következő: @hu
label: có ghi chú về kích thước của bản @vi
label: har anmärkning om exemplarets mått @sv
label: har note om eksemplarets størrelse @no
label: har note om eksemplars størrelse @da
label: has note on dimensions of item @en
label: hat Anmerkung zu Maßen eines Exemplars @de
label: heeft noot bij afmetingen van item @nl
label: huomautus kappaleen koosta @fi
label: kopyanın boyutları hakkında not ile ilişkilidir @tr
label: märkus eksemplari mõõtmete kohta @et
label: piezīme par vienības izmēriem @lv
label: té com a nota sobre dimensions d’un ítem @ca
label: έχει σημείωση στις διαστάσεις του αντιτύπου @el
label: له تبصرة عن أبعاد مفردة @ar
label: 有关于单件尺寸的附注 @zh-hans
sub property of: a pour note sur un item
definition: Bir kopyayı, kopyanın boyutları hakkında bilgi sağlayan kopya üzerindeki bir notla ilişkilendirir. @tr
definition: Hozzákapcsol egy példányt egy példányra tett megjegyzéshez, amely információt nyújt egy példány méretéről. @hu
definition: Liittää kappaleen huomautukseen, joka antaa tietoa kappaleen koosta. @fi
definition: Liên kết bản với ghi chú cung cấp thông tin về kích thước của bản cụ thể đang được mô tả nhưng không được ghi như là phần của yếu tố kích thước. @vi
definition: Met un item en relation avec une note sur un item qui fournit de l’information sur les dimensions d’un item.
definition: Relaciona un ítem amb una nota sobre l’ítem que proporciona la informació sobre les dimensions d’un ítem. @ca
definition: Relateert een item aan een noot bij item die informatie geeft over de afmetingen van een item. @nl
definition: Relaterer et eksemplar til en note om eksemplar som gir informasjon om størrelsen til et eksemplar. @no
definition: Relaterer et eksemplar til en note om eksemplar, som giver information om et eksemplars størrelse. @da
definition: Relates an item to a note on item that provides information on the dimensions of an item. @en
definition: Sasaista vienību ar piezīmi par vienību, kurā ir ziņas par vienības izmēriem. @lv
definition: Seostab eksemplari märkusega, mis sisaldab infot eksemplari mõõtmete kohta. @et
definition: Setzt ein Exemplar in Beziehung zu einer Anmerkung zum Exemplar, die Informationen über die Maße eines Exemplars enthält. @de
definition: Συνδέει ένα ανίτυπο με μια σημείωση που παρέχει πληροφορίες αναφορικά με τις διαστάσεις ενός συγκεκριμένου περιγραφόμενου αντιτύπου οι οποίες δεν καταχωρίζονται ως μέρος του στοιχείου των διαστάσεων. @el
definition: يربط مفردة بتبصرة عن مفردة توفر معلومات عن أبعاد مفردة. @ar
definition: 将一个单件与提供关于单件尺寸信息的一个关于单件的附注关联起来。 @zh-hans

a pour note sur l’étendue d’un item
has element type: 6
instruction number: 3.22.2
toolkit definition: A note on item that provides information on the extent of an item. @en
toolkit definition: Bir kopyanın kapsamı hakkında bilgi sağlayan kopya hakkında bir not @tr
toolkit definition: Een noot bij item die informatie geeft over de omvang van een item. @nl
toolkit definition: Egy példányra tett megjegyzés, amely információt nyújt egy példány terjedelméről. @hu
toolkit definition: Eine Anmerkung zum Exemplar, die Informationen über den Umfang eines Exemplars enthält. @de
toolkit definition: En note om eksemplar som gir informasjon om omfanget til et eksemplar. @no
toolkit definition: Ghi chú cung cấp thông tin về quy mô của bản cụ thể đang được mô tả nhưng không được ghi như là phần của yếu tố quy mô. @vi
toolkit definition: Huomautus, joka antaa tietoa kappaleen laajuudesta. @fi
toolkit definition: Märkus, mis sisaldab infot eksemplari mahu kohta. @et
toolkit definition: Nota sobre l’ítem que proporciona la informació sobre l’extensió d’un ítem. @ca
toolkit definition: Note om eksemplar, som giver information om et eksemplars omfang. @da
toolkit definition: Note sur un item qui fournit de l’information sur l’étendue d’un item.
toolkit definition: Piezīme par vienību, kurā ir ziņas par vienības apjomu. @lv
toolkit definition: Una nota que proporciona información sobre la extensión del ítem específico descrito que está registrado como parte del elemento extensión @es
toolkit definition: Nota sull'item che fornisce informazioni sull'estensione dell'item @it
toolkit definition: Μια σημείωση που παρέχει πληροφορίες αναφορικά με την έκταση ενός συγκεκριμένου περιγραφόμενου αντιτύπου η οποία δεν καταχωρίζεται ως μέρος του στοιχείου της έκτασης. @el
toolkit definition: تبصرة عن مفردة توفر معلومات عن امتداد مفردة. @ar
toolkit definition: 提供关于单件数量信息的一个关于单件的附注 @zh-hans
toolkit label: Anmerkung zum Umfang eines Exemplars @de
toolkit label: anmärkning om exemplarets omfång @sv
toolkit label: ghi chú về quy mô của bản @vi
toolkit label: ha come nota su estensione dell'item @it
toolkit label: huomautus kappaleen laajuudesta @fi
toolkit label: märkus eksemplari mahu kohta @et
toolkit label: noot bij omvang van item @nl
toolkit label: nota sobre extensió d’un ítem @ca
toolkit label: nota sobre la extensión del ítem @es
toolkit label: note om eksemplarets omfang @no
toolkit label: note om omfang af eksemplar @da
toolkit label: note on extent of item @en
toolkit label: note sur l’étendue d’un item
toolkit label: piezīme par vienības apjomu @lv
toolkit label: példány terjedelméről szóló megjegyzése: @hu
toolkit label: İfadenin kapsamı hakkında not @tr
toolkit label: σημείωση στην έκταση του αντιτύπου @el
toolkit label: تبصرة عن امتداد مفردة @ar
toolkit label: 关于单件数量的附注 @zh-hans
has subproperty: P40011
lexical alias: noteOnExtentOfItem.en
status: Published
type: Property
domain: C10003
label: a példány terjedelméről szóló megjegyzése a következő: @hu
label: có ghi chú về quy mô của bản @vi
label: gösterimin kapsamı hakkında not ile ilişkilidir @tr
label: ha come nota su estensione dell'item @it
label: har anmärkning om exemplarets omfång @sv
label: har note om eksemplarets omfang @no
label: har note om omfang af eksemplar @da
label: has note on extent of item @en
label: hat Anmerkung zum Umfang eines Exemplars @de
label: heeft noot bij omvang van item @nl
label: huomautus kappaleen laajuudesta @fi
label: märkus eksemplari mahu kohta @et
label: piezīme par vienības apjomu @lv
label: té com a nota sobre extensió d’un ítem @ca
label: έχει σημείωση στην έκταση του αντιτύπου @el
label: له تبصرة عن امتداد مفردة @ar
label: 有关于单件数量的附注 @zh-hans
sub property of: a pour note sur un item
definition: Bir kopyayı, kopyanın kapsamı hakkında bilgi sağlayan kopya üzerindeki bir notla ilişkilendirir. @tr
definition: Correla un item a una nota sull'item che fornisce informazioni sull'estensione di un item. @it
definition: Hozzákapcsol egy példányt egy példányra tett megjegyzéshez, amely információt nyújt egy példány terjedelméről. @hu
definition: Liittää kappaleen huomautukseen, joka antaa tietoa kappaleen laajuudesta. @fi
definition: Liên kết bản với ghi chú cung cấp thông tin về quy mô của bản cụ thể đang được mô tả nhưng không được ghi như là phần của yếu tố quy mô. @vi
definition: Met un item en relation avec une note sur un item qui fournit de l’information sur l’étendue d’un item.
definition: Relaciona un ítem amb una nota sobre l’ítem que proporciona la informació sobre l’extensió d’un ítem. @ca
definition: Relateert een item aan een noot bij item die informatie geeft over de omvang van een item. @nl
definition: Relaterer et eksemplar til en note om eksemplar som gir informasjon om omfanget til et eksemplar. @no
definition: Relaterer et eksemplar til en note om eksemplar, som giver information om et eksemplars omfang. @da
definition: Relates an item to a note on item that provides information on the extent of an item. @en
definition: Sasaista vienību ar piezīmi par vienību, kurā ir ziņas par vienības apjomu. @lv
definition: Seostab eksemplari märkusega, mis sisaldab infot eksemplari mahu kohta. @et
definition: Setzt ein Exemplar in Beziehung zu einer Anmerkung zum Exemplar, die Informationen über den Umfang eines Exemplars enthält. @de
definition: Συνδέει ένα αντίτυπο με μια σημείωση που παρέχει πληροφορίες αναφορικά με την έκταση ενός συγκεκριμένου περιγραφόμενου αντιτύπου η οποία δεν καταχωρίζεται ως μέρος του στοιχείου της έκτασης. @el
definition: يربط مفردة بتبصرة عن مفردة توفر معلومات عن امتداد مفردة. @ar
definition: 将一个单件与提供关于单件数量信息的一个关于单件的附注关联起来。 @zh-hans

a pour agent enlumineur
has element type: 2
instruction number: 18.5
toolkit definition: Agent que decora un ítem concret amb metalls preciosos o amb color, sovint amb dissenys i motius elaborats. @ca
toolkit definition: Agent qui orne un item spécifique en utilisant des métaux précieux ou de la couleur, souvent avec des dessins et des motifs élaborés.
toolkit definition: Agent, som udsmykker et særligt eksemplar med ædelmetal eller farve, ofte med detaljerige mønstre og motiver. @da
toolkit definition: Agente che decora uno specifico item utilizzando metalli o colori preziosi, spesso con progetti e motivi elaborati. @it
toolkit definition: An agent who decorates a specific item using precious metals or colour, often with elaborate designs and motifs. @en
toolkit definition: Aģents, kas izgrezno konkrēto vienību, izmantojot krāsu un/vai dārgmetālus, bieži ar izsmalcinātiem un filigrāniem zīmējumiem, burtiem un motīviem. @lv
toolkit definition: Belirli bir öğeyi değerli metaller veya renkler kullanarak, genellikle özenle hazırlanmış tasarımlar ve motiflerle süsleyen bir temsilci. @tr
toolkit definition: Cá nhân trang trí cho bản cụ thể sử dụng kim loại quý hoặc màu, thường thiết kế và kiểu dáng tỷ mỷ. @vi
toolkit definition: Een actor die een specifiek item decoreert met edelmetalen of kleur, vaak met uitgebreide ontwerpen en motieven. @nl
toolkit definition: Egy ágens, amely egy adott példányt nemesfémekkel vagy színekkel díszít, gyakran gondosan kidolgozott kivitelezéssel és motívumok használával. @hu
toolkit definition: Ein Akteur, der ein bestimmtes Exemplar durch Edelmetalle oder Farben, häufig mit kunstvollen Mustern und Motiven, (aus-)gestaltet. @de
toolkit definition: En agent som dekorerer et bestemt eksemplar med edle metaller eller farger, gjerne med intrikate former og motiver. @no
toolkit definition: Tegija, kes kaunistab väärismetallide ja värvidega kindlat eksemplari, kasutades sageli keerulisi kujundeid ja motiive. @et
toolkit definition: Toimija, joka koristelee yksittäisen kappaleen käyttäen jalometalleja tai värejä, usein yksityiskohtaisissa kuvioissa tai motiiveissa. @fi
toolkit definition: Una persona que proporciona la decoración de un ítem específico utilizando metales preciosos, o color, a menudo con diseños y motivos elaborados. @es
toolkit definition: Ένα φυσικό πρόσωπο που διακοσμεί ένα συγκεκριμένο αντίτυπο χρησιμοποιώντας πολύτιμα μέταλλα ή χρώματα, συχνά με περίτεχνα σχέδια και μοτίβα. @el
toolkit definition: وكيل يزين مفردة محددة باستخدام معادن ثمينة أو ألوان، غالبًا بتصاميم وزخارف منمقة. @ar
toolkit definition: 对特定单件用贵重的金属或色彩（通常有精心的设计和图案）进行装饰的一个行为者 @zh-hans
toolkit label: Illuminatorin/Illuminator (Akteur) @de
toolkit label: agent enlumineur
toolkit label: agent il·luminador @ca
toolkit label: agent, som er illuminator @da
toolkit label: illuminator (agent) @no
toolkit label: illuminator agent @en
toolkit label: illumineerija (tegija) @et
toolkit label: illuminoinnin tekijä (toimija) @fi
toolkit label: illuminátor ágense: @hu
toolkit label: iluminador @es
toolkit label: iluminators (aģents) @lv
toolkit label: miniatore agente @it
toolkit label: người tô màu @vi
toolkit label: tezhip sanatçısı temsilcisi ile ilişkilidir @tr
toolkit label: verluchter-actor @nl
toolkit label: φωτιστής @el
toolkit label: وكيل مزخرف @ar
toolkit label: 彩饰者行为者 @zh-hans
has subproperty: a pour personne enlumineuse
has subproperty: a pour agent collectif enlumineur
has subproperty: P40012
lexical alias: illuminatorAgent.en
status: Published
type: Property
domain: C10003
label: có người tô màu @vi
label: har agent, som er illuminator @da
label: har illuminator (agent) @no
label: has illuminator agent @en
label: hat Illuminatorin/Illuminator (Akteur) @de
label: ha come miniatore agente @it
label: heeft verluchter-actor @nl
label: illumineerija (tegija) @et
label: illuminoinnin tekijä (toimija) @fi
label: illuminátor ágense a következő: @hu
label: iluminators (aģents) @lv
label: tezhip sanatçısı temsilcisi ile ilişkilidir @tr
label: té com a agent il·luminador @ca
label: έχει φωτιστή @el
label: له وكيل مزخرف @ar
label: 有彩饰者行为者 @zh-hans
sub property of: a pour agent modificateur
alternative label: Illuminator @de
alternative label: enlumineur
alternative label: illuminator @en
alternative label: illumineerija @et
alternative label: illuminoinnin tekijä @fi
alternative label: illuminátora: @hu
alternative label: iluminador @es
alternative label: il·luminador @ca
alternative label: miniatore @it
alternative label: مزخرف @ar
alternative label: 彩饰者 @zh-hans
definition: Bir kopyayı, belirli bir kopyayı değerli metaller veya renkler kullanarak, genellikle özenle hazırlanmış tasarımlar ve motiflerle süsleyen bir temsilciyle ilişkilendirir. @tr
definition: Correla un item a un agente che decora uno specifico item utilizzando metalli o colori preziosi, spesso con progetti e motivi elaborati. @it
definition: Hozzákapcsol egy példányt egy ágenshez, amely egy adott példányt nemesfémekkel vagy színekkel díszít, gyakran gondosan kidolgozott kivitelezéssel és motívumok használával. @hu
definition: Liittää kappaleen toimijaan, joka koristelee yksittäisen kappaleen käyttäen jalometalleja tai värejä, usein yksityiskohtaisissa kuvioissa tai motiiveissa. @fi
definition: Liên kết bản với cá nhân trang trí cho bản cụ thể sử dụng kim loại quý hoặc màu, thường thiết kế và kiểu dáng tỷ mỷ. @vi
definition: Met un item en relation avec un agent qui orne un item spécifique en utilisant des métaux précieux ou de la couleur, souvent avec des dessins et des motifs élaborés.

a pour agent relieur
has element type: 2
instruction number: 18.5
toolkit definition: Agent que enquaderna un ítem. @ca
toolkit definition: Agent qui relie un item.
toolkit definition: Agent, som indbinder et eksemplar. @da
toolkit definition: Agente che rilega un item. @it
toolkit definition: An agent who binds an item. @en
toolkit definition: Aģents, kas iesien vienību. @lv
toolkit definition: Bir öğeyi ciltleyen bir temsilci. @tr
toolkit definition: Cá nhân người đóng một bản. @vi
toolkit definition: Een actor die een item bindt. @nl
toolkit definition: Egy ágens, amely beköt egy forrást. @hu
toolkit definition: Ein Akteur, der ein Exemplar bindet. @de
toolkit definition: En agent som binder inn et eksemplar. @no
toolkit definition: Tegija, kes on eksemplari köitnud. @et
toolkit definition: Toimija, joka sitoo kappaleen. @fi
toolkit definition: Una persona que encuaderna un ítem. @es
toolkit definition: Ένα φυσικό πρόσωπο που βιβλιοδετεί ένα αντίτυπο. @el
toolkit definition: وكيل يقوم بتجليد مفردة. @ar
toolkit definition: 装订单件的一个行为者 @zh-hans
toolkit label: Buchbinderin/Buchbinder (Akteur) @de
toolkit label: agent enquadernador @ca
toolkit label: agent relieur
toolkit label: agent, som er bogbinder @da
toolkit label: binder agent @en
toolkit label: binder-actor @nl
toolkit label: bokbinder (agent) @no
toolkit label: ciltleyici temsilci @tr
toolkit label: encuadernador @es
toolkit label: grāmatsējējs (aģents) @lv
toolkit label: köitja (tegija) @et
toolkit label: könyvkötő ágense: @hu
toolkit label: người đóng sách @vi
toolkit label: rilegatore agente @it
toolkit label: sitoja (toimija) @fi
toolkit label: βιβλιοδέτης @el
toolkit label: وكيل مسئول عن التجليد @ar
toolkit label: 装订者行为者 @zh-hans
has subproperty: a pour personne relieuse
has subproperty: a pour agent collectif relieur
has subproperty: P40013
lexical alias: binderAgent.en
status: Published
type: Property
domain: C10003
label: ciltleyen temsilci ile ilişkilidir @tr
label: có người đóng sách @vi
label: grāmatsējējs (aģents) @lv
label: har agent, som er bogbinder @da
label: har bokbinder (agent) @no
label: has binder agent @en
label: hat Buchbinderin/Buchbinder (Akteur) @de
label: ha come rilegatore agente @it
label: heeft binder-actor @nl
label: köitja (tegija) @et
label: könyvkötő ágense a következő: @hu
label: sitoja (toimija) @fi
label: té com a agent enquadernador @ca
label: έχει βιβλιοδέτη @el
label: له وكيل مسئول عن التجليد @ar
label: 有装订者行为者 @zh-hans
sub property of: a pour agent modificateur
alternative label: Buchbinder @de
alternative label: binder @en
alternative label: bogbinder @da
alternative label: bokbinder @no
alternative label: ciltleyici @tr
alternative label: encuadernador @es
alternative label: enquadernador @ca
alternative label: köitja @et
alternative label: könyvkötője: @hu
alternative label: relieur
alternative label: rilegatore @it
alternative label: sitoja @fi
alternative label: مسئول عن التجليد @ar
alternative label: 装订者 @zh-hans
definition: Bir kopyayı, bir kopyaı ciltleyen bir temsilciyle ilişkilendirir. @tr
definition: Correla un item a un agente che rilega un item. @it
definition: Hozzákapcsol egy példányt egy ágenshez, amely beköt egy forrást. @hu

a pour dédicateur d’un item
has element type: 2
instruction number: 18.5
toolkit definition: A person who writes a statement of dedication or gift on an item. @en
toolkit definition: Bir kopya üzerine, hediye veya ithaf beyanı yazan kişi. @tr
toolkit definition: Cá nhân người viết thông tin đề tặng hoặc quà biếu trên bản. @vi
toolkit definition: Een persoon die een vermelding van opdracht of geschenk schrijft op een item. @nl
toolkit definition: Egy személy, aki elkötelezettségi vagy ajándékozási nyilatkozatot ír egy példányra. @hu
toolkit definition: Eine Person, die eine Widmung oder einen Schenkungsvermerk in ein Exemplar schreibt. @de
toolkit definition: En person som skriver en angivelse av dedikasjon eller gave på et eksemplar. @no
toolkit definition: Henkilö, joka kirjoittaa kappaleeseen omistuskirjoituksen tai merkinnön lahjoituksesta. @fi
toolkit definition: Isik, kes kirjutab eksemplarisse või eksemplarile pühenduse või märke kinkimise kohta. @et
toolkit definition: Person, som skriver en dedikation eller gavetilegnelse på et eksemplar. @da
toolkit definition: Persona che scrive una dichiarazione di dedica o di dono su un item. @it
toolkit definition: Persona que ha escrit una menció de dedicatòria o de regal en un ítem. @ca
toolkit definition: Persona, kura konkrētā vienībā ir ierakstījusi veltījumu. @lv
toolkit definition: Personne qui écrit une dédicace ou une mention de don sur un item.
toolkit definition: Una persona que ha escrito una mención de dedicatoria o donación en un ítem. @es
toolkit definition: Ένα φυσικό πρόσωπο το οποίο έχει γράψει μια αφιέρωση ή δήλωση δωρεάς σε ένα αντίτυπο. @el
toolkit definition: شخص يكتب جملة اهداء أو هبة على مفردة. @ar
toolkit definition: 在单件上书写题词或赠与文字的个人 @zh-hans
toolkit label: Beschriftende Person @de
toolkit label: armağan notu yazarı ile ilişkilidir @tr
toolkit label: autor de dedicatoria @es
toolkit label: beírója: @hu
toolkit label: dedicante @it
toolkit label: dédicateur d’un item
toolkit label: indskriver @da
toolkit label: inscriber @en
toolkit label: inscriptor @ca
toolkit label: người ghi @vi
toolkit label: omistuskirjoituksen kirjoittaja @fi
toolkit label: opdrachtschrijver @nl
toolkit label: person som tilegner @no
toolkit label: pühenduse kirjutaja @et
toolkit label: veltījuma ieraksta autors @lv
toolkit label: χαράκτης @el
toolkit label: حفَّار @ar
toolkit label: 题写者 @zh-hans
has subproperty: P40014
lexical alias: inscriber.en
status: Published
type: Property
domain: C10003
label: armağan notu yazarı ile ilişkilidir @tr
label: beírója a következő: @hu
label: có người khắc @vi
label: ha come dedicante @it
label: har indskriver @da
label: har person som tilegner @no
label: has inscriber @en
label: hat beschriftende Person @de
label: heeft opdrachtschrijver @nl
label: omistuskirjoituksen kirjoittaja @fi
label: pühenduse kirjutaja @et
label: té com a inscriptor @ca
label: veltījuma ieraksta autors @lv
label: έχει χαράκτη @el
label: له حفار @ar
label: 有题写者 @zh-hans
sub property of: a pour personne modificatrice
alternative label: auteur d’un envoi
definition: Bir kopyayı, bir kopyaya hediye veya ithaf beyanı yazan bir kişi ile ilişkilendirir. @tr
definition: Correla un item a una persona che scrive una dichiarazione di dedica o di dono su un item. @it
definition: Hozzákapcsol egy példányt egy személyhez, aki elkötelezettségi vagy ajándékozási nyilatkozatot ír egy példányra. @hu
definition: Liittää kappaleen henkilöön, joka kirjoittaa kappaleeseen omistuskirjoituksen tai merkinnön lahjoituksesta. @fi
definition: Liên kết bản với cá nhân người viết thông tin đề tặng hoặc quà biếu trên bản. @vi
definition: Met un item en relation avec une personne qui écrit une dédicace ou une mention de don sur un item.
definition: Relaciona un ítem amb una persona que ha escrit una menció de dedicatòria o de regal en un ítem. @ca
definition: Relateert een item aan een persoon die een vermelding van opdracht of geschenk schrijft op een item. @nl
definition: Relaterer et eksemplar til en person som skriver en angivelse av dedikasjon eller gave på et eksemplar. @no
definition: Relaterer et eksemplar til en person, som skriver en dedikation eller gavetilegnelse på et eksemplar. @da
definition: Relates an item to a person who writes a statement of dedication or gift on an item. @en
definition: Sasaista vienību ar personu, kura konkrētā vienībā ir ierakstījusi veltījumu. @lv
definition: Seostab eksemplari isikuga, kes kirjutab eksemplarisse või eksemplarile pühenduse või märke kinkimise kohta. @et
definition: Setzt ein Exemplar in Beziehung zu einer Person, die eine Widmung oder einen Schenkungsvermerk in ein Exemplar schreibt. @de
definition: Συνδέει ένα αντίτυπο με ένα φυσικό πρόσωπο το οποίο έχει γράψει μια αφιέρωση ή δήλωση δωρεάς σε ένα αντίτυπο. @el
definition: يربط مفردة بشخص يكتب جملة اهداء على مفردة. @ar
definition: 将一个单件与在单件上书写题词或赠与文字的个人关联起来。 @zh-hans

a pour annotateur
has element type: 2
instruction number: 18.5
toolkit definition: A person who adds notes and other information to an item by hand. @en
toolkit definition: Bir kopyaya, notlar ve diğer bilgileri elle ekleyen kişi. @tr
toolkit definition: Cá nhân người tạo chú thích bản thảo trên bản. @vi
toolkit definition: Een persoon die aantekeningen en andere informatie met de hand toevoegt aan een item. @nl
toolkit definition: Egy személy, aki jegyzeteket és más, kézzel írott információt fűz egy példányhoz. @hu
toolkit definition: Eine Person, die handschriftlich Anmerkungen und andere Informationen in ein Exemplar hinzufügt. @de
toolkit definition: En person som legger til håndskrevne noter og annen informasjon i et eksemplar. @no
toolkit definition: Henkilö, joka kirjoittaa käsin lisähuomautuksia tai muita selityksiä kappaleeseen. @fi
toolkit definition: Isik, kes lisab eksemplari käsitsi märkusi ja muud infot. @et
toolkit definition: Person, som i hånden tilføjer noter og anden information på et eksemplar. @da
toolkit definition: Persona che appone annotazioni o altre informazioni manoscritte su un item. @it
toolkit definition: Persona que afegeix a mà notes i altra informació a un ítem. @ca
toolkit definition: Persona, kura pievieno rakstam/vienībai ar roku rakstītas piezīmes un citu informāciju. @lv
toolkit definition: Personne qui ajoute des notes ou d’autres informations à la main sur un item.
toolkit definition: Una persona que hace anotaciones manuscritas en un ítem. @es
toolkit definition: Ένα φυσικό πρόσωπο το οποίο δημιουργεί χειρόγραφα σχόλια/σημειώσεις σε ένα αντίτυπο. @el
toolkit definition: شخص يضيف حواشي ومعلومات أخرى على مفردة باليد. @ar
toolkit definition: 在单件上手写批注和其他信息的个人 @zh-hans
toolkit label: Annotierende Person @de
toolkit label: annotateur
toolkit label: annotator @en
toolkit label: annoterende person @no
toolkit label: annoteringsskriver @da
toolkit label: anotador @ca
toolkit label: anotācijas autors @lv
toolkit label: jegyzetekkel ellátója: @hu
toolkit label: lisähuomautusten kirjoittaja @fi
toolkit label: người chú thích @vi
toolkit label: postillatore @it
toolkit label: sissekirjutuste autor @et
toolkit label: yorumlayıcı @tr
toolkit label: υπομνηματιστής @el
toolkit label: مُعلِق @ar
toolkit label: 手写批注者 @zh-hans
has subproperty: P40015
lexical alias: annotator.en
status: Published
type: Property
domain: C10003
label: anotācijas autors @lv
label: có người chú thích @vi
label: ha come postillatore @it
label: har annoterende person @no
label: har annoteringsskriver @da
label: has annotator @en
label: hat annotierende Person @de
label: heeft annotator @nl
label: jegyzetekkel ellátója a következő: @hu
label: lisähuomautusten kirjoittaja @fi
label: sissekirjutuste autor @et
label: té com a anotador @ca
label: yorumlayıcı ile ilişkilidir @tr
label: έχει υπομνηματιστή @el
label: له مُعلِق @ar
label: 有手写批注者 @zh-hans
sub property of: a pour personne modificatrice
definition: Bir kopyayı, bir kopyaya elle alınan notlar ve diğer bilgiler ekleyen bir kişiyle ilişkilendirir. @tr
definition: Correla un item a una persona che appone annotazioni o altre informazioni manoscritte su un item. @it
definition: Hozzákapcsol egy példányt egy személyhez, aki jegyzeteket és más, kézzel írott információt fűz egy példányhoz. @hu
definition: Liittää kappaleen henkilöön, joka kirjoittaa käsin lisähuomautuksia tai muita selityksiä kappaleeseen. @fi
definition: Liên kết bản với cá nhân người tạo chú thích bản thảo trên bản. @vi
definition: Met un item en relation avec une personne qui ajoute des notes ou d’autres informations à la main sur un item.
definition: Relaciona un ítem amb una persona que afegeix a mà notes i altra informació a un ítem. @ca
definition: Relateert een item aan een persoon die aantekeningen en andere informatie met de hand toevoegt aan een item. @nl
definition: Relaterer et eksemplar til en person som legger til håndskrevne noter og annen informasjon i et eksemplar. @no
definition: Relaterer et eksemplar til en person, som i hånden tilføjer noter og anden information på et eksemplar. @da
definition: Relates an item to a person who adds notes and other information to an item by hand. @en
definition: Sasaista vienību ar personu, kura pievieno rakstam/vienībai ar roku rakstītas piezīmes un citu informāciju. @lv
definition: Seostab eksemplari isikuga, kes lisab eksemplari käsitsi märkusi ja muud infot. @et
definition: Setzt ein Exemplar in Beziehung zu einer Person, die handschriftlich Anmerkungen und andere Informationen in ein Exemplar hinzufügt. @de
definition: Συνδέει ένα αντίτυπο με ένα φυσικό πρόσωπο το οποίο δημιουργεί χειρόγραφα σχόλια/σημειώσεις σε ένα αντίτυπο. @el
definition: يربط مفردة بشخص يضيف باليد حواشي ومعلومات أخرى على مفردة . @ar
definition: 将一个单件与在单件上手写批注和其他信息的个人关联起来。 @zh-hans

a pour signataire autographe
has element type: 2
instruction number: 18.5
toolkit definition: A person whose manuscript signature appears on an item. @en
toolkit definition: Cá nhân có chữ ký bản thảo xuất hiện trên bản. @vi
toolkit definition: Een persoon wiens handtekening in manuscript op een item staat. @nl
toolkit definition: Egy személy, akinek a kézírásos aláírása megjelenik egy példányon. @hu
toolkit definition: Eine Person, deren handschriftliche Unterschrift auf einem Exemplar steht. @de
toolkit definition: El yazması imzası bir kopya üzerinde görünen bir kişi. @tr
toolkit definition: En person hvis håndskrevne signatur finnes på et eksemplar. @no
toolkit definition: Henkilö, jonka käsin kirjoitettu nimikirjoitus on kappaleessa. @fi
toolkit definition: Isik, kelle omakäeline nimi või nimemärk on eksemplaris või eksemplaril. @et
toolkit definition: Person, hvis signatur forekommer på et eksemplar. @da
toolkit definition: Persona la cui firma compare su un item. @it
toolkit definition: Persona la signatura autògrafa de la qual figura en un ítem. @ca
toolkit definition: Persona, kuras paraksts parādās uz vienības. @lv
toolkit definition: Personne dont la signature manuscrite figure sur un item.
toolkit definition: Una persona cuya firma manuscrita aparece en un ítem. @es
toolkit definition: Ένα φυσικό πρόσωπο του οποίου η ιδιόχειρη υπογραφή υπάρχει σε ένα αντίτυπο. @el
toolkit definition: شخص يظهر توقيعه بخط اليد على مفردة. @ar
toolkit definition: 在单件上亲笔签名的个人 @zh-hans
toolkit label: Unterzeichnerin/Unterzeichner @de
toolkit label: aláírója: @hu
toolkit label: autograafi kirjutaja @et
toolkit label: autografskriver @da
toolkit label: autographer @en
toolkit label: autogrāfa autors @lv
toolkit label: autore di autografo @it
toolkit label: firmante de autógrafo @es
toolkit label: handtekeningzetter @nl
toolkit label: imzalayan @tr
toolkit label: người ghi bút tích @vi
toolkit label: nimikirjoituksen kirjoittaja @fi
toolkit label: person som signerer @no
toolkit label: signataire autographe
toolkit label: signatari d’un autògraf @ca
toolkit label: χειρόγραφη υπογραφή @el
toolkit label: موقِّع أتوجراف @ar
toolkit label: 亲笔签名者 @zh-hans
has subproperty: P40016
lexical alias: autographer.en
status: Published
type: Property
domain: C10003
label: aláírója a következő: @hu
label: autograafi kirjutaja @et
label: autogrāfa autors @lv
label: có người ghi bút tích @vi
label: har autografskriver @da
label: har person som signerer @no
label: has autographer @en
label: hat Unterzeichnerin/Unterzeichner @de
label: ha come autore di autografo @it
label: heeft handtekeningzetter @nl
label: imza sahibi ile ilişkilidir @tr
label: nimikirjoituksen kirjoittaja @fi
label: té com a signatari d’un autògraf @ca
label: έχει χειρόγραφη υπογραφή @el
label: له شخص موقِّع أتوجراف @ar
label: 有亲笔签名者 @zh-hans
sub property of: a pour personne modificatrice
definition: Bir kopyayı, el yazması imzası bir kopya üzerinde görünen bir kişiyle ilişkilendirir. @tr
definition: Correla un item a una persona la cui firma compare su un item. @it
definition: Hozzákapcsol egy példányt egy személyhez, akinek a kézírásos aláírása megjelenik egy példányon. @hu
definition: Liittää kappaleen henkilöön, jonka käsin kirjoitettu nimikirjoitus on kappaleessa. @fi
definition: Liên kết bản với cá nhân có chữ ký bản thảo xuất hiện trên bản. @vi
definition: Met un item en relation avec une personne dont la signature manuscrite figure sur un item.
definition: Relaciona un ítem amb una persona la signatura autògrafa de la qual figura en un ítem. @ca
definition: Relateert een item aan een persoon wiens handtekening in manuscript op een item staat. @nl
definition: Relaterer et eksemplar til en person hvis håndskrevne signatur finnes på et eksemplar. @no
definition: Relaterer et eksemplar til en person, hvis signatur forekommer på et eksemplar. @da
definition: Relates an item to a person whose manuscript signature appears on an item. @en
definition: Sasaista vienību ar personu, kuras paraksts parādās uz vienības. @lv
definition: Seostab eksemplari isikuga, kelle omakäeline nimi või nimemärk on eksemplaris või eksemplaril. @et
definition: Setzt ein Exemplar in Beziehung zu einer Person, deren handschriftliche Unterschrift auf einem Exemplar steht. @de
definition: Συνδέει ένα αντίτυπο με ένα φυσικό πρόσωπο του οποίου η ιδιόχειρη υπογραφή υπάρχει σε ένα αντίτυπο. @el
definition: يربط مفردة بشخص يظهر توقيعه بخط اليد على مفردة. @ar
definition: 将一个单件与在单件上亲笔签名的个人关联起来。 @zh-hans

a pour agent conservateur
has element type: 2
instruction number: 18.5
toolkit definition: Agent que concep o gestiona l’agregació d’un ítem en una exposició o una col·lecció. @ca
toolkit definition: Agent qui conçoit ou gère l’agrégation d’un item dans une exposition ou une collection.
toolkit definition: Agent, som udtænker eller administrerer samlingen af et eksemplar til en udstilling eller samling. @da
toolkit definition: Agente che concepisce o gestisce l'aggregazione di un item in una mostra o in una raccolta. @it
toolkit definition: An agent who conceives or manages the aggregation of an item in an exhibition or collection. (Deprecated) @en
toolkit definition: Aģents, kas iecer un realizē vienības iekļaušanu izstādē vai kolekcijā. @lv
toolkit definition: Een actor die de samenstelling bedenkt of beheert van een item in een tentoonstelling of collectie. @nl
toolkit definition: Egy ágens, amely kigondolja vagy kezeli egy példány begyűjtését egy kiállítás keretébe vagy gyűjteménybe. @hu
toolkit definition: Ein Akteur, der die Aggregation eines Exemplars in einer Ausstellung oder Sammlung konzipiert oder organisiert. @de
toolkit definition: En agent som har idéen til eller håndterer innsamlingen av et eksemplar i en utstilling eller samling. @no
toolkit definition: Tegija, kes kavandab või korraldab eksemplari liitmise näituse või koguga. @et
toolkit definition: Toimija, joka saa aikaan ja hallinnoi näyttelyn tai kokoelman kappaleaggregaatiota. @fi
toolkit definition: Tác nhân tạo lập, tập hợp, hoặc tổ chức triển lãm, bộ sưu tập, hoặc hạng mục khác. @vi
toolkit definition: Una persona, familia o entidad corporativa que concibe, agrega y/o organiza una exhibición, colección u otro ítem. @es
toolkit definition: Ένας φορέας που συλλαμβάνει, συγκεντρώνει ή και οργανώνει μια έκθεση, συλλογή ή άλλο αντίτυπο. @el
toolkit definition: وكيل يطرح أو يدير تجميعة لمفردة في معرض، أو في مجموعة. @ar
toolkit label: Kuratorin/Kurator (Akteur) @de
toolkit label: agent conservador @ca
toolkit label: agent conservateur
toolkit label: agent, som er kurator @da
toolkit label: curador @es
toolkit label: curator agent (Deprecated) @en
toolkit label: curator-actor @nl
toolkit label: curatore agente @it
toolkit label: kuraator (tegija) @et
toolkit label: kuraattori (toimija) @fi
toolkit label: kurator (agent) @no
toolkit label: kurators (aģents) @lv
toolkit label: kurátor ágense: @hu
toolkit label: người trông nom @vi
toolkit label: έφορος @el
toolkit label: وكيل أمين متحف @ar
has subproperty: a pour agent collectionneur
has subproperty: a pour agent catalogueur d’une collection de ressources
has subproperty: a pour personne conservatrice
has subproperty: a pour agent collectif conservateur
has subproperty: P40017
lexical alias: curatorAgent.en
status: Deprecated
type: Property
domain: C10003
label: có người trông nom @vi
label: har agent, som er kurator @da
label: har kurator (agent) @no
label: has curator agent (Deprecated) @en
label: hat Kuratorin/Kurator (Akteur) @de
label: ha come curatore agente @it
label: heeft curator-actor @nl
label: kuraator (tegija) @et
label: kuraattori (toimija) @fi
label: kurators (aģents) @lv
label: kurátor ágense a következő: @hu
label: té com a agent conservador @ca
label: έχει έφορο @el
label: له وكيل أمين متحف @ar
sub property of: a pour agent en relation avec un item
alternative label: Kurator @de
alternative label: conservador @ca
alternative label: conservateur
alternative label: conservator @nl
alternative label: curator @en
alternative label: curatore @it
alternative label: kuraator @et
alternative label: kuraattori @fi
alternative label: kurator @da
alternative label: kurátora: @hu
alternative label: أمين متحف @ar
definition: Correla un item a un agente che concepisce o gestisce l'aggregazione di un item in una mostra o in una raccolta. @it
definition: Hozzákapcsol egy példányt egy ágenshez, amely kigondolja vagy kezeli egy példány begyűjtését egy kiállítás keretébe vagy gyűjteménybe. @hu
definition: Liittää kappaleen toimijaan, joka saa aikaan ja hallinnoi näyttelyn tai kokoelman kappaleaggregaatiota. @fi
definition: Liên kết bản với tác nhân tạo lập, tập hợp, hoặc tổ chức triển lãm, bộ sưu tập, hoặc hạng mục khác. @vi
definition: Met un item en relation avec un agent qui conçoit ou gère l’agrégation d’un item dans une exposition ou une collection.
definition: Relaciona un ítem amb un agent que concep o gestiona l’agregació d’un ítem en una exposició o una col·lecció. @ca
definition: Relateert een item aan een actor die de samenstelling bedenkt of beheert van een item in een tentoonstelling of collectie. @nl
definition: Relaterer et eksemplar til en agent som har idéen til eller håndterer innsamlingen av et eksemplar i en utstilling eller samling. @no
definition: Relaterer et eksemplar til en agent, som udtænker eller administrerer samlingen af et eksemplar til en udstilling eller samling. @da
definition: Relates an item to an agent who conceives or manages the aggregation of an item in an exhibition or collection. (Deprecated) @en

a pour agent propriétaire actuel
has element type: 2
instruction number: 18.5
toolkit definition: Agent que té la propietat legal actual d’un ítem. @ca
toolkit definition: Agent qui possède actuellement et légalement un item.
toolkit definition: Agent, som p.t. er i lovlig besiddelse af et eksemplar. @da
toolkit definition: Agente che detiene l'attuale proprietà giuridica di un item. @it
toolkit definition: An agent who has current legal possession of an item. @en
toolkit definition: Aģents, kas ir vienības pašreizējais likumīgais īpašnieks. @lv
toolkit definition: Bir öğenin mevcut yasal mülkiyetine sahip olan bir temsilci. @tr
toolkit definition: Een actor die huidig wettelijk bezit heeft van een item. @nl
toolkit definition: Egy ágens, amelynek jelenleg jogszerű tulajdonában van egy példány. @hu
toolkit definition: Ein Akteur, der derzeit im rechtmäßigen Besitz eines Exemplars ist. @de
toolkit definition: En agent som for tiden er den rettmessige eieren av et eksemplar. @no
toolkit definition: Tegija, kellele praegu õiguspäraselt eksemplar kuulub. @et
toolkit definition: Toimija, joka tällä hetkellä laillisesti omistaa kappaleen. @fi
toolkit definition: Tác nhân hiện đang sở hữu theo pháp luật một bản. @vi
toolkit definition: Una persona, familia o entidad corporativa que actualmente tiene la posesión legal de un ítem. @es
toolkit definition: Ένας φορέας, ο οποίος επί του παρόντος έχει τη νόμιμη κατοχή ενός αντιτύπου. @el
toolkit definition: وكيل لديه حاليا الملكية القانونية لمفردة. @ar
toolkit definition: 拥有对一个单件当前法定所有权的一个行为者 @zh-hans
toolkit label: Gegenwärtige Eigentümerin/Gegenwärtiger Eigentümer (Akteur) @de
toolkit label: agent propietari actual @ca
toolkit label: agent propriétaire actuel
toolkit label: agent, som er nuværende ejer @da
toolkit label: current owner agent @en
toolkit label: huidige eigenaar-actor @nl
toolkit label: jelenlegi tulajdonos ágense: @hu
toolkit label: người chủ hiện tại @vi
toolkit label: nykyinen omistaja (toimija) @fi
toolkit label: nåværende eier (agent) @no
toolkit label: pašreizējais īpašnieks (aģents) @lv
toolkit label: praegune omanik (tegija) @et
toolkit label: propietario actual @es
toolkit label: proprietario attuale agente @it
toolkit label: şu anki sahibi olan temsi̇lci̇ @tr
toolkit label: τρέχων ιδιοκτήτης @el
toolkit label: وكيل مالك حالي @ar
toolkit label: 当前拥有者行为者 @zh-hans
has subproperty: a pour agent déposant
has subproperty: a pour personne propriétaire actuelle
has subproperty: a pour agent collectif propriétaire actuel
has subproperty: P40018
lexical alias: currentOwnerAgent.en
status: Published
type: Property
domain: C10003
label: có người chủ hiện tại @vi
label: har agent, som er nuværende ejer @da
label: har nåværende eier (agent) @no
label: has current owner agent @en
label: hat gegenwärtige Eigentümerin/gegenwärtigen Eigentümer (Akteur) @de
label: ha come proprietario attuale agente @it
label: heeft huidige eigenaar-actor @nl
label: jelenlegi tulajdonos ágense a következő: @hu
label: mevcut sahip temsilcisi ile ilişkilidir @tr
label: nykyinen omistaja (toimija) @fi
label: pašreizējais īpašnieks (aģents) @lv
label: praegune omanik (tegija) @et
label: té com a agent propietari actual @ca
label: έχει τρέχοντα ιδιοκτήτη @el
label: له وكيل مالك حالي @ar
label: 有当前拥有者行为者 @zh-hans
sub property of: a pour agent propriétaire
alternative label: Gegenwärtiger Eigentümer @de
alternative label: current owner @en
alternative label: dueño actual @es
alternative label: jelenlegi tulajdonosa: @hu
alternative label: nuværende ejer @da
alternative label: nykyinen omistaja @fi
alternative label: nåværende eier @no
alternative label: praegune omanik @et
alternative label: propietari actual @ca
alternative label: proprietario attuale @it
alternative label: propriétaire actuel
alternative label: şu anki sahibi @tr
alternative label: مالك حالي @ar
alternative label: 当前拥有者 @zh-hans
definition: Bir kopyayı, bir kopyanın mevcut yasal mülkiyetine sahip olan bir temsilciyle ilişkilendirir. @tr
definition: Correla un item a un agente che detiene l'attuale proprietà giuridica di un item. @it

a pour ancien agent propriétaire
has element type: 2
instruction number: 18.5
toolkit definition: Agent que té la propietat legal anterior d’un ítem. @ca
toolkit definition: Agent qui a auparavant possédé légalement un item.
toolkit definition: Agent, som tidligere har været i lovlig besiddelse af et eksemplar. @da
toolkit definition: Agente che ha detenuto in precedenza la proprietà giuridica di un item. @it
toolkit definition: An agent who has former legal possession of an item. @en
toolkit definition: Aģents, kam vienība iepriekš ir bijusi juridiskā īpašumā. @lv
toolkit definition: Bir öğenin daha önceki yasal mülkiyetine sahip olan bir temsilci. @tr
toolkit definition: Een actor die voormalig wettelijk bezit heeft van een item. @nl
toolkit definition: Egy ágens, amelynek jelenleg jogszerű tulajdonában van egy példány. @hu
toolkit definition: Ein Akteur, der früher im rechtmäßigen Besitz eines Exemplars war. @de
toolkit definition: En agent som tidligere var den rettmessige eieren av et eksemplar. @no
toolkit definition: Tegija, kellele eksemplar varem õiguspäraselt kuulus. @et
toolkit definition: Toimija, joka on aiemmin laillisesti omistanut kappaleen. @fi
toolkit definition: Tác nhân trước đây đã sở hữu theo pháp luật một bản. @vi
toolkit definition: Una persona, familia o entidad corporativa que tuvo anteriormente la posesión legal de un ítem. @es
toolkit definition: Ένας φορέας ο οποίος είχε προηγούμενα τη νόμιμη κατοχή ενός αντιτύπου. @el
toolkit definition: وكيل لديه سابقا ملكية قانونية لمفردة @ar
toolkit definition: 拥有对一个单件先前法定所有权的一个行为者 @zh-hans
toolkit label: Frühere Eigentümerin/Früherer Eigentümer (Akteur) @de
toolkit label: agent propietari anterior @ca
toolkit label: agent, som er tidligere ejer @da
toolkit label: agrākais īpašnieks (aģents) @lv
toolkit label: aiempi omistaja (toimija) @fi
toolkit label: ancien agent propriétaire
toolkit label: endine omanik (tegija) @et
toolkit label: former owner agent @en
toolkit label: korábbi tulajdonos ágense: @hu
toolkit label: người chủ trước đây @vi
toolkit label: propietario anterior @es
toolkit label: proprietario precedente agente @it
toolkit label: tidligere eier (agent) @no
toolkit label: voormalige eigenaar-actor @nl
toolkit label: önceki sahibi olan temsilci @tr
toolkit label: προηγούμενος ιδιοκτήτης @el
toolkit label: وكيل مالك سابق @ar
toolkit label: 先前拥有者行为者 @zh-hans
has subproperty: a pour agent donateur
has subproperty: a pour agent vendeur
has subproperty: a pour ancienne personne propriétaire
has subproperty: a pour ancien agent collectif propriétaire
has subproperty: P40019
lexical alias: formerOwnerAgent.en
status: Published
type: Property
domain: C10003
label: agrākais īpašnieks (aģents) @lv
label: aiempi omistaja (toimija) @fi
label: có người chủ trước đây @vi
label: endine omanik (tegija) @et
label: eski sahip temsilcisi ile ilişkilidir @tr
label: har agent, som er tidligere ejer @da
label: har tidligere eier (agent) @no
label: has former owner agent @en
label: hat frühere Eigentümerin/früheren Eigentümer (Akteur) @de
label: ha come proprietario precedente agente @it
label: heeft voormalige eigenaar-actor @nl
label: korábbi tulajdonos ágense a következő: @hu
label: té com a agent propietari anterior @ca
label: έχει προηγούμενο ιδιοκτήτη @el
label: له وكيل مالك سابق @ar
label: 有先前拥有者行为者 @zh-hans
sub property of: a pour agent propriétaire
alternative label: Früherer Eigentümer @de
alternative label: aikaisempi omistaja @fi
alternative label: ancien propriétaire
alternative label: dueño actual @es
alternative label: endine omanik @et
alternative label: former owner @en
alternative label: korábbi tulajdonosa: @hu
alternative label: propietari anterior @ca
alternative label: proprietario precedente @it
alternative label: tidligere eier @no
alternative label: tidligere ejer @da
alternative label: önceki sahibi @tr
alternative label: مالك سابق @ar
alternative label: 先前拥有者 @zh-hans
definition: Bir kopyayı, bir kopyanın daha önceki yasal mülkiyetine sahip olan bir temsilciyle ilişkilendirir. @tr

a pour agent dépositaire
has element type: 2
instruction number: 22.3
toolkit definition: Agent que té la custodia legal d’un ítem. @ca
toolkit definition: Agent à qui est confiée la garde légale d’un item.
toolkit definition: Agent, der lovligt har et eksemplar i forvaring. @da
toolkit definition: Agente che ha la custodia giuridica di un item. @it
toolkit definition: An agent who has legal custody of an item. @en
toolkit definition: Aģents, kas likumīgi glabā vienību. @lv
toolkit definition: Bir öğenin yasal velayetine sahip olan bir temsilci. @tr
toolkit definition: Een actor die van rechtswege een item bewaart. @nl
toolkit definition: Egy ágens, amely egy példány törvényes megőrzője. @hu
toolkit definition: Ein Akteur, dem die rechtmäßige Verwahrung eines Exemplars obliegt. @de
toolkit definition: En agent som har et eksemplar i lovlig forvaring. @no
toolkit definition: Tegija, kelle õiguspärasel vastutaval hoiul eksemplar on. @et
toolkit definition: Toimija, jolla on kappaleen laillinen säilyttämisoikeus. @fi
toolkit definition: Tác nhân giám hộ theo pháp luật một bản. @vi
toolkit definition: Una persona, familia o entidad corporativa que tiene la custodia legal de un ítem. @es
toolkit definition: Ένας φορέας ο οποίος έχει τη νόμιμη επιμέλεια φύλαξης ενός αντιτύπου. @el
toolkit definition: وكيل لديه الوصاية القانونية على مفردة @ar
toolkit definition: 对一个单件拥有合法保管权的一个行为者 @zh-hans
toolkit label: Verwahrerin/Verwahrer (Akteur) @de
toolkit label: agent dipositari @ca
toolkit label: agent dépositaire
toolkit label: agent, som er forvalter @da
toolkit label: curatele-actor @nl
toolkit label: custodian agent @en
toolkit label: custodio @es
toolkit label: depositario agente @it
toolkit label: förvaltare @sv
toolkit label: koruyucu temsilci @tr
toolkit label: letétkezelő ágense: @hu
toolkit label: người giám hộ @vi
toolkit label: oppbevarer (agent) @no
toolkit label: pārvaldītājs (aģents) @lv
toolkit label: säilyttäjä (toimija) @fi
toolkit label: vastutav hoidja (tegija) @et
toolkit label: θεματοφύλακας @el
toolkit label: وكيل وصى @ar
toolkit label: 保管者行为者 @zh-hans
has subproperty: a pour personne dépositaire
has subproperty: a pour agent collectif dépositaire
has subproperty: P40020
lexical alias: custodianAgent.en
status: Published
type: Property
domain: C10003
label: có người giám hộ @vi
label: har agent, som er forvalter @da
label: har förvaltare @sv
label: har oppbevarer (agent) @no
label: has custodian agent @en
label: hat Verwahrerin/Verwahrer (Akteur) @de
label: ha come depositario agente @it
label: heeft curatele-actor @nl
label: koruyucu temsilcisi ile ilişkilidir @tr
label: letétkezelő ágense a következő: @hu
label: pārvaldītājs (aģents) @lv
label: säilyttäjä (toimija) @fi
label: té com a agent dipositari @ca
label: vastutav hoidja (tegija) @et
label: έχει θεματοφύλακα @el
label: له وكيل وصى @ar
label: 有保管者行为者 @zh-hans
sub property of: a pour agent en relation avec un item
alternative label: Verwahrer @de
alternative label: custodian @en
alternative label: custodio @es
alternative label: depositario @it
alternative label: dipositari @ca
alternative label: dépositaire
alternative label: forvalter @da
alternative label: koruyucu @tr
alternative label: letétkezelője: @hu
alternative label: oppbevarer @no
alternative label: säilyttäjä @fi
alternative label: vastutav hoidja @et
alternative label: موصى @ar
alternative label: 保管者 @zh-hans
definition: Bir kopyayı, bir kopyanın yasal mülkiyetine sahip olan bir temsilciyle ilişkilendirir. @tr

a pour agent propriétaire
has element type: 2
instruction number: 22.2
toolkit definition: Agent que té la propietat legal actual o anterior d’un ítem. @ca
toolkit definition: Agent qui possède actuellement ou a auparavant possédé légalement un item.
toolkit definition: Agent, som er i lovlig besiddelse af et eksemplar. @da
toolkit definition: Agente che ha la proprietà giuridica di un item. @it
toolkit definition: An agent who has current or former legal possession of an item. @en
toolkit definition: Aģents, kam ir vai ir bijušas likumīgas tiesības uz īpašumu. @lv
toolkit definition: Bir öğenin mevcut veya daha önceki yasal mülkiyetine sahip olan bir temsilci. @tr
toolkit definition: Een actor die huidig of voormalig wettelijk bezit heeft van een item. @nl
toolkit definition: Egy ágens, amely törvényesen birtokol egy példányt. @hu
toolkit definition: Ein Akteur, der gegenwärtig oder früher im rechtmäßigen Besitz eines Exemplars ist/war. @de
toolkit definition: En agent som er den rettmessige eieren av et eksemplar. @no
toolkit definition: Tegija, kellele eksemplar praegu õiguspäraselt kuulub või varem kuulus. @et
toolkit definition: Toimija, jolla on kappaleen laillinen omistusoikeus. @fi
toolkit definition: Tác nhân sở hữu theo pháp luật một bản. @vi
toolkit definition: Una persona, familia o entidad corporativa que detenta la posesión legal de un ítem (es decir, una copia específica o una instancia de un recurso). @es
toolkit definition: Ένας φορέας που έχει τη νόμιμη κατοχή ενός αντιτύπου. @el
toolkit definition: وكيل لديه حاليا الملكية القانونية لمفردة. @ar
toolkit definition: 拥有对一个单件当前或先前法定所有权的一个行为者 @zh-hans
toolkit label: Eigentümerin/Eigentümer (Akteur) @de
toolkit label: Sahip temsilci @tr
toolkit label: agent propietari @ca
toolkit label: agent propriétaire
toolkit label: agent, som er ejer @da
toolkit label: eier (agent) @no
toolkit label: eigenaar-actor @nl
toolkit label: người chủ @vi
toolkit label: omanik (tegija) @et
toolkit label: omistaja (toimija) @fi
toolkit label: owner agent @en
toolkit label: propietario @es
toolkit label: proprietario agente @it
toolkit label: tulajdonos ágense: @hu
toolkit label: ägare @sv
toolkit label: īpašnieks (aģents) @lv
toolkit label: ιδιοκτήτης @el
toolkit label: وكيل مالك @ar
toolkit label: 拥有者行为者 @zh-hans
has subproperty: a pour agent propriétaire actuel
has subproperty: a pour ancien agent propriétaire
has subproperty: a pour personne propriétaire
has subproperty: a pour agent collectif propriétaire
has subproperty: P40021
lexical alias: ownerAgent.en
status: Published
type: Property
domain: C10003
label: có người chủ @vi
label: ha come proprietario agente @it
label: har agent, som er ejer @da
label: har eier (agent) @no
label: har ägare @sv
label: has owner agent @en
label: hat Eigentümerin/Eigentümer (Akteur) @de
label: heeft eigenaar-actor @nl
label: omanik (tegija) @et
label: omistaja (toimija) @fi
label: sahip temsilcisi ile ilişkilidir @tr
label: tulajdonos ágense a következő: @hu
label: té com a agent propietari @ca
label: īpašnieks (aģents) @lv
label: έχει ιδιοκτήτη @el
label: له وكيل مالك @ar
label: 有拥有者行为者 @zh-hans
sub property of: a pour agent en relation avec un item
alternative label: Eigentümer @de
alternative label: Sahip @tr
alternative label: dueño @es
alternative label: eier @no
alternative label: ejer @da
alternative label: omanik @et
alternative label: omistaja @fi
alternative label: owner @en
alternative label: propietari @ca
alternative label: proprietario @it
alternative label: propriétaire
alternative label: tulajdonosa: @hu
alternative label: مالك @ar

a pour agent honoré d’un item
has element type: 2
instruction number: 18.5
toolkit definition: Agent que és homenatjat en un ítem. @ca
toolkit definition: Agent qui est honoré par un item.
toolkit definition: Agent, som er hædret i et eksemplar. @da
toolkit definition: Agente onorato da un item. @it
toolkit definition: An agent who is honoured by an item. @en
toolkit definition: Aģents, kas godināts ar vienību. @lv
toolkit definition: Bir kopyayla onurlandırılan bir temsilci. @tr
toolkit definition: Een actor die geëerd wordt door een item. @nl
toolkit definition: Egy ágens, amelyet egy példány méltat. @hu
toolkit definition: Ein Akteur, der durch ein Exemplar geehrt wird. @de
toolkit definition: En agent som beæres av et eksemplar. @no
toolkit definition: Tegija, keda eksemplariga austatakse. @et
toolkit definition: Toimija, jota kappaleella kunnioitetaan. @fi
toolkit definition: Tác nhân được thể hiện kính trong bởi một bản. @vi
toolkit definition: Una persona, familia o entidad corporativa en cuyo honor se realiza un ítem, por ej., una persona a la cual se le brinda una copia. @es
toolkit definition: Ένας φορέας τιμώμενος σε ένα αντίτυπο. @el
toolkit definition: وكيل هو مُكرم بمفردة. @ar
toolkit definition: 被一个单件纪念的一个行为者 @zh-hans
toolkit label: Gefeierte/Gefeierter eines Exemplars (Akteur) @de
toolkit label: agent beæret av eksemplar @no
toolkit label: agent homenatjat d’un ítem @ca
toolkit label: agent honoré d’un item
toolkit label: agent, som er beæret i eksemplar @da
toolkit label: ar vienību godinātais aģents @lv
toolkit label: eksemplari austusavalduse saaja (tegija) @et
toolkit label: geëerde-actor van item @nl
toolkit label: homenajeado en el ítem @es
toolkit label: honouree agent of item @en
toolkit label: kappaleella kunnioitettu toimija @fi
toolkit label: kopyanın onurlandırılan temsilcisi ile ilişkilidir @tr
toolkit label: người kính trọng (bản) @vi
toolkit label: onorato agente da item @it
toolkit label: példány méltatott ágense a következő: @hu
toolkit label: τιμώμενο πρόσωπο (αντίτυπο) @el
toolkit label: وكيل مكرم بمفردة @ar
toolkit label: 单件的被纪念者行为者 @zh-hans
has subproperty: a pour personne honorée d’un item
has subproperty: a pour agent collectif honoré d’un item
has subproperty: P40022
lexical alias: honoureeAgentOfItem.en
status: Published
type: Property
domain: C10003
label: ar vienību godinātais aģents @lv
label: có người kính trọng của bản @vi
label: eksemplari austusavalduse saaja (tegija) @et
label: har agent beæret av eksemplar @no
label: har agent, som er beæret i eksemplar @da
label: has honouree agent of item @en
label: hat Gefeierte/Gefeierten eines Exemplars (Akteur) @de
label: ha come onorato agente di item @it
label: heeft geëerde-actor van item @nl
label: kappaleella kunnioitettu toimija @fi
label: kopyanın onurlandırılan temsilcisi ile ilişkilidir @tr
label: példány méltatott ágense a következő: @hu
label: té com a agent homenatjat d’un ítem @ca
label: έχει τιμώμενο πρόσωπο (αντίτυπο) @el
label: له وكيل مكرم بمفردة @ar
label: 有单件的被纪念者行为者 @zh-hans
sub property of: a pour agent en relation avec un item
alternative label: Gefeierter (Exemplar) @de
alternative label: agent honoré (item)
alternative label: beæret av eksemplar @no
alternative label: eksemplari austusavalduse saaja @et
alternative label: homenajeado (ítem) @es
alternative label: homenajeado de ítem @es
alternative label: honoree of item @en
alternative label: honouree (item) @en
alternative label: hædersperson i eksemplar @da
alternative label: méltatottja (példány): @hu
alternative label: méltatottja a következő példánynak: @hu
alternative label: onorato da item @it
alternative label: مُكرَم (مفردة) @ar
alternative label: 单件的被纪念者 @zh-hans
alternative label: 被纪念者（单件） @zh-hans
definition: Bir kopyayı, bir kopya tarafından onurlandıran bir temsilciyle ilişkilendirir. @tr
definition: Correla un item a un agente onorato da un item. @it

a pour autre agent associé à un item
has element type: 3
instruction number: 22.4
toolkit definition: Agent bortset fra en ejer eller forvalter, der er knyttet til et eksemplar. @da
toolkit definition: Agent diferent d’un propietari o un dipositari associat amb un ítem. @ca
toolkit definition: Agent, autre qu’un propriétaire ou un dépositaire, associé à un item.
toolkit definition: An agent other than an owner or custodian who is associated with an item. (Deprecated) @en
toolkit definition: Egy ágens (személy, család vagy testület), aki/amely nem a tulajdonos vagy az őrző, aki/amely kötődik egy példányhoz. @hu
toolkit definition: Ein Akteur, der mit einem Exemplar in Verbindung steht, aber nicht der Eigentümer oder der Verwahrer ist. @de
toolkit definition: En agent som forbindes med et eksemplar og som ikke er en eier eller oppbevarer. @no
toolkit definition: Kappaleeseen liittyvä muu toimija, joka ei ole kappaleen omistaja tai säilyttäjä. @fi
toolkit definition: Tác nhân liên quan tới bản, khác với người chủ hoặc người giám hộ. @vi
toolkit definition: Una persona, familia o entidad corporativa (diferente a un propietario o custodio), asociada con un ítem. @es
toolkit definition: Ένας φορέας άλλος από τον ιδιοκτήτη ή τον θεματοφύλακα ο οποίος συνδέεται με ένα αντίτυπο. @el
toolkit label: Sonstiger Akteur der mit einem Exemplar in Verbindung steht @de
toolkit label: altre agent associat amb un ítem @ca
toolkit label: anden agent knyttet til et eksemplar @da
toolkit label: annen agent som forbindes med eksemplar @no
toolkit label: autre agent associé à un item
toolkit label: kappaleeseen liittyvä muu toimija @fi
toolkit label: other agent associated with item (Deprecated) @en
toolkit label: otra persona, familia o entidad corporativa asociada con un ítem @es
toolkit label: példányhoz kötődő másik ágens @hu
toolkit label: tác nhân khác của bản @vi
toolkit label: övrig person, familj/släkt eller institution knuten till ett exemplar @sv
toolkit label: άλλος φορέας συνδεδεμένος με το αντίτυπο @el
has subproperty: P40023
lexical alias: otherAgentItem.en
status: Deprecated
type: Property
domain: C10003
label: có tác nhân khác của bản @vi
label: har anden person, familie eller korporation knyttet til et eksemplar @da
label: har övrig person, familj/släkt eller institution knuten till ett exemplar @sv
label: has other agent associated with item (Deprecated) @en
label: hat sonstigen Akteur, der mit einem Exemplar in Verbindung steht @de
label: kappaleeseen liittyvä muu toimija @fi
label: té com a altre agent associat amb un ítem @ca
label: van más, a példányhoz kötődő ágense @hu
label: έχει άλλον φορέα συνδεδεμένο με το αντίτυπο @el
sub property of: a pour agent en relation avec un item
definition: Egy példányt hozzákapcsol egy ágenshez (személyhez, családhoz vagy testülethez), aki/amely más, mint a példányhoz kötődő tulajdonos vagy őrző. @hu
definition: Liittää kappaleen muuhun toimijaan, joka ei ole kappaleen omistaja tai säilyttäjä. @fi
definition: Liên kết bản với tác nhân liên quan tới bản, khác với người chủ hoặc người giám hộ. @vi
definition: Met un item en relation avec un agent, autre qu’un propriétaire ou un dépositaire, associé à un item.
definition: Relaciona un item amb un agent diferent d’un propietari o un dipositari associat amb un ítem. @ca
definition: Relaterer et eksemplar til en agent bortset fra en ejer eller forvalter, der er knyttet til et eksemplar. @da
definition: Relates an item to an agent other than an owner or custodian who is associated with an item. (Deprecated) @en
definition: Setzt ein Exemplar mit einem Akteur, der mit einem Exemplar in Verbindung steht, aber nicht der Eigentümer oder der Verwahrer ist, in Beziehung. @de
definition: Συνδέει ένα αντίτυπο με έναν φορέα άλλον από τον ιδιοκτήτη ή τον θεματοφύλακα ο οποίος συνδέεται με ένα αντίτυπο. @el
scope note: Curators, binders, restorationists, etc., are included. (Deprecated) @en
scope note: Dazu gehören Kuratoren, Buchbinder, Restauratoren usw. @de
scope note: Inclou els conservadors, els enquadernadors, els restauradors, etc. @ca
scope note: Kappaleeseen liittyviin muihin toimijoihin kuuluvat kuraattorit, kirjansitojat, restauroijat jne. @fi
scope note: Kuratorer, bogbindere, konservatorer etc, er omfattet. @da
scope note: Kurátorok, könyvkötők, restaurátorok stb. beletartoznak. @hu
scope note: Người trông nom, người đóng sách, người phục chế, v.v..., được bao gồm. @vi
scope note: Sont inclus les conservateurs, les relieurs, les restaurateurs, etc.
scope note: Περιλαμβάνονται επιμελητές έκθεσης, βιβλιοδέτες, συντηρητές κ.λπ. @el

a pour agent restaurateur d’un item
has element type: 2
instruction number: 18.5
toolkit definition: Agent que és responsable del conjunt de procediments tècnics, editorials i intel·lectuals destinats a compensar la degradació d’un ítem retornant-lo a un estat que s’aproximi al màxim a la seva condició original. @ca
toolkit definition: Agent qui est responsable de l’ensemble des procédures techniques, éditoriales et intellectuelles destinées à compenser la dégradation d’un item en le ramenant à un état aussi près que possible de sa condition originelle.
toolkit definition: Agent, som er ansvarlig for en række af tekniske, redaktionelle og intellektuelle procedurer, som forsøger at kompensere for nedslidningen af et eksemplar ved at føre det tilbage til en tilstand, der er så tæt som muligt på dets oprindelige tilstand. @da
toolkit definition: Agente responsabile dell'insieme delle procedure tecniche, di cura e intellettuali finalizzate al risarcimento di un item in seguito alla sua degradazione, riportandolo a uno stato il più possibile vicino alla condizione originale. @it
toolkit definition: An agent who is responsible for the set of technical, editorial, and intellectual procedures aimed at compensating for the degradation of an item by bringing it back to a state as close as possible to its original condition. @en
toolkit definition: Aģents, kas ir atbildīgs par tehnisko, redakcionālo un intelektuālo procedūru kopumu, kuru mērķis ir kompensēt vienības pakāpenisko bojāeju, atgriežot to, cik vien iespējams, tuvu tās sākotnējam stāvoklim. @lv
toolkit definition: Bir öğenin bozulmasını orijinal durumuna mümkün olduğunca yakın bir duruma geri getirerek telafi etmeyi amaçlayan bir dizi teknik, editoryal ve entelektüel prosedürden sorumlu bir temsilci. @tr
toolkit definition: Een actor die verantwoordelijk is voor de verzameling van technische, redactionele en intellectuele procedures gericht op het corrigeren van de achteruitgang van een item door het zo goed mogelijk terug te brengen tot de oorspronkelijke staat. @nl
toolkit definition: Egy ágens, amely felelős technikai, szerkesztői és intellektuális eljárások összességéért, amelyek célja egy példány romlásának ellensúlyozása, amivel azt az eredeti állapotához a lehető legközelebb képesek visszahozni. @hu
toolkit definition: Ein Akteur, der für die technischen, redaktionellen und intellektuellen Verfahren verantwortlich ist, die darauf abzielen, die Zersetzung eines Exemplars auszugleichen, indem es in einen Zustand zurückversetzt wird, der seiner ursprünglichen Beschaffenheit möglichst nahe kommt. @de
toolkit definition: En agent som har ansvar for de tekniske og intellektuelle metodene som brukes for å kompensere for nedbrytningen av et eksemplar ved å restaurere det til en tilstand som er så lik originaltilstanden som mulig. @no
toolkit definition: Tegija, kes vastutab rea tehniliste, toimetuslike ja intellektuaalsete toimingute eest, mille eesmärk on taastada kahjustatud eksemplari seisund võimalikult originaalseisundi lähedaseks. @et
toolkit definition: Toimija, joka vastaa teknisistä, toimituksellisista ja tiedollisista toimenpiteistä, joiden tarkoitus on palauttaa huonokuntoinen kappale mahdollisimman lähelle sen alkuperäistä kuntoa. @fi
toolkit definition: Tác nhân có trách nhiệm tới chuỗi các quy trình kỹ thuật, biên tập, và trí tuệ trong việc khắc phục sự xuống cấp của bản bằng cách đưa nó về trạng thái gần giống nhất có thể với điều kiện nguyên gốc. @vi
toolkit definition: Una persona, familia o entidad corporativa responsable del conjunto de procedimientos técnicos, editoriales e intelectuales orientados a compensar la degradación de un ítem devolviéndolo a un estado lo más cercano posible a su estado original. @es
toolkit definition: Ένας φορέας υπεύθυνος για το σύνολο των τεχνικών, συντακτικών και διανοητικών διαδικασιών που στοχεύουν στην αποκατάσταση της αποδόμησης ενός αντιτύπου επαναφέροντάς το όσο το δυνατόν εγγύτερα στην αρχική του κατάσταση. @el
toolkit definition: وكيل مسئول عن مجموعة الإجراءات الفنية، والتحريرية، والفكرية التي تهدف إلى إصلاح التدهور الذي لحق بمفردة وإعادتها إلى حالة أقرب ما تكون إلى حالتها الأصلية. @ar
toolkit definition: 负责为弥补单件的损毁而担负一系列技术、编辑和智力操作、使之尽可能恢复到原始状态的一个行为者 @zh-hans
toolkit label: Restauratorin/Restaurator eines Exemplars (Akteur) @de
toolkit label: agent restaurador d’un ítem @ca
toolkit label: agent restaurateur d’un item
toolkit label: agent, som er konservator af eksemplar @da
toolkit label: eksemplari restaureerija (tegija) @et
toolkit label: kappaleen entisöijä (toimija) @fi
toolkit label: konservator for eksemplar (agent) @no
toolkit label: kopyanın restorasyon uzmanı temsilcisi @tr
toolkit label: người phục chế (bản) @vi
toolkit label: példány restaurátor ágense: @hu
toolkit label: restaurador @es
toolkit label: restaurator-actor van item @nl
toolkit label: restauratore di item agente @it
toolkit label: restorationist agent of item @en
toolkit label: vienības restaurators (aģents) @lv
toolkit label: συντηρητής (αντίτυπο) @el
toolkit label: وكيل مرمم لمفردة @ar
toolkit label: 单件的修复者行为者 @zh-hans
has subproperty: a pour personne restauratrice d’un item
has subproperty: a pour agent collectif restaurateur d’un item
has subproperty: P40024
lexical alias: restorationistAgentOfItem.en
status: Published
type: Property
domain: C10003
label: có người phục chế (bản) @vi
label: eksemplari restaureerija (tegija) @et
label: har agent, som er konservator af eksemplar @da
label: har konservator for eksemplar (agent) @no
label: has restorationist agent of item @en
label: hat Restauratorin/Restaurator eines Exemplars (Akteur) @de
label: ha come restauratore agente di item @it
label: heeft restaurator-actor van item @nl
label: kappaleen entisöijä (toimija) @fi
label: kopyanın restorasyon uzmanı temsilcisi ile ilişkilidir @tr
label: példány restaurátor ágense a következő: @hu
label: té com a agent restaurador d’un ítem @ca
label: vienības restaurators (aģents) @lv
label: έχει συντηρητή (αντίτυπο) @el
label: له وكيل مرمم لمفردة @ar
label: 有单件的修复者行为者 @zh-hans
sub property of: a pour agent modificateur
alternative label: (kopya) restorasyon uzmanı @tr
alternative label: Restaurator (Exemplar) @de
alternative label: eksemplari ennistaja @et
alternative label: eksemplari restaureerija @et
alternative label: entisöijä (kappale) @fi
alternative label: konservator af eksemplar @da
alternative label: konservator for eksemplar @no
alternative label: példány restaurátora @hu
alternative label: restauracionista (ítem) @es
alternative label: restaurador de (ítem) @ca
alternative label: restaurateur (item)
alternative label: restauratore di item @it
alternative label: restorationist (item) @en
alternative label: مُرمم (مفردة) @ar
alternative label: 修复者（单件） @zh-hans
definition: Bir kopyayı,orijinal durumuna mümkün olduğunca yakın bir duruma geri getirerek bir kopyanın bozulmasını telafi etmeyi amaçlayan bir dizi teknik, yayın ve entelektüel prosedürden sorumlu olan bir temsilciyle ilişkilendirir. @tr
definition: Correla un item all'agente responsabile dell'insieme delle procedure tecniche, di cura e intellettuali finalizzate al risarcimento di un item in seguito alla sua degradazione, riportandolo a uno stato il più possibile vicino alla condizione originale. @it

a pour agent dédicataire d’un item
has element type: 2
instruction number: 18.5
toolkit definition: Agent a qui es dedica un ítem. @ca
toolkit definition: Agent à qui un item est dédié.
toolkit definition: Agent, som et eksemplar er tilegnet. @da
toolkit definition: Agente al quale un item è dedicato. @it
toolkit definition: An agent to whom an item is dedicated. @en
toolkit definition: Aģents, kam ir veltīta vienība. @lv
toolkit definition: Bir öğenin ithaf edildiği bir temsilci. @tr
toolkit definition: Een actor aan wie een item is opgedragen. @nl
toolkit definition: Egy ágens, amelynek a példányt dedikálják. @hu
toolkit definition: Ein Akteur, dem ein Exemplar gewidmet ist. @de
toolkit definition: En agent som et eksemplar er dedisert til. @no
toolkit definition: Tegija, kellele eksemplar on pühendatud. @et
toolkit definition: Toimija, jolle kappale on omistettu. @fi
toolkit definition: Tác nhân mà bản đề tặng. @vi
toolkit definition: Una persona, familia o entidad corporativa a la cual se dedica un ítem. @es
toolkit definition: Ένας φορέας στον οποίο είναι αφιερωμένο ένα αντίτυπο. @el
toolkit definition: وكيل أُهديت إليه مفردة. @ar
toolkit definition: 一个单件被题献给的一个行为者 @zh-hans
toolkit label: Widmungsempfängerin/Widmungsempfänger eines Exemplars (Akteur) @de
toolkit label: agent dedicatari d’un ítem @ca
toolkit label: agent dédicataire d’un item
toolkit label: agent, som er tilegnet af eksemplar @da
toolkit label: dedicatario agente di item @it
toolkit label: dedicatee agent of item @en
toolkit label: destinatario de dedicatoria en el ítem @es
toolkit label: eksemplari pühenduse saaja (tegija) @et
toolkit label: kappaleen omistuksen kohde (toimija) @fi
toolkit label: kopyanın adandığı temsilci @tr
toolkit label: người được đề tặng (bản) @vi
toolkit label: opgedragen-actor van item @nl
toolkit label: példány dedikált ágense: @hu
toolkit label: tilegnet agent for eksemplar @no
toolkit label: veltījumvienība aģentam @lv
toolkit label: αποδέκτης αφιέρωσης (αντίτυπο) @el
toolkit label: هو وكيل مُهدى إليه مفردة @ar
toolkit label: 单件的被题献者行为者 @zh-hans
has subproperty: a pour personne dédicataire d’un item
has subproperty: a pour agent collectif dédicataire d’un item
has subproperty: P40025
lexical alias: dedicateeAgentOfItem.en
status: Published
type: Property
domain: C10003
label: có người được đề tặng (bản) @vi
label: eksemplari pühenduse saaja (tegija) @et
label: ha come dedicatario agente di item @it
label: har agent, som er tilegnet i eksemplar @da
label: har tilegnet agent for eksemplar @no
label: has dedicatee agent of item @en
label: hat Widmungsempfängerin/Widmungsempfänger eines Exemplars (Akteur) @de
label: heeft opgedragene-actor van item @nl
label: kappaleen omistuksen kohde (toimija) @fi
label: kopyanın ithaf edilen temsilcisi ile ilişkilidir @tr
label: példány dedikált ágense a következő: @hu
label: té com a agent dedicatari d’un ítem @ca
label: veltījumvienība aģentam @lv
label: έχει αποδέκτη αφιέρωσης (αντίτυπο) @el
label: له وكيل مُهدى إليه مفردة @ar
label: 有单件的被题献者行为者 @zh-hans
sub property of: a pour agent en relation avec un item
alternative label: Widmungsempfänger (Exemplar) @de
alternative label: adanmış (kopya) @tr
alternative label: dedicatari de (ítem) @ca
alternative label: dedicatario (ítem) @es
alternative label: dedicatario di item @it
alternative label: dedicatee (item) @en
alternative label: dedikáltja (példány): @hu
alternative label: dédicataire (item)
alternative label: eksemplari dedikatsiooni saaja @et
alternative label: eksemplari pühenduse saaja @et
alternative label: kappale omistettu @fi
alternative label: tilegnelse for eksemplar @no
alternative label: tilegnet af eksemplar @da
alternative label: مُهدى إليه (مفردة) @ar
alternative label: 被题献者（单件） @zh-hans
definition: Bir kopyayı, bir kopyanın ithaf edildiği bir temsilciyle ilişkilendirir. @tr
definition: Correla un item a un agente al quale un item è dedicato. @it

a pour historique de la garde d’un item
has element type: 6
instruction number: 2.18
toolkit definition: A példány korábbi tulajdoni vagy letéti őrzési feljegyzése, amely tartalmaz ágenst, helyet és időtartamot. @hu
toolkit definition: A record of previous ownership or custodianship of an item, including agent, place, and timespan. @en
toolkit definition: Andmed eksemplari varasemate omanike ja vastutavate hoidjate kohta, sealhulgas andmed tegijatest, kohtadest ja ajavahemikest. @et
toolkit definition: Een optekening van voormalig eigenaarschap of curatele van een item, inclusief actor, plaats en tijdspanne. @nl
toolkit definition: Ein Bericht über frühere Eigentümerinnen/Eigentümer oder Verwahrerinnen/Verwahrer eines Exemplars, einschließlich eines Akteurs, eines Geografikums und eines Zeitraums. @de
toolkit definition: En angivelse av tidligere eierforhold eller oppbevaring av et eksemplar, inkludert agent, sted og tidsrom. @no
toolkit definition: Enregistrement de la propriété ou de la garde antérieure d’un item, notamment un agent, un lieu et un laps de temps.
toolkit definition: Ieraksts par vienības iepriekšējiem īpašniekiem vai glabātājiem, ieskaitot aģentu, vietu un laikposmu. @lv
toolkit definition: Optegnelse over tidligere ejerskab eller opbevaring af et eksemplar, inklusiv agent, sted og tidsperiode. @da
toolkit definition: Registrazione di una precedente proprietà o custodia di un item, che comprende agente, luogo e arco di tempo. @it
toolkit definition: Registre dels propietaris anteriors o de la custòdia prèvia d’un ítem, incloent-hi l’agent, el lloc i l’interval de temps. @ca
toolkit definition: Temsilci, yer ve zaman aralığı da dahil olmak üzere bir kopyanın önceki sahipliğinin veya gözetiminin bir kaydı. @tr
toolkit definition: Tiedot kappaleen omistus- tai säilytyshistoriasta, mukaanlukien tiedot toimijoista, paikoista ja ajanjaksoista. @fi
toolkit definition: Un registro de la propiedad anterior o custodia de un ítem. @es
toolkit definition: Với hồ sơ về quyền sở hữu hoặc quyền giám hộ trước đây của bản. @vi
toolkit definition: Μια εγγραφή της προηγούμενης ιδιοκτησίας ή της θεματοφυλακής ενός αντιτύπου. @el
toolkit definition: سجل ملكية أو وصاية سابقة لمفردة، تتضمن وكيلا، ومكانا، و فترة زمنية @ar
toolkit definition: 关于单件以往拥有或保管情况的记录（包括行为者、地点和时间段） @zh-hans
toolkit label: Besitzhistorie eines Exemplars @de
toolkit label: bewaargeschiedenis van item @nl
toolkit label: custodial history of item @en
toolkit label: eksemplari hoiustamise ajalugu @et
toolkit label: historia de la custodia del ítem @es
toolkit label: historique de la garde d’un item
toolkit label: història de custòdia d’un ítem @ca
toolkit label: kappaleen omistushistoria @fi
toolkit label: kopyanın korunma geçmişi @tr
toolkit label: lịch sử giám hộ của bản @vi
toolkit label: oppbevaringshistorikk for eksemplar @no
toolkit label: proveniens @da
toolkit label: példány őrzési története: @hu
toolkit label: storia della custodia di item @it
toolkit label: vienības pārvaldīšanas vēsture @lv
toolkit label: ιστορία του θεματοφύλακα του αντιτύπου @el
toolkit label: تاريخ وصاية على مفردة @ar
toolkit label: 单件的保管历史 @zh-hans
has subproperty: P40026
lexical alias: custodialHistoryOfItem.en
status: Published
type: Property
domain: C10003
label: có lịch sử giám hộ của bản @vi
label: eksemplari hoiustamise ajalugu @et
label: har oppbevaringshistorikk for eksemplar @no
label: har proveniens af eksemplar @da
label: has custodial history of item @en
label: hat Besitzhistorie eines Exemplars @de
label: ha come storia della custodia di item @it
label: heeft bewaargeschiedenis van item @nl
label: kappaleen omistushistoria @fi
label: kopya koruma geçmişi ile ilişkilidir @tr
label: példány őrzési története a következő: @hu
label: té com a història de custòdia d’un ítem @ca
label: vienības pārvaldīšanas vēsture @lv
label: έχει ιστορία θεματοφύλακα του αντιτύπου @el
label: له تاريخ وصاية على مفردة @ar
label: 有单件的保管历史 @zh-hans
definition: Bir kopyayı, temsilci, yer ve zaman aralığı dahil olmak üzere bir öğenin önceki mülkiyeti veya velayet kaydıyla ilişkilendirir. @tr
definition: Correla un item a una registrazione di una precedente proprietà o custodia di un item, che comprende agente, luogo e arco di tempo. @it
definition: Hozzákapcsol egy példányt a példány korábbi tulajdoni vagy letéti őrzési feljegyzéséhez, amely tartalmaz ágenst, helyet és időtartamot. @hu
definition: Liittää kappaleen tietoihin kappaleen omistus- tai säilytyshistoriasta, mukaanlukien tiedot toimijoista, paikoista ja ajanjaksoista. @fi
definition: Liên kết bản với với hồ sơ về quyền sở hữu hoặc quyền giám hộ trước đây của bản. @vi
definition: Met un item en relation avec un enregistrement de la propriété ou de la garde antérieure d’un item, notamment un agent, un lieu et un laps de temps.
definition: Relaciona un ítem amb un registre dels propietaris anteriors o de la custòdia prèvia d’un ítem, incloent-hi l’agent, el lloc i l’interval de temps. @ca
definition: Relateert een item aan een optekening van voormalig eigenaarschap of curatele van een item, inclusief actor, plaats en tijdspanne. @nl
definition: Relaterer et eksemplar til en angivelse av tidligere eierforhold eller oppbevaring av et eksemplar, inkludert agent, sted og tidsrom. @no
definition: Relaterer et eksemplar til en optegnelse over tidligere ejerskab eller opbevaring af et eksemplar, inklusiv agent, sted og tidsperiode. @da
definition: Relates an item to a record of previous ownership or custodianship of an item, including agent, place, and timespan. @en
definition: Sasaista vienību ar ierakstu par vienības iepriekšējiem īpašniekiem vai glabātājiem, ieskaitot aģentu, vietu un laikposmu. @lv
definition: Seostab eksemplari andmetega eksemplari varasemate omanike ja vastutavate hoidjate kohta, sealhulgas andmed tegijatest, kohtadest ja ajavahemikest. @et
definition: Setzt ein Exemplar in Beziehung zu einem Bericht über frühere Eigentümerinnen/Eigentümer oder Verwahrerinnen/Verwahrer eines Exemplars, einschließlich eines Akteurs, eines Geografikums und eines Zeitraums. @de
definition: Συνδέει ένα αντίτυπο με μια εγγραφή της προηγούμενης ιδιοκτησίας ή της θεματοφυλακής ενός αντιτύπου. @el
definition: يربط مفردة بسجل ملكية سابقة أو بوصاية على مفردة، تتضمن وكيلا، ومكانا، وفترة زمنية. @ar
definition: 将一个单件与关于单件以往拥有或保管情况的记录（包括行为者、地点和时间段）关联起来。 @zh-hans

est une reproduction électronique de (item)
instruction number: 24.5
toolkit definition: Analogisessa muodossa oleva kappale, joka on muunnettu digitaaliseen muotoon. @fi
toolkit definition: Bản dưới định dạng tương tự được chuyển sang định dạng số @vi
toolkit definition: Ein Exemplar in einem analogen Format, das in ein digitales Format übertragen wurde. @de
toolkit definition: Eksemplar i et analogt format, der er overført til et digitalt format. @da
toolkit definition: Et eksemplar i et analogt format som overføres til et digitalt format. @no
toolkit definition: Item sur support analogique qui a été transféré dans un format numérique.
toolkit definition: Un ítem en un formato digital que es el resultado de la transferencia de un ítem en un formato analógico. @es
toolkit definition: Ítem en un format analògic que es transfereix a un format digital. @ca
toolkit definition: Ένα αντίτυπο σε ένα αναλογικό μορφότυπο το οποίο μεταφέρεται σε ένα ψηφιακό μορφότυπο. @el
toolkit label: Elektronische Reproduktion von (Exemplar) @de
toolkit label: digitoitu kappaleesta @fi
toolkit label: elektronisk reproduksjon av (eksemplar) @no
toolkit label: elektronisk reproduktion af (eksemplar) @da
toolkit label: phiên bản điện tử của (bản) @vi
toolkit label: reproducció electrònica de (ítem) @ca
toolkit label: reproducción electrónica (ítem) @es
toolkit label: reproduction électronique de (item)
toolkit label: ηλεκτρονική αναπαραγωγή του (αντίτυπο) @el
has subproperty: P40027
lexical alias: electronicReproductionOfItem.en
status: Deprecated
type: Property
domain: C10003
label: digitoitu kappaleesta @fi
label: er elektronisk reproduktion af (eksemplar) @da
label: ist elektronische Reproduktion von (Exemplar) @de
label: là phiên bản điện tử của (bản) @vi
label: és reproducció electrònica de (ítem) @ca
label: είναι ηλεκτρονική αναπαραγωγή του (αντίτυπο) @el
sub property of: est une reproduction de (item)
definition: Liittää kappaleen analogisessa muodossa olevaan kappaleeseen, josta kuvailun kohde on digitoitu. @fi
definition: Liên kết bản với bản dưới định dạng tương tự được chuyển sang định dạng số @vi
definition: Met un item en relation avec un item sur support analogique qui a été transféré dans un format numérique.
definition: Relaciona un item amb un ítem en un format analògic que es transfereix a un format digital. @ca
definition: Relaterer et eksemplar til et eksemplar i et analogt format, der er overført til et digitalt format. @da
definition: Setzt ein Exemplar mit einem Exemplar in einem analogen Format, das in ein digitales Format übertragen wurde, in Beziehung. @de
definition: Συνδέει ένα αντίτυπο με ένα αντίτυπο σε ένα αναλογικό μορφότυπο το οποίο μεταφέρεται σε ένα ψηφιακό μορφότυπο. @el

a pour note sur un item
has element type: 6
instruction number: 2.21
toolkit definition: A broad unstructured description of one or more attributes of an item. @en
toolkit definition: Ampia descrizione non strutturata di uno o più attributi di un item. @it
toolkit definition: Bir kopyanın bir veya daha fazla niteliğinin yapılandırılmamış geniş tanımı. @tr
toolkit definition: Bred, ustruktureret beskrivelse af en eller flere af et eksemplars attributter. @da
toolkit definition: Descripció no estructurada àmplia d’un o més atributs d’un ítem. @ca
toolkit definition: Description non structurée générale d’un ou plusieurs attributs d’un item.
toolkit definition: Een algemene ongestructureerde beschrijving van één of meer attributen van een item. @nl
toolkit definition: Egy példány egy vagy több ismérvének átfogó strukturálatlan leírása. @hu
toolkit definition: Eine umfassende, unstrukturierte Beschreibung eines Merkmals oder mehrerer Merkmale eines Exemplars. @de
toolkit definition: En bred, ustrukturert beskrivelse av ett eller flere attributter for et eksemplar. @no
toolkit definition: Ghi chú cung cấp thông tin về các thuộc tính của bản. @vi
toolkit definition: Plašs nestrukturēts vienības viena vai vairāku atribūtu apraksts. @lv
toolkit definition: Una nota que proporciona información sobre los atributos del ítem. @es
toolkit definition: Yleisluonteinen rakenteistamaton kuvailu, joka sisältää kappaleen yhden tai useamman attribuutin. @fi
toolkit definition: Üldine struktureerimata kirjeldus, mis iseloomustab üht või mitut eksemplari omadust. @et
toolkit definition: Μια σημείωση που παρέχει πληροφορίες σχετικά με τις ιδιότητες ενός αντιτύπου. @el
toolkit definition: وصف واسع غير محدد لخصائص مفردة. @ar
toolkit definition: 关于一个单件的一个或多个属性的宽泛的非结构化的描述 @zh-hans
toolkit label: Anmerkung zum Exemplar @de
toolkit label: anmärkning om exemplaret @sv
toolkit label: ghi chú về bản @vi
toolkit label: huomautus kappaleesta @fi
toolkit label: märkus eksemplari kohta @et
toolkit label: noot bij item @nl
toolkit label: nota sobre el ítem @es
toolkit label: nota sobre un ítem @ca
toolkit label: nota su item @it
toolkit label: note om eksemplar @da
toolkit label: note on item @en
toolkit label: note sur un item
toolkit label: piezīme par vienību @lv
toolkit label: példányra vonatkozó megjegyzése: @hu
toolkit label: Ürün hakkında not @tr
toolkit label: σημείωση στο αντίτυπο @el
toolkit label: تبصرة عن مفردة @ar
toolkit label: 关于单件的附注 @zh-hans
has subproperty: a pour modification d’un item
has subproperty: a pour note sur les dimensions d’un item
has subproperty: a pour note sur l’étendue d’un item
has subproperty: P40028
lexical alias: noteOnItem.en
status: Published
type: Property
domain: C10003
label: có ghi chú về bản @vi
label: har anmärkning om exemplaret @sv
label: har note om eksemplar @da
label: has note on item @en
label: hat Anmerkung zum Exemplar @de
label: ha come nota su item @it
label: heeft noot bij item @nl
label: huomautus kappaleesta @fi
label: kopya hakkında not ile ilişkilidir @tr
label: märkus eksemplari kohta @et
label: piezīme par vienību @lv
label: példányra vonatkozó megjegyzése a következő: @hu
label: té com a nota sobre un ítem @ca
label: έχει σημείωση στο αντίτυπο @el
label: لديه تبصرة لمفردة @ar
label: 有关于单件的附注 @zh-hans
sub property of: P00015
definition: Bir kopyayı, bir kopyanın bir veya daha fazla özelliğinin geniş, yapılandırılmamış açıklamasıyla ilişkilendirir. @tr
definition: Correla un item a un'ampia descrizione non strutturata di uno o più attributi di un item. @it
definition: Hozzákapcsol egy példányt egy példány egy vagy több ismérvének átfogó strukturálatlan leírásához. @hu
definition: Liittää kappaleen yleisluonteiseen rakenteistamattomaan kuvailuun, joka sisältää kappaleen yhden tai useamman attribuutin. @fi
definition: Liên kết bản với ghi chú cung cấp thông tin về các thuộc tính của bản. @vi
definition: Met un item en relation avec une description non structurée générale d’un ou plusieurs attributs d’un item.
definition: Relaciona un ítem amb una descripció no estructurada àmplia d’un o més atributs d’un ítem. @ca
definition: Relateert een item aan een algemene ongestructureerde beschrijving van één of meer attributen van een item. @nl
definition: Relaterer et eksemplar til en bred, ustruktureret beskrivelse af en eller flere af et eksemplars attributter. @da
definition: Relaterer et eksemplar til en bred, ustrukturert beskrivelse av ett eller flere attributter for et eksemplar. @no
definition: Relates an item to a broad unstructured description of one or more attributes of an item. @en
definition: Sasaista vienību ar plašu nestrukturētu vienības viena vai vairāku atribūtu aprakstu. @lv
definition: Seostab eksemplari üldise struktureerimata kirjeldusega, mis iseloomustab üht või mitut eksemplari omadust. @et
definition: Setzt ein Exemplar in Beziehung zu einer umfassenden, unstrukturierten Beschreibung eines Merkmals oder mehrerer Merkmale eines Exemplars. @de
definition: Συνδέει ένα αντίτυπο με μια σημείωση που παρέχει πληροφορίες σχετικά με τις ιδιότητες ενός αντιτύπου. @el
definition: يربط مفردة بوصف واسع غير محدد لخاصية أو أكثر من خصائص مفردة. @ar

est conservé avec
has element type: 2
instruction number: 24.5
toolkit definition: An item that is held in the same collection as an item. @en
toolkit definition: Bir kopyayla aynı koleksiyonda tutulan bir kopya. @tr
toolkit definition: Bản đi kèm với bản khác sau khi được công bố. @vi
toolkit definition: Een item dat is samengebracht met een ander item nadat het is uitgevaardigd. @nl
toolkit definition: Egy példány, amelyet kibocsátás után összevetetnek egy másik példánnyal. @hu
toolkit definition: Ein Exemplar, das mit einem anderen Exemplar nach dem Herausgeben zusammengebracht wurde. @de
toolkit definition: Eksemplar, mis on pärast väljaandmist teise eksemplariga kokku pandud. @et
toolkit definition: Eksemplar, som er ført sammen med et andet eksemplar efter udgivelse. @da
toolkit definition: Et eksemplar som er knyttet til et annet eksemplar etter utgivelse. @no
toolkit definition: Item che è stato unito a un altro item dopo la sua emissione. @it
toolkit definition: Item qui est conservé dans la même collection de ressources qu’un item.
toolkit definition: Kappale, joka on samassa kokoelmassa. @fi
toolkit definition: Un ítem que se ha unido con otro ítem después de su publicación. @es
toolkit definition: Vienība, kas ir salikta kopā ar citu vienību, pēc izdošanas. @lv
toolkit definition: Ítem que és aplegat amb un altre ítem després de la publicació. @ca
toolkit definition: Ένα αντίτυπο το οποίο συνενώνεται με ένα άλλο αντίτυπο μετά την έκδοσή του. @el
toolkit definition: مفردة جُمعت مع مفردة أخرى بعد اصدارها. @ar
toolkit definition: 和一个单件在同一个收藏中的一个单件 @zh-hans
toolkit label: Begleitet von (Exemplar) @de
toolkit label: accompagnato da item @it
toolkit label: acompanyat d’un ítem @ca
toolkit label: acompañado por (ítem) @es
toolkit label: begeleid door item @nl
toolkit label: conservé avec
toolkit label: held with @en
toolkit label: ile birlikte tutulur @tr
toolkit label: izdots kopā ar vienību @lv
toolkit label: kaasasolev eksemplar @et
toolkit label: kíséri ez a példány: @hu
toolkit label: ledsaget af eksemplar @da
toolkit label: ledsaget av eksemplar @no
toolkit label: saman kokoelman kappale @fi
toolkit label: được kèm theo bởi (bản) @vi
toolkit label: συνοδεύεται από (αντίτυπο) @el
toolkit label: مصاحبة لمفردة @ar
toolkit label: 和……一起收藏 @zh-hans
has subproperty: est relié avec
has subproperty: est sur le disque avec un item
has subproperty: est filmé avec un item
has subproperty: P40029
lexical alias: heldWith.en
status: Published
type: Property
domain: C10003
label: er ledsaget af eksemplar @da
label: er ledsaget av eksemplar @no
label: ile birlikte tutulur @tr
label: ir izdots kopā ar vienību @lv
label: is begeleid door item @nl
label: is held with @en
label: ist begleitet von (Exemplar) @de
label: kaasasolev eksemplar @et
label: kíséri a következő példány: @hu
label: saman kokoelman kappale @fi
label: è accompagnato da item @it
label: és acompanyat d’un ítem @ca
label: được kèm theo bởi (bản) @vi
label: συνοδεύεται από (αντίτυπο) @el
label: هي مصاحبة لمفردة @ar
label: 和……一起收藏 @zh-hans
sub property of: a pour item en relation avec un item
alternative label: Begleitende Beziehungen auf Exemplarebene @de
alternative label: Eşlik eden kopya ilişkisi @tr
alternative label: Kopya eşliğinde @tr
alternative label: accompagné d’un item
alternative label: accompanied by item @en
alternative label: accompanying item relationship @en
alternative label: acompañado por ítem @es
alternative label: kísérő típusú példánykapcsolat @hu
alternative label: ledsaget af eksemplar-relation @da
alternative label: relación de ítem acompañante @es
alternative label: relation d’item d’accompagnement
alternative label: علاقة مفردة مصاحبة @ar
alternative label: 伴随单件关系 @zh-hans
alternative label: 被单件伴随 @zh-hans
definition: Bir kopyayı, kopyayla aynı koleksiyonda tutulan bir kopyayla ilişkilendirir. @tr
definition: Correla un item a un item che è stato unito a un altro item dopo la sua emissione. @it

is description of (item) (Deprecated)
instruction number: 24.5
toolkit definition: An item described by a describing work. (Deprecated) @en
toolkit label: description of (item) (Deprecated) @en
has subproperty: is analysis of (item) (Deprecated)
has subproperty: is evaluation of (item) (Deprecated)
has subproperty: is review of (item) (Deprecated)
has subproperty: is critique of (item) (Deprecated)
has subproperty: is commentary on (item) (Deprecated)
lexical alias: descriptionOfItem.en
status: Deprecated
type: Property
domain: C10001
sub property of: has descriptive item relationship with (Deprecated)
definition: Relates a work to an item described by a describing work. (Deprecated) @en

a pour item équivalent
has element type: 3
instruction number: 24.5
toolkit definition: An item that exemplifies a manifestation that embodies the same expression of a work. @en
toolkit definition: Bir eserin aynı ifadesini somutlaştıran bir gösterimi örnekleyen bir kopya. @tr
toolkit definition: Een item dat een manifestatie voorstelt die dezelfde expressie van een werk belichaamt. @nl
toolkit definition: Egy megjelenési forma példánya, amely megjelenési forma egy mű ugyanazon kifejezési formáját testesíti meg. @hu
toolkit definition: Ein Exemplar, das eine Manifestation darstellt, die dieselbe Expression eines Werks verkörpert. @de
toolkit definition: Eksemplar, der eksemplificerer en manifestation, som indeholder det samme udtryk af et værk. @da
toolkit definition: Eksemplar, mis esindab teose sama väljenduse kehastust. @et
toolkit definition: Et eksemplar som er et eksempel på en manifestasjon som gis form til det samme uttrykket av et verk. @no
toolkit definition: Item che esemplifica una manifestazione che materializza la stessa espressione di un'opera. @it
toolkit definition: Item qui exemplifie une manifestation matérialisant la même expression d’une œuvre.
toolkit definition: Kappale, joka edustaa teoksen saman ekspression manifestaatiota. @fi
toolkit definition: Thể hiện biểu thị là hiện thấn của cùng biểu hiện của tác phẩm. @vi
toolkit definition: Un ítem que ejemplifica una manifestación que materializa la misma expresión de una obra. @es
toolkit definition: Vienība, kura pārstāv manifestāciju, kas ietver to pašu darba izteiksmi. @lv
toolkit definition: Ítem que exemplifica una manifestació que materialitza la mateixa expressió d’una obra. @ca
toolkit definition: Ένα αντίτυπο το οποίο αποτελεί παράδειγμα υλοποίησης μιας εκδήλωσης που ενσωματώνει την ίδια έκφραση ενός έργου. @el
toolkit definition: مفردة تمثل تجسيدة تجسد تعبيرة العمل نفسها. @ar
toolkit definition: 例证具体化一种作品同一种内容表达的一种载体表现的一个单件 @zh-hans
toolkit label: ekvivalens példány: @hu
toolkit label: ekvivalenta vienība @lv
toolkit label: ekvivalentne eksemplar @et
toolkit label: equivalent item @en
toolkit label: equivalente (ítem) @es
toolkit label: eşdeğer kopya @tr
toolkit label: item equivalente @it
toolkit label: item équivalent
toolkit label: tilsvarende eksemplar @da
toolkit label: tương đương (bản) @vi
toolkit label: vastaava kappale @fi
toolkit label: Äquivalent (Exemplar) @de
toolkit label: ítem equivalent @ca
toolkit label: ισοδύναμο (αντίτυπο) @el
toolkit label: مفردة مكافئة @ar
toolkit label: 等同单件 @zh-hans
has subproperty: est une reproduction de (item)
has subproperty: est reproduit comme (item)
has subproperty: P40031
lexical alias: equivalentItem.en
status: Published
type: Property
domain: C10003
label: egyenértékű példánya a következő: @hu
label: ekvivalenta vienība @lv
label: ekvivalentne eksemplar @et
label: eşdeğer kopya ile ilişkilidir @tr
label: har tilsvarende eksemplar @da
label: has equivalent item @en
label: hat Äquivalent (Exemplar) @de
label: ha come item equivalente @it
label: heeft equivalent item @nl
label: là tương đương (bản) @vi
label: té com a ítem equivalent @ca
label: vastaava kappale @fi
label: είναι ισοδύναμο (αντίτυπο) @el
label: لها مفردة مكافئة @ar
label: 有等同单件 @zh-hans
sub property of: a pour item en relation avec un item
alternative label: ekvivalens típusú példánykapcsolat @hu
alternative label: equivalent item relationship @en
alternative label: eşdeğer kopya ilişkisi @tr
alternative label: relació d’ítem equivalent @ca
alternative label: relación de ítem equivalente @es
alternative label: relation d’item équivalent
alternative label: tilsvarende eksemplar-relation @da
alternative label: vastaavan kappaleen suhde @fi
alternative label: Äquivalenzbeziehungen auf Exemplarebene @de
alternative label: علاقة مفردة مكافِئة @ar
alternative label: 等同单件关系 @zh-hans
definition: Bir kopyayı, bir eserin aynı anlatımını somutlaştıran bir gösterimi örnekleyen bir kopya ile ilişkilendirilir. @tr
definition: Correla un item a un item che esemplifica una manifestazione che materializza la stessa espressione di un'opera. @it
definition: Hozzákapcsol egy példányt egy megjelenési forma példányához, amely megjelenési forma egy mű ugyanazon kifejezési formáját testesíti meg. @hu
definition: Liittää kappaleen kappaleeseen, joka edustaa teoksen saman ekspression manifestaatiota. @fi
definition: Liên kết bản với thể hiện biểu thị là hiện thấn của cùng biểu hiện của tác phẩm. @vi
definition: Met un item en relation avec un item qui exemplifie une manifestation matérialisant la même expression d’une œuvre.
definition: Relaciona un ítem amb un ítem que exemplifica una manifestació que materialitza la mateixa expressió d’una obra. @ca
definition: Relateert een item aan een item dat een manifestatie voorstelt die dezelfde expressie van een werk belichaamt. @nl
definition: Relaterer et eksemplar til et eksemplar som er et eksempel på en manifestasjon som gis form til det samme uttrykket av et verk. @no

est relié avec
has element type: 2
instruction number: 24.5
toolkit definition: An item that is physically combined with an item to form a collection manifestation. @en
toolkit definition: Bir koleksiyon gösterimi oluşturmak için bir kopyayla fiziksel olarak birleştirilen bir kopya. @tr
toolkit definition: Bản được đóng lại cùng tập đóng với bản đang được mô tả. @vi
toolkit definition: Een item dat fysiek gecombineerd of verenigd is met een item. @nl
toolkit definition: Egy példány, amelyet fizikailag hozzákapcsolnak vagy egyesítenek egy példánnyal. @hu
toolkit definition: Ein Exemplar, das physisch mit einem Exemplar verbunden ist. @de
toolkit definition: Eksemplar, mis on füüsiliselt ühendatud teise eksemplariga. @et
toolkit definition: Eksemplar, som er fysisk kombineret eller sat sammen med et eksemplar. @da
toolkit definition: Et eksemplar som er fysisk kombinert eller satt sammen med et eksemplar. @no
toolkit definition: Item fisicamente congiunto o unito a un item. @it
toolkit definition: Item qui est physiquement combiné à un item pour former une manifestation de collection de ressources.
toolkit definition: Kappale, joka on fyysisesti sidottu yhteen toisen samassa kokoelmassa olevan kappaleen kanssa. @fi
toolkit definition: Un ítem que se ha incluido con la misma encuadernación que el ítem descrito. @es
toolkit definition: Vienība, kas iesieta vienā iesējumā ar aprakstāmo vienību. @lv
toolkit definition: Ítem que es combina físicament amb un ítem per formar una manifestació de col·lecció de recursos. @ca
toolkit definition: Ένα αντίτυπο το οποίο έχει δεθεί μαζί με το περιγραφόμενο αντίτυπο. @el
toolkit definition: مفردة مدمجة أو مرتبطة مادياً بمفردة. @ar
toolkit definition: 和一个单件在物理上结合起来形成一个收藏载体表现的一个单件 @zh-hans
toolkit label: Eingebunden mit @de
toolkit label: bound with @en
toolkit label: egybekötve a következővel: @hu
toolkit label: encuadernado con @es
toolkit label: enquadernat amb @ca
toolkit label: gebonden met @nl
toolkit label: iesiets kopā ar @lv
toolkit label: ile bağlı @tr
toolkit label: indbundet sammen med @da
toolkit label: innbundet med @no
toolkit label: kokku köidetud eksemplariga @et
toolkit label: legato con @it
toolkit label: relié avec
toolkit label: yhteensidottu @fi
toolkit label: được đóng với @vi
toolkit label: δεμένο με @el
toolkit label: مرتبطة بـ @ar
toolkit label: 与……合订 @zh-hans
has subproperty: P40032
lexical alias: boundWith.en
status: Published
type: Property
domain: C10003
label: egybekötve a következővel: @hu
label: er indbundet sammen med @da
label: er innbundet med @no
label: ile bağlanmıştır @tr
label: ir iesiets kopā ar @lv
label: is bound with @en
label: is gebonden met @nl
label: ist eingebunden mit @de
label: kokku köidetud eksemplariga @et
label: yhteensidottu @fi
label: è legato con @it
label: és enquadernat amb @ca
label: được đóng với @vi
label: είναι δεμένο με @el
label: هي مرتبطة بـ @ar
label: 与……合订 @zh-hans
sub property of: est conservé avec
definition: Bir kopyayı, bir koleksiyon gösterimi oluşturmak için bir kopyayla fiziksel olarak birleştirilen bir kopyayla ilişkilendirir. @tr
definition: Correla un item a un item fisicamente congiunto o unito a un item. @it
definition: Hozzákapcsol egy példányt egy példányhoz, amelyet fizikailag hozzákapcsolnak vagy egyesítenek egy példánnyal. @hu
definition: Liittää kappaleen kappaleeseen, joka on fyysisesti sidottu yhteen toisen samassa kokoelmassa olevan kappaleen kanssa. @fi
definition: Liên kết bản với bản được đóng lại cùng tập đóng với bản đang được mô tả. @vi
definition: Met un item en relation avec un item qui est physiquement combiné à un item pour former une manifestation de collection de ressources.
definition: Relaciona un ítem amb un ítem que es combina físicament amb un ítem per formar una manifestació de col·lecció de recursos. @ca
definition: Relateert een item aan een item dat fysiek gecombineerd of verenigd is met een item. @nl
definition: Relaterer et eksemplar til et eksemplar som er fysisk kombinert eller satt sammen med et eksemplar. @no
definition: Relaterer et eksemplar til et eksemplar, som er fysisk kombineret eller sat sammen med et eksemplar. @da
definition: Relates an item to an item that is physically combined with an item to form a collection manifestation. @en
definition: Sasaista vienību ar vienību, kas iesieta vienā iesējumā ar aprakstāmo vienību. @lv
definition: Seostab eksemplari eksemplariga, mis on füüsiliselt ühendatud teise eksemplariga. @et
definition: Setzt ein Exemplar in Beziehung zu einem Exemplar, das physisch mit einem Exemplar verbunden ist. @de
definition: Συνδέει ένα αντίτυπο με ένα αντίτυπο το οποίο έχει δεθεί μαζί με το περιγραφόμενο αντίτυπο. @el
definition: يربط مفردة بمفردة مدمجة أو مرتبطة مادياً بمفردة. @ar
definition: 将一个单件与和一个单件在物理上结合起来形成一个收藏载体表现的一个单件关联起来。 @zh-hans

is analysis of (item) (Deprecated)
instruction number: 24.5
toolkit definition: An item that has been examined to identify its components and their relations. (Deprecated) @en
toolkit label: analysis of (item) (Deprecated) @en
lexical alias: analysisOfItem.en
status: Deprecated
type: Property
domain: C10001
sub property of: is description of (item) (Deprecated)
definition: Relates a work to an item that has been examined to identify its components and their relations. (Deprecated) @en

est un conteneur d’un item
has element type: 2
instruction number: 24.5
toolkit definition: An item that is a discrete component of a larger item. @en
toolkit definition: Bản là bộ phận cấu thành tách biệt của bản lớn hơn. @vi
toolkit definition: Daha büyük bir kopyanın ayrı bir bileşeni olan bir kopya. @tr
toolkit definition: Een item dat een afzonderlijk onderdeel is van een groter item. @nl
toolkit definition: Egy példány, amely egy nagyobb példány elkülöníthető alkotóeleme. @hu
toolkit definition: Ein Exemplar, das ein eigenständiger Bestandteil eines größeren Exemplars ist. @de
toolkit definition: Eksemplar, mis on suurema eksemplari eraldi osa. @et
toolkit definition: Eksemplar, som udgør en adskilt komponent af et større eksemplar. @da
toolkit definition: Et eksemplar som er en avgrenset bestanddel av et større eksemplar. @no
toolkit definition: Item che costituisce una componente distinta di un item più ampio. @it
toolkit definition: Item qui constitue une composante distincte d’un item plus vaste.
toolkit definition: Kappale, joka on itsenäinen osa laajempaa kappaletta. @fi
toolkit definition: Un ítem que es un componente separado de un ítem mayor. @es
toolkit definition: Vienība, kas ir lielākas vienības atsevišķs komponents. @lv
toolkit definition: Ítem que és un component discret d’un ítem més ampli. @ca
toolkit definition: Ένα αντίτυπο το οποίο είναι διακριτό συστατικό ενός μεγαλύτερου αντιτύπου. @el
toolkit definition: مفردة هي جزء منفصل عن مفردة أكبر @ar
toolkit definition: 作为一个更大单件的分离组成部分的一个单件 @zh-hans
toolkit label: Enthält ein Exemplar @de
toolkit label: container af eksemplar @da
toolkit label: container of item @en
toolkit label: conteneur d’un item
toolkit label: contenidor d’un ítem @ca
toolkit label: contenitore di item @it
toolkit label: contiene (ítem) @es
toolkit label: houder van item @nl
toolkit label: ietver vienību @lv
toolkit label: kopyanın kapsayıcısı @tr
toolkit label: omfattet av eksemplar @no
toolkit label: példány befoglalója: @hu
toolkit label: sisältää kappaleen @fi
toolkit label: vỏ chứa của (bản) @vi
toolkit label: ümbris eksemplarile @et
toolkit label: περιέκτης του (αντίτυπο) @el
toolkit label: حاوية لمفردة @ar
toolkit label: 单件的整体 @zh-hans
has subproperty: P40034
lexical alias: containerOfItem.en
status: Published
type: Property
domain: C10003
label: befoglalója a következő példánynak: @hu
label: er container af eksemplar @da
label: er omfattet av eksemplar @no
label: ir ietver vienību @lv
label: is container of item @en
label: is houder van item @nl
label: ist enthält ein Exemplar @de
label: kopyanın kapsayıcısıdır @tr
label: là vỏ chứa của (bản) @vi
label: sisältää kappaleen @fi
label: è contenitore di item @it
label: és contenidor d’un ítem @ca
label: ümbris eksemplarile @et
label: είναι περιέκτης του (αντίτυπο) @el
label: هي حاوية لمفردة @ar
label: 是单件的整体 @zh-hans
sub property of: a pour item en relation avec un item
definition: Bir kopyayı, daha büyük bir kopyanın ayrık bir bileşeni olan bir kopyayla ilişkilendirir. @tr
definition: Correla un item a un item che costituisce un componente distinto di un item più ampio. @it
definition: Hozzákapcsol egy példányt egy példányhoz, amely egy nagyobb példány elkülöníthető alkotóeleme. @hu
definition: Liittää kappaleen kappaleeseen, joka on itsenäinen osa laajempaa kappaletta. @fi
definition: Liên kết bản với bản là bộ phận cấu thành tách biệt của bản lớn hơn. @vi
definition: Met un item en relation avec un item qui constitue une composante distincte d’un item plus vaste.
definition: Relaciona un ítem amb un ítem que és un component discret d’un ítem més ampli. @ca
definition: Relateert een item aan een item dat een afzonderlijk onderdeel is van een groter item. @nl
definition: Relaterer et eksemplar til et eksemplar som er en avgrenset bestanddel av et større eksemplar. @no
definition: Relaterer et eksemplar til et eksemplar, som udgør en adskilt komponent af et større eksemplar. @da
definition: Relates an item to an item that is a discrete component of a larger item. @en
definition: Sasaista vienību ar vienību, kas ir lielākas vienības atsevišķs komponents. @lv
definition: Seostab eksemplari eksemplariga, mis on suurema eksemplari eraldi osa. @et
definition: Setzt ein Exemplar in Beziehung zu einem Exemplar, das ein eigenständiger Bestandteil eines größeren Exemplars ist. @de
definition: Συνδέει ένα αντίτυπο με ένα αντίτυπο το οποίο είναι διακριτό συστατικό ενός μεγαλύτερου αντιτύπου. @el
definition: يربط مفردة بمفردة هي جزء منفصل عن مفردة أكبر. @ar
definition: 将一个单件与作为一个更大单件的分离组成部分的一个单件关联起来。 @zh-hans

est sur le disque avec un item
has element type: 2
instruction number: 24.5
toolkit definition: An item that is contained on the same disc as an item. @en
toolkit definition: Bir kopyayla aynı diskte bulunan bir kopya. @tr
toolkit definition: Bản được chứa trên cùng đĩa với bản đang được mô tả @vi
toolkit definition: Een item dat gehouden wordt op dezelfde disk als een item. @nl
toolkit definition: Egy példány, amely ugyanazon a lemezen található, mint a példány. @hu
toolkit definition: Ein Exemplar, das auf derselben Disk enthalten ist, wie ein Exemplar. @de
toolkit definition: Eksemplar, mis sisaldub eksemplariga samal plaadil. @et
toolkit definition: Eksemplar, som er indeholdt på samme disk som et andet eksemplar. @da
toolkit definition: Et eksemplar som befinner seg på samme plate som et eksemplar. @no
toolkit definition: Item a un item contenuto come item nello stesso disco. @it
toolkit definition: Item qui est contenu sur le même disque qu’un item.
toolkit definition: Kappale, joka on samalla levyllä toisen kappale kanssa. @fi
toolkit definition: Un ítem que se incluye en el mismo disco que el ítem descrito. @es
toolkit definition: Vienība, kas ir ietverta tajā pašā diskā kopā ar aprakstāmo vienību. @lv
toolkit definition: Ítem que s’inclou en el mateix disc com un ítem. @ca
toolkit definition: Ένα αντίτυπο το οποίο περιέχεται στον ίδιο δίσκο με ένα περιγραφόμενο αντίτυπο. @el
toolkit definition: مفردة موجودة على القرص نفسه كمفردة. @ar
toolkit definition: 和一个单件一起包含在同一片盘中的一个单件 @zh-hans
toolkit label: Auf Disk mit (Exemplar) @de
toolkit label: azonos lemezen a következő példánnyal: @hu
toolkit label: en disco con (ítem) @es
toolkit label: en un disc amb un ítem @ca
toolkit label: izdots diskā kopā ar vienību @lv
toolkit label: kopya ile diskte @tr
toolkit label: levyllä myös (kappale) @fi
toolkit label: on disc with item @en
toolkit label: op schijf met item @nl
toolkit label: plaadil ka eksemplar @et
toolkit label: på disk sammen med eksemplar @da
toolkit label: på plate med eksemplar @no
toolkit label: su disco con item @it
toolkit label: sur le disque avec un item
toolkit label: trên đĩa với (bản) @vi
toolkit label: στον δίσκο μαζί με (αντίτυπο) @el
toolkit label: على قرص مع مفردة @ar
toolkit label: 与单件合盘 @zh-hans
has subproperty: P40035
lexical alias: onDiscWithItem.en
status: Published
type: Property
domain: C10003
label: azonos lemezen a következő példánnyal: @hu
label: er på disk sammen med eksemplar @da
label: er på plate med eksemplar @no
label: ir izdots diskā kopā ar vienību @lv
label: is on disc with item @en
label: is op schijf met item @nl
label: ist auf Disk mit (Exemplar) @de
label: kopya ile aynı disk üzerinde yer alır @tr
label: levyllä myös (kappale) @fi
label: là trên đĩa với (bản) @vi
label: plaadil ka eksemplar @et
label: è su disco con item @it
label: és en un disc amb un ítem @ca
label: είναι στον δίσκο μαζί με (αντίτυπο) @el
label: هي على قرص مع مفردة @ar
label: 与单件合盘 @zh-hans
sub property of: est conservé avec
definition: Bir kopyayı, bir kopyayla aynı diskte bulunan bir kopyayla ilişkilendirir. @tr
definition: Correla un item a un item contenuto come item nello stesso disco. @it
definition: Hozzákapcsol egy példányt egy példányhoz, amely ugyanazon a lemezen található, mint a példány. @hu
definition: Liittää kappaleen kappaleeseen, joka on samalla levyllä toisen kappaleen kanssa. @fi
definition: Liên kết bản với bản được chứa trên cùng đĩa với bản đang được mô tả @vi
definition: Met un item en relation avec un item qui est contenu sur le même disque qu’un item.
definition: Relaciona un ítem amb un ítem que s’inclou en el mateix disc com un ítem. @ca
definition: Relateert een item aan een item dat gehouden wordt op dezelfde disk als een item. @nl
definition: Relaterer et eksemplar til et eksemplar som befinner seg på samme plate som et eksemplar. @no
definition: Relaterer et eksemplar til et eksemplar, som er indeholdt på samme disk som et andet eksemplar. @da
definition: Relates an item to an item that is contained on the same disc as an item. @en
definition: Sasaista vienību ar vienību, kas ir ietverta tajā pašā diskā kopā ar aprakstāmo vienību. @lv
definition: Seostab eksemplari eksemplariga, mis sisaldub eksemplariga samal plaadil. @et
definition: Setzt ein Exemplar in Beziehung zu einem Exemplar, das auf derselben Disk enthalten ist, wie ein Exemplar. @de
definition: Συνδέει ένα αντίτυπο με ένα αντίτυπο το οποίο περιέχεται στον ίδιο δίσκο με ένα περιγραφόμενο αντίτυπο. @el
definition: يربط مفردة بمفردة توجد على القرص نفسه كمفردة. @ar
definition: 将一个单件与和一个单件一起包含在同一片盘中的一个单件关联起来。 @zh-hans

est filmé avec un item
has element type: 2
instruction number: 24.5
toolkit definition: An item that is contained on the same microform as an item. @en
toolkit definition: Bir kopyayla aynı mikro formda bulunan bir kopya. @tr
toolkit definition: Bản được chứa trên cùng vi phim với bản đang được mô tả. @vi
toolkit definition: Een item dat gehouden wordt op dezelfde microvorm als een item. @nl
toolkit definition: Egy példány, amely ugyanazon a mikroformátumú hordozón található, mint a példány. @hu
toolkit definition: Ein Exemplar, das auf derselben Mikroform enthalten ist, wie ein Exemplar. @de
toolkit definition: Eksemplar, mis sisaldub eksemplariga samal mikrovormil. @et
toolkit definition: Eksemplar, som er indeholdt på samme mikroform som et andet eksemplar. @da
toolkit definition: Et eksemplar som befinner seg på samme mikroform som et eksemplar. @no
toolkit definition: Item qui est contenu sur la même microforme qu’un item.
toolkit definition: Item a un item contenuto come item nella stessa microforma. @it
toolkit definition: Kappale, joka on samalla mikromuotoisella tallenteella toisen kappale kanssa. @fi
toolkit definition: Un ítem que se incluye en la misma microforma que el ítem descrito. @es
toolkit definition: Vienība, kas ir ietverta tajā pašā mikroformā kopā ar aprakstāmo vienību. @lv
toolkit definition: Ítem que s’inclou en la mateixa microforma com un ítem. @ca
toolkit definition: Ένα αντίτυπο το οποίο περιέχεται στην ίδια μικροφόρμα με ένα περιγραφόμενο αντίτυπο. @el
toolkit definition: مفردة توجد على الميكروفورم نفسه كمفردة. @ar
toolkit definition: 和一个单件一起包含在同一缩微品中的一个单件 @zh-hans
toolkit label: Verfilmt mit (Exemplar) @de
toolkit label: filmado con (ítem) @es
toolkit label: filmat amb un ítem @ca
toolkit label: filmed with item @en
toolkit label: filmezve példánnyal: @hu
toolkit label: filmé avec un item
toolkit label: gefilmd met item @nl
toolkit label: izdots mikroformā kopā ar vienību @lv
toolkit label: kopya ile filme alınan @tr
toolkit label: mikrofilmillä myös (kappale) @fi
toolkit label: mikrovormil ka eksemplar @et
toolkit label: optaget sammen med eksemplar @da
toolkit label: på film med eksemplar @no
toolkit label: su pellicola con item @it
toolkit label: được làm phim với (bản) @vi
toolkit label: κινηματογραφημένο μαζί με (αντίτυπο) @el
toolkit label: مُصورَة مع مفردة @ar
toolkit label: 与单件合拍 @zh-hans
has subproperty: P40036
lexical alias: filmedWithItem.en
status: Published
type: Property
domain: C10003
label: er optaget sammen med eksemplar @da
label: er på film med eksemplar @no
label: filmezve a következő példánnyal: @hu
label: ir izdots mikroformā kopā ar vienību @lv
label: is filmed with item @en
label: is gefilmd met item @nl
label: ist verfilmt mit (Exemplar) @de
label: kopya ile birlikte çekilmiştir @tr
label: mikrofilmillä myös (kappale) @fi
label: mikrovormil ka eksemplar @et
label: è su pellicola con item @it
label: és filmat amb un ítem @ca
label: được làm phim với (bản) @vi
label: είναι κινηματογραφημένο μαζί με (αντίτυπο) @el
label: هي مُصورَة مع مفردة @ar
label: 与单件合拍 @zh-hans
sub property of: est conservé avec
definition: Bir kopyayı, bir kopyala aynı mikroformda bulunan bir kopyayla ilişkilendirir. @tr
definition: Hozzákapcsol egy példányt egy példányhoz, amely ugyanazon a mikroformátumú hordozón található, mint a példány. @hu
definition: Liittää kappaleen kappaleeseen, joka on samalla mikromuotoisella tallenteella toisen kappaleen kanssa. @fi
definition: Liên kết bản với bản được chứa trên cùng vi phim với bản đang được mô tả. @vi
definition: Met un item en relation avec un item qui est contenu sur la même microforme qu’un item.
definition: Relaciona un ítem amb un ítem que s’inclou en la mateixa microforma com un ítem. @ca
definition: Relateert een item aan een item dat gehouden wordt op dezelfde microvorm als een item. @nl
definition: Relaterer et eksemplar til et eksemplar som befinner seg på samme mikroform som et eksemplar. @no
definition: Relaterer et eksemplar til et eksemplar, som er indeholdt på samme mikroform som et andet eksemplar. @da
definition: Relates an item to an item that is contained on the same microform as an item. @en
definition: Sasaista vienību ar vienību, kas ir ietverta tajā pašā mikroformā kopā ar aprakstāmo vienību. @lv
definition: Seostab eksemplari eksemplariga, mis sisaldub eksemplariga samal mikrovormil. @et
definition: Setzt ein Exemplar in Beziehung zu einem Exemplar, das auf derselben Mikroform enthalten ist, wie ein Exemplar. @de
definition: Correla un item a un item contenuto come item nella stessa microforma. @it
definition: Συνδέει ένα αντίτυπο με ένα αντίτυπο το οποίο περιέχεται στην ίδια μικροφόρμα με ένα περιγραφόμενο αντίτυπο. @el
definition: يربط مفردة بمفردة توجد على الميكروفورم نفسه كمفردة. @ar
definition: 将一个单件与和一个单件一起包含在同一缩微品中的一个单件关联起来。 @zh-hans

is evaluation of (item) (Deprecated)
instruction number: 24.5
toolkit definition: An item that is examined or judged. (Deprecated) @en
toolkit label: evaluation of (item) (Deprecated) @en
lexical alias: evaluationOfItem.en
status: Deprecated
type: Property
domain: C10001
sub property of: is description of (item) (Deprecated)
definition: Relates a work to an item that is examined or judged. (Deprecated) @en

est une réimpression de (item)
instruction number: 24.5
toolkit definition: Bản thể hiện biểu thị đã được in, được sử dụng như là cơ sở cho công bố lại biểu thị. @vi
toolkit definition: Ein Exemplar, das eine gedruckte Manifestation darstellt, die als Grundlage für eine Neuausgabe einer Manifestation verwendet wurde. @de
toolkit definition: Eksemplar, der eksemplificerer en trykt manifestation, der er anvendt som grundlag for et genoptryk af en manifestation. @da
toolkit definition: Et eksemplar som er et eksempel på en trykt manifestasjon som brukes som utgangspunkt for et opptrykk av en manifestasjon. @no
toolkit definition: Item qui représente une manifestation imprimée servant de base à une réédition d’une manifestation.
toolkit definition: Kappale, joka edustaa julkaistua manifestaatiota, jonka pohjalta manifestaation uusi painos on tehty. @fi
toolkit definition: Un ítem que ejemplifica una manifestación impresa que se usa como base para una reedición de una manifestación. @es
toolkit definition: Ítem que exemplifica una manifestació impresa que s’usa com a base d’una reimpressió d’una manifestació. @ca
toolkit definition: Ένα αντίτυπο το οποίο αποτελεί παράδειγμα υλοποίησης μιας έντυπης εκδήλωσης, η οποία χρησιμοποιείται ως η βάση για την επανέκδοση μιας εκδήλωσης. @el
toolkit label: Nachdruck von (Exemplar) @de
toolkit label: alkuperäinen painos (kappale) @fi
toolkit label: genudgivelse af (eksemplar) @da
toolkit label: opptrykk av (eksemplar) @no
toolkit label: reimpresión de (ítem) @es
toolkit label: reimpressió de (ítem) @ca
toolkit label: réimpression de (item)
toolkit label: tái bản của (bản) @vi
toolkit label: ανατύπωση του (αντίτυπο) @el
has subproperty: P40038
lexical alias: reprintOfItem.en
status: Deprecated
type: Property
domain: C10003
label: alkuperäinen painos (kappale) @fi
label: er genudgivelse af (eksemplar) @da
label: ist Nachdruck von (Exemplar) @de
label: là tái bản của (bản) @vi
label: és reimpressió de (ítem) @ca
label: είναι ανατύπωση του (αντίτυπο) @el
sub property of: est une reproduction de (item)
definition: Liittää kappaleen kappaleeseen, joka edustaa julkaistua manifestaatiota, jonka pohjalta manifestaation uusi painos on tehty. @fi
definition: Liên kết bản với bản thể hiện biểu thị đã được in, được sử dụng như là cơ sở cho công bố lại biểu thị. @vi
definition: Met un item en relation avec un item qui représente une manifestation imprimée servant de base à une réédition d’une manifestation.
definition: Relaciona un item amb un ítem que exemplifica una manifestació impresa que s’usa com a base d’una reimpressió d’una manifestació. @ca
definition: Relaterer et eksemplar til et eksemplar, der eksemplificerer en trykt manifestation, der er anvendt som grundlag for et genoptryk af en manifestation. @da
definition: Setzt ein Exemplar mit einem Exemplar, das eine gedruckte Manifestation darstellt, die als Grundlage für eine Neuausgabe einer Manifestation verwendet wurde, in Beziehung. @de
definition: Συνδέει ένα αντίτυπο με ένα αντίτυπο το οποίο αποτελεί παράδειγμα υλοποίησης μιας έντυπης εκδήλωσης η οποία χρησιμοποιείται ως η βάση για την επανέκδοση μιας εκδήλωσης. @el

est un transfert numérique de (item)
instruction number: 24.5
toolkit definition: Bản dưới định dạng số được chuyển sang định dạng số khác. @vi
toolkit definition: Digitaalisessa muodossa oleva kappale, jota on muunnettu toiseen digitaaliseen muotoon. @fi
toolkit definition: Ein Exemplar in einem digitalen Format, das in ein anderes digitales Format übertragen wurde. @de
toolkit definition: Eksemplar i et digitalt format, der er overført til et andet digitalt format. @da
toolkit definition: Et eksemplar i et digitalt format som overføres til et annet digitalt format. @no
toolkit definition: Item en format numérique qui a été transféré dans un format numérique différent.
toolkit definition: Un ítem en un formato digital que es transferido a otro formato digital. @es
toolkit definition: Ítem en un format digital que es transfereix a un altre format digital. @ca
toolkit definition: Ένα αντίτυπο σε ένα ψηφιακό μορφότυπο που μεταφέρεται σε ένα άλλο ψηφιακό μορφότυπο. @el
toolkit label: Digitale Übertragung von (Exemplar) @de
toolkit label: bản chuyền điện tử của (bản) @vi
toolkit label: digital overføring av (eksemplar) @no
toolkit label: digital overførsel af (eksemplar) @da
toolkit label: konvertoitu kappaleesta @fi
toolkit label: transferencia digital de (ítem) @es
toolkit label: transfert numérique de (item)
toolkit label: transferència digital de (ítem) @ca
toolkit label: ψηφιακή μεταφορά του (αντίτυπο) @el
has subproperty: P40039
lexical alias: digitalTransferOfItem.en
status: Deprecated
type: Property
domain: C10003
label: er digital overførsel af (eksemplar) @da
label: ist digitale Übertragung von (Exemplar) @de
label: konvertoitu kappaleesta @fi
label: là bản chuyền điện tử của (bản) @vi
label: és transferència digital de (ítem) @ca
label: είναι ψηφιακή μεταφορά του (αντίτυπο) @el
sub property of: est une reproduction de (item)
definition: Liittää kappaleen digitaalisessa muodossa olevaan kappaleeseen, jota on muunnettu toiseen digitaaliseen muotoon. @fi
definition: Liên kết bản với bản dưới định dạng số được chuyển sang định dạng số khác. @vi
definition: Met un item en relation avec un item en format numérique qui a été transféré dans un format numérique différent.
definition: Relaciona un item amb un ítem en un format digital que es transfereix a un altre format digital. @ca
definition: Relaterer et eksemplar til et eksemplar i et digitalt format, der er overført til et andet digitalt format. @da
definition: Setzt ein Exemplar mit einem Exemplar in einem digitalen Format, das in ein anderes digitales Format übertragen wurde, in Beziehung. @de
definition: Συνδέει ένα αντίτυπο με ένα αντίτυπο σε ένα ψηφιακό μορφότυπο που μεταφέρεται σε ένα άλλο ψηφιακό μορφότυπο. @el

is review of (item) (Deprecated)
instruction number: 24.5
toolkit definition: An item used as the basis for a brief evaluation. (Deprecated) @en
toolkit label: review of (item) (Deprecated) @en
lexical alias: reviewOfItem.en
status: Deprecated
type: Property
domain: C10001
sub property of: is description of (item) (Deprecated)
definition: Relates a work to an item used as the basis for a brief evaluation. (Deprecated) @en

is critique of (item) (Deprecated)
instruction number: 24.5
toolkit definition: An item used as the basis for a critical evaluation. (Deprecated) @en
toolkit label: critique of (item) (Deprecated) @en
lexical alias: critiqueOfItem.en
status: Deprecated
type: Property
domain: C10001
sub property of: is description of (item) (Deprecated)
definition: Relates a work to an item used as the basis for a critical evaluation. (Deprecated) @en

est une reproduction de (item)
instruction number: 24.5
toolkit definition: Bản được sử dụng như là cơ sở cho sản xuất lại. @vi
toolkit definition: Ein Exemplar, das als Grundlage für eine Reproduktion verwendet wurde. @de
toolkit definition: Eksemplar, der er anvendt som grundlag for en reproduktion. @da
toolkit definition: Et eksemplar som brukes som utgangspunkt for en reproduksjon. @no
toolkit definition: Item qui sert de base à une reproduction.
toolkit definition: Jäljentämisen perustana käytetty kappale. @fi
toolkit definition: Un ítem que es usado como base para una reproducción. @es
toolkit definition: Ítem que s’usa com a base d’una reproducció. @ca
toolkit definition: Ένα αντίτυπο το οποίο χρησιμοποιείται ως η βάση για μια αναπαραγωγή. @el
toolkit label: Reproduktion von (Exemplar) @de
toolkit label: jäljenne kappaleesta @fi
toolkit label: reproducció de (ítem) @ca
toolkit label: reproducción de (ítem) @es
toolkit label: reproduction de (item)
toolkit label: reproduksjon av (eksemplar) @no
toolkit label: reproduktion af (eksemplar) @da
toolkit label: sao chép của (bản) @vi
toolkit label: αναπαραγωγή του (αντίτυπο) @el
has subproperty: est une reproduction électronique de (item)
has subproperty: est une réimpression de (item)
has subproperty: est un transfert numérique de (item)
has subproperty: est un fac-un similé de (item)
has subproperty: P40042
lexical alias: reproductionOfItem.en
status: Deprecated
type: Property
domain: C10003
label: er reproduktion af (eksemplar) @da
label: ist Reproduktion von (Exemplar) @de
label: jäljenne kappaleesta @fi
label: là sao chép của (bản) @vi
label: és reproducció de (ítem) @ca
label: είναι αναπαραγωγή του (αντίτυπο) @el
sub property of: a pour item équivalent
definition: Liittää kappaleen jäljentämisen perustana käytettyyn kappaleeseen. @fi
definition: Liên kết bản với bản được sử dụng như là cơ sở cho sản xuất lại. @vi
definition: Met un item en relation avec un item qui sert de base à une reproduction.
definition: Relaciona un item amb un ítem que s’usa com a base d’una reproducció. @ca
definition: Relaterer et eksemplar til et eksemplar, der er anvendt som grundlag for en reproduktion. @da
definition: Setzt ein Exemplar mit einem Exemplar, das als Grundlage für eine Reproduktion verwendet wurde, in Beziehung. @de
definition: Συνδέει ένα αντίτυπο με ένα αντίτυπο το οποίο χρησιμοποιείται ως η βάση για μια αναπαραγωγή. @el

is commentary on (item) (Deprecated)
instruction number: 24.5
toolkit definition: An item used as the basis for a set of explanatory or critical notes. (Deprecated) @en
toolkit label: commentary on (item) (Deprecated) @en
lexical alias: commentaryOnItem.en
status: Deprecated
type: Property
domain: C10001
sub property of: is description of (item) (Deprecated)
definition: Relates a work to an item used as the basis for a set of explanatory or critical notes. (Deprecated) @en

est un fac-similé de conservation de (item)
instruction number: 24.5
toolkit definition: Bản được sử dụng như là cơ sở cho sản xuất lại chính xác trên phương tiện chất lượng bảo quản, như là giấy vĩnh cửu phi axit hoặc giấy lưu trữ. @vi
toolkit definition: Ein Exemplar, das als Grundlage für eine exakte Reproduktion auf bestandserhaltenden Medien, wie z. B. säurefreiem oder Archivpapier, verwendet wurde. @de
toolkit definition: Eksemplar, der er anvendt som grundlag for en nøjagtig reproduktion på et medium af bevaringskvalitet, såsom syrefrit permanent- eller arkivpapir. @da
toolkit definition: Et eksemplar som brukes som utgangspunkt for en eksakt reproduksjon på et medium av bevaringskvalitet, for eksempel syrefritt pergament eller arkivpapir. @no
toolkit definition: Item qui sert de base à une reproduction exacte sur un support de qualité conservation, tel qu’un papier permanent sans acide ou un papier d’archivage.
toolkit definition: Kappale, jota on käytetty arkistokelpoisen (kuten hapottoman arkistopaperin), täysin identtisen jäljennöksen perustana. @fi
toolkit definition: Un ítem utilizado como base para una reproducción exacta sobre un medio con calidad de preservación, tal como papel libre de ácido o papel de archivo. @es
toolkit definition: Ítem que s’usa com a base d’una reproducció exacta en un suport de preservació de qualitat, com ara paper permanent no àcid o paper d’arxiu. @ca
toolkit definition: Ένα αντίτυπο το οποίο χρησιμοποιείται ως η βάση για μια αναπαραγωγή ακριβείας σε μέσα διατήρησης της ποιότητας, όπως μόνιμο αντιόξινο ή αρχειακό χαρτί. @el
toolkit label: Bestandserhaltungsfaksimile von (Exemplar) @de
toolkit label: bevaringsfaksimile af eksemplar @da
toolkit label: bevaringskopi av (eksemplar) @no
toolkit label: bảo quản trên bản sao của (bản) @vi
toolkit label: fac-similé de conservation de (item)
toolkit label: facsímil de preservació de (ítem) @ca
toolkit label: facsímil de preservación de (ítem) @es
toolkit label: säilytyskopio kappaleesta @fi
toolkit label: διατηρημένο ομοιότυπο του (αντίτυπο) @el
has subproperty: P40044
lexical alias: preservationFacsimileOfItem.en
status: Deprecated
type: Property
domain: C10003
label: er bevaringsfaksimile af (eksemplar) @da
label: ist Bestandserhaltungsfaksimile von (Exemplar) @de
label: là bản sao bảo quản của (bản) @vi
label: säilytyskopio kappaleesta @fi
label: és facsímil de preservació de (ítem) @ca
label: είναι διατηρημένο ομοιότυπο του (αντίτυπο) @el
sub property of: est un fac-un similé de (item)
definition: Liittää kappaleen kappaleeseen, jota on käytetty arkistokelpoisen (kuten hapottoman arkistopaperin), täysin identtisen jäljennöksen perustana. @fi
definition: Liên kết bản với bản được sử dụng như là cơ sở cho sản xuất lại chính xác trên phương tiện chất lượng bảo quản, như là giấy vĩnh cửu phi axit hoặc giấy lưu trữ. @vi
definition: Met un item en relation avec un item qui sert de base à une reproduction exacte sur un support de qualité conservation, tel qu’un papier permanent sans acide ou un papier d’archivage.
definition: Relaciona un item amb un ítem que s’usa com a base d’una reproducció exacta en un suport de preservació de qualitat, com ara paper permanent no àcid o paper d’arxiu. @ca
definition: Relaterer et eksemplar til et eksemplar, der er anvendt som grundlag for en nøjagtig reproduktion på et medium af bevaringskvalitet, såsom syrefrit permanent- eller arkivpapir. @da
definition: Setzt ein Exemplar mit einem Exemplar, das als Grundlage für eine exakte Reproduktion auf bestandserhaltenden Medien, wie z. B. säurefreiem oder Archivpapier, verwendet wurde, in Beziehung. @de
definition: Συνδέει ένα αντίτυπο με ένα αντίτυπο το οποίο χρησιμοποιείται ως η βάση για μια αναπαραγωγή ακριβείας σε μέσα διατήρησης της ποιότητας, όπως μόνιμο αντιόξινο ή αρχειακό χαρτί. @el

est un fac-un similé de (item)
instruction number: 24.5
toolkit definition: Bản được sử dụng như là cơ sở cho sản xuất lại chính xác. @vi
toolkit definition: Ein Exemplar, das als Grundlage für eine exakte Reproduktion verwendet wurde. @de
toolkit definition: Eksemplar, der er anvendt som grundlag for en nøjagtig reproduktion. @da
toolkit definition: Et eksemplar som brukes som utgangspunkt for en eksakt reproduksjon. @no
toolkit definition: Item qui sert de base à une reproduction exacte.
toolkit definition: Kappale, jota on käytetty täysin identtisen jäljennöksen perustana. @fi
toolkit definition: Un ítem utilizado como base para una reproducción exacta. @es
toolkit definition: Ítem que s’usa com a base d’una reproducció exacta. @ca
toolkit definition: Ένα αντίτυπο το οποίο χρησιμοποιείται ως η βάση για μια αναπαραγωγή ακριβείας. @el
toolkit label: Faksimile von (Exemplar) @de
toolkit label: bản sao của (bản) @vi
toolkit label: fac-similé de (item)
toolkit label: facsímil de (ítem) @ca
toolkit label: faksimile af (eksemplar) @da
toolkit label: faksimile av (eksemplar) @no
toolkit label: näköispainoksen alkuperä (kappale) @fi
toolkit label: ομοιότυπο του (αντίτυπο) @el
has subproperty: est un fac-similé de conservation de (item)
has subproperty: P40045
lexical alias: facsimileOfItem.en
status: Deprecated
type: Property
domain: C10003
label: er faksimile af (eksemplar) @da
label: ist Faksimile von (Exemplar) @de
label: là bản sao của (bản) @vi
label: näköispainoksen alkuperä (kappale) @fi
label: és facsímil de (ítem) @ca
label: είναι ομοιότυπο του (αντίτυπο) @el
sub property of: est une reproduction de (item)
definition: Liittää kappaleen kappaleeseen, jota on käytetty täysin identtisen jäljennöksen perustana. @fi
definition: Liên kết bản với bản được sử dụng như là cơ sở cho sản xuất lại chính xác. @vi
definition: Met un item en relation avec un item qui sert de base à une reproduction exacte.
definition: Relaciona un item amb un ítem que s’usa com a base d’una reproducció exacta. @ca
definition: Relaterer et eksemplar til et eksemplar, der er anvendt som grundlag for en nøjagtig reproduktion. @da
definition: Setzt ein Exemplar mit einem Exemplar, das als Grundlage für eine exakte Reproduktion verwendet wurde, in Beziehung. @de
definition: Συνδέει ένα αντίτυπο με ένα αντίτυπο το οποίο χρησιμοποιείται ως η βάση για μια αναπαραγωγή ακριβείας. @el

a pour item en relation avec un item
has element type: 1
toolkit definition: An item that is associated with an item. @en
toolkit definition: Bir kopyayla bağlantılı olan bir kopya. @tr
toolkit definition: Een item dat geassocieerd is met een item. @nl
toolkit definition: Egy példány, amelyet egy példányhoz társítanak. @hu
toolkit definition: Ein Exemplar, das mit einem Exemplar in Verbindung steht. @de
toolkit definition: Eksemplar, som er knyttet til et eksemplar. @da
toolkit definition: Eksemplariga seotud eksemplar. @et
toolkit definition: Et eksemplar som forbindes med et eksemplar. @no
toolkit definition: Item qui est associé à un item.
toolkit definition: Item associato a un item. @it
toolkit definition: Kappale, joka liittyy kappaleeseen. @fi
toolkit definition: Vienība, kas ir saistīta ar vienību. @lv
toolkit definition: Ítem que s’associa amb un ítem. @ca
toolkit definition: مفردة ذات صلة بمفردة @ar
toolkit definition: 和一个单件有关的一个单件 @zh-hans
toolkit label: Kopyayla ilişkili kopya @tr
toolkit label: ar vienību saistītā vienība @lv
toolkit label: eksemplar relateret til eksemplar @da
toolkit label: eksemplariga seotud eksemplar @et
toolkit label: gerelateerd item van item @nl
toolkit label: item correlato di item @it
toolkit label: item en relation avec un item
toolkit label: kappaleeseen liittyvä kappale @fi
toolkit label: mit Exemplar in Beziehung stehendes Exemplar @de
toolkit label: példány kapcsolódó példánya: @hu
toolkit label: related item of item @en
toolkit label: relaterat exemplar @sv
toolkit label: relatert eksemplar av eksemplar @no
toolkit label: ítem relacionat amb un ítem @ca
toolkit label: مفردة مرتبطة بمفردة @ar
toolkit label: 单件的关联单件 @zh-hans
has subproperty: est contenu dans un item
has subproperty: est conservé avec
has subproperty: a pour item équivalent
has subproperty: est un conteneur d’un item
has subproperty: a pour relation d’item d’accompagnement
has subproperty: has descriptive item relationship with (Deprecated)
has subproperty: a pour relation d’item équivalent
has subproperty: a pour relation d’item tout-partie
has subproperty: est sur une manifestation avec
has subproperty: P40046
lexical alias: relatedItemOfItem.en
status: Published
type: Property
domain: C10003
label: ar vienību saistītā vienība @lv
label: có bản có liên quan (bản) @vi
label: eksemplariga seotud eksemplar @et
label: ha come item correlato di item @it
label: har eksemplar relateret til eksemplar @da
label: har relaterat exemplar @sv
label: har relatert eksemplar av eksemplar @no
label: has related item of item @en
label: hat mit Exemplar in Beziehung stehendes Exemplar @de
label: heeft gerelateerd item van item @nl
label: kappaleeseen liittyvä kappale @fi
label: kopyanın ilgili kopyası ile ilişkilidir @tr
label: példány kapcsolódó példánya a következő: @hu
label: té com a ítem relacionat amb un ítem @ca
label: έχει σχετικό αντίτυπο (αντίτυπο) @el
label: له مفردة مرتبطة بمفردة @ar
label: 有单件的关联单件 @zh-hans
sub property of: a pour entité RDA en relation avec un item
sub property of: P00005
alternative label: Teil-Ganzes-Beziehungen auf Exemplarebene @de
alternative label: bütün-parça kopya ilişkisi @tr
alternative label: egésze-része típusú példánykapcsolat @hu
alternative label: helhed-del-eksemplar-relation @da
alternative label: kappaleen osa-kokonaisuus-suhde @fi
alternative label: relació d’ítem tot-part @ca
alternative label: relación de ítem de parte entera @es
alternative label: relation d’item tout-partie
alternative label: whole-part item relationship @en
alternative label: علاقة الجزء بالكل لمفردة @ar
alternative label: 整体-部分单件关系 @zh-hans
definition: Bir kopyayı, bir kopyayla bağlantılı olan bir kopyayla ilişkilendirir. @tr
definition: Correla un item a un item associato a un item. @it
definition: Hozzákapcsol egy példányt egy példányhoz, amelyet egy példányhoz társítanak. @hu

a pour restriction d’accès à un item
has element type: 5
instruction number: 4.4
toolkit definition: A limitation placed on access to an item. @en
toolkit definition: Begrænsning af adgangen til et eksemplar. @da
toolkit definition: Bir kopyanın erişimine getirilen bir sınırlama. @tr
toolkit definition: Een begrenzing geplaatst op de toegang tot een item. @nl
toolkit definition: Egy korlátozás, amelyet egy példányhoz való hozzáféréshez rendelnek. @hu
toolkit definition: Eine Beschränkung des Zugangs zu einem Exemplar. @de
toolkit definition: En begrensning for tilgangen til en ressurs. @no
toolkit definition: Giới hạn được đặt ra về truy cấp tới bản. @vi
toolkit definition: Ierobežojums, kas noteikts vienības piekļuvei. @lv
toolkit definition: Kappaleen saatavuudelle asetetut rajoitukset. @fi
toolkit definition: Limitaciones establecidas para el acceso a un recurso. @es
toolkit definition: Limitació imposada sobre l’accés a un ítem. @ca
toolkit definition: Limitation imposée sur l’accès à un item.
toolkit definition: Limitazione di accesso a un item. @it
toolkit definition: Piirang, mis on kehtestatud eksemplari juurdepääsule. @et
toolkit definition: Ένας περιορισμός που ανατίθεται στην πρόσβαση σε ένα αντίτυπο. @el
toolkit definition: قيد وضع على الوصول لمفردة @ar
toolkit definition: 对单件获取设置的限制 @zh-hans
toolkit label: Zugangsbeschränkung zu einem Exemplar @de
toolkit label: adgangsbegrensning for eksemplar @no
toolkit label: beperking op toegang tot item @nl
toolkit label: cấm truy cập vào bản @vi
toolkit label: eksemplari juurdepääsupiirang @et
toolkit label: kappaleen saatavuuden rajoitukset @fi
toolkit label: kopyaya erişim kısıtlaması @tr
toolkit label: limitazione di accesso ad item @it
toolkit label: példány hozzáférési korlátozása: @hu
toolkit label: restricciones de acceso @es
toolkit label: restricció d’accés a un ítem @ca
toolkit label: restriction d’accès à un item
toolkit label: restriction on access to item @en
toolkit label: restriktion på adgang til eksemplar @da
toolkit label: vienības piekļuves ierobežojums @lv
toolkit label: åtkomstrestriktioner @sv
toolkit label: περιορισμός στην πρόσβαση στο αντίτυπο @el
toolkit label: قيد على الوصول لمفردة @ar
toolkit label: 单件的获取限制 @zh-hans
has subproperty: P40047
lexical alias: restrictionOnAccessToItem.en
status: Published
type: Property
domain: C10003
label: có cấm truy cập vào bản @vi
label: eksemplari juurdepääsupiirang @et
label: har adgangsbegrensning for eksemplar @no
label: har restriktion på adgang til eksemplar @da
label: har åtkomstrestriktioner @sv
label: has restriction on access to item @en
label: hat Zugangsbeschränkung zu einem Exemplar @de
label: ha come limitazione di accesso ad item @it
label: heeft beperking op toegang tot item @nl
label: kappaleen saatavuuden rajoitukset @fi
label: kopyaya erişim kısıtlaması ile ilişkilidir @tr
label: példány hozzáférési korlátozása a következő: @hu
label: té com a restricció d’accés a un ítem @ca
label: vienības piekļuves ierobežojums @lv
label: έχει περιορισμό στην πρόσβαση στο αντίτυπο @el
label: له قيد على الوصول لمفردة @ar
label: 有单件的获取限制 @zh-hans
definition: Bir kopyayı, bir kopyaya getirilen erişim kısıtlamasıyla ilişkilendirir. @tr
definition: Correla un item a una limitazione di accesso a un item. @it
definition: Hozzákapcsol példányt egy korlátozáshoz, amelyet egy példányhoz való hozzáféréshez rendelnek. @hu
definition: Liittää kappaleen kappaleen saatavuudelle asetettuihin rajoituksiin. @fi
definition: Liên kết bản với giới hạn được đặt ra về truy cấp tới bản. @vi
definition: Met un item en relation avec une limitation imposée sur l’accès à un item.
definition: Relaciona un ítem amb una limitació imposada sobre l’accés a un ítem. @ca
definition: Relateert een item aan een begrenzing geplaatst op de toegang tot een item. @nl
definition: Relaterer et eksemplar til en begrensning for tilgangen til en ressurs. @no
definition: Relaterer et eksemplar til en begrænsning af adgangen til et eksemplar. @da
definition: Relates an item to a limitation placed on access to an item. @en
definition: Sasaista vienību ar ierobežojumu, kas noteikts vienības piekļuvei. @lv
definition: Seostab eksemplari piiranguga, mis on kehtestatud eksemplari juurdepääsule. @et
definition: Setzt ein Exemplar in Beziehung zu einer Beschränkung des Zugangs zu einem Exemplar. @de
definition: Συνδέει ένα αντίτυπο με έναν περιορισμό που ανατίθεται στην πρόσβαση σε ένα αντίτυπο. @el
definition: يربط مفردة بقيد على الوصول لمفردة. @ar
definition: 将一个单件与对单件获取设置的限制关联起来。 @zh-hans

a pour restriction d’usage d’un item
has element type: 5
instruction number: 4.5
toolkit definition: A limitation placed on reproduction, publication, exhibition, etc., of an item. @en
toolkit definition: Begrænsning af reproduktion, publicering, udstilling etc. af et eksemplar. @da
toolkit definition: Beschränkung der Verwendungsart eines Exemplars, wie zum Beispiel Reproduktion, Veröffentlichung, Ausstellung und so weiter. @de
toolkit definition: Bir kopyanın çoğaltılmasına, yayınlanmasına, sergilenmesine vb. getirilen bir sınırlama. @tr
toolkit definition: Een begrenzing geplaatst op reproductie, publicatie, tentoonstelling etc. van een item. @nl
toolkit definition: Egy korlátozás, amelyet egy példány másolásához, publikálásához, kiállításához stb. rendelnek. @hu
toolkit definition: En begrensning for reproduksjon, utgivelse, utstilling etc. av en ressurs. @no
toolkit definition: Giới hạn được đặt ra về sản xuất lại, xuất bản, triển lãm, v.v..., của bản. @vi
toolkit definition: Limitaciones establecidas sobre los usos, tales como reproducción, publicación, exhibición, etc. @es
toolkit definition: Limitació imposada sobre la reproducció, la publicació, l’exposició, etc., d’un ítem. @ca
toolkit definition: Limitation imposée sur la reproduction, la publication, l’exposition, etc. d’un item.
toolkit definition: Limitazione posta alla riproduzione, pubblicazione, esposizione, etc. di un item. @it
toolkit definition: Piirang, mis on kehtestatud eksemplari reprodutseerimisele, avaldamisele, eksponeerimisele jms. @et
toolkit definition: Rajoitukset, jotka koskevat kappaleen jäljentämistä, julkaisua, näytteille asettamista tms. @fi
toolkit definition: Vienības izmantošanas ierobežojumi pavairošanā, izgatavošanā, izrādīšanā u.tml. @lv
toolkit definition: Ένας περιορισμός που ανατίθεται στην αναπαραγωγή, τη δημοσίευση, την έκθεση κ.λπ. ενός αντιτύπου. @el
toolkit definition: قيد لمنع استنساخ مفردة، أو نشرها، أو عرضها، الخ. @ar
toolkit definition: 对单件的复制、出版、展览等设置的限制 @zh-hans
toolkit label: Benutzungsbeschränkung für ein Exemplar @de
toolkit label: användningsrestriktioner @sv
toolkit label: beperking op gebruik van item @nl
toolkit label: cấm sử dụng bản @vi
toolkit label: eksemplari kasutuspiirang @et
toolkit label: kappaleen käyttöehdot @fi
toolkit label: kopyanın kullanımına ilişkin kısıtlama @tr
toolkit label: limitazione di uso di item @it
toolkit label: példány felhasználási korlátozása: @hu
toolkit label: restricciones sobre el uso @es
toolkit label: restricció d’ús d’un ítem @ca
toolkit label: restriction d’usage d’un item
toolkit label: restriction on use of item @en
toolkit label: restriksjoner for bruk av eksemplar @no
toolkit label: restriktion på brug af eksemplar @da
toolkit label: vienības izmantošanas ierobežojums @lv
toolkit label: περιορισμός στη χρήση του αντιτύπου @el
toolkit label: قيد على استخدام مفردة @ar
toolkit label: 单件使用的限制 @zh-hans
has subproperty: P40048
lexical alias: restrictionOnUseOfItem.en
status: Published
type: Property
domain: C10003
label: có cấm sử dụng bản @vi
label: eksemplari kasutuspiirang @et
label: ha come limitazione di uso di item @it
label: har användningsrestriktioner @sv
label: har restriksjoner for bruk av eksemplar @no
label: har restriktion på brug af eksemplar @da
label: has restriction on use of item @en
label: hat Benutzungsbeschränkung für ein Exemplar @de
label: heeft beperking op gebruik van item @nl
label: kappaleen käyttöehdot @fi
label: kopyanın kullanım kısıtlaması ile ilişkilidir @tr
label: példány felhasználási korlátozása a következő: @hu
label: té com a restricció d’ús d’un ítem @ca
label: vienības izmantošanas ierobežojums @lv
label: έχει περιορισμό στη χρήση του αντιτύπου @el
label: له قيد على استخدام مفردة @ar
label: 有对单件使用的限制 @zh-hans
definition: Bir kopyayı, bir kopyanın çoğaltılmasına, yayınlanmasına, sergilenmesine vb. konulan bir kısıtlamayla ilişkilendirir. @tr
definition: Correla un item a una limitazione posta alla riproduzione, pubblicazione, esposizione, etc. di un item. @it
definition: Hozzákapcsol egy példányt egy korlátozáshoz, amelyet egy példány másolásához, publikálásához, kiállításához stb. rendelnek. @hu
definition: Liittää kappaleen rajoituksiin koskien kappaleen jäljentämistä, julkaisemista, näytteille asettamista tms. @fi
definition: Liên kết bản với giới hạn được đặt ra về sản xuất lại, xuất bản, triển lãm, v.v..., của bản. @vi
definition: Met un item en relation avec une limitation imposée sur la reproduction, la publication, l’exposition, etc. d’un item.
definition: Relaciona un ítem amb una limitació imposada sobre la reproducció, la publicació, l’exposició, etc., d’un ítem. @ca
definition: Relateert een item aan een begrenzing geplaatst op reproductie, publicatie, tentoonstelling etc. van een item. @nl
definition: Relaterer en manifestation til en begrænsning af reproduktion, publicering, udstilling etc. af et eksemplar. @da
definition: Relaterer et eksemplar til en begrensning for reproduksjon, utgivelse, utstilling etc. av en ressurs. @no
definition: Relates an item to a limitation placed on reproduction, publication, exhibition, etc., of an item. @en
definition: Sasaista vienību ar vienības izmantošanas ierobežojumiem pavairošanā, izgatavošanā, izrādīšanā u.tml. @lv
definition: Seostab eksemplari piiranguga, mis on kehtestatud eksemplari reprodutseerimisele, avaldamisele, eksponeerimisele jms. @et
definition: Setzt ein Exemplar in Beziehung zu einer Beschränkung der Verwendungsart eines Exemplars, wie zum Beispiel Reproduktion, Veröffentlichung, Ausstellung und so weiter. @de
definition: Συνδέει ένα αντίτυπο με έναν περιορισμό που ανατίθεται στην αναπαραγωγή, τη δημοσίευση, την έκθεση κ.λπ. ενός αντιτύπου. @el
definition: يربط مفردة بقيد لمنع استنساخ مفردة، أو نشرها، أو عرضها، الخ. @ar
definition: 将一个单件与对单件的复制、出版、展览等设置的限制关联起来。 @zh-hans

a pour manifestation exemplifiée
has element type: 3
instruction number: 17.12
toolkit definition: A manifestation that is exemplified by an item. @en
toolkit definition: Bir kopya tarafından örneklenen bir gösterim. @tr
toolkit definition: Biểu thị được thể hiện bởi bản. @vi
toolkit definition: Een manifestatie die voorgesteld wordt door een item. @nl
toolkit definition: Egy megjelenési forma, amelyet egy példány szemléltet. @hu
toolkit definition: Eine Manifestation, die durch ein Exemplar beispielhaft dargestellt wird. @de
toolkit definition: En manifestasjonen som er eksemplifisert ved et eksemplar. @no
toolkit definition: Kehastus, mida eksemplar esindab. @et
toolkit definition: La manifestación ejemplificada en un ítem. @es
toolkit definition: Manifestaatio, jota kappale edustaa. @fi
toolkit definition: Manifestació que s’exemplifica per un ítem. @ca
toolkit definition: Manifestation qui est exemplifiée par un item.
toolkit definition: Manifestation, som er eksemplificeret af et eksemplar. @da
toolkit definition: Manifestazione esemplificata da un item. @it
toolkit definition: Manifestācija, kas ir izmantota par paraugu vienībai. @lv
toolkit definition: Μια εκδήλωση που υλοποιείται από ένα αντίτυπο. @el
toolkit definition: تجسيدة ممثلة في مفردة @ar
toolkit definition: 被一个单件例证的一种载体表现 @zh-hans
toolkit label: Kopya edilmiş gösterim @tr
toolkit label: biểu thị được thể hiện @vi
toolkit label: eksemplificeret manifestation @da
toolkit label: esindab kehastust @et
toolkit label: exemplar av manifestation @sv
toolkit label: im Exemplar vorliegende Manifestation @de
toolkit label: kappaleen edustama manifestaatio @fi
toolkit label: manifestació exemplificada @ca
toolkit label: manifestación ejemplificada @es
toolkit label: manifestasjon eksemplifisert @no
toolkit label: manifestatie voorgesteld @nl
toolkit label: manifestation exemplified @en
toolkit label: manifestation exemplifiée
toolkit label: manifestazione esemplificata @it
toolkit label: megjelenési forma példája: @hu
toolkit label: paraugeksemplārs manifestācijai @lv
toolkit label: υλοποιημένη εκδήλωση @el
toolkit label: تجسيدة ممثلة @ar
toolkit label: 被例证的载体表现 @zh-hans
has subproperty: P40049
lexical alias: manifestationExemplified.en
status: Published
type: Property
domain: C10003
label: có biểu thị được ví dụ @vi
label: esindab kehastust @et
label: ha come manifestazione esemplificata @it
label: har eksemplificeret manifestation @da
label: har exemplar av manifestationen @sv
label: har manifestasjon eksemplifisert @no
label: has manifestation exemplified @en
label: hat im Exemplar vorliegende Manifestation @de
label: heeft manifestatie voorgesteld @nl
label: kappaleen edustama manifestaatio @fi
label: megjelenési forma példája a következő: @hu
label: paraugeksemplārs manifestācijai @lv
label: té com a manifestació exemplificada @ca
label: örneklenen gösterim ile ilişkilidir @tr
label: έχει υλοποιημένη εκδήλωση @el
label: له تجسيدة ممثلة @ar
label: 有被例证的载体表现 @zh-hans
sub property of: a pour manifestation en relation avec un item
alternative label: manifestation représentée
definition: Bir kopyayı, bir kopya tarafından kopya edilmiş bir gösterimle ilişkilendirir. @tr
definition: Correla un item a una manifestazione esemplificata da un item. @it
definition: Hozzákapcsol egy példányt egy megjelenési formához, amelyet egy példány szemléltet. @hu
definition: Liittää kappaleen manifestaatioon, jota kappale edustaa. @fi
definition: Liên kết bản với biểu thị được thể hiện bởi bản. @vi
definition: Met un item en relation avec une manifestation qui est exemplifiée par un item.
definition: Relaciona un ítem amb una manifestació que s’exemplifica per un ítem. @ca
definition: Relateert een item aan een manifestatie die voorgesteld wordt door een item. @nl
definition: Relaterer et eksemplar til en manifestasjonen som er eksemplifisert ved et eksemplar. @no
definition: Relaterer et eksemplar til en manifestation, som er eksemplificeret af et eksemplar. @da
definition: Relates an item to a manifestation that is exemplified by an item. @en
definition: Sasaista vienību ar manifestāciju, kas ir izmantota par paraugu vienībai. @lv
definition: Seostab eksemplari kehastusega, mida eksemplar esindab. @et
definition: Setzt ein Exemplar in Beziehung zu einer Manifestation, die durch ein Exemplar beispielhaft dargestellt wird. @de
definition: Συνδέει ένα αντίτυπο με μια εκδήλωση που υλοποιείται από ένα αντίτυπο. @el
definition: يربط مفردة بتجسيدة ممثلة في مفردة. @ar

a pour source immédiate d’acquisition d’un item
has element type: 6
instruction number: 2.19
toolkit definition: Avots, no kura aģentūra tieši iegūst resursu un nosacījumi tā saņemšanai. @lv
toolkit definition: Azok a körülmények, amelyek keretében egy példányt közvetlenül beszereznek, beleértve a beszerzés módszerét, forrását és időpontját. @hu
toolkit definition: Circonstances dans lesquelles un item a été directement acquis, notamment une méthode, une source et une date d’acquisition.
toolkit definition: Circostanze nelle quali l'item è stato direttamente acquisito, inclusi metodo, fonte e data di acquisizione. @it
toolkit definition: Circumstàncies sota les quals un ítem és adquirit directament, inclòs un mètode, una font i una data d’adquisició. @ca
toolkit definition: De omstandigheden waaronder een item direct verworven is, waaronder een methode, bron en datum van verwerving. @nl
toolkit definition: Die Umstände, unter denen ein Exemplar direkt erworben wird. Darunter fallen Erwerbungsmethoden, Erwerbungsquellen und Erwerbungsdaten. @de
toolkit definition: Eksemplari hankimise asjaolud, nagu hankimise viis, allikas ja daatum. @et
toolkit definition: Kappaleen hankintaolosuhteet, kuten hankintatapa, -lähde ja -ajankohta. @fi
toolkit definition: La fuente de la cual la agencia adquirió directamente un ítem y las circunstancias bajo las cuales se recibió. @es
toolkit definition: Nguồn mà từ đó cơ quan bổ sung trực tiếp bản và điều kiện quy định để nhận được nó. @vi
toolkit definition: Omstendighetene som et eksemplar direkte blir anskaffet under, inkludert metode, kilde og dato for akvisisjon. @no
toolkit definition: Omstændigheder, hvorunder et eksemplar anskaffes, samt metode, kilde og dato for anskaffelse. @da
toolkit definition: The circumstances under which an item is directly acquired, including a method, source, and date of acquisition. @en
toolkit definition: Yöntem, kaynak ve edinme tarihi de dahil olmak üzere, bir öğenin doğrudan edinildiği koşullar. @tr
toolkit definition: Μια πηγή από την οποία ένας φορέας απέκτησε άμεσα ένα αντίτυπο και οι συνθήκες υπό τις οποίες το παρέλαβε. @el
toolkit definition: ظروف اقتناء مفردة بصورة مباشرة، ويشمل ذلك طريقة الاقتناء، مصدره، تاريخه. @ar
toolkit definition: 单件直接被获取的环境（包括获取的方法、来源和日期） @zh-hans
toolkit label: Bezugsquelle eines Exemplars @de
toolkit label: directe bron van verwerving van item @nl
toolkit label: direkte anskaffelseskilde for eksemplar @da
toolkit label: direkte kilde for anskaffelse av eksemplar @no
toolkit label: eksemplari hankeallikas @et
toolkit label: font immediata d’adquisició d’un ítem @ca
toolkit label: fonte immediata di acquisizione di item @it
toolkit label: fuente inmediata de acquisición del ítem @es
toolkit label: immediate source of acquisition of item @en
toolkit label: kappaleen hankintalähde @fi
toolkit label: kopyanın doğrudan edinildiği kaynak ile ilişkilidir @tr
toolkit label: nguồn bổ sung trực tiếp của bản @vi
toolkit label: példány közvetlen beszerzési forrása: @hu
toolkit label: senaste förvärvskälla @sv
toolkit label: source immédiate d’acquisition d’un item
toolkit label: tiešais vienības komplektēšanas avots @lv
toolkit label: άμεση πηγή της πρόσκτησης του αντιτύπου @el
toolkit label: مصدر مباشر لاقتناء مفردة @ar
toolkit label: 单件的直接获取来源 @zh-hans
has subproperty: P40050
lexical alias: immediateSourceOfAcquisitionOfItem.en
status: Published
type: Property
domain: C10003
label: có nguồn bổ sung trực tiếp của bản @vi
label: eksemplari hankeallikas @et
label: ha come fonte immediata di acquisizione di item @it
label: har direkte anskaffelseskilde for eksemplar @da
label: har direkte kilde for anskaffelse av eksemplar @no
label: har senaste förvärvskälla @sv
label: has immediate source of acquisition of item @en
label: hat Bezugsquelle eines Exemplars @de
label: heeft directe bron van verwerving van item @nl
label: kappaleen hankintalähde @fi
label: kopyanın doğrudan sağlandığı kaynak ile ilişkilidir @tr
label: példány közvetlen beszerzési forrása a következő: @hu
label: tiešais vienības komplektēšanas avots @lv
label: té com a font immediata d’adquisició d’un ítem @ca
label: έχει άμεση πηγή της πρόσκτησης του αντιτύπου @el
label: له مصدر مباشر لاقتناء مفردة @ar
label: 有单件的直接获取来源 @zh-hans
definition: Bir kopyayı, yöntem, kaynak ve edinim tarihi de dahil olmak üzere, bir kopyanın doğrudan edinildiği koşullarla ilişkilendirir. @tr
definition: Correla un item alle circostanze nelle quali l'item è stato direttamente acquisito, inclusi metodo, fonte e data di acquisizione. @it
definition: Hozzákapcsol egy példányt azokhoz a körülményekhez, amelyek keretében egy példányt közvetlenül beszereznek, beleértve a beszerzés módszerét, forrását és időpontját. @hu
definition: Liittää kappaleen kappaleen hankintaolosuhteisiin, kuten hankintatapaan, -lähteeseen ja -ajankohtaan. @fi
definition: Liên kết bản với nguồn mà từ đó cơ quan bổ sung trực tiếp bản và điều kiện quy định để nhận được nó. @vi
definition: Met un item en relation avec des circonstances dans lesquelles un item a été directement acquis, notamment une méthode, une source et une date d’acquisition.
definition: Relaciona un ítem amb les circumstàncies sota les quals un ítem és adquirit directament, inclòs un mètode, una font i una data d’adquisició. @ca
definition: Relateert een item aan de omstandigheden waaronder een item direct verworven is, waaronder een methode, bron en datum van verwerving. @nl
definition: Relaterer et eksemplar til de omstændigheder, hvorunder et eksemplar anskaffes, samt metode, kilde og dato for anskaffelse. @da
definition: Relaterer et eksemplar til omstendighetene som et eksemplar direkte blir anskaffet under, inkludert metode, kilde og dato for akvisisjon. @no
definition: Relates an item to the circumstances under which an item is directly acquired, including a method, source, and date of acquisition. @en
definition: Sasaista vienību ar avotu, no kura aģentūra tieši iegūst resursu, un nosacījumiem tā saņemšanai. @lv
definition: Seostab eksemplari eksemplari hankimise asjaoludega, nagu hankimise viis, allikas ja daatum. @et
definition: Setzt ein Exemplar in Beziehung zu den Umständen, unter denen ein Exemplar direkt erworben wird. Darunter fallen Erwerbungsmethoden, Erwerbungsquellen und Erwerbungsdaten. @de
definition: Συνδέει ένα αντίτυπο με μια πηγή από την οποία ένας φορέας απέκτησε άμεσα ένα αντίτυπο και τις συνθήκες υπό τις οποίες το παρέλαβε. @el
definition: يربط مفردة بظروف اقتناء مفردة بصورة مباشرة، ويشمل ذلك طريقة الاقتناء، مصدره، تاريخه. @ar
definition: 将一个单件与单件直接被获取的环境（包括获取的方法、来源和日期）关联起来。 @zh-hans

a pour relation d’item d’accompagnement
instruction number: 24.5
toolkit definition: Bản lèm theo hoặc đi kèm bởi bản khác. @vi
toolkit definition: Ein Exemplar, das ein anderes Exemplar begleitet oder von einem begleitet wird. @de
toolkit definition: Eksemplar der ledsager eller er ledsaget af et eksemplar. @da
toolkit definition: Et eksemplar som ledsager eller ledsages av et annet eksemplar. @no
toolkit definition: Item qui accompagne ou est accompagné par un autre item.
toolkit definition: Kappale, johon on yhdistetty toinen kappale tai joka on yhdistetty toiseen kappaleeseen. @fi
toolkit definition: Un ítem que acompaña o está acompañado por el ítem. @es
toolkit definition: Ítem que acompanya o és acompanyat per un altre ítem. @ca
toolkit definition: Ένα αντίτυπο το οποίο συνοδεύει ή συνοδεύεται από κάποιο άλλο αντίτυπο. @el
toolkit label: Begleitende Beziehung auf Exemplarebene @de
toolkit label: ledsagende eksemplar: relasjonstype @no
toolkit label: ledsagende eksemplarrelation @da
toolkit label: mối quan hệ bản kèm theo @vi
toolkit label: relaciones de ítem acompañante @es
toolkit label: relació d’ítem d’acompanyament @ca
toolkit label: relation d’item d’accompagnement
toolkit label: suhde yhdistettyyn kappaleeseen @fi
toolkit label: συνοδευτική σχέση του αντιτύπου @el
has subproperty: P40051
lexical alias: accompanyingItemRelationship.en
status: Deprecated
type: Property
domain: C10003
label: có mối quan hệ bản kèm theo @vi
label: har ledsagende eksemplarrelation med @da
label: hat begleitende Beziehungen auf Exemplarebene @de
label: suhde yhdistettyyn kappaleeseen @fi
label: té com a relació d’ítem d’acompanyament @ca
label: έχει συνοδευτική σχέση του αντιτύπου με @el
sub property of: a pour item en relation avec un item
definition: Liittää kappaleen sellaiseen kappaleeseen, johon on yhdistetty toinen kappale tai joka on yhdistetty toiseen kappaleeseen. @fi
definition: Liên kết bản với bản lèm theo hoặc đi kèm bởi bản khác. @vi
definition: Met un item en relation avec un item qui accompagne ou est accompagné par un autre item.
definition: Relaciona un item amb un ítem que acompanya o és acompanyat per un altre ítem. @ca
definition: Relaterer et eksemplar til et eksemplar der ledsager eller er ledsaget af et eksemplar. @da
definition: Setzt ein Exemplar mit einem Exemplar, das ein anderes Exemplar begleitet oder von einem begleitet wird, in Beziehung. @de
definition: Συνδέει ένα αντίτυπο με ένα αντίτυπο το οποίο συνοδεύει ή συνοδεύεται από κάποιο άλλο αντίτυπο. @el

has descriptive item relationship with (Deprecated)
instruction number: 24.5
toolkit definition: A work that is a description of the item. (Deprecated) @en
toolkit label: descriptive item relationship (Deprecated) @en
has subproperty: is description of (item) (Deprecated)
lexical alias: descriptiveItemRelationship.en
status: Deprecated
type: Property
domain: C10003
sub property of: a pour item en relation avec un item
definition: Relates an item to a work that is a description of the item. (Deprecated) @en

a pour relation d’item équivalent
instruction number: 18.5
toolkit definition: Bản tương đương với bản khác. @vi
toolkit definition: Ein Exemplar, das mit einem anderen Exemplar äquivalent ist. @de
toolkit definition: Eksemplar der er ækvivalent til et eksemplar. @da
toolkit definition: Et eksemplar som tilsvarer et annet eksemplar. @no
toolkit definition: Item qui est équivalent à un autre item.
toolkit definition: Kappale, joka vastaa toista kappaletta. @fi
toolkit definition: Un ítem que es equivalente al ítem. @es
toolkit definition: Ítem que és equivalent a un altre ítem. @ca
toolkit definition: Ένα αντίτυπο το οποίο είναι ισοδύναμο με κάποιο άλλο αντίτυπο. @el
toolkit label: ekvivalent eksemplar: relasjonstype @no
toolkit label: mối quan hệ bản tương đương @vi
toolkit label: relaciones de ítem equivalente @es
toolkit label: relació d’ítem equivalent @ca
toolkit label: relation d’item équivalent
toolkit label: suhde vastaavaan kappaleeseen @fi
toolkit label: Äquivalenzbeziehung auf Exemplarebene @de
toolkit label: ækvivalent eksemplarrelation @da
toolkit label: ισοδύναμη σχέση του αντιτύπου @el
has subproperty: P40053
lexical alias: equivalentItemRelationship.en
status: Deprecated
type: Property
domain: C10003
label: có mối quan hệ bản tương đương với @vi
label: har ækvivalent eksemplarrelation med @da
label: hat Äquivalenzbeziehung auf Exemplarebene @de
label: suhde vastaavaan kappaleeseen @fi
label: té com a relació d’ítem equivalent @ca
label: έχει ισοδύναμη σχέση του αντιτύπου με @el
sub property of: a pour item en relation avec un item
definition: Liittää kappaleen kappaleeseen, joka vastaa toista kappaletta. @fi
definition: Liên kết bản với bản tương đương với bản khác. @vi
definition: Met un item en relation avec un item qui est équivalent à un autre item.
definition: Relaciona un item amb un ítem que és equivalent a un altre ítem. @ca
definition: Relaterer et eksemplar til et eksemplar der er ækvivalent til et eksemplar. @da
definition: Setzt ein Exemplar mit einem Exemplar, das mit einem anderen Exemplar äquivalent ist, in Beziehung. @de
definition: Συνδέει ένα αντίτυπο με ένα αντίτυπο το οποίο είναι ισοδύναμο με κάποιο άλλο αντίτυπο. @el

a pour relation d’item tout-partie
instruction number: 24.5
toolkit definition: Bản được chứa trong hoặc có chứa bản khác. @vi
toolkit definition: Ein Exemplar, das in einem anderen Exemplar enthalten ist oder eins enthält. @de
toolkit definition: Eksemplar der indgår i, eller indeholder et eksemplar. @da
toolkit definition: Et eksemplar som omfattes av eller selv omfatter et annet eksemplar. @no
toolkit definition: Item qui contient ou est contenu dans un autre item.
toolkit definition: Kappale, joka sisältyy toiseen kappaleeseen tai sisältää toisen kappaleen. @fi
toolkit definition: Un ítem que es incluido en, o contiene el ítem. @es
toolkit definition: Ítem que és contingut o conté un altre ítem. @ca
toolkit definition: Ένα αντίτυπο το οποίο περιέχεται σε ή περιέχει κάποιο άλλο αντίτυπο. @el
toolkit label: Teil-Ganzes-Beziehung auf Exemplarebene @de
toolkit label: helhed-del-eksemplarrelation @da
toolkit label: mối quan hệ bản toàn bộ phần @vi
toolkit label: osa-kokonaissuhde kappaleeseen @fi
toolkit label: relació d’ítem tot-part @ca
toolkit label: relación del ítem todo-parte @es
toolkit label: relasjonstypen hel/del av eksemplar @no
toolkit label: relation d’item tout-partie
toolkit label: σχέση συνόλου-τμήματος του αντιτύπου @el
has subproperty: P40054
lexical alias: wholePartItemRelationship.en
status: Deprecated
type: Property
domain: C10003
label: có mối quan hệ bản toàn bộ-phần với @vi
label: har helhed-del-eksemplarrelation med @da
label: hat Teil-Ganzes-Beziehung auf Exemplarebene @de
label: osa-kokonaissuhde kappaleeseen @fi
label: té com a relació d’ítem tot-part @ca
label: έχει σχέση συνόλου-τμήματος του αντιτύπου με @el
sub property of: a pour item en relation avec un item
definition: Liittää kappaleen kappaleeseen, joka sisältyy toiseen kappaleeseen tai sisältää toisen kappaleen. @fi
definition: Liên kết bản với bản được chứa trong hoặc có chứa bản khác. @vi
definition: Met un item en relation avec un item qui contient ou est contenu dans un autre item.
definition: Relaciona un item amb un ítem que és contingut o conté un altre ítem. @ca
definition: Relaterer et eksemplar til et eksemplar der indgår i, eller indeholder et eksemplar. @da
definition: Setzt ein Exemplar mit einem Exemplar, das in einem anderen Exemplar enthalten ist oder eins enthält, in Beziehung. @de
definition: Συνδέει ένα αντίτυπο με ένα αντίτυπο το οποίο περιέχεται σε ή περιέχει κάποιο άλλο αντίτυπο. @el

est reproduit comme (item)
instruction number: 24.5
toolkit definition: Bản tạo lại bản khác. @vi
toolkit definition: Ein Exemplar, das ein anderes Exemplar reproduziert. @de
toolkit definition: Eksemplar, der reproducerer et andet eksemplar. @da
toolkit definition: Et eksemplar som reproduserer et annet eksemplar. @no
toolkit definition: Item qui reproduit un autre item.
toolkit definition: Kappale, joka on jäljenne toisesta kappaleesta. @fi
toolkit definition: Un ítem que reproduce otro ítem. @es
toolkit definition: Ítem que reprodueix un altre ítem. @ca
toolkit definition: Ένα αντίτυπο που αναπαράγει κάποιο άλλο αντίτυπο. @el
toolkit label: Reproduziert als (Exemplar) @de
toolkit label: jäljenteenä (kappale) @fi
toolkit label: reproduceret som (eksemplar) @da
toolkit label: reproducida como (ítem) @es
toolkit label: reproduit comme (item)
toolkit label: reprodusert som (eksemplar) @no
toolkit label: reproduït com (ítem) @ca
toolkit label: được sao chép như là (bản) @vi
toolkit label: έχει αναπαραχθεί ως (αντίτυπο) @el
has subproperty: a pour transfert numérique (item)
has subproperty: a pour reproduction électronique (item)
has subproperty: a pour fac-similé (item)
has subproperty: est réimprimé comme (item)
has subproperty: P40055
lexical alias: reproducedAsItem.en
status: Deprecated
type: Property
domain: C10003
label: er reproduceret som (eksemplar) @da
label: ist reproduziert als (Exemplar) @de
label: jäljenteenä (kappale) @fi
label: és reproduït com (ítem) @ca
label: được sao chép như là (bản) @vi
label: έχει αναπαραχθεί ως (αντίτυπο) @el
sub property of: a pour item équivalent
definition: Liittää kappaleen kappaleeseen, joka on jäljenne toisesta kappaleesta. @fi
definition: Liên kết bản với bản tạo lại bản khác. @vi
definition: Met un item en relation avec un item qui reproduit un autre item.
definition: Relaciona un item amb un ítem que reprodueix un altre ítem. @ca
definition: Relaterer et eksemplar til et eksemplar, der reproducerer et andet eksemplar. @da
definition: Setzt ein Exemplar mit einem Exemplar, das ein anderes Exemplar reproduziert, in Beziehung. @de
definition: Συνδέει ένα αντίτυπο με ένα αντίτυπο που αναπαράγει κάποιο άλλο αντίτυπο. @el

a pour transfert numérique (item)
instruction number: 24.5
toolkit definition: Bản dưới định dạng số là kết quả của việc chuyển ạng của bản dưới định dạng số khác. @vi
toolkit definition: Digitaalisessa muodossa oleva kappale, joka syntyy toisen digitaalisessa muodossa olevan kappaleen digitoinnin tuloksena. @fi
toolkit definition: Ein Exemplar in einem digitalen Format, das aus der Übertragung eines Exemplars in ein anderes digitales Format resultiert. @de
toolkit definition: Eksemplar i et digitalt format, der er resultatet af overførsel af et eksemplar i et andet digitalt format. @da
toolkit definition: Et eksemplar i digitalt format som er resultatet av overføring av et eksemplar fra et annet digitalt format. @no
toolkit definition: Item en format numérique qui résulte du transfert d’un item dans un format numérique différent.
toolkit definition: Un ítem en un formato digital que resulta de la transferencia de un ítem en otro formato digital. @es
toolkit definition: Ítem en un format digital que és el resultat de la transferència d’un ítem en un altre format digital. @ca
toolkit definition: Ένα αντίτυπο σε ψηφιακό μορφότυπο το οποίο προκύπτει από τη μεταφορά ενός αντιτύπου σε ένα άλλο ψηφιακό μορφότυπο. @el
toolkit label: Digitale Übertragung (Exemplar) @de
toolkit label: chuyển kỹ thuật số (bản) @vi
toolkit label: digital overføring (eksemplar) @no
toolkit label: digital overførsel (eksemplar) @da
toolkit label: konvertoituna (kappale) @fi
toolkit label: transferencia digital (ítem) @es
toolkit label: transfert numérique (item)
toolkit label: transferència digital (ítem) @ca
toolkit label: ψηφιακή μεταφορά (αντίτυπο) @el
has subproperty: P40056
lexical alias: digitalTransferItem.en
status: Deprecated
type: Property
domain: C10003
label: có chuyển kỹ thuật số (bản) @vi
label: har digital overførsel (eksemplar) @da
label: hat digitale Übertragung (Exemplar) @de
label: konvertoituna (kappale) @fi
label: té com a transferència digital (ítem) @ca
label: έχει ψηφιακή μεταφορά (αντίτυπο) @el
sub property of: est reproduit comme (item)
definition: Liittää kappaleen digitaalisessa muodossa olevaan kappaleeseen, joka syntyy toisen digitaalisessa muodossa olevan kappaleen digitoinnin tuloksena. @fi
definition: Liên kết bản với bản dưới định dạng số là kết quả của việc chuyển ạng của bản dưới định dạng số khác. @vi
definition: Met un item en relation avec un item en format numérique qui résulte du transfert d’un item dans un format numérique différent.
definition: Relaciona un item amb un ítem en un format digital que és el resultat de la transferència d’un ítem en un altre format digital. @ca
definition: Relaterer et eksemplar til et eksemplar i et digitalt format, der er resultatet af overførsel af et eksemplar i et andet digitalt format. @da
definition: Setzt ein Exemplar mit einem Exemplar in einem digitalen Format, das aus der Übertragung eines Exemplars in ein anderes digitales Format resultiert, in Beziehung. @de
definition: Συνδέει ένα αντίτυπο με ένα αντίτυπο σε ένα ψηφιακό μορφότυπο το οποίο προκύπτει από τη μεταφορά ενός αντιτύπου σε ένα άλλο ψηφιακό μορφότυπο. @el

a pour reproduction électronique (item)
instruction number: 24.5
toolkit definition: Bản dưới định dạng số là kết quả của việc chuyển ạng của bản dưới định dạng tương tự. @vi
toolkit definition: Digitaalisessa muodossa oleva kappale, joka syntyi analogisessa muodossa olevan kappaleen digitoinnin tuloksena. @fi
toolkit definition: Ein Exemplar in einem digitalen Format, das das Ergebnis der Übertragung eines Exemplars in einem analogen Format ist. @de
toolkit definition: Eksemplar i et digitalt format, der er resultatet af overførsel af et eksemplar i analogt format. @da
toolkit definition: Et eksemplar i digitalt format som er resultatet av overføring av et eksemplar fra analogt format. @no
toolkit definition: Item en format numérique qui résulte du transfert d’un item sur support analogique.
toolkit definition: Un ítem en un formato digital que es el resultado de la transferencia de un ítem en un formato analógico. @es
toolkit definition: Ítem en un format digital que és el resultat de la transferència d’un ítem en format analògic. @ca
toolkit definition: Ένα αντίτυπο σε ένα ψηφιακό μορφότυπο το οποίο προκύπτει από τη μεταφορά ενός αντιτύπου σε αναλογικό μορφότυπο. @el
toolkit label: Elektronische Reproduktion (Exemplar) @de
toolkit label: digitoituna (kappale) @fi
toolkit label: elektronisk reproduksjon (eksemplar) @no
toolkit label: elektronisk reproduktion (eksemplar) @da
toolkit label: reproducció electrònica (ítem) @ca
toolkit label: reproducción electrónica (ítem) @es
toolkit label: reproduction électronique (item)
toolkit label: sao chép điện tử (bản) @vi
toolkit label: ηλεκτρονική αναπαραγωγή (αντίτυπο) @el
has subproperty: P40057
lexical alias: electronicReproductionItem.en
status: Deprecated
type: Property
domain: C10003
label: có sao chép điện tử (bản) @vi
label: digitoituna (kappale) @fi
label: har elektronisk reproduktion (eksemplar) @da
label: hat elektronische Reproduktion (Exemplar) @de
label: té com a reproducció electrònica (ítem) @ca
label: έχει ηλεκτρονική αναπαραγωγή (αντίτυπο) @el
sub property of: est reproduit comme (item)
definition: Liittää kappaleen digitaalisessa muodossa olevaan kappaleeseen, joka syntyi analogisessa muodossa olevan kappaleen digitoinnin tuloksena. @fi
definition: Liên kết bản với bản dưới định dạng số là kết quả của việc chuyển ạng của bản dưới định dạng tương tự. @vi
definition: Met un item en relation avec un item en format numérique qui résulte du transfert d’un item sur support analogique.
definition: Relaciona un item amb un ítem en un format digital que és el resultat de la transferència d’un ítem en format analògic. @ca
definition: Relaterer et eksemplar til et eksemplar i et digitalt format, der er resultatet af overførsel af et eksemplar i analogt format. @da
definition: Setzt ein Exemplar mit einem Exemplar in einem digitalen Format, das das Ergebnis der Übertragung eines Exemplars in einem analogen Format ist, in Beziehung. @de
definition: Συνδέει ένα αντίτυπο με ένα αντίτυπο σε ένα ψηφιακό μορφότυπο η οποία προκύπτει από τη μεταφορά ενός αντιτύπου σε αναλογικό μορφότυπο. @el

a pour fac-similé (item)
instruction number: 24.5
toolkit definition: Bản tạo lại chính xác bản khác. @vi
toolkit definition: Ein Exemplar, das ein anderes Exemplar exakt reproduziert. @de
toolkit definition: Eksemplar, der er en nøjagtig reproduktion af et andet eksemplar. @da
toolkit definition: Et eksemplar som er en tro kopi av et annet eksemplar. @no
toolkit definition: Item qui reproduit exactement un autre item.
toolkit definition: Kappale, joka on toisen kappaleen täysin identtinen jäljennös. @fi
toolkit definition: Un ítem que reproduce exactamente un ítem. @es
toolkit definition: Ítem que reprodueix exactament un ítem. @ca
toolkit definition: Ένα αντίτυπο το οποίο αναπαράγει ακριβώς κάποιο άλλο αντίτυπο. @el
toolkit label: Faksimile (Exemplar) @de
toolkit label: fac-similé (item)
toolkit label: facsímil (ítem) @ca
toolkit label: faksimile (eksemplar) @da
toolkit label: näköispainos (kappale) @fi
toolkit label: sao chép (bản) @vi
toolkit label: ομοιότυπο (αντίτυπο) @el
has subproperty: a pour fac-similé de conservation (item)
has subproperty: P40058
lexical alias: facsimileItem.en
status: Deprecated
type: Property
domain: C10003
label: có sao chép (bản) @vi
label: har faksimile (eksemplar) @da
label: hat Faksimile (Exemplar) @de
label: näköispainos (kappale) @fi
label: té com a facsímil (ítem) @ca
label: έχει ομοιότυπο (αντίτυπο) @el
sub property of: est reproduit comme (item)
definition: Liittää kappaleen kappaleeseen, joka on toisen kappaleen täysin identtinen jäljennös. @fi
definition: Liên kết bản với bản tạo lại chính xác bản khác. @vi
definition: Met un item en relation avec un item qui reproduit exactement un autre item.
definition: Relaciona un item amb un ítem que reprodueix exactament un ítem. @ca
definition: Relaterer et eksemplar til et eksemplar, der er en nøjagtig reproduktion af et andet eksemplar. @da
definition: Setzt ein Exemplar mit einem Exemplar, das ein anderes Exemplar exakt reproduziert, in Beziehung. @de
definition: Συνδέει ένα αντίτυπο με ένα αντίτυπο το οποίο αναπαράγει ακριβώς κάποιο άλλο αντίτυπο. @el

a pour fac-similé de conservation (item)
instruction number: 24.5
toolkit definition: Bản gồm có bản tạo lại chính xác trên phương tiện chất lượng bảo quản, như là giấy vĩnh cửu phi axit hoặc giấy lưu trữ. @vi
toolkit definition: Ein Exemplar, das aus einer exakten Reproduktion auf bestandserhaltenden Medien, wie z. B. säurefreiem oder Archivpapier, besteht. @de
toolkit definition: Eksemplar, der består af en nøjagtig reproduktion på et medium af bevaringskvalitet, såsom syrefrit permanent- eller arkivpapir. @da
toolkit definition: Et eksemplar som består av en eksakt reproduksjon på et medium av bevaringskvalitet, for eksempel syrefritt pergament eller arkivpapir. @no
toolkit definition: Item qui consiste en une reproduction exacte sur un support de qualité conservation, tel qu’un papier permanent sans acide ou un papier d’archivage.
toolkit definition: Kappale, joka on arkistokelpoinen (kuten hapoton arkistopaperi), täysin identtinen jäljennös. @fi
toolkit definition: Un ítem que consiste en una reproducción exacta sobre un medio con calidad de preservación, tal como papel libre de ácido o papel de archivo. @es
toolkit definition: Ítem que consisteix en una reproducció exacta en un suport de preservació de qualitat, com ara paper permanent no àcid o paper d’arxiu. @ca
toolkit definition: Ένα αντίτυπο το οποίο συνίσταται από μια ακριβή αναπαραγωγή πάνω σε μέσα διατήρησης της ποιότητας, όπως αντιόξινο μόνιμο ή αρχειακό χαρτί. @el
toolkit label: Bestandserhaltungsfaksimile (Exemplar) @de
toolkit label: bevaringsfaksimile eksemplar @da
toolkit label: bevaringskopi (eksemplar) @no
toolkit label: bản sao chép bản quản (bản) @vi
toolkit label: fac-similé de conservation (item)
toolkit label: facsímil de preservació (ítem) @ca
toolkit label: facsímil de preservación (ítem) @es
toolkit label: säilytyskopio (kappale) @fi
toolkit label: διατήρηση ομοιότυπου (αντίτυπο) @el
has subproperty: P40059
lexical alias: preservationFacsimileItem.en
status: Deprecated
type: Property
domain: C10003
label: có sao chép bảo quản (bản) @vi
label: har bevaringsfaksimile (eksemplar) @da
label: hat Bestandserhaltungsfaksimile (Exemplar) @de
label: säilytyskopio (kappale) @fi
label: té com a facsímil de preservació (ítem) @ca
label: έχει διατήρηση ομοιότυπου (αντίτυπο) @el
sub property of: a pour fac-similé (item)
definition: Liittää kappaleen kappaleeseen, joka on arkistokelpoinen (kuten hapoton arkistopaperi), täysin identtinen jäljennös. @fi
definition: Liên kết bản với bản gồm có bản tạo lại chính xác trên phương tiện chất lượng bảo quản, như là giấy vĩnh cửu phi axit hoặc giấy lưu trữ. @vi
definition: Met un item en relation avec un item qui consiste en une reproduction exacte sur un support de qualité conservation, tel qu’un papier permanent sans acide ou un papier d’archivage.
definition: Relaciona un item amb un ítem que consisteix en una reproducció exacta en un suport de preservació de qualitat, com ara paper permanent no àcid o paper d’arxiu. @ca
definition: Relaterer et eksemplar til et eksemplar, der består af en nøjagtig reproduktion på et medium af bevaringskvalitet, såsom syrefrit permanent- eller arkivpapir. @da
definition: Setzt ein Exemplar mit einem Exemplar, das aus einer exakten Reproduktion auf bestandserhaltenden Medien, wie z. B. säurefreiem oder Archivpapier, besteht, in Beziehung. @de
definition: Συνδέει ένα αντίτυπο με ένα αντίτυπο το οποίο συνίσταται από μια ακριβή αναπαραγωγή πάνω σε μέσα διατήρησης της ποιότητας, όπως αντιόξινο μόνιμο ή αρχειακό χαρτί. @el

est réimprimé comme (item)
instruction number: 24.5
toolkit definition: Bản là bản công bố lại của bản thể hiện biểu thị được in khác. @vi
toolkit definition: Ein Exemplar, das eine Neuausgabe eines Exemplars ist, das eine andere gedruckte Manifestation darstellt. @de
toolkit definition: Eksemplar, der er en genudgivelse af et eksemplar, som eksemplificerer en anden trykt manifestation. @da
toolkit definition: Et eksemplar som er et opptrykk av et eksemplar som er et eksempel på en annen trykt manifestasjon. @no
toolkit definition: Item qui est une réédition d’un item représentant une autre manifestation imprimée.
toolkit definition: Kappale, joka on uusi painos toisesta samansisältöisestä manifestaatiosta. @fi
toolkit definition: Un ítem que es una reedición de un ítem que ejemplifica otra manifestación impresa. @es
toolkit definition: Ítem que és una reimpressió d’un ítem que exemplifica una altra manifestació impresa. @ca
toolkit definition: Ένα αντίτυπο το οποίο είναι επανέκδοση ενός αντιτύπου που υλοποιεί κάποια άλλη έντυπη εκδήλωση. @el
toolkit label: Nachgedruckt als (Exemplar) @de
toolkit label: genoptrykt som (eksemplar) @da
toolkit label: opptrykt som (eksemplar) @no
toolkit label: reimpreso como (ítem) @es
toolkit label: reimprès com (ítem) @ca
toolkit label: réimprimé comme (item)
toolkit label: uusintapainos (kappale) @fi
toolkit label: được in lại như là (bản) @vi
toolkit label: ανατυπωμένο ως (αντίτυπο) @el
has subproperty: P40060
lexical alias: reprintedAsItem.en
status: Deprecated
type: Property
domain: C10003
label: er genoptryk som (eksemplar) @da
label: ist nachgedruckt als (Exemplar) @de
label: uusintapainos (kappale) @fi
label: és reimprès com (ítem) @ca
label: được in lại như là (bản) @vi
label: είναι ανατυπωμένο ως (αντίτυπο) @el
sub property of: est reproduit comme (item)
definition: Liittää kappaleen kappaleeseen, joka on uusi painos toisesta samansisältöisestä manifestaatiosta. @fi
definition: Liên kết bản với bản là bản công bố lại của bản thể hiện biểu thị được in khác. @vi
definition: Met un item en relation avec un item qui est une réédition d’un item représentant une autre manifestation imprimée.
definition: Relaciona un item amb un ítem que és una reimpressió d’un ítem que exemplifica una altra manifestació impresa. @ca
definition: Relaterer et eksemplar til et eksemplar, der er en genudgivelse af et eksemplar, som eksemplificerer en anden trykt manifestation. @da
definition: Setzt ein Exemplar mit einem Exemplar, das eine Neuausgabe eines Exemplars ist, das eine andere gedruckte Manifestation darstellt, in Beziehung. @de
definition: Συνδέει ένα αντίτυπο με ένα αντίτυπο το οποίο είναι επανέκδοση ενός αντιτύπου που υλοποιεί κάποια άλλη έντυπη εκδήλωση. @el

est un item sujet de
has element type: 2
toolkit definition: A work that is about an item. @en
toolkit definition: Bir kopya hakkındaki bir eser. @tr
toolkit definition: Darbs, kura temats ir vienība. @lv
toolkit definition: Een werk dat over een item gaat. @nl
toolkit definition: Egy mű, ami egy példányról szól. @hu
toolkit definition: Ein Werk, das von einem Exemplar handelt. @de
toolkit definition: Et verk som handler om et eksemplar. @no
toolkit definition: Kappaleesta kertova teos. @fi
toolkit definition: Obra que tracta d’un ítem. @ca
toolkit definition: Opera che tratta di un item. @it
toolkit definition: Teos, mis on eksemplari kohta. @et
toolkit definition: Tác phẩm về bản. @vi
toolkit definition: Værk, som handler om et eksemplar. @da
toolkit definition: Œuvre qui traite d’un item.
toolkit definition: Ένα έργο σχετικά με ένα αντίτυπο. @el
toolkit definition: عمل عن مفردة @ar
toolkit definition: 关于一个单件的一种作品 @zh-hans
toolkit label: Thema von (Exemplar) @de
toolkit label: chủ đề của (bản) @vi
toolkit label: eksemplar, som er subjekt af @da
toolkit label: emne for eksemplar @no
toolkit label: ir temats (vienība) @lv
toolkit label: item soggetto di @it
toolkit label: item sujet de
toolkit label: kappale aiheena teoksessa @fi
toolkit label: konu alınan kopya @tr
toolkit label: käsitletud teoses (eksemplar) @et
toolkit label: onderwerp-item van @nl
toolkit label: példány-tárgya: @hu
toolkit label: subject item of @en
toolkit label: ítem de matèria de @ca
toolkit label: θέμα του (αντίτυπο) @el
toolkit label: مفردة لموضوع عن @ar
toolkit label: ……的主题单件 @zh-hans
has subproperty: est un item décrit par
has subproperty: P40061
lexical alias: subjectItemOf.en
status: Published
type: Property
domain: C10003
label: er eksemplar, som er subjekt af @da
label: er emne for eksemplar @no
label: ir temats (vienība) @lv
label: is onderwerp-item van @nl
label: is subject item of @en
label: ist Thema von (Exemplar) @de
label: kappale aiheena teoksessa @fi
label: konu kopyasıdır @tr
label: käsitletud teoses (eksemplar) @et
label: là chủ đề của (bản) @vi
label: példány-tárgya a következőnek: @hu
label: è item soggetto di @it
label: és ítem de matèria de @ca
label: είναι θέμα του (αντίτυπο) @el
label: هي مفردة موضوع لـ @ar
label: 是……的主题单件 @zh-hans
sub property of: a pour œuvre en relation avec un item
sub property of: P00014
alternative label: (koyanın) konusu @tr
alternative label: Thema von (Exemplar) @de
alternative label: emne for (eksemplar) @no
alternative label: genstand for (eksemplar) @da
alternative label: matèria de (ítem) @ca
alternative label: soggetto di (item) @it
alternative label: subject of (item) @en
alternative label: sujet de (item)
alternative label: tema de (ítem) @es
alternative label: tárgya (példány): @hu
alternative label: موضوع (لمفردة) @ar
alternative label: ……的主题（单件） @zh-hans
definition: Bir kopyayı, bir kopya hakkında olan bir eserle ilişkilendirir. @tr
definition: Correla un item a un'opera che tratta di un item. @it
definition: Hozzákapcsol egy példányt egy műhöz, ami egy példányról szól. @hu
definition: Liittää kappaleen kappaleesta kertovaan teokseen. @fi
definition: Liên kết bản với tác phẩm về bản. @vi
definition: Met un item en relation avec une œuvre qui traite d’un item.
definition: Relaciona un ítem amb una obra que tracta d’un ítem. @ca
definition: Relateert een item aan een werk dat over een item gaat. @nl

est un item décrit par
has element type: 2
instruction number: 23.5
toolkit definition: A work that is a description of an item. @en
toolkit definition: Bir kopyanın tanımı olan bir eser @tr
toolkit definition: Darbs, kurā aprakstīta konkrētā vienība. @lv
toolkit definition: Een werk dat een item beschrijft. @nl
toolkit definition: Egy mű, amely egy példányt ír le. @hu
toolkit definition: Ein Werk, das ein Exemplar beschreibt. @de
toolkit definition: Et verk som beskriver et eksemplar. @no
toolkit definition: Obra que es una descripció d’un ítem. @ca
toolkit definition: Opera che descrive un item. @it
toolkit definition: Teos, joka kuvaa kappaletta. @fi
toolkit definition: Teos, milles kirjeldatakse eksemplari. @et
toolkit definition: Tác phẩm mô tả bản được mô tả. @vi
toolkit definition: Una obra que describe un ítem descrito. @es
toolkit definition: Værk, som beskriver et eksemplar. @da
toolkit definition: Œuvre qui consiste en une description d’un item.
toolkit definition: Ένα έργο που περιγράφει ένα περιγραφόμενο αντίτυπο. @el
toolkit definition: عمل يصف مفردة @ar
toolkit definition: 作为一个单件之描述的一种作品 @zh-hans
toolkit label: Exemplar beschrieben in @de
toolkit label: beskrevet i eksemplar @no
toolkit label: descrita en (ítem) @es
toolkit label: eksemplar beskrevet i @da
toolkit label: eksemplari kirjeldus @et
toolkit label: item beschreven in @nl
toolkit label: item described by @en
toolkit label: item descritto in @it
toolkit label: item décrit par
toolkit label: kappaletta kuvaava teos @fi
toolkit label: példány leírva a következőben: @hu
toolkit label: tarafından açıklanan kopya @tr
toolkit label: vienības apraksts @lv
toolkit label: ítem descrit per @ca
toolkit label: được mô tả trong (bản) @vi
toolkit label: περιγράφεται στο (αντίτυπο) @el
toolkit label: مفردة موصوفة في @ar
toolkit label: 被……描述的单件 @zh-hans
has subproperty: est un item analysé dans
has subproperty: est un item commenté dans
has subproperty: est un item critiqué dans
has subproperty: est un item évalué dans
has subproperty: est un item recensé dans
has subproperty: est un item décrit avec des métadonnées par
has subproperty: P40062
lexical alias: itemDescribedBy.en
status: Published
type: Property
domain: C10003
label: eksemplari kirjeldus @et
label: er beskrevet i eksemplar @no
label: er eksemplar beskrevet i @da
label: ir vienības apraksts @lv
label: is item beschreven in @nl
label: is item described by @en
label: ist Exemplar beschrieben in @de
label: kappaletta kuvaava teos @fi
label: példány leírva a következőben: @hu
label: tarafından tanımlanan kopyadır @tr
label: è item descritto in @it
label: és ítem descrit per @ca
label: được mô tả trong (bản) @vi
label: περιγράφεται στο (αντίτυπο) @el
label: هي مفردة موصوفة في @ar
label: 是被……描述的单件 @zh-hans
sub property of: est un item sujet de
alternative label: Beschrieben in (Exemplar) @de
alternative label: açıklanan (kopya) @tr
alternative label: beskrevet i (eksemplar) @da
alternative label: described in (item) @en
alternative label: descrit en (ítem) @ca
alternative label: descrito en (ítem) @es
alternative label: descritto in (item) @it
alternative label: décrit dans (item)
alternative label: item décrit dans
alternative label: kappaleen kuvaus @fi
alternative label: leírva a következőben (példány): @hu
alternative label: موصوف في(مفردة) @ar
alternative label: 被描述于（单件） @zh-hans

est un item analysé dans
has element type: 2
instruction number: 23.5
toolkit definition: A work that describes the structure and composition of an item. @en
toolkit definition: Bir kopyanın yapı ve kompozisyonunu tanımlayan bir eser. @tr
toolkit definition: Darbs, kas analizē pamatvienības sastāvdaļas un to attiecības. @lv
toolkit definition: Een werk dat de structuur en compositie van een item beschrijft. @nl
toolkit definition: Egy mű, amely egy példányt vizsgál, hogy leírhassa annak alkotóelemeit és azok viszonyait. @hu
toolkit definition: Ein Werk, das den Aufbau und die Zusammensetzung eines Exemplars beschreibt. @de
toolkit definition: Et verk som beskriver strukturen og komposisjonen av et eksemplar. @no
toolkit definition: Obra que descriu l’estructura i la composició d’un ítem. @ca
toolkit definition: Opera che descrive la struttura e la composizione di un item. @it
toolkit definition: Teos, joka kuvailee kappaleen rakennetta ja kokoonpanoa. @fi
toolkit definition: Teos, milles kirjeldatakse eksemplari struktuuri ja kompositsiooni @et
toolkit definition: Tác phẩm kiểm tra bản nguồn để nhận dạng các thành phần của nó và quan hệ của chúng. @vi
toolkit definition: Una obra que examina el ítem fuente para identificar sus componentes y sus relaciones. @es
toolkit definition: Værk, som beskriver et eksemplars struktur og sammensætning. @da
toolkit definition: Œuvre qui décrit la structure et la composition d’un item.
toolkit definition: Ένα έργο που εξετάζει ένα αντίτυπο-πηγή για την ταύτιση των συστατικών του και των σχέσεων τους. @el
toolkit definition: عمل يصف هيكل مفردة وتركيبها @ar
toolkit definition: 描述一个单件的结构和创作的一种作品 @zh-hans
toolkit label: Analiz edilen kopya @tr
toolkit label: Exemplar analysiert in @de
toolkit label: analizada en (ítem) @es
toolkit label: analizzato in @it
toolkit label: analysert i eksemplar @no
toolkit label: eksemplar analyseret i @da
toolkit label: eksemplari analüüs @et
toolkit label: item analysed in @en
toolkit label: item analysé dans
toolkit label: item geanalyseerd in @nl
toolkit label: kappaleen analyysi @fi
toolkit label: példány elemezve a következőben: @hu
toolkit label: vienības analīze @lv
toolkit label: ítem analitzat en @ca
toolkit label: được phân tích trong (bản) @vi
toolkit label: αναλύεται στο (αντίτυπο) @el
toolkit label: مفردة تم تحليلها في @ar
toolkit label: 被分析于……的单件 @zh-hans
has subproperty: P40063
lexical alias: itemAnalysedIn.en
status: Published
type: Property
domain: C10003
label: analiz edilen kopyadır @tr
label: eksemplari analüüs @et
label: er analysert i eksemplar @no
label: er eksemplar analyseret i @da
label: ir vienības analīze @lv
label: is item analysed in @en
label: is item geanalyseerd in @nl
label: ist Exemplar analysiert in @de
label: kappaleen analyysi @fi
label: példány elemezve a következőben: @hu
label: è item analizzato in @it
label: és ítem analitzat en @ca
label: được phân tích trong (bản) @vi
label: αναλύεται στο (αντίτυπο) @el
label: هي مفردة تم تحليلها في @ar
label: 是被分析于……的单件 @zh-hans
sub property of: est un item décrit par
alternative label: Analysiert in (Exemplar) @de
alternative label: analitzat en (ítem) @ca
alternative label: analiz edilen (kopya) @tr
alternative label: analizado en (ítem) @es
alternative label: analizzato in (item) @it
alternative label: analysed in (item) @en
alternative label: analyseret i (eksemplar) @da
alternative label: analysert i (eksemplar) @no
alternative label: analysé dans (item)
alternative label: elemezve a következőben (példány): @hu
alternative label: تم تحليلها في (مفردة) @ar
alternative label: 被分析于（单件） @zh-hans
definition: Bir kopyayı, bir kopyanın yapısını ve bileşimini tanımlayan bir eserle ilişkilendirir. @tr
definition: Correla un item a un'opera che descrive la struttura e la composizione di un item. @it
definition: Hozzákapcsol egy példányt egy műhöz, amely egy példányt vizsgál, hogy leírhassa annak alkotóelemeit és azok viszonyait. @hu
definition: Liittää kappaleen teokseen, joka kuvailee kappaleen rakennetta ja kokoonpanoa. @fi
definition: Liên kết bản với tác phẩm kiểm tra bản nguồn để nhận dạng các thành phần của nó và quan hệ của chúng. @vi
definition: Met un item en relation avec une œuvre qui décrit la structure et la composition d’un item.
definition: Relaciona un ítem amb una obra que descriu l’estructura i la composició d’un ítem. @ca

est un item commenté dans
has element type: 2
instruction number: 23.5
toolkit definition: A work that is a set of explanatory or critical notes on an item. @en
toolkit definition: Bir kopya üzerine açıklayıcı veya eleştirel notlar dizisi olan bir eser. @tr
toolkit definition: Darbs, kas satur skaidrojošu vai kritisku piezīmju kopumu par aprakstīto objektu. @lv
toolkit definition: Een werk dat is een verzameling van verklarende of kritische noten over een item. @nl
toolkit definition: Egy mű, amely egy példány magyarázó vagy kritikai jegyzeteinek a halmaza. @hu
toolkit definition: Ein Werk, bei dem es sich um eine Reihe von erläuternden oder kritischen Anmerkungen zu einem Exemplar handelt. @de
toolkit definition: Et verk som inneholder et sett med forklarende eller kritiske noter til et eksemplar. @no
toolkit definition: Obra que és un conjunt de notes explicatives o crítiques sobre un ítem. @ca
toolkit definition: Opera che contiene un insieme di note esplicative o critiche su un item. @it
toolkit definition: Teos, joka on selittävä tai kriittinen huomautus kappaleesta. @fi
toolkit definition: Teos, mis sisaldab kogumi selgitavaid või kriitilisi märkusi eksemplari kohta. @et
toolkit definition: Tác phẩm có chứa chuỗi các ghi chú giải thích hoặc phê bình về bản được mô tả. @vi
toolkit definition: Una obra que contiene un conjunto de notas explicativas o críticas sobre el ítem descrito. @es
toolkit definition: Værk, som indeholder forklarende eller kritiske noter om et eksemplar. @da
toolkit definition: Œuvre qui consiste en un ensemble de notes explicatives ou critiques sur un item.
toolkit definition: Ένα έργο που περιέχει ένα σύνολο επεξηγηματικών ή κριτκών σημειώσεων σε ένα περιγραφόμενο αντίτυπο. @el
toolkit definition: عمل هو مجموعة تبصرات توضيحية أو نقدية عن مفردة. @ar
toolkit definition: 作为关于一个单件的评注或批评附注的集合的一种作品 @zh-hans
toolkit label: Exemplar kommentiert in @de
toolkit label: bình luận trong (bản) @vi
toolkit label: comentari d’ítem en @ca
toolkit label: comentario en (ítem) @es
toolkit label: eksemplar kommentar i @da
toolkit label: eksemplari kommentaar @et
toolkit label: item becommentarieerd in @nl
toolkit label: item commentary in @en
toolkit label: item commentato in @it
toolkit label: item commenté dans
toolkit label: kappaleen kommentaari @fi
toolkit label: kommentert i eksemplar @no
toolkit label: kopya yorumu @tr
toolkit label: példány kommentálva a következőben: @hu
toolkit label: vienības komentārs @lv
toolkit label: σχόλια στο (αντίτυπο) @el
toolkit label: تعليق على مفردة في @ar
toolkit label: 在……中的单件评注 @zh-hans
has subproperty: P40064
lexical alias: itemCommentaryIn.en
status: Published
type: Property
domain: C10003
label: eksemplari kommentaar @et
label: er eksemplar kommentar i @da
label: er kommentert i eksemplar @no
label: ir vienības komentārs @lv
label: is item becommentarieerd in @nl
label: is item commentary in @en
label: ist Exemplar kommentiert in @de
label: kappaleen kommentaari @fi
label: kopya yorumudur @tr
label: là bình luận trong (bản) @vi
label: példány kommentálva a következőben: @hu
label: è item commentato in @it
label: és comentari d’ítem en @ca
label: είναι σχόλια στο (αντίτυπο) @el
label: هو تعليق على مفردة في @ar
label: 是在……中的单件评注 @zh-hans
sub property of: est un item décrit par
alternative label: Kommentar in (Exemplar) @de
alternative label: comentari en (ítem) @ca
alternative label: comentario en (ítem) @es
alternative label: commentaire dans (item)
alternative label: commentary in (item) @en
alternative label: commento a (item) @it
alternative label: kommentar i (eksemplar) @da
alternative label: kommentert i (eksemplar) @no
alternative label: kommentálva a következőben (példány): @hu
alternative label: yorum (kopya) @tr
alternative label: تعليق في (مفردة) @ar
alternative label: 在……中的评注（单件） @zh-hans
definition: Bir kopyayı, bir kopya hakkında açıklayıcı veya eleştirel notlar kümesi olan bir eserle ilişkilendirir. @tr
definition: Correla un item a un'opera che contiene un insieme di note esplicative o critiche su un item. @it
definition: Hozzákapcsol egy példányt egy műhöz, amely egy példány magyarázó vagy kritikai jegyzeteinek a halmaza. @hu
definition: Liittää kappaleen teokseen, joka on selittävä tai kriittinen huomautus kappaleesta. @fi
definition: Liên kết bản với tác phẩm có chứa chuỗi các ghi chú giải thích hoặc phê bình về bản được mô tả. @vi
definition: Met un item en relation avec une œuvre qui consiste en un ensemble de notes explicatives ou critiques sur un item.
definition: Relaciona un ítem amb una obra que és un conjunt de notes explicatives o crítiques sobre un ítem. @ca

est un item critiqué dans
has element type: 2
instruction number: 23.5
toolkit definition: A work that is a critical evaluation of an item. (Deprecated) @en
toolkit definition: Darbs, kas satur aprakstītās vienības kritisku novērtējumu @lv
toolkit definition: Een werk dat is een kritische beschouwing van een item. @nl
toolkit definition: Egy mű, amely egy példány kritikai értékelése. @hu
toolkit definition: Ein Werk, bei dem es sich um eine kritische Untersuchung eines Exemplars handelt. @de
toolkit definition: Et verk som inneholder en kritisk evaluering av et eksemplar. @no
toolkit definition: Obra que és una avaluació crítica d’un ítem. @ca
toolkit definition: Opera che contiene una valutazione critica di un item. @it
toolkit definition: Teos, joka sisältää kriittinen arviointi kappaleesta. @fi
toolkit definition: Teos, mis sisaldab kriitilist hinnangut eksemplarile. @et
toolkit definition: Tác phẩm có chứa đánh giá phê bình về bản được mô tả. @vi
toolkit definition: Una obra que contiene una evaluación crítica del ítem descrito. @es
toolkit definition: Værk, som indeholder kritisk evaluering af et eksemplar. @da
toolkit definition: Œuvre qui consiste en une évaluation critique d’un item.
toolkit definition: Ένα έργο που περιέχει μια κριτική αξιολόγηση ενός περιγραφόμενου αντιτύπου. @el
toolkit definition: عمل يتضمن تقييما نقديا لمفردة. @ar
toolkit label: Kritik eines Exemplars in @de
toolkit label: criticada en (ítem) @es
toolkit label: eksemplar kritiseret i @da
toolkit label: eksemplari arvustus @et
toolkit label: item bekritiseerd in @nl
toolkit label: item critiqued in (Deprecated) @en
toolkit label: item critiqué dans
toolkit label: item sottoposto a critica in @it
toolkit label: kappaleen kritiikki @fi
toolkit label: kritisert i eksemplar @no
toolkit label: példány bírálva a következőben: @hu
toolkit label: vienības kritika @lv
toolkit label: ítem criticat en @ca
toolkit label: được phê bình trong (bản) @vi
toolkit label: κρίνεται στο (αντίτυπο) @el
toolkit label: مفردة منتَقدة في @ar
has subproperty: P40065
lexical alias: itemCritiquedIn.en
status: Deprecated
type: Property
domain: C10003
label: eksemplari arvustus @et
label: er eksemplar kritiseret i @da
label: er kritisert i eksemplar @no
label: ir vienības kritika @lv
label: is item bekritiseerd in @nl
label: is item critiqued in (Deprecated) @en
label: ist Kritik eines Exemplars in @de
label: kappaleen kritiikki @fi
label: példány bírálva a következőben: @hu
label: è item sottoposto a critica in @it
label: és ítem criticat en @ca
label: được phê bình trong (bản) @vi
label: κρίνεται στο (αντίτυπο) @el
label: هي مفردة منتقدة في @ar
sub property of: est un item décrit par
alternative label: Kritik in (Exemplar) @de
alternative label: bírálva a következőben (példány): @hu
alternative label: criticat en (ítem) @ca
alternative label: critiqued in (item) @en
alternative label: critiqué dans (item)
alternative label: kritiseret i (eksemplar) @da
alternative label: kritisert i (eksemplar) @no
alternative label: sottoposto a critica (item) @it
alternative label: منتقدة في (مفردة) @ar
definition: Correla un item a un'opera che contiene una valutazione critica di un item. @it
definition: Hozzákapcsol egy példányt egy műhöz, amely egy példány kritikai értékelése. @hu
definition: Liittää kappaleen teokseen, joka on kriittinen arviointi kappaleesta. @fi
definition: Liên kết bản với tác phẩm có chứa đánh giá phê bình về bản được mô tả. @vi
definition: Met un item en relation avec une œuvre qui consiste en une évaluation critique d’un item.
definition: Relaciona un ítem amb una obra que és una avaluació crítica d’un ítem. @ca
definition: Relateert een item aan een werk dat is een kritische beschouwing van een item. @nl
definition: Relaterer et eksemplar til et verk som inneholder en kritisk evaluering av et eksemplar. @no
definition: Relaterer et eksemplar til et værk, som indeholder kritisk evaluering af et eksemplar. @da
definition: Relates an item to a work that is a critical evaluation of an item. (Deprecated) @en
definition: Sasaista vienību ar darbu, kas satur aprakstītās vienības kritisku novērtējumu. @lv
definition: Seostab eksemplari teosega, mis sisaldab kriitilist hinnangut eksemplarile. @et
definition: Setzt ein Exemplar in Beziehung zu einem Werk, bei dem es sich um eine kritische Untersuchung eines Exemplars handelt. @de
definition: Συνδέει ένα αντίτυπο με ένα έργο που περιέχει μια κριτική αξιολόγηση ενός περιγραφόμενου αντιτύπου. @el
definition: يربط مفردة بعمل يتضمن تقييما نقديا لمفردة. @ar

est un item évalué dans
has element type: 2
instruction number: 23.5
toolkit definition: A work that examines or judges an item. (Deprecated) @en
toolkit definition: Darbs, kas analizē vai novērtē konkrēto vienību. @lv
toolkit definition: Een werk dat een item onderzoekt of beoordeelt. @nl
toolkit definition: Egy mű, amely egy példányt vizsgál és ítél meg. @hu
toolkit definition: Ein Werk, das ein Exemplar untersucht oder beurteilt. @de
toolkit definition: Et verk som utforsker eller vurderer et eksemplar. @no
toolkit definition: Obra que examina o jutja un ítem. @ca
toolkit definition: Opera che esamina o giudica un item. @it
toolkit definition: Teos, joka tutkii ja arvioi kappaletta. @fi
toolkit definition: Teos, milles kontrollitakse või hinnatakse eksemplari. @et
toolkit definition: Tác phẩm kiểm tra hoặc đánh giá bản đang được mô tả. @vi
toolkit definition: Una obra que examina o juzga el ítem descrito. @es
toolkit definition: Værk, som undersøger eller bedømmer et eksemplar. @da
toolkit definition: Œuvre qui examine ou juge un item.
toolkit definition: Ένα έργο που εξετάζει ή κρίνει ένα περιγραφόμενο αντίτυπο. @el
toolkit definition: عمل يفحص أو يحكم على مفردة. @ar
toolkit label: Exemplar evaluiert in @de
toolkit label: eksemplar evalueret i @da
toolkit label: eksemplari hinnang @et
toolkit label: evaluada en (ítem) @es
toolkit label: evaluert i eksemplar @no
toolkit label: item beschouwd in @nl
toolkit label: item evaluated in (Deprecated) @en
toolkit label: item valutato in @it
toolkit label: item évalué dans
toolkit label: kappaleen arviointi @fi
toolkit label: példány értékelve a következőben: @hu
toolkit label: vienības novērtējums @lv
toolkit label: ítem avaluat en @ca
toolkit label: được đánh giá trong (bản) @vi
toolkit label: αξιολογείται στο (αντίτυπο) @el
toolkit label: مفردة مقيَّمة في @ar
has subproperty: P40066
lexical alias: itemEvaluatedIn.en
status: Deprecated
type: Property
domain: C10003
label: eksemplari hinnang @et
label: er eksemplar evalueret i @da
label: er evaluert i eksemplar @no
label: ir vienības novērtējums @lv
label: is item beschouwd in @nl
label: is item evaluated in (Deprecated) @en
label: ist Exemplar evaluiert in @de
label: kappaleen arviointi @fi
label: példány értékelve a következőben: @hu
label: è item valutato in @it
label: és ítem avaluat en @ca
label: được đánh giá trong (bản) @vi
label: αξιολογείται στο (αντίτυπο) @el
label: هي مفردة مُقيَّمة في @ar
sub property of: est un item décrit par
alternative label: Evaluiert in (Exemplar) @de
alternative label: avaluat en (ítem) @ca
alternative label: evaluated in (item) @en
alternative label: evalueret i (eksemplar) @da
alternative label: evaluert i (eksemplar) @no
alternative label: valutato in (item) @it
alternative label: értékelve a következőben (példány): @hu
alternative label: évalué dans (item)
alternative label: مقيَّمة في (مفردة) @ar
definition: Correla un item a un'opera che esamina o giudica un item. @it
definition: Hozzákapcsol egy példányt egy műhöz, amely egy példányt vizsgál és ítél meg. @hu
definition: Liittää kappaleen teokseen, joka tutkii ja arvioi kappaletta. @fi
definition: Liên kết bản với tác phẩm kiểm tra hoặc đánh giá bản đang được mô tả. @vi
definition: Met un item en relation avec une œuvre qui examine ou juge un item.
definition: Relaciona un ítem amb una obra que examina o jutja un ítem. @ca
definition: Relateert een item aan een werk dat een item onderzoekt of beoordeelt. @nl
definition: Relaterer et eksemplar til et verk som utforsker eller vurderer et eksemplar. @no
definition: Relaterer et eksemplar til et værk, som undersøger eller bedømmer et eksemplar. @da
definition: Relates an item to a work that examines or judges an item. (Deprecated) @en
definition: Sasaista vienību ar darbu, kas analizē vai novērtē konkrēto vienību. @lv
definition: Seostab eksemplari teosega, milles kontrollitakse või hinnatakse eksemplari. @et
definition: Setzt ein Exemplar in Beziehung zu einem Werk, das ein Exemplar untersucht oder beurteilt. @de
definition: Συνδέει ένα αντίτυπο με ένα έργο που εξετάζει ή κρίνει ένα περιγραφόμενο αντίτυπο. @el
definition: يربط مفردة بعمل يفحص أو يحكم على مفردة. @ar

est un item recensé dans
has element type: 2
instruction number: 23.5
toolkit definition: A work that is a brief evaluation of an item. (Deprecated) @en
toolkit definition: Darbs, kas satur īsu aprakstītās vienības novērtējumu. @lv
toolkit definition: Een werk dat is een korte beschouwing van een item. @nl
toolkit definition: Egy mű, amely egy példány rövid értékelése. @hu
toolkit definition: Ein Werk, bei dem es sich um eine kurze Untersuchung eines Exemplars handelt. @de
toolkit definition: Et verk som inneholder en kortfattet evaluering av et eksemplar. @no
toolkit definition: Obra que és una avaluació breu d’un ítem. @ca
toolkit definition: Opera che contiene una breve valutazione di un item. @it
toolkit definition: Teos, joka on lyhyt arviointi kappaleesta. @fi
toolkit definition: Teos, mis sisaldab lühikest hinnangut eksemplarile. @et
toolkit definition: Tác phẩm có chứa đánh giá vắn tắt về bản đang được mô tả. @vi
toolkit definition: Una obra que contiene una evaluación breve del ítem descrito. @es
toolkit definition: Værk, som indeholder en kort kritik af et eksemplar. @da
toolkit definition: Œuvre qui consiste en une brève évaluation d’un item.
toolkit definition: Ένα έργο που περιέχει μια σύντομη αξιολόγηση ενός περιγραφόμενου αντιτύπου. @el
toolkit definition: عمل يتضمن تقييما مختصرا لمفردة @ar
toolkit label: Exemplar rezensiert in @de
toolkit label: anmeldt i eksemplar @no
toolkit label: eksemplar anmeldt i @da
toolkit label: eksemplari ülevaade @et
toolkit label: item gerecenseerd in @nl
toolkit label: item recensito in @it
toolkit label: item recensé dans
toolkit label: item reviewed in (Deprecated) @en
toolkit label: kappaleen arvostelu @fi
toolkit label: példány szemlézve a következőben: @hu
toolkit label: reseñada en (ítem) @es
toolkit label: vienības recenzija @lv
toolkit label: ítem revisat en @ca
toolkit label: được tổng quan trong (bản) @vi
toolkit label: εξετάζεται στο (αντίτυπο) @el
toolkit label: مفردة قيد المراجعة في @ar
has subproperty: P40067
lexical alias: itemReviewedIn.en
status: Deprecated
type: Property
domain: C10003
label: eksemplari ülevaade @et
label: er anmeldt i eksemplar @no
label: er eksemplar anmeldt i @da
label: ir vienības recenzija @lv
label: is item gerecenseerd in @nl
label: is item reviewed in (Deprecated) @en
label: ist Exemplar rezensiert in @de
label: kappaleen arvostelu @fi
label: példány szemlézve a következőben: @hu
label: è item recensito in @it
label: és ítem revisat en @ca
label: được tổng quan trong (bản) @vi
label: εξετάζεται στο (αντίτυπο) @el
label: هي مفردة قيد المراجعة في @ar
sub property of: est un item décrit par
alternative label: Rezensiert in (Exemplar) @de
alternative label: anmeldt i (eksemplar) @da
alternative label: recensito in (item) @it
alternative label: recensé dans (item)
alternative label: reviewed in (item) @en
alternative label: revisat en (ítem) @ca
alternative label: szemlézve a következőben (példány): @hu
alternative label: معروض في (مفردة) @ar
definition: Correla un item a un'opera che contiene una breve valutazione di un item. @it
definition: Hozzákapcsol egy példányt egy műhöz, amely egy példány rövid értékelése. @hu
definition: Liittää kappaleen teokseen, joka on lyhyt arviointi kappaleesta. @fi
definition: Liên kết bản với tác phẩm có chứa đánh giá vắn tắt về bản đang được mô tả. @vi
definition: Met un item en relation avec une œuvre qui consiste en est une brève évaluation d’un item.
definition: Relaciona un ítem amb una obra que és una avaluació breu d’un ítem. @ca
definition: Relateert een item aan een werk dat is een korte beschouwing van een item. @nl
definition: Relaterer et eksemplar til et verk som inneholder en kortfattet evaluering av et eksemplar. @no
definition: Relaterer et eksemplar til et værk, som indeholder en kort kritik af et eksemplar. @da
definition: Relates an item to a work that is a brief evaluation of an item. (Deprecated) @en
definition: Sasaista vienību ar darbu, kas satur īsu aprakstītās vienības novērtējumu. @lv
definition: Seostab eksemplari teosega, mis sisaldab lühikest hinnangut eksemplarile. @et
definition: Setzt ein Exemplar in Beziehung zu einem Werk, bei dem es sich um eine kurze Untersuchung eines Exemplars handelt. @de
definition: Συνδέει ένα αντίτυπο με ένα έργο που περιέχει μια σύντομη αξιολόγηση ενός περιγραφόμενου αντιτύπου. @el
definition: يربط مفردة بعمل يتضمن تقييما مختصرا لمفردة. @ar

a pour entité RDA en relation avec un item
has element type: 1
toolkit definition: An RDA entity that is associated with an item. @en
toolkit definition: Bir kopyayla bağlantılı olan bir RDA varlığı. @tr
toolkit definition: Een RDA-entiteit die geassocieerd is met een item. @nl
toolkit definition: Egy RDA-entitás, amelyet egy példányhoz társítanak. @hu
toolkit definition: Eine RDA-Entität, die mit einem Exemplar in Verbindung steht. @de
toolkit definition: Eksemplariga seotud RDA olem. @et
toolkit definition: En RDA-entitet som forbindes med et eksemplar. @no
toolkit definition: Entitat RDA que s’associa amb un ítem. @ca
toolkit definition: Entità RDA associata a un item. @it
toolkit definition: Entité RDA qui est associée à un item.
toolkit definition: RDA entīte, kas saistīta ar vienību. @lv
toolkit definition: RDA-entiteetti, joka liittyy kappaleeseen. @fi
toolkit definition: RDA-entitet, som er knyttet til et eksemplar. @da
toolkit definition: كيان "وام" ذو الصلة بمفردة. @ar
toolkit definition: 和一个单件有关的一个RDA实体 @zh-hans
toolkit label: Kopyanın RDA varlığyla ilişkisi @tr
toolkit label: RDA-entitet relateret til eksemplar @da
toolkit label: RDA-entitet relatert til eksemplar @no
toolkit label: ar vienību saistītā RDA entīte @lv
toolkit label: eksemplariga seotud RDA olem @et
toolkit label: entitat RDA relacionada amb un ítem @ca
toolkit label: entità RDA correlata di item @it
toolkit label: entité RDA en relation avec un item
toolkit label: gerelateerde RDA-entiteit van item @nl
toolkit label: kappaleeseen liittyvä RDA-entiteetti @fi
toolkit label: mit Exemplar in Beziehung stehende RDA-Entität @de
toolkit label: példányhoz kapcsolódó RDA-entitás: @hu
toolkit label: related RDA entity of item @en
toolkit label: له كيان "وام" مرتبط بمفردة @ar
toolkit label: 关联的RDA单间实体 @zh-hans
has subproperty: a pour item en relation avec un item
has subproperty: a pour œuvre en relation avec un item
has subproperty: a pour expression en relation avec un item
has subproperty: a pour manifestation en relation avec un item
has subproperty: a pour agent en relation avec un item
has subproperty: a pour lieu en relation avec un item
has subproperty: a pour laps de temps en relation avec un item
has subproperty: a pour nomen en relation avec un item
has subproperty: P40068
lexical alias: relatedRDAEntityOfItem.en
status: Published
type: Property
domain: C10003
label: ar vienību saistītā RDA entīte @lv
label: có thực thể có liên quan (bản) @vi
label: eksemplariga seotud RDA olem @et
label: ha come entità RDA correlata di item @it
label: har RDA-entitet relateret til eksemplar @da
label: har RDA-entitet relatert til eksemplar @no
label: has related RDA entity of item @en
label: hat mit Exemplar in Beziehung stehende RDA-Entität @de
label: heeft gerelateerde RDA-entiteit van item @nl
label: kappaleeseen liittyvä RDA-entiteetti @fi
label: kopyanın ilgili RDA varlığı ile ilişkilidir @tr
label: példány kapcsolódó RDA-entitása a következő: @hu
label: té com a entitat RDA relacionada amb un ítem @ca
label: έχει σχετική οντότητα στο (αντίτυπο) @el
label: لها كيان "وام" مرتبط بمفردة @ar
label: 有关联的RDA单间实体 @zh-hans
sub property of: a pour entité en relation avec un item
sub property of: P00001
definition: Bir kopyayı, bir kopyayla bağlantılı olan bir RDA varlığıyla ilişkilendirir. @tr
definition: Correla un item a un'entità RDA associata a un item. @it
definition: Hozzákapcsol egy példányt egy RDA-entitáshoz, amelyet egy példányhoz társítanak. @hu
definition: Liittää kappaleen RDA-entiteettiin, joka liittyy kappaleeseen. @fi
definition: Liên kết bản với thực thể liên quan với bản đang được mô tả. @vi
definition: Met un item en relation avec une entité RDA qui est associée à un item.
definition: Relaciona un ítem amb una entitat RDA que s’associa amb un ítem. @ca
definition: Relateert een item aan een RDA-entiteit die geassocieerd is met een item. @nl
definition: Relaterer et eksemplar til en RDA-entitet som forbindes med et eksemplar. @no
definition: Relaterer et eksemplar til en RDA-entitet, som er knyttet til et eksemplar. @da
definition: Relates an item to an RDA entity that is associated with an item. @en
definition: Sasaista vienību ar RDA entīti, kas saistīta ar vienību. @lv
definition: Seostab eksemplari eksemplariga seotud RDA olemiga. @et
definition: Setzt ein Exemplar in Beziehung zu einer RDA-Entität, die mit einem Exemplar in Verbindung steht. @de
definition: Συνδέει ένα αντίτυπο με μια οντότητα που συνδέεται με ένα περιγραφόμενο αντίτυπο. @el
definition: يربط مفردة بكيان "وام" ذي الصلة بمفردة. @ar
definition: 将一个单件与和一个单件有关的一个RDA实体关联起来。 @zh-hans

a pour œuvre en relation avec un item
has element type: 1
toolkit definition: A work that is associated with an item. @en
toolkit definition: Bir kopya ile bağlantılı olan bir eser. @tr
toolkit definition: Darbs, kas saistīts ar vienību. @lv
toolkit definition: Een werk dat geassocieerd is met een item. @nl
toolkit definition: Egy mű, amelyet egy példányhoz társítanak. @hu
toolkit definition: Ein Werk, das mit einem Exemplar in Verbindung steht. @de
toolkit definition: Eksemplariga seotud teos. @et
toolkit definition: Et verk som forbindes med et eksemplar. @no
toolkit definition: Obra que s’associa amb un ítem. @ca
toolkit definition: Opera associata a un item. @it
toolkit definition: Teos, joka liittyy kappaleeseen. @fi
toolkit definition: Værk, som er knyttet til et eksemplar. @da
toolkit definition: Œuvre qui est associée à un item.
toolkit definition: عمل ذو صلة بمفردة @ar
toolkit definition: 和一个单件有关的一种作品 @zh-hans
toolkit label: Kopyayla ilişkili eser @tr
toolkit label: ar vienību saistītais darbs @lv
toolkit label: eksemplariga seotud teos @et
toolkit label: gerelateerd werk van item @nl
toolkit label: kappaleeseen liittyvä teos @fi
toolkit label: mit Exemplar in Beziehung stehendes Werk @de
toolkit label: obra relacionada amb un ítem @ca
toolkit label: opera correlata di item @it
toolkit label: példányhoz kapcsolódó mű: @hu
toolkit label: related work of item @en
toolkit label: verk relatert til eksemplar @no
toolkit label: værk relateret til eksemplar @da
toolkit label: œuvre en relation avec un item
toolkit label: عمل مرتبط بمفردة @ar
toolkit label: 单件的关联作品 @zh-hans
has subproperty: est un item sujet de
has subproperty: a pour reliure d’un item
has subproperty: P40069
lexical alias: relatedWorkOfItem.en
status: Published
type: Property
domain: C10003
label: ar vienību saistītais darbs @lv
label: có tác phẩm có liên quan (bản) @vi
label: eksemplariga seotud teos @et
label: ha come opera correlata di item @it
label: har verk relatert til eksemplar @no
label: har værk relateret til eksemplar @da
label: has related work of item @en
label: hat mit Exemplar in Beziehung stehendes Werk @de
label: heeft gerelateerd werk van item @nl
label: kappaleeseen liittyvä teos @fi
label: kopyanın ilgili eseri ile ilişkilidir @tr
label: példány kapcsolódó műve a következő: @hu
label: té com a obra relacionada amb un ítem @ca
label: έχει σχετικό έργο (αντίτυπο) @el
label: له عمل مرتبط بمفردة @ar
label: 有单件的关联作品 @zh-hans
sub property of: a pour entité RDA en relation avec un item
sub property of: P00002
definition: Bir kopyayı, bir kopyayla bağlantılı olan bir eserle ilişkilendirir. @tr
definition: Correla un item un'opera associata a un item. @it
definition: Hozzákapcsol egy példányt egy műhöz, amelyet egy példányhoz társítanak. @hu
definition: Liittää kappaleen teokseen, joka liittyy kappaleeseen. @fi
definition: Liên kết bản với tác phẩm liên quan với bản đang được mô tả. @vi
definition: Met un item en relation avec une œuvre qui est associée à un item.
definition: Relaciona un ítem amb una obra que s’associa amb un ítem. @ca
definition: Relateert een item aan een werk dat geassocieerd is met een item. @nl
definition: Relaterer et eksemplar til et verk som forbindes med et eksemplar. @no
definition: Relaterer et eksemplar til et værk, som er knyttet til et eksemplar. @da
definition: Relates an item to a work that is associated with an item. @en
definition: Sasaista vienību ar darbu, kas saistīts ar vienību. @lv
definition: Seostab eksemplari eksemplariga seotud teosega. @et
definition: Setzt ein Exemplar in Beziehung zu einem Werk, das mit einem Exemplar in Verbindung steht. @de
definition: Συνδέει ένα αντίτυπο με ένα έργο που συνδέεται με ένα περιγραφόμενο αντίτυπο. @el
definition: يربط مفردة بعمل ذي صلة بمفردة. @ar
definition: 将一个单件与和一个单件有关的一种作品关联起来。 @zh-hans

a pour expression en relation avec un item
has element type: 1
toolkit definition: An expression that is associated with an item. @en
toolkit definition: Bir öğeyle bağlantılı olan bir anlatım. @tr
toolkit definition: Een expressie die geassocieerd is met een item. @nl
toolkit definition: Egy kifejezési forma, amelyet egy példányhoz társítanak. @hu
toolkit definition: Eine Expression, die mit einem Exemplar in Verbindung steht. @de
toolkit definition: Eksemplariga seotud väljendus. @et
toolkit definition: Ekspressio, joka liittyy kappaleeseen. @fi
toolkit definition: Espressione associata a un item. @it
toolkit definition: Et uttrykk som forbindes med et eksemplar. @no
toolkit definition: Expression qui est associée à un item.
toolkit definition: Expressió que s’associa amb un ítem. @ca
toolkit definition: Izteiksme, kas ir saistīta ar vienību. @lv
toolkit definition: Udtryk, som er knyttet til et eksemplar. @da
toolkit definition: تعبيرة ذات صلة بمفردة @ar
toolkit definition: 和一个单件有关的一种内容表达 @zh-hans
toolkit label: Kopyanın ilişkili anlatımı @tr
toolkit label: ar vienību saistītā izteiksme @lv
toolkit label: eksemplariga seotud väljendus @et
toolkit label: espressione correlata di item @it
toolkit label: expression en relation avec un item
toolkit label: expressió relacionada amb un ítem @ca
toolkit label: gerelateerde expressie van item @nl
toolkit label: kappaleeseen liittyvä ekspressio @fi
toolkit label: mit Exemplar in Beziehung stehende Expression @de
toolkit label: példányhoz kapcsolódó kifejezési forma: @hu
toolkit label: related expression of item @en
toolkit label: udtryk relateret til eksemplar @da
toolkit label: uttrykk relatert til eksemplar @no
toolkit label: تعبيرة مرتبطة بمفردة @ar
toolkit label: 单件的关联内容表达 @zh-hans
has subproperty: P40070
lexical alias: relatedExpressionOfItem.en
status: Published
type: Property
domain: C10003
label: ar vienību saistītā izteiksme @lv
label: có biểu hiện có liên quan (bản) @vi
label: eksemplariga seotud väljendus @et
label: ha come espressione correlata di item @it
label: har udtryk relateret til eksemplar @da
label: har uttrykk relatert til eksemplar @no
label: has related expression of item @en
label: hat mit Exemplar in Beziehung stehende Expression @de
label: heeft gerelateerde expressie van item @nl
label: kappaleeseen liittyvä ekspressio @fi
label: kopyanın ilgili anlatımı ile ilişkilidir @tr
label: példány kapcsolódó kifejezési formája a következő: @hu
label: té com a expressió relacionada amb un ítem @ca
label: έχει σχετική έκφραση (αντίτυπο) @el
label: له تعبيرة ذات صلة بمفردة @ar
label: 有单件的关联内容表达 @zh-hans
sub property of: a pour entité RDA en relation avec un item
sub property of: P00003
definition: Bir kopyayı, bir kopyayla bağlantılı bir anlatımla ilişkilendirir. @tr
definition: Correla un item a un'espressione associata a un item. @it
definition: Hozzákapcsol egy példányt egy kifejezési formához, amelyet egy példányhoz társítanak. @hu
definition: Liittää kappaleen ekspressioon, joka liittyy kappaleeseen. @fi
definition: Liên kết bản với biểu hiện liên quan với bản đang được mô tả. @vi
definition: Met un item en relation avec une expression qui est associée à un item.
definition: Relaciona un ítem amb una expressió que s’associa amb un ítem. @ca
definition: Relateert een item aan een expressie die geassocieerd is met een item. @nl
definition: Relaterer et eksemplar til et udtryk, som er knyttet til et eksemplar. @da
definition: Relaterer et eksemplar til et uttrykk som forbindes med et eksemplar. @no
definition: Relates an item to an expression that is associated with an item. @en
definition: Sasaista vienību ar izteiksmi, kas ir saistīta ar vienību. @lv
definition: Seostab eksemplari eksemplariga seotud väljendusega. @et
definition: Setzt ein Exemplar in Beziehung zu einer Expression, die mit einem Exemplar in Verbindung steht. @de
definition: Συνδέει ένα αντίτυπο με μια έκφραση συνδεδεμένη με ένα περιγραφόμενο αντίτυπο. @el
definition: يربط مفردة بتعبيرة ذات صلة بمفردة. @ar
definition: 将一个单件与和一个单件有关的一种内容表达关联起来。 @zh-hans

a pour manifestation en relation avec un item
has element type: 1
toolkit definition: A manifestation that is associated with an item. @en
toolkit definition: Bir kopya ile bağlantılı olan bir gösterim. @tr
toolkit definition: Een manifestatie die geassocieerd is met een item. @nl
toolkit definition: Egy megjelenési forma, amelyet egy példányhoz társítanak. @hu
toolkit definition: Eine Manifestation, die mit einem Exemplar in Verbindung steht. @de
toolkit definition: Eksemplariga seotud kehastus. @et
toolkit definition: En manifestasjon som forbindes med et eksemplar. @no
toolkit definition: Manifestaatio, joka liittyy kappaleeseen. @fi
toolkit definition: Manifestació que s’associa amb un ítem. @ca
toolkit definition: Manifestation qui est associée à un item.
toolkit definition: Manifestation, som er knyttet til et eksemplar. @da
toolkit definition: Manifestazione associata a un item. @it
toolkit definition: Manifestācija, kas ir saistīta ar vienību. @lv
toolkit definition: تجسيدة ذات صلة بمفردة @ar
toolkit definition: 和一个单件有关的一种载体表现 @zh-hans
toolkit label: Kopyanın ilişkili gösterimi @tr
toolkit label: ar vienību saistītā manifestācija @lv
toolkit label: eksemplariga seotud kehastus @et
toolkit label: gerelateerde manifestatie van item @nl
toolkit label: kappaleeseen liittyvä manifestaatio @fi
toolkit label: manifestació relacionada amb un ítem @ca
toolkit label: manifestasjon relatert til eksemplar @no
toolkit label: manifestation en relation avec un item
toolkit label: manifestation relateret til eksemplar @da
toolkit label: manifestazione correlata di item @it
toolkit label: mit Exemplar in Beziehung stehende Manifestation @de
toolkit label: példányhoz kapcsolódó megjelenési forma: @hu
toolkit label: related manifestation of item @en
toolkit label: تجسيدة مرتبطة بمفردة @ar
toolkit label: 单件的关联载体表现 @zh-hans
has subproperty: a pour manifestation exemplifiée
has subproperty: est reproduit comme un item
has subproperty: est conservé par
has subproperty: P40071
lexical alias: relatedManifestationOfItem.en
status: Published
type: Property
domain: C10003
label: ar vienību saistītā manifestācija @lv
label: có biểu thị có liên quan (bản) @vi
label: eksemplariga seotud kehastus @et
label: ha come manifestazione correlata di item @it
label: har manifestasjon relatert til eksemplar @no
label: har manifestation relateret til eksemplar @da
label: has related manifestation of item @en
label: hat mit Exemplar in Beziehung stehende Manifestation @de
label: heeft gerelateerde manifestatie van item @nl
label: kappaleeseen liittyvä manifestaatio @fi
label: kopyanın ilgili gösterimi ile ilişkilidir @tr
label: példány kapcsolódó megjelenési formája a következő: @hu
label: té com a manifestació relacionada amb un ítem @ca
label: έχει σχετική εκδήλωση (αντίτυπο) @el
label: له تجسيدة مرتبطة بمفردة @ar
label: 有单件的关联载体表现 @zh-hans
sub property of: a pour entité RDA en relation avec un item
sub property of: P00004
definition: Bir kopyayı, bir kopyayla bağlantılı olan bir gösterimle ilişkilendirir. @tr
definition: Correla un item a una manifestazione associata a un item. @it
definition: Hozzákapcsol egy példányt egy megjelenési formához, amelyet egy példányhoz társítanak. @hu
definition: Liittää kappaleen manifestaatioon, joka liittyy kappaleeseen. @fi
definition: Liên kết bản với thực biểu hiện liên quan với bản đang được mô tả. @vi
definition: Met un item en relation avec une manifestation qui est associée à un item.
definition: Relaciona un ítem amb una manifestació que s’associa amb un ítem. @ca
definition: Relateert een item aan een manifestatie die geassocieerd is met een item. @nl
definition: Relaterer et eksemplar til en manifestasjon som forbindes med et eksemplar. @no
definition: Relaterer et eksemplar til en manifestation, som er knyttet til et eksemplar. @da
definition: Relates an item to a manifestation that is associated with an item. @en
definition: Sasaista vienību ar manifestāciju, kas ir saistīta ar vienību. @lv
definition: Seostab eksemplari eksemplariga seotud kehastusega. @et
definition: Setzt ein Exemplar in Beziehung zu einer Manifestation, die mit einem Exemplar in Verbindung steht. @de
definition: Συνδέει ένα αντίτυπο με μια εκδήλωση που συνδέεται με ένα περιγραφόμενο αντίτυπο. @el
definition: يربط مفردة بتجسيدة ذات صلة بمفردة. @ar
definition: 将一个单件与和一个单件有关的一种载体表现关联起来。 @zh-hans

a pour agent en relation avec un item
has element type: 1
toolkit definition: Agent que s’associa amb un ítem. @ca
toolkit definition: Agent qui est associé à un item.
toolkit definition: Agent, som er knyttet til et eksemplar. @da
toolkit definition: Agente associato a un item. @it
toolkit definition: An agent who is associated with an item. @en
toolkit definition: Aģents, kas saistīts ar vienību. @lv
toolkit definition: Bir kopyayla bağlantılı olan bir temsilci. @tr
toolkit definition: Een actor die geassocieerd is met een item. @nl
toolkit definition: Egy példányhoz kapcsolódó ágens. @hu
toolkit definition: Ein Akteur, der mit einem Exemplar in Verbindung steht. @de
toolkit definition: Eksemplariga seotud tegija. @et
toolkit definition: En agent som forbindes med et eksemplar. @no
toolkit definition: Toimija, joka liittyy kappaleeseen. @fi
toolkit definition: وكيل ذو صلة بمفردة @ar
toolkit definition: 和一个单件有关的一个行为者 @zh-hans
toolkit label: Kopyayla ilişkili temsilci @tr
toolkit label: agent en relation avec un item
toolkit label: agent relacionat amb un ítem @ca
toolkit label: agent relateret til eksemplar @da
toolkit label: agent relatert til eksemplar @no
toolkit label: agente correlato di item @it
toolkit label: ar vienību saistītais aģents @lv
toolkit label: eksemplariga seotud tegija @et
toolkit label: gerelateerde actor van item @nl
toolkit label: kappaleeseen liittyvä toimija @fi
toolkit label: mit Exemplar in Beziehung stehender Akteur @de
toolkit label: példány kapcsolódó ágense: @hu
toolkit label: related agent of item @en
toolkit label: وكيل مرتبط بمفردة @ar
toolkit label: 单件的关联行为者 @zh-hans
has subproperty: a pour agent conservateur
has subproperty: a pour agent dépositaire
has subproperty: a pour agent propriétaire
has subproperty: a pour agent honoré d’un item
has subproperty: a pour autre agent associé à un item
has subproperty: a pour agent dédicataire d’un item
has subproperty: a pour personne en relation avec un item
has subproperty: a pour agent collectif en relation avec un item
has subproperty: a pour agent modificateur
has subproperty: P40072
lexical alias: relatedAgentOfItem.en
status: Published
type: Property
domain: C10003
label: ar vienību saistītais aģents @lv
label: có tác nhân có liên quan (bản) @vi
label: eksemplariga seotud tegija @et
label: har agent relateret til eksemplar @da
label: har agent relatert til eksemplar @no
label: has related agent of item @en
label: hat mit Exemplar in Beziehung stehenden Akteur @de
label: ha come agente correlato di item @it
label: heeft gerelateerde actor van item @nl
label: kappaleeseen liittyvä toimija @fi
label: kopyanın ilgili temsilcisi ile ilişkilidir @tr
label: példány kapcsolódó ágense a következő: @hu
label: té com a agent relacionat amb un ítem @ca
label: έχει σχετικό φορέα (αντίτυπο) @el
label: له وكيل مرتبط بمفردة @ar
label: 有单件的关联行为者 @zh-hans
sub property of: a pour entité RDA en relation avec un item
sub property of: P00006
alternative label: Sonstiger Akteur, der mit einem Exemplar in Verbindung steht @de
alternative label: altre agent associat amb un ítem @ca
alternative label: autre agent associé à un item
alternative label: kappaleeseen liittyvä muu toimija @fi
alternative label: other agent associated with item @en
alternative label: otro agente asociado con ítem @es
alternative label: példányhoz kapcsolódó egyéb ágens: @hu
alternative label: Öğeyle bağlantılı diğer temsilci @tr
alternative label: وكيل آخر ذو صلة بمفردة @ar
alternative label: 和单件有关的其他行为者 @zh-hans
definition: Bir kopyayı, bir kopyayla bağlantılı olan bir temsilciyle ilişkilendirir. @tr
definition: Correla un item a un agente associato a un item. @it
definition: Hozzákapcsol egy példányt egy példányhoz kapcsolódó ágenshez. @hu
definition: Liittää kappaleen toimijaan, joka liittyy kappaleeseen. @fi
definition: Liên kết bản với tác nhân liên quan với bản đang được mô tả. @vi
definition: Met un item en relation avec un agent qui est associé à un item.

a pour personne en relation avec un item
has element type: 1
toolkit definition: A person who is associated with an item. @en
toolkit definition: Bir kopya ile bağlantılı olan bir kişi. @tr
toolkit definition: Een persoon die geassocieerd is met een item. @nl
toolkit definition: Egy példányhoz kapcsolódó személy. @hu
toolkit definition: Eine Person, die mit einem Exemplar in Verbindung steht. @de
toolkit definition: Eksemplariga seotud isik. @et
toolkit definition: En person som forbindes med et eksemplar. @no
toolkit definition: Henkilö, joka liittyy kappaleeseen. @fi
toolkit definition: Person, som er knyttet til et eksemplar. @da
toolkit definition: Persona associata a un item. @it
toolkit definition: Persona que s’associa amb un ítem. @ca
toolkit definition: Persona, kura saistīta ar vienību. @lv
toolkit definition: Personne qui est associée à un item.
toolkit definition: شخص ذو صلة بمفردة @ar
toolkit definition: 和一个单件有关的一个个人 @zh-hans
toolkit label: Kopyayla ilişkili kişi @tr
toolkit label: ar vienību saistītā persona @lv
toolkit label: eksemplariga seotud isik @et
toolkit label: gerelateerde persoon van item @nl
toolkit label: kappaleeseen liittyvä henkilö @fi
toolkit label: mit Exemplar in Beziehung stehende Person @de
toolkit label: person relateret til eksemplar @da
toolkit label: person relatert til eksemplar @no
toolkit label: persona correlata di item @it
toolkit label: persona relacionada amb un ítem @ca
toolkit label: personne en relation avec un item
toolkit label: példányhoz kapcsolódó személy: @hu
toolkit label: related person of item @en
toolkit label: شخص مرتبط بمفردة @ar
toolkit label: 单件的关联个人 @zh-hans
has subproperty: a pour personne dédicataire d’un item
has subproperty: a pour personne conservatrice
has subproperty: a pour personne dépositaire
has subproperty: a pour personne propriétaire
has subproperty: a pour personne honorée d’un item
has subproperty: a pour personne modificatrice
has subproperty: P40073
lexical alias: relatedPersonOfItem.en
status: Published
type: Property
domain: C10003
label: ar vienību saistītā persona @lv
label: có cá nhân có liên quan (bản) @vi
label: eksemplariga seotud isik @et
label: ha come persona correlata di item @it
label: har person relateret til eksemplar @da
label: har person relatert til eksemplar @no
label: has related person of item @en
label: hat mit Exemplar in Beziehung stehende Person @de
label: heeft gerelateerde persoon van item @nl
label: kappaleeseen liittyvä henkilö @fi
label: kopyanın ilgili kişisi ile ilişkilidir @tr
label: példány kapcsolódó személye a következő: @hu
label: té com a persona relacionada amb un ítem @ca
label: έχει σχετικό φυσικό πρόσωπο (αντίτυπο) @el
label: له شخص مرتبط بمفردة @ar
label: 有单件的关联个人 @zh-hans
sub property of: a pour agent en relation avec un item
sub property of: P00007
definition: Bir kopyayı, bir kopyayla bağlantılı olan bir kişiyle ilişkilendirir. @tr
definition: Correla un item a una persona associata a un item. @it
definition: Hozzákapcsol egy példányt egy példányhoz kapcsolódó személyhez. @hu
definition: Liittää kappaleen henkilöön, joka liittyy kappaleeseen. @fi
definition: Liên kết bản với cá nhân liên quan với bản đang được mô tả. @vi
definition: Met un item en relation avec une personne qui est associée à un item.
definition: Relaciona un ítem amb una persona que s’associa amb un ítem. @ca
definition: Relateert een item aan een persoon die geassocieerd is met een item. @nl
definition: Relaterer et eksemplar til en person som forbindes med et eksemplar. @no
definition: Relaterer et eksemplar til en person, som er knyttet til et eksemplar. @da
definition: Relates an item to a person who is associated with an item. @en
definition: Sasaista vienību ar personu, kura saistīta ar vienību. @lv
definition: Seostab eksemplari eksemplariga seotud isikuga. @et
definition: Setzt ein Exemplar in Beziehung zu einer Person, die mit einem Exemplar in Verbindung steht. @de
definition: Συνδέει ένα αντίτυπο με ένα φυσικό πρόσωπο που συνδέεται με ένα περιγραφόμενο αντίτυπο. @el
definition: يربط مفردة بشخص ذي صلة بمفردة. @ar
definition: 将一个单件与和一个单件有关的一个个人关联起来。 @zh-hans

a pour famille en relation avec un item
has element type: 1
toolkit definition: A family who is associated with an item. @en
toolkit definition: Bir kopya ile bağlantılı olan bir aile. @tr
toolkit definition: Dzimta/ģimene, kas saistīta ar vienību. @lv
toolkit definition: Een familie die geassocieerd is met een item. @nl
toolkit definition: Egy példányhoz kapcsolódó család. @hu
toolkit definition: Eine Familie, die mit einem Exemplar in Verbindung steht. @de
toolkit definition: Eksemplariga seotud perekond. @et
toolkit definition: En familie som forbindes med et eksemplar. @no
toolkit definition: Famiglia associata a un item. @it
toolkit definition: Familie, som er knyttet til et eksemplar. @da
toolkit definition: Famille qui est associée à un item.
toolkit definition: Família que s’associa amb un ítem. @ca
toolkit definition: Suku, joka liittyy kappaleeseen. @fi
toolkit definition: عائلة ذات صلة بمفردة @ar
toolkit definition: 和一个单件有关的一个家族 @zh-hans
toolkit label: Kopyayla ilişkili aile @tr
toolkit label: ar vienību saistītā dzimta/ģimene @lv
toolkit label: eksemplariga seotud perekond @et
toolkit label: famiglia correlata di item @it
toolkit label: familie relateret til eksemplar @da
toolkit label: familie relatert til eksemplar @no
toolkit label: famille en relation avec un item
toolkit label: família relacionada amb un ítem @ca
toolkit label: gerelateerde familie van item @nl
toolkit label: kappaleeseen liittyvä suku @fi
toolkit label: mit Exemplar in Beziehung stehende Familie @de
toolkit label: példányhoz kapcsolódó család: @hu
toolkit label: related family of item @en
toolkit label: عائلة مرتبطة بمفردة @ar
toolkit label: 单件的关联家族 @zh-hans
has subproperty: a pour famille dédicataire d’un item
has subproperty: a pour famille conservatrice
has subproperty: a pour famille dépositaire
has subproperty: a pour famille propriétaire
has subproperty: a pour famille honorée d’un item
has subproperty: a pour famille modificatrice
has subproperty: P40074
lexical alias: relatedFamilyOfItem.en
status: Published
type: Property
domain: C10003
label: ar vienību saistītā dzimta/ģimene @lv
label: có gia đình có liên quan (bản) @vi
label: eksemplariga seotud perekond @et
label: har familie relateret til eksemplar @da
label: har familie relatert til eksemplar @no
label: has related family of item @en
label: hat mit Exemplar in Beziehung stehende Familie @de
label: ha come famiglia correlata di item @it
label: heeft gerelateerde familie van item @nl
label: kappaleeseen liittyvä suku @fi
label: kopyanın ilgili ailesi ile ilişkilidir @tr
label: példány kapcsolódó családja a következő: @hu
label: té com a família relacionada amb un ítem @ca
label: έχει σχετική οικογένεια (αντίτυπο) @el
label: له عائلة مرتبطة بمفردة @ar
label: 有单件的关联家族 @zh-hans
sub property of: a pour agent collectif en relation avec un item
sub property of: P00008
definition: Bir kopyayı, bir kopyayla bağlantılı olan bir aileyle ilişkilendirir. @tr
definition: Correla un item a una famiglia associata a un item. @it
definition: Hozzákapcsol egy példányt egy példányhoz kapcsolódó családhoz. @hu
definition: Liittää kappaleen sukuun, joka liittyy kappaleeseen. @fi
definition: Liên kết bản với gia đình liên quan với bản đang được mô tả. @vi
definition: Met un item en relation avec une famille qui est associée à un item.
definition: Relaciona un ítem amb una família que s’associa amb un ítem. @ca
definition: Relateert een item aan een familie die geassocieerd is met een item. @nl
definition: Relaterer et eksemplar til en familie som forbindes med et eksemplar. @no
definition: Relaterer et eksemplar til en familie, som er knyttet til et eksemplar. @da
definition: Relates an item to a family who is associated with an item. @en
definition: Sasaista vienību ar dzimtu/ģimeni, kas saistīta ar vienību. @lv
definition: Seostab eksemplari eksemplariga seotud perekonnaga. @et
definition: Setzt ein Exemplar in Beziehung zu einer Familie, die mit einem Exemplar in Verbindung steht. @de
definition: Συνδέει ένα αντίτυπο με μια οικογένεια που συνδέεται με ένα περιγραφόμενο αντίτυπο. @el
definition: يربط مفردة بعائلة ذات صلة بمفردة. @ar
definition: 将一个单件与和一个单件有关的一个家族关联起来。 @zh-hans

a pour collectivité en relation avec un item
has element type: 1
toolkit definition: A corporate body who is associated with an item. @en
toolkit definition: Bir kopya ile ilişkili bir tüzel kişi. @tr
toolkit definition: Collectivité qui est associée à un item.
toolkit definition: Een corporatie die geassocieerd is met een item. @nl
toolkit definition: Egy példányhoz kapcsolódó testület. @hu
toolkit definition: Eine Körperschaft, die mit einem Exemplar in Verbindung steht. @de
toolkit definition: Eksemplariga seotud asutus. @et
toolkit definition: En korporasjon som forbindes med et eksemplar. @no
toolkit definition: Ente associato a un item. @it
toolkit definition: Entitat corporativa que s’associa amb un ítem. @ca
toolkit definition: Institūcija, kas saistīta ar vienību. @lv
toolkit definition: Korporation, som er knyttet til et eksemplar. @da
toolkit definition: Yhteisö, joka liittyy kappaleeseen. @fi
toolkit definition: هيئة ذات صلة بمفردة @ar
toolkit definition: 和一个单件有关的一个团体 @zh-hans
toolkit label: Kopyanın tüzel kişiyle ilişkisi @tr
toolkit label: ar vienību saistītā institūcija @lv
toolkit label: collectivité en relation avec un item
toolkit label: eksemplariga seotud asutus @et
toolkit label: ente correlato di item @it
toolkit label: entitat corporativa relacionada amb un ítem @ca
toolkit label: gerelateerde corporatie van item @nl
toolkit label: kappaleeseen liittyvä yhteisö @fi
toolkit label: korporasjon relatert til eksemplar @no
toolkit label: korporation relateret til eksemplar @da
toolkit label: mit Exemplar in Beziehung stehende Körperschaft @de
toolkit label: példány kapcsolódó testülete: @hu
toolkit label: related corporate body of item @en
toolkit label: هيئة مرتبطة بمفردة @ar
toolkit label: 单件的关联团体 @zh-hans
has subproperty: a pour collectivité dédicataire d’un item
has subproperty: a pour collectivité conservatrice
has subproperty: a pour collectivité dépositaire
has subproperty: a pour collectivité propriétaire
has subproperty: a pour collectivité honorée d’un item
has subproperty: a pour collectivité modificatrice
has subproperty: P40075
lexical alias: relatedCorporateBodyOfItem.en
status: Published
type: Property
domain: C10003
label: ar vienību saistītā institūcija @lv
label: có tập thể có liên quan (bản) @vi
label: eksemplariga seotud asutus @et
label: ha come ente correlato di item @it
label: har korporasjon relatert til eksemplar @no
label: har korporation relateret til eksemplar @da
label: has related corporate body of item @en
label: hat mit Exemplar in Beziehung stehende Körperschaft @de
label: heeft gerelateerde corporatie van item @nl
label: kappaleeseen liittyvä yhteisö @fi
label: kopyanın ilgili tüzel kişisi ile ilişkilidir @tr
label: példány kapcsolódó testülete a következő: @hu
label: té com a entitat corporativa relacionada amb un ítem @ca
label: έχει σχετικό συλλογικό όργανο (αντίτυπο) @el
label: له هيئة مرتبطة بمفردة @ar
label: 有单件的关联团体 @zh-hans
sub property of: a pour agent collectif en relation avec un item
sub property of: P00009
definition: Bir kopyayı, bir kopya ile bağlantılı olan tüzel bir kişiyle ilişkilendirir. @tr
definition: Correla un item a un ente associato a un item. @it
definition: Hozzákapcsol egy példányt egy példányhoz kapcsolódó testülethez. @hu
definition: Liittää kappaleen yhteisöön, joka liittyy kappaleeseen. @fi
definition: Liên kết bản với tập thể liên quan với bản đang được mô tả. @vi
definition: Met un item en relation avec une collectivité qui est associée à un item.
definition: Relaciona un ítem amb una entitat corporativa que s’associa amb un ítem. @ca
definition: Relateert een item aan een corporatie die geassocieerd is met een item. @nl
definition: Relaterer et eksemplar til en korporasjon som forbindes med et eksemplar. @no
definition: Relaterer et eksemplar til en korporation, som er knyttet til et eksemplar. @da
definition: Relates an item to a corporate body who is associated with an item. @en
definition: Sasaista vienību ar institūciju, kas saistīta ar vienību. @lv
definition: Seostab eksemplari eksemplariga seotud asutusega. @et
definition: Setzt ein Exemplar in Beziehung zu einer Körperschaft, die mit einem Exemplar in Verbindung steht. @de
definition: Συνδέει ένα αντίτυπο με ένα συλλογικό όργανο που συνδέεται με ένα περιγραφόμενο αντίτυπο. @el
definition: يربط مفردة بهيئة ذات صلة بمفردة. @ar
definition: 将一个单件与和一个单件有关的一个团体关联起来。 @zh-hans

a pour agent collectif en relation avec un item
has element type: 1
toolkit definition: A collective agent who is associated with an item. @en
toolkit definition: Agent collectif qui est associé à un item.
toolkit definition: Agent col·lectiu que s’associa amb un ítem. @ca
toolkit definition: Agente collettivo associato a un item. @it
toolkit definition: Bir kopys ile ilişkililendirilen kolektif bir temsilci. @tr
toolkit definition: Een collectieve actor die geassocieerd is met een item. @nl
toolkit definition: Egy példányhoz kapcsolódó kollektív ágens. @hu
toolkit definition: Ein gemeinschaftlicher Akteur, der mit einem Exemplar in Verbindung steht. @de
toolkit definition: Eksemplariga seotud kollektiiv. @et
toolkit definition: En kollektiv agent som forbindes med et eksemplar. @no
toolkit definition: Grupa, kas saistīta ar vienību. @lv
toolkit definition: Kollektiv agent, som er knyttet til et eksemplar. @da
toolkit definition: Yhteistoimija, joka liitttyy kappaleeseen. @fi
toolkit definition: وكيل جماعي ذو صلة بمفردة @ar
toolkit definition: 和一个单件有关的一个集体行为者 @zh-hans
toolkit label: Kopyanın kolektif temsilciyle ilişkisi @tr
toolkit label: agent collectif en relation avec un item
toolkit label: agent col·lectiu relacionat amb un ítem @ca
toolkit label: agente collettivo correlato di item @it
toolkit label: ar vienību saistītā grupa @lv
toolkit label: eksemplariga seotud kollektiiv @et
toolkit label: gerelateerde collectieve actor van item @nl
toolkit label: kappaleeseen liittyvä yhteistoimija @fi
toolkit label: kollektiv agent relateret til eksemplar @da
toolkit label: kollektiv agent relatert til eksemplar @no
toolkit label: mit Exemplar in Beziehung stehender gemeinschaftlicher Akteur @de
toolkit label: példány kapcsolódó kollektív ágense: @hu
toolkit label: related collective agent of item @en
toolkit label: وكيل جماعي مرتبط بمفردة @ar
toolkit label: 单件的关联集体行为者 @zh-hans
has subproperty: a pour famille en relation avec un item
has subproperty: a pour collectivité en relation avec un item
has subproperty: a pour agent collectif dédicataire d’un item
has subproperty: a pour agent collectif conservateur
has subproperty: a pour agent collectif dépositaire
has subproperty: a pour agent collectif propriétaire
has subproperty: a pour agent collectif honoré d’un item
has subproperty: a pour agent collectif modificateur
has subproperty: P40076
lexical alias: relatedCollectiveAgentOfItem.en
status: Published
type: Property
domain: C10003
label: ar vienību saistītā grupa @lv
label: có tác nhân tập thể có liên quan (bản) @vi
label: eksemplariga seotud kollektiiv @et
label: ha come agente collettivo correlato di item @it
label: har kollektiv agent relateret til eksemplar @da
label: har kollektiv agent relatert til eksemplar @no
label: has related collective agent of item @en
label: hat mit Exemplar in Beziehung stehenden gemeinschaftlichen Akteur @de
label: heeft gerelateerde collectieve actor van item @nl
label: kappaleeseen liittyvä yhteistoimija @fi
label: kopyanın ilgili kolektif temsilcisi ile ilişkilidir @tr
label: példány kapcsolódó kollektív ágense a következő: @hu
label: té com a agent col·lectiu relacionat amb un ítem @ca
label: έχει σχετικό συλλογικό φορέα (αντίτυπο) @el
label: له وكيل جماعي مرتبط بمفردة @ar
label: 有单件的关联集体行为者 @zh-hans
sub property of: a pour agent en relation avec un item
sub property of: P00012
definition: Bir kopyayı, bir kopyanın bağlantılı olan kolektif bir temsilciyle ilişkilendirir. @tr
definition: Correla un item a un agente collettivo associato a un item. @it
definition: Hozzákapcsol egy példányt egy példányhoz kapcsolódó kollektív ágenshez. @hu
definition: Liittää kappaleen yhteistoimijaan, joka liitttyy kappaleeseen. @fi
definition: Liên kết bản với tác nhân tập thể liên quan với bản đang được mô tả. @vi
definition: Met un item en relation avec un agent collectif qui est associé à un item.
definition: Relaciona un ítem amb un agent col·lectiu que s’associa amb un ítem. @ca
definition: Relateert een item aan een collectieve actor die geassocieerd is met een item. @nl
definition: Relaterer et eksemplar til en kollektiv agent som forbindes med et eksemplar. @no
definition: Relaterer et eksemplar til en kollektiv agent, som er knyttet til et eksemplar. @da
definition: Relates an item to a collective agent who is associated with an item. @en
definition: Sasaista vienību ar grupu, kas saistīta ar vienību. @lv
definition: Seostab eksemplari eksemplariga seotud kollektiiviga. @et
definition: Setzt ein Exemplar in Beziehung zu einem gemeinschaftlichen Akteur, der mit einem Exemplar in Verbindung steht. @de
definition: Συνδέει ένα αντίτυπο με έναν συλλογικό φορέα που συνδέεται με ένα περιγραφόμενο αντίτυπο. @el
definition: يربط مفردة بوكيل جماعي ذي صلة بمفردة. @ar
definition: 将一个单件与和一个单件有关的一个集体行为者关联起来。 @zh-hans

a pour lieu en relation avec un item
has element type: 1
toolkit definition: A place that is associated with an item. @en
toolkit definition: Bir kopya ile bağlantılı olan bir yer. @tr
toolkit definition: Een plaats die geassocieerd is met een item. @nl
toolkit definition: Egy hely, amelyet egy példányhoz társítanak. @hu
toolkit definition: Ein Geografikum, das mit einem Exemplar in Verbindung steht. @de
toolkit definition: Eksemplariga seotud koht. @et
toolkit definition: Et sted som forbindes med et eksemplar. @no
toolkit definition: Lieu qui est associé à un item.
toolkit definition: Lloc que s’associa amb un ítem. @ca
toolkit definition: Luogo associato a un item. @it
toolkit definition: Paikka, joka liittyy kappaleeseen. @fi
toolkit definition: Sted, som er knyttet til et eksemplar. @da
toolkit definition: Vieta, kas saistīta ar vienību. @lv
toolkit definition: مكان ذو صلة بمفردة @ar
toolkit definition: 和一个单件有关的一个地点 @zh-hans
toolkit label: Kopyayla ilişkili yer @tr
toolkit label: ar vienību saistītā vieta @lv
toolkit label: eksemplariga seotud koht @et
toolkit label: gerelateerde plaats van item @nl
toolkit label: kappaleeseen liittyvä paikka @fi
toolkit label: lieu en relation avec un item
toolkit label: lloc relacionat amb un ítem @ca
toolkit label: luogo correlato di item @it
toolkit label: mit Exemplar in Beziehung stehendes Geografikum @de
toolkit label: példány kapcsolódó helye: @hu
toolkit label: related place of item @en
toolkit label: sted relateret til eksemplar @da
toolkit label: sted relatert til eksemplar @no
toolkit label: مكان مرتبط بمفردة @ar
toolkit label: 单件的关联地点 @zh-hans
has subproperty: a pour emplacement d’un item
has subproperty: P40077
lexical alias: relatedPlaceOfItem.en
status: Published
type: Property
domain: C10003
label: ar vienību saistītā vieta @lv
label: có địa điểm có liên quan (bản) @vi
label: eksemplariga seotud koht @et
label: ha come luogo correlato di item @it
label: har sted relateret til eksemplar @da
label: har sted relatert til eksemplar @no
label: has related place of item @en
label: hat mit Exemplar in Beziehung stehendes Geografikum @de
label: heeft gerelateerde plaats van item @nl
label: kappaleeseen liittyvä paikka @fi
label: kopyanın ilgili yeri ile ilişkilidir @tr
label: példány kapcsolódó helye a következő: @hu
label: té com a lloc relacionat amb un ítem @ca
label: έχει σχετικό τόπο (αντίτυπο) @el
label: له مكان مرتبط بمفردة @ar
label: 有单件的关联地点 @zh-hans
sub property of: a pour entité RDA en relation avec un item
sub property of: P00010
definition: Bir kopyayı, bir kopyayla bağlantılı olan bir yerle ilişkilendirir. @tr
definition: Correla un item a un luogo associato a un item. @it
definition: Hozzákapcsol egy példányt egy helyhez, amelyet egy példányhoz társítanak. @hu
definition: Liittää kappaleen paikkaan, joka liitttyy kappaleeseen. @fi
definition: Liên kết bản với địa điểm liên quan với bản đang được mô tả. @vi
definition: Met un item en relation avec un lieu qui est associé à un item.
definition: Relaciona un ítem amb un lloc que s’associa amb un ítem. @ca
definition: Relateert een item aan een plaats die geassocieerd is met een item. @nl
definition: Relaterer et eksemplar til et sted som forbindes med et eksemplar. @no
definition: Relaterer et eksemplar til et sted, som er knyttet til et eksemplar. @da
definition: Relates an item to a place that is associated with an item. @en
definition: Sasaista vienību ar vietu, kas saistīta ar vienību. @lv
definition: Seostab eksemplari eksemplariga seotud kohaga. @et
definition: Setzt ein Exemplar in Beziehung zu einem Geografikum, das mit einem Exemplar in Verbindung steht. @de
definition: Συνδέει ένα αντίτυπο με έναν τόπο που συνδέεται με ένα περιγραφόμενο αντίτυπο. @el
definition: يربط مفردة بمكان ذي صلة بمفردة. @ar
definition: 将一个单件与和一个单件有关的一个地点关联起来。 @zh-hans

a pour laps de temps en relation avec un item
has element type: 1
toolkit definition: A timespan that is associated with an item. @en
toolkit definition: Ajanjakso, joka liittyy kappaleeseen. @fi
toolkit definition: Arco di tempo associato a un item. @it
toolkit definition: Bir kopya ile bağlantılı olan bir zaman aralığı. @tr
toolkit definition: Een tijdspanne die geassocieerd is met een item. @nl
toolkit definition: Egy időtartam, amelyet egy példányhoz társítanak. @hu
toolkit definition: Ein Zeitraum, der mit einem Exemplar in Verbindung steht. @de
toolkit definition: Eksemplariga seotud ajavahemik. @et
toolkit definition: Et tidsrom som forbindes med et eksemplar. @no
toolkit definition: Interval de temps que s’associa amb un ítem. @ca
toolkit definition: Laikposms, kas saistīts ar vienību. @lv
toolkit definition: Laps de temps qui est associé à un item.
toolkit definition: Tidsperiode, som er knyttet til et eksemplar. @da
toolkit definition: فترة زمنية ذات صلة بمفردة @ar
toolkit definition: 和一个单件有关的一个时间段 @zh-hans
toolkit label: Kopyanın zaman aralığıyla ilişkisi @tr
toolkit label: ar vienību saistītais laikposms @lv
toolkit label: arco di tempo correlato di item @it
toolkit label: eksemplariga seotud ajavahemik @et
toolkit label: gerelateerde tijdspanne van item @nl
toolkit label: interval de temps relacionat amb un ítem @ca
toolkit label: kappaleeseen liittyvä ajanjakso @fi
toolkit label: laps de temps en relation avec un item
toolkit label: mit Exemplar in Beziehung stehender Zeitraum @de
toolkit label: példány kapcsolódó időtartama: @hu
toolkit label: related timespan of item @en
toolkit label: tidsperiode relateret til eksemplar @da
toolkit label: tidsrom relatert til eksemplar @no
toolkit label: فترة زمنية مرتبطة بمفردة @ar
toolkit label: 单件的关联时间段 @zh-hans
has subproperty: P40078
lexical alias: relatedTimespanOfItem.en
status: Published
type: Property
domain: C10003
label: ar vienību saistītais laikposms @lv
label: có khoảng thời gian có liên quan (bản) @vi
label: eksemplariga seotud ajavahemik @et
label: ha come arco di tempo correlato di item @it
label: har tidsperiode relateret til eksemplar @da
label: har tidsrom relatert til eksemplar @no
label: has related timespan of item @en
label: hat mit Exemplar in Beziehung stehenden Zeitraum @de
label: heeft gerelateerde tijdspanne van item @nl
label: kappaleeseen liittyvä ajanjakso @fi
label: kopyanın ilgili zaman aralığı ile ilişkilidir @tr
label: példány kapcsolódó időtartama a következő: @hu
label: té com a interval de temps relacionat amb un ítem @ca
label: έχει σχετικό χρονικό διάστημα (αντίτυπο) @el
label: له فترة زمنية مرتبطة بمفردة @ar
label: 有单件的关联时间段 @zh-hans
sub property of: a pour entité RDA en relation avec un item
sub property of: P00011
definition: Bir kopyayı, bir kopyayla bağlantılı olan bir zaman aralığıyla ilişkilendirir. @tr
definition: Correla un item a un arco di tempo associato a un item. @it
definition: Hozzákapcsol egy példány egy időtartamhoz, amelyet egy példányhoz társítanak. @hu
definition: Liittää kappaleen ajanjaksoon, joka liittyy kappaleeseen. @fi
definition: Liên kết bản với khoảng thời gian liên quan với bản đang được mô tả. @vi
definition: Met un item en relation avec un laps de temps qui est associé à un item.
definition: Relaciona un ítem amb un interval de temps que s’associa amb un ítem. @ca
definition: Relateert een item aan een tijdspanne die geassocieerd is met een item. @nl
definition: Relaterer et eksemplar til en tidsperiode, som er knyttet til et eksemplar. @da
definition: Relaterer et eksemplar til et tidsrom som forbindes med et eksemplar. @no
definition: Relates an item to a timespan that is associated with an item. @en
definition: Sasaista vienību ar laikposmu, kas saistīts ar vienību. @lv
definition: Seostab eksemplari eksemplariga seotud ajavahemikuga. @et
definition: Setzt ein Exemplar in Beziehung zu einem Zeitraum, der mit einem Exemplar in Verbindung steht. @de
definition: Συνδέει ένα αντίτυπο με το χρονικό διάστημα που συνδέεται με ένα περιγραφόμενο αντίτυπο. @el
definition: يربط مفردة بفترة زمنية ذات صلة بمفردة. @ar
definition: 将一个单件与和一个单件有关的一个时间段关联起来。 @zh-hans

a pour nomen en relation avec un item
has element type: 1
toolkit definition: A nomen that is associated with an item. @en
toolkit definition: Bir kopya ile bağlantılı olan bir isim. @tr
toolkit definition: Een nomen dat geassocieerd is met een item. @nl
toolkit definition: Egy nomen, amelyet egy példányhoz társítanak. @hu
toolkit definition: Ein Nomen, das mit einem Exemplar in Verbindung steht. @de
toolkit definition: Eksemplariga seotud nomen. @et
toolkit definition: Et nomen som forbindes med et eksemplar. @no
toolkit definition: Nomen associato con un item. @it
toolkit definition: Nomen que s’associa amb un ítem. @ca
toolkit definition: Nomen qui est associé à un item.
toolkit definition: Nomen, joka liittyy kappaleeseen. @fi
toolkit definition: Nomen, som er knyttet til et eksemplar. @da
toolkit definition: Nomens, kas saistīts ar vienību. @lv
toolkit definition: تسمية ذات صلة بمفردة @ar
toolkit definition: 和一个单件有关的一个命名 @zh-hans
toolkit label: Kopyanın ilişkili ismi @tr
toolkit label: ar vienību saistītais nomens @lv
toolkit label: eksemplariga seotud nomen @et
toolkit label: gerelateerde nomen van item @nl
toolkit label: kappaleeseen liittyvä nomen @fi
toolkit label: mit Exemplar in Beziehung stehendes Nomen @de
toolkit label: nomen correlato di item @it
toolkit label: nomen en relation avec un item
toolkit label: nomen relacionat amb un ítem @ca
toolkit label: nomen relateret til eksemplar @da
toolkit label: nomen relatert til eksemplar @no
toolkit label: példány kapcsolódó nomene: @hu
toolkit label: related nomen of item @en
toolkit label: تسمية مرتبطة بمفردة @ar
toolkit label: 单件的关联命名 @zh-hans
has subproperty: a pour appellation d’item
has subproperty: P40079
lexical alias: relatedNomenOfItem.en
status: Published
type: Property
domain: C10003
label: ar vienību saistītais nomens @lv
label: có danh pháp có liên quan (bản) @vi
label: eksemplariga seotud nomen @et
label: ha come nomen correlato di item @it
label: har nomen relateret til eksemplar @da
label: har nomen relatert til eksemplar @no
label: has related nomen of item @en
label: hat mit Exemplar in Beziehung stehendes Nomen @de
label: heeft gerelateerde nomen van item @nl
label: kappaleeseen liittyvä nomen @fi
label: kopyanın ilgili ismi ile ilişkilidir @tr
label: példány kapcsolódó nomene a következő: @hu
label: té com a nomen relacionat amb un ítem @ca
label: έχει σχετικό όνομα (αντίτυπο) @el
label: له تسمية مرتبطة بمفردة @ar
label: 有单件的关联命名 @zh-hans
sub property of: a pour entité RDA en relation avec un item
sub property of: P00013
definition: Bir kopyayı, bir kopyayla bağlantılı olan bir isimle ilişkilendirir. @tr
definition: Correla un item a un nomen associato a un item. @it
definition: Hozzákapcsol egy példányt egy nomenhez, amelyet egy példányhoz társítanak. @hu
definition: Liittää kappaleen nomeniin, joka liittyy kappaleeseen. @fi
definition: Liên kết bản với danh pháp liên quan với bản đang được mô tả. @vi
definition: Met un item en relation avec un nomen qui est associé à un item.
definition: Relaciona un ítem amb un nomen que s’associa amb un ítem. @ca
definition: Relateert een item aan een nomen dat geassocieerd is met een item. @nl
definition: Relaterer et eksemplar til et nomen som forbindes med et eksemplar. @no
definition: Relaterer et eksemplar til et nomen, som er knyttet til et eksemplar. @da
definition: Relates an item to a nomen that is associated with an item. @en
definition: Sasaista vienību ar nomenu, kas saistīts ar vienību. @lv
definition: Seostab eksemplari eksemplariga seotud nomen'iga. @et
definition: Setzt ein Exemplar in Beziehung zu einem Nomen, das mit einem Exemplar in Verbindung steht. @de
definition: Συνδέει ένα αντίτυπο με ένα όνομα που συνδέεται με ένα περιγραφόμενο αντίτυπο. @el
definition: يربط مفردة بتسمية ذات صلة بمفردة. @ar
definition: 将一个单件与和一个单件有关的一个命名关联起来。 @zh-hans

a pour point d’accès d’un item
has element type: 3
toolkit definition: A nomen that is an appellation of item in natural language that is taken from a vocabulary encoding scheme or is constructed using a string encoding scheme. @en
toolkit definition: Benævnelse på eksemplar på normalsprog, som er taget fra et vokabularkodningsskema eller er konstrueret ved hjælp af et strengkodningsskema. @da
toolkit definition: Bir kelime kodlama şemasından alınan veya bir dizi kodlama şeması kullanılarak oluşturulan, doğal dilde bir kopyanın unvanı olan bir isim. @tr
toolkit definition: Denominazione di item in linguaggio naturale, tratta da uno schema di codifica di vocabolario o costruita utilizzando uno schema di codifica della stringa @it
toolkit definition: Een nomen dat is een benaming van item in natuurlijke taal die ontleend is aan een vocabulair coderingsschema of gevormd is volgens een string coderingsschema. @nl
toolkit definition: Egy nomen, egy példány természetes nyelvű megnevezése, amely egy szótárkódolási sémából származik, vagy egy karakterlánc-kódolási séma használatával szerkesztett. @hu
toolkit definition: Eine Bezeichnung für ein Exemplar in natürlicher Sprache, die einem Vocabulary Encoding Scheme entnommen oder mit einem String Encoding Scheme konstruiert wird. @de
toolkit definition: Eksemplari nimetus loomulikus keeles, mis on võetud leksikaalsest märkimissüsteemist või moodustatud stringilise märkimissüsteemi alusel. @et
toolkit definition: En betegnelse på eksemplar på et naturlig språk som er hentet fra et kodeskjema for vokabular eller er laget ved bruk av et kodeskjema for syntaks. @no
toolkit definition: Nomen que és una apel·lació d’ítem en llenguatge natural que s’obté d’un esquema de codificació de vocabulari o s’elabora usant un esquema de codificació de cadenes. @ca
toolkit definition: Nomen qui est une appellation d’item en langage naturel provenant d’un schéma d’encodage de vocabulaire ou construite à l’aide d’un schéma d’encodage de chaînes.
toolkit definition: Nomen, joka on luonnollisen kielen mukainen kappaleen nimitys, joka on otettu sanaston merkintäjärjestelmästä tai joka on muodostettu merkkijonon merkintäjärjestelmää käyttäen. @fi
toolkit definition: Vienības vārds/nosaukums dabiskā valodā, kas ņemts no shēmas kontrolētu vārdnīcu kodēšanai vai tiek konstruēts, izmantojot virknes kodēšanas shēmu. @lv
toolkit definition: تسمية هي اسم مفردة في لغة طبيعية مأخوذة من خطة ترميز مفردات أو مبنية باستخدام خطة ترميز سلسلة تمثيلات. @ar
toolkit definition: 作为一个单件的称谓、取自一个词表编码体系或者用一个串编码体系构建、用自然语言的一个命名 @zh-hans
toolkit label: Kopya için erişim noktası @tr
toolkit label: Sucheinstieg für ein Exemplar @de
toolkit label: access point for item @en
toolkit label: eksemplari otsielement @et
toolkit label: hozzáférési pontja példányhoz: @hu
toolkit label: ingang voor item @nl
toolkit label: kappaleen hakutieto @fi
toolkit label: point d’accès d’un item
toolkit label: punt d’accés d’ítem @ca
toolkit label: punto d'accesso per item @it
toolkit label: søgeindgang for eksemplar @da
toolkit label: søkeinngang for eksemplar @no
toolkit label: vienības pamatforma @lv
toolkit label: نقطة وصول لمفردة @ar
toolkit label: 单件的检索点 @zh-hans
has subproperty: a pour point d’accès autorisé d’un item
has subproperty: a pour variante de point d’accès d’un item
has subproperty: P40080
lexical alias: accessPointForItem.en
status: Published
type: Property
domain: C10003
label: eksemplari otsielement @et
label: ha come punto d'accesso per item @it
label: har søgeindgang for eksemplar @da
label: har søkeinngang for eksemplar @no
label: has access point for item @en
label: hat Sucheinstieg für ein Exemplar @de
label: heeft ingang voor item @nl
label: hozzáférési pontja példányhoz a következő: @hu
label: kappaleen hakutieto @fi
label: kopya için erişim noktası ile ilişkilidir @tr
label: té com a punt d’accés d’ítem @ca
label: vienības pamatforma @lv
label: له نقطة وصول لمفردة @ar
label: 有单件的检索点 @zh-hans
sub property of: a pour appellation d’item
sub property of: P00016
definition: Bir kopyayı, bir sözcük kodlama şemasından alınan veya bir dizge kodlama şeması kullanılarak oluşturulan doğal dilde bir kopyanın unvanı olan bir isimle ilişkilendirir. @tr
definition: Correla un item a una denominazione di item in linguaggio naturale, tratta da uno schema di codifica di vocabolario o costruita utilizzando uno schema di codifica della stringa. @it
definition: Hozzákapcsol példányt egy nomenhez, egy példány természetes nyelvű megnevezéséhez, amely egy szótárkódolási sémából származik, vagy egy karakterlánc-kódolási séma használatával szerkesztett. @hu
definition: Liittää kappaleen nomeniin, joka on luonnollisen kielen mukainen kappaleen nimitys, joka on otettu sanaston merkintäjärjestelmästä tai joka on muodostettu merkkijonon merkintäjärjestelmää käyttäen. @fi
definition: Met un item en relation avec un nomen qui est une appellation d’item en langage naturel provenant d’un schéma d’encodage de vocabulaire ou construite à l’aide d’un schéma d’encodage de chaînes.
definition: Relaciona un ítem amb un nomen que és una apel·lació d’ítem en llenguatge natural que s’obté d’un esquema de codificació de vocabulari o s’elabora usant un esquema de codificació de cadenes. @ca
definition: Relateert een item aan een nomen dat is een benaming van item in natuurlijke taal die ontleend is aan een vocabulair coderingsschema of gevormd is volgens een string coderingsschema. @nl
definition: Relaterer et eksemplar til en benævnelse på eksemplar på normalsprog, som er taget fra et vokabularkodningsskema eller er konstrueret ved hjælp af et strengkodningsskema. @da
definition: Relaterer et eksemplar til en betegnelse på eksemplar på et naturlig språk som er hentet fra et kodeskjema for vokabular eller er laget ved bruk av et kodeskjema for syntaks. @no
definition: Relates an item to a nomen that is an appellation of item in natural language that is taken from a vocabulary encoding scheme or is constructed using a string encoding scheme. @en
definition: Sasaista vienību ar nomenu, kas ir vienības vārds/nosaukums dabiskā valodā, kas ņemts no shēmas kontrolētu vārdnīcu kodēšanai vai tiek konstruēts, izmantojot virknes kodēšanas shēmu. @lv
definition: Seostab eksemplari eksemplari nimetusega loomulikus keeles, mis on võetud leksikaalsest märkimissüsteemist või moodustatud stringilise märkimissüsteemi alusel. @et
definition: Setzt ein Exemplar in Beziehung zu einer Bezeichnung für ein Exemplar in natürlicher Sprache, die einem Vocabulary Encoding Scheme entnommen oder mit einem String Encoding Scheme konstruiert wird. @de
definition: يربط مفردة بتسمية هي اسم مفردة في لغة طبيعية مأخوذة من خطة ترميز مفردات أو مبنية باستخدام خطة ترميز سلسلة تمثيلات. @ar
definition: 将一个单件与作为一个单件的称谓、取自一个词表编码体系或者用一个串编码体系构建、用自然语言的一个命名关联起来。 @zh-hans

a pour appellation d’item
has element type: 3
toolkit definition: A nomen that is used within a given scheme or context to refer to an item. @en
toolkit definition: Belirli bir şema veya bağlam içinde bir kopyaya atıfta bulunmak için kullanılan bir isim. @tr
toolkit definition: Een nomen gebruikt binnen een bepaald schema of context om te verwijzen naar een item. @nl
toolkit definition: Egy nomen, amelyet egy adott sémán vagy kontextuson belül használnak egy példányra való hivatkozásra. @hu
toolkit definition: Ein Nomen, das in einem bestimmten Schema oder Kontext verwendet wird, um ein Exemplar zu referenzieren. @de
toolkit definition: Et nomen som er brukt i et bestemt skjema eller en bestemt sammenheng for å refere til et eksemplar. @no
toolkit definition: Nomen que s’usa en un esquema o un context determinat per referir-se a un ítem. @ca
toolkit definition: Nomen qui est utilisé à l’intérieur d’un schéma ou d’un contexte donnés pour désigner un item.
toolkit definition: Nomen, jota käytetään viitattaessa kappaleeseen tietyssä järjestelmässä tai kontekstissa. @fi
toolkit definition: Nomen, mida antud süsteemis või kontekstis kasutatakse eksemplarile viitamiseks. @et
toolkit definition: Nomen, som anvendes inden for et givet skema eller kontekst for at henvise til et eksemplar. @da
toolkit definition: Nomens, ko lieto konkrētajā sistēmā vai kontekstā, lai norādītu uz vienību @lv
toolkit definition: Nomen utilizzato nell'ambito di un dato schema o contesto da riferire a un item. @it
toolkit definition: تسمية مستخدمة ضمن خطة أو سياق محدد للإشارة إلى مفردة. @ar
toolkit definition: 在一个给定的体系或语境中指称一个单件所用的一个命名 @zh-hans
toolkit label: Bezeichnung für ein Exemplar @de
toolkit label: apel·lació d’ítem @ca
toolkit label: appellation d’item
toolkit label: appellation of item @en
toolkit label: benaming voor item @nl
toolkit label: benævnelse på eksemplar @da
toolkit label: betegnelse for eksemplar @no
toolkit label: denominazione di item @it
toolkit label: eksemplari nimetus @et
toolkit label: kappaleen nimitys @fi
toolkit label: kopyanın unvanı @tr
toolkit label: példány megnevezése: @hu
toolkit label: vienības apzīmējums @lv
toolkit label: اسم لمفردة @ar
toolkit label: 单件的称谓 @zh-hans
has subproperty: a pour identifiant d’item
has subproperty: a pour point d’accès d’un item
has subproperty: a pour titre d’item
has subproperty: P40081
lexical alias: appellationOfItem.en
status: Published
type: Property
domain: C10003
label: eksemplari nimetus @et
label: ha come appellativo di item @it
label: har benævnelse på eksemplar @da
label: har betegnelse for eksemplar @no
label: has appellation of item @en
label: hat Bezeichnung für ein Exemplar @de
label: heeft benaming voor item @nl
label: kappaleen nimitys @fi
label: kopyanın unvanı ile ilişkilidir @tr
label: példány megnevezése a következő: @hu
label: té com a apel·lació d’ítem @ca
label: vienības apzīmējums @lv
label: له اسم لمفردة @ar
label: 有单件的称谓 @zh-hans
sub property of: a pour nomen en relation avec un item
sub property of: P00017
definition: Bir kopyayı, bir kopyaya atıfta bulunmak için belirli bir şema veya bağlam içinde kullanılan bir isimle ilişkilendirir. @tr
definition: Correla un item a un nomen utilizzato nell'ambito di un dato schema o contesto da riferire a un item. @it
definition: Hozzákapcsol egy példányt egy nomenhez, amelyet egy adott sémán vagy kontextuson belül használnak egy példányra való hivatkozásra. @hu
definition: Liittää kappaleen nomeniin, jota käytetään viitattaessa kappaleeseen tietyssä järjestelmässä tai kontekstissa. @fi
definition: Met un item en relation avec un nomen qui est utilisé à l’intérieur d’un schéma ou d’un contexte donnés pour désigner un item.
definition: Relaciona un ítem amb un nomen que s’usa en un esquema o un context determinat per referir-se a un ítem. @ca
definition: Relateert een item aan een nomen gebruikt binnen een bepaald schema of context om te verwijzen naar een item. @nl
definition: Relaterer et eksemplar til et nomen som er brukt i et bestemt skjema eller en bestemt sammenheng for å refere til et eksemplar. @no
definition: Relaterer et eksemplar til et nomen, som anvendes inden for et givet skema eller kontekst for at henvise til et eksemplar. @da
definition: Relates an item to a nomen that is used within a given scheme or context to refer to an item. @en
definition: Sasaista vienību ar nomenu, ko lieto konkrētajā sistēmā vai kontekstā, lai norādītu uz vienību. @lv
definition: Seostab eksemplari nomen'iga, mida antud süsteemis või kontekstis kasutatakse eksemplarile viitamiseks. @et
definition: Setzt ein Exemplar in Beziehung zu einem Nomen, das in einem bestimmten Schema oder Kontext verwendet wird, um ein Exemplar zu referenzieren. @de
definition: يربط مفردة بتسمية مستخدمة ضمن خطة أو سياق معين للإشارة إلى مفردة. @ar
definition: 将一个单件与在一个给定的体系或语境中指称一个单件所用的一个命名关联起来。 @zh-hans

a pour titre d’item
has element type: 3
toolkit definition: A nomen that is an appellation of item in natural language and phrasing used in common discourse. @en
toolkit definition: Benævnelse på eksemplar på normalsprog og med formuleringer, som bruges alment. @da
toolkit definition: Denominazione di item in linguaggio e frasi naturali usati nel discorso comune. @it
toolkit definition: Doğal dilde ve ortak söylemde kullanılan ifadelerde bir kopyanın unvanı olan bir isim. @tr
toolkit definition: Een nomen dat is een benaming van item in natuurlijke taal en terminologie in gebruikelijke bewoording. @nl
toolkit definition: Egy nomen, amely egy példány természetes nyelvű megnevezése és a közbeszédben használt megfogalmazása. @hu
toolkit definition: Eine Bezeichnung für ein Exemplar in natürlicher Sprache und Ausdrucksweise, die beim normalen Sprechen und Schreiben verwendet wird. @de
toolkit definition: Eksemplari nimetus loomulikus keeles ja sõnastuses, mida kasutatakse ühises diskursuses. @et
toolkit definition: En betegnelse på eksemplar med et naturlig språk og med en frasering brukt i alminnelig diskurs. @no
toolkit definition: Nomen que és una apel·lació d’ítem en llenguatge i frases naturals usada en el discurs comú. @ca
toolkit definition: Nomen qui est une appellation d’item exprimée dans un langage et une formulation naturels et utilisée dans le langage courant.
toolkit definition: Nomen, joka on kappaleen nimitys, joka on luonnollisen kielen ja yleisen diskurssin sanamuodon mukainen. @fi
toolkit definition: Vienības apzīmējums dabiskā valodā un frāzēs, kas tiek lietots savstarpējā saziņā. @lv
toolkit definition: تسمية هي اسم مفردة في لغة طبيعية وفي العبارات المستخدمة في الخطاب العام. @ar
toolkit definition: 作为用自然语言和普通话语措词表达的单件的称谓的一个命名 @zh-hans
toolkit label: Titel eines Exemplars @de
toolkit label: eksemplari pealkiri @et
toolkit label: kappaleen nimeke @fi
toolkit label: kopyanın başlığı @tr
toolkit label: példány címe: @hu
toolkit label: titel på eksemplar @da
toolkit label: titel van item @nl
toolkit label: title of item @en
toolkit label: titolo di item @it
toolkit label: titre d’item
toolkit label: tittel for eksemplar @no
toolkit label: títol d’ítem @ca
toolkit label: vienības nosaukums @lv
toolkit label: عنوان لمفردة @ar
toolkit label: 单件的题名 @zh-hans
has subproperty: a pour titre privilégié d’un item
has subproperty: a pour variante de titre d’item
has subproperty: P40082
lexical alias: titleOfItem.en
status: Published
type: Property
domain: C10003
label: eksemplari pealkiri @et
label: ha come titolo di item @it
label: har titel på eksemplar @da
label: har tittel for eksemplar @no
label: has title of item @en
label: hat Titel eines Exemplars @de
label: heeft titel van item @nl
label: kappaleen nimeke @fi
label: kopya başlığı ile ilişkilidir @tr
label: példány címe a következő: @hu
label: té com a títol d’ítem @ca
label: vienības nosaukums @lv
label: له عنوان مفردة @ar
label: 有单件的题名 @zh-hans
sub property of: a pour appellation d’item
sub property of: P00019
definition: Bir kopyayı, kopyanın doğal dildeki adı ve ortak söylemde kullanılan ifade biçimi olan bir isimle ilişkilendirir. @tr
definition: Correla un item a una denominazione di item in linguaggio e frasi naturali usati nel discorso comune. @it
definition: Hozzákapcsol egy példányt egy nomenhez, amely egy példány természetes nyelvű megnevezése és a közbeszédben használt megfogalmazása. @hu
definition: Liittää kappaleen nomeniin, joka on kappaleen nimitys, joka on luonnollisen kielen ja yleisen diskurssin sanamuodon mukainen. @fi
definition: Met un item en relation avec un nomen qui est une appellation d’item exprimée dans un langage et une formulation naturels et utilisée dans le langage courant.
definition: Relaciona un ítem amb un nomen que és una apel·lació d’ítem en llenguatge i frases naturals usada en el discurs comú. @ca
definition: Relateert een item aan een nomen dat is een benaming van item in natuurlijke taal en terminologie in gebruikelijke bewoording. @nl
definition: Relaterer et eksemplar til en benævnelse på eksemplar på normalsprog og med formuleringer, som bruges alment. @da
definition: Relaterer et eksemplar til en betegnelse på eksemplar med et naturlig språk og med en frasering brukt i alminnelig diskurs. @no
definition: Relates an item to a nomen that is an appellation of item in natural language and phrasing used in common discourse. @en
definition: Sasaista vienību ar nomenu, kas ir vienības apzīmējums dabiskā valodā un frāzēs, kas tiek lietots savstarpējā saziņā. @lv
definition: Seostab eksemplari eksemplari nimetusega loomulikus keeles ja sõnastuses, mida kasutatakse ühises diskursuses. @et
definition: Setzt eine Exemplar in Beziehung zu einer Bezeichnung für ein Exemplar in natürlicher Sprache und Ausdrucksweise, die beim normalen Sprechen und Schreiben verwendet wird. @de
definition: يربط مفردة بتسمية هي اسم مفردة في لغة طبيعية وفي العبارات المستخدمة في الخطاب العام. @ar
definition: 将一个单件与作为用自然语言和普通话语措词表达的单件的称谓的一个命名关联起来。 @zh-hans

a pour point d’accès autorisé d’un item
has element type: 3
toolkit definition: A nomen that is an access point of item that is selected for preference in a specific vocabulary encoding scheme. @en
toolkit definition: Belirli bir kelime kodlama şemasında tercih için seçilen bir kopyanın erişim noktası olan bir isim. @tr
toolkit definition: Een nomen dat is een ingang van item die als voorkeursterm geselecteerd is in een specifiek vocabulair coderingssysteem. @nl
toolkit definition: Egy nomen, amely egy példány olyan előnyben részesített hozzáférési pontja, amelyet egy adott szótárkódolási sémából választanak ki. @hu
toolkit definition: Ein Sucheinstieg für ein Exemplar, der in einem bestimmten Vocabulary Encoding Scheme als Vorzugsform bestimmt wird. @de
toolkit definition: Eksemplari otsielement, mis on valitud eelistatuks vastavas leksikaalses märkimissüsteemis. @et
toolkit definition: En foretrukket søkeinngang for eksemplar som er valgt fra et bestemt kodeskjema for vokabular. @no
toolkit definition: Nomen que és un punt d’accés d’ítem que se selecciona com a preferent en un esquema de codificació de vocabulari específic. @ca
toolkit definition: Nomen qui est un point d’accès d’un item faisant l’objet d’un choix privilégié dans un schéma d’encodage de vocabulaire spécifique.
toolkit definition: Nomen, joka on kappaleen hakutieto, joka on valittu ensisijaiseksi tietyssä sanaston merkintäjärjestelmässä. @fi
toolkit definition: Punto d'accesso autorizzato di item selezionato come preferito in uno specifico schema di codifica di vocabolario. @it
toolkit definition: Søgeindgang for eksemplar, som er valgt som præference i et specifikt vokabularkodningsskema. @da
toolkit definition: Vienības pamatforma, kas ir izvēle no konkrētas vārdnīcas. @lv
toolkit definition: تسمية هي نقطة وصول لمفردة اختير للتفضيل في خطة ترميز مفردات محددة. @ar
toolkit definition: 作为一个单件的检索点、并在一个特定的词表编码体系中被首选的一个命名 @zh-hans
toolkit label: Normierter Sucheinstieg für ein Exemplar @de
toolkit label: authorized access point for item @en
toolkit label: autoriseret søgeindgang for eksemplar @da
toolkit label: autorisert søkeinngang for eksemplar @no
toolkit label: eksemplari normitud otsielement @et
toolkit label: geautoriseerde ingang voor item @nl
toolkit label: kappaleen auktorisoitu hakutieto @fi
toolkit label: kopya için yetkili erişim noktası @tr
toolkit label: point d’accès autorisé d’un item
toolkit label: punt d’accés autoritzat d’ítem @ca
toolkit label: punto d'accesso autorizzato per item @it
toolkit label: példány autorizált hozzáférési pontja: @hu
toolkit label: vienības autoritatīvā pamatforma @lv
toolkit label: نقطة وصول مقننة لمفردة @ar
toolkit label: 单件的规范检索点 @zh-hans
has subproperty: P40083
lexical alias: authorizedAccessPointForItem.en
status: Published
type: Property
domain: C10003
label: eksemplari normitud otsielement @et
label: ha come punto d'accesso autorizzato per item @it
label: har autoriseret søgeindgang for eksemplar @da
label: har autorisert søkeinngang for eksemplar @no
label: has authorized access point for item @en
label: hat normierten Sucheinstieg für ein Exemplar @de
label: heeft geautoriseerde ingang voor item @nl
label: kappaleen auktorisoitu hakutieto @fi
label: kopya için yetkilendirilmiş erişim noktası ile ilişkilidir @tr
label: példány autorizált hozzáférési pontja a következő: @hu
label: té com a punt d’accés autoritzat d’ítem @ca
label: vienības autoritatīvā pamatforma @lv
label: له نقطة وصول مقننة لمفردة @ar
label: 有单件的规范检索点 @zh-hans
sub property of: a pour point d’accès d’un item
sub property of: P00020
definition: Bir kopyayı, belirli bir kelime kodlama şemasında tercih edilmek üzere seçilen bir kopyanın erişim noktası olan bir isimle ilişkilendirir. @tr
definition: Correla un item a un punto d'accesso autorizzato di item selezionato come preferito in uno specifico schema di codifica di vocabolario. @it
definition: Hozzákapcsol egy példányt egy nomenhez, amely egy példány olyan előnyben részesített hozzáférési pontja, amelyet egy adott szótárkódolási sémából választanak ki. @hu
definition: Liittää kappaleen nomeniin, joka on kappaleen hakutieto, joka on valittu ensisijaiseksi tietyssä sanaston merkintäjärjestelmässä. @fi
definition: Met un item en relation avec un nomen qui est un point d’accès d’un item faisant l’objet d’un choix privilégié dans un schéma d’encodage de vocabulaire spécifique.
definition: Relaciona un ítem amb un nomen que és un punt d’accés d’ítem que se selecciona com a preferent en un esquema de codificació de vocabulari específic. @ca
definition: Relateert een item aan een nomen dat is een ingang van item die als voorkeursterm geselecteerd is in een specifiek vocabulair coderingssysteem. @nl
definition: Relaterer et eksemplar til en foretrukket søkeinngang for eksemplar som er valgt fra et bestemt kodeskjema for vokabular. @no
definition: Relaterer et eksemplar til en søgeindgang for eksemplar, som er valgt som præference i et specifikt vokabularkodningsskema. @da
definition: Relates an item to a nomen that is an access point of item that is selected for preference in a specific vocabulary encoding scheme. @en
definition: Sasaista vienību ar nomenu, kas ir vienības pamatforma, kas ir izvēle no konkrētas vārdnīcas. @lv
definition: Seostab eksemplari eksemplari otsielemendiga, mis on valitud eelistatuks vastavas leksikaalses märkimissüsteemis. @et
definition: Setzt ein Exemplar in Beziehung zu einem Sucheinstieg für ein Exemplar, der in einem bestimmten Vocabulary Encoding Scheme als Vorzugsform bestimmt wird. @de
definition: يربط مفردة بتسمية هي نقطة وصول لمفردة اختيرت للتفضيل في خطة ترميز مفردات محددة. @ar
definition: 将一个单件与作为一个单件的检索点、并在一个特定的词表编码体系中被首选的一个命名关联起来。 @zh-hans

a pour variante de point d’accès d’un item
has element type: 3
toolkit definition: A nomen that is an access point of item that is not selected for preference in a specific vocabulary encoding scheme. @en
toolkit definition: Belirli bir kelime kodlama şemasında tercih için seçilmemiş bir kopyanın erişim noktası olan bir isim. @tr
toolkit definition: Egy nomen, amely egy példány olyan hozzáférési pontja, amelyet egy adott szótárkódolási sémában nem részesítenek előnyben. @hu
toolkit definition: Ein Sucheinstieg für ein Exemplar, der in einem bestimmten Vocabulary Encoding Scheme nicht als Vorzugsform bestimmt wird. @de
toolkit definition: Eksemplari otsielement, mis ei ole valitud eelistatuks vastavas leksikaalses märkimissüsteemis. @et
toolkit definition: En søkeinngang for eksemplar som ikke er en foretrukket søkeinngang i et bestemt kodeskjema for vokabular. @no
toolkit definition: Nomen que és un punt d’accés d’ítem que no se selecciona com a preferent en un esquema de codificació de vocabulari específic. @ca
toolkit definition: Nomen qui est un point d’accès d’un item ne faisant pas l’objet d’un choix privilégié dans un schéma d’encodage de vocabulaire spécifique.
toolkit definition: Nomen, joka on kappaleen hakutieto, jota ei ole valittu ensisijaiseksi tietyssä sanaston merkintäjärjestelmässä. @fi
toolkit definition: Piekļuves punkts vienībai, kas nav izvēlēta kā prioritāra noteiktai kontrolētas vārdnīcas shēmai. @lv
toolkit definition: Punto d'accesso di item non selezionato come preferito in uno specifico schema di codifica di vocabolario. @it
toolkit definition: Søgeindgang for eksemplar, som ikke er valgt som præference i et specifikt vokabularkodningsskema. @da
toolkit definition: geen nieuwe vert nodig, bevatte tikfout in Engelse versie, geen inhoudelijke wijziging. @nl
toolkit definition: تسمية هي نقطة وصول لمفردة لم تُختر للتفضيل في خطة ترميز مفردات محددة. @ar
toolkit definition: 作为一个单件的检索点、并没有在一个特定的词表编码体系中被首选的一个命名 @zh-hans
toolkit label: Zusätzlicher Sucheinstieg für ein Exemplar @de
toolkit label: alternativ søkeinngang for eksemplar @no
toolkit label: eksemplari otsielemendi variant @et
toolkit label: kappaleen varianttihakutieto @fi
toolkit label: kopya için alternatif erişim noktası @tr
toolkit label: punto d'accesso variante per item @it
toolkit label: példány hozzáférésipont-változata: @hu
toolkit label: variant access point for item @en
toolkit label: variant af søgeindgang for eksemplar @da
toolkit label: variant de punt d’accés d’ítem @ca
toolkit label: variant ingang voor item @nl
toolkit label: variante de point d’accès d’un item
toolkit label: vienības papildforma @lv
toolkit label: نقطة وصول مختلفة لمفردة @ar
toolkit label: 单件的变异检索点 @zh-hans
has subproperty: P40084
lexical alias: variantAccessPointForItem.en
status: Published
type: Property
domain: C10003
label: eksemplari otsielemendi variant @et
label: ha come punto d'accesso variante per item @it
label: har alternativ søkeinngang for eksemplar @no
label: har variant af søgeindgang for eksemplar @da
label: has variant access point for item @en
label: hat zusätzlichen Sucheinstieg für ein Exemplar @de
label: heeft variant ingang voor item @nl
label: kappaleen varianttihakutieto @fi
label: kopya için alternatif erişim noktası ile ilişkilidir @tr
label: példány hozzáférésipont-változata a következő: @hu
label: té com a variant de punt d’accés d’ítem @ca
label: vienības papildforma @lv
label: له نقطة وصول مختلفة لمفردة @ar
label: 有单件的变异检索点 @zh-hans
sub property of: a pour point d’accès d’un item
sub property of: P00022
definition: Bir kopyayı, belirli bir kelime kodlama şemasında tercih için seçilmeyen bir kopyanın erişim noktası olan bir isimle ilişkilendirir. @tr
definition: Correla un item a un punto d'accesso di item non selezionato come preferito in uno specifico schema di codifica di vocabolario. @it
definition: Hozzákapcsol példány egy nomenhez, amely egy példány olyan hozzáférési pontja, amelyet egy adott szótárkódolási sémában nem részesítenek előnyben. @hu
definition: Liittää kappaleen nomeniin, joka on kappaleen hakutieto, jota ei ole valittu ensisijaiseksi tietyssä sanaston merkintäjärjestelmässä. @fi
definition: Met un item en relation avec un nomen qui est un point d’accès d’un item ne faisant pas l’objet d’un choix privilégié dans un schéma d’encodage de vocabulaire spécifique.
definition: Relaciona un ítem amb un nomen que és un punt d’accés d’ítem que no se selecciona com a preferent en un esquema de codificació de vocabulari específic. @ca
definition: Relaterer et eksemplar til en søgeindgang for eksemplar, som ikke er valgt som præference i et specifikt vokabularkodningsskema. @da
definition: Relaterer et eksemplar til en søkeinngang for eksemplar som ikke er en foretrukket søkeinngang i et bestemt kodeskjema for vokabular. @no
definition: Relates an item to a nomen that is an access point of item that is not selected for preference in a specific vocabulary encoding scheme. @en
definition: Sasaista vienību ar nomenu, kas ir piekļuves punkts vienībai, kas nav izvēlēta kā prioritāra noteiktai kontrolētas vārdnīcas shēmai. @lv
definition: Seostab eksemplari eksemplari otsielemendiga, mis ei ole valitud eelistatuks vastavas leksikaalses märkimissüsteemis. @et
definition: Setzt ein Exemplar in Beziehung zu einem Sucheinstieg für ein Exemplar, der in einem bestimmten Vocabulary Encoding Scheme nicht als Vorzugsform bestimmt wird. @de
definition: geen nieuwe vert nodig, bevatte tikfout in Engelse versie, geen inhoudelijke wijziging. @nl
definition: يربط مفردة بتسمية هي نقطة وصول لمفردة لم تُختر للتفضيل في خطة ترميز مفردات. @ar
definition: 将一个单件与作为一个单件的检索点、并没有在一个特定的词表编码体系中被首选的一个命名关联起来。 @zh-hans

a pour titre privilégié d’un item
has element type: 3
toolkit definition: A nomen that is a title of item that is selected for preference in a specific application or context. @en
toolkit definition: Belirli bir uygulama veya bağlamda tercih için seçilen bir kopyanın başlığı olan bir isim. @tr
toolkit definition: Een nomen dat is een titel van item die als voorkeursterm geselecteerd is in een specifieke toepassing of context. @nl
toolkit definition: Egy nomen, amely egy példány olyan címe, amelyet egy adott alkalmazásban vagy kontextusban előnyben részesítenek. @hu
toolkit definition: Ein Titel eines Exemplars, der in einer bestimmten Anwendung oder in einem bestimmten Kontext als Vorzugsform bestimmt wird. @de
toolkit definition: Eksemplari pealkiri, mis kindlas rakenduses või kontekstis on valitud eelistatuks. @et
toolkit definition: En tittel for eksemplar som er valgt som foretrukket tittel i en spesifikk applikasjon eller kontekst. @no
toolkit definition: Nomen que és un títol d’ítem que se selecciona com a preferent en una aplicació o un context específic. @ca
toolkit definition: Nomen qui est un titre d’item faisant l’objet d’un choix privilégié dans une application ou un contexte spécifiques.
toolkit definition: Nomen, joka on kappaleen nimeke, joka on valittu ensisijaiseksi tietyssä sovelluksessa tai kontekstissa. @fi
toolkit definition: Titel på eksemplar, som er valgt som præference i en specifik anvendelse eller kontekst. @da
toolkit definition: Titolo di item, selezionato come preferito in un'applicazione o contesto specifici. @it
toolkit definition: Vienības nosaukums, kas ir izvēlēts noteiktam lietojumam vai noteiktā kontekstā. @lv
toolkit definition: عنوان مفردة اختير للتفضيل في تطبيق أو في سياق محدد. @ar
toolkit definition: 作为单件的一个题名并在一个特定的应用或语境下被首选的一个命名 @zh-hans
toolkit label: bevorzugter Titel eines Exemplars @de
toolkit label: eksemplari eelispealkiri @et
toolkit label: foretrukken titel på eksemplar @da
toolkit label: foretrukket tittel for eksemplar @no
toolkit label: geprefereerde titel van item @nl
toolkit label: kappaleen ensisijainen nimeke @fi
toolkit label: preferred title of item @en
toolkit label: példány előnyben részesített címe: @hu
toolkit label: titolo preferito di item @it
toolkit label: titre privilégié d’un item
toolkit label: títol preferit d’ítem @ca
toolkit label: vienības prioritārais nosaukums @lv
toolkit label: Öğenin tercih edilen başlığı @tr
toolkit label: عنوان مفردة مفضل @ar
toolkit label: 单件的首选检索点 @zh-hans
has subproperty: P40085
lexical alias: preferredTitleOfItem.en
status: Published
type: Property
domain: C10003
label: eksemplari eelispealkiri @et
label: ha come titolo preferito di item @it
label: har foretrukken titel på eksemplar @da
label: har foretrukket tittel for eksemplar @no
label: has preferred title of item @en
label: hat bevorzugten Titel eines Exemplars @de
label: heeft geprefereerde titel van item @nl
label: kappaleen ensisijainen nimeke @fi
label: példány előnyben részesített címe a következő: @hu
label: tercih edilen kopya başlığı ile ilişkilidir @tr
label: té com a títol preferit d’ítem @ca
label: vienības prioritārais nosaukums @lv
label: له عنوان مفردة مفضل @ar
label: 有单件的首选检索点 @zh-hans
sub property of: a pour titre d’item
sub property of: P00021
definition: Bir kopyayı, belirli bir uygulama veya bağlamda tercih edilmek üzere seçilen bir kopya başlığı olan bir isimle ilişkilendirir. @tr
definition: Correla un item a un titolo di item, selezionato come preferito in un'applicazione o contesto specifici. @it
definition: Hozzákapcsol egy példány egy nomenhez, amely egy példány olyan címe, amelyet egy adott alkalmazásban vagy kontextusban előnyben részesítenek. @hu
definition: Liittää kappaleen nomeniin, joka on kappaleen nimeke, joka on valittu ensisijaiseksi tietyssä sovelluksessa tai kontekstissa. @fi
definition: Met un item en relation avec un nomen qui est un titre d’item faisant l’objet d’un choix privilégié dans une application ou un contexte spécifiques.
definition: Relaciona un ítem amb nomen que és un títol d’ítem que se selecciona com a preferent en una aplicació o un context específic. @ca
definition: Relateert een item aan een nomen dat is een titel van item die als voorkeursterm geselecteerd is in een specifieke toepassing of context. @nl
definition: Relaterer et eksemplar til en titel på eksemplar, som er valgt som præference i en specifik anvendelse eller kontekst. @da
definition: Relaterer et eksemplar til en tittel for eksemplar som er valgt som foretrukket tittel i en spesifikk applikasjon eller kontekst. @no
definition: Relates an item to a nomen that is a title of item that is selected for preference in a specific application or context. @en
definition: Sasaista vienību ar nomenu, kas ir vienības nosaukums, kas ir izvēlēts noteiktam lietojumam vai noteiktā kontekstā. @lv
definition: Seostab eksemplari eksemplari pealkirjaga, mis kindlas rakenduses või kontekstis on valitud eelistatuks. @et
definition: Setzt ein Exemplar in Beziehung zu einem Titel eines Exemplars, der in einer bestimmten Anwendung oder in einem bestimmten Kontext als Vorzugsform bestimmt wird. @de
definition: يربط مفردة بتسمية هي عنوان مفردة اختير للتفضيل في تطبيق أو في سياق محدد. @ar
definition: 将一个单件与作为单件的一个题名并在一个特定的应用或语境下被首选的一个命名关联起来。 @zh-hans

a pour variante de titre d’item
has element type: 3
toolkit definition: A nomen that is a title of item that is not selected for preference in a specific application or context. @en
toolkit definition: Belirli bir uygulama veya bağlamda tercih için seçilmemiş bir kopyanın başlığı olan bir isim. @tr
toolkit definition: Een nomen dat is een titel van item die niet als voorkeursterm geselecteerd is in een specifieke toepassing of context. @nl
toolkit definition: Egy nomen, amely egy példány olyan címe, amelyet egy adott alkalmazásban vagy kontextusban nem részesítenek előnyben. @hu
toolkit definition: Ein Titel eines Exemplars, der in einer bestimmten Anwendung oder in einem bestimmten Kontext nicht als Vorzugsform bestimmt wird. @de
toolkit definition: Eksemplari pealkiri, mis kindlas rakenduses või kontekstis ei ole valitud eelistatuks. @et
toolkit definition: En tittel for eksemplar som ikke er valgt som foretrukket tittel i en spesifikk applikasjon eller kontekst. @no
toolkit definition: Nomen que és un títol d’ítem que no se selecciona com a preferent en una aplicació o un context específic. @ca
toolkit definition: Nomen qui est un titre d’item ne faisant pas l’objet d’un choix privilégié dans une application ou un contexte spécifiques.
toolkit definition: Nomen, joka on kappaleen nimeke, jota ei ole valittu ensisijaiseksi tietyssä sovelluksessa tai kontekstissa. @fi
toolkit definition: Titel på eksemplar, som ikke er valgt som præference i en specifik anvendelse eller kontekst. @da
toolkit definition: Titolo di item, non selezionato come preferito in un'applicazione o contesto specifici. @it
toolkit definition: Vienīibas nosaukums, kas nav izvēlēts kā prioritārs noteiktā lietojumprogrammā vai kontekstā. @lv
toolkit definition: عنوان مفردة لم يُختر للتفضيل في تطبيق أو في سياق محدد. @ar
toolkit definition: 作为一个单件的题名、并没有在一个特定的应用或语境中被首选的一个命名 @zh-hans
toolkit label: abweichender Titel eines Exemplars @de
toolkit label: eksemplari variantpealkiri @et
toolkit label: kappaleen varianttinimeke @fi
toolkit label: kopyanın alternatif başlığı @tr
toolkit label: példány címváltozata: @hu
toolkit label: titolo variante di item @it
toolkit label: tittelvariant for eksemplar @no
toolkit label: variant af titel på eksemplar @da
toolkit label: variant de títol d’ítem @ca
toolkit label: variant titel van item @nl
toolkit label: variant title of item @en
toolkit label: variante de titre d’item
toolkit label: vienības cits nosaukums @lv
toolkit label: عنوان مفردة مختلف @ar
toolkit label: 单件的变异题名 @zh-hans
has subproperty: P40086
lexical alias: variantTitleOfItem.en
status: Published
type: Property
domain: C10003
label: eksemplari variantpealkiri @et
label: ha come titolo variante di item @it
label: har tittelvariant for eksemplar @no
label: har variant af titel på eksemplar @da
label: has variant title of item @en
label: hat abweichenden Titel eines Exemplars @de
label: heeft variant titel van item @nl
label: kappaleen varianttinimeke @fi
label: kopyanın alternatif başlığı ile ilişkilidir @tr
label: példány címváltozata a következő: @hu
label: té com a variant de títol d’ítem @ca
label: vienības cits nosaukums @lv
label: له عنوان مفردة مختلف @ar
label: 有单件的变异题名 @zh-hans
sub property of: a pour titre d’item
sub property of: P00023
definition: Bir kopyayı, belirli bir uygulama veya bağlamda tercih için seçilmeyen bir kopya başlığı olan bir isimle ilişkilendirir. @tr
definition: Correla un item a un titolo di item non selezionato come preferito in un'applicazione o contesto specifici. @it
definition: Hozzákapcsol egy példány egy nomenhez, amely egy példány olyan címe, amelyet egy adott alkalmazásban vagy kontextusban nem részesítenek előnyben. @hu
definition: Liittää kappaleen nomeniin, joka on kappaleen nimeke, jota ei ole valittu ensisijaiseksi tietyssä sovelluksessa tai kontekstissa. @fi
definition: Met un item en relation avec un nomen qui est un titre d’item ne faisant pas l’objet d’un choix privilégié dans une application ou un contexte spécifiques.
definition: Relaciona un ítem amb nomen que és un títol d’ítem que no se selecciona com a preferent en una aplicació o un context específic. @ca
definition: Relateert een item aan een nomen dat is een titel van item die niet als voorkeursterm geselecteerd is in een specifieke toepassing of context. @nl
definition: Relaterer et eksemplar til en titel på eksemplar, som ikke er valgt som præference i en specifik anvendelse eller kontekst. @da
definition: Relaterer et eksemplar til en tittel for eksemplar som ikke er valgt som foretrukket tittel i en spesifikk applikasjon eller kontekst. @no
definition: Relates an item to a nomen that is a title of item that is not selected for preference in a specific application or context. @en
definition: Sasaista vienību ar nomenu, kas ir vienīibas nosaukums, kas nav izvēlēts kā prioritārs noteiktā lietojumprogrammā vai kontekstā. @lv
definition: Seostab eksemplari eksemplari pealkirjaga, mis kindlas rakenduses või kontekstis ei ole valitud eelistatuks. @et
definition: Setzt ein Exemplar in Beziehung zu einem Titel eines Exemplars, der in einer bestimmten Anwendung oder in einem bestimmten Kontext nicht als Vorzugsform bestimmt wird. @de
definition: يربط مفردة بعنوان مفردة لم يُختر للتفضيل في تطبيق أو في سياق محدد. @ar
definition: 将一个单件与作为一个单件的题名、并没有在一个特定的应用或语境中被首选的一个命名关联起来。 @zh-hans

a pour transfert numérique d’un item
has element type: 2
toolkit definition: A manifestation in a digital format that results from the transfer of an item in another digital format. @en
toolkit definition: Bir kopyanın başka bir dijital formatta aktarılmasından kaynaklanan dijital formattaki bir gösterim. @tr
toolkit definition: Digitaalisessa muodossa oleva manifestaatio, joka on tulosta toisessa digitaalisessa muodossa olevan kappaleen muunnoksesta. @fi
toolkit definition: Digitaalne kehastus, mis on muus digitaalvormingus oleva eksemplari konversiooni tulemus. @et
toolkit definition: Een manifestatie in een digitaal formaat die het resultaat is van een kopie van een item in een ander digitaal formaat. @nl
toolkit definition: Egy digitális formátumú megjelenési forma, amely egy másik digitális formátumú példány átviteléből származik. @hu
toolkit definition: Eine Manifestation in einem digitalen Format, die durch die Übertragung eines Exemplars in ein anderes digitales Format entsteht. @de
toolkit definition: En manifestasjon i et digitalt format som er resultatet av overføringen av et eksemplar i et annet digitalt format. @no
toolkit definition: Manifestació en un format digital que és el resultat de la transferència d’un ítem en un altre format digital. @ca
toolkit definition: Manifestation en format numérique qui résulte du transfert d’un item dans un format numérique différent.
toolkit definition: Manifestation i et digitalt format, som er resultatet af en overførsel af et eksemplar i et andet digitalt format. @da
toolkit definition: Manifestazione in un formato digitale che risulta dal trasferimento di un item in un altro formato digitale. @it
toolkit definition: Manifestācija digitālā formātā, kas ir cita digitāla formāta vienības transformācijas rezultāts. @lv
toolkit definition: تجسيدة في شكل رقمي نتج عن تحويل مفردة إلى شكل رقمي آخر. @ar
toolkit definition: 从另一种数字格式的单件转储为一种数字格式而形成的载体表现 @zh-hans
toolkit label: Digitale Übertragung eines Exemplars @de
toolkit label: digital overføring av eksemplar @no
toolkit label: digital overførsel af eksemplar @da
toolkit label: digital transfer of item @en
toolkit label: digitale kopie van item @nl
toolkit label: eksemplari digitaalne konversioon @et
toolkit label: konvertoinnin tulos (kappale) @fi
toolkit label: kopyanın dijital aktarımı @tr
toolkit label: példány digitális átvitele: @hu
toolkit label: transfert numérique d’un item
toolkit label: transferència digital d’un ítem @ca
toolkit label: trasferimento digitale di item @it
toolkit label: vienības digitāls pārveidojums @lv
toolkit label: تحويل رقمي لمفردة @ar
toolkit label: 单件的数字转储 @zh-hans
has subproperty: P40087
lexical alias: digitalTransferOfItem.en
status: Published
type: Property
domain: C10003
label: eksemplari digitaalne konversioon @et
label: ha come trasferimento digitale di item @it
label: har digital overføring av eksemplar @no
label: har digital overførsel af eksemplar @da
label: has digital transfer of item @en
label: hat digitale Übertragung eines Exemplars @de
label: heeft digitale kopie van item @nl
label: konvertoinnin tulos (kappale) @fi
label: kopyanın dijital aktarımı ile ilişkilidir @tr
label: példány digitális átvitele a következő: @hu
label: té com a transferència digital d’un ítem @ca
label: vienības digitāls pārveidojums @lv
label: له تحويل رقمي لمفردة @ar
label: 有单件的数字转储 @zh-hans
sub property of: est reproduit comme un item
alternative label: Digitale Übertragung (Exemplar) @de
alternative label: digital transfer (item) @en
alternative label: digitális átvitele (példány): @hu
alternative label: dijital aktarım (kopya) @tr
alternative label: transferencia digital (ítem) @es
alternative label: transfert numérique (item)
alternative label: transferència digital (ítem) @ca
alternative label: تحويل رقمي (مفردة) @ar
alternative label: 数字转储（单件） @zh-hans
definition: Bir kopyayı, başka bir dijital formattaki bir kopyanın aktarımından kaynaklanan dijital formattaki bir gösterimle ilişkilendirir. @tr
definition: Correla un item a una manifestazione in un formato digitale che risulta dal trasferimento di un item in un altro formato digitale. @it
definition: Hozzákapcsol egy példányt egy digitális formátumú megjelenési formához, amely egy másik digitális formátumú példány átviteléből származik. @hu
definition: Liittää kappaleen digitaalisessa muodossa olevaan manifestaatioon, joka on tulosta toisessa digitaalisessa muodossa olevan kappaleen muunnoksesta. @fi
definition: Met un item en relation avec une manifestation en format numérique qui résulte du transfert d’un item dans un format numérique différent.
definition: Relaciona un ítem amb una manifestació en un format digital que és el resultat de la transferència d’un ítem en un altre format digital. @ca
definition: Relateert een item aan een manifestatie in een digitaal formaat die het resultaat is van een kopie van een item in een ander digitaal formaat. @nl
definition: Relaterer et eksemplar til en manifestasjon i et digitalt format som er resultatet av overføringen av et eksemplar i et annet digitalt format. @no
definition: Relaterer et eksemplar til en manifestation i et digitalt format, som er resultatet af en overførsel af et eksemplar i et andet digitalt format. @da
definition: Relates an item to a manifestation in a digital format that results from the transfer of an item in another digital format. @en
definition: Sasaista vienību ar manifestāciju digitālā formātā, kas ir cita digitāla formāta vienības transformācijas rezultāts. @lv
definition: Seostab eksemplari digitaalse kehastusega, mis on muus digitaalvormingus oleva eksemplari konversiooni tulemus. @et
definition: Setzt ein Exemplar in Beziehung zu einer Manifestation in einem digitalen Format, die durch die Übertragung eines Exemplars in ein anderes digitales Format entsteht. @de
definition: يربط مفردة بتجسيدة في شكل رقمي نتجت عن تحويل مفردة إلى شكل رقمي آخر. @ar
definition: 将一个单件与从另一种数字格式的单件转储为一种数字格式而形成的载体表现关联起来。 @zh-hans

a pour reproduction électronique d’un item
has element type: 2
toolkit definition: A manifestation in a digital format that is the result of the transfer of an item in analog format. @en
toolkit definition: Analog formatta bir kopyanın aktarımının sonucu olan dijital formatta bir gösterim. @tr
toolkit definition: Digitaalisessa muodossa oleva manifestaatio, joka analogisen kappaleen muunnoksen tulos. @fi
toolkit definition: Digitaalvormis kehastus, mis on saadud analoogvormis eksemplari digiteerimise teel. @et
toolkit definition: Een manifestatie in een digiteel formaat die het resultaat is van een kopie van een item in analoog formaat. @nl
toolkit definition: Egy digitális formátumban lévő megjelenési forma, amely egy példány analóg formátumból történő átviteléből ered. @hu
toolkit definition: Eine Manifestation in einem digitalen Format, die das Ergebnis der Übertragung eines Exemplars in einem analogen Format ist. @de
toolkit definition: En manifestasjon i et digitalt format som er resultatet av overføringen av et eksemplar i et analogt format. @no
toolkit definition: Manifestació en un format digital que és el resultat de la transferència d’un ítem en format analògic. @ca
toolkit definition: Manifestation en format numérique qui est le résultat du transfert d’un item sur support analogique.
toolkit definition: Manifestation i et digitalt format, som er resultatet af en overførsel af en manifestation i et analogt format. @da
toolkit definition: Manifestazione in formato digitale che risulta dal trasferimento di un item in un formato analogo. @it
toolkit definition: Manifestācija digitālā formātā, kas ir analoga formāta vienības transformācijas rezultāts. @lv
toolkit definition: تجسيدة في شكل رقمي نتج عن تحويل مفردة في شكل تناظري. @ar
toolkit definition: 从模拟格式的单件转储为一种数字格式而形成的载体表现 @zh-hans
toolkit label: Elektronische Reproduktion eines Exemplars @de
toolkit label: eksemplari elektrooniline reproduktsioon @et
toolkit label: electronic reproduction of item @en
toolkit label: elektronische reproductie van item @nl
toolkit label: elektronisk reproduksjon av eksemplar @no
toolkit label: elektronisk reproduktion af eksemplar @da
toolkit label: kappaleen digitoitu jäljenne @fi
toolkit label: kopyanın elektronik olarak yeniden üretimi @tr
toolkit label: példány elektronikus másolata: @hu
toolkit label: reproducció electrònica d’un ítem @ca
toolkit label: reproduction électronique d’un item
toolkit label: riproduzione elettronica di item @it
toolkit label: vienības digitāla reprodukcija @lv
toolkit label: استنساخ إلكتروني لمفردة @ar
toolkit label: 单件的电子复制品 @zh-hans
has subproperty: P40088
lexical alias: electronicReproductionOfItem.en
status: Published
type: Property
domain: C10003
label: eksemplari elektrooniline reproduktsioon @et
label: ha come riproduzione elettronica di item @it
label: har elektronisk reproduksjon av eksemplar @no
label: har elektronisk reproduktion af eksemplar @da
label: has electronic reproduction of item @en
label: hat elektronische Reproduktion eines Exemplars @de
label: heeft elektronische reproductie van item @nl
label: kappaleen digitoitu jäljenne @fi
label: kopyanın elektronik yeniden üretimi ile ilişkilidir @tr
label: példány elektronikus másolata a következő: @hu
label: té com a reproducció electrònica d’un ítem @ca
label: vienības digitāla reprodukcija @lv
label: له استنساخ إلكتروني لمفردة @ar
label: 有单件的电子复制品 @zh-hans
sub property of: est reproduit comme un item
alternative label: Elektronische Reproduktion (Exemplar) @de
alternative label: digitoitu jäljenne (kappale) @fi
alternative label: electronic reproduction (item) @en
alternative label: elektronik yeniden üretim (kopya) @tr
alternative label: elektronikus másolata (példány): @hu
alternative label: elektronisk reproduktion (eksemplar) @da
alternative label: reproducció electrònica (ítem) @ca
alternative label: reproducción electrónica (ítem) @es
alternative label: reproduction électronique (item)
alternative label: استنساخ إلكتروني (مفردة) @ar
alternative label: 电子复制品（单件） @zh-hans
definition: Bir kopyayı, analog formattaki bir kopyanın aktarımının sonucu olan dijital formattaki bir gösterimle ilişkilendirir. @tr
definition: Correla un item a una manifestazione in formato digitale che risulta dal trasferimento di un item in un formato analogo. @it
definition: Hozzákapcsol egy példányt egy digitális formátumban lévő megjelenési formához, amely egy példány analóg formátumból történő átviteléből ered. @hu
definition: Liittää kappaleen digitaalisessa muodossa olevaan manifestaatioon, joka analogisen kappaleen muunnoksen tulos. @fi
definition: Met un item en relation avec une manifestation en format numérique qui est le résultat du transfert d’un item sur support analogique.
definition: Relaciona un ítem amb una manifestació en un format digital que és el resultat de la transferència d’un ítem en format analògic. @ca
definition: Relateert een item aan een manifestatie in een digitaal formaat die het resultaat is van een kopie van een item in analoog formaat. @nl
definition: Relaterer et eksemplar til en manifestasjon i et digitalt format som er resultatet av overføringen av et eksemplar i et analogt format. @no
definition: Relaterer et eksemplar til en manifestation i et digitalt format, som er resultatet af en overførsel af en manifestation i et analogt format. @da
definition: Relates an item to a manifestation in a digital format that is the result of the transfer of an item in analog format. @en
definition: Sasaista vienību ar manifestāciju digitālā formātā, kas ir analoga formāta vienības transformācijas rezultāts. @lv
definition: Seostab eksemplari digitaalvormis kehastusega, mis on saadud analoogvormis eksemplari digiteerimise teel. @et
definition: Setzt ein Exemplar in Beziehung zu einer Manifestation in einem digitalen Format, die das Ergebnis der Übertragung eines Exemplars in einem analogen Format ist. @de
definition: يربط مفردة بتجسيدة في شكل رقمي نتج عن تحويل مفردة في شكل تناظري. @ar
definition: 将一个单件与从模拟格式的单件转储为一种数字格式而形成的载体表现关联起来。 @zh-hans

a pour fac-similé d’un item
has element type: 2
toolkit definition: A manifestation that exactly reproduces an item that exemplifies another manifestation. @en
toolkit definition: Başka bir gösterimi örnekleyen bir kopyayı tam olarak yeniden üreten bir gösterim. @tr
toolkit definition: Een manifestatie die een item exact reproduceert dat een andere manifestatie voorstelt. @nl
toolkit definition: Egy megjelenési forma, amely egy másik megjelenési forma egy példányának pontos másolata. @hu
toolkit definition: Eine Manifestation, die ein Exemplar exakt reproduziert, welches eine andere Manifestation darstellt. @de
toolkit definition: En manifestasjon som er en nøyaktig reproduksjon av et eksemplar som eksemplifiserer en annen manifestasjon. @no
toolkit definition: Kehastus, mis on teist kehastust esindava eksemplari täpne reproduktsioon. @et
toolkit definition: Manifestaatio, joka jäljentää tarkalleen toista manifestaatiota edustavan kappaleen. @fi
toolkit definition: Manifestació que reprodueix exactament un ítem que exemplifica una altra manifestació. @ca
toolkit definition: Manifestation qui reproduit exactement un item exemplifiant une autre manifestation.
toolkit definition: Manifestation, som nøjagtigt gengiver et eksemplar, som eksemplificerer en anden manifestation. @da
toolkit definition: Manifestazione che riproduce esattamente un item che esemplifica un'altra manifestazione. @it
toolkit definition: Manifestācija, kas precīzi reproducē vienību, kas ir kā piemērs citai manifestācijai. @lv
toolkit definition: تجسيدة مستنسخة تماما من مفردة تمثل تجسيدة أخرى. @ar
toolkit definition: 精确复制例证另一种载体表现的单件的一种载体表现 @zh-hans
toolkit label: Faksimile eines Exemplars @de
toolkit label: eksemplari faksiimile @et
toolkit label: fac-similé d’un item
toolkit label: facsimile di item @it
toolkit label: facsimile of item @en
toolkit label: facsimile van item @nl
toolkit label: facsímil d’un ítem @ca
toolkit label: faksimile af eksemplar @da
toolkit label: faksimile av eksemplar @no
toolkit label: kappaleen näköispainos @fi
toolkit label: kopyanın tıpkıbasımı @tr
toolkit label: példány hasonmása: @hu
toolkit label: vienības faksimils @lv
toolkit label: نسخة طبق الأصل من مفردة @ar
toolkit label: 单件的摹真品 @zh-hans
has subproperty: a pour fac-similé de conservation d’un item
has subproperty: P40089
lexical alias: facsimileOfItem.en
status: Published
type: Property
domain: C10003
label: eksemplari faksiimile @et
label: ha come facsimile di item @it
label: har faksimile af eksemplar @da
label: har faksimile av eksemplar @no
label: has facsimile of item @en
label: hat Faksimile eines Exemplars @de
label: heeft facsimile van item @nl
label: kappaleen näköispainos @fi
label: kopyanın tıpkıbasımı ile ilişkilidir @tr
label: példány hasonmása a következő: @hu
label: té com a facsímil d’un ítem @ca
label: vienības faksimils @lv
label: لها نسخة طبق الأصل من مفردة @ar
label: 有单件的摹真品 @zh-hans
sub property of: est reproduit comme un item
alternative label: Faksimile (Exemplar) @de
alternative label: fac-similé (item)
alternative label: facsimile (item) @en
alternative label: facsímil (ítem) @ca
alternative label: faksimile (eksemplar) @da
alternative label: hasonmása (példány): @hu
alternative label: näköispainos (kappale) @fi
alternative label: tıpkıbasım (kopya) @tr
alternative label: نسخة طبق الأصل (مفردة) @ar
alternative label: 摹真品（单件） @zh-hans
definition: Bir kopyayı, başka bir gösterimden kopya edilmiş bir kopyayı tam olarak yeniden üreten bir gösterimle ilişkilendirir. @tr
definition: Correla un item a una manifestazione che riproduce esattamente un item che esemplifica un'altra manifestazione. @it
definition: Hozzákapcsol egy példányt egy megjelenési formához, amely egy másik megjelenési forma egy példányának pontos másolata. @hu
definition: Liittää kappaleen manifestaatioon, joka jäljentää tarkalleen toista manifestaatiota edustavan kappaleen. @fi
definition: Met un item en relation avec une manifestation qui reproduit exactement un item exemplifiant une autre manifestation.
definition: Relaciona un ítem amb una manifestació que reprodueix exactament un ítem que exemplifica una altra manifestació. @ca
definition: Relateert een item aan een manifestatie die een item exact reproduceert dat een andere manifestatie voorstelt. @nl
definition: Relaterer et eksemplar til en manifestasjon som er en nøyaktig reproduksjon av et eksemplar som eksemplifiserer en annen manifestasjon. @no
definition: Relaterer et eksemplar til en manifestation, som nøjagtigt gengiver et eksemplar, som eksemplificerer en anden manifestation. @da
definition: Relates an item to a manifestation that exactly reproduces an item that exemplifies another manifestation. @en
definition: Sasaista vienību ar manifestāciju, kas precīzi reproducē vienību, kas ir kā piemērs citai manifestācijai. @lv
definition: Seostab eksemplari kehastusega, mis on teist kehastust esindava eksemplari täpne reproduktsioon. @et
definition: Setzt ein Exemplar in Beziehung zu einer Manifestation, die ein Exemplar exakt reproduziert, welches eine andere Manifestation darstellt. @de
definition: يربط مفردة بتجسيدة هي استنساخ تام من مفردة تمثل تجسيدة أخرى. @ar
definition: 将一个单件与精确复制例证另一种载体表现的单件的一种载体表现关联起来。 @zh-hans

a pour fac-similé de conservation d’un item
has element type: 2
toolkit definition: A manifestation that consists of an exact reproduction of an item on preservation-quality media, such as acid-free permanent or archival paper. @en
toolkit definition: Asitsiz kalıcı kağıt veya arşiv kağıdı gibi koruma kalitesinde ortamlarda bir kopyanın tam olarak çoğaltılmasından oluşan bir gösterim. @tr
toolkit definition: Een manifestatie die bestaat uit een exacte reproductie van een item op een medium van conserveringskwaliteit, zoals zuurvrij permanent- of archiefpapier. @nl
toolkit definition: Egy megjelenési forma, amely egy példány pontos újraalkotása olyan megőrzés-minőségű médiumon, mint például a savmentes tartós vagy archiváló papír. @hu
toolkit definition: Eine Manifestation, die aus einer exakten Reproduktion eines Exemplars auf bestandserhaltenden Medien, wie zum Beispiel säurefreiem Papier oder Archivpapier, besteht. @de
toolkit definition: En manifestasjon som består av en nøyaktig reproduksjon av et eksemplar på et medium av bevaringskvalitet, som for eksempel syrefritt papir eller arkivpapir. @no
toolkit definition: Kehastus, mis on eksemplari täpne reproduktsioon arhiivikvaliteediga meediumil, nt happevabal vananemiskindlal ehk arhiivipaberil. @et
toolkit definition: Manifestaatio, joka koostuu kappaleen täsmällisestä jäljennöksestä. Jäljennöksen valmistuksessa on käytetty arkistokelpoista materiaalia, esim. arkistopaperia. @fi
toolkit definition: Manifestació que consisteix en una reproducció exacta d’un ítem en un suport de preservació de qualitat, com ara paper permanent no àcid o paper d’arxiu. @ca
toolkit definition: Manifestation qui consiste en une reproduction exacte d’un item sur un support de qualité conservation, tel qu’un papier permanent sans acide ou un papier d’archivage.
toolkit definition: Manifestation, som består af en nøjagtig reproduktion af et eksemplar på et medium af bevaringskvalitet, såsom syrefrit permanent- eller arkivpapir. @da
toolkit definition: Manifestācija - precīza vienības reprodukcija saglabāšanai piemērotas kvalitātes vidē, piemēram, uz skābi nesaturoša papīra vai arhīvpapīra. @lv
toolkit definition: Mmanifestazione che consiste di una riproduzione esatta di un item su supporto destinato alla conservazione, come come carta non acida permanente o carta da archivio. @it
toolkit definition: تجسيدة تتكون من استنساخ كامل لمفردة على وسيط حفظ عالي الجودة، مثل ورق خال من الأحماض. @ar
toolkit definition: 由在诸如脱酸的永久用纸或档案纸等具有保存品质的媒介上的精确复制品组成的载体表现 @zh-hans
toolkit label: Bestandserhaltungsfaksimile eines Exemplars @de
toolkit label: bevaringsfaksimile af eksemplar @da
toolkit label: bevaringskopi av eksemplar @no
toolkit label: conservatiefacsimile van item @nl
toolkit label: eksemplari säilituskoopia @et
toolkit label: fac-similé de conservation d’un item
toolkit label: facsimile per la conservazione di item @it
toolkit label: facsímil de preservació d’un ítem @ca
toolkit label: kappaleen säilytyskopio @fi
toolkit label: kopyanın korunan tıpkı basımı @tr
toolkit label: preservation facsimile of item @en
toolkit label: példány megőrzési hasonmása: @hu
toolkit label: vienības arhīvfaksimils @lv
toolkit label: حفظ نسخة طبق الأصل من مفردة @ar
toolkit label: 单件的保存摹真品 @zh-hans
has subproperty: P40090
lexical alias: preservationFacsimileOfItem.en
status: Published
type: Property
domain: C10003
label: eksemplari säilituskoopia @et
label: ha come facsmile per la conservazione di item @it
label: har bevaringsfaksimile af eksemplar @da
label: har bevaringskopi av eksemplar @no
label: has preservation facsimile of item @en
label: hat Bestandserhaltungsfaksimile eines Exemplars @de
label: heeft conservatiefacsimile van item @nl
label: kappaleen säilytyskopio @fi
label: kopyanın koruma kopyası ile ilişkilidir @tr
label: példány megőrzési hasonmása a következő: @hu
label: té com a facsímil de preservació d’un ítem @ca
label: vienības arhīvfaksimils @lv
label: له حفظ لنسخة طبق الأصل من مفردة @ar
label: 有单件的保存摹真品 @zh-hans
sub property of: a pour fac-similé d’un item
alternative label: Bestandserhaltungsfaksimile (Exemplar) @de
alternative label: Tıpkı basımın koruma kopyası @tr
alternative label: bevaringsfaksimile (eksemplar) @da
alternative label: fac-similé de conservation (item)
alternative label: facsímil de preservació (ítem) @ca
alternative label: facsímil de preservación (ítem) @es
alternative label: megőrzési hasonmása (példány): @hu
alternative label: preservation facsimile (item) @en
alternative label: säilytyskopio (kappale) @fi
alternative label: حفظ نسخة طبق الأصل ( مفردة) @ar
alternative label: 保存摹真品（单件） @zh-hans
definition: Bir kopyayı, bir kopyanın asitsiz kalıcı veya arşiv kağıdı gibi koruma kalitesinde ortam üzerinde tam olarak çoğaltılmasından oluşan bir gösterimle ilişkilendirir. @tr
definition: Correla un item a una manifestazione che consiste di una riproduzione esatta di un item su supporto destinato alla conservazione, come come carta non acida permanente o carta da archivio. @it
definition: Hozzákapcsol egy példányt egy megjelenési formához, amely egy példány pontos újraalkotása olyan megőrzés-minőségű médiumon, mint például a savmentes tartós vagy archiváló papír. @hu
definition: Liittää kappaleen manifestaatioon, joka koostuu kappaleen täsmällisestä jäljennöksestä. Jäljennöksen valmistuksessa on käytetty arkistokelpoista materiaalia, esim. arkistopaperia. @fi
definition: Met un item en relation avec une manifestation qui consiste en une reproduction exacte d’un item sur un support de qualité conservation, tel qu’un papier permanent sans acide ou un papier d’archivage.
definition: Relaciona un ítem amb una manifestació que consisteix en una reproducció exacta d’un ítem en un suport de preservació de qualitat, com ara paper permanent no àcid o paper d’arxiu. @ca
definition: Relateert een item aan een manifestatie die bestaat uit een exacte reproductie van een item op een medium van conserveringskwaliteit, zoals zuurvrij permanent- of archiefpapier. @nl
definition: Relaterer et eksemplar til en manifestasjon som består av en nøyaktig reproduksjon av et eksemplar på et medium av bevaringskvalitet, som for eksempel syrefritt papir eller arkivpapir. @no
definition: Relaterer et eksemplar til en manifestation, som består af en nøjagtig reproduktion af et eksemplar på et medium af bevaringskvalitet, såsom syrefrit permanent- eller arkivpapir. @da
definition: Relates an item to a manifestation that consists of an exact reproduction of an item on preservation-quality media, such as acid-free permanent or archival paper. @en
definition: Sasaista vienību ar manifestāciju, kas ir precīza vienības reprodukcija saglabāšanai piemērotas kvalitātes vidē, piemēram, uz skābi nesaturoša papīra vai arhīvpapīra. @lv
definition: Seostab eksemplari kehastusega, mis on eksemplari täpne reproduktsioon arhiivikvaliteediga meediumil, nt happevabal vananemiskindlal ehk arhiivipaberil. @et
definition: Setzt ein Exemplar in Beziehung zu einer Manifestation, die aus einer exakten Reproduktion eines Exemplars auf bestandserhaltenden Medien, wie zum Beispiel säurefreiem Papier oder Archivpapier, besteht. @de
definition: يربط مفردة بتجسيدة تتكون من استنساخ تام لمفردة على وسيط حفظ عالي الجودة، مثل ورق خال من الأحماض @ar
definition: 将一个单件与由在诸如脱酸的永久用纸或档案纸等具有保存品质的媒介上的精确复制品组成的载体表现关联起来。 @zh-hans

est réimprimé comme un item
has element type: 2
toolkit definition: A manifestation that is a reissue of an item that exemplifies another printed manifestation. @en
toolkit definition: Başka bir basılı gösterimi örnekleyen bir kopyanın yeniden basımı olan bir gösterim. @tr
toolkit definition: Een manifestatie die een heruitgave is van een item dat een andere gedrukte manifestatie voorstelt. @nl
toolkit definition: Egy megjelenési forma, amely egy példány kiadása, amely egy másik nyomtatott megjelenési formát példáz. @hu
toolkit definition: Eine Manifestation, die eine Neuauflage eines Exemplars ist, das eine andere gedruckte Manifestation darstellt. @de
toolkit definition: En manifestasjon som er et opptrykk av et eksemplar som eksemplifiserer en annen trykt manifestasjon. @no
toolkit definition: Kehastus, mis on teist trükitud kehastust esindava eksemplari kordustrükk. @et
toolkit definition: Manifestaatio, joka on uusintajulkaisu toista painettua manifestaatiota edustavasta kappaleesta. @fi
toolkit definition: Manifestació que és una reimpressió d’un ítem que exemplifica una altra manifestació impresa. @ca
toolkit definition: Manifestation qui consiste en une réédition d’un item exemplifiant une autre manifestation imprimée.
toolkit definition: Manifestation, som er en genudgivelse af et eksemplar, som eksemplificerer en anden trykt manifestation. @da
toolkit definition: Manifestazione che è una riemissione di un item che esemplifica un'altra manifestazione a stampa. @it
toolkit definition: Manifestācija, kas ir vienības, kas ir citas drukātas manifestācijas paraugeksemplārs, reprints. @lv
toolkit definition: تجسيدة هي إعادة اصدار لمفردة تُمثل تجسيدة أخرى مطبوعة. @ar
toolkit definition: 作为例证另一个印刷载体表现的一个单件的重新发行本的一种载体表现 @zh-hans
toolkit label: Nachgedruckt als Exemplar @de
toolkit label: eksemplari kordustrükk @et
toolkit label: genoptrykt som eksemplar @da
toolkit label: herdrukt als item @nl
toolkit label: kappaleen uusintapainos @fi
toolkit label: kopya olarak yeniden basılmış @tr
toolkit label: opptrykk av eksemplar @no
toolkit label: reimprès com a ítem @ca
toolkit label: reprint példány: @hu
toolkit label: reprinted as item @en
toolkit label: ristampato come item @it
toolkit label: réimprimé comme un item
toolkit label: vienības reprints @lv
toolkit label: أُعيد طبعها كمفردة @ar
toolkit label: 被重印为单件 @zh-hans
has subproperty: P40091
lexical alias: reprintedAsItem.en
status: Published
type: Property
domain: C10003
label: eksemplari kordustrükk @et
label: er genoptrykt som eksemplar @da
label: er opptrykk av eksemplar @no
label: ir vienības reprints @lv
label: is herdrukt als item @nl
label: is reprinted as item @en
label: ist nachgedruckt als Exemplar @de
label: kappaleen uusintapainos @fi
label: kopya olarak yeniden basılmıştır @tr
label: reprint példánya a következőnek: @hu
label: è ristampato come item @it
label: és reimprès com a ítem @ca
label: أُعيد طبعها كمفردة @ar
label: 被重印为单件 @zh-hans
sub property of: est reproduit comme un item
definition: Bir kopyayı, başka bir basılı gösterimden kopya edilen bir kopyanın yeniden yayımı olan bir gösterimle ilişkilendirir. @tr
definition: Correla un itema una manifestazione che è una riemissione di un item che esemplifica un'altra manifestazione a stampa. @it
definition: Hozzákapcsol egy példányt egy megjelenési formához, amely egy példány kiadása, amely egy másik nyomtatott megjelenési formát példáz. @hu
definition: Liittää kappaleen manifestaatioon, joka on uusintajulkaisu toista painettua manifestaatiota edustavasta kappaleesta. @fi
definition: Met un item en relation avec une manifestation qui consiste en une réédition d’un item exemplifiant une autre manifestation imprimée.
definition: Relaciona un ítem amb una manifestació que és una reimpressió d’un ítem que exemplifica una altra manifestació impresa. @ca
definition: Relateert een item aan een manifestatie die een heruitgave is van een item dat een andere gedrukte manifestatie voorstelt. @nl
definition: Relaterer et eksemplar til en manifestasjon som er et opptrykk av et eksemplar som eksemplifiserer en annen trykt manifestasjon. @no
definition: Relaterer et eksemplar til en manifestation, som er en genudgivelse af et eksemplar, som eksemplificerer en anden trykt manifestation. @da
definition: Relates an item to a manifestation that is a reissue of an item that exemplifies another printed manifestation. @en
definition: Sasaista vienību ar manifestāciju, kas ir vienības, kas ir citas drukātas manifestācijas paraugeksemplārs, reprints. @lv
definition: Seostab eksemplari kehastusega, mis on teist trükitud kehastust esindava eksemplari kordustrükk. @et
definition: Setzt ein Exemplar in Beziehung zu einer Manifestation, die eine Neuauflage eines Exemplars ist, das eine andere gedruckte Manifestation darstellt. @de
definition: يربط مفردة بتجسيدة هى اعادة اصدار لمفردة تمثل تجسيدة أخرى مطبوعة. @ar
definition: 将一个单件与作为例证另一个印刷载体表现的一个单件的重新发行本的一种载体表现关联起来。 @zh-hans

est reproduit comme un item
has element type: 2
toolkit definition: A manifestation that reproduces an item that exemplifies another manifestation. @en
toolkit definition: Başka bir gösterimi örnekleyen bir kopyayı yeniden üreten bir gösterim. @tr
toolkit definition: Een manifestatie die een item reproduceert dat een andere manifestatie voorstelt. @nl
toolkit definition: Egy megjelenési forma, amely reprodukál egy példányt, amely egy másik megjelenési formát példáz. @hu
toolkit definition: Eine Manifestation, die ein Exemplar reproduziert, welches eine andere Manifestation darstellt. @de
toolkit definition: En manifestasjon som reproduserer et eksemplar som eksemplifiserer en annen manifestasjon. @no
toolkit definition: Kehastus, mis on teist kehastust esindava eksemplari reproduktsioon. @et
toolkit definition: Manifestaatio, joka on jäljenne toista manifestaatiota edustavasta kappaleesta. @fi
toolkit definition: Manifestació que reprodueix un ítem que exemplifica una altra manifestació. @ca
toolkit definition: Manifestation qui reproduit un item exemplifiant une autre manifestation.
toolkit definition: Manifestation, som gengiver et eksemplar, som eksemplificerer en anden manifestation. @da
toolkit definition: Manifestazione che riproduce un item che esemplifica un'altra manifestazione. @it
toolkit definition: Manifestācija, kas atveido citu manifestāciju pārstāvošu vienību. @lv
toolkit definition: تجسيدة تستنسخ مفردة تمثل تجسيدة أخرى. @ar
toolkit definition: 复制例证另一种载体表现的一个单件的一种载体表现 @zh-hans
toolkit label: Reproduziert als Exemplar @de
toolkit label: eksemplari reproduktsioon @et
toolkit label: gereproduceerd als item @nl
toolkit label: kappaleen jäljenne @fi
toolkit label: kopya olarak yeniden üretilmiş @tr
toolkit label: reproduced as item @en
toolkit label: reproduceret som eksemplar @da
toolkit label: reproduit comme un item
toolkit label: reprodukciós példány: @hu
toolkit label: reproduksjon av eksemplar @no
toolkit label: reproduït com a ítem @ca
toolkit label: riprodotto come item @it
toolkit label: vienības reprodukcija @lv
toolkit label: مستنسخة كمفردة @ar
toolkit label: 被复制为单件 @zh-hans
has subproperty: a pour transfert numérique d’un item
has subproperty: a pour reproduction électronique d’un item
has subproperty: a pour fac-similé d’un item
has subproperty: est réimprimé comme un item
has subproperty: P40092
lexical alias: reproducedAsItem.en
status: Published
type: Property
domain: C10003
label: eksemplari reproduktsioon @et
label: er reproduceret som eksemplar @da
label: er reproduksjon av eksemplar @no
label: ir vienības reprodukcija @lv
label: is gereproduceerd als item @nl
label: is reproduced as item @en
label: ist reproduziert als Exemplar @de
label: kappaleen jäljenne @fi
label: kopya olarak yeniden yapılmıştır @tr
label: reprodukált példánya a következőnek: @hu
label: è riprodotto come item @it
label: és reproduït com a ítem @ca
label: هي مستنسخة كمفردة @ar
label: 被复制为单件 @zh-hans
sub property of: a pour manifestation en relation avec un item
definition: Bir kopyayı, başka bir gösterimden kopya edilen bir kopyayı yeniden üreten bir gösterimle ilişkilendirir. @tr
definition: Correla un item a una manifestazione che riproduce un item che esemplifica un'altra manifestazione. @it
definition: Hozzákapcsol egy példányt egy megjelenési formához, amely reprodukál egy példányt, amely egy másik megjelenési formát példáz. @hu
definition: Liittää kappaleen manifestaatioon, joka on jäljenne toista manifestaatiota edustavasta kappaleesta. @fi
definition: Met un item en relation avec une manifestation qui reproduit un item exemplifiant une autre manifestation.
definition: Relaciona un ítem amb una manifestació que reprodueix un ítem que exemplifica una altra manifestació. @ca
definition: Relateert een item aan een manifestatie die een item reproduceert dat een andere manifestatie voorstelt. @nl
definition: Relaterer et eksemplar til en manifestasjon som reproduserer et eksemplar som eksemplifiserer en annen manifestasjon. @no
definition: Relaterer et eksemplar til en manifestation, som gengiver et eksemplar, som eksemplificerer en anden manifestation. @da
definition: Relates an item to a manifestation that reproduces an item that exemplifies another manifestation. @en
definition: Sasaista vienību ar manifestāciju, kas atveido citu manifestāciju pārstāvošu vienību. @lv
definition: Seostab eksemplari kehastusega, mis on teist kehastust esindava eksemplari reproduktsioon. @et
definition: Setzt ein Exemplar in Beziehung zu einer Manifestation, die ein Exemplar reproduziert, welches eine andere Manifestation darstellt. @de
definition: يربط مفردة بتجسيدة تستنسخ مفردة تمثل تجسيدة أخرى. @ar
definition: 将一个单件与复制例证另一种载体表现的一个单件的一种载体表现关联起来。 @zh-hans

a pour agent modificateur
has element type: 2
toolkit definition: Agent que fa canvis a un ítem sense crear una manifestació nova. @ca
toolkit definition: Agent qui apporte des modifications à un item sans créer une nouvelle manifestation.
toolkit definition: Agent, som ændrer i et eksemplar uden at skabe en ny manifestation. @da
toolkit definition: Agente che apporta modifiche a un item senza creare una nuova manifestazione. @it
toolkit definition: An agent who makes changes to an item without creating a new manifestation. @en
toolkit definition: Aģents, kas veicis izmaiņas vienībā, neradot jaunu manifestāciju. @lv
toolkit definition: Een actor die veranderingen aanbrengt aan een item zonder een nieuwe manifestatie te creëren. @nl
toolkit definition: Egy ágens, amely új megjelenési forma létrehozása nélkül idéz elő változást a példányban. @hu
toolkit definition: Ein Akteur, der Änderungen an einem Exemplar vornimmt, ohne eine neue Manifestation zu erschaffen. @de
toolkit definition: En agent som gjør endringer på et eksemplar uten å skape en ny manifestasjon. @no
toolkit definition: Tegija, kes muudab eksemplari, loomata uut kehastust. @et
toolkit definition: Toimija, joka tekee muutoksia kappaleeseen luomatta uutta manifestaatiota. @fi
toolkit definition: Yeni bir gösterim oluşturmadan bir öğede değişiklik yapan bir temsilci. @tr
toolkit definition: وكيل يقوم يجري تغييرات على مفردة دون أن ينشئ تجسيدة جديدة. @ar
toolkit definition: 对一个单件作修改而不创建一个新的载体表现的一个行为者 @zh-hans
toolkit label: Bearbeiterin/Bearbeiter eines Exemplars (Akteur) @de
toolkit label: Dönüştürücü temsilci @tr
toolkit label: Hozzákapcsol egy példányt egy ágenshez, amely új megjelenési forma létrehozása nélkül idéz elő változást a példányban. @hu
toolkit label: aanpasser-actor @nl
toolkit label: agent modificador @ca
toolkit label: agent modificateur
toolkit label: agent, som er tilpasser @da
toolkit label: modificatore agente @it
toolkit label: modificētājs (aģents) @lv
toolkit label: modifier agent @en
toolkit label: muokkaaja (toimija) @fi
toolkit label: muutja (tegija) @et
toolkit label: tilpasser (agent) @no
toolkit label: وكيل مُعدِّل @ar
toolkit label: 修改者行为者 @zh-hans
has subproperty: a pour agent enlumineur
has subproperty: a pour agent relieur
has subproperty: a pour agent restaurateur d’un item
has subproperty: a pour personne modificatrice
has subproperty: a pour agent collectif modificateur
has subproperty: P40093
lexical alias: modifierAgent.en
status: Published
type: Property
domain: C10003
label: düzenleyici temsilcisi ile ilişkilidir @tr
label: ha come modificatore agente @it
label: har agent, som er tilpasser @da
label: har tilpasser (agent) @no
label: has modifier agent @en
label: hat Bearbeiterin/Bearbeiter eines Exemplars (Akteur) @de
label: heeft aanpasser-actor @nl
label: modificētājs (aģents) @lv
label: muokkaaja (toimija) @fi
label: muutja (tegija) @et
label: módosító ágense a következő: @hu
label: té com a agent modificador @ca
label: له وكيل مُعدِّل @ar
label: 有修改者行为者 @zh-hans
sub property of: a pour agent en relation avec un item
alternative label: Dönüştürücü @tr
alternative label: modificador @ca
alternative label: modificateur
alternative label: modificatore (?) @it
alternative label: modifier @en
alternative label: muokkaaja @fi
alternative label: muutja @et
alternative label: módosítója: @hu
alternative label: tilpasser @da
alternative label: معدِّل @ar
alternative label: 修改者 @zh-hans
definition: Bir kopyayı, yeni bir gösterim oluşturmadan bir kopyada değişiklik yapan bir temsilciyle ilişkilendirir. @tr
definition: Correla un item a un agente che apporta modifiche a un item senza creare una nuova manifestazione. @it
definition: Liittää kappaleen toimijaan, joka tekee muutoksia kappaleeseen luomatta uutta manifestaatiota. @fi
definition: Met un item en relation avec un agent qui apporte des modifications à un item sans créer une nouvelle manifestation.
definition: Relaciona un ítem amb un agent que fa canvis a un ítem sense crear una manifestació nova. @ca
definition: Relateert een item aan een actor die veranderingen aanbrengt aan een item zonder een nieuwe manifestatie te creëren. @nl
definition: Relaterer et eksemplar til en agent som gjør endringer på et eksemplar uten å skape en ny manifestasjon. @no
definition: Relaterer et eksemplar til en agent, som ændrer i et eksemplar uden at skabe en ny manifestation. @da
definition: Relates an item to an agent that makes changes to an item without creating a new manifestation. @en
definition: Sasaista vienību ar aģentu, kas veicis izmaiņas vienībā, neradot jaunu manifestāciju. @lv
definition: Seostab eksemplari tegijaga, kes muudab eksemplari, loomata uut kehastust. @et
definition: Setzt ein Exemplar in Beziehung zu einem Akteur, der Änderungen an einem Exemplar vornimmt, ohne eine neue Manifestation zu erstellen. @de

a pour reliure d’un item
has element type: 2
toolkit definition: A work that is a binding of an item. @en
toolkit definition: Bir kopyanın bağlantısı olan bir eser. @tr
toolkit definition: Darbs, kas ir vienības iesējums. @lv
toolkit definition: Een werk dat een band is van een item. @nl
toolkit definition: Egy mű, amely egy példány kötése. @hu
toolkit definition: Ein Werk, bei dem es sich um den Einband eines Exemplars handelt. @de
toolkit definition: Et verk som er en innbinding av et eksemplar. @no
toolkit definition: Obra que és una enquadernació d’un ítem. @ca
toolkit definition: Opera che è una rilegatura di un item. @it
toolkit definition: Teos, joka on kappaleen sidos. @fi
toolkit definition: Teos, mis on eksemplari köide. @et
toolkit definition: Værk, som er en indbinding af et eksemplar. @da
toolkit definition: Œuvre qui consiste en une reliure d’un item.
toolkit definition: عمل هو تجليد مفردة. @ar
toolkit definition: 作为一个单件的装订的一种作品 @zh-hans
toolkit label: Einband eines Exemplars @de
toolkit label: band van item @nl
toolkit label: binding of item @en
toolkit label: eksemplari köide @et
toolkit label: enquadernació d’un ítem @ca
toolkit label: indbinding af eksemplar @da
toolkit label: innbinding for eksemplar @no
toolkit label: kappaleen sidos @fi
toolkit label: kopyanın ciltlenmesi @tr
toolkit label: példány kötése: @hu
toolkit label: reliure d’un item
toolkit label: rilegatura di item @it
toolkit label: vienības iesējums @lv
toolkit label: تجليد مفردة @ar
toolkit label: 单件的装订 @zh-hans
has subproperty: P40094
lexical alias: bindingOfItem.en
status: Published
type: Property
domain: C10003
label: eksemplari köide @et
label: ha come rilegatura di item @it
label: har indbinding af eksemplar @da
label: har innbinding for eksemplar @no
label: has binding of item @en
label: hat Einband eines Exemplars @de
label: heeft bindwijze van item @nl
label: kappaleen sidos @fi
label: kopyanın ciltlenmesi ile ilişkilidir @tr
label: példány kötése a következő: @hu
label: té com a enquadernació d’un ítem @ca
label: vienības iesējums @lv
label: له تجليد لمفردة @ar
label: 有单件的装订 @zh-hans
sub property of: a pour œuvre en relation avec un item
definition: Bir kopyayı, bir kopyanın ciltlemesi olan bir eserle ilişkilendirir. @tr
definition: Correla un item un'opera che è una rilegatura di un item. @it
definition: Hozzákapcsol egy példányt egy műhöz, amely egy példány kötése. @hu
definition: Liittää kappaleen teokseen, joka on kappaleen sidos. @fi
definition: Met un item en relation avec une œuvre qui consiste en une reliure d’un item.
definition: Relaciona un ítem amb una obra que és una enquadernació d’un ítem. @ca
definition: Relateert een item aan een werk dat een band is van een item. @nl
definition: Relaterer et eksemplar til et verk som er en innbinding av et eksemplar. @no
definition: Relaterer et eksemplar til et værk, som er en indbinding af et eksemplar. @da
definition: Relates an item to a work that is a binding of an item. @en
definition: Sasaista vienību ar darbu, kas ir vienības iesējums. @lv
definition: Seostab eksemplari teosega, mis on eksemplari köide. @et
definition: Setzt ein Exemplar in Beziehung zu einem einem Werk, bei dem es sich um den Einband eines Exemplars handelt. @de
definition: يربط مفردة بعمل هو تجليد لمفردة. @ar
definition: 将一个单件与作为一个单件的装订的一种作品关联起来。 @zh-hans

a pour entité en relation avec un item
has element type: 1
toolkit definition: An entity that is associated with an item. @en
toolkit definition: Bir kopya ile bağlantılı olan bir varlık. @tr
toolkit definition: Een entiteit die geassocieerd is met een item. @nl
toolkit definition: Egy entitás, amelyet egy példányhoz társítanak. @hu
toolkit definition: Eine Entität, die mit einem Exemplar in Verbindung steht. @de
toolkit definition: Eksemplariga seotud olem. @et
toolkit definition: En entitet som forbindes med et eksemplar. @no
toolkit definition: Entitat que s’associa amb un ítem. @ca
toolkit definition: Entiteetti, joka liittyy kappaleeseen. @fi
toolkit definition: Entitet, som er knyttet til et eksemplar. @da
toolkit definition: Entità associata a un item. @it
toolkit definition: Entité qui est associée à un item.
toolkit definition: Entīte, kas saistīta ar vienību. @lv
toolkit definition: كيان هو مرتبط بمفردة @ar
toolkit definition: 和一个单件有关的一个实体 @zh-hans
toolkit label: Kopyanın ilişkili olduğu varlığı @tr
toolkit label: ar vienību saistītā entīte @lv
toolkit label: eksemplariga seotud olem @et
toolkit label: entitat relacionada amb un ítem @ca
toolkit label: entitet relateret til eksemplar @da
toolkit label: entità correlata di item @it
toolkit label: entité en relation avec un item
toolkit label: gerelateerde entiteit van item @nl
toolkit label: kappaleeseen liittyvä entiteetti @fi
toolkit label: mit Exemplar in Beziehung stehende Entität @de
toolkit label: példány kapcsolódó entitása: @hu
toolkit label: related entity of item @en
toolkit label: relatert entiet for eksemplar @no
toolkit label: كيان مرتبط بمفردة @ar
toolkit label: 单件的关联实体 @zh-hans
has subproperty: a pour entité RDA en relation avec un item
has subproperty: P40095
lexical alias: relatedEntityOfItem.en
status: Published
type: Property
domain: C10003
label: ar vienību saistītā entīte @lv
label: eksemplariga seotud olem @et
label: ha come entità correlata di item @it
label: har entitet relateret til eksemplar @da
label: har relatert entiet for eksemplar @no
label: has related entity of item @en
label: hat mit Exemplar in Beziehung stehende Entität @de
label: heeft gerelateerde entiteit van item @nl
label: kappaleeseen liittyvä entiteetti @fi
label: kopyanın ilgili varlığı ile ilişkilidir @tr
label: példány kapcsolódó entitása a következő: @hu
label: té com a entitat relacionada amb un ítem @ca
label: له كيان مرتبط بمفردة @ar
label: 有单件的关联实体 @zh-hans
sub property of: P00028
definition: Bir kopyayı, bir kopyayla bağlantılı olan bir varlıkla ilişkilendirir. @tr
definition: Correla un item a un'entità associata a un item. @it
definition: Hozzákapcsol egy példányt egy entitáshoz, amelyet egy példányhoz társítanak. @hu
definition: Liittää kappaleen entiteettiin, joka liittyy kappaleeseen. @fi
definition: Met un item en relation avec une entité qui est associée à un item.
definition: Relaciona un ítem amb una entitat que s’associa amb un ítem. @ca
definition: Relateert een item aan een entiteit die geassocieerd is met een item. @nl
definition: Relaterer et eksemplar til en entitet som forbindes med et eksemplar. @no
definition: Relaterer et eksemplar til en entitet, som er knyttet til et eksemplar. @da
definition: Relates an item to an entity that is associated with an item. @en
definition: Sasaista vienību ar entīti, kas saistīta ar vienību. @lv
definition: Seostab eksemplari eksemplariga seotud olemiga. @et
definition: Setzt ein Exemplar in Beziehung zu einer Entität, die mit einem Exemplar in Verbindung steht. @de
definition: يربط مفردة بكيان هو مرتبط بمفردة. @ar
definition: 将一个单件与和一个单件有关的一个实体关联起来。 @zh-hans

a pour catégorie d’item
has element type: 5
toolkit definition: A type to which an item belongs. @en
toolkit definition: Bir kopyanın ait olduğu bir tür. @tr
toolkit definition: Een type waartoe een item behoort. @nl
toolkit definition: Eine Art, zu der ein Exemplar gehört. @de
toolkit definition: En type som et eksemplar tilhører. @no
toolkit definition: Tipo al quale un item appartiene. @it
toolkit definition: Tipus al qual pertany un ítem. @ca
toolkit definition: Type auquel un item appartient.
toolkit definition: Type, hvortil et eksemplar tilhører. @da
toolkit definition: Tyyppi, johon kappale kuuluu. @fi
toolkit definition: Tüüp, millesse eksemplar kuulub. @et
toolkit definition: Veids, pie kura pieder vienība. @lv
toolkit definition: példány típusa: @hu
toolkit definition: نوع تنتمي إليه مفردة @ar
toolkit definition: 一个单件所属于的一种类型 @zh-hans
toolkit label: Egy típus, amelyhez a példány tartozik. @hu
toolkit label: Kategorie eines Exemplars @de
toolkit label: categoria di item @it
toolkit label: categoria d’ítem @ca
toolkit label: categorie van item @nl
toolkit label: category of item @en
toolkit label: catégorie d’item
toolkit label: eksemplari kategooria @et
toolkit label: eksemplarkategori @no
toolkit label: kappaleen kategoria @fi
toolkit label: kategori af eksemplar @da
toolkit label: kopya kategorisi @tr
toolkit label: vienības kategorija @lv
toolkit label: فئة مفردة @ar
toolkit label: 单件的类别 @zh-hans
has subproperty: P40096
lexical alias: categoryOfItem.en
status: Published
type: Property
domain: C10003
label: eksemplari kategooria @et
label: ha come categoria di item @it
label: har eksemplarkategori @no
label: har kategori af eksemplar @da
label: has category of item @en
label: hat Kategorie eines Exemplars @de
label: heeft categorie van item @nl
label: kappaleen kategoria @fi
label: kopyanın kategorisi ile ilişkilidir @tr
label: példány kategóriája a következő: @hu
label: té com a categoria d’ítem @ca
label: vienības kategorija @lv
label: له فئة مفردة @ar
label: 有单件的类别 @zh-hans
sub property of: P00029
alternative label: eksemplari tüüp @et
alternative label: kappaleen tyyppi @fi
alternative label: kopyanın türü @tr
alternative label: példány kategóriája: @hu
alternative label: tipo @it
alternative label: tipo de ítem @es
alternative label: tipus d’ítem @ca
alternative label: type af eksemplar @da
alternative label: type d’item
alternative label: type eksemplar @no
alternative label: type of item @en
alternative label: نوع مفردة @ar
alternative label: 单件的类型 @zh-hans
definition: Bir kopyayı, kopyanın ait olduğu bir türle ilişkilendirir. @tr
definition: Correla un item a un tipo al quale un item appartiene. @it
definition: Hozzákapcsol egy példányt egy típushoz, amelyhez a példány tartozik. @hu
definition: Liittää kappaleen tyyppiin, johon kappale kuuluu. @fi
definition: Met un item en relation avec un type auquel un item appartient.
definition: Relaciona un ítem amb un tipus al qual pertany un ítem. @ca
definition: Relateert een item aan een type waartoe een item behoort. @nl
definition: Relaterer et eksemplar til en type som et eksemplar tilhører. @no
definition: Relaterer et eksemplar til en type, hvortil et eksemplar tilhører. @da
definition: Relates an item to a type to which an item belongs. @en
definition: Sasaista vienību ar veidu, pie kura pieder vienība. @lv
definition: Seostab eksemplari tüübiga, millesse eksemplar kuulub. @et
definition: Setzt ein Exemplar in Beziehung zu einer Art, zu der ein Exemplar gehört. @de
definition: يربط مفردة بنوع تنتمى إليه مفردة. @ar
definition: 将一个单件与一个单件所属于的一种类型关联起来。 @zh-hans

a pour personne dédicataire d’un item
has element type: 2
toolkit definition: A person to whom an item is dedicated. @en
toolkit definition: Bir kopyanın ithaf edildiği kişi @tr
toolkit definition: Een persoon aan wie een item is opgedragen. @nl
toolkit definition: Egy személy, akinek a példányt dedikálják. @hu
toolkit definition: Eine Person, der ein Exemplar gewidmet ist. @de
toolkit definition: En person som et eksemplar er dedisert til. @no
toolkit definition: Henkilö, jolle kappale on omistettu. @fi
toolkit definition: Isik, kellele eksemplar on pühendatud. @et
toolkit definition: Person, som et eksemplar er tilegnet. @da
toolkit definition: Persona a qui es dedica un ítem. @ca
toolkit definition: Persona alla quale un item è dedicato . @it
toolkit definition: Persona, kurai ir veltīta vienība. @lv
toolkit definition: Personne à qui un item est dédié.
toolkit definition: شخص أُهديت اليه مفردة. @ar
toolkit definition: 一个单件被题献给的一个个人 @zh-hans
toolkit label: Widmungsempfängerin/Widmungsempfänger eines Exemplars (Person) @de
toolkit label: dedicatario di item persona @it
toolkit label: dedicatee person of item @en
toolkit label: eksemplari pühenduse saaja (isik) @et
toolkit label: kappaleen omistuksen kohde (henkilö) @fi
toolkit label: kopyanın adandığı kişi @tr
toolkit label: opgedragen-persoon van item @nl
toolkit label: person, som er tilegnet af eksemplar @da
toolkit label: persona dedicatària d’un ítem @ca
toolkit label: personne dédicataire d’un item
toolkit label: példány dedikált személye: @hu
toolkit label: tilegnet person for eksemplar @no
toolkit label: veltījumvienība personai @lv
toolkit label: شخص مُهدى إليه مفردة @ar
toolkit label: 单件的被题献者个人 @zh-hans
has subproperty: P40097
lexical alias: dedicateePersonOfItem.en
status: Published
type: Property
domain: C10003
label: eksemplari pühenduse saaja (isik) @et
label: ha come dedicatario persona di item @it
label: har person, som er tilegnet af eksemplar @da
label: har tilegnet person for eksemplar @no
label: has dedicatee person of item @en
label: hat Widmungsempfängerin/Widmungsempfänger eines Exemplars (Person) @de
label: heeft opgedragene-persoon van item @nl
label: kappaleen omistuksen kohde (henkilö) @fi
label: kopyanın ithaf edilen kişisi ile ilişkilidir @tr
label: példány dedikált személye a következő: @hu
label: té com a persona dedicatària d’un ítem @ca
label: veltījumvienība personai @lv
label: له شخص مُهدى إليه مفردة @ar
label: 有单件的被题献者个人 @zh-hans
sub property of: a pour agent dédicataire d’un item
sub property of: a pour personne en relation avec un item
definition: Bir kopyayı, bir kopyanın ithaf edildiği bir kişiyle ilişkilendirir. @tr
definition: Correla un item a una persona alla quale un item è dedicato. @it
definition: Hozzákapcsol egy példányt egy személyhez, akinek a példányt dedikálják. @hu
definition: Liittää kappaleen henkilöön, jolle kappale on omistettu. @fi
definition: Met un item en relation avec une personne à qui un item est dédié.
definition: Relaciona un ítem amb una persona a qui es dedica un ítem. @ca
definition: Relateert een item aan een persoon aan wie een item is opgedragen. @nl
definition: Relaterer et eksemplar til en person som et eksemplar er dedisert til. @no
definition: Relaterer et eksemplar til en person, som et eksemplar er tilegnet. @da
definition: Relates an item to a person to whom an item is dedicated. @en
definition: Sasaista vienību ar personu, kurai ir veltīta vienība. @lv
definition: Seostab eksemplari isikuga, kellele eksemplar on pühendatud. @et
definition: Setzt ein Exemplar in Beziehung zu einer Person, der ein Exemplar gewidmet ist. @de
definition: يربط مفردة بشخص أُهديت إليه مفردة. @ar
definition: 将一个单件与一个单件被题献给的一个个人关联起来。 @zh-hans

a pour personne relieuse
has element type: 2
toolkit definition: A person who binds an item. @en
toolkit definition: Een persoon die een item bindt. @nl
toolkit definition: Egy személy, aki beköt egy példányt. @hu
toolkit definition: Eine Person, die ein Exemplar bindet. @de
toolkit definition: En person som binder inn et eksemplar. @no
toolkit definition: Henkilö, joka sitoo kappaleen. @fi
toolkit definition: Isik, kes on eksemplari köitnud. @et
toolkit definition: Kopyayı ciltleyen kişi @tr
toolkit definition: Person, som indbinder et eksemplar. @da
toolkit definition: Persona che rilega un item. @it
toolkit definition: Persona que enquaderna un ítem. @ca
toolkit definition: Persona, kura iesējusi vienību. @lv
toolkit definition: Personne qui relie un item.
toolkit definition: شخص يجلد مفردة. @ar
toolkit definition: 装订单件的一个个人 @zh-hans
toolkit label: Buchbinderin/Buchbinder (Person) @de
toolkit label: binder person @en
toolkit label: binder-persoon @nl
toolkit label: bokbinder (person) @no
toolkit label: ciltleyici @tr
toolkit label: grāmatsējējs (persona) @lv
toolkit label: köitja (isik) @et
toolkit label: könyvkötő személye: @hu
toolkit label: person, som er bogbinder @da
toolkit label: persona enquadernadora @ca
toolkit label: personne relieuse
toolkit label: rilegatore persona @it
toolkit label: sitoja (henkilö) @fi
toolkit label: شخص مسئول عن التجليد @ar
toolkit label: 装订者个人 @zh-hans
has subproperty: P40098
lexical alias: binderPerson.en
status: Published
type: Property
domain: C10003
label: ciltleyen kişi ile ilişkilidir @tr
label: grāmatsējējs (persona) @lv
label: ha come rilegatore persona @it
label: har bokbinder (person) @no
label: har person, som er bogbinder @da
label: has binder person @en
label: hat Buchbinderin/Buchbinder (Person) @de
label: heeft binder-persoon @nl
label: köitja (isik) @et
label: könyvkötő személye a következő: @hu
label: sitoja (henkilö) @fi
label: té com a persona enquadernadora @ca
label: له شخص مسئول عن التجليد @ar
label: 有装订者个人 @zh-hans
sub property of: a pour agent relieur
sub property of: a pour personne modificatrice
definition: Bir kopyayı, bir kopyayı ciltleyen bir kişiyle ilişkilendirir. @tr
definition: Correla un item a una persona che rilega un item. @it
definition: Hozzákapcsol egy példányt egy személyhez, aki beköt egy példányt. @hu
definition: Liittää kappaleen henkilöön, joka sitoo kappaleen. @fi
definition: Met un item en relation avec une personne qui relie un item.
definition: Relaciona un ítem amb una persona que enquaderna un ítem. @ca
definition: Relateert een item aan een persoon die een item bindt. @nl
definition: Relaterer et eksemplar til en person som binder inn et eksemplar. @no
definition: Relaterer et eksemplar til en person, som indbinder et eksemplar. @da
definition: Relates an item to a person who binds an item. @en
definition: Sasaista vienību ar personu, kura iesējusi vienību. @lv
definition: Seostab eksemplari isikuga, kes on eksemplari köitnud. @et
definition: Setzt ein Exemplar in Beziehung zu einer Person, die ein Exemplar bindet. @de
definition: يربط مفردة بشخص يجلد مفردة. @ar
definition: 将一个单件与装订单件的一个个人关联起来。 @zh-hans

a pour personne conservatrice
has element type: 2
toolkit definition: A person who conceives or manages the aggregation of an item in an exhibition or collection. (Deprecated) @en
toolkit definition: Een persoon die de samenstelling bedenkt of beheert van een item in een tentoonstelling of collectie. @nl
toolkit definition: Egy személy, aki kigondolja vagy kezeli egy példány begyűjtését egy kiállítás keretébe vagy egy gyűjteménybe. @hu
toolkit definition: Eine Person, die die Aggregation eines Exemplars in einer Ausstellung oder Sammlung konzipiert oder organisiert. @de
toolkit definition: En person som har idéen til eller håndterer innsamlingen av et eksemplar i en utstilling eller samling. @no
toolkit definition: Henkilö, joka saa aikaan ja hallinnoi näyttelyn tai kokoelman kappaleaggregaatiota. @fi
toolkit definition: Isik, kes kavandab või korraldab eksemplari liitmise näituse või koguga. @et
toolkit definition: Person, som udtænker eller administrerer samlingen af et eksemplar til en udstilling eller samling. @da
toolkit definition: Persona che concepisce o gestisce l'aggregazione di un item in una mostra o collezione. @it
toolkit definition: Persona que concep o gestiona l’agregació d’un ítem en una exposició o en una col·lecció. @ca
toolkit definition: Persona, kura iecer un realizē vienības iekļaušanu izstādē vai kolekcijā. @lv
toolkit definition: Personne qui conçoit ou gère l’agrégation d’un item dans une exposition ou une collection.
toolkit definition: شخص لديه تصور أو يدير تجميعة لمفردة في معرض، أو في مجموعة . @ar
toolkit label: Kuratorin/Kurator (Person) @de
toolkit label: curator person (Deprecated) @en
toolkit label: curator-persoon @nl
toolkit label: curatore persona @it
toolkit label: kuraator (isik) @et
toolkit label: kuraattori (henkilö) @fi
toolkit label: kurator (person) @no
toolkit label: kurators (persona) @lv
toolkit label: kurátor személye: @hu
toolkit label: person, som er kurator @da
toolkit label: persona conservadora @ca
toolkit label: personne conservatrice
toolkit label: شخص أمين متحف @ar
has subproperty: a pour personne collectionneuse
has subproperty: a pour personne catalogueuse d’une collection de ressources
has subproperty: P40099
lexical alias: curatorPerson.en
status: Deprecated
type: Property
domain: C10003
label: ha come curatore persona @it
label: har kurator (person) @no
label: har person, som er kurator @da
label: has curator person (Deprecated) @en
label: hat Kuratorin/Kurator (Person) @de
label: heeft curator-persoon @nl
label: kuraator (isik) @et
label: kuraattori (henkilö) @fi
label: kurators (persona) @lv
label: kurátor személye a következő: @hu
label: té com a persona conservadora @ca
label: له شخص أمين متحف @ar
sub property of: a pour agent conservateur
sub property of: a pour personne en relation avec un item
definition: Hozzákapcsol egy példányt egy személyhez, aki kigondolja vagy kezeli a példány begyűjtését egy kiállítás keretébe vagy egy gyűjteménybe. @hu
definition: Liittää kappaleen henkilöön, joka saa aikaan ja hallinnoi näyttelyn tai kokoelman kappaleaggregaatiota. @fi
definition: Met un item en relation avec une personne qui conçoit ou gère l’agrégation d’un item dans une exposition ou une collection.
definition: Relaciona un ítem amb una persona que concep o gestiona l’agregació d’un ítem en una exposició o en una col·lecció. @ca
definition: Relateert een item aan een persoon die de samenstelling bedenkt of beheert van een item in een tentoonstelling of collectie. @nl
definition: Relaterer et eksemplar til en person som har idéen til eller håndterer innsamlingen av et eksemplar i en utstilling eller samling. @no
definition: Relaterer et eksemplar til en person, som udtænker eller administrerer samlingen af et eksemplar til en udstilling eller samling. @da
definition: Relates an item to a person who conceives or manages the aggregation of an item in an exhibition or collection. (Deprecated) @en
definition: Sasaista vienību ar personu, kura iecer un realizē vienības iekļaušanu izstādē vai kolekcijā. @lv
definition: Seostab eksemplari isikuga, kes kavandab või korraldab eksemplari liitmise näituse või koguga. @et
definition: Setzt ein Exemplar in Beziehung zu einer Person, die die Aggregation eines Exemplars in einer Ausstellung oder Sammlung konzipiert oder organisiert. @de
definition: Correla un item a una persona che concepisce o gestisce l'aggregazione di un item in una mostra o collezione. @it
definition: يربط مفردة بشخص لديه تصور أو يدير تجميعة لمفردة في معرض، أو في مجموعة . @ar

a pour personne enlumineuse
has element type: 2
toolkit definition: A person who decorates a specific item using precious metals or colour, often with elaborate designs and motifs. @en
toolkit definition: Belirli bir öğeyi değerli metaller veya renkler kullanarak, genellikle özenle hazırlanmış desenler ve motiflerle süsleyen kişi. @tr
toolkit definition: Een persoon die een specifiek item decoreert met edelmetalen of kleur, vaak met uitgebreide ontwerpen en motieven. @nl
toolkit definition: Egy személy, aki egy adott példányt nemesfémekkel vagy színekkel díszít, gyakran gondosan kidolgozott kivitelezéssel és motívumok használával @hu
toolkit definition: Eine Person, die ein bestimmtes Exemplar durch Edelmetalle oder Farben, häufig mit kunstvollen Mustern und Motiven, (aus-)gestaltet. @de
toolkit definition: En person som dekorerer et bestemt eksemplar med edle metaller eller farger, gjerne med intrikate former og motiver. @no
toolkit definition: Henkilö, joka koristelee yksittäisen kappaleen käyttäen jalometalleja tai värejä, usein yksityiskohtaisissa kuvioissa tai motiiveissa. @fi
toolkit definition: Isik, kes kaunistab väärismetallide ja värvidega üksikut eksemplari, sageli keeruliste kujundite ja motiividega. @et
toolkit definition: Person, som udsmykker et særligt eksemplar med ædelmetal eller farve, ofte med detaljerige mønstre og motiver. @da
toolkit definition: Persona che decora uno specifico item utilizzando metalli o colori preziosi, spesso con progetti e motivi elaborati. @it
toolkit definition: Persona que decora un ítem concret amb metalls preciosos o amb color, sovint amb dissenys i motius elaborats. @ca
toolkit definition: Persona, kura izgreznojusi konkrēto vienību, izmantojot krāsu un/vai dārgmetālus, bieži ar izsmalcinātiem un filigrāniem zīmējumiem, burtiem un motīviem. @lv
toolkit definition: Personne qui orne un item spécifique en utilisant des métaux précieux ou de la couleur, souvent avec des dessins et des motifs élaborés.
toolkit definition: شخص يزين مفردة محددة باستخدام معادن ثمينة أو ألوان، غالبًا بتصاميم وزخارف منمقة. @ar
toolkit definition: 对特定单件用贵重的金属或色彩（通常有精心的设计和图案）进行装饰的一个个人 @zh-hans
toolkit label: Illuminatorin/Illuminator (Person) @de
toolkit label: illuminator (person) @no
toolkit label: illuminator person @en
toolkit label: illumineerija (isik) @et
toolkit label: illuminoinnin tekijä (henkilö) @fi
toolkit label: illuminátor személye: @hu
toolkit label: iluminators (persona) @lv
toolkit label: miniatore persona @it
toolkit label: person, som er illuminator @da
toolkit label: persona il·luminadora @ca
toolkit label: personne enlumineuse
toolkit label: tezhip sanatçısı kişisi ile ilişkilidir @tr
toolkit label: verluchter-persoon @nl
toolkit label: شخص مزخرف @ar
toolkit label: 彩饰者个人 @zh-hans
has subproperty: P40100
lexical alias: illuminatorPerson.en
status: Published
type: Property
domain: C10003
label: ha come miniatore persona @it
label: har illuminator (person) @no
label: har person, som er illuminator @da
label: has illuminator person @en
label: hat Illuminatorin/Illuminator (Person) @de
label: heeft verluchter-persoon @nl
label: illuminator személye a következő: @hu
label: illumineerija (isik) @et
label: illuminoinnin tekijä (henkilö) @fi
label: iluminators (persona) @lv
label: tezhip sanatçısı kişisi ile ilişkilidir @tr
label: té com a persona il·luminadora @ca
label: له شخص مزخرف @ar
label: 有彩饰者个人 @zh-hans
sub property of: a pour agent enlumineur
sub property of: a pour personne modificatrice
definition: Bir kopyayı, belirli bir kopyayı değerli metaller veya renkler kullanarak, genellikle ayrıntılı tasarımlar ve motiflerle süsleyen bir kişiyle ilişkilendirir. @tr
definition: Correla un item a una persona che decora uno specifico item utilizzando metalli o colori preziosi, spesso con progetti e motivi elaborati. @it
definition: Hozzákapcsol egy példányt egy személyhez, aki egy adott példányt nemesfémekkel vagy színekkel díszít, gyakran gondosan kidolgozott kivitelezéssel és motívumok használával. @hu
definition: Liittää kappaleen henkilöön, joka koristelee yksittäisen kappaleen käyttäen jalometalleja tai värejä, usein yksityiskohtaisissa kuvioissa tai motiiveissa. @fi
definition: Met un item en relation avec une personne qui orne un item spécifique en utilisant des métaux précieux ou de la couleur, souvent avec des dessins et des motifs élaborés.
definition: Relaciona un ítem amb una persona que decora un ítem concret amb metalls preciosos o amb color, sovint amb dissenys i motius elaborats. @ca
definition: Relateert een item aan een persoon die een specifiek item decoreert met edelmetalen of kleur, vaak met uitgebreide ontwerpen en motieven. @nl
definition: Relaterer et eksemplar til en person som dekorerer et bestemt eksemplar med edle metaller eller farger, gjerne med intrikate former og motiver. @no
definition: Relaterer et eksemplar til en person, som udsmykker et særligt eksemplar med ædelmetal eller farve, ofte med detaljerige mønstre og motiver. @da
definition: Relates an item to a person who decorates a specific item using precious metals or colour, often with elaborate designs and motifs. @en
definition: Sasaista vienību ar personu, kura izgreznojusi konkrēto vienību, izmantojot krāsu un/vai dārgmetālus, bieži ar izsmalcinātiem un filigrāniem zīmējumiem, burtiem un motīviem. @lv
definition: Seostab eksemplari isikuga, kes kaunistab väärismetallide ja värvidega üksikut eksemplari, sageli keeruliste kujundite ja motiividega. @et
definition: Setzt ein Exemplar in Beziehung zu einer Person, die ein bestimmtes Exemplar durch Edelmetalle oder Farben, häufig mit kunstvollen Mustern und Motiven, (aus-)gestaltet. @de
definition: يربط مفردة بشخص يزين مفردة محددة باستخدام معادن ثمينة أو ألوان، غالبًا بتصاميم وزخارف منمقة. @ar
definition: 将一个单件与对特定单件用贵重的金属或色彩（通常有精心的设计和图案）进行装饰的一个个人关联起来。 @zh-hans

a pour personne propriétaire actuelle
has element type: 2
toolkit definition: A person who has current legal possession of an item. @en
toolkit definition: Bir kopyanın mevcut yasal mülkiyetine sahip olan bir kişi. @tr
toolkit definition: Een persoon die huidig wettelijk bezit heeft van een item. @nl
toolkit definition: Egy személy, aki jelenleg törvényesen birtokol egy példányt. @hu
toolkit definition: Eine Person, die derzeit im rechtmäßigen Besitz eines Exemplars ist. @de
toolkit definition: En person som for tiden er den rettmessige eieren av et eksemplar. @no
toolkit definition: Henkilö, joka tällä hetkellä laillisesti omistaa kappaleen. @fi
toolkit definition: Isik, kellele praegu õiguspäraselt eksemplar kuulub. @et
toolkit definition: Person, som p.t. er i lovlig besiddelse af et eksemplar. @da
toolkit definition: Persona che detiene l'attuale proprietà giuridica di un item. @it
toolkit definition: Persona que té la propietat legal actual d’un ítem. @ca
toolkit definition: Persona, kura ir vienības pašreizējais likumīgais īpašnieks. @lv
toolkit definition: Personne qui possède actuellement et légalement un item.
toolkit definition: شخص لديه حاليا الملكية القانونية لمفردة @ar
toolkit definition: 拥有对一个单件当前法定所有权的一个个人 @zh-hans
toolkit label: Gegenwärtige Eigentümerin/Gegenwärtiger Eigentümer (Person) @de
toolkit label: current owner person @en
toolkit label: huidige eigenaar-persoon @nl
toolkit label: jelenlegi tulajdonos személye: @hu
toolkit label: nykyinen omistaja (henkilö) @fi
toolkit label: nåværende eier (person) @no
toolkit label: pašreizējais īpašnieks (persona) @lv
toolkit label: person, som er nuværende ejer @da
toolkit label: persona propietària actual @ca
toolkit label: personne propriétaire actuelle
toolkit label: praegune omanik (isik) @et
toolkit label: proprietario attuale persona @it
toolkit label: şu anki sahibi olan kişi @tr
toolkit label: شخص مالك حالي @ar
toolkit label: 当前拥有者个人 @zh-hans
has subproperty: a pour personne déposante
has subproperty: P40101
lexical alias: currentOwnerPerson.en
status: Published
type: Property
domain: C10003
label: ha come proprietario attuale persona @it
label: har nåværende eier (person) @no
label: har person, som er nuværende ejer @da
label: has current owner person @en
label: hat gegenwärtige Eigentümerin/gegenwärtigen Eigentümer (Person) @de
label: heeft huidige eigenaar-persoon @nl
label: jelenlegi tulajdonos személye a következő: @hu
label: mevcut sahip kişisi ile ilişkilidir @tr
label: nykyinen omistaja (henkilö) @fi
label: pašreizējais īpašnieks (persona) @lv
label: praegune omanik (isik) @et
label: té com a persona propietària actual @ca
label: له شخص مالك حالي @ar
label: 有当前拥有者个人 @zh-hans
sub property of: a pour agent propriétaire actuel
sub property of: a pour personne propriétaire
definition: Bir kopyayı, bir kopyanın mevcut yasal mülkiyetine sahip olan bir kişiyle ilişkilendirir. @tr
definition: Correla un item a una persona che detiene l'attuale proprietà giuridica di un item. @it
definition: Hozzákapcsol egy példányt egy személyhez, aki jelenleg törvényesen birtokol egy példányt. @hu
definition: Liittää kappaleen henkilöön, joka tällä hetkellä laillisesti omistaa kappaleen. @fi
definition: Met un item en relation avec une personne qui possède actuellement et légalement un item.
definition: Relaciona un ítem amb una persona que té la propietat legal actual d’un ítem. @ca
definition: Relateert een item aan een persoon die huidig wettelijk bezit heeft van een item. @nl
definition: Relaterer et eksemplar til en person som for tiden er den rettmessige eieren av et eksemplar. @no
definition: Relaterer et eksemplar til en person, som p.t. er i lovlig besiddelse af et eksemplar. @da
definition: Relates an item to a person who has current legal possession of an item. @en
definition: Sasaista vienību ar personu, kura ir vienības pašreizējais likumīgais īpašnieks. @lv
definition: Seostab eksemplari isikuga, kellele praegu õiguspäraselt eksemplar kuulub. @et
definition: Setzt ein Exemplar in Beziehung zu einer Person, die derzeit im rechtmäßigen Besitz eines Exemplars ist. @de
definition: يربط مفردة بشخص لديه حاليا الملكية القانونية لمفردة. @ar
definition: 将一个单件与拥有对一个单件当前法定所有权的一个个人关联起来。 @zh-hans

a pour ancienne personne propriétaire
has element type: 2
toolkit definition: A person who has former legal possession of an item. @en
toolkit definition: Bir kopyanın daha önce yasal mülkiyetine sahip olan bir kişi. @tr
toolkit definition: Een persoon die voormalig wettelijk bezit had van een item. @nl
toolkit definition: Egy személy, aki korábban törvényesen birtokolt egy példányt. @hu
toolkit definition: Eine Person, die früher im rechtmäßigen Besitz eines Exemplars war. @de
toolkit definition: En person som tidligere var den rettmessige eieren av et eksemplar. @no
toolkit definition: Henkilö, joka on aiemmin laillisesti omistanut kappaleen. @fi
toolkit definition: Isik, kellele eksemplar varem õiguspäraselt kuulus. @et
toolkit definition: Person, som tidligere har været i lovlig besiddelse af et eksemplar. @da
toolkit definition: Persona che ha detenuto in precedenza la proprietà giuridica di un item. @it
toolkit definition: Persona que té la propietat legal anterior d’un ítem. @ca
toolkit definition: Persona, kurai vienība iepriekš ir bijusi juridiskā īpašumā. @lv
toolkit definition: Personne qui a auparavant possédé légalement un item.
toolkit definition: شخص لديه سابقا الملكية القانونية لمفردة. @ar
toolkit definition: 拥有对一个单件先前法定所有权的一个个人 @zh-hans
toolkit label: Frühere Eigentümerin/Früherer Eigentümer (Person) @de
toolkit label: agrākais īpašnieks (persona) @lv
toolkit label: aiempi omistaja (henkilö) @fi
toolkit label: ancienne personne propriétaire
toolkit label: endine omanik (isik) @et
toolkit label: former owner person @en
toolkit label: korábbi tulajdonos személye: @hu
toolkit label: person, som er tidligere ejer @da
toolkit label: persona propietària anterior @ca
toolkit label: proprietario precedente persona @it
toolkit label: tidligere eier (person) @no
toolkit label: voormalige eigenaar-persoon @nl
toolkit label: önceki sahibi olan kişi @tr
toolkit label: شخص مالك سابق @ar
toolkit label: 先前拥有者个人 @zh-hans
has subproperty: a pour personne donatrice
has subproperty: a pour personne vendeuse
has subproperty: P40102
lexical alias: formerOwnerPerson.en
status: Published
type: Property
domain: C10003
label: agrākais īpašnieks (persona) @lv
label: aiempi omistaja (henkilö) @fi
label: endine omanik (isik) @et
label: eski sahip kişisi ile ilişkilidir @tr
label: ha come proprietario precedente persona @it
label: har person, som er tidligere ejer @da
label: har tidligere eier (person) @no
label: has former owner person @en
label: hat frühere Eigentümerin/früheren Eigentümer (Person) @de
label: heeft voormalige eigenaar-persoon @nl
label: korábbi tulajdonos személye a következő: @hu
label: té com a persona propietària anterior @ca
label: له شخص مالك سابق @ar
label: 有先前拥有者个人 @zh-hans
sub property of: a pour ancien agent propriétaire
sub property of: a pour personne propriétaire
definition: Bir kopyayı, bir kopyanın daha önce yasal mülkiyetine sahip olan bir kişiyle ilişkilendirir. @tr
definition: Correla un item a una persona che ha detenuto in precedenza la proprietà giuridica di un item. @it
definition: Hozzákapcsol egy példányt egy személyhez, aki korábban törvényesen birtokolt egy példányt. @hu
definition: Liittää kappaleen henkilöön, joka on aiemmin laillisesti omistanut kappaleen. @fi
definition: Met un item en relation avec une personne qui a auparavant possédé légalement un item.
definition: Relaciona un ítem amb una persona que té la propietat legal anterior d’un ítem. @ca
definition: Relateert een item aan een persoon die voormalig wettelijk bezit had van een item. @nl
definition: Relaterer et eksemplar til en person som tidligere var den rettmessige eieren av et eksemplar. @no
definition: Relaterer et eksemplar til en person, som tidligere har været i lovlig besiddelse af et eksemplar. @da
definition: Relates an item to a person who has former legal possession of an item. @en
definition: Sasaista vienību ar personu, kurai vienība iepriekš ir bijusi juridiskā īpašumā. @lv
definition: Seostab eksemplari isikuga, kellele eksemplar varem õiguspäraselt kuulus. @et
definition: Setzt ein Exemplar in Beziehung zu einer Person, die früher im rechtmäßigen Besitz eines Exemplars war. @de
definition: يربط مفردة بشخص لديه سابقا الملكية القانونية لمفردة. @ar
definition: 将一个单件与拥有对一个单件先前法定所有权的一个个人关联起来。 @zh-hans

a pour personne dépositaire
has element type: 2
toolkit definition: A person who has legal custody of an item. @en
toolkit definition: Bir kopyanın yasal velayetini elinde bulunduran kişi. @tr
toolkit definition: Een persoon die van rechtswege een item bewaart. @nl
toolkit definition: Egy személy, aki egy példány törvényes megőrzője. @hu
toolkit definition: Eine Person, der die rechtmäßige Verwahrung eines Exemplars obliegt. @de
toolkit definition: En person som har et eksemplar i lovlig forvaring. @no
toolkit definition: Henkilö, jolla on kappaleen laillinen säilyttämisoikeus. @fi
toolkit definition: Isik, kelle õiguspärasel vastutaval hoiul eksemplar on. @et
toolkit definition: Person, som lovligt har et eksemplar i forvaring. @da
toolkit definition: Persona che detiene la custodia giuridica di un item. @it
toolkit definition: Persona que té la custodia legal d’un ítem. @ca
toolkit definition: Persona, kura likumīgi glabā vienību. @lv
toolkit definition: Personne à qui est confiée la garde légale d’un item.
toolkit definition: شخص لديه الوصاية القانونية على مفردة. @ar
toolkit definition: 对一个单件拥有合法保管权的一个个人 @zh-hans
toolkit label: Verwahrerin/Verwahrer (Person) @de
toolkit label: curatele-persoon @nl
toolkit label: custodian person @en
toolkit label: depositario persona @it
toolkit label: koruyucu @tr
toolkit label: letétkezelő személye: @hu
toolkit label: oppbevarer (person) @no
toolkit label: person, som er forvalter @da
toolkit label: persona dipositària @ca
toolkit label: personne dépositaire
toolkit label: pārvaldītājs (persona) @lv
toolkit label: säilyttäjä (henkilö) @fi
toolkit label: vastutav hoidja (isik) @et
toolkit label: شخص وصى @ar
toolkit label: 保管者个人 @zh-hans
has subproperty: P40103
lexical alias: custodianPerson.en
status: Published
type: Property
domain: C10003
label: ha come depositario persona @it
label: har oppbevarer (person) @no
label: har person, som er forvalter @da
label: has custodian person @en
label: hat Verwahrerin/Verwahrer (Person) @de
label: heeft curatele-persoon @nl
label: koruyucu kişisi ile ilişkilidir @tr
label: letétkezelő személye a következő: @hu
label: pārvaldītājs (persona) @lv
label: säilyttäjä (henkilö) @fi
label: té com a persona dipositària @ca
label: vastutav hoidja (isik) @et
label: له شخص وصى @ar
label: 有保管者个人 @zh-hans
sub property of: a pour agent dépositaire
sub property of: a pour personne en relation avec un item
definition: Bir kopyayı, bir kopyanın yasal velayetine sahip olan bir kişiyle ilişkilendirir. @tr
definition: Correla un item a una persona che detiene la custodia giuridica di un item. @it
definition: Hozzákapcsol egy példányt egy személyhez, aki egy példány törvényes megőrzője. @hu
definition: Liittää kappaleen henkilöön, jolla on kappaleen laillinen säilyttämisoikeus. @fi
definition: Met un item en relation avec une personne à qui est confiée la garde légale d’un item.
definition: Relaciona un ítem amb una persona que té la custodia legal d’un ítem. @ca
definition: Relateert een item aan een persoon die van rechtswege een item bewaart. @nl
definition: Relaterer et eksemplar til en person som har et eksemplar i lovlig forvaring. @no
definition: Relaterer et eksemplar til en person, som lovligt har et eksemplar i forvaring. @da
definition: Relates an item to a person who has legal custody of an item. @en
definition: Sasaista vienību ar personu, kura likumīgi glabā vienību. @lv
definition: Seostab eksemplari isikuga, kelle õiguspärasel vastutaval hoiul eksemplar on. @et
definition: Setzt ein Exemplar in Beziehung zu einer Person, der die rechtmäßige Verwahrung eines Exemplars obliegt. @de
definition: يربط مفردة بشخص لديه الوصاية القانونية على مفردة. @ar
definition: 将一个单件与对一个单件拥有合法保管权的一个个人关联起来。 @zh-hans

a pour personne propriétaire
has element type: 2
toolkit definition: A person who has current or former legal possession of an item. @en
toolkit definition: Bir kopyanın mevcut veya eski yasal mülkiyetine sahip olan bir kişi. @tr
toolkit definition: Een persoon die huidig of voormalig wettelijk bezit heeft van een item. @nl
toolkit definition: Egy személy, aki törvényesen birtokol egy példányt . @hu
toolkit definition: Eine Person, die gegenwärtig oder früher im rechtmäßigen Besitz eines Exemplars ist/war. @de
toolkit definition: En person som er den rettmessige eieren av et eksemplar. @no
toolkit definition: Henkilö, jolla on kappaleen nykyinen tai aiempi laillinen omistusoikeus. @fi
toolkit definition: Isik, kellele eksemplar praegu õiguspäraselt kuulub või varem kuulus. @et
toolkit definition: Person, som er i lovlig besiddelse af et eksemplar. @da
toolkit definition: Persona che detiene la proprietà giuridica di un item. @it
toolkit definition: Persona que té la propietat legal actual o anterior d’un ítem. @ca
toolkit definition: Persona, kurai ir vai ir bijušas likumīgas tiesības uz īpašumu. @lv
toolkit definition: Personne qui possède actuellement ou a auparavant possédé légalement un item.
toolkit definition: شخص لديه حاليا أو سابقا الملكية القانونية لمفردة @ar
toolkit definition: 拥有对一个单件当前或先前法定所有权的一个个人 @zh-hans
toolkit label: Eigentümerin/Eigentümer (Person) @de
toolkit label: eier (person) @no
toolkit label: eigenaar-persoon @nl
toolkit label: omanik (isik) @et
toolkit label: omistaja (henkilö) @fi
toolkit label: owner person @en
toolkit label: person, som er ejer @da
toolkit label: persona propietària @ca
toolkit label: personne propriétaire
toolkit label: proprietario persona @it
toolkit label: sahip olan kişi @tr
toolkit label: tulajdonos személye: @hu
toolkit label: īpašnieks (persona) @lv
toolkit label: شخص مالك @ar
toolkit label: 拥有者个人 @zh-hans
has subproperty: a pour personne propriétaire actuelle
has subproperty: a pour ancienne personne propriétaire
has subproperty: P40104
lexical alias: ownerPerson.en
status: Published
type: Property
domain: C10003
label: har eier (person) @no
label: har person, som er ejer @da
label: has owner person @en
label: hat Eigentümerin/Eigentümer (Person) @de
label: ha come proprietario persona @it
label: heeft eigenaar-persoon @nl
label: omanik (isik) @et
label: omistaja (henkilö) @fi
label: sahip kişisi ile ilişkilidir @tr
label: tulajdonos személye a következő: @hu
label: té com a persona propietària @ca
label: īpašnieks (persona) @lv
label: له شخص مالك @ar
label: 有拥有者个人 @zh-hans
sub property of: a pour agent propriétaire
sub property of: a pour personne en relation avec un item
definition: Bir kopyayı, bir kopyanın mevcut veya daha önce yasal mülkiyetine sahip olan bir kişiyle ilişkilendirir. @tr
definition: Correla un item a una persona che detiene la proprietà giuridica di un item. @it
definition: Hozzákapcsol egy példányt egy személyhez, aki törvényesen birtokol egy példányt. @hu
definition: Liittää kappaleen henkilöön, jolla on kappaleen nykyinen tai aiempi laillinen omistusoikeus. @fi
definition: Met un item en relation avec une personne qui possède actuellement ou a auparavant possédé légalement un item.
definition: Relaciona un ítem amb una persona que té la propietat legal actual o anterior d’un ítem. @ca
definition: Relateert een item aan een persoon die huidig of voormalig wettelijk bezit heeft van een item. @nl
definition: Relaterer et eksemplar til en person som er den rettmessige eieren av et eksemplar. @no
definition: Relaterer et eksemplar til en person, som er i lovlig besiddelse af et eksemplar. @da
definition: Relates an item to a person who has current or former legal possession of an item. @en
definition: Sasaista vienību ar personu, kurai ir vai ir bijušas likumīgas tiesības uz īpašumu. @lv
definition: Seostab eksemplari isikuga, kellele eksemplar praegu õiguspäraselt kuulub või varem kuulus. @et
definition: Setzt ein Exemplar in Beziehung zu einer Person, die gegenwärtig oder früher im rechtmäßigen Besitz eines Exemplars ist/war. @de
definition: يربط مفردة بشخص لديه الملكية القانونية لمفردة. @ar
definition: 将一个单件与拥有对一个单件当前或先前法定所有权的一个个人关联起来。 @zh-hans

a pour personne collectionneuse
has element type: 2
toolkit definition: A person who is a curator who brings together items from various sources that are arranged, described, or catalogued as a collection. (Deprecated) @en
toolkit definition: Curatore persona che raccoglie item da varie fonti, che sono organizzati, descritti o catalogati come una collezione. @it
toolkit definition: Een persoon die een curator is die items samenbrengt uit diverse bronnen die gerangschikt, beschreven of gecatalogiseerd zijn als een collectie. @nl
toolkit definition: Egy kurátor személy, aki különböző forrásokból származó, gyűjteményként rendezett, leírt és katalogizált példányokat fog össze. @hu
toolkit definition: Eine Kuratorin/Ein Kurator (Person), die/der Materialien aus unterschiedlichen Quellen zusammenträgt, die dann als Sammlung geordnet, beschrieben oder katalogisiert werden. @de
toolkit definition: En person som er en kurator som setter sammen eksemplarer fra ulike kilder og som er arrangert, beskrevet eller katalogisert som en samling. @no
toolkit definition: Isik, kes kuraatorina kogub eri allikatest kokku eksemplarid, mis korrastatakse, kirjeldatakse või kataloogitakse koguna. @et
toolkit definition: Kuraattorina toimiva henkilö, joka kokoaa eri lähteistä järjestettävät, kuvailtavat ja luetteloitavat kappaleet kokoelmaksi. @fi
toolkit definition: Person, som er kurator, som indsamler eksemplarer fra forskellige kilder, som bliver arrangeret, beskrevet eller katalogiseret som en samling. @da
toolkit definition: Persona que és un conservador que aplega ítems de diverses fonts que s’arrangen, es descriuen o es cataloguen com una col·lecció. @ca
toolkit definition: Persona, kura apkopo vienības no dažādiem avotiem, kas ir sakārtotas, aprakstītas vai kataloģizētas kā kolekcija. @lv
toolkit definition: Personne conservatrice qui rassemble des items de diverses sources qui sont arrangés, décrits et catalogués comme une collection.
toolkit definition: شخص هو أمين متحف يجمع مفردات معاً من مصادر مختلفة رتُبت، أو وُصفت، أو فُهرست كمجموعة. @ar
toolkit label: Sammlerin/Sammler (Person) @de
toolkit label: collector person (Deprecated) @en
toolkit label: collezionista persona @it
toolkit label: kogu moodustaja (isik) @et
toolkit label: kokoelman muodostaja (henkilö) @fi
toolkit label: kolekcionārs (persona) @lv
toolkit label: kollektor személy: @hu
toolkit label: person, som er samler @da
toolkit label: persona col·leccionista @ca
toolkit label: personne collectionneuse
toolkit label: samler (person) @no
toolkit label: verzamelaar-persoon @nl
toolkit label: شخص جامع @ar
has subproperty: P40105
lexical alias: collectorPerson.en
status: Deprecated
type: Property
domain: C10003
label: har person, som er samler @da
label: har samler (person) @no
label: has collector person (Deprecated) @en
label: hat Sammlerin/Sammler (Person) @de
label: ha come collezionista persona @it
label: heeft verzamelaar-persoon @nl
label: kogu moodustaja (isik) @et
label: kokoelman muodostaja (henkilö) @fi
label: kolekcionārs (persona) @lv
label: kollektor személye a következő: @hu
label: té com a persona col·leccionista @ca
label: له شخص جامع @ar
sub property of: a pour agent collectionneur
sub property of: a pour personne conservatrice
definition: Correla un item al curatore persona che raccoglie item da varie fonti, che sono organizzati, descritti o catalogati come una collezione. @it
definition: Hozzákapcsol egy példányt egy kurátor személyhez, aki különböző forrásokból származó, gyűjteményként rendezett, leírt és katalogizált példányokat fog össze. @hu
definition: Liittää kappaleen kuraattorina toimivaan henkilöön, joka kokoaa eri lähteistä järjestettävät, kuvailtavat ja luetteloitavat kappaleet kokoelmaksi. @fi
definition: Met un item en relation avec une personne conservatrice qui rassemble des items de diverses sources qui sont arrangés, décrits et catalogués comme une collection.
definition: Relaciona un ítem amb una persona que és un conservador que aplega ítems de diverses fonts que s’arrangen, es descriuen o es cataloguen com una col·lecció. @ca
definition: Relateert een item aan een persoon die een curator is die items samenbrengt uit diverse bronnen die gerangschikt, beschreven of gecatalogiseerd zijn als een collectie. @nl
definition: Relaterer et eksemplar til en person som er en kurator som setter sammen eksemplarer fra ulike kilder og som er arrangert, beskrevet eller katalogisert som en samling. @no
definition: Relaterer et eksemplar til en person, som er kurator, som indsamler eksemplarer fra forskellige kilder, som bliver arrangeret, beskrevet eller katalogiseret som en samling. @da
definition: Relates an item to a person who is a curator who brings together items from various sources that are arranged, described, or catalogued as a collection. (Deprecated) @en
definition: Sasaista vienību ar personu, kura apkopo vienības no dažādiem avotiem, kas ir sakārtotas, aprakstītas vai kataloģizētas kā kolekcija. @lv
definition: Seostab eksemplari isikuga, kes kuraatorina kogub eri allikatest kokku eksemplarid, mis korrastatakse, kirjeldatakse või kataloogitakse koguna. @et
definition: Setzt ein Exemplar in Beziehung zu einer Kuratorin/einem Kurator (Person), die/der Materialien aus unterschiedlichen Quellen zusammenträgt, die dann als Sammlung geordnet, beschrieben oder katalogisiert werden. @de
definition: يربط مفردة بشخص هو أمين متحف يجمع مفردات معاً من مصادر مختلفة رتُبت، أو وُصفت، أو فُهرست كمجموعة. @ar

a pour personne catalogueuse d’une collection de ressources
has element type: 2
toolkit definition: A person who is a curator who lists or inventories items in a collection aggregate. (Deprecated) @en
toolkit definition: Curatore persona che elenca o inventaria gli item in un aggregato collezione. @it
toolkit definition: Een persoon die een curator is die een lijst of inventaris aanlegt van items in een collectie-aggregaat. @nl
toolkit definition: Egy kurátor személy, aki példányokat sorol fel vagy leltároz egy gyűjteményi aggregátumban. @hu
toolkit definition: Eine Kuratorin/Ein Kurator (Person), die/der die Exemplare eines Sammlungsaggregats verzeichnet oder inventarisiert. @de
toolkit definition: En person som er en kurator som lager lister eller oversikter over eksemplarene i en aggregert samling. @no
toolkit definition: Isik, kes kuraatorina loetleb või inventeerib kogu eksemplarid. @et
toolkit definition: Kuraattorina toimiva henkilö, joka luetteloi tai inventoi kokoelma-aggregaatin kappaleet. @fi
toolkit definition: Person, som er kurator, som listefører eller opgører en inventarliste over eksemplarer i et samlingsaggregat. @da
toolkit definition: Persona que és un conservador que llista o inventaria els ítems en una col·lecció agregada. @ca
toolkit definition: Persona, kura kolekciju apkopojumā uzskaita vai inventarizē vienības. @lv
toolkit definition: Personne conservatrice qui dresse une liste ou un inventaire des items faisant partie d’un agrégat par regroupement.
toolkit definition: شخص هو أمين متحف يقوم بتسجيل قوائم مفردات أو بجردها في مجموعة مجمعة. @ar
toolkit label: Registrarin/Registrar (Person) @de
toolkit label: collectieregistrator-persoon @nl
toolkit label: collection registrar person (Deprecated) @en
toolkit label: gyűjtemény-nyilvántartó személy: @hu
toolkit label: kogu registreerija (isik) @et
toolkit label: kokoelman luetteloija (henkilö) @fi
toolkit label: kolekcijas reģistrētājs (persona) @lv
toolkit label: person, som er samlingsregistrator @da
toolkit label: persona conservadora de col·leccions @ca
toolkit label: persona conservatrice di collezione @it
toolkit label: personne catalogueuse d’une collection de ressources
toolkit label: samlingsregistrator (person) @no
toolkit label: شخص مسجل المجموعات @ar
has subproperty: P40106
lexical alias: collectionRegistrarPerson.en
status: Deprecated
type: Property
domain: C10003
label: gyűjtemény-nyilvántartó személye a következő: @hu
label: ha come conservatore di collezione persona @it
label: har person, som er samlingsregistrator @da
label: har samlingsregistrator (person) @no
label: has collection registrar person (Deprecated) @en
label: hat Registrarin/Registrar (Person) @de
label: heeft collectieregistrator-persoon @nl
label: kogu registreerija (isik) @et
label: kokoelman luetteloija (henkilö) @fi
label: kolekcijas reģistrētājs (persona) @lv
label: té com a persona conservadora de col·leccions @ca
label: له شخص مسجِل المجموعات @ar
sub property of: a pour agent catalogueur d’une collection de ressources
sub property of: a pour personne conservatrice
alternative label: personne conservatrice d’une collection de ressources
definition: Correla un item al curatore persona che elenca o inventaria gli item in un aggregato collezione. @it
definition: Hozzákapcsol egy példányt egy kurátor személyhez, aki példányokat sorol fel vagy leltároz egy gyűjteményi aggregátumban. @hu
definition: Liittää kappaleen kuraattorina toimivaan henkilöön, joka luetteloi tai inventoi kokoelma-aggregaatin kappaleet. @fi
definition: Met un item en relation avec une personne conservatrice qui dresse une liste ou un inventaire des items faisant partie d’un agrégat par regroupement.
definition: Relaciona un ítem amb una persona que és un conservador que llista o inventaria els ítems en una col·lecció agregada. @ca
definition: Relateert een item aan een persoon die een curator is die een lijst of inventaris aanlegt van items in een collectie-aggregaat. @nl
definition: Relaterer et eksemplar til en person som er en kurator som lager lister eller oversikter over eksemplarene i en aggregert samling. @no
definition: Relaterer et eksemplar til en person, som er kurator, som listefører eller opgører en inventarliste over eksemplarer i et samlingsaggregat. @da
definition: Relates an item to a person who is a curator who lists or inventories items in a collection aggregate. (Deprecated) @en
definition: Sasaista vienību ar personu, kura kolekciju apkopojumā uzskaita vai inventarizē vienības. @lv
definition: Seostab eksemplari isikuga, kes kuraatorina loetleb või inventeerib kogu eksemplarid. @et
definition: Setzt ein Exemplar in Beziehung zu einer Kuratorin/einem Kurator (Person), die/der die Exemplare eines Sammlungsaggregats verzeichnet oder inventarisiert. @de
definition: يربط مفردة بشخص هو أمين متحف يقوم بتسجيل قوائم مفردات أو بجردها في مجموعة مجمعة. @ar

a pour personne déposante
has element type: 2
toolkit definition: A person who is a current owner of an item who deposits the item into the custody of another agent without transferring ownership. @en
toolkit definition: Bir kopyanın mevcut sahibi olan ve mülkiyeti devretmeden kopyayı başka bir temsilcinin gözetimine bırakan kişi. @tr
toolkit definition: Een persoon die een huidige eigenaar is van een item die het item onderbrengt bij een andere actor zonder eigenaarschap over te dragen. @nl
toolkit definition: Egy személy, aki egy példány jelenlegi tulajdonosa, és aki egy másik ágens megőrzésébe letétként helyezi el a példányt anélkül, hogy a tulajdonjogot átruházná. @hu
toolkit definition: Eine gegenwärtige Eigentümerin/Ein gegenwärtiger Eigentümer (Person) eines Exemplars, die/der das Exemplar in die Obhut eines anderen Akteurs gibt, ohne das Eigentumsrecht zu übertragen. @de
toolkit definition: En person som er en nåværende eier av et eksemplar som deponerer eksemplaret til forvaring til en annen agent uten at eierskapet blir overført. @no
toolkit definition: Isik, kes praeguse omanikuna deponeerib eksemplari teise tegija vastutavale hoiule ilma omandiõiguse üleminekuta. @et
toolkit definition: Kappaleen nykyinen henkilöomistaja, joka tallettaa kappaleen toisen toimijan huostaan omistajuudesta luopumatta. @fi
toolkit definition: Person, som er nuværende ejer af et eksemplar, som deponerer eksemplaret til forvaring hos en anden agent, men uden at overgive ejerskab. @da
toolkit definition: Persona que és un propietari actual d’un ítem que el diposita sota la custòdia d’un altre agent sense transferir-li la propietat. @ca
toolkit definition: Persona, pašreizējais vienības īpašnieks, kurš deponējis vienību cita aģenta uzglabāšanā, vienlaikus saglabājot īpašumtiesības. @lv
toolkit definition: Personne propriétaire actuelle d’un item qui dépose l’item sous la garde d’un autre agent sans en transférer la propriété.
toolkit definition: Proprietario attuale persona di un item che deposita l'item sotto la custodia di un altro agente senza trasferirne la proprietà. @it
toolkit definition: شخص هو المالك الحالي لمفردة، يودعها تحت وصاية وكيل آخر دون نقل ملكيتها. @ar
toolkit definition: 作为单件的当前拥有者将单件委托给另一个行为者保管但未转让所有权的一个个人 @zh-hans
toolkit label: Leihgeberin/Leihgeber (Person) @de
toolkit label: bruikleen-persoon @nl
toolkit label: deponeerija (isik) @et
toolkit label: deponent (person) @no
toolkit label: deponents (persona) @lv
toolkit label: depositante persona @it
toolkit label: depositor person @en
toolkit label: letétbe helyező személye: @hu
toolkit label: mevduatçı @tr
toolkit label: person, som er udlåner @da
toolkit label: persona dipositadora @ca
toolkit label: personne déposante
toolkit label: tallettaja (henkilö) @fi
toolkit label: شخص مودع @ar
toolkit label: 托存者个人 @zh-hans
has subproperty: P40107
lexical alias: depositorPerson.en
status: Published
type: Property
domain: C10003
label: deponeerija (isik) @et
label: deponents (persona) @lv
label: har deponent (person) @no
label: har person, som er udlåner @da
label: has depositor person @en
label: hat Leihgeberin/Leihgeber (Person) @de
label: ha come depositante persona @it
label: heeft bruikleen-persoon @nl
label: letétbe helyező személye a következő: @hu
label: mevduatçı kişisi ile ilişkilidir @tr
label: tallettaja (henkilö) @fi
label: té com a persona dipositadora @ca
label: له شخص مودِع @ar
label: 有托存者个人 @zh-hans
sub property of: a pour agent déposant
sub property of: a pour personne propriétaire actuelle
definition: Bir kopyayı, mülkiyeti devretmeden başka bir temsilcinin gözetimine emanet eden, bir kopyanın mevcut sahibi olan bir kişiyle ilişkilendirir. @tr
definition: Correla un item al proprietario attuale persona di un item che deposita l'item sotto la custodia di un altro agente senza trasferirne la proprietà. @it
definition: Hozzákapcsol egy példányt egy személyhez, aki egy példány jelenlegi tulajdonosa, és aki egy másik ágens megőrzésébe letétként helyezi el a példányt anélkül, hogy a tulajdonjogot átruházná. @hu
definition: Liittää kappaleen sen nykyiseen henkilöomistajaan, joka tallettaa kappaleen toisen toimijan huostaan omistajuudesta luopumatta. @fi
definition: Met un item en relation avec une personne propriétaire actuelle d’un item qui dépose l’item sous la garde d’un autre agent sans en transférer la propriété.
definition: Relaciona un ítem amb una persona que és un propietari actual d’un ítem que el diposita sota la custòdia d’un altre agent sense transferir-li la propietat. @ca
definition: Relateert een item aan een persoon die een huidige eigenaar is van een item die het item onderbrengt bij een andere actor zonder eigenaarschap over te dragen. @nl
definition: Relaterer et eksemplar til en person som er en nåværende eier av et eksemplar som deponerer eksemplaret til forvaring til en annen agent uten at eierskapet blir overført. @no
definition: Relaterer et eksemplar til en person, som er nuværende ejer af et eksemplar, som deponerer eksemplaret til forvaring hos en anden agent, men uden at overgive ejerskab. @da
definition: Relates an item to a person who is a current owner of an item who deposits the item into the custody of another agent without transferring ownership. @en
definition: Sasaista vienību ar personu, kura ir pašreizējais vienības īpašnieks, kurš deponējis vienību cita aģenta uzglabāšanā, vienlaikus saglabājot īpašumtiesības. @lv
definition: Seostab eksemplari isikuga, kes praeguse omanikuna deponeerib eksemplari teise tegija vastutavale hoiule ilma omandiõiguse üleminekuta. @et
definition: Setzt ein Exemplar in Beziehung zu einer gegenwärtigen Eigentümerin/einem gegenwärtigen Eigentümer (Person) eines Exemplars, die/der das Exemplar in die Obhut eines anderen Akteurs gibt, ohne das Eigentumsrecht zu übertragen. @de
definition: يربط مفردة بشخص هو المالك الحالي لمفردة، يودعها تحت وصاية وكيل آخر دون نقل ملكيتها. @ar
definition: 将一个单件与作为单件的当前拥有者将单件委托给另一个行为者保管但未转让所有权的一个个人关联起来。 @zh-hans

a pour personne donatrice
has element type: 2
toolkit definition: A person who is a former owner of an item who donates the item to another owner. @en
toolkit definition: Ancienne personne propriétaire d’un item qui fait don de cet item à un autre propriétaire.
toolkit definition: Bir kopyanın eski sahibi olan ve kopyayı başka bir sahibine bağışlayan kişi. @tr
toolkit definition: Een persoon die een voormalige eigenaar is van een item die het item schenkt aan een andere eigenaar. @nl
toolkit definition: Egy személy, aki egy példány korábbi tulajdonosa, és aki a példányt egy másik tulajdonosnak adományozta. @hu
toolkit definition: Eine frühere Eigentümerin/Ein früherer Eigentümer (Person) eines Exemplars, die/der das Exemplar einer anderen Eigentümerin/einem anderen Eigentümer überlässt. @de
toolkit definition: En person som er en tidligere eier av et eksemplar som har gitt eksemplaret til en annen eier. @no
toolkit definition: Isik, kes eksemplari endise omanikuna on kinkinud selle teisele omanikule. @et
toolkit definition: Kappaleen aiempi henkilöomistaja, joka lahjoittaa sen toiselle omistajalle. @fi
toolkit definition: Person, som er tidligere ejer af et eksemplar, som har doneret dette eksemplar til en anden ejer. @da
toolkit definition: Persona que és un propietari anterior d’un ítem que dona l’ítem a un altre propietari. @ca
toolkit definition: Persona, agrākais vienības īpašnieks, kurš ziedojis šo vienību citam īpašniekam. @lv
toolkit definition: Proprietario precedente persona di un item che ha donato l'item a un altro possessore. @it
toolkit definition: شخص هو المالك السابق لمفردة، تبرع بها لمالك آخر. @ar
toolkit definition: 作为先前拥有者将单件捐赠给另一个拥有者的一个个人 @zh-hans
toolkit label: Stifterin/Stifter (Person) @de
toolkit label: adományozó személye: @hu
toolkit label: annetaja (isik) @et
toolkit label: bağışçı @tr
toolkit label: donatore persona @it
toolkit label: donor person @en
toolkit label: giver (person) @no
toolkit label: lahjoittaja (henkilö) @fi
toolkit label: person, som er donor @da
toolkit label: persona donant @ca
toolkit label: personne donatrice
toolkit label: schenker-persoon @nl
toolkit label: ziedotājs (persona) @lv
toolkit label: شخص متبرع @ar
toolkit label: 捐赠者个人 @zh-hans
has subproperty: P40108
lexical alias: donorPerson.en
status: Published
type: Property
domain: C10003
label: adományozó személye a következő: @hu
label: annetaja (isik) @et
label: bağışçı kişisi ile ilişkilidir @tr
label: ha come donatore persona @it
label: har giver (person) @no
label: har person, som er donor @da
label: has donor person @en
label: hat Stifterin/Stifter (Person) @de
label: heeft schenker-persoon @nl
label: lahjoittaja (henkilö) @fi
label: té com a persona donant @ca
label: ziedotājs (persona) @lv
label: له شخص متبرع @ar
label: 有捐赠者个人 @zh-hans
sub property of: a pour agent donateur
sub property of: a pour ancienne personne propriétaire
definition: Bir kopyayı, bir kopyanın eski sahibi olan ve kopyayı başka bir sahibine bağışlayan bir kişiyle ilişkilendirir. @tr
definition: Correla un item al proprietario precedente persona di un item che ha donato l'item a un altro possessore. @it
definition: Hozzákapcsol egy példányt egy személyhez, aki egy példány korábbi tulajdonosa, és aki a példányt egy másik tulajdonosnak adományozta. @hu
definition: Liittää kappaleen sen aiempaan henkilöomistajaan, joka lahjoittaa sen toiselle omistajalle. @fi
definition: Met un item en relation avec une ancienne personne propriétaire d’un item qui fait don de cet item à un autre propriétaire.
definition: Relaciona un ítem amb una persona que és un propietari anterior d’un ítem que dona l’ítem a un altre propietari. @ca
definition: Relateert een item aan een persoon die een voormalige eigenaar is van een item die het item schenkt aan een andere eigenaar. @nl
definition: Relaterer et eksemplar til en person som er en tidligere eier av et eksemplar som har gitt eksemplaret til en annen eier. @no
definition: Relaterer et eksemplar til en person, som er tidligere ejer af et eksemplar, som har doneret dette eksemplar til en anden ejer. @da
definition: Relates an item to a person who is a former owner of an item who donates the item to another owner. @en
definition: Sasaista vienību ar personu, kura ir agrākais vienības īpašnieks, kurš ziedojis šo vienību citam īpašniekam. @lv
definition: Seostab eksemplari isikuga, kes eksemplari endise omanikuna on kinkinud selle teisele omanikule. @et
definition: Setzt ein Exemplar in Beziehung zu einer früheren Eigentümerin/einem früheren Eigentümer (Person) eines Exemplars, die/der das Exemplar einer anderen Eigentümerin/einem anderen Eigentümer überlässt. @de
definition: يربط مفردة بشخص هو المالك السابق لمفردة، تبرع بها لمالك آخر. @ar
definition: 将一个单件与作为先前拥有者将单件捐赠给另一个拥有者的一个个人关联起来。 @zh-hans

a pour personne vendeuse
has element type: 2
toolkit definition: A person who is a former owner of an item who sells the item to another owner. @en
toolkit definition: Ancienne personne propriétaire d’un item qui vend cet item à un autre propriétaire.
toolkit definition: Bir kopyanın eski sahibi olan ve kopyayı başka bir sahibine satan kişi. @tr
toolkit definition: Een persoon die een voormalige eigenaar is van een item die het item verkoopt aan een andere eigenaar. @nl
toolkit definition: Egy személy, aki egy példány korábbi tulajdonosa, és aki a példányt egy másik tulajdonosnak adja el. @hu
toolkit definition: Eine frühere Eigentümerin/Ein früherer Eigentümer (Person) eines Exemplars, die/der das Exemplar an eine andere Eigentümerin/einen anderen Eigentümer verkauft. @de
toolkit definition: En person som er en tidligere eier av et eksemplar, som har solgt eksemplaret til en annen eier. @no
toolkit definition: Isik, kes eksemplari endise omanikuna on müünud selle teisele omanikule. @et
toolkit definition: Kappaleen aiempi henkilöomistaja, joka myy kappaleen toiselle omistajalle. @fi
toolkit definition: Person, som er tidligere ejer af et eksemplar, som har solgt dette eksemplar til en anden ejer. @da
toolkit definition: Persona - vienības agrākais īpašnieks, kura pārdod šo vienību citam īpašniekam. @lv
toolkit definition: Persona que és un propietari anterior d’un ítem que ven l’ítem a un altre propietari. @ca
toolkit definition: Proprietario precedente persona di un item che ha venduto l'item a un altro proprietario. @it
toolkit definition: شخص هو مالك سابق لمفردة قام ببيعها لمالك آخر. @ar
toolkit definition: 作为先前拥有者将单件出售给另一个拥有者的一个个人 @zh-hans
toolkit label: Verkäuferin/Verkäufer (Person) @de
toolkit label: myyjä (henkilö) @fi
toolkit label: müüja (isik) @et
toolkit label: person, som er sælger @da
toolkit label: persona venedora @ca
toolkit label: personne vendeuse
toolkit label: pārdevējs (persona) @lv
toolkit label: satıcı kişi @tr
toolkit label: selger (person) @no
toolkit label: seller person @en
toolkit label: venditore persona @it
toolkit label: verkoper-persoon @nl
toolkit label: értékesítő személye: @hu
toolkit label: شخص بائع @ar
toolkit label: 出售者个人 @zh-hans
has subproperty: P40109
lexical alias: sellerPerson.en
status: Published
type: Property
domain: C10003
label: har person, som er sælger @da
label: har selger (person) @no
label: has seller person @en
label: hat Verkäuferin/Verkäufer (Person) @de
label: ha come venditore persona @it
label: heeft verkoper-persoon @nl
label: myyjä (henkilö) @fi
label: müüja (isik) @et
label: pārdevējs (persona) @lv
label: satıcı kişisi ile ilişkilidir @tr
label: té com a persona venedora @ca
label: értékesítő személye a következő: @hu
label: له شخص بائع @ar
label: 有出售者个人 @zh-hans
sub property of: a pour agent vendeur
sub property of: a pour ancienne personne propriétaire
definition: Bir kopyayı, bir kopyanın eski sahibi olan ve o kopyayı başka bir sahibine satan bir kişiyle ilişkilendirir. @tr
definition: Correla un item al proprietario precedente persona di un item che ha venduto l'item a un altro proprietario. @it
definition: Hozzákapcsol egy példányt egy személyhez, aki egy példány korábbi tulajdonosa, és aki a példányt egy másik tulajdonosnak adja el. @hu
definition: Liittää kappaleen sen aiempaan henkilöomistajaan, joka myy kappaleen toiselle omistajalle. @fi
definition: Met un item en relation avec une ancienne personne propriétaire d’un item qui vend cet item à un autre propriétaire.
definition: Relaciona un ítem amb una persona que és un propietari anterior d’un ítem que ven l’ítem a un altre propietari. @ca
definition: Relateert een item aan een persoon die een voormalige eigenaar is van een item die het item verkoopt aan een andere eigenaar. @nl
definition: Relaterer et eksemplar til en person som er en tidligere eier av et eksemplar, som har solgt eksemplaret til en annen eier. @no
definition: Relaterer et eksemplar til en person, som er tidligere ejer af et eksemplar, som har solgt dette eksemplar til en anden ejer. @da
definition: Relates an item to a person who is a former owner of an item who sells the item to another owner. @en
definition: Sasaista vienību ar personu, kura ir vienības agrākais īpašnieks, kura pārdod šo vienību citam īpašniekam. @lv
definition: Seostab eksemplari isikuga, kes eksemplari endise omanikuna on müünud selle teisele omanikule. @et
definition: Setzt ein Exemplar in Beziehung zu einer früheren Eigentümerin/einem früheren Eigentümer (Person) eines Exemplars, die/der das Exemplar an eine andere Eigentümerin/einen anderen Eigentümer verkauft. @de
definition: يربط مفردة بشخص هو مالك سابق لمفردة قام ببيعها لمالك آخر. @ar
definition: 将一个单件与作为先前拥有者将单件出售给另一个拥有者的一个个人关联起来。 @zh-hans

a pour personne honorée d’un item
has element type: 2
toolkit definition: A person who is honoured by an item. @en
toolkit definition: Bir kopya ile onurlandırılan kişi. @tr
toolkit definition: Een persoon die geëerd wordt door een item. @nl
toolkit definition: Egy személy, akit a példány méltat. @hu
toolkit definition: Eine Person, die durch ein Exemplar geehrt wird. @de
toolkit definition: En person som beæres av et eksemplar. @no
toolkit definition: Henkilö, jota kappaleella kunnioitetaan. @fi
toolkit definition: Isik, keda eksemplariga austatakse. @et
toolkit definition: Person, som er hædret i et eksemplar. @da
toolkit definition: Persona onorata da un item. @it
toolkit definition: Persona que és homenatjada en un ítem. @ca
toolkit definition: Persona, kura godināta ar vienību. @lv
toolkit definition: Personne qui est honorée par un item.
toolkit definition: شخص هو مُكُرم بمفردة. @ar
toolkit definition: 被一个单件纪念的一个个人 @zh-hans
toolkit label: Gefeierte/Gefeierter eines Exemplars (Person) @de
toolkit label: ar vienību godinātā persona @lv
toolkit label: eksemplari austusavalduse saaja (isik) @et
toolkit label: geëerde-persoon van item @nl
toolkit label: honouree person of item @en
toolkit label: kappaleella kunnioitettu henkilö @fi
toolkit label: kopyanın onurlandırılan kişi ile ilişkilidir @tr
toolkit label: person beæret av eksemplar @no
toolkit label: person, som er beæret i eksemplar @da
toolkit label: persona homenatjada d’un ítem @ca
toolkit label: persona onorata di item @it
toolkit label: personne honorée d’un item
toolkit label: példány méltatott személye: @hu
toolkit label: شخص مكرم بمفردة @ar
toolkit label: 单件的被纪念者个人 @zh-hans
has subproperty: P40110
lexical alias: honoureePersonOfItem.en
status: Published
type: Property
domain: C10003
label: ar vienību godinātā persona @lv
label: eksemplari austusavalduse saaja (isik) @et
label: ha come onorato persona di item @it
label: har person beæret av eksemplar @no
label: har person, som er beæret i eksemplar @da
label: has honouree person of item @en
label: hat Gefeierte/Gefeierten eines Exemplars (Person) @de
label: heeft geëerde-persoon van item @nl
label: kappaleella kunnioitettu henkilö @fi
label: kopyanın onurlandırılan kişisi ile ilişkilidir @tr
label: példány méltatott személye a következő: @hu
label: té com a persona homenatjada d’un ítem @ca
label: له شخص مكرَم بمفردة @ar
label: 有单件的被纪念者个人 @zh-hans
sub property of: a pour agent honoré d’un item
sub property of: a pour personne en relation avec un item
definition: Bir kopyayı, bir kopyayla onurlandırılan bir kişiyle ilişkilendirir. @tr
definition: Correla un item alla persona onorata da un item. @it
definition: Hozzákapcsol egy példányt egy személyhez, akit a példány méltat. @hu
definition: Liittää kappaleen henkilöön, jota kappaleella kunnioitetaan. @fi
definition: Met un item en relation avec une personne qui est honorée par un item.
definition: Relaciona un ítem amb una persona que és homenatjada en un ítem. @ca
definition: Relateert een item aan een persoon die geëerd wordt door een item. @nl
definition: Relaterer et eksemplar til en person som beæres av et eksemplar. @no
definition: Relaterer et eksemplar til en person, som er hædret i et eksemplar. @da
definition: Relates an item to a person who is honoured by an item. @en
definition: Sasaista vienību ar personu, kura godināta ar vienību. @lv
definition: Seostab eksemplari isikuga, keda eksemplariga austatakse. @et
definition: Setzt ein Exemplar in Beziehung zu einer Person, die durch ein Exemplar geehrt wird. @de
definition: يربط مفردة بشخص مُكُرم بمفردة. @ar
definition: 将一个单件与被一个单件纪念的一个个人关联起来。 @zh-hans

a pour personne restauratrice d’un item
has element type: 2
toolkit definition: A person who is responsible for the set of technical, editorial, and intellectual procedures aimed at compensating for the degradation of an item by bringing it back to a state as close as possible to its original condition. @en
toolkit definition: Bir kopyayı orijinal durumuna mümkün olduğunca yakın bir duruma getirerek bozulmasını telafi etmeyi amaçlayan bir dizi teknik, editoryal ve entelektüel prosedürden sorumlu olan kişi. @tr
toolkit definition: Een persoon die verantwoordelijk is voor de verzameling van technische, redactionele en intellectuele procedures gericht op het corrigeren van de achteruitgang van een item door het zo goed mogelijk terug te brengen tot de oorspronkelijke staat. @nl
toolkit definition: Egy személy, aki felelős technikai, szerkesztői és intellektuális eljárások összességéért, amelyek célja egy példány romlásának ellensúlyozása, amivel azt az eredeti állapotához a lehető legközelebb képesek visszahozni. @hu
toolkit definition: Eine Person, die für die technischen, redaktionellen und intellektuellen Verfahren verantwortlich ist, die darauf abzielen, die Zersetzung eines Exemplars auszugleichen, indem es in einen Zustand zurückversetzt wird, der seiner ursprünglichen Beschaffenheit möglichst nahe kommt. @de
toolkit definition: En person som har ansvar for de tekniske og intellektuelle metodene som brukes for å kompensere for nedbrytningen av et eksemplar ved å restaurere det til en tilstand som er så lik originaltilstanden som mulig. @no
toolkit definition: Henkilö, joka vastaa teknisistä, toimituksellisista ja tiedollisista toimenpiteistä, joiden tarkoitus on palauttaa huonokuntoinen kappale mahdollisimman lähelle sen alkuperäistä kuntoa. @fi
toolkit definition: Isik, kes vastutab rea tehniliste, toimetuslike ja intellektuaalsete toimingute eest, mille eesmärk on taastada kahjustatud eksemplari seisund võimalikult originaalseisundi lähedaseks. @et
toolkit definition: Person, som er ansvarlig for en række af tekniske, redaktionelle og intellektuelle procedurer, som forsøger at kompensere for nedslidningen af et eksemplar ved at føre det tilbage til en tilstand, der er så tæt som muligt på dets oprindelige tilstand. @da
toolkit definition: Persona que és responsable del conjunt de procediments tècnics, editorials i intel·lectuals destinats a compensar la degradació d’un ítem retornant-lo a un estat que s’aproximi al màxim a la seva condició original. @ca
toolkit definition: Persona responsabile dell'insieme delle procedure tecniche, di cura e intellettuali finalizzate al risarcimento di un item in seguito alla sua degradazione, riportandolo a uno stato il più possibile vicino alla condizione originale. @it
toolkit definition: Persona, kura ir atbildīga par tehnisko, redakcionālo un intelektuālo procedūru kopumu, kuru mērķis ir kompensēt vienības pakāpenisko bojāeju, atgriežot to, cik vien iespējams, tuvu tās sākotnējam stāvoklim. @lv
toolkit definition: Personne qui est responsable de l’ensemble des procédures techniques, éditoriales et intellectuelles destinées à compenser la dégradation d’un item en le ramenant à un état aussi près que possible de sa condition originelle.
toolkit definition: شخص مسؤول عن مجموعة الإجراءاتالفنية، والتحريرية، والفكرية التي تهدف إلى إصلاح التدهور الذي لحق بمفردة، وإعادتها إلى حالة أقرب ما تكون إلى حالتها الأصلية. @ar
toolkit definition: 负责为弥补单件的损毁而担负一系列技术、编辑和智力操作、使之尽可能恢复到原始状态的一个个人 @zh-hans
toolkit label: Restauratorin/Restaurator eines Exemplars (Person) @de
toolkit label: eksemplari restaureerija (isik) @et
toolkit label: kappaleen entisöijä (henkilö) @fi
toolkit label: konservator for eksemplar (person) @no
toolkit label: kopyanın restoraston uzmanı kişisi @tr
toolkit label: person, som er konservator af eksemplar @da
toolkit label: persona restauradora d’un ítem @ca
toolkit label: persona restauratore di item @it
toolkit label: personne restauratrice d’un item
toolkit label: példány restaurátor személye: @hu
toolkit label: restaurator-persoon van item @nl
toolkit label: restorationist person of item @en
toolkit label: vienības restaurators (persona) @lv
toolkit label: شخص مرمم لمفردة @ar
toolkit label: 单件的修复者个人 @zh-hans
has subproperty: P40111
lexical alias: restorationistPersonOfItem.en
status: Published
type: Property
domain: C10003
label: eksemplari restaureerija (isik) @et
label: har konservator for eksemplar (person) @no
label: har person, som er konservator af eksemplar @da
label: has restorationist person of item @en
label: hat Restauratorin/Restaurator eines Exemplars (Person) @de
label: ha come restauratore di item persona @it
label: heeft restaurator-persoon van item @nl
label: kappaleen entisöijä (henkilö) @fi
label: kopyanın restorasyon uzmanı kişisi ile ilişkilidir @tr
label: példány restaurátor személye a következő: @hu
label: té com a persona restauradora d’un ítem @ca
label: vienības restaurators (persona) @lv
label: له شخص مرمم لمفردة @ar
label: 有单件的修复者个人 @zh-hans
sub property of: a pour agent restaurateur d’un item
sub property of: a pour personne modificatrice
definition: Bir kopyayı, orijinal durumuna mümkün olduğunca yakın bir duruma getirerek bozulmasını telafi etmeyi amaçlayan bir dizi teknik, yayın ve entelektüel prosedür dizisinden sorumlu olan bir kişiyle ilişkilendirir. @tr
definition: Correla un item alla persona responsabile dell'insieme delle procedure tecniche, di cura e intellettuali finalizzate al risarcimento di un item in seguito alla sua degradazione, riportandolo a uno stato il più possibile vicino alla condizione originale. @it
definition: Hozzákapcsol egy példányt egy személyhez, aki felelős technikai, szerkesztői és intellektuális eljárások összességéért, amelyek célja egy példány romlásának ellensúlyozása, amivel azt az eredeti állapotához a lehető legközelebb képesek visszahozni. @hu
definition: Liittää kappaleen henkilöön, joka vastaa teknisistä, toimituksellisista ja tiedollisista toimenpiteistä, joiden tarkoitus on palauttaa huonokuntoinen kappale mahdollisimman lähelle sen alkuperäistä kuntoa. @fi
definition: Met un item en relation avec une personne qui est responsable de l’ensemble des procédures techniques, éditoriales et intellectuelles destinées à compenser la dégradation d’un item en le ramenant à un état aussi près que possible de sa condition originelle.
definition: Relaciona un ítem amb una persona que és responsable del conjunt de procediments tècnics, editorials i intel·lectuals destinats a compensar la degradació d’un ítem retornant-lo a un estat que s’aproximi al màxim a la seva condició original. @ca
definition: Relateert een item aan een persoon die verantwoordelijk is voor de verzameling van technische, redactionele en intellectuele procedures gericht op het corrigeren van de achteruitgang van een item door het zo goed mogelijk terug te brengen tot de oorspronkelijke staat. @nl
definition: Relaterer et eksemplar til en person som har ansvar for de tekniske og intellektuelle metodene som brukes for å kompensere for nedbrytningen av et eksemplar ved å restaurere det til en tilstand som er så lik originaltilstanden som mulig. @no
definition: Relaterer et eksemplar til en person, som er ansvarlig for en række af tekniske, redaktionelle og intellektuelle procedurer, som forsøger at kompensere for nedslidningen af et eksemplar ved at føre det tilbage til en tilstand, der er så tæt som muligt på dets oprindelige tilstand. @da
definition: Relates an item to a person who is responsible for the set of technical, editorial, and intellectual procedures aimed at compensating for the degradation of an item by bringing it back to a state as close as possible to its original condition. @en
definition: Sasaista vienību ar personu, kura ir atbildīga par tehnisko, redakcionālo un intelektuālo procedūru kopumu, kuru mērķis ir kompensēt vienības pakāpenisko bojāeju, atgriežot to, cik vien iespējams, tuvu tās sākotnējam stāvoklim. @lv
definition: Seostab eksemplari isikuga, kes vastutab rea tehniliste, toimetuslike ja intellektuaalsete toimingute eest, mille eesmärk on taastada kahjustatud eksemplari seisund võimalikult originaalseisundi lähedaseks. @et
definition: Setzt ein Exemplar in Beziehung zu einer Person, die für die technischen, redaktionellen und intellektuellen Verfahren verantwortlich ist, die darauf abzielen, die Zersetzung eines Exemplars auszugleichen, indem es in einen Zustand zurückversetzt wird, der seiner ursprünglichen Beschaffenheit möglichst nahe kommt. @de
definition: يربط مفردة بشخص مسئول عن مجموعة الإجراءاتالفنية، والتحريرية، والفكرية التي تهدف إلى إصلاح التدهور الذي لحق بمفردة، وإعادتها إلى حالة أقرب ما تكون إلى حالتها الأصلية. @ar
definition: 将一个个人与负责为弥补单件的损毁而担负一系列技术、编辑和智力操作、使之尽可能恢复到原始状态的一个个人关联起来。 @zh-hans

a pour personne modificatrice
has element type: 2
toolkit definition: A person who makes changes to an item without creating a new manifestation. @en
toolkit definition: Een persoon die veranderingen aanbrengt aan een item zonder een nieuwe manifestatie te creëren. @nl
toolkit definition: Egy személy, aki új megjelenési létrehozása nélkül idéz elő változást a példányban. @hu
toolkit definition: Eine Person, die Änderungen an einem Exemplar vornimmt, ohne eine neue Manifestation zu erstellen. @de
toolkit definition: En person som gjør endringer på et eksemplar uten å skape en ny manifestasjon. @no
toolkit definition: Henkilö, joka tekee muutoksia kappaleeseen luomatta uutta manifestaatiota. @fi
toolkit definition: Isik, kes muudab eksemplari, loomata uut kehastust. @et
toolkit definition: Person, som ændrer i et eksemplar uden at skabe en ny manifestation. @da
toolkit definition: Persona che apporta modifiche a un item senza creare una nuova manifestazione. @it
toolkit definition: Persona que fa canvis a un ítem sense crear una manifestació nova. @ca
toolkit definition: Persona, kura veikusi izmaiņas vienībā, neradot jaunu manifestāciju. @lv
toolkit definition: Personne qui apporte des modifications à un item sans créer une nouvelle manifestation.
toolkit definition: Yeni bir gösterim yaratmadan bir kopya üzerinde değişiklik yapan kişi. @tr
toolkit definition: شخص يقوم بإجراء تغييرات على مفردة دون أن ينشئ تجسيدة جديدة. @ar
toolkit definition: 对一个单件作修改而不创建一个新的载体表现的一个个人 @zh-hans
toolkit label: Bearbeiterin/Bearbeiter eines Exemplars (Person) @de
toolkit label: Dönüştüren kişi @tr
toolkit label: bewerker-persoon @nl
toolkit label: modificatore persona @it
toolkit label: modificētājs (persona) @lv
toolkit label: modifier person @en
toolkit label: muokkaaja (henkilö) @fi
toolkit label: muutja (isik) @et
toolkit label: módosító személye: @hu
toolkit label: person, som er tilpasser @da
toolkit label: persona modificadora @ca
toolkit label: personne modificatrice
toolkit label: tilpasser (person) @no
toolkit label: شخص مُعدِّل @ar
toolkit label: 修改者个人 @zh-hans
has subproperty: a pour dédicateur d’un item
has subproperty: a pour annotateur
has subproperty: a pour signataire autographe
has subproperty: a pour personne relieuse
has subproperty: a pour personne enlumineuse
has subproperty: a pour personne restauratrice d’un item
has subproperty: P40112
lexical alias: modifierPerson.en
status: Published
type: Property
domain: C10003
label: düzenleyici kişisi ile ilişkilidir @tr
label: ha come modificatore persona @it
label: har person, som er tilpasser @da
label: har tilpasser (person) @no
label: has modifier person @en
label: hat Bearbeiterin/Bearbeiter eines Exemplars (Person) @de
label: heeft bewerker-persoon @nl
label: modificētājs (persona) @lv
label: muokkaaja (henkilö) @fi
label: muutja (isik) @et
label: módosító személye a következő: @hu
label: té com a persona modificadora @ca
label: له شخص مُعدِّل @ar
label: 有修改者个人 @zh-hans
sub property of: a pour personne en relation avec un item
sub property of: a pour agent modificateur
definition: Bir kopyayı, yeni bir gösterim oluşturmadan bir kopyada değişiklik yapan bir kişiyle ilişkilendirir. @tr
definition: Correla un item alla persona che apporta modifiche a un item senza creare una nuova manifestazione. @it
definition: Hozzákapcsol egy példányt egy személyhez, aki új megjelenési létrehozása nélkül idéz elő változást a példányban. @hu
definition: Liittää kappaleen henkilöön, joka tekee muutoksia kappaleeseen luomatta uutta manifestaatiota. @fi
definition: Met un item en relation avec une personne qui apporte des modifications à un item sans créer une nouvelle manifestation.
definition: Relaciona un ítem amb una persona que fa canvis a un ítem sense crear una manifestació nova. @ca
definition: Relateert een item aan een persoon die veranderingen aanbrengt aan een item zonder een nieuwe manifestatie te creëren. @nl
definition: Relaterer et eksemplar til en person som gjør endringer på et eksemplar uten å skape en ny manifestasjon. @no
definition: Relaterer et eksemplar til en person, som ændrer i et eksemplar uden at skabe en ny manifestation. @da
definition: Relates an item to a person that makes changes to an item without creating a new manifestation. @en
definition: Sasaista vienību ar personu, kura veikusi izmaiņas vienībā, neradot jaunu manifestāciju. @lv
definition: Seostab eksemplari isikuga, kes muudab eksemplari, loomata uut kehastust. @et
definition: Setzt ein Exemplar in Beziehung zu einer Person, die Änderungen an einem Exemplar vornimmt, ohne eine neue Manifestation zu erstellen. @de
definition: يربط مفردة بشخص يقوم بإجراء تغييرات على مفردة دون أن ينشئ تجسيدة جديدة. @ar
definition: 将一个单件与对一个单件作修改而不创建一个新的载体表现的一个个人关联起来。 @zh-hans

a pour agent collectif dédicataire d’un item
has element type: 2
toolkit definition: A collective agent to whom an item is dedicated. @en
toolkit definition: Agent collectif à qui un item est dédié.
toolkit definition: Agent col·lectiu a qui es dedica un ítem. @ca
toolkit definition: Agente collettivo al quale un item è dedicato. @it
toolkit definition: Bir kopyanın ithaf edildiği kolektif bir temsilci. @tr
toolkit definition: Een collectieve actor aan wie een item is opgedragen. @nl
toolkit definition: Egy kollektív ágens, amelynek a példányt dedikálják. @hu
toolkit definition: Ein gemeinschaftlicher Akteur, dem ein Exemplar gewidmet ist. @de
toolkit definition: En kollektiv agent som et eksemplar er dedisert til. @no
toolkit definition: Grupa, kam ir veltīta vienība. @lv
toolkit definition: Kollektiiv, kellele eksemplar on pühendatud. @et
toolkit definition: Kollektiv agent, som et eksemplar er tilegnet. @da
toolkit definition: Yhteistoimija, jolle kappale on omistettu. @fi
toolkit definition: وكيل جماعي أُهديت إليه مفردة. @ar
toolkit definition: 一个单件被题献给的一个集体行为者 @zh-hans
toolkit label: Widmungsempfängerin/Widmungsempfänger eines Exemplars (Gemeinschaftlicher Akteur) @de
toolkit label: agent collectif dédicataire d’un item
toolkit label: agent col·lectiu dedicatari d’un ítem @ca
toolkit label: agente collettivo dedicatario di item @it
toolkit label: dedicatee collective agent of item @en
toolkit label: eksemplari pühenduse saaja (kollektiiv) @et
toolkit label: kappaleen omistuksen kohde (yhteistoimija) @fi
toolkit label: kollektiv agent, som er tilegnet af eksemplar @da
toolkit label: kopyanın adandığı kolektif temsilci @tr
toolkit label: opgedragen-collectieve actor van item @nl
toolkit label: példány dedikált kollektív ágense: @hu
toolkit label: tilegnet kollektiv agent for eksemplar @no
toolkit label: veltījumvienība grupai @lv
toolkit label: وكيل جماعي مُهدى إليه مفردة @ar
toolkit label: 单件的被题献者集体行为者 @zh-hans
has subproperty: a pour collectivité dédicataire d’un item
has subproperty: a pour famille dédicataire d’un item
has subproperty: P40113
lexical alias: dedicateeCollectiveAgentOfItem.en
status: Published
type: Property
domain: C10003
label: dedikált kollektív ágense a következő: @hu
label: eksemplari pühenduse saaja (kollektiiv) @et
label: ha come dedicatario agente collettivo di item @it
label: har kollektiv agent, som er tilegnet af eksemplar @da
label: har tilegnet kollektiv agent for eksemplar @no
label: has dedicatee collective agent of item @en
label: hat Widmungsempfängerin/Widmungsempfänger eines Exemplars (Gemeinschaftlicher Akteur) @de
label: heeft opgedragene-collectieve actor van item @nl
label: kappaleen omistuksen kohde (yhteistoimija) @fi
label: kopyanın ithaf edilen kolektif temsilcisi ile ilişkilidir @tr
label: té com a agent col·lectiu dedicatari d’un ítem @ca
label: veltījumvienība grupai @lv
label: له وكيل جماعي مُهدى إليه مفردة @ar
label: 有单件的被题献者集体行为者 @zh-hans
sub property of: a pour agent dédicataire d’un item
sub property of: a pour agent collectif en relation avec un item
definition: Bir kopyayı, bir kopyanın ithaf edildiği kolektif bir temsilciyle ilişkilendirir. @tr
definition: Correla un item a un agente collettivo al quale un item è dedicato. @it
definition: Hozzákapcsol egy példányt egy kollektív ágenshez, amelynek a példányt dedikálják. @hu
definition: Liittää kappaleen yhteistoimijaan, jolle kappale on omistettu. @fi
definition: Met un item en relation avec un agent collectif à qui un item est dédié.
definition: Relaciona un ítem amb un agent col·lectiu a qui es dedica un ítem. @ca
definition: Relateert een item aan een collectieve actor aan wie een item is opgedragen. @nl
definition: Relaterer et eksemplar til en kollektiv agent som et eksemplar er dedisert til. @no
definition: Relaterer et eksemplar til en kollektiv agent, som et eksemplar er tilegnet. @da
definition: Relates an item to a collective agent to whom an item is dedicated. @en
definition: Sasaista vienību ar grupu, kam ir veltīta vienība. @lv
definition: Seostab eksemplari kollektiiviga, kellele eksemplar on pühendatud. @et
definition: Setzt ein Exemplar in Beziehung zu einem gemeinschaftlichen Akteur, dem ein Exemplar gewidmet ist. @de
definition: يربط مفردة بوكيل جماعي أُهديت اليه مفردة. @ar
definition: 将一个单件与一个单件被题献给的一个集体行为者关联起来。 @zh-hans

a pour agent collectif relieur
has element type: 2
toolkit definition: A collective agent who binds an item. @en
toolkit definition: Agent collectif qui relie un item.
toolkit definition: Agent col·lectiu que enquaderna un ítem. @ca
toolkit definition: Agente collettivo che rilega un item. @it
toolkit definition: Bir kopyayı ciltleyen kolektif temsilci @tr
toolkit definition: Een collectieve actor die een item bindt. @nl
toolkit definition: Egy kollektív ágens, amely beköt egy példányt. @hu
toolkit definition: Ein gemeinschaftlicher Akteur, der ein Exemplar bindet. @de
toolkit definition: En kollektiv agent som binder inn et eksemplar. @no
toolkit definition: Grupa, kas ir iesējusi vienību. @lv
toolkit definition: Kollektiiv, kes on eksemplari köitnud. @et
toolkit definition: Kollektiv agent, som indbinder et eksemplar. @da
toolkit definition: Yhteistoimija, joka sitoo kappaleen. @fi
toolkit definition: وكيل جامع يجلد مفردة. @ar
toolkit definition: 装订单件的一个集体行为者 @zh-hans
toolkit label: Buchbinderin/Buchbinder (Gemeinschaftlicher Akteur) @de
toolkit label: agent collectif relieur
toolkit label: agent col·lectiu enquadernador @ca
toolkit label: binder collective agent @en
toolkit label: binder-collectieve actor @nl
toolkit label: bokbinder (kollektiv agent) @no
toolkit label: ciltleyici kolektif temsilci @tr
toolkit label: grāmatsējējs (grupa) @lv
toolkit label: kollektiv agent, som er bogbinder @da
toolkit label: köitja (kollektiiv) @et
toolkit label: könyvkötő kollektív ágense: @hu
toolkit label: rilegatore agente collettivo @it
toolkit label: sitoja (yhteistoimija) @fi
toolkit label: وكيل جماعي مسئول عن التجليد @ar
toolkit label: 装订者集体行为者 @zh-hans
has subproperty: a pour collectivité relieuse
has subproperty: a pour famille relieuse
has subproperty: P40114
lexical alias: binderCollectiveAgent.en
status: Published
type: Property
domain: C10003
label: ciltleyen kolektif temsilci ile ilişkilidir @tr
label: grāmatsējējs (grupa) @lv
label: har bokbinder (kollektiv agent) @no
label: har kollektiv agent, som er bogbinder @da
label: has binder collective agent @en
label: hat Buchbinderin/Buchbinder (Gemeinschaftlicher Akteur) @de
label: ha come rilegatore agente collettivo @it
label: heeft binder-collectieve actor @nl
label: köitja (kollektiiv) @et
label: könyvkötő kollektív ágense a következő: @hu
label: sitoja (yhteistoimija) @fi
label: té com a agent col·lectiu enquadernador @ca
label: له وكيل جماعي مسئول عن التجليد @ar
label: 有装订者集体行为者 @zh-hans
sub property of: a pour agent relieur
sub property of: a pour agent collectif modificateur
definition: Bir kopyayı, bir kopyayı ciltleyen kolektif bir temsilciyle ilişkilendirir. @tr
definition: Correla un item a un agente collettivo che rilega un item. @it
definition: Hozzákapcsol egy példányt egy kollektív ágenshez, amely beköt egy példányt. @hu
definition: Liittää kappaleen yhteistoimijaan, joka sitoo kappaleen. @fi
definition: Met un item en relation avec un agent collectif qui relie un item.
definition: Relaciona un ítem amb un agent col·lectiu que enquaderna un ítem. @ca
definition: Relateert een item aan een collectieve actor die een item bindt. @nl
definition: Relaterer et eksemplar til en kollektiv agent som binder inn et eksemplar. @no
definition: Relaterer et eksemplar til en kollektiv agent, som indbinder et eksemplar. @da
definition: Relates an item to a collective agent who binds an item. @en
definition: Sasaista vienību ar grupu, kas ir iesējusi vienību. @lv
definition: Seostab eksemplari kollektiiviga, kes on eksemplari köitnud. @et
definition: Setzt ein Exemplar in Beziehung zu einem gemeinschaftlichen Akteur, der ein Exemplar bindet. @de
definition: يربط مفردة بوكيل جماعي يجلد مفردة. @ar
definition: 将一个单件与装订单件的一个集体行为者关联起来。 @zh-hans

a pour agent collectif conservateur
has element type: 2
toolkit definition: A collective agent who conceives or manages the aggregation of an item in an exhibition or collection. (Deprecated) @en
toolkit definition: Agent collectif qui conçoit ou gère l’agrégation d’un item dans une exposition ou une collection.
toolkit definition: Agent col·lectiu que concep o gestiona l’agregació d’un ítem en una exposició o en una col·lecció. @ca
toolkit definition: Agente collettivo che concepisce o gestisce l'aggergazione di un item in una mostra o collezione. @it
toolkit definition: Een collectieve actor die de samenstelling bedenkt of beheert van een item in een tentoonstelling of collectie. @nl
toolkit definition: Egy kollektív ágens, amely kigondolja vagy kezeli egy példány begyűjtését egy kiállítás keretébe vagy egy gyűjteménybe. @hu
toolkit definition: Ein gemeinschaftlicher Akteur, der die Aggregation eines Exemplars in einer Ausstellung oder Sammlung konzipiert oder organisiert @de
toolkit definition: En kollektiv agent som har idéen til eller håndterer innsamlingen av et eksemplar i en utstilling eller samling. @no
toolkit definition: Grupa, kas iecer un realizē vienības iekļaušanu izstādē vai kolekcijā. @lv
toolkit definition: Kollektiiv, kes kavandab või korraldab eksemplari liitmise näituse või koguga. @et
toolkit definition: Kollektiv agent, som udtænker eller administrerer samlingen af et eksemplar til en udstilling eller samling. @da
toolkit definition: Yhteistoimija, joka saa aikaan ja hallinnoi näyttelyn tai kokoelman kappaleaggregaatiota. @fi
toolkit definition: وكيل جماعي يطرح تجميعة لمفردة في معرض، أو في مجموعة أو يديرها. @ar
toolkit label: Kuratorin/Kurator (Gemeinschaftlicher Akteur) @de
toolkit label: agent collectif conservateur
toolkit label: agent col·lectiu conservador @ca
toolkit label: curator collective agent (Deprecated) @en
toolkit label: curator-collectieve actor @nl
toolkit label: curatore agente collettivo @it
toolkit label: kollektiv agent, som er kurator @da
toolkit label: kuraator (kollektiiv) @et
toolkit label: kuraattori (yhteistoimija) @fi
toolkit label: kurator (kollektiv agent) @no
toolkit label: kurators (grupa) @lv
toolkit label: kurátor kollektív ágense: @hu
toolkit label: وكيل جماعي أمين متحف @ar
has subproperty: a pour agent collectif collectionneur
has subproperty: a pour agent collectif catalogueur d’une collection de ressources
has subproperty: a pour collectivité conservatrice
has subproperty: a pour famille conservatrice
has subproperty: P40115
lexical alias: curatorCollectiveAgent.en
status: Deprecated
type: Property
domain: C10003
label: har kollektiv agent, som er kurator @da
label: har kurator (kollektiv agent) @no
label: has curator collective agent (Deprecated) @en
label: hat Kuratorin/Kurator (Gemeinschaftlicher Akteur) @de
label: ha come curatore agente collettivo @it
label: heeft curator-collectieve actor @nl
label: kuraator (kollektiiv) @et
label: kuraattori (yhteistoimija) @fi
label: kurators (grupa) @lv
label: kurátor kollektív ágense a következő: @hu
label: té com a agent col·lectiu conservador @ca
label: له وكيل جماعي أمين متحف @ar
sub property of: a pour agent conservateur
sub property of: a pour agent collectif en relation avec un item
definition: Correla un item a un agente collettivo che concepisce o gestisce l'aggregazione di una mostra o collezione. @it
definition: Hozzákapcsol egy példányt egy kollektív ágenshez, amely kigondolja vagy kezeli egy példány begyűjtését egy kiállítás keretébe vagy egy gyűjteménybe. @hu
definition: Liittää kappaleen yhteistoimijaan, joka saa aikaan ja hallinnoi näyttelyn tai kokoelman kappaleaggregaatiota. @fi
definition: Met un item en relation avec un agent collectif qui conçoit ou gère l’agrégation d’un item dans une exposition ou une collection.
definition: Relaciona un ítem amb un agent col·lectiu que concep o gestiona l’agregació d’un ítem en una exposició o en una col·lecció. @ca
definition: Relateert een item aan een collectieve actor die de samenstelling bedenkt of beheert van een item in een tentoonstelling of collectie. @nl
definition: Relaterer et eksemplar til en kollektiv agent som har idéen til eller håndterer innsamlingen av et eksemplar i en utstilling eller samling. @no
definition: Relaterer et eksemplar til en kollektiv agent, som udtænker eller administrerer samlingen af et eksemplar til en udstilling eller samling. @da
definition: Relates an item to a collective agent who conceives or manages the aggregation of an item in an exhibition or collection. (Deprecated) @en
definition: Sasaista vienību ar grupu, kas iecer un realizē vienības iekļaušanu izstādē vai kolekcijā. @lv
definition: Seostab eksemplari kollektiiviga, kes kavandab või korraldab eksemplari liitmise näituse või koguga. @et
definition: Setzt ein Exemplar in Beziehung zu einem gemeinschaftlichen Akteur, der die Aggregation eines Exemplars in einer Ausstellung oder Sammlung konzipiert oder organisiert @de
definition: يربط مفردة بوكيل جماعي يطرح تجميعة لمفردة في معرض، أو في مجموعة أو يديرها. @ar

a pour agent collectif enlumineur
has element type: 2
toolkit definition: A collective agent who decorates a specific item using precious metals or colour, often with elaborate designs and motifs. @en
toolkit definition: Agent collectif qui orne un item spécifique en utilisant des métaux précieux ou de la couleur, souvent avec des dessins et des motifs élaborés.
toolkit definition: Agent col·lectiu que decora un ítem concret amb metalls preciosos o amb color, sovint amb dissenys i motius elaborats. @ca
toolkit definition: Agente collettivo che decora uno specifico item utilizzando metalli o colori preziosi, spesso con progetti e motivi elaborati. @it
toolkit definition: Belirli bir kopyayı değerli metaller veya renkler kullanarak, genellikle özenle hazırlanmış tasarımlar ve motiflerle süsleyen kolektif bir temsilci. @tr
toolkit definition: Een collectieve actor die een specifiek item decoreert met edelmetalen of kleur, vaak met uitgebreide ontwerpen en motieven. @nl
toolkit definition: Egy kollektív ágens, amely egy adott példányt nemesfémekkel vagy színekkel díszít, gyakran gondosan kidolgozott kivitelezéssel és motívumok használával. @hu
toolkit definition: Ein gemeinschaftlicher Akteur, der ein bestimmtes Exemplar durch Edelmetalle oder Farben, häufig mit kunstvollen Mustern und Motiven, (aus-)gestaltet. @de
toolkit definition: En kollektiv agent som dekorerer et bestemt eksemplar med edle metaller eller farger, gjerne med intrikate former og motiver. @no
toolkit definition: Grupa, kas izgreznojusi konkrēto vienību, izmantojot krāsu un/vai dārgmetālus, bieži ar izsmalcinātiem un filigrāniem zīmējumiem, burtiem un motīviem. @lv
toolkit definition: Kollektiiv, kes kaunistab väärismetallide ja värvidega üksikut eksemplari, sageli keeruliste kujundite ja motiividega. @et
toolkit definition: Kollektiv agent, som udsmykker et særligt eksemplar med ædelmetal eller farve, ofte med detaljerige mønstre og motiver. @da
toolkit definition: Yhteistoimija, joka koristelee yksittäisen kappaleen käyttäen jalometalleja tai värejä, usein yksityiskohtaisissa kuvioissa tai motiiveissa. @fi
toolkit definition: وكيل جماعي يزين مفردة محددة باستخدام معادن ثمينة أو ألوان، غالبًا بتصاميم وزخارف منمقة. @ar
toolkit definition: 对特定单件用贵重的金属或色彩（通常有精心的设计和图案）进行装饰的一个集体行为者 @zh-hans
toolkit label: Illuminatorin/Illuminator (Gemeinschaftlicher Akteur) @de
toolkit label: agent collectif enlumineur
toolkit label: agent col·lectiu il·luminador @ca
toolkit label: illuminator (kollektiv agent) @no
toolkit label: illuminator collective agent @en
toolkit label: illumineerija (kollektiiv) @et
toolkit label: illuminoinnin tekijä (yhteistoimija) @fi
toolkit label: illuminátor kollektív ágense: @hu
toolkit label: iluminators (grupa) @lv
toolkit label: kollektiv agent, som er illuminator @da
toolkit label: miniatore agente collettivo @it
toolkit label: tezhip sanatçısı kolektif temsilcisi ile ilişkilidir @tr
toolkit label: verluchter-collectieve actor @nl
toolkit label: وكيل جماعي مزخرف @ar
toolkit label: 彩饰者集体行为者 @zh-hans
has subproperty: a pour collectivité enlumineuse
has subproperty: a pour famille enlumineuse
has subproperty: P40116
lexical alias: illuminatorCollectiveAgent.en
status: Published
type: Property
domain: C10003
label: ha come miniatore agente collettivo @it
label: har illuminator (kollektiv agent) @no
label: har kollektiv agent, som er illuminator @da
label: has illuminator collective agent @en
label: hat Illuminatorin/Illuminator (Gemeinschaftlicher Akteur) @de
label: heeft verluchter-collectieve actor @nl
label: illumineerija (kollektiiv) @et
label: illuminoinnin tekijä (yhteistoimija) @fi
label: illuminátor kollektív ágense a következő: @hu
label: iluminators (grupa) @lv
label: tezhip sanatçısı kolektif temsilcisi ile ilişkilidir @tr
label: té com a agent col·lectiu il·luminador @ca
label: له وكيل جماعي مزخرف @ar
label: 有彩饰者集体行为者 @zh-hans
sub property of: a pour agent enlumineur
sub property of: a pour agent collectif modificateur
definition: Bir kopyayı, belirli bir kopyayı değerli metaller veya renkler kullanarak, genellikle ayrıntılı tasarımlar ve motiflerle süsleyen kolektif bir temsilciyle ilişkilendirir. @tr
definition: Correla un item a un agente collettivo che decora uno specifico item utilizzando metalli o colori preziosi, spesso con progetti e motivi elaborati. @it
definition: Hozzákapcsol egy példányt egy kollektív ágenshez, amely egy adott példányt nemesfémekkel vagy színekkel díszít, gyakran gondosan kidolgozott kivitelezéssel és motívumok használával. @hu
definition: Liittää kappaleen yhteistoimijaan, joka koristelee yksittäisen kappaleen käyttäen jalometalleja tai värejä, usein yksityiskohtaisissa kuvioissa tai motiiveissa. @fi
definition: Met un item en relation avec un agent collectif qui orne un item spécifique en utilisant des métaux précieux ou de la couleur, souvent avec des dessins et des motifs élaborés.
definition: Relaciona un ítem amb un agent col·lectiu que decora un ítem concret amb metalls preciosos o amb color, sovint amb dissenys i motius elaborats. @ca
definition: Relateert een item aan een collectieve actor die een specifiek item decoreert met edelmetalen of kleur, vaak met uitgebreide ontwerpen en motieven. @nl
definition: Relaterer et eksemplar til en kollektiv agent som dekorerer et bestemt eksemplar med edle metaller eller farger, gjerne med intrikate former og motiver. @no
definition: Relaterer et eksemplar til en kollektiv agent, som udsmykker et særligt eksemplar med ædelmetal eller farve, ofte med detaljerige mønstre og motiver. @da
definition: Relates an item to a collective agent who decorates a specific item using precious metals or colour, often with elaborate designs and motifs. @en
definition: Sasaista vienību ar grupu, kas izgreznojusi konkrēto vienību, izmantojot krāsu un/vai dārgmetālus, bieži ar izsmalcinātiem un filigrāniem zīmējumiem, burtiem un motīviem. @lv
definition: Seostab eksemplari kollektiiviga, kes kaunistab väärismetallide ja värvidega üksikut eksemplari, sageli keeruliste kujundite ja motiividega. @et
definition: Setzt ein Exemplar in Beziehung zu einem gemeinschaftlichen Akteur, der ein bestimmtes Exemplar durch Edelmetalle oder Farben, häufig mit kunstvollen Mustern und Motiven, (aus-)gestaltet. @de
definition: يربط مفردة بوكيل جماعي يزين مفردة محددة باستخدام معادن ثمينة أو ألوان، غالبًا بتصاميم وزخارف منمقة. @ar
definition: 将一个单件与对特定单件用贵重的金属或色彩（通常有精心的设计和图案）进行装饰的一个集体行为者关联起来。 @zh-hans

a pour agent collectif propriétaire actuel
has element type: 2
toolkit definition: A collective agent who has current legal possession of an item. @en
toolkit definition: Agent collectif qui possède actuellement et légalement un item.
toolkit definition: Agent col·lectiu que té la propietat legal actual d’un ítem. @ca
toolkit definition: Agente collettivo che detiene l'attuale proprietà giuridica di un item. @it
toolkit definition: Bir kopyanın mevcut yasal mülkiyetine sahip olan kolektif bir temsilci. @tr
toolkit definition: Een collectieve actor die huidig wettelijk bezit heeft van een item. @nl
toolkit definition: Egy kollektív ágens, amely jelenleg törvényesen birtokol egy példányt. @hu
toolkit definition: Ein gemeinschaftlicher Akteur, der derzeit im rechtmäßigen Besitz eines Exemplars ist. @de
toolkit definition: En kollektiv agent som for tiden er den rettmessige eieren av et eksemplar. @no
toolkit definition: Grupa, kas ir vienības pašreizējais likumīgais īpašnieks. @lv
toolkit definition: Kollektiiv, kellele praegu õiguspäraselt eksemplar kuulub. @et
toolkit definition: Kollektiv agent, som p.t. er i lovlig besiddelse af et eksemplar. @da
toolkit definition: Yhteistoimija, joka tällä hetkellä laillisesti omistaa kappaleen. @fi
toolkit definition: وكيل جماعي لديه حاليا الملكية القانونية لمفردة. @ar
toolkit definition: 拥有对一个单件当前法定所有权的一个集体行为者 @zh-hans
toolkit label: Gegenwärtige Eigentümerin/Gegenwärtiger Eigentümer (Gemeinschaftlicher Akteur) @de
toolkit label: agent collectif propriétaire actuel
toolkit label: agent col·lectiu propietari actual @ca
toolkit label: current owner collective agent @en
toolkit label: huidige eigenaar-collectieve actor @nl
toolkit label: jelenlegi tulajdonos kollektív ágense: @hu
toolkit label: kollektiv agent, som er nuværende ejer @da
toolkit label: nykyinen omistaja (yhteistoimija) @fi
toolkit label: nåværende eier (kollektiv agent) @no
toolkit label: pašreizējais īpašnieks (grupa) @lv
toolkit label: praegune omanik (kollektiiv) @et
toolkit label: proprietario attuale agente collettivo @it
toolkit label: şu anki sahibi olan kolektif temsilci @tr
toolkit label: وكيل جماعي مالك حالي @ar
toolkit label: 当前拥有者集体行为者 @zh-hans
has subproperty: a pour agent collectif déposant
has subproperty: a pour collectivité propriétaire actuelle
has subproperty: a pour famille propriétaire actuelle
has subproperty: P40117
lexical alias: currentOwnerCollectiveAgent.en
status: Published
type: Property
domain: C10003
label: ha come proprietario attuale agente collettivo @it
label: har kollektiv agent, som er nuværende ejer @da
label: har nåværende eier (kollektiv agent) @no
label: has current owner collective agent @en
label: hat gegenwärtige Eigentümerin/gegenwärtigen Eigentümer (Gemeinschaftlicher Akteur) @de
label: heeft huidige eigenaar-collectieve actor @nl
label: jelenlegi tulajdonos kollektív ágense a következő: @hu
label: mevcut sahip kolektif temsilcisi ile ilişkilidir @tr
label: nykyinen omistaja (yhteistoimija) @fi
label: pašreizējais īpašnieks (grupa) @lv
label: praegune omanik (kollektiiv) @et
label: té com a agent col·lectiu propietari actual @ca
label: له وكيل جماعي مالك حالي @ar
label: 有当前拥有者集体行为者 @zh-hans
sub property of: a pour agent propriétaire actuel
sub property of: a pour agent collectif propriétaire
definition: Bir kopyayı, bir kopyanın mevcut yasal mülkiyetine sahip olan kolektif bir temsilciyle ilişkilendirir. @tr
definition: Correla un item a un agente collettivo che detiene l'attuale proprietà giuridica di un item. @it
definition: Hozzákapcsol egy példányt egy kollektív ágenshez, amely jelenleg törvényesen birtokol egy példányt. @hu
definition: Liittää kappaleen yhteistoimijaan, joka tällä hetkellä laillisesti omistaa kappaleen. @fi
definition: Met un item en relation avec un agent collectif qui possède actuellement et légalement un item.
definition: Relaciona un ítem amb un agent col·lectiu que té la propietat legal actual d’un ítem. @ca
definition: Relateert een item aan een collectieve actor die huidig wettelijk bezit heeft van een item. @nl
definition: Relaterer et eksemplar til en kollektiv agent som for tiden er den rettmessige eieren av et eksemplar. @no
definition: Relaterer et eksemplar til en kollektiv agent, som p.t. er i lovlig besiddelse af et eksemplar. @da
definition: Relates an item to a collective agent who has current legal possession of an item. @en
definition: Sasaista vienību ar grupu, kas ir vienības pašreizējais likumīgais īpašnieks. @lv
definition: Seostab eksemplari kollektiiviga, kellele praegu õiguspäraselt eksemplar kuulub. @et
definition: Setzt ein Exemplar in Beziehung zu einem gemeinschaftlichen Akteur, der derzeit im rechtmäßigen Besitz eines Exemplars ist. @de
definition: يربط مفردة بوكيل جماعي لديه حاليا الملكية القانونية لمفردة. @ar
definition: 将一个单件与拥有对一个单件当前法定所有权的一个集体行为者关联起来。 @zh-hans

a pour ancien agent collectif propriétaire
has element type: 2
toolkit definition: A collective agent who has former legal possession of an item. @en
toolkit definition: Agent collectif qui a auparavant possédé légalement un item.
toolkit definition: Agent col·lectiu que té la propietat legal anterior d’un ítem. @ca
toolkit definition: Agente collettivo che ha detenuto in precedenza la proprietà giuridca di un item. @it
toolkit definition: Bir kopyanın daha önce yasal mülkiyetine sahip olan kolektif bir temsilci. @tr
toolkit definition: Een collectieve actor die voormalig wettelijk bezit had van een item. @nl
toolkit definition: Egy kollektív ágens, amely korábban törvényesen birtokolt egy példányt. @hu
toolkit definition: Ein gemeinschaftlicher Akteur, der früher im rechtmäßigen Besitz eines Exemplars war. @de
toolkit definition: En kollektiv agent som tidligere var den rettmessige eieren av et eksemplar. @no
toolkit definition: Grupa, kam vienība iepriekš ir bijusi juridiskā īpašumā. @lv
toolkit definition: Kollektiiv, kellele eksemplar varem õiguspäraselt kuulus. @et
toolkit definition: Kollektiv agent, som tidligere har været i lovlig besiddelse af et eksemplar. @da
toolkit definition: Yhteistoimija, joka on aiemmin laillisesti omistanut kappaleen. @fi
toolkit definition: وكيل جماعي لديه سابقا الملكية القانونية لمفردة. @ar
toolkit definition: 拥有对一个单件先前法定所有权的一个集体行为者 @zh-hans
toolkit label: Frühere Eigentümerin/früherer Eigentümer (Gemeinschaftlicher Akteur) @de
toolkit label: agent col·lectiu propietari anterior @ca
toolkit label: agrākais īpašnieks (grupa) @lv
toolkit label: aiempi omistaja (yhteistoimija) @fi
toolkit label: ancien agent collectif propriétaire
toolkit label: endine omanik (kollektiiv) @et
toolkit label: former owner collective agent @en
toolkit label: kollektiv agent, som er tidligere ejer @da
toolkit label: korábbi tulajdonos kollektív ágense: @hu
toolkit label: proprietario precedente agente collettivo @it
toolkit label: tidligere eier (kollektiv agent) @no
toolkit label: voormalige eigenaar-collectieve actor @nl
toolkit label: önceki sahibi olan kolektif temsilci @tr
toolkit label: وكيل جماعي مالك سابق @ar
toolkit label: 先前拥有者集体行为者 @zh-hans
has subproperty: a pour agent collectif donateur
has subproperty: a pour agent collectif vendeur
has subproperty: a pour ancienne collectivité propriétaire
has subproperty: a pour ancienne famille propriétaire
has subproperty: P40118
lexical alias: formerOwnerCollectiveAgent.en
status: Published
type: Property
domain: C10003
label: agrākais īpašnieks (grupa) @lv
label: aiempi omistaja (yhteistoimija) @fi
label: endine omanik (kollektiiv) @et
label: eski sahip kolektif temsilcisi ile ilişkilidir @tr
label: ha come proprietario precedente agente collettivo @it
label: har kollektiv agent, som er tidligere ejer @da
label: har tidligere eier (kollektiv agent) @no
label: has former owner collective agent @en
label: hat frühere Eigentümerin/früheren Eigentümer (Gemeinschaftlicher Akteur) @de
label: heeft voormalige eigenaar-collectieve actor @nl
label: korábbi tulajdonos kollektív ágense a következő: @hu
label: té com a agent col·lectiu propietari anterior @ca
label: له وكيل جماعي مالك سابق @ar
label: 有先前拥有者集体行为者 @zh-hans
sub property of: a pour ancien agent propriétaire
sub property of: a pour agent collectif propriétaire
definition: Bir kopyayı, bir kopyanın daha önce yasal mülkiyetine sahip olan bir kolektif temsilciyle ilişkilendirir. @tr
definition: Correla un item a un agente collettivo che ha detenuto in precedenza la proprietà giuridca di un item. @it
definition: Hozzákapcsol egy példányt egy testülethez, amely korábban törvényesen birtokolt egy példányt. @hu
definition: Liittää kappaleen yhteistoimijaan, joka on aiemmin laillisesti omistanut kappaleen. @fi
definition: Met un item en relation avec un agent collectif qui a auparavant possédé légalement un item.
definition: Relaciona un ítem amb un agent col·lectiu que té la propietat legal anterior d’un ítem. @ca
definition: Relateert een item aan een collectieve actor die voormalig wettelijk bezit had van een item. @nl
definition: Relaterer et eksemplar til en kollektiv agent som tidligere var den rettmessige eieren av et eksemplar. @no
definition: Relaterer et eksemplar til en kollektiv agent, som tidligere har været i lovlig besiddelse af et eksemplar. @da
definition: Relates an item to a collective agent who has former legal possession of an item. @en
definition: Sasaista vienību ar grupu, kam vienība iepriekš ir bijusi juridiskā īpašumā. @lv
definition: Seostab eksemplari kollektiiviga, kellele eksemplar varem õiguspäraselt kuulus. @et
definition: Setzt ein Exemplar in Beziehung zu einem gemeinschaftlichen Akteur, der früher im rechtmäßigen Besitz eines Exemplars war. @de
definition: يربط مفردة بوكيل جماعي لديه سابقا الملكية القانونية لمفردة. @ar
definition: 将一个单件与拥有对一个单件先前法定所有权的一个集体行为者关联起来。 @zh-hans

a pour agent collectif dépositaire
has element type: 2
toolkit definition: A collective agent who has legal custody of an item. @en
toolkit definition: Agent collectif à qui est confiée la garde légale d’un item.
toolkit definition: Agent col·lectiu que té la custodia legal d’un ítem. @ca
toolkit definition: Agente collettivo che detiene la custodia giuridica di un item. @it
toolkit definition: Bir kopyanın yasal velayetini elinde bulunduran kolektif bir temsilci. @tr
toolkit definition: Een collectieve actor die van rechtswege een item bewaart. @nl
toolkit definition: Egy kollektív ágen, amely egy példány törvényes megőrzője. @hu
toolkit definition: Ein gemeinschaftlicher Akteur, dem die rechtmäßige Verwahrung eines Exemplars obliegt. @de
toolkit definition: En kollektiv agent som har et eksemplar i lovlig forvaring. @no
toolkit definition: Grupa, kas likumīgi glabā vienību. @lv
toolkit definition: Kollektiiv, kelle õiguspärasel vastutaval hoiul eksemplar on. @et
toolkit definition: Kollektiv agent, som lovligt har et eksemplar i forvaring. @da
toolkit definition: Yhteistoimija, jolla on kappaleen laillinen säilyttämisoikeus. @fi
toolkit definition: وكيل جماعي لديه الوصاية القانونية على مفردة. @ar
toolkit definition: 对一个单件拥有合法保管权的一个集体行为者 @zh-hans
toolkit label: Verwahrerin/Verwahrer (Gemeinschaftlicher Akteur) @de
toolkit label: agent collectif dépositaire
toolkit label: agent col·lectiu dipositari @ca
toolkit label: curatele-collectieve actor @nl
toolkit label: custodian collective agent @en
toolkit label: depositario agente collettivo @it
toolkit label: kollektiv agent, som er forvalter @da
toolkit label: koruyucu kolektif temsilci @tr
toolkit label: letétkezelő kollektív ágense: @hu
toolkit label: oppbevarer (kollektiv agent) @no
toolkit label: pārvaldītājs (grupa) @lv
toolkit label: säilyttäjä (yhteistoimija) @fi
toolkit label: vastutav hoidja (kollektiiv) @et
toolkit label: وكيل جماعي وصى @ar
toolkit label: 保管者集体行为者 @zh-hans
has subproperty: a pour collectivité dépositaire
has subproperty: a pour famille dépositaire
has subproperty: P40119
lexical alias: custodianCollectiveAgent.en
status: Published
type: Property
domain: C10003
label: har kollektiv agent, som er forvalter @da
label: har oppbevarer (kollektiv agent) @no
label: has custodian collective agent @en
label: hat Verwahrerin/Verwahrer (Gemeinschaftlicher Akteur) @de
label: ha come depositario agente collettivo @it
label: heeft curatele-collectieve actor @nl
label: koruyucu kolektif temsilcisi ile ilişkilidir @tr
label: letétkezelő kollektív ágense a következő: @hu
label: pārvaldītājs (grupa) @lv
label: säilyttäjä (yhteistoimija) @fi
label: té com a agent col·lectiu dipositari @ca
label: vastutav hoidja (kollektiiv) @et
label: له وكيل جماعي وصي @ar
label: 有保管者集体行为者 @zh-hans
sub property of: a pour agent dépositaire
sub property of: a pour agent collectif en relation avec un item
definition: Bir kopyayı, bir kopyayı yasal velayetine sahip olan kolektif bir temsilciyle ilişkilendirir. @tr
definition: Correla un item a un agente collettivo che detiene la custodia giuridica di un item. @it
definition: Hozzákapcsol egy példányt egy kollektív ágenshez, amely egy példány törvényes megőrzője. @hu
definition: Liittää kappaleen yhteistoimijaan, jolla on kappaleen laillinen säilyttämisoikeus. @fi
definition: Met un item en relation avec un agent collectif à qui est confiée la garde légale d’un item.
definition: Relaciona un ítem amb un agent col·lectiu que té la custodia legal d’un ítem. @ca
definition: Relateert een item aan een collectieve actor die van rechtswege een item bewaart. @nl
definition: Relaterer et eksemplar til en kollektiv agent som har et eksemplar i lovlig forvaring. @no
definition: Relaterer et eksemplar til en kollektiv agent, som lovligt har et eksemplar i forvaring. @da
definition: Relates an item to a collective agent who has legal custody of an item. @en
definition: Sasaista vienību ar grupu, kas likumīgi glabā vienību. @lv
definition: Seostab eksemplari kollektiiviga, kelle õiguspärasel vastutaval hoiul eksemplar on. @et
definition: Setzt ein Exemplar in Beziehung zu einem gemeinschaftlichen Akteur, dem die rechtmäßige Verwahrung eines Exemplars obliegt. @de
definition: يربط مفردة بوكيل جماعي لديه الوصاية القانونية على مفردة. @ar
definition: 将一个单件与对一个单件拥有合法保管权的一个集体行为者关联起来。 @zh-hans

a pour agent collectif propriétaire
has element type: 2
toolkit definition: A collective agent who has current or former legal possession of an item. @en
toolkit definition: Agent collectif qui possède actuellement ou a auparavant possédé légalement un item.
toolkit definition: Agent col·lectiu que té la propietat legal actual o anterior d’un ítem. @ca
toolkit definition: Agente collettivo che detiene la proprietà giuridica di un item. @it
toolkit definition: Bir kopyanın mevcut veya eski yasal mülkiyetine sahip olan kolektif bir temsilci. @tr
toolkit definition: Een collectieve actor die huidig of voormalig wettelijk bezit heeft van een item. @nl
toolkit definition: Egy kollektív ágens, amely törvényesen birtokol egy példányt. @hu
toolkit definition: Ein gemeinschaftlicher Akteur, der gegenwärtig oder früher im rechtmäßigen Besitz eines Exemplars ist/war. @de
toolkit definition: En kollektiv agent som er den rettmessige eieren av et eksemplar. @no
toolkit definition: Grupa, kam ir vai ir bijušas likumīgas tiesības uz īpašumu. @lv
toolkit definition: Kollektiiv, kellele eksemplar praegu õiguspäraselt kuulub või varem kuulus. @et
toolkit definition: Kollektiv agent, som er i lovlig besiddelse af et eksemplar. @da
toolkit definition: Yhteistoimija, jolla on kappaleen nykyinen tai aiempi laillinen omistusoikeus. @fi
toolkit definition: وكيل جماعي لديه الملكية القانونية لمفردة. @ar
toolkit definition: 拥有对一个单件当前或先前法定所有权的一个集体行为者 @zh-hans
toolkit label: Eigentümerin/Eigentümer (Gemeinschaftlicher Akteur) @de
toolkit label: Sahip olan kolektif temsilci @tr
toolkit label: agent collectif propriétaire
toolkit label: agent col·lectiu propietari @ca
toolkit label: eier (kollektiv agent) @no
toolkit label: eigenaar-collectieve actor @nl
toolkit label: kollektiv agent, som er ejer @da
toolkit label: omanik (kollektiiv) @et
toolkit label: omistaja (yhteistoimija) @fi
toolkit label: owner collective agent @en
toolkit label: proprietario agente collettivo @it
toolkit label: tulajdonos kollektív ágense: @hu
toolkit label: īpašnieks (grupa) @lv
toolkit label: وكيل جماعي مالك @ar
toolkit label: 拥有者集体行为者 @zh-hans
has subproperty: a pour agent collectif propriétaire actuel
has subproperty: a pour ancien agent collectif propriétaire
has subproperty: a pour collectivité propriétaire
has subproperty: a pour famille propriétaire
has subproperty: P40120
lexical alias: ownerCollectiveAgent.en
status: Published
type: Property
domain: C10003
label: ha come proprietario agente collettivo @it
label: har eier (kollektiv agent) @no
label: har kollektiv agent, som er ejer @da
label: has owner collective agent @en
label: hat Eigentümerin/Eigentümer (Gemeinschaftlicher Akteur) @de
label: heeft eigenaar-collectieve actor @nl
label: omanik (kollektiiv) @et
label: omistaja (yhteistoimija) @fi
label: sahip kolektif temsilcisi ile ilişkilidir @tr
label: tulajdonos kollektív ágense a következő: @hu
label: té com a agent col·lectiu propietari @ca
label: īpašnieks (grupa) @lv
label: له وكيل جماعي مالك @ar
label: 有拥有者集体行为者 @zh-hans
sub property of: a pour agent propriétaire
sub property of: a pour agent collectif en relation avec un item
definition: Bir kopyayı, bir kopyanın şu anda veya daha önce yasal mülkiyetine sahip olan kolektif bir temsilciyle ilişkilendirir. @tr
definition: Correla un item a un agente collettivo che detiene la proprietà giuridica di un item. @it
definition: Hozzákapcsol egy példányt egy kollektív ágenshez, amely törvényesen birtokol egy példányt. @hu
definition: Liittää kappaleen yhteistoimijaan, jolla on kappaleen nykyinen tai aiempi laillinen omistusoikeus. @fi
definition: Met un item en relation avec un agent collectif qui possède actuellement ou a auparavant possédé légalement un item.
definition: Relaciona un ítem amb un agent col·lectiu que té la propietat legal actual o anterior d’un ítem. @ca
definition: Relateert een item aan een collectieve actor die huidig of voormalig wettelijk bezit heeft van een item. @nl
definition: Relaterer et eksemplar til en kollektiv agent som er den rettmessige eieren av et eksemplar. @no
definition: Relaterer et eksemplar til en kollektiv agent, som er i lovlig besiddelse af et eksemplar. @da
definition: Relates an item to a collective agent who has current or former legal possession of an item. @en
definition: Sasaista vienību ar grupu, kam ir vai ir bijušas likumīgas tiesības uz īpašumu. @lv
definition: Seostab eksemplari kollektiiviga, kellele eksemplar praegu õiguspäraselt kuulub või varem kuulus. @et
definition: Setzt ein Exemplar in Beziehung zu einem gemeinschaftlichen Akteur, der gegenwärtig oder früher im rechtmäßigen Besitz eines Exemplars ist/war. @de
definition: يربط مفردة بوكيل جماعي لديه الملكية القانونية لمفردة. @ar
definition: 将一个单件与拥有对一个单件当前或先前法定所有权的一个集体行为者关联起来。 @zh-hans

a pour agent collectif collectionneur
has element type: 2
toolkit definition: A collective agent who is a curator who brings together items from various sources that are arranged, described, or catalogued as a collection. (Deprecated) @en
toolkit definition: Agent collectif conservateur qui rassemble des items de diverses sources qui sont arrangés, décrits et catalogués comme une collection.
toolkit definition: Agent col·lectiu que és un conservador que aplega ítems de diverses fonts que s’arrangen, es descriuen o es cataloguen com una col·lecció. @ca
toolkit definition: Agente collettivo curatore che raccoglie item da varie fonti, che sono organizzati, descritti o catalogati come una collezione. @it
toolkit definition: Een collectieve actor die een curator is die items samenbrengt uit diverse bronnen die gerangschikt, beschreven of gecatalogiseerd zijn als een collectie. @nl
toolkit definition: Egy kurátor kollektív ágens, amely különböző forrásokból származó, gyűjteményként rendezett, leírt és katalogizált példányokat fog össze. @hu
toolkit definition: Eine Kuratorin/Ein Kurator (Gemeinschaftlicher Akteur), die/der Materialien aus unterschiedlichen Quellen zusammenträgt, die dann als Sammlung geordnet, beschrieben oder katalogisiert werden. @de
toolkit definition: En kollektiv agent som er en kurator som setter sammen eksemplarer fra ulike kilder og som er arrangert, beskrevet eller katalogisert som en samling. @no
toolkit definition: Grupa, kas apkopo vienības no dažādiem avotiem, kas ir sakārtotas, aprakstītas vai kataloģizētas kā kolekcija. @lv
toolkit definition: Kollektiiv, kes kuraatorina kogub eri allikatest kokku eksemplarid, mis korrastatakse, kirjeldatakse või kataloogitakse koguna. @et
toolkit definition: Kollektiv agent, som er kurator, som indsamler eksemplarer fra forskellige kilder, som bliver arrangeret, beskrevet eller katalogiseret som en samling. @da
toolkit definition: Kuraattorina toimiva yhteistoimija, joka kokoaa eri lähteistä järjestettävät, kuvailtavat ja luetteloitavat kappaleet kokoelmaksi. @fi
toolkit definition: وكيل هو أمين متحف يجمع مفردات معاً من مصادر مختلفة رتُبت، أو وُصفت، أو فُهرست كمجموعة. @ar
toolkit label: Sammlerin/Sammler (Gemeinschaftlicher Akteur) @de
toolkit label: agent collectif collectionneur
toolkit label: agent col·lectiu col·leccionista @ca
toolkit label: collector collective agent (Deprecated) @en
toolkit label: collezionista agente collettivo @it
toolkit label: kogu moodustaja (kollektiiv) @et
toolkit label: kokoelman muodostaja (yhteistoimija) @fi
toolkit label: kolekcionārs (grupa) @lv
toolkit label: kollektiv agent, som er samler @da
toolkit label: kollektor kollektív ágense: @hu
toolkit label: samler (kollektiv agent) @no
toolkit label: verzamelaar-collectieve actor @nl
toolkit label: وكيل جماعي جامع @ar
has subproperty: a pour collectivité collectionneuse
has subproperty: a pour famille collectionneuse
has subproperty: P40121
lexical alias: collectorCollectiveAgent.en
status: Deprecated
type: Property
domain: C10003
label: ha come collezionista agente collettivo @it
label: har kollektiv agent, som er samler @da
label: har samler (kollektiv agent) @no
label: has collector collective agent (Deprecated) @en
label: hat Sammlerin/Sammler (Gemeinschaftlicher Akteur) @de
label: heeft verzamelaar-collectieve actor @nl
label: kogu moodustaja (kollektiiv) @et
label: kokoelman muodostaja (yhteistoimija) @fi
label: kolekcionārs (grupa) @lv
label: kollektor kollektív ágense a következő: @hu
label: té com a agent col·lectiu col·leccionista @ca
label: له وكيل جماعي جامع @ar
sub property of: a pour agent collectionneur
sub property of: a pour agent collectif conservateur
definition: Correla un item all'agente collettivo curatore che raccoglie item da varie fonti, che sono organizzati, descritti o catalogati come una collezione. @it
definition: Hozzákapcsol egy példányt egy kurátor kollektív ágenshez, amely különböző forrásokból származó, gyűjteményként rendezett, leírt és katalogizált példányokat fog össze. @hu
definition: Liittää kappaleen kuraattorina toimivaan yhteistoimijaan, joka kokoaa eri lähteistä järjestettävät, kuvailtavat ja luetteloitavat kappaleet kokoelmaksi. @fi
definition: Met un item en relation avec un agent collectif conservateur qui rassemble des items de diverses sources qui sont arrangés, décrits et catalogués comme une collection.
definition: Relaciona un ítem amb un agent col·lectiu que és un conservador que aplega ítems de diverses fonts que s’arrangen, es descriuen o es cataloguen com una col·lecció. @ca
definition: Relateert een item aan een collectieve actor die een curator is die items samenbrengt uit diverse bronnen die gerangschikt, beschreven of gecatalogiseerd zijn als een collectie. @nl
definition: Relaterer et eksemplar til en kollektiv agent som er en kurator som setter sammen eksemplarer fra ulike kilder og som er arrangert, beskrevet eller katalogisert som en samling. @no
definition: Relaterer et eksemplar til en kollektiv agent, som er kurator, som indsamler eksemplarer fra forskellige kilder, som bliver arrangeret, beskrevet eller katalogiseret som en samling. @da
definition: Relates an item to a collective agent who is a curator who brings together items from various sources that are arranged, described, or catalogued as a collection. (Deprecated) @en
definition: Sasaista vienību ar grupu, kas apkopo vienības no dažādiem avotiem, kas ir sakārtotas, aprakstītas vai kataloģizētas kā kolekcija. @lv
definition: Seostab eksemplari kollektiiviga, kes kuraatorina kogub eri allikatest kokku eksemplarid, mis korrastatakse, kirjeldatakse või kataloogitakse koguna. @et
definition: Setzt ein Exemplar in Beziehung zu einer Kuratorin/einem Kurator (Gemeinschaftlicher Akteur), die/der Materialien aus unterschiedlichen Quellen zusammenträgt, die dann als Sammlung geordnet, beschrieben oder katalogisiert werden. @de
definition: يربط مفردة بوكيل هو أمين متحف يجمع مفردات معاً من مصادر مختلفة رتُبت، أو وُصفت، أو فُهرست كمجموعة. @ar

a pour agent collectif catalogueur d’une collection de ressources
has element type: 2
toolkit definition: A collective agent who is a curator who lists or inventories items in a collection aggregate. (Deprecated) @en
toolkit definition: Agent collectif conservateur qui dresse une liste ou un inventaire des items faisant partie d’un agrégat par regroupement.
toolkit definition: Agent col·lectiu que és un conservador que llista o inventaria els ítems en una col·lecció agregada. @ca
toolkit definition: Agente collettivo curatore che elenca o inventaria gli item in un aggregato collezione. @it
toolkit definition: Een collectieve actor die een curator is die een lijst of inventaris aanlegt van items in een collectie-aggregaat. @nl
toolkit definition: Egy kurátor kollektív ágens, amely példányokat sorol fel vagy leltároz egy gyűjteményi aggregátumban. @hu
toolkit definition: Eine Kuratorin/Ein Kurator (Gemeinschaftlicher Akteur), die/der die Exemplare in einem Sammlungsaggregat verzeichnet oder inventarisiert. @de
toolkit definition: En kollektiv agent som er en kurator som lager lister eller oversikter over eksemplarene i en aggregert samling. @no
toolkit definition: Grupa, kas kolekciju apkopojumā uzskaita vai inventarizē vienības. @lv
toolkit definition: Kollektiiv, kes kuraatorina loetleb või inventeerib kogu eksemplarid. @et
toolkit definition: Kollektiv agent, som er kurator, som listefører eller opgører en inventarliste over eksemplarer i et samlingsaggregat. @da
toolkit definition: Kuraattorina toimiva yhteistoimija, joka luetteloi tai inventoi kokoelma-aggregaatin kappaleet. @fi
toolkit definition: وكيل جماعي أمين متحف يسجل قوائم مفردات أو يجردها لمجموعة مجمعة. @ar
toolkit label: Registrarin/Registrar (Gemeinschaftlicher Akteur) @de
toolkit label: agent collectif catalogueur d’une collection de ressources
toolkit label: agent col·lectiu conservador de col·leccions @ca
toolkit label: collectieregistrator-collectieve actor @nl
toolkit label: collection registrar collective agent (Deprecated) @en
toolkit label: conservatore di collezione agente collettivo @it
toolkit label: gyűjtemény-nyilvántartó kollektív ágense: @hu
toolkit label: kogu registreerija (kollektiiv) @et
toolkit label: kokoelman luetteloija (yhteistoimija) @fi
toolkit label: kolekcijas reģistrētājs (grupa) @lv
toolkit label: kollektiv agent, som er samlingsregistrator @da
toolkit label: samlingsregistrator (kollektiv agent) @no
toolkit label: وكيل جماعي مسجل المجموعات @ar
has subproperty: a pour collectivité catalogueuse d’une collection de ressources
has subproperty: a pour famille catalogueuse d’une collection de ressources
has subproperty: P40122
lexical alias: collectionRegistrarCollectiveAgent.en
status: Deprecated
type: Property
domain: C10003
label: gyűjtemény-nyilvántartó kollektív ágense a következő: @hu
label: ha come conservatore di collezione agente collettivo @it
label: har kollektiv agent, som er samlingsregistrator @da
label: har samlingsregistrator (kollektiv agent) @no
label: has collection registrar collective agent (Deprecated) @en
label: hat Registrarin/Registrar (Gemeinschaftlicher Akteur) @de
label: heeft collectieregistrator-collectieve actor @nl
label: kogu registreerija (kollektiiv) @et
label: kokoelman luetteloija (yhteistoimija) @fi
label: kolekcijas reģistrētājs (grupa) @lv
label: té com a agent col·lectiu conservador de col·leccions @ca
label: له وكيل جماعي مسجل المجموعات @ar
sub property of: a pour agent catalogueur d’une collection de ressources
sub property of: a pour agent collectif conservateur
alternative label: agent collectif conservateur d’une collection de ressources
definition: Correla un item all'agente collettivo curatore che elenca o inventaria gli item in un aggregato collezione. @it
definition: Hozzákapcsol egy példányt egy kurátor kollektív ágenshez, amely példányokat sorol fel vagy leltároz egy gyűjteményi aggregátumban. @hu
definition: Liittää kappaleen kuraattorina toimivaan yhteistoimijaan, joka luetteloi tai inventoi kokoelma-aggregaatin kappaleet. @fi
definition: Met un item en relation avec un agent collectif conservateur qui dresse une liste ou un inventaire des items faisant partie d’un agrégat par regroupement.
definition: Relaciona un ítem amb un agent col·lectiu que és un conservador que llista o inventaria els ítems en una col·lecció agregada. @ca
definition: Relateert een item aan een collectieve actor die een curator is die een lijst of inventaris aanlegt van items in een collectie-aggregaat. @nl
definition: Relaterer et eksemplar til en kollektiv agent som er en kurator som lager lister eller oversikter over eksemplarene i en aggregert samling. @no
definition: Relaterer et eksemplar til en kollektiv agent, som er kurator, som listefører eller opgører en inventarliste over eksemplarer i et samlingsaggregat. @da
definition: Relates an item to a collective agent who is a curator who lists or inventories items in a collection aggregate. (Deprecated) @en
definition: Sasaista vienību ar grupu, kas kolekciju apkopojumā uzskaita vai inventarizē vienības. @lv
definition: Seostab eksemplari kollektiiviga, kes kuraatorina loetleb või inventeerib kogu eksemplarid. @et
definition: Setzt ein Exemplar in Beziehung zu einer Kuratorin/einem Kurator (Gemeinschaftlicher Akteur), die/der die Exemplare in einem Sammlungsaggregat verzeichnet oder inventarisiert. @de
definition: يربط مفردة بوكيل جماعي هو أمين متحف يقوم بتسجيل قوائم مفردات أو جردها لمجموعة مجمعة. @ar

a pour agent collectif déposant
has element type: 2
toolkit definition: A collective agent who is a current owner of an item who deposits the item into the custody of another agent without transferring ownership. @en
toolkit definition: Agent collectif propriétaire actuel d’un item qui dépose l’item sous la garde d’un autre agent sans en transférer la propriété.
toolkit definition: Agent col·lectiu que és un propietari actual d’un ítem que el diposita sota la custòdia d’un altre agent sense transferir-li la propietat. @ca
toolkit definition: Bir kopyanın mevcut sahibi olan ve mülkiyeti devretmeden kopyayı başka bir temsilcinin gözetimine bırakan kolektif bir temsilci. @tr
toolkit definition: Een collectieve actor die een huidige eigenaar is van een item die het item onderbrengt bij een andere actor zonder eigenaarschap over te dragen. @nl
toolkit definition: Egy kollektív ágens, amely egy példány jelenlegi tulajdonosa, ás amely egy másik ágens megőrzésébe letétként helyezi el a példánytt anélkül, hogy a tulajdonjogot átruházná. @hu
toolkit definition: Eine gegenwärtige Eigentümerin/Ein gegenwärtiger Eigentümer (Gemeinschaftlicher Akteur) eines Exemplars, die/der das Exemplar in die Obhut eines anderen Akteurs gibt, ohne das Eigentumsrecht zu übertragen. @de
toolkit definition: En kollektiv agent som er en nåværende eier av et eksemplar som deponerer eksemplaret til forvaring til en annen agent uten at eierskapet blir overført. @no
toolkit definition: Grupa, pašreizējais vienības īpašnieks, kurš deponējis vienību cita aģenta uzglabāšanā, vienlaikus saglabājot īpašumtiesības. @lv
toolkit definition: Kappaleen nykyisenä omistajana oleva yhteistoimija, joka tallettaa kappaleen toisen toimijan huostaan omistajuudesta luopumatta. @fi
toolkit definition: Kollektiiv, kes praeguse omanikuna deponeerib eksemplari teise tegija vastutavale hoiule ilma omandiõiguse üleminekuta. @et
toolkit definition: Kollektiv agent, som er nuværende ejer af et eksemplar, som deponerer eksemplaret til forvaring hos en anden agent, men uden at overgive ejerskab. @da
toolkit definition: Proprietario attuale agente collettivo di un item che deposita l'item sotto la custodia di un altro agente senza trasferirne la proprietà. @it
toolkit definition: وكيل جماعي هو المالك الحالي لمفردة، يقوم بإيداعها تحت وصاية وكيل آخر دون نقل ملكيتها. @ar
toolkit definition: 作为单件的当前拥有者将单件委托给另一个行为者保管但未转让所有权的一个集体行为者 @zh-hans
toolkit label: Leihgeberin/Leihgeber (Gemeinschaftlicher Akteur) @de
toolkit label: agent collectif déposant
toolkit label: agent col·lectiu dipositador @ca
toolkit label: bruikleen-collectieve actor @nl
toolkit label: deponeerija (kollektiiv) @et
toolkit label: deponent (kollektiv agent) @no
toolkit label: deponents (grupa) @lv
toolkit label: depositante agente collettivo @it
toolkit label: depositor collective agent @en
toolkit label: kollektiv agent, som er udlåner @da
toolkit label: letétbe helyező kollektív ágense: @hu
toolkit label: mevduatçı kolektif temsilci @tr
toolkit label: tallettaja (yhteistoimija) @fi
toolkit label: وكيل جماعي مودع @ar
toolkit label: 托存者集体行为者 @zh-hans
has subproperty: a pour collectivité déposante
has subproperty: a pour famille déposante
has subproperty: P40123
lexical alias: depositorCollectiveAgent.en
status: Published
type: Property
domain: C10003
label: deponeerija (kollektiiv) @et
label: deponents (grupa) @lv
label: ha come depositante agente collettivo @it
label: har deponent (kollektiv agent) @no
label: har kollektiv agent, som er udlåner @da
label: has depositor collective agent @en
label: hat Leihgeberin/Leihgeber (Gemeinschaftlicher Akteur) @de
label: heeft bruikleen-collectieve actor @nl
label: letétbe helyező kollektív ágense a következő: @hu
label: mevduatçı kolektif temsilcisi ile ilişkilidir @tr
label: tallettaja (yhteistoimija) @fi
label: té com a agent col·lectiu dipositador @ca
label: له وكيل جماعي مودع @ar
label: 有托存者集体行为者 @zh-hans
sub property of: a pour agent déposant
sub property of: a pour agent collectif propriétaire actuel
definition: Bir kopyayı, mülkiyeti devretmeden başka bir temsilcinin gözetimine teslim eden, bir kopyanın mevcut sahibi olan kolektif bir temsilciyle ilişkilendirir. @tr
definition: Correla un item al proprietario attuale agente collettivo di un item che deposita l'item sotto la custodia di un altro agente senza trasferirne la proprietà. @it
definition: Hozzákapcsol egy példányt egy kollektív ágenshez, amely egy példány jelenlegi tulajdonosa, ás amely egy másik ágens megőrzésébe letétként helyezi el a példánytt anélkül, hogy a tulajdonjogot átruházná. @hu
definition: Liittää kappaleen sen nykyisenä omistajana olevaan yhteistoimijaan, joka tallettaa kappaleen toisen toimijan huostaan omistajuudesta luopumatta. @fi
definition: Met un item en relation avec un agent collectif propriétaire actuel d’un item qui dépose l’item sous la garde d’un autre agent sans en transférer la propriété.
definition: Relaciona un ítem amb un agent col·lectiu que és un propietari actual d’un ítem que el diposita sota la custòdia d’un altre agent sense transferir-li la propietat. @ca
definition: Relateert een item aan een collectieve actor die een huidige eigenaar is van een item die het item onderbrengt bij een andere actor zonder eigenaarschap over te dragen. @nl
definition: Relaterer et eksemplar til en kollektiv agent som er en nåværende eier av et eksemplar som deponerer eksemplaret til forvaring til en annen agent uten at eierskapet blir overført. @no
definition: Relaterer et eksemplar til en kollektiv agent, som er nuværende ejer af et eksemplar, som deponerer eksemplaret til forvaring hos en anden agent, men uden at overgive ejerskab. @da
definition: Relates an item to a collective agent who is a current owner of an item who deposits the item into the custody of another agent without transferring ownership. @en
definition: Sasaista vienību ar grupu, kas ir pašreizējais vienības īpašnieks, kurš deponējis vienību cita aģenta uzglabāšanā, vienlaikus saglabājot īpašumtiesības. @lv
definition: Seostab eksemplari kollektiiviga, kes praeguse omanikuna deponeerib eksemplari teise tegija vastutavale hoiule ilma omandiõiguse üleminekuta. @et
definition: Setzt ein Exemplar in Beziehung zu einer gegenwärtigen Eigentümerin/einem gegenwärtigen Eigentümer (Gemeinschaftlicher Akteur) eines Exemplars, die/der das Exemplar in die Obhut eines anderen Akteurs gibt, ohne das Eigentumsrecht zu übertragen. @de
definition: يربط مفردة بوكيل جماعي هو المالك الحالي لمفردة، يقوم بإيداعها تحت وصاية وكيل آخر دون نقل ملكيتها. @ar
definition: 将一个单件与作为单件的当前拥有者将单件委托给另一个行为者保管但未转让所有权的一个集体行为者关联起来。 @zh-hans

a pour agent collectif donateur
has element type: 2
toolkit definition: A collective agent who is a former owner of an item who donates the item to another owner. @en
toolkit definition: Agent col·lectiu que és un propietari anterior d’un ítem que dona l’ítem a un altre propietari. @ca
toolkit definition: Agente collettivo precedente proprietario di un item che ha donato l'item a un altro proprietario. @it
toolkit definition: Ancien agent collectif propriétaire d’un item qui fait don de cet item à un autre propriétaire.
toolkit definition: Aģents grupa, agrākais vienības īpašnieks, kurš ziedojis šo vienību citam īpašniekam. @lv
toolkit definition: Bir kopyanın eski sahibi olan ve kopyayı başka bir sahibine bağışlayan kolektif bir temsilci. @tr
toolkit definition: Een collectieve actor die een voormalige eigenaar is van een item die het item schenkt aan een andere eigenaar. @nl
toolkit definition: Egy kollektív ágens, amely egy példány korábbi tulajdonosa, és aki a példányt egy másik tulajdonosnak adományozza. @hu
toolkit definition: Eine frühere Eigentümerin/Ein früherer Eigentümer (Gemeinschaftlicher Akteur) eines Exemplars, die/der das Exemplar einer anderen Eigentümerin/einem anderen Eigentümer überlässt. @de
toolkit definition: En kollektiv agent som er en tidligere eier av et eksemplar som har gitt eksemplaret til en annen eier. @no
toolkit definition: Kappaleen aiempana omistajana oleva yhteistoimija, joka lahjoittaa sen toiselle omistajalle. @fi
toolkit definition: Kollektiiv, kes eksemplari endise omanikuna on kinkinud selle teisele omanikule. @et
toolkit definition: Kollektiv agent, som er tidligere ejer af et eksemplar, som har doneret dette eksemplar til en anden ejer. @da
toolkit definition: وكيل جماعي هو المالك السابق لمفردة، تبرع بها لمالك آخر. @ar
toolkit definition: 作为先前拥有者将单件捐赠给另一个拥有者的一个集体行为者 @zh-hans
toolkit label: Stifterin/Stifter (Gemeinschaftlicher Akteur) @de
toolkit label: adományozó kollektív ágense: @hu
toolkit label: agent collectif donateur
toolkit label: agent col·lectiu donant @ca
toolkit label: annetaja (kollektiiv) @et
toolkit label: bağışçı kolektif temsilci @tr
toolkit label: donatore agente collettivo @it
toolkit label: donor collective agent @en
toolkit label: giver (kollektiv agent) @no
toolkit label: kollektiv agent, som er donor @da
toolkit label: lahjoittaja (yhteistoimija) @fi
toolkit label: schenker-collectieve actor @nl
toolkit label: ziedotājs (grupa) @lv
toolkit label: وكيل جماعي متبرع @ar
toolkit label: 捐赠者集体行为者 @zh-hans
has subproperty: a pour collectivité donatrice
has subproperty: a pour famille donatrice
has subproperty: P40124
lexical alias: donorCollectiveAgent.en
status: Published
type: Property
domain: C10003
label: adományozó kollektív ágense a következő: @hu
label: annetaja (kollektiiv) @et
label: bağışçı kolektif temsilcisi ile ilişkilidir @tr
label: ha come donatore agente collettivo @it
label: har giver (kollektiv agent) @no
label: har kollektiv agent, som er donor @da
label: has donor collective agent @en
label: hat Stifterin/Stifter (Gemeinschaftlicher Akteur) @de
label: heeft schenker-collectieve actor @nl
label: lahjoittaja (yhteistoimija) @fi
label: té com a agent col·lectiu donant @ca
label: ziedotājs (grupa) @lv
label: له وكيل جماعي متبرع @ar
label: 有捐赠者集体行为者 @zh-hans
sub property of: a pour agent donateur
sub property of: a pour ancien agent collectif propriétaire
definition: Bir kopyayı, bir kopyanın eski sahibi olan ve kopyayı başka bir sahibine bağışlayan kolektif bir temsilciyle ilişkilendirir. @tr
definition: Correla un item all'agente collettivo precedente proprietario di un item che ha donato l'item a un altro proprietario. @it
definition: Hozzákapcsol egy példányt egy kollektív ágenshez, amely egy példány korábbi tulajdonosa, és amely a példányt egy másik tulajdonosnak adományozza. @hu
definition: Liittää kappaleen sen aiempana omistajana olevaan yhteistoimijaan, joka lahjoittaa sen toiselle omistajalle. @fi
definition: Met un item en relation avec un ancien agent collectif propriétaire d’un item qui fait don de cet item à un autre propriétaire.
definition: Relaciona un ítem amb un agent col·lectiu que és un propietari anterior d’un ítem que dona l’ítem a un altre propietari. @ca
definition: Relateert een item aan een collectieve actor die een voormalige eigenaar is van een item die het item schenkt aan een andere eigenaar. @nl
definition: Relaterer et eksemplar til en kollektiv agent som er en tidligere eier av et eksemplar som har gitt eksemplaret til en annen eier. @no
definition: Relaterer et eksemplar til en kollektiv agent, som er tidligere ejer af et eksemplar, som har doneret dette eksemplar til en anden ejer. @da
definition: Relates an item to a collective agent who is a former owner of an item who donates the item to another owner. @en
definition: Sasaista vienību ar grupu, kas ir agrākais vienības īpašnieks, kurš ziedojis šo vienību citam īpašniekam. @lv
definition: Seostab eksemplari kollektiiviga, kes eksemplari endise omanikuna on kinkinud selle teisele omanikule. @et
definition: Setzt ein Exemplar in Beziehung zu einer früheren Eigentümerin/einem früheren Eigentümer (Gemeinschaftlicher Akteur) eines Exemplars, die/der das Exemplar einer anderen Eigentümerin/einem anderen Eigentümer überlässt. @de
definition: يربط مفردة بوكيل جماعي هو المالك السابق لمفردة، تبرع بها لمالك آخر. @ar
definition: 将一个单件与作为先前拥有者将单件捐赠给另一个拥有者的一个集体行为者关联起来。 @zh-hans

a pour agent collectif vendeur
has element type: 2
toolkit definition: A collective agent who is a former owner of an item who sells the item to another owner. @en
toolkit definition: Agent col·lectiu que és un propietari anterior d’un ítem que ven l’ítem a un altre propietari. @ca
toolkit definition: Agente collettivo precedente proprietario di un item che ha venduto l'item a un altro proprietario. @it
toolkit definition: Ancien agent collectif propriétaire d’un item qui vend cet item à un autre propriétaire.
toolkit definition: Bir kopyanın eski sahibi olan ve kopyayı başka bir sahibine satan kolektif bir temsilci. @tr
toolkit definition: Een collectieve actor die een voormalige eigenaar is van een item die het item verkoopt aan een andere eigenaar. @nl
toolkit definition: Egy kollektív ágens, amely egy példány korábbi tulajdonosa, és amely a példányt másik tulajdonosnak adja el. @hu
toolkit definition: Eine frühere Eigentümerin/Ein früherer Eigentümer (Gemeinschaftlicher Akteur) eines Exemplars, die/der das Exemplar an eine andere Eigentümerin/einen anderen Eigentümer verkauft. @de
toolkit definition: En kollektiv agent som er en tidligere eier av et eksemplar, som har solgt eksemplaret til en annen eier. @no
toolkit definition: Grupa - vienības agrākais īpašnieks, kura pārdod šo vienību citam īpašniekam. @lv
toolkit definition: Kappaleen aiempana omistajana oleva yhteistoimija, joka myy kappaleen toiselle omistajalle. @fi
toolkit definition: Kollektiiv, kes eksemplari endise omanikuna on müünud selle teisele omanikule. @et
toolkit definition: Kollektiv agent, som er tidligere ejer af et eksemplar, som har solgt dette eksemplar til en anden ejer. @da
toolkit definition: وكيل جماعي هو المالك السابق لمفردة قام ببيعها لمالك آخر. @ar
toolkit definition: 作为先前拥有者将单件出售给另一个拥有者的一个集体行为者 @zh-hans
toolkit label: Verkäuferin/Verkäufer (Gemeinschaftlicher Akteur) @de
toolkit label: agent collectif vendeur
toolkit label: agent col·lectiu venedor @ca
toolkit label: kollektiv agent, som er sælger @da
toolkit label: myyjä (yhteistoimija) @fi
toolkit label: müüja (kollektiiv) @et
toolkit label: pārdevējs (grupa) @lv
toolkit label: satıcı kolektif temsilci @tr
toolkit label: selger (kollektiv agent) @no
toolkit label: seller collective agent @en
toolkit label: venditore agente collettivo @it
toolkit label: verkoper-collecteve actor @nl
toolkit label: értékesítő kollektív ágense: @hu
toolkit label: وكيل جماعي بائع @ar
toolkit label: 出售者集体行为者 @zh-hans
has subproperty: a pour collectivité vendeuse
has subproperty: a pour famille vendeuse
has subproperty: P40125
lexical alias: sellerCollectiveAgent.en
status: Published
type: Property
domain: C10003
label: ha come venditore agente collettivo @it
label: har kollektiv agent, som er sælger @da
label: har selger (kollektiv agent) @no
label: has seller collective agent @en
label: hat Verkäuferin/Verkäufer (Gemeinschaftlicher Akteur) @de
label: heeft verkoper-collecteve actor @nl
label: myyjä (yhteistoimija) @fi
label: müüja (kollektiiv) @et
label: pārdevējs (grupa) @lv
label: satıcı kolektif temsilcisi ile ilişkilidir @tr
label: té com a agent col·lectiu venedor @ca
label: értékesítő kollektív ágense a következő: @hu
label: له وكيل جماعي بائع @ar
label: 有出售者集体行为者 @zh-hans
sub property of: a pour agent vendeur
sub property of: a pour ancien agent collectif propriétaire
definition: Bir kopyayı, bir kopyanın eski sahibi olan ve kopyayı başka bir sahibe satan kolektif bir temsilciyle ilişkilendirir. @tr
definition: Correla un item all'agente collettivo precedente proprietario di un item che ha venduto l'item a un altro proprietario. @it
definition: Hozzákapcsol egy példányt egy kollektív ágenshez, amely a példány korábbi tulajdonosa, és amely a példányt másik tulajdonosnak adja el. @hu
definition: Liittää kappaleen sen aiempana omistajana olevaan yhteistoimijaan, joka myy kappaleen toiselle omistajalle. @fi
definition: Met un item en relation avec un ancien agent collectif propriétaire d’un item qui vend cet item à un autre propriétaire.
definition: Relaciona un ítem amb un agent col·lectiu que és un propietari anterior d’un ítem que ven l’ítem a un altre propietari. @ca
definition: Relateert een item aan een collectieve actor die een voormalige eigenaar is van een item die het item verkoopt aan een andere eigenaar. @nl
definition: Relaterer et eksemplar til en kollektiv agent som er en tidligere eier av et eksemplar, som har solgt eksemplaret til en annen eier. @no
definition: Relaterer et eksemplar til en kollektiv agent, som er tidligere ejer af et eksemplar, som har solgt dette eksemplar til en anden ejer. @da
definition: Relates an item to a collective agent who is a former owner of an item who sells the item to another owner. @en
definition: Sasaista vienību ar grupu, kas ir vienības agrākais īpašnieks, kura pārdod šo vienību citam īpašniekam. @lv
definition: Seostab eksemplari kollektiiviga, kes eksemplari endise omanikuna on müünud selle teisele omanikule. @et
definition: Setzt ein Exemplar in Beziehung zu einer früheren Eigentümerin/einem früheren Eigentümer (Gemeinschaftlicher Akteur) eines Exemplars, die/der das Exemplar an eine andere Eigentümerin/einen anderen Eigentümer verkauft. @de
definition: يربط مفردة بوكيل جماعي هو المالك السابق لمفردة قام ببيعها لمالك آخر. @ar
definition: 将一个单件与作为先前拥有者将单件出售给另一个拥有者的一个集体行为者关联起来。 @zh-hans

a pour agent collectif honoré d’un item
has element type: 2
toolkit definition: A collective agent who is honoured by an item. @en
toolkit definition: Agent collectif qui est honoré par un item.
toolkit definition: Agent col·lectiu que és homenatjat en un ítem. @ca
toolkit definition: Agente collettivo onorato da un item. @it
toolkit definition: Bir kopya ile onurlandırılan kolektif temsilci. @tr
toolkit definition: Een collectieve actor die geëerd wordt door een item. @nl
toolkit definition: Egy kollektív ágens, amelyet a példány méltat. @hu
toolkit definition: Ein gemeinschaftlicher Akteur, der durch ein Exemplar geehrt wird. @de
toolkit definition: En kollektiv agent som beæres av et eksemplar. @no
toolkit definition: Grupa, kas godināta ar vienību. @lv
toolkit definition: Kollektiiv, keda eksemplariga austatakse. @et
toolkit definition: Kollektiv agent, som er hædret i et eksemplar. @da
toolkit definition: Yhteistoimija, jota kappaleella kunnioitetaan. @fi
toolkit definition: وكيل جماعي هو كُرِّم بمفردة. @ar
toolkit definition: 被一个单件纪念的一个集体行为者 @zh-hans
toolkit label: Gefeierte/Gefeierter eines Exemplars (Gemeinschaftlicher Akteur) @de
toolkit label: agent collectif honoré d’un item
toolkit label: agent col·lectiu homenatjat d’un ítem @ca
toolkit label: ar vienību godinātā grupa @lv
toolkit label: eksemplari austusavalduse saaja (kollektiiv) @et
toolkit label: geëerde-collectieve actor van item @nl
toolkit label: honouree collective agent of item @en
toolkit label: kappaleella kunnioitettu yhteistoimija @fi
toolkit label: kollektiv agent beæret av eksemplar @no
toolkit label: kollektiv agent, som er beæret i eksemplar @da
toolkit label: kopyanın onurlandırılan kolektif temsilcisi ile ilişkilidir @tr
toolkit label: onorato di item agente collettivo @it
toolkit label: példány méltatott kollektív ágense @hu
toolkit label: وكيل جماعي مُكُرم بمفردة. @ar
toolkit label: 单件的被纪念者集体行为者 @zh-hans
has subproperty: a pour collectivité honorée d’un item
has subproperty: a pour famille honorée d’un item
has subproperty: P40126
lexical alias: honoureeCollectiveAgentOfItem.en
status: Published
type: Property
domain: C10003
label: ar vienību godinātā grupa @lv
label: eksemplari austusavalduse saaja (kollektiiv) @et
label: ha come onorato agente collettivo di item @it
label: har kollektiv agent beæret av eksemplar @no
label: har kollektiv agent, som er beæret i eksemplar @da
label: has honouree collective agent of item @en
label: hat Gefeierte/Gefeierten eines Exemplars (Gemeinschaftlicher Akteur) @de
label: heeft geëerde-collectieve actor van item @nl
label: kappaleella kunnioitettu yhteistoimija @fi
label: kopyanın onurlandırılan kolektif temsilcisi ile ilişkilidir @tr
label: példány méltatott kollektív ágense a következő: @hu
label: té com a agent col·lectiu homenatjat d’un ítem @ca
label: له وكيل جماعي مكرم بمفردة @ar
label: 有单件的被纪念者集体行为者 @zh-hans
sub property of: a pour agent honoré d’un item
sub property of: a pour agent collectif en relation avec un item
definition: Bir kopyayı, bir kopya tarafından onurlandırılan kolektif temsilciyle ilişkilendirir. @tr
definition: Correla un item all'agente collettivo onorato da un item. @it
definition: Hozzákapcsol egy példányt egy kollektív ágenshez, amelyet a példány méltat. @hu
definition: Liittää kappaleen yhteistoimijaan, jota kappaleella kunnioitetaan. @fi
definition: Met un item en relation avec un agent collectif qui est honoré par un item.
definition: Relaciona un ítem amb un agent col·lectiu que és homenatjat en un ítem. @ca
definition: Relateert een item aan een collectieve actor die geëerd wordt door een item. @nl
definition: Relaterer et eksemplar til en kollektiv agent som beæres av et eksemplar. @no
definition: Relaterer et eksemplar til en kollektiv agent, som er hædret i et eksemplar. @da
definition: Relates an item to a collective agent who is honoured by an item. @en
definition: Sasaista vienību ar grupu, kas godināta ar vienību. @lv
definition: Seostab eksemplari kollektiiviga, keda eksemplariga austatakse. @et
definition: Setzt ein Exemplar in Beziehung zu einem gemeinschaftlichen Akteur, der durch ein Exemplar geehrt wird. @de
definition: يربط مفردة بوكيل جماعي مُكُرم بمفردة. @ar
definition: 将一个单件与被一个单件纪念的一个集体行为者关联起来。 @zh-hans

a pour agent collectif restaurateur d’un item
has element type: 2
toolkit definition: A collective agent who is responsible for the set of technical, editorial, and intellectual procedures aimed at compensating for the degradation of an item by bringing it back to a state as close as possible to its original condition. @en
toolkit definition: Agent collectif qui est responsable de l’ensemble des procédures techniques, éditoriales et intellectuelles destinées à compenser la dégradation d’un item en le ramenant à un état aussi près que possible de sa condition originelle.
toolkit definition: Agent col·lectiu que és responsable del conjunt de procediments tècnics, editorials i intel·lectuals destinats a compensar la degradació d’un ítem retornant-lo a un estat que s’aproximi al màxim a la seva condició original. @ca
toolkit definition: Agente collettivo responsabile dell'insieme delle procedure tecniche, di cura e intellettuali finalizzate al risarcimento di un item in seguito alla sua degradazione, riportandolo a uno stato il più possibile vicino alla condizione originale. @it
toolkit definition: Bir kopyanın bozulmasını orijinal durumuna mümkün olduğu kadar yakın bir duruma geri getirerek telafi etmeyi amaçlayan teknik, editoryal ve entelektüel prosedürler dizisinden sorumlu olan kolektif bir temsilci. @tr
toolkit definition: Een collectieve actor die verantwoordelijk is voor de verzameling van technische, redactionele en intellectuele procedures gericht op het corrigeren van de achteruitgang van een item door het zo goed mogelijk terug te brengen tot de oorspronkelijke staat. @nl
toolkit definition: Egy kollektív ágens, amely felelős technikai, szerkesztői és intellektuális eljárások összességéért, amelyek célja egy példány romlásának ellensúlyozása, amivel azt az eredeti állapotához a lehető legközelebb képesek visszahozni. @hu
toolkit definition: Ein gemeinschaftlicher Akteur, der für die technischen, redaktionellen und intellektuellen Verfahren verantwortlich ist, die darauf abzielen, die Zersetzung eines Exemplars auszugleichen, indem es in einen Zustand zurückversetzt wird, der seiner ursprünglichen Beschaffenheit möglichst nahe kommt. @de
toolkit definition: En kollektiv agent som har ansvar for de tekniske og intellektuelle metodene som brukes for å kompensere for nedbrytningen av et eksemplar ved å restaurere det til en tilstand som er så lik originaltilstanden som mulig. @no
toolkit definition: Grupa, kas ir atbildīga par tehnisko, redakcionālo un intelektuālo procedūru kopumu, kuru mērķis ir kompensēt vienības pakāpenisko bojāeju, atgriežot to, cik vien iespējams, tuvu tās sākotnējam stāvoklim. @lv
toolkit definition: Kollektiiv, kes vastutab rea tehniliste, toimetuslike ja intellektuaalsete toimingute eest, mille eesmärk on taastada kahjustatud eksemplari seisund võimalikult originaalseisundi lähedaseks. @et
toolkit definition: Kollektiv agent, som er ansvarlig for en række af tekniske, redaktionelle og intellektuelle procedurer, som forsøger at kompensere for nedslidningen af et eksemplar ved at føre det tilbage til en tilstand, der er så tæt som muligt på dets oprindelige tilstand. @da
toolkit definition: Yhteistoimija, joka vastaa teknisistä, toimituksellisista ja tiedollisista toimenpiteistä, joiden tarkoitus on palauttaa huonokuntoinen kappale mahdollisimman lähelle sen alkuperäistä kuntoa. @fi
toolkit definition: وكيل جماعي مسئول عن مجموعة الإجراءات الفنية، والتحريرية، والفكرية التي تهدف إلى إصلاح التدهور الذي لحق بمفردة وإعادتها إلى حالة أقرب ما تكون إلى حالتها الأصلية. @ar
toolkit definition: 负责为弥补单件的损毁而担负一系列技术、编辑和智力操作、使之尽可能恢复到原始状态的一个集体行为者 @zh-hans
toolkit label: Restauratorin/Restaurator eines Exemplars (Gemeinschaftlicher Akteur) @de
toolkit label: agent collectif restaurateur d’un item
toolkit label: agent col·lectiu restaurador d’un ítem @ca
toolkit label: eksemplari restaureerija (kollektiiv) @et
toolkit label: kappaleen entisöijä (yhteistoimija) @fi
toolkit label: kollektiv agent, som er konservator af eksemplar @da
toolkit label: konservator for eksemplar (kollektiv agent) @no
toolkit label: kopyanın restorasyon uzmanı kolektif temsilcisi @tr
toolkit label: példány restaurátor kollektív ágense @hu
toolkit label: restaurator-collectieve actor van item @nl
toolkit label: restauratore di item agente collettivo @it
toolkit label: restorationist collective agent of item @en
toolkit label: vienības restaurators (grupa) @lv
toolkit label: وكيل جماعي مرمم لمفردة @ar
toolkit label: 单件的修复者集体行为者 @zh-hans
has subproperty: a pour collectivité restauratrice d’un item
has subproperty: a pour famille restauratrice d’un item
has subproperty: P40127
lexical alias: restorationistCollectiveAgentOfItem.en
status: Published
type: Property
domain: C10003
label: eksemplari restaureerija (kollektiiv) @et
label: ha come restauratore di item agente collettivo @it
label: har kollektiv agent, som er konservator af eksemplar @da
label: har konservator for eksemplar (kollektiv agent) @no
label: has restorationist collective agent of item @en
label: hat Restauratorin/Restaurator eines Exemplars (Gemeinschaftlicher Akteur) @de
label: heeft restaurator-collectieve actor van item @nl
label: kappaleen entisöijä (yhteistoimija) @fi
label: kopyanın restorasyon uzmanı kolektif temsilcisi ile ilişkilidir @tr
label: példány restaurátor kollektív ágense a következő: @hu
label: té com a agent col·lectiu restaurador d’un ítem @ca
label: vienības restaurators (grupa) @lv
label: له وكيل جماعي مرمم لمفردة @ar
label: 有单件的修复者集体行为者 @zh-hans
sub property of: a pour agent restaurateur d’un item
sub property of: a pour agent collectif modificateur
definition: Bir kopyayı, orijinal durumuna mümkün olduğu kadar yakın bir duruma geri getirerek bir kopyanın bozulmasını telafi etmeyi amaçlayan teknik, yayın ve entelektüel prosedürler dizisinden sorumlu olan kolektif bir temsilciyle ilişkilendirir. @tr
definition: Correla un item all'agente collettivo responsabile dell'insieme delle procedure tecniche, di cura e intellettuali finalizzate al risarcimento di un item in seguito alla sua degradazione, riportandolo a uno stato il più possibile vicino alla condizione originale. @it
definition: Hozzákapcsol egy példányt egy kollektív ágenshez, amely felelős technikai, szerkesztői és intellektuális eljárások összességéért, amelyek célja egy példány romlásának ellensúlyozása, amivel azt az eredeti állapotához a lehető legközelebb képesek visszahozni. @hu
definition: Liittää kappaleen yhteistoimijaan, joka vastaa teknisistä, toimituksellisista ja tiedollisista toimenpiteistä, joiden tarkoitus on palauttaa huonokuntoinen kappale mahdollisimman lähelle sen alkuperäistä kuntoa. @fi
definition: Met un item en relation avec un agent collectif qui est responsable de l’ensemble des procédures techniques, éditoriales et intellectuelles destinées à compenser la dégradation d’un item en le ramenant à un état aussi près que possible de sa condition originelle.
definition: Relaciona un ítem amb un agent col·lectiu que és responsable del conjunt de procediments tècnics, editorials i intel·lectuals destinats a compensar la degradació d’un ítem retornant-lo a un estat que s’aproximi al màxim a la seva condició original. @ca
definition: Relateert een item aan een collectieve actor die verantwoordelijk is voor de verzameling van technische, redactionele en intellectuele procedures gericht op het corrigeren van de achteruitgang van een item door het zo goed mogelijk terug te brengen tot de oorspronkelijke staat. @nl
definition: Relaterer et eksemplar til en kollektiv agent som har ansvar for de tekniske og intellektuelle metodene som brukes for å kompensere for nedbrytningen av et eksemplar ved å restaurere det til en tilstand som er så lik originaltilstanden som mulig. @no
definition: Relaterer et eksemplar til en kollektiv agent, som er ansvarlig for en række af tekniske, redaktionelle og intellektuelle procedurer, som forsøger at kompensere for nedslidningen af et eksemplar ved at føre det tilbage til en tilstand, der er så tæt som muligt på dets oprindelige tilstand. @da
definition: Relates an item to a collective agent who is responsible for the set of technical, editorial, and intellectual procedures aimed at compensating for the degradation of an item by bringing it back to a state as close as possible to its original condition. @en
definition: Sasaista vienību ar grupu, kas ir atbildīga par tehnisko, redakcionālo un intelektuālo procedūru kopumu, kuru mērķis ir kompensēt vienības pakāpenisko bojāeju, atgriežot to, cik vien iespējams, tuvu tās sākotnējam stāvoklim. @lv
definition: Seostab eksemplari kollektiiviga, kes vastutab rea tehniliste, toimetuslike ja intellektuaalsete toimingute eest, mille eesmärk on taastada kahjustatud eksemplari seisund võimalikult originaalseisundi lähedaseks. @et
definition: Setzt ein Exemplar in Beziehung zu einem gemeinschaftlichen Akteur, der für die technischen, redaktionellen und intellektuellen Verfahren verantwortlich ist, die darauf abzielen, die Zersetzung eines Exemplars auszugleichen, indem es in einen Zustand zurückversetzt wird, der seiner ursprünglichen Beschaffenheit möglichst nahe kommt. @de
definition: يربط مفردة بوكيل جماعي مسئول عن مجموعة الإجراءات لفنية، والتحريرية، والفكرية التي تهدف إلى إصلاح التدهور الذي لحق بمفردة وإعادتها إلى حالة أقرب ما تكون إلى حالتها الأصلية. @ar
definition: 将一个单件与负责为弥补单件的损毁而担负一系列技术、编辑和智力操作、使之尽可能恢复到原始状态的一个集体行为者关联起来。 @zh-hans

a pour agent collectif modificateur
has element type: 2
toolkit definition: A collective agent who makes changes to an item without creating a new manifestation. @en
toolkit definition: Agent collectif qui apporte des modifications à un item sans créer une nouvelle manifestation.
toolkit definition: Agent col·lectiu que fa canvis a un ítem sense crear una manifestació nova. @ca
toolkit definition: Agente collettivo che apporta modifiche a un item senza creare una nuova manifestazione. @it
toolkit definition: Een collectieve actor die veranderingen aanbrengt aan een item zonder een nieuwe manifestatie te creëren. @nl
toolkit definition: Egy kollektív ágens, amely új megjelenési forma létrehozása nélkül idéz elő változást a példányban. @hu
toolkit definition: Ein gemeinschaftlicher Akteur, der Änderungen an einem Exemplar vornimmt, ohne eine neue Manifestation zu erstellen. @de
toolkit definition: En kollektiv agent som gjør endringer på et eksemplar uten å skape en ny manifestasjon. @no
toolkit definition: Grupa, kas veikusi izmaiņas vienībā, neradot jaunu manifestāciju. @lv
toolkit definition: Kollektiiv, kes muudab eksemplari, loomata uut kehastust. @et
toolkit definition: Kollektiv agent, som ændrer i et eksemplar uden at skabe en ny manifestation. @da
toolkit definition: Yeni bir gösterim oluşturmadan bir kopyada değişiklik yapan kolektif bir temsilci. @tr
toolkit definition: Yhteistoimija, joka tekee muutoksia kappaleeseen luomatta uutta manifestaatiota. @fi
toolkit definition: وكيل جماعي يجري تغييرات على مفردة دون أن ينشئ تجسيدة جديدة. @ar
toolkit definition: 对一个单件作修改而不创建一个新的载体表现的一个集体行为者 @zh-hans
toolkit label: Bearbeiterin/Bearbeiter eines Exemplars (Gemeinschaftlicher Akteur) @de
toolkit label: Dönüştüren kolektif temsilci @tr
toolkit label: aanpasser-collectieve actor @nl
toolkit label: agent collectif modificateur
toolkit label: agent col·lectiu modificador @ca
toolkit label: kollektiv agent, som er tilpasser @da
toolkit label: modificatore agente collettivo @it
toolkit label: modificētājs (grupa) @lv
toolkit label: modifier collective agent @en
toolkit label: muokkaaja (yhteistoimija) @fi
toolkit label: muutja (kollektiiv) @et
toolkit label: módosító kollektív ágense: @hu
toolkit label: tilpasser (kollektiv agent) @no
toolkit label: وكيل جماعي مُعدِّل @ar
toolkit label: 修改者集体行为者 @zh-hans
has subproperty: a pour agent collectif relieur
has subproperty: a pour agent collectif enlumineur
has subproperty: a pour agent collectif restaurateur d’un item
has subproperty: a pour collectivité modificatrice
has subproperty: a pour famille modificatrice
has subproperty: P40128
lexical alias: modifierCollectiveAgent.en
status: Published
type: Property
domain: C10003
label: düzenleyici kolektif temsilcisi ile ilişkilidir @tr
label: ha come modificatore agente collettivo @it
label: har kollektiv agent, som er tilpasser @da
label: har tilpasser (kollektiv agent) @no
label: has modifier collective agent @en
label: hat Bearbeiterin/Bearbeiter eines Exemplars (Gemeinschaftlicher Akteur) @de
label: heeft aanpasser-collectieve actor @nl
label: modificētājs (grupa) @lv
label: muokkaaja (yhteistoimija) @fi
label: muutja (kollektiiv) @et
label: módosító kollektív ágense a következő: @hu
label: té com a agent col·lectiu modificador @ca
label: له وكيل جماعي مُعدِّل @ar
label: 有修改者集体行为者 @zh-hans
sub property of: a pour agent collectif en relation avec un item
sub property of: a pour agent modificateur
definition: Bir kopyayı, yeni bir gösterim oluşturmadan bir kopyada değişiklik yapan kolektif bir temsilciyle ilişkilendirir. @tr
definition: Correla un item a un agente collettivo che apporta modifiche a un item senza creare una nuova manifestazione. @it
definition: Hozzákapcsol egy példányt egy kollektív ágenshez, amely új megjelenési forma létrehozása nélkül idéz elő változást a példányban. @hu
definition: Liittää kappaleen yhteistoimijaan, joka tekee muutoksia kappaleeseen luomatta uutta manifestaatiota. @fi
definition: Met un item en relation avec un agent collectif qui apporte des modifications à un item sans créer une nouvelle manifestation.
definition: Relaciona un ítem amb un agent col·lectiu que fa canvis a un ítem sense crear una manifestació nova. @ca
definition: Relateert een item aan een collectieve actor die veranderingen aanbrengt aan een item zonder een nieuwe manifestatie te creëren. @nl
definition: Relaterer et eksemplar til en kollektiv agent som gjør endringer på et eksemplar uten å skape en ny manifestasjon. @no
definition: Relaterer et eksemplar til en kollektiv agent, som ændrer i et eksemplar uden at skabe en ny manifestation. @da
definition: Relates an item to a collective agent that makes changes to an item without creating a new manifestation. @en
definition: Sasaista vienību ar grupu, kas veikusi izmaiņas vienībā, neradot jaunu manifestāciju. @lv
definition: Seostab eksemplari kollektiiviga, kes muudab eksemplari, loomata uut kehastust. @et
definition: Setzt ein Exemplar in Beziehung zu einem gemeinschaftlichen Akteur, der Änderungen an einem Exemplar vornimmt, ohne eine neue Manifestation zu erstellen. @de
definition: يربط مفردة بوكيل جماعي يقوم بإجراء تغييرات على مفردة دون أن ينشئ تجسيدة جديدة. @ar
definition: 将一个单件与对一个单件作修改而不创建一个新的载体表现的一个集体行为者关联起来。 @zh-hans

a pour collectivité dédicataire d’un item
has element type: 2
toolkit definition: A corporate body to whom an item is dedicated. @en
toolkit definition: Asutus, kellele eksemplar on pühendatud. @et
toolkit definition: Bir kopyanın ithaf edildiği tüzel kişi. @tr
toolkit definition: Collectivité à qui un item est dédié.
toolkit definition: Een corporatie aan wie een item is opgedragen. @nl
toolkit definition: Egy testület, amelynek a példányt dedikálják. @hu
toolkit definition: Eine Körperschaft, der ein Exemplar gewidmet ist. @de
toolkit definition: En korporasjon som et eksemplar er dedisert til. @no
toolkit definition: Ente al quale un item è dedicato. @it
toolkit definition: Entitat corporativa a qui es dedica un ítem. @ca
toolkit definition: Institūcija, kam ir veltīta vienība. @lv
toolkit definition: Korporation, som et eksemplar er tilegnet. @da
toolkit definition: Yhteisö, jolle kappale on omistettu. @fi
toolkit definition: هيئة أُهديت اليها مفردة. @ar
toolkit definition: 一个单件被题献给的一个团体 @zh-hans
toolkit label: Widmungsempfängerin/Widmungsempfänger eines Exemplars (Körperschaft) @de
toolkit label: collectivité dédicataire d’un item
toolkit label: dedicatario ente di item @it
toolkit label: dedicatee corporate body of item @en
toolkit label: eksemplari pühenduse saaja (asutus) @et
toolkit label: entitat corporativa dedicatària d’un ítem @ca
toolkit label: kappaleen omistuksen kohde (yhteisö) @fi
toolkit label: kopyanın adandığı tüzel kişi @tr
toolkit label: korporation, som er tilegnet af eksemplar @da
toolkit label: opgedragen-corporatie van item @nl
toolkit label: példány dedikált testülete @hu
toolkit label: tilegnet korporasjon for eksemplar @no
toolkit label: veltījumvienība institūcijai @lv
toolkit label: هيئة مُهدى إليها مفردة @ar
toolkit label: 单件的被题献者团体 @zh-hans
has subproperty: P40129
lexical alias: dedicateeCorporateBodyOfItem.en
status: Published
type: Property
domain: C10003
label: eksemplari pühenduse saaja (asutus) @et
label: ha come dedicatario ente di item @it
label: har korporation, som er tilegnet af eksemplar @da
label: har tilegnet korporasjon for eksemplar @no
label: has dedicatee corporate body of item @en
label: hat Widmungsempfängerin/Widmungsempfänger eines Exemplars (Körperschaft) @de
label: heeft opgedragene-corporatie van item @nl
label: kappaleen omistuksen kohde (yhteisö) @fi
label: kopyanın ithaf edilen tüzel kişisi ile ilişkilidir @tr
label: példány dedikált testülete a következő: @hu
label: té com a entitat corporativa dedicatària d’un ítem @ca
label: veltījumvienība institūcijai @lv
label: له هيئة مُهدى إليها مفردة @ar
label: 有单件的被题献者团体 @zh-hans
sub property of: a pour collectivité en relation avec un item
sub property of: a pour agent collectif dédicataire d’un item
definition: Bir kopyayı, bir kopyanın ithaf edildiği tüzel bir kişiyle ilişkilendirir. @tr
definition: Correla un item a un ente al quale un item è dedicato. @it
definition: Hozzákapcsol egy példányt egy testülethez, amelynek a példányt dedikálják. @hu
definition: Liittää kappaleen yhteisöön, jolle kappale on omistettu. @fi
definition: Met un item en relation avec une collectivité à qui un item est dédié.
definition: Relaciona un ítem amb una entitat corporativa a qui es dedica un ítem. @ca
definition: Relateert een item aan een corporatie aan wie een item is opgedragen. @nl
definition: Relaterer et eksemplar til en korporasjon som et eksemplar er dedisert til. @no
definition: Relaterer et eksemplar til en korporation, som et eksemplar er tilegnet. @da
definition: Relates an item to a corporate body to whom an item is dedicated. @en
definition: Sasaista vienību ar institūciju, kam ir veltīta vienība. @lv
definition: Seostab eksemplari asutusega, kellele eksemplar on pühendatud. @et
definition: Setzt ein Exemplar in Beziehung zu einer Körperschaft, der ein Exemplar gewidmet ist. @de
definition: يربط مفردة بهيئة أُهديت اليها مفردة. @ar
definition: 将一个单件与一个单件被题献给的一个团体关联起来。 @zh-hans

a pour collectivité relieuse
has element type: 2
toolkit definition: A corporate body who binds an item. @en
toolkit definition: Asutus, kes on eksemplari köitnud. @et
toolkit definition: Bir kopyayı ciltleyen tüzel kişi @tr
toolkit definition: Collectivité qui relie un item.
toolkit definition: Een corporatie die een item bindt. @nl
toolkit definition: Egy testület, amely beköt egy példányt. @hu
toolkit definition: Eine Körperschaft, die ein Exemplar bindet. @de
toolkit definition: En korporasjon som binder inn et eksemplar. @no
toolkit definition: Ente che rilega un item. @it
toolkit definition: Entitat corporativa que enquaderna un ítem. @ca
toolkit definition: Institūcija, kas ir iesējusi vienību. @lv
toolkit definition: Korporation, som indbinder et eksemplar. @da
toolkit definition: Yhteisö, joka sitoo kappaleen. @fi
toolkit definition: هيئة تجلد مفردة. @ar
toolkit definition: 装订单件的一个团体 @zh-hans
toolkit label: Buchbinderin/Buchbinder (Körperschaft) @de
toolkit label: binder corporate body @en
toolkit label: binder-corporatie @nl
toolkit label: bokbinder (korporasjon) @no
toolkit label: ciltleyici tüzel kişi @tr
toolkit label: collectivité relieuse
toolkit label: entitat corporativa enquadernadora @ca
toolkit label: grāmatsējējs (institūcija) @lv
toolkit label: korporation, som er bogbinder @da
toolkit label: köitja (asutus) @et
toolkit label: könyvkötő testülete: @hu
toolkit label: rilegatore ente @it
toolkit label: sitoja (yhteisö) @fi
toolkit label: هيئة مسئولة عن التجليد @ar
toolkit label: 装订者团体 @zh-hans
has subproperty: P40130
lexical alias: binderCorporateBody.en
status: Published
type: Property
domain: C10003
label: ciltleyen tüzel kişi ile ilişkilidir @tr
label: grāmatsējējs (institūcija) @lv
label: ha come rilegatore ente @it
label: har bokbinder (korporasjon) @no
label: har korporation, som er bogbinder @da
label: has binder corporate body @en
label: hat Buchbinderin/Buchbinder (Körperschaft) @de
label: heeft binder-corporatie @nl
label: köitja (asutus) @et
label: könyvkötő testülete a következő: @hu
label: sitoja (yhteisö) @fi
label: té com a entitat corporativa enquadernadora @ca
label: له هيئة مسئولة عن التجليد @ar
label: 有装订者团体 @zh-hans
sub property of: a pour agent collectif relieur
sub property of: a pour collectivité modificatrice
definition: Bir kopyayı, bir kopyayı ciltleyen tüzel bir kişiyle ilişkilendirir. @tr
definition: Correla un item a un ente che rilega un item. @it
definition: Egy példányt hozzákapcsol egy testülethez, amely beköti a példányt. @hu
definition: Liittää kappaleen yhteisöön, joka sitoo kappaleen. @fi
definition: Met un item en relation avec une collectivité qui relie un item.
definition: Relaciona un ítem amb una entitat corporativa que enquaderna un ítem. @ca
definition: Relateert een item aan een corporatie die een item bindt. @nl
definition: Relaterer et eksemplar til en korporasjon som binder inn et eksemplar. @no
definition: Relaterer et eksemplar til en korporation, som indbinder et eksemplar. @da
definition: Relates an item to a corporate body who binds an item. @en
definition: Sasaista vienību ar institūciju, kas ir iesējusi vienību. @lv
definition: Seostab eksemplari asutusega, kes on eksemplari köitnud. @et
definition: Setzt ein Exemplar in Beziehung zu einer Körperschaft, die ein Exemplar bindet. @de
definition: يربط مفردة بهيئة تجلد مفردة. @ar
definition: 将一个单件与装订单件的一个团体关联起来。 @zh-hans

a pour collectivité conservatrice
has element type: 2
toolkit definition: A corporate body who conceives or manages the aggregation of an item in an exhibition or collection. (Deprecated) @en
toolkit definition: Asutus, kes kavandab või korraldab eksemplari liitmise näituse või koguga. @et
toolkit definition: Collectivité qui conçoit ou gère l’agrégation d’un item dans une exposition ou une collection.
toolkit definition: Een corporatie die de samenstelling bedenkt of beheert van een item in een tentoonstelling of collectie. @nl
toolkit definition: Egy testület, amely kigondolja vagy kezeli egy példány begyűjtését kiállítás keretébe vagy gyűjteménybe. @hu
toolkit definition: Einer Körperschaft, die die Aggregation eines Exemplars in einer Ausstellung oder Sammlung konzipiert oder organisiert. @de
toolkit definition: En korporasjon som har idéen til eller håndterer innsamlingen av et eksemplar i en utstilling eller samling. @no
toolkit definition: Ente che concepisce o gestisce l'aggregazione di un item nell'ambito di una mostra o collezione. @it
toolkit definition: Entitat corporativa que concep o gestiona l’agregació d’un ítem en una exposició o en una col·lecció. @ca
toolkit definition: Institūcija, kas iecer un realizē vienības iekļaušanu izstādē vai kolekcijā. @lv
toolkit definition: Korporation, som udtænker eller administrerer samlingen af et eksemplar til en udstilling eller samling. @da
toolkit definition: Yhteisö, joka saa aikaan ja hallinnoi näyttelyn tai kokoelman kappaleaggregaatiota. @fi
toolkit definition: هيئة تطرح تجميعة لمفردة في معرض، أو في مجموعة أو تديرها . @ar
toolkit label: Kuratorin/Kurator (Körperschaft) @de
toolkit label: collectivité conservatrice
toolkit label: curator corporate body (Deprecated) @en
toolkit label: curator-corporatie @nl
toolkit label: curatore ente @it
toolkit label: entitat corporativa conservadora @ca
toolkit label: korporation, som er kurator @da
toolkit label: kuraator (asutus) @et
toolkit label: kuraattori (yhteisö) @fi
toolkit label: kurator (korporasjon) @no
toolkit label: kurators (institūcija) @lv
toolkit label: kurátor testülete: @hu
toolkit label: هيئة أمينة متحف @ar
has subproperty: a pour collectivité collectionneuse
has subproperty: a pour collectivité catalogueuse d’une collection de ressources
has subproperty: P40131
lexical alias: curatorCorporateBody.en
status: Deprecated
type: Property
domain: C10003
label: ha come curatore ente @it
label: har korporation, som er kurator @da
label: har kurator (korporasjon) @no
label: has curator corporate body (Deprecated) @en
label: hat Kuratorin/Kurator (Körperschaft) @de
label: heeft curator-corporatie @nl
label: kuraator (asutus) @et
label: kuraattori (yhteisö) @fi
label: kurators (institūcija) @lv
label: kurátor testülete a következő: @hu
label: té com a entitat corporativa conservadora @ca
label: له هيئة أمينة متحف @ar
sub property of: a pour collectivité en relation avec un item
sub property of: a pour agent collectif conservateur
definition: Correla un item a un ente che concepisce o gestisce l'aggregazione di un item nell'ambito di una mostra o collezione. @it
definition: Egy példányt hozzákapcsol egy testülethez, amely kigondolja vagy kezeli a példány begyűjtését kiállítás keretébe vagy gyűjteménybe. @hu
definition: Liittää kappaleen yhteisöön, joka saa aikaan ja hallinnoi näyttelyn tai kokoelman kappaleaggregaatiota. @fi
definition: Met un item en relation avec une collectivité qui conçoit ou gère l’agrégation d’un item dans une exposition ou une collection.
definition: Relaciona un ítem amb una entitat corporativa que concep o gestiona l’agregació d’un ítem en una exposició o en una col·lecció. @ca
definition: Relateert een item aan een corporatie die de samenstelling bedenkt of beheert van een item in een tentoonstelling of collectie. @nl
definition: Relaterer et eksemplar til en korporasjon som har idéen til eller håndterer innsamlingen av et eksemplar i en utstilling eller samling. @no
definition: Relaterer et eksemplar til en korporation, som udtænker eller administrerer samlingen af et eksemplar til en udstilling eller samling. @da
definition: Relates an item to a corporate body who conceives or manages the aggregation of an item in an exhibition or collection. (Deprecated) @en
definition: Sasaista vienību ar institūciju, kas iecer un realizē vienības iekļaušanu izstādē vai kolekcijā. @lv
definition: Seostab eksemplari asutusega, kes kavandab või korraldab eksemplari liitmise näituse või koguga. @et
definition: Setzt ein Exemplar in Beziehung zu einer Körperschaft, die die Aggregation eines Exemplars in einer Ausstellung oder Sammlung konzipiert oder organisiert. @de
definition: يربط مفردة بهيئة تطرح تجميعة لمفردة في معرض، أو في مجموعة أو تديرها. @ar

a pour collectivité enlumineuse
has element type: 2
toolkit definition: A corporate body who decorates a specific item using precious metals or colour, often with elaborate designs and motifs. @en
toolkit definition: Asutus, kes kaunistab väärismetallide ja värvidega üksikut eksemplari, sageli keeruliste kujundite ja motiividega. @et
toolkit definition: Belirli bir kopyayı, değerli metaller veya renkler kullanarak, genellikle özenle hazırlanmış tasarımlar ve motiflerle süsleyen tüzel bir kişi. @tr
toolkit definition: Collectivité qui orne un item spécifique en utilisant des métaux précieux ou de la couleur, souvent avec des dessins et des motifs élaborés.
toolkit definition: Een corporatie die een specifiek item decoreert met edelmetalen of kleur, vaak met uitgebreide ontwerpen en motieven. @nl
toolkit definition: Egy testület, amely egy adott példányt nemesfémekkel vagy színekkel díszít, gyakran gondosan kidolgozott kivitelezéssel és motívumok használával. @hu
toolkit definition: Eine Körperschaft, die ein bestimmtes Exemplar durch Edelmetalle oder Farben, häufig mit kunstvollen Mustern und Motiven, (aus-)gestaltet. @de
toolkit definition: En korporasjon som dekorerer et bestemt eksemplar med edle metaller eller farger, gjerne med intrikate former og motiver. @no
toolkit definition: Ente che decora uno specifico item utilizzando metalli o colori preziosi, spesso con progetti e motivi elaborati. @it
toolkit definition: Entitat corporativa que decora un ítem concret amb metalls preciosos o amb color, sovint amb dissenys i motius elaborats. @ca
toolkit definition: Institūcija, kas izgreznojusi konkrēto vienību, izmantojot krāsu un/vai dārgmetālus, bieži ar izsmalcinātiem un filigrāniem zīmējumiem, burtiem un motīviem. @lv
toolkit definition: Korporation, som udsmykker et særligt eksemplar med ædelmetal eller farve, ofte med detaljerige mønstre og motiver. @da
toolkit definition: Yhteisö, joka koristelee yksittäisen kappaleen käyttäen jalometalleja tai värejä, usein yksityiskohtaisissa kuvioissa tai motiiveissa. @fi
toolkit definition: هيئة تزين مفردة محددة باستخدام معادن ثمينة أو ألوان، غالبًا بتصاميم وزخارف منمقة. @ar
toolkit definition: 对特定单件用贵重的金属或色彩（通常有精心的设计和图案）进行装饰的一个团体 @zh-hans
toolkit label: Illuminatorin/Illuminator (Körperschaft) @de
toolkit label: collectivité enlumineuse
toolkit label: entitat corporativa il·luminadora @ca
toolkit label: illuminator (korporasjon) @no
toolkit label: illuminator corporate body @en
toolkit label: illumineerija (asutus) @et
toolkit label: illuminoinnin tekijä (yhteisö) @fi
toolkit label: illuminátor testülete: @hu
toolkit label: iluminators (institūcija) @lv
toolkit label: korporation, som er illuminator @da
toolkit label: miniatore ente @it
toolkit label: tezhip sanatçısı tüzel kişi ile ilişkilidir @tr
toolkit label: verluchter-corporatie @nl
toolkit label: هيئة مزخرفة @ar
toolkit label: 彩饰者团体 @zh-hans
has subproperty: P40132
lexical alias: illuminatorCorporateBody.en
status: Published
type: Property
domain: C10003
label: ha come miniatore ente @it
label: har illuminator (korporasjon) @no
label: har korporation, som er illuminator @da
label: has illuminator corporate body @en
label: hat Illuminatorin/Illuminator (Körperschaft) @de
label: heeft verluchter-corporatie @nl
label: illumineerija (asutus) @et
label: illuminoinnin tekijä (yhteisö) @fi
label: illuminátor testülete a következő: @hu
label: iluminators (institūcija) @lv
label: tezhip sanatçısı tüzel kişisi ile ilişkilidir @tr
label: té com a entitat corporativa il·luminadora @ca
label: له هيئة مزخرفة @ar
label: 有彩饰者团体 @zh-hans
sub property of: a pour agent collectif enlumineur
sub property of: a pour collectivité modificatrice
definition: Bir kopyayı, belirli bir kopyanın değerli metaller veya renkler kullanarak, genellikle özenle hazırlanmış tasarımlar ve motiflerle süsleyen tüzel bir kişiyle ilişkilendirir. @tr
definition: Correla un item a un ente che decora uno specifico item utilizzando metalli o colori preziosi, spesso con progetti e motivi elaborati. @it
definition: Hozzákapcsol egy példányt egy testülethez, amely egy adott példányt nemesfémekkel vagy színekkel díszít, gyakran gondosan kidolgozott kivitelezéssel és motívumok használával. @hu
definition: Liittää kappaleen yhteisöön, joka koristelee yksittäisen kappaleen käyttäen jalometalleja tai värejä, usein yksityiskohtaisissa kuvioissa tai motiiveissa. @fi
definition: Met un item en relation avec une collectivité qui orne un item spécifique en utilisant des métaux précieux ou de la couleur, souvent avec des dessins et des motifs élaborés.
definition: Relaciona un ítem amb una entitat corporativa que decora un ítem concret amb metalls preciosos o amb color, sovint amb dissenys i motius elaborats. @ca
definition: Relateert een item aan een corporatie die een specifiek item decoreert met edelmetalen of kleur, vaak met uitgebreide ontwerpen en motieven. @nl
definition: Relaterer et eksemplar til en korporasjon som dekorerer et bestemt eksemplar med edle metaller eller farger, gjerne med intrikate former og motiver. @no
definition: Relaterer et eksemplar til en korporation, som udsmykker et særligt eksemplar med ædelmetal eller farve, ofte med detaljerige mønstre og motiver. @da
definition: Relates an item to a corporate body who decorates a specific item using precious metals or colour, often with elaborate designs and motifs. @en
definition: Sasaista vienību ar institūciju, kas izgreznojusi konkrēto vienību, izmantojot krāsu un/vai dārgmetālus, bieži ar izsmalcinātiem un filigrāniem zīmējumiem, burtiem un motīviem. @lv
definition: Seostab eksemplari asutusega, kes kaunistab väärismetallide ja värvidega üksikut eksemplari, sageli keeruliste kujundite ja motiividega. @et
definition: Setzt ein Exemplar in Beziehung zu einer Körperschaft, die ein bestimmtes Exemplar durch Edelmetalle oder Farben, häufig mit kunstvollen Mustern und Motiven, (aus-)gestaltet. @de
definition: يربط مفردة بهيئة تزين مفردة محددة باستخدام معادن ثمينة أو ألوان، غالبًا بتصاميم وزخارف منمقة. @ar
definition: 将一个单件与对特定单件用贵重的金属或色彩（通常有精心的设计和图案）进行装饰的一个团体关联起来。 @zh-hans

a pour collectivité propriétaire actuelle
has element type: 2
toolkit definition: A corporate body who has current legal possession of an item. @en
toolkit definition: Asutus, kellele praegu õiguspäraselt eksemplar kuulub. @et
toolkit definition: Bir kopyanın mevcut yasal mülkiyetine sahip olan bir tüzel kişi. @tr
toolkit definition: Collectivité qui possède actuellement et légalement un item.
toolkit definition: Een corporatie die huidig wettelijk bezit heeft van een item. @nl
toolkit definition: Egy testület, amely jelenleg törvényesen birtokol egy példányt. @hu
toolkit definition: Eine Körperschaft, die derzeit im rechtmäßigen Besitz eines Exemplars ist. @de
toolkit definition: En korporasjon som for tiden er den rettmessige eieren av et eksemplar. @no
toolkit definition: Ente che detiene la proprietà giuridica attuale di un item. @it
toolkit definition: Entitat corporativa que té la propietat legal actual d’un ítem. @ca
toolkit definition: Institūcija, kas ir vienības pašreizējais likumīgais īpašnieks. @lv
toolkit definition: Korporation, som p.t. er i lovlig besiddelse af et eksemplar. @da
toolkit definition: Yhteisö, joka tällä hetkellä laillisesti omistaa kappaleen. @fi
toolkit definition: هيئة لديها حاليا الملكية القانونية لمفردة. @ar
toolkit definition: 拥有对一个单件当前法定所有权的一个团体 @zh-hans
toolkit label: Gegenwärtige Eigentümerin/Gegenwärtiger Eigentümer (Körperschaft) @de
toolkit label: collectivité propriétaire actuelle
toolkit label: current owner corporate body @en
toolkit label: entitat corporativa propietària actual @ca
toolkit label: huidige eigenaar-corporatie @nl
toolkit label: jelenlegi tulajdonos testülete: @hu
toolkit label: korporation, som er nuværende ejer @da
toolkit label: nykyinen omistaja (yhteisö) @fi
toolkit label: nåværende eier (korporasjon) @no
toolkit label: pašreizējais īpašnieks (institūcija) @lv
toolkit label: praegune omanik (asutus) @et
toolkit label: proprietario attuale ente @it
toolkit label: şu anki sahibi olan tüzel kişi @tr
toolkit label: هيئة مالكة حاليا @ar
toolkit label: 当前拥有者团体 @zh-hans
has subproperty: a pour collectivité déposante
has subproperty: P40133
lexical alias: currentOwnerCorporateBody.en
status: Published
type: Property
domain: C10003
label: ha come proprietario attuale ente @it
label: har korporation, som er nuværende ejer @da
label: har nåværende eier (korporasjon) @no
label: has current owner corporate body @en
label: hat gegenwärtige Eigentümerin/gegenwärtigen Eigentümer (Körperschaft) @de
label: heeft huidige eigenaar-corporatie @nl
label: jelenlegi tulajdonos testülete a következő: @hu
label: mevcut sahip tüzel kişisi ile ilişkilidir @tr
label: nykyinen omistaja (yhteisö) @fi
label: pašreizējais īpašnieks (institūcija) @lv
label: praegune omanik (asutus) @et
label: té com a entitat corporativa propietària actual @ca
label: له هيئة مالكة حاليا @ar
label: 有当前拥有者团体 @zh-hans
sub property of: a pour agent collectif propriétaire actuel
sub property of: a pour collectivité propriétaire
definition: Bir kopyayı, bir kopyanın halihazırda yasal mülkiyetine sahip olan tüzel bir kişiyle ilişkilendirir. @tr
definition: Correla un item a un ente che detiene l'attuale proprietà giuridica di un item. @it
definition: Egy példányt hozzákapcsol egy testülethez, amely jelenleg törvényesen birtokolja a példányt. @hu
definition: Liittää kappaleen yhteisöön, joka tällä hetkellä laillisesti omistaa kappaleen. @fi
definition: Met un item en relation avec une collectivité qui possède actuellement et légalement un item.
definition: Relaciona un ítem amb una entitat corporativa que té la propietat legal actual d’un ítem. @ca
definition: Relateert een item aan een corporatie die huidig wettelijk bezit heeft van een item. @nl
definition: Relaterer et eksemplar til en korporasjon som for tiden er den rettmessige eieren av et eksemplar. @no
definition: Relaterer et eksemplar til en korporation, som p.t. er i lovlig besiddelse af et eksemplar. @da
definition: Relates an item to a corporate body who has current legal possession of an item. @en
definition: Sasaista vienību ar institūciju, kas ir vienības pašreizējais likumīgais īpašnieks. @lv
definition: Seostab eksemplari asutusega, kellele praegu õiguspäraselt eksemplar kuulub. @et
definition: Setzt ein Exemplar in Beziehung zu einer Körperschaft, die derzeit im rechtmäßigen Besitz eines Exemplars ist. @de
definition: يربط مفردة بهيئة لديها حاليا الملكية القانونية لمفردة. @ar
definition: 将一个单件与拥有对一个单件当前法定所有权的一个团体关联起来。 @zh-hans

a pour ancienne collectivité propriétaire
has element type: 2
toolkit definition: A corporate body who has former legal possession of an item. @en
toolkit definition: Asutus, kellele eksemplar varem õiguspäraselt kuulus. @et
toolkit definition: Bir kopyanın daha önce yasal mülkiyetine sahip olan bir tüzel kişi. @tr
toolkit definition: Collectivité qui a auparavant possédé légalement un item.
toolkit definition: Een corporatie die voormalig wettelijk bezit had van een item. @nl
toolkit definition: Egy testület, amely egy példányt jelenleg törvényesen birtokol. @hu
toolkit definition: Eine Körperschaft, die früher im rechtmäßigen Besitz eines Exemplars war. @de
toolkit definition: En korporasjon som tidligere var den rettmessige eieren av et eksemplar. @no
toolkit definition: Ente che ha detenuto in precedenza la proprietà giuridica di un item. @it
toolkit definition: Entitat corporativa que té la propietat legal anterior d’un ítem. @ca
toolkit definition: Institūcija, kam vienība iepriekš ir bijusi juridiskā īpašumā. @lv
toolkit definition: Korporation, som tidligere har været i lovlig besiddelse af et eksemplar. @da
toolkit definition: Yhteisö, joka on aiemmin laillisesti omistanut kappaleen. @fi
toolkit definition: هيئة لديها سابقا الملكية القانونية لمفردة. @ar
toolkit definition: 拥有对一个单件先前法定所有权的一个团体 @zh-hans
toolkit label: agrākais īpašnieks (institūcija) @lv
toolkit label: aiempi omistaja (yhteisö) @fi
toolkit label: ancienne collectivité propriétaire
toolkit label: endine omanik (asutus) @et
toolkit label: entitat corporativa propietària anterior @ca
toolkit label: former owner corporate body @en
toolkit label: frühere Eigentümerin/Früherer Eigentümer (Körperschaft) @de
toolkit label: korporation, som er tidligere ejer @da
toolkit label: korábbi tulajdonos testülete: @hu
toolkit label: proprietario precedente ente @it
toolkit label: tidligere eier (korporasjon) @no
toolkit label: voormalige eigenaar-corporatie @nl
toolkit label: önceki sahibi olan tüzel kişi @tr
toolkit label: هيئة المالك السابق @ar
toolkit label: 先前拥有者团体 @zh-hans
has subproperty: a pour collectivité donatrice
has subproperty: a pour collectivité vendeuse
has subproperty: P40134
lexical alias: formerOwnerCorporateBody.en
status: Published
type: Property
domain: C10003
label: agrākais īpašnieks (institūcija) @lv
label: aiempi omistaja (yhteisö) @fi
label: endine omanik (asutus) @et
label: eski sahip tüzel kişisi ile ilişkilidir @tr
label: ha come proprietario precedente ente @it
label: har korporation, som er tidligere ejer @da
label: har tidligere eier (korporasjon) @no
label: has former owner corporate body @en
label: hat frühere Eigentümerin/früheren Eigentümer (Körperschaft) @de
label: heeft voormalige eigenaar-corporatie @nl
label: korábbi tulajdonos testülete a következő: @hu
label: té com a entitat corporativa propietària anterior @ca
label: له هيئة مالكة سابقة @ar
label: 有先前拥有者团体 @zh-hans
sub property of: a pour ancien agent collectif propriétaire
sub property of: a pour collectivité propriétaire
definition: Bir kopyayı, bir kopyanın daha önce yasal mülkiyetine sahip olan tüzel bir kişiyle ilişkilendirir. @tr
definition: Correla un item a un ente che ha detenuto in precedenza la proprietà giuridica di un item. @it
definition: Egy példányt hozzákapcsol egy testülethez, amely korábban törvényesen birtokolta a példányt. @hu
definition: Liittää kappaleen yhteisöön, joka on aiemmin laillisesti omistanut kappaleen. @fi
definition: Met un item en relation avec une collectivité qui a auparavant possédé légalement un item.
definition: Relaciona un ítem amb una entitat corporativa que té la propietat legal anterior d’un ítem. @ca
definition: Relateert een item aan een corporatie die voormalig wettelijk bezit had van een item. @nl
definition: Relaterer et eksemplar til en korporasjon som tidligere var den rettmessige eieren av et eksemplar. @no
definition: Relaterer et eksemplar til en korporation, som tidligere har været i lovlig besiddelse af et eksemplar. @da
definition: Relates an item to a corporate body who has former legal possession of an item. @en
definition: Sasaista vienību ar institūciju, kam vienība iepriekš ir bijusi juridiskā īpašumā. @lv
definition: Seostab eksemplari asutusega, kellele eksemplar varem õiguspäraselt kuulus. @et
definition: Setzt ein Exemplar in Beziehung zu einer Körperschaft, die früher im rechtmäßigen Besitz eines Exemplars war. @de
definition: يربط مفردة بهيئة لديها سابقا الملكية القانونية لمفردة. @ar
definition: 将一个单件与拥有对一个单件先前法定所有权的一个团体关联起来。 @zh-hans

a pour collectivité dépositaire
has element type: 2
toolkit definition: A corporate body who has legal custody of an item. @en
toolkit definition: Asutus, kelle õiguspärasel vastutaval hoiul eksemplar on. @et
toolkit definition: Bir kopyanın yasal velayetine sahip olan tüzel kişi. @tr
toolkit definition: Collectivité à qui est confiée la garde légale d’un item.
toolkit definition: Een corporatie die van rechtswege een item bewaart. @nl
toolkit definition: Egy testület, amely egy példány törvényes megőrzője. @hu
toolkit definition: Eine Körperschaft, der die rechtmäßige Verwahrung eines Exemplars obliegt. @de
toolkit definition: En korporasjon som har et eksemplar i lovlig forvaring. @no
toolkit definition: Ente che detiene la custodia giuridica di un item. @it
toolkit definition: Entitat corporativa que té la custodia legal d’un ítem. @ca
toolkit definition: Institūcija, kas likumīgi glabā vienību. @lv
toolkit definition: Korporation, som lovligt har et eksemplar i forvaring. @da
toolkit definition: Yhteisö, jolla on kappaleen laillinen säilyttämisoikeus. @fi
toolkit definition: هيئة لديها الوصاية القانونية على مفردة. @ar
toolkit definition: 对一个单件拥有合法保管权的一个团体 @zh-hans
toolkit label: Verwahrerin/Verwahrer (Körperschaft) @de
toolkit label: collectivité dépositaire
toolkit label: curatele-corporatie @nl
toolkit label: custodian corporate body @en
toolkit label: depositario ente @it
toolkit label: entitat corporativa dipositària @ca
toolkit label: korporation, som er forvalter @da
toolkit label: koruyucu tüzel kişi @tr
toolkit label: letétkezelő testülete: @hu
toolkit label: oppbevarer (korporasjon) @no
toolkit label: pārvaldītājs (institūcija) @lv
toolkit label: säilyttäjä (yhteisö) @fi
toolkit label: vastutav hoidja (asutus) @et
toolkit label: هيئة وصية @ar
toolkit label: 保管者团体 @zh-hans
has subproperty: P40135
lexical alias: custodianCorporateBody.en
status: Published
type: Property
domain: C10003
label: ha come depositario ente @it
label: har korporation, som er forvalter @da
label: har oppbevarer (korporasjon) @no
label: has custodian corporate body @en
label: hat Verwahrerin/Verwahrer (Körperschaft) @de
label: heeft curatele-corporatie @nl
label: koruyucu tüzel kişisi ile ilişkilidir @tr
label: letétkezelő testülete a következő: @hu
label: pārvaldītājs (institūcija) @lv
label: säilyttäjä (yhteisö) @fi
label: té com a entitat corporativa dipositària @ca
label: vastutav hoidja (asutus) @et
label: له هيئة وصية @ar
label: 有保管者团体 @zh-hans
sub property of: a pour collectivité en relation avec un item
sub property of: a pour agent collectif dépositaire
definition: Bir kopyayı, bir kopyanın yasal velayetine sahip olan tüzel bir kişiyle ilişkilendirir. @tr
definition: Correla un item a un ente che detiene la custodia giuridica di un item. @it
definition: Egy példányt hozzákapcsol egy testülethez, amely a példány törvényes megőrzője. @hu
definition: Liittää kappaleen yhteisöön, jolla on kappaleen laillinen säilyttämisoikeus. @fi
definition: Met un item en relation avec une collectivité à qui est confiée la garde légale d’un item.
definition: Relaciona un ítem amb una entitat corporativa que té la custodia legal d’un ítem. @ca
definition: Relateert een item aan een corporatie die van rechtswege een item bewaart. @nl
definition: Relaterer et eksemplar til en korporasjon som har et eksemplar i lovlig forvaring. @no
definition: Relaterer et eksemplar til en korporation, som lovligt har et eksemplar i forvaring. @da
definition: Relates an item to a corporate body who has legal custody of an item. @en
definition: Sasaista vienību ar institūciju, kas likumīgi glabā vienību. @lv
definition: Seostab eksemplari asutusega, kelle õiguspärasel vastutaval hoiul eksemplar on. @et
definition: Setzt ein Exemplar in Beziehung zu einer Körperschaft, der die rechtmäßige Verwahrung eines Exemplars obliegt. @de
definition: يربط مفردة بهيئة لديها الوصاية القانونية على مفردة. @ar
definition: 将一个单件与对一个单件拥有合法保管权的一个团体关联起来。 @zh-hans

a pour collectivité propriétaire
has element type: 2
toolkit definition: A corporate body who has current or former legal possession of an item. @en
toolkit definition: Asutus, kellele eksemplar praegu õiguspäraselt kuulub või varem kuulus. @et
toolkit definition: Bir kopyanın mevcut veya eski yasal mülkiyetine sahip olan bir tüzel kişi. @tr
toolkit definition: Collectivité qui possède actuellement ou a auparavant possédé légalement un item.
toolkit definition: Een corporatie die huidig of voormalig wettelijk bezit heeft van een item. @nl
toolkit definition: Egy testület, amely törvényesen birtokol egy példányt. @hu
toolkit definition: Eine Körperschaft, die gegenwärtig oder früher im rechtmäßigen Besitz eines Exemplars ist/war. @de
toolkit definition: En korporasjon som er den rettmessige eieren av et eksemplar. @no
toolkit definition: Ente che detiene la proprietà giuridica di un item. @it
toolkit definition: Entitat corporativa que té la propietat legal actual o anterior d’un ítem. @ca
toolkit definition: Institūcija, kam ir vai ir bijušas likumīgas tiesības uz īpašumu. @lv
toolkit definition: Korporation, som er i lovlig besiddelse af et eksemplar. @da
toolkit definition: Yhteisö, jolla on kappaleen nykyinen tai aiempi laillinen omistusoikeus. @fi
toolkit definition: هيئة لديها الملكية القانونية حاليا أو سابقا لمفردة. @ar
toolkit definition: 拥有对一个单件当前或先前法定所有权的一个团体 @zh-hans
toolkit label: Eigentümerin/Eigentümer (Körperschaft) @de
toolkit label: collectivité propriétaire
toolkit label: eier (korporasjon) @no
toolkit label: eigenaar-corporatie @nl
toolkit label: entitat corporativa propietària @ca
toolkit label: korporation, som er ejer @da
toolkit label: omanik (asutus) @et
toolkit label: omistaja (yhteisö) @fi
toolkit label: owner corporate body @en
toolkit label: proprietario ente @it
toolkit label: sahip olan tüzel kişi @tr
toolkit label: tulajdonos testülete: @hu
toolkit label: īpašnieks (institūcija) @lv
toolkit label: هيئة مالكة @ar
toolkit label: 拥有者团体 @zh-hans
has subproperty: a pour collectivité propriétaire actuelle
has subproperty: a pour ancienne collectivité propriétaire
has subproperty: P40136
lexical alias: ownerCorporateBody.en
status: Published
type: Property
domain: C10003
label: ha come proprietario ente @it
label: har eier (korporasjon) @no
label: har korporation, som er ejer @da
label: has owner corporate body @en
label: hat Eigentümerin/Eigentümer (Körperschaft) @de
label: heeft eigenaar-corporatie @nl
label: omanik (asutus) @et
label: omistaja (yhteisö) @fi
label: sahip tüzel kişisi ile ilişkilidir @tr
label: tulajdonos testülete a következő: @hu
label: té com a entitat corporativa propietària @ca
label: īpašnieks (institūcija) @lv
label: له هيئة مالكة @ar
label: 有拥有者团体 @zh-hans
sub property of: a pour collectivité en relation avec un item
sub property of: a pour agent collectif propriétaire
definition: Bir kopyayı, bir kopyayı mevcut veya eski yasal mülkiyetine sahip olan tüzel bir kişiyle ilişkilendirir. @tr
definition: Correla un item a un ente che detiene la proprietà giuridica di un item. @it
definition: Egy példányt hozzákapcsol egy testülethez, amely törvényesen birtokolja a példányt. @hu
definition: Liittää kappaleen yhteisöön, jolla on kappaleen nykyinen tai aiempi laillinen omistusoikeus. @fi
definition: Met un item en relation avec une collectivité qui possède actuellement ou a auparavant possédé légalement un item.
definition: Relaciona un ítem amb una entitat corporativa que té la propietat legal actual o anterior d’un ítem. @ca
definition: Relateert een item aan een corporatie die huidig of voormalig wettelijk bezit heeft van een item. @nl
definition: Relaterer et eksemplar til en korporasjon som er den rettmessige eieren av et eksemplar. @no
definition: Relaterer et eksemplar til en korporation, som er i lovlig besiddelse af et eksemplar. @da
definition: Relates an item to a corporate body who has current or former legal possession of an item. @en
definition: Sasaista vienību ar institūciju, kam ir vai ir bijušas likumīgas tiesības uz īpašumu. @lv
definition: Seostab eksemplari asutusega, kellele eksemplar praegu õiguspäraselt kuulub või varem kuulus. @et
definition: Setzt ein Exemplar in Beziehung zu einer Körperschaft, die gegenwärtig oder früher im rechtmäßigen Besitz eines Exemplars ist/war. @de
definition: يربط مفردة بهيئة لديها الملكية القانونية حاليا أو سابقا لمفردة. @ar
definition: 将一个单件与拥有对一个单件当前或先前法定所有权的一个团体关联起来。 @zh-hans

a pour collectivité collectionneuse
has element type: 2
toolkit definition: A corporate body who is a curator who brings together items from various sources that are arranged, described, or catalogued as a collection. (Deprecated) @en
toolkit definition: Asutus, kes kuraatorina kogub eri allikatest kokku eksemplarid, mis korrastatakse, kirjeldatakse või kataloogitakse koguna. @et
toolkit definition: Collectivité conservatrice qui rassemble des items de diverses sources qui sont arrangés, décrits et catalogués comme une collection.
toolkit definition: Een corporatie die een curator is die items samenbrengt uit diverse bronnen die gerangschikt, beschreven of gecatalogiseerd zijn als een collectie. @nl
toolkit definition: Egy kurátor testület, amely különböző forrásokból származó, gyűjteményként rendezett, leírt és katalogizált példányokat fog össze. @hu
toolkit definition: Eine Kuratorin/Ein Kurator (Körperschaft), die/der Materialien aus unterschiedlichen Quellen zusammenträgt, die dann als Sammlung geordnet, beschrieben oder katalogisiert werden. @de
toolkit definition: En korporasjon som er en kurator som setter sammen eksemplarer fra ulike kilder og som er arrangert, beskrevet eller katalogisert som en samling. @no
toolkit definition: Ente curatore che raccoglie item da varie fonti, che sono organizzati, descritti o catalogati come una collezione. @it
toolkit definition: Entitat corporativa que és un conservador que aplega ítems de diverses fonts que s’arrangen, es descriuen o es cataloguen com una col·lecció. @ca
toolkit definition: Institūcija, kas apkopo vienības no dažādiem avotiem, kas ir sakārtotas, aprakstītas vai kataloģizētas kā kolekcija. @lv
toolkit definition: Korporation, som er kurator, som indsamler eksemplarer fra forskellige kilder, som bliver arrangeret, beskrevet eller katalogiseret som en samling. @da
toolkit definition: Kuraattorina toimiva yhteisö, joka kokoaa eri lähteistä järjestettävät, kuvailtavat ja luetteloitavat kappaleet kokoelmaksi. @fi
toolkit definition: هيئة هي أمينة متحف تجمع معاً مفردات من مصادر مختلفة رتُبت، أو وُصفت، أو فُهرست كمجموعة. @ar
toolkit label: Sammlerin/Sammler (Körperschaft) @de
toolkit label: collectivité collectionneuse
toolkit label: collector corporate body (Deprecated) @en
toolkit label: collezionista ente @it
toolkit label: entitat corporativa col·leccionista @ca
toolkit label: kogu moodustaja (asutus) @et
toolkit label: kokoelman muodostaja (yhteisö) @fi
toolkit label: kolekcionārs (institūcija) @lv
toolkit label: kollektor testület: @hu
toolkit label: korporation, som er samler @da
toolkit label: samler (korporasjon) @no
toolkit label: verzamelaar-corporatie @nl
toolkit label: هيئة جامعة @ar
has subproperty: P40137
lexical alias: collectorCorporateBody.en
status: Deprecated
type: Property
domain: C10003
label: ha come collezionista ente @it
label: har korporation, som er samler @da
label: har samler (korporasjon) @no
label: has collector corporate body (Deprecated) @en
label: hat Sammlerin/Sammler (Körperschaft) @de
label: heeft verzamelaar-corporatie @nl
label: kogu moodustaja (asutus) @et
label: kokoelman muodostaja (yhteisö) @fi
label: kolekcionārs (institūcija) @lv
label: kollektor testülete a következő: @hu
label: té com a entitat corporativa col·leccionista @ca
label: له هيئة تجميع @ar
sub property of: a pour agent collectif collectionneur
sub property of: a pour collectivité conservatrice
definition: Correla un item all'ente curatore che raccoglie item da varie fonti, che sono organizzati, descritti o catalogati come una collezione. @it
definition: Hozzákapcsol egy példányt egy kurátor testülethez, amely különböző forrásokból származó, gyűjteményként rendezett, leírt és katalogizált példányokat fog össze. @hu
definition: Liittää kappaleen kuraattorina toimivaan yhteisöön, joka kokoaa eri lähteistä järjestettävät, kuvailtavat ja luetteloitavat kappaleet kokoelmaksi. @fi
definition: Met un item en relation avec une collectivité conservatrice qui rassemble des items de diverses sources qui sont arrangés, décrits et catalogués comme une collection.
definition: Relaciona un ítem amb una entitat corporativa que és un conservador que aplega ítems de diverses fonts que s’arrangen, es descriuen o es cataloguen com una col·lecció. @ca
definition: Relateert een item aan een corporatie die een curator is die items samenbrengt uit diverse bronnen die gerangschikt, beschreven of gecatalogiseerd zijn als een collectie. @nl
definition: Relaterer et eksemplar til en korporasjon som er en kurator som setter sammen eksemplarer fra ulike kilder og som er arrangert, beskrevet eller katalogisert som en samling. @no
definition: Relaterer et eksemplar til en korporation, som er kurator, som indsamler eksemplarer fra forskellige kilder, som bliver arrangeret, beskrevet eller katalogiseret som en samling. @da
definition: Relates an item to a corporate body who is a curator who brings together items from various sources that are arranged, described, or catalogued as a collection. (Deprecated) @en
definition: Sasaista vienību ar institūciju, kas apkopo vienības no dažādiem avotiem, kas ir sakārtotas, aprakstītas vai kataloģizētas kā kolekcija. @lv
definition: Seostab eksemplari asutusega, kes kuraatorina kogub eri allikatest kokku eksemplarid, mis korrastatakse, kirjeldatakse või kataloogitakse koguna. @et
definition: Setzt ein Exemplar in Beziehung zu einer Kuratorin/einem Kurator (Körperschaft), die/der Materialien aus unterschiedlichen Quellen zusammenträgt, die dann als Sammlung geordnet, beschrieben oder katalogisiert werden. @de
definition: يربط مفردة بهيئة هي أمينة متحف تجمع معاً مفردات من مصادر مختلفة رتُبت، أو وُصفت، أو فُهرست كمجموعة. @ar

a pour collectivité catalogueuse d’une collection de ressources
has element type: 2
toolkit definition: A corporate body who is a curator who lists or inventories items in a collection aggregate. (Deprecated) @en
toolkit definition: Asutus, kes kuraatorina loetleb või inventeerib kogu eksemplarid. @et
toolkit definition: Collectivité conservatrice qui dresse une liste ou un inventaire des items faisant partie d’un agrégat par regroupement.
toolkit definition: Een corporatie die een curator is die een lijst of inventaris aanlegt van items in een collectie-aggregaat. @nl
toolkit definition: Egy kurátor testület, amely példányokat sorol fel vagy leltároz egy gyűjteményi aggregátumban. @hu
toolkit definition: Eine Kuratorin/Ein Kurator (Körperschaft), die/der die Exemplare in einem Sammlungsaggregat verzeichnet oder inventarisiert. @de
toolkit definition: En korporasjon som er en kurator som lager lister eller oversikter over eksemplarene i en aggregert samling. @no
toolkit definition: Ente curatore che elenca o inventaria gli item in un aggregato collezione. @it
toolkit definition: Entitat corporativa que és un conservador que llista o inventaria els ítems en una col·lecció agregada. @ca
toolkit definition: Institūcija, kas kolekciju apkopojumā uzskaita vai inventarizē vienības. @lv
toolkit definition: Korporation, som er kurator, som listefører eller opgører en inventarliste over eksemplarer i et samlingsaggregat. @da
toolkit definition: Kuraattorina toimiva yhteisö, joka luetteloi tai inventoi kokoelma-aggregaatin kappaleet. @fi
toolkit definition: هيئة أمينة متحف تقوم بتسجيل قوائم مفردات أو جردها لمجموعة مجمعة. @ar
toolkit label: Registrarin/Registrar (Körperschaft) @de
toolkit label: collectieregistrator-corporatie @nl
toolkit label: collection registrar corporate body (Deprecated) @en
toolkit label: collectivité catalogueuse d’une collection de ressources
toolkit label: conservatore di collezione ente @it
toolkit label: entitat corporativa conservadora de col·leccions @ca
toolkit label: gyűjtemény-nyilvántartó testület: @hu
toolkit label: kogu registreerija (asutus) @et
toolkit label: kokoelman luetteloija (yhteisö) @fi
toolkit label: kolekcijas reģistrētājs (institūcija) @lv
toolkit label: korporation, som er samlingsregistrator @da
toolkit label: samlingsregistrator (korporasjon) @no
toolkit label: هيئة مسجلة المجموعات @ar
has subproperty: P40138
lexical alias: collectionRegistrarCorporateBody.en
status: Deprecated
type: Property
domain: C10003
label: gyűjtemény-nyilvántartó testülete a következő: @hu
label: ha come conservatore di collezione ente @it
label: har korporation, som er samlingsregistrator @da
label: har samlingsregistrator (korporasjon) @no
label: has collection registrar corporate body (Deprecated) @en
label: hat Registrarin/Registrar (Körperschaft) @de
label: heeft collectieregistrator-corporatie @nl
label: kogu registreerija (asutus) @et
label: kokoelman luetteloija (yhteisö) @fi
label: kolekcijas reģistrētājs (institūcija) @lv
label: té com a entitat corporativa conservadora de col·leccions @ca
label: هي هيئة مسجلة المجموعات لـ @ar
sub property of: a pour agent collectif catalogueur d’une collection de ressources
sub property of: a pour collectivité conservatrice
alternative label: collectivité conservatrice d’une collection de ressources
definition: Correla un item all'ente curatore che elenca o inventaria gli item in un aggregato collezione. @it
definition: Hozzákapcsol egy példányt egy kurátor testülethez, amely példányokat sorol fel vagy leltároz egy gyűjteményi aggregátumban. @hu
definition: Liittää kappaleen kuraattorina toimivaan yhteisöön, joka luetteloi tai inventoi kokoelma-aggregaatin kappaleet. @fi
definition: Met un item en relation avec une collectivité conservatrice qui dresse une liste ou un inventaire des items faisant partie d’un agrégat par regroupement.
definition: Relaciona un ítem amb una entitat corporativa que és un conservador que llista o inventaria els ítems en una col·lecció agregada. @ca
definition: Relateert een item aan een corporatie die een curator is die een lijst of inventaris aanlegt van items in een collectie-aggregaat. @nl
definition: Relaterer et eksemplar til en korporasjon som er en kurator som lager lister eller oversikter over eksemplarene i en aggregert samling. @no
definition: Relaterer et eksemplar til en korporation, som er kurator, som listefører eller opgører en inventarliste over eksemplarer i et samlingsaggregat. @da
definition: Relates an item to a corporate body who is a curator who lists or inventories items in a collection aggregate. (Deprecated) @en
definition: Sasaista vienību ar institūciju, kas kolekciju apkopojumā uzskaita vai inventarizē vienības. @lv
definition: Seostab eksemplari asutusega, kes kuraatorina loetleb või inventeerib kogu eksemplarid. @et
definition: Setzt ein Exemplar in Beziehung zu einer Kuratorin/einem Kurator (Körperschaft), die/der die Exemplare in einem Sammlungsaggregat verzeichnet oder inventarisiert. @de
definition: يربط مفردة بهيئة هي أمينة متحف تقوم بتسجيل قوائم مفردات أو جردها لمجموعة مجمعة. @ar

a pour collectivité déposante
has element type: 2
toolkit definition: A corporate body who is a current owner of an item who deposits the item into the custody of another agent without transferring ownership. @en
toolkit definition: Asutus, kes praeguse omanikuna deponeerib eksemplari teise tegija vastutavale hoiule ilma omandiõiguse üleminekuta. @et
toolkit definition: Bir kopyayı mevcut sahibi olan ve mülkiyeti devretmeden kopyayı başka bir temsilcinin gözetimine emanet eden bir tüzel kişi. @tr
toolkit definition: Collectivité propriétaire actuelle d’un item qui dépose l’item sous la garde d’un autre agent sans en transférer la propriété.
toolkit definition: Een corporatie die een huidige eigenaar is van een item die het item onderbrengt bij een andere actor zonder eigenaarschap over te dragen. @nl
toolkit definition: Egy testület, amely egy példány jelenlegi tulajdonosa, és amely egy másik ágens megőrzésébe letétként helyezi el a példányt anélkül, hogy a tulajdonjogot átruházná. @hu
toolkit definition: Eine gegenwärtige Eigentümerin/Ein gegenwärtiger Eigentümer (Körperschaft) eines Exemplars, die/der das Exemplar in die Obhut eines anderen Akteurs gibt, ohne das Eigentumsrecht zu übertragen. @de
toolkit definition: En korporasjon som er en nåværende eier av et eksemplar som deponerer eksemplaret til forvaring til en annen agent uten at eierskapet blir overført. @no
toolkit definition: Entitat corporativa que és un propietari actual d’un ítem que el diposita sota la custòdia d’un altre agent sense transferir-li la propietat. @ca
toolkit definition: Institūcija, pašreizējais vienības īpašnieks, kurš deponējis vienību cita aģenta uzglabāšanā, vienlaikus saglabājot īpašumtiesības. @lv
toolkit definition: Kappaleen nykyinen omistajayhteisö, joka tallettaa kappaleen toisen toimijan huostaan omistajuudesta luopumatta. @fi
toolkit definition: Korporation, som er nuværende ejer af et eksemplar, som deponerer eksemplaret til forvaring hos en anden agent, men uden at overgive ejerskab. @da
toolkit definition: Proprietario attuale ente di un item che deposita l'item sotto la custodia di un altro agente senza trasferirne la proprietà. @it
toolkit definition: هيئة هي المالك الحالي لمفردة، يودعها تحت وصاية وكيل آخر دون نقل ملكيتها. @ar
toolkit definition: 作为单件的当前拥有者将单件委托给另一个行为者保管但未转让所有权的一个团体 @zh-hans
toolkit label: Leihgeberin/Leihgeber (Körperschaft) @de
toolkit label: bruikleen-corporatie @nl
toolkit label: collectivité déposante
toolkit label: deponeerija (asutus) @et
toolkit label: deponent (korporasjon) @no
toolkit label: deponents (institūcija) @lv
toolkit label: depositante ente @it
toolkit label: depositor corporate body @en
toolkit label: entitat corporativa dipositadora @ca
toolkit label: korporation, som er udlåner @da
toolkit label: letétbe helyező testülete: @hu
toolkit label: mevduatçı tüzel kişi @tr
toolkit label: tallettaja (yhteisö) @fi
toolkit label: هيئة مودعة @ar
toolkit label: 托存者团体 @zh-hans
has subproperty: P40139
lexical alias: depositorCorporateBody.en
status: Published
type: Property
domain: C10003
label: deponeerija (asutus) @et
label: deponents (institūcija) @lv
label: ha come depositante ente @it
label: har deponent (korporasjon) @no
label: har korporation, som er udlåner @da
label: has depositor corporate body @en
label: hat Leihgeberin/Leihgeber (Körperschaft) @de
label: heeft bruikleen-corporatie @nl
label: letétbe helyező testülete a következő: @hu
label: mevduatçı tüzel kişisi ile ilişkilidir @tr
label: tallettaja (yhteisö) @fi
label: té com a entitat corporativa dipositadora @ca
label: له هيئة مودعة @ar
label: 有托存者团体 @zh-hans
sub property of: a pour agent collectif déposant
sub property of: a pour collectivité propriétaire actuelle
definition: Bir kopyayı, bir kopyanın mevcut sahibi olan ve mülkiyeti devretmeden eşyayı başka bir temsilcinin emanetine bırakan tüzel bir kişiyle ilişkilendirir. @tr
definition: Correla un item al proprietario attuale ente di un item che deposita l'item sotto la custodia di un altro agente senza trasferirne la proprietà. @it
definition: Hozzákapcsol egy példányt egy testülethez, amely egy példány jelenlegi tulajdonosa, és amely egy másik ágens megőrzésébe letétként helyezi el a példányt anélkül, hogy a tulajdonjogot átruházná. @hu
definition: Liittää kappaleen sen nykyiseen omistajayhteisöön, joka tallettaa kappaleen toisen toimijan huostaan omistajuudesta luopumatta. @fi
definition: Met un item en relation avec une collectivité propriétaire actuelle d’un item qui dépose l’item sous la garde d’un autre agent sans en transférer la propriété.
definition: Relaciona un ítem amb una entitat corporativa que és un propietari actual d’un ítem que el diposita sota la custòdia d’un altre agent sense transferir-li la propietat. @ca
definition: Relateert een item aan een corporatie die een huidige eigenaar is van een item die het item onderbrengt bij een andere actor zonder eigenaarschap over te dragen. @nl
definition: Relaterer et eksemplar til en korporasjon som er en nåværende eier av et eksemplar som deponerer eksemplaret til forvaring til en annen agent uten at eierskapet blir overført. @no
definition: Relaterer et eksemplar til en korporation, som er nuværende ejer af et eksemplar, som deponerer eksemplaret til forvaring hos en anden agent, men uden at overgive ejerskab. @da
definition: Relates an item to a corporate body who is a current owner of an item who deposits the item into the custody of another agent without transferring ownership. @en
definition: Sasaista vienību ar institūciju, kas ir pašreizējais vienības īpašnieks, kurš deponējis vienību cita aģenta uzglabāšanā, vienlaikus saglabājot īpašumtiesības. @lv
definition: Seostab eksemplari asutusega, kes praeguse omanikuna deponeerib eksemplari teise tegija vastutavale hoiule ilma omandiõiguse üleminekuta. @et
definition: Setzt ein Exemplar in Beziehung zu einer gegenwärtigen Eigentümerin/einem gegenwärtigen Eigentümer (Körperschaft) eines Exemplars, die/der das Exemplar in die Obhut eines anderen Akteurs gibt, ohne das Eigentumsrecht zu übertragen. @de
definition: يربط مفردة بهيئة هي المالك الحالي لمفردة، قامت بإيداعها تحت وصاية وكيل آخر دون نقل ملكيتها. @ar
definition: 将一个单件与作为单件的当前拥有者将单件委托给另一个行为者保管但未转让所有权的一个团体关联起来。 @zh-hans

a pour collectivité donatrice
has element type: 2
toolkit definition: A corporate body who is a former owner of an item who donates the item to another owner. @en
toolkit definition: Ancienne collectivité propriétaire d’un item qui fait don de cet item à un autre propriétaire.
toolkit definition: Asutus, kes eksemplari endise omanikuna on kinkinud selle teisele omanikule. @et
toolkit definition: Bir kopyanın eski sahibi olan ve kopyayı başka bir sahibine bağışlayan bir tüzel kişi. @tr
toolkit definition: Een corporatie die een voormalige eigenaar is van een item die het item schenkt aan een andere eigenaar. @nl
toolkit definition: Egy testület, amely egy példány korábbi tulajdonosa, és amely a példányt egy másik tulajdonosnak adományozza. @hu
toolkit definition: Eine frühere Eigentümerin/Ein früherer Eigentümer (Körperschaft) eines Exemplars, die/der das Exemplar einer anderen Eigentümerin/einem anderen Eigentümer überlässt. @de
toolkit definition: En korporasjon som er en tidligere eier av et eksemplar som har gitt eksemplaret til en annen eier. @no
toolkit definition: Ente proprietario precedente di un item che ha donato l'item a un altro proprietario. @it
toolkit definition: Entitat corporativa que és un propietari anterior d’un ítem que dona l’ítem a un altre propietari. @ca
toolkit definition: Institūcija, agrākais vienības īpašnieks, kurš ziedojis šo vienību citam īpašniekam. @lv
toolkit definition: Kappaleen aiempi omistajayhteisö, joka lahjoittaa sen toiselle omistajalle. @fi
toolkit definition: Korporation, som er tidligere ejer af et eksemplar, som har doneret dette eksemplar til en anden ejer. @da
toolkit definition: هيئة هي مالك سابق لمفردة تبرعت بها لمالك آخر. @ar
toolkit definition: 作为先前拥有者将单件捐赠给另一个拥有者的一个团体 @zh-hans
toolkit label: Stifterin/Stifter (Körperschaft) @de
toolkit label: adományozó testülete: @hu
toolkit label: annetaja (asutus) @et
toolkit label: bağışçı tüzel kişi @tr
toolkit label: collectivité donatrice
toolkit label: donatore ente @it
toolkit label: donor corporate body @en
toolkit label: entitat corporativa donant @ca
toolkit label: giver (korporasjon) @no
toolkit label: korporation, som er donor @da
toolkit label: lahjoittaja (yhteisö) @fi
toolkit label: schenker-corporatie @nl
toolkit label: ziedotājs (institūcija) @lv
toolkit label: هيئة متبرعة @ar
toolkit label: 捐赠者团体 @zh-hans
has subproperty: P40140
lexical alias: donorCorporateBody.en
status: Published
type: Property
domain: C10003
label: adományozó testülete a következő: @hu
label: annetaja (asutus) @et
label: bağışçı tüzel kişisi ile ilişkilidir @tr
label: ha come donatore ente @it
label: har giver (korporasjon) @no
label: har korporation, som er donor @da
label: has donor corporate body @en
label: hat Stifterin/Stifter (Körperschaft) @de
label: heeft schenker-corporatie @nl
label: lahjoittaja (yhteisö) @fi
label: té com a entitat corporativa donant @ca
label: ziedotājs (institūcija) @lv
label: له هيئة متبرع @ar
label: 有捐赠者团体 @zh-hans
sub property of: a pour agent collectif donateur
sub property of: a pour ancienne collectivité propriétaire
definition: Bir kopyayı, bir kopyanın eski sahibi olan ve kopyayı başka bir sahibine bağışlayan tüzel bir kişiyle ilişkilendirir. @tr
definition: Correla un item all'ente proprietario precedente di un item, che ha donato l'item a un altro proprietario. @it
definition: Egy példányt hozzákapcsol egy testülethez, amely egy példány korábbi tulajdonosa, és amely a példányt egy másik tulajdonosnak adományozza. @hu
definition: Liittää kappaleen sen aiempaan omistajayhteisöön, joka lahjoittaa sen toiselle omistajalle. @fi
definition: Met un item en relation avec une ancienne collectivité propriétaire d’un item qui fait don de cet item à un autre propriétaire.
definition: Relaciona un ítem amb una entitat corporativa que és un propietari anterior d’un ítem que dona l’ítem a un altre propietari. @ca
definition: Relateert een item aan een corporatie die een voormalige eigenaar is van een item die het item schenkt aan een andere eigenaar. @nl
definition: Relaterer et eksemplar til en korporasjon som er en tidligere eier av et eksemplar som har gitt eksemplaret til en annen eier. @no
definition: Relaterer et eksemplar til en korporation, som er tidligere ejer af et eksemplar, som har doneret dette eksemplar til en anden ejer. @da
definition: Relates an item to a corporate body who is a former owner of an item who donates the item to another owner. @en
definition: Sasaista vienību ar institūciju, kas ir agrākais vienības īpašnieks, kurš ziedojis šo vienību citam īpašniekam. @lv
definition: Seostab eksemplari asutusega, kes eksemplari endise omanikuna on kinkinud selle teisele omanikule. @et
definition: Setzt ein Exemplar in Beziehung zu einer früheren Eigentümerin/einem früheren Eigentümer (Körperschaft) eines Exemplars, die/der das Exemplar einer anderen Eigentümerin/einem anderen Eigentümer überlässt. @de
definition: يربط مفردة بهيئة هي المالك السابق لمفردة تبرعت بها لمالك آخر. @ar
definition: 将一个单件与作为先前拥有者将单件捐赠给另一个拥有者的一个团体关联起来。 @zh-hans

a pour collectivité vendeuse
has element type: 2
toolkit definition: A corporate body who is a former owner of an item who sells the item to another owner. @en
toolkit definition: Ancienne collectivité propriétaire d’un item qui vend cet item à un autre propriétaire.
toolkit definition: Asutus, kes eksemplari endise omanikuna on müünud selle teisele omanikule. @et
toolkit definition: Bir kopyanın eski sahibi olan ve kopyayı başka bir sahibine satan bir tüzel kişi. @tr
toolkit definition: Een corporatie die een voormalige eigenaar is van een item die het item verkoopt aan een andere eigenaar. @nl
toolkit definition: Egy testület, amely egy példány korábbi tulajdonosa, és amely a példányt másik tulajdonosnak adja el. @hu
toolkit definition: Eine frühere Eigentümerin/Ein früherer Eigentümer (Körperschaft) eines Exemplars, die/der das Exemplar an eine andere Eigentümerin/einen anderen Eigentümer verkauft. @de
toolkit definition: En korporasjon som er en tidligere eier av et eksemplar, som har solgt eksemplaret til en annen eier. @no
toolkit definition: Ente proprietario precedente di un item che ha venduto l'item a un altro proprietario. @it
toolkit definition: Entitat corporativa que és un propietari anterior d’un ítem que ven l’ítem a un altre propietari. @ca
toolkit definition: Institūcija - vienības agrākais īpašnieks, kura pārdod šo vienību citam īpašniekam. @lv
toolkit definition: Kappaleen aiempi omistajayhteisö, joka myy kappaleen toiselle omistajalle. @fi
toolkit definition: Korporation, som er tidligere ejer af et eksemplar, som har solgt dette eksemplar til en anden ejer. @da
toolkit definition: هيئة هي مالك سابق لمفردة قامت ببيعها لمالك آخر. @ar
toolkit definition: 作为先前拥有者将单件出售给另一个拥有者的一个团体 @zh-hans
toolkit label: Verkäuferin/Verkäufer (Körperschaft) @de
toolkit label: collectivité vendeuse
toolkit label: entitat corporativa venedora @ca
toolkit label: korporation, som er sælger @da
toolkit label: myyjä (yhteisö) @fi
toolkit label: müüja (asutus) @et
toolkit label: pārdevējs (institūcija) @lv
toolkit label: satıcı tüzel kişi @tr
toolkit label: selger (korporasjon) @no
toolkit label: seller corporate body @en
toolkit label: venditore ente @it
toolkit label: verkoper-corporatie @nl
toolkit label: értékesítő testülete: @hu
toolkit label: هيئة بائعة @ar
toolkit label: 出售者团体 @zh-hans
has subproperty: P40141
lexical alias: sellerCorporateBody.en
status: Published
type: Property
domain: C10003
label: ha come venditore ente @it
label: har korporation, som er sælger @da
label: har selger (korporasjon) @no
label: has seller corporate body @en
label: hat Verkäuferin/Verkäufer (Körperschaft) @de
label: heeft verkoper-corporatie @nl
label: myyjä (yhteisö) @fi
label: müüja (asutus) @et
label: pārdevējs (institūcija) @lv
label: satıcı tüzel kişisi ile ilişkilidir @tr
label: té com a entitat corporativa venedora @ca
label: értékesítő testülete a következő: @hu
label: له هيئة بائعة @ar
label: 有出售者团体 @zh-hans
sub property of: a pour agent collectif vendeur
sub property of: a pour ancienne collectivité propriétaire
definition: Bir kopyayı, bir kopyayı başka bir sahibe satan bir kopyanın eski sahibi olan tüzel bir kişiyle ilişkilendirir. @tr
definition: Correla un item all'ente proprietario precedente di un item, che ha venduto l'item a un altro proprietario. @it
definition: Egy példányt hozzákapcsol egy testülethez, amely a példány korábbi tulajdonosa, és amely a példányt másik tulajdonosnak adja el. @hu
definition: Liittää kappaleen sen aiempaan omistajayhteisöön, joka myy kappaleen toiselle omistajalle. @fi
definition: Met un item en relation avec une ancienne collectivité propriétaire d’un item qui vend cet item à un autre propriétaire.
definition: Relaciona un ítem amb una entitat corporativa que és un propietari anterior d’un ítem que ven l’ítem a un altre propietari. @ca
definition: Relateert een item aan een corporatie die een voormalige eigenaar is van een item die het item verkoopt aan een andere eigenaar. @nl
definition: Relaterer et eksemplar til en korporasjon som er en tidligere eier av et eksemplar, som har solgt eksemplaret til en annen eier. @no
definition: Relaterer et eksemplar til en korporation, som er tidligere ejer af et eksemplar, som har solgt dette eksemplar til en anden ejer. @da
definition: Relates an item to a corporate body who is a former owner of an item who sells the item to another owner. @en
definition: Sasaista vienību ar institūciju, kas ir vienības agrākais īpašnieks, kura pārdod šo vienību citam īpašniekam. @lv
definition: Seostab eksemplari asutusega, kes eksemplari endise omanikuna on müünud selle teisele omanikule. @et
definition: Setzt ein Exemplar in Beziehung zu einer früheren Eigentümerin/einem früheren Eigentümer (Körperschaft) eines Exemplars, die/der das Exemplar an eine andere Eigentümerin/einen anderen Eigentümer verkauft. @de
definition: يربط مفردة بهيئة هي مالك سابق لمفردة قامت ببيعها لمالك آخر. @ar
definition: 将一个单件与作为先前拥有者将单件出售给另一个拥有者的一个团体关联起来。 @zh-hans

a pour collectivité honorée d’un item
has element type: 2
toolkit definition: A corporate body who is honoured by an item. @en
toolkit definition: Asutus, keda eksemplariga austatakse. @et
toolkit definition: Bir kopya tarafından onurlandırılan bir tüzel kişi. @tr
toolkit definition: Collectivité qui est honorée par un item.
toolkit definition: Een corporatie die geëerd wordt door een item. @nl
toolkit definition: Egy testület, amelyet a példány méltat. @hu
toolkit definition: Eine Körperschaft, die durch ein Exemplar geehrt wird. @de
toolkit definition: En korporasjon som beæres av et eksemplar. @no
toolkit definition: Ente onorato da un item. @it
toolkit definition: Entitat corporativa que és homenatjada en un ítem. @ca
toolkit definition: Institūcija, kas godināta ar vienību. @lv
toolkit definition: Korporation, som er hædret i et eksemplar. @da
toolkit definition: Yhteisö, jota kappaleella kunnioitetaan. @fi
toolkit definition: هيئة تم تكريمها بمفردة. @ar
toolkit definition: 被一个单件纪念的一个团体 @zh-hans
toolkit label: Gefeierte/Gefeierter eines Exemplars (Körperschaft) @de
toolkit label: ar vienību godinātā institūcija @lv
toolkit label: collectivité honorée d’un item
toolkit label: eksemplari austusavalduse saaja (asutus) @et
toolkit label: ente onorato di item @it
toolkit label: entitat corporativa homenatjada d’un ítem @ca
toolkit label: geëerde-corporatie van item @nl
toolkit label: honouree corporate body of item @en
toolkit label: kappaleella kunnioitettu yhteisö @fi
toolkit label: kopyanın onurlandırılan tüzel kişisi ile ilişkilidir @tr
toolkit label: korporasjon beæret av eksemplar @no
toolkit label: korporation, som er beæret i eksemplar @da
toolkit label: példány méltatott testülete @hu
toolkit label: هيئة مكرَمة بمفردة @ar
toolkit label: 单件的被纪念者团体 @zh-hans
has subproperty: P40142
lexical alias: honoureeCorporateBodyOfItem.en
status: Published
type: Property
domain: C10003
label: ar vienību godinātā institūcija @lv
label: eksemplari austusavalduse saaja (asutus) @et
label: ha come onorato ente di item @it
label: har korporasjon beæret av eksemplar @no
label: har korporation, som er beæret i eksemplar @da
label: has honouree corporate body of item @en
label: hat Gefeierte/Gefeierten eines Exemplars (Körperschaft) @de
label: heeft geëerde-corporatie van item @nl
label: kappaleella kunnioitettu yhteisö @fi
label: kopyanın onurlandırılan tüzel kişisi ile ilişkilidir @tr
label: példány méltatott testülete a következő: @hu
label: té com a entitat corporativa homenatjada d’un ítem @ca
label: له هيئة مكرمة بمفردة @ar
label: 有单件的被纪念者团体 @zh-hans
sub property of: a pour collectivité en relation avec un item
sub property of: a pour agent collectif honoré d’un item
definition: Bir kopyayı, bir kopyayla onurlandırılan tüzel bir kişiyle ilişkilendirir. @tr
definition: Correla un item all'ente onorato da un item. @it
definition: Hozzákapcsol egy példányt egy testülethez, amelyet a példány méltat. @hu
definition: Liittää kappaleen yhteisöön, jota kappaleella kunnioitetaan. @fi
definition: Met un item en relation avec une collectivité qui est honorée par un item.
definition: Relaciona un ítem amb una entitat corporativa que és homenatjada en un ítem. @ca
definition: Relateert een item aan een corporatie die geëerd wordt door een item. @nl
definition: Relaterer et eksemplar til en korporasjon som beæres av et eksemplar. @no
definition: Relaterer et eksemplar til en korporation, som er hædret i et eksemplar. @da
definition: Relates an item to a corporate body who is honoured by an item. @en
definition: Sasaista vienību ar institūciju, kas godināta ar vienību. @lv
definition: Seostab eksemplari asutusega, keda eksemplariga austatakse. @et
definition: Setzt ein Exemplar in Beziehung zu einer Körperschaft, die durch ein Exemplar geehrt wird. @de
definition: يربط مفردة بهيئة مُكَرمة بمفردة. @ar
definition: 将一个单件与被一个单件纪念的一个团体关联起来。 @zh-hans

a pour collectivité restauratrice d’un item
has element type: 2
toolkit definition: A corporate body who is responsible for the set of technical, editorial, and intellectual procedures aimed at compensating for the degradation of an item by bringing it back to a state as close as possible to its original condition. @en
toolkit definition: Asutus, kes vastutab rea tehniliste, toimetuslike ja intellektuaalsete toimingute eest, mille eesmärk on taastada kahjustatud eksemplari seisund võimalikult originaalseisundi lähedaseks. @et
toolkit definition: Bir kopyanın bozulmasını orijinal durumuna mümkün olduğunca yakın bir duruma geri getirerek telafi etmeyi amaçlayan bir dizi teknik, editoryal ve entelektüel prosedürden sorumlu olan bir tüzel kişi. @tr
toolkit definition: Collectivité qui est responsable de l’ensemble des procédures techniques, éditoriales et intellectuelles destinées à compenser la dégradation d’un item en le ramenant à un état aussi près que possible de sa condition originelle.
toolkit definition: Een corporatie die verantwoordelijk is voor de verzameling van technische, redactionele en intellectuele procedures gericht op het corrigeren van de achteruitgang van een item door het zo goed mogelijk terug te brengen tot de oorspronkelijke staat. @nl
toolkit definition: Egy testület, amely felelős technikai, szerkesztői és intellektuális eljárások összességéért, amelyek célja egy példány romlásának ellensúlyozása, amivel azt az eredeti állapotához a lehető legközelebb képesek visszahozni. @hu
toolkit definition: Eine Körperschaft, die für die technischen, redaktionellen und intellektuellen Verfahren verantwortlich ist, die darauf abzielen, die Zersetzung eines Exemplars auszugleichen, indem es in einen Zustand zurückversetzt wird, der seiner ursprünglichen Beschaffenheit möglichst nahe kommt. @de
toolkit definition: En korporasjon som har ansvar for de tekniske og intellektuelle metodene som brukes for å kompensere for nedbrytningen av et eksemplar ved å restaurere det til en tilstand som er så lik originaltilstanden som mulig. @no
toolkit definition: Ente responsabile dell'insieme delle procedure tecniche, di cura e intellettuali finalizzate al risarcimento di un item in seguito alla sua degradazione, riportandolo a uno stato il più possibile vicino alla condizione originale. @it
toolkit definition: Entitat corporativa que és responsable del conjunt de procediments tècnics, editorials i intel·lectuals destinats a compensar la degradació d’un ítem retornant-lo a un estat que s’aproximi al màxim a la seva condició original. @ca
toolkit definition: Institūcija, kas ir atbildīga par tehnisko, redakcionālo un intelektuālo procedūru kopumu, kuru mērķis ir kompensēt vienības pakāpenisko bojāeju, atgriežot to, cik vien iespējams, tuvu tās sākotnējam stāvoklim. @lv
toolkit definition: Korporation, som er ansvarlig for en række af tekniske, redaktionelle og intellektuelle procedurer, som forsøger at kompensere for nedslidningen af et eksemplar ved at føre det tilbage til en tilstand, der er så tæt som muligt på dets oprindelige tilstand. @da
toolkit definition: Yhteisö, joka vastaa teknisistä, toimituksellisista ja tiedollisista toimenpiteistä, joiden tarkoitus on palauttaa huonokuntoinen kappale mahdollisimman lähelle sen alkuperäistä kuntoa. @fi
toolkit definition: هيئة مسئولة عن مجموعة الإجراءات الفنية، والتحريرية، والفكرية التي تهدف إلى إصلاح التدهور الذي لحق بمفردة، وإعادتها إلى حالة أقرب ما تكون إلى حالتها الأصلية. @ar
toolkit definition: 负责为弥补单件的损毁而担负一系列技术、编辑和智力操作、使之尽可能恢复到原始状态的一个团体 @zh-hans
toolkit label: Restauratorin/Restaurator eines Exemplars (Körperschaft) @de
toolkit label: collectivité restauratrice d’un item
toolkit label: eksemplari restaureerija (asutus) @et
toolkit label: ente restauratore di item @it
toolkit label: entitat corporativa restauradora d’un ítem @ca
toolkit label: kappaleen entisöijä (yhteisö) @fi
toolkit label: konservator for eksemplar (korporasjon) @no
toolkit label: kopyanın restorasyon uzmanı tüzel kişisi @tr
toolkit label: korporation, som er konservator af eksemplar @da
toolkit label: példány restaurátor testülete @hu
toolkit label: restaurator-corporatie van item @nl
toolkit label: restorationist corporate body of item @en
toolkit label: vienības restaurators (institūcija) @lv
toolkit label: هيئة مُرممة لمفردة @ar
toolkit label: 单件的修复者团体 @zh-hans
has subproperty: P40143
lexical alias: restorationistCorporateBodyOfItem.en
status: Published
type: Property
domain: C10003
label: eksemplari restaureerija (asutus) @et
label: ha come restauratore ente di item @it
label: har konservator for eksemplar (korporasjon) @no
label: har korporation, som er konservator af eksemplar @da
label: has restorationist corporate body of item @en
label: hat Restauratorin/Restaurator eines Exemplars (Körperschaft) @de
label: heeft restaurator-corporatie van item @nl
label: kappaleen entisöijä (yhteisö) @fi
label: kopyanın restorasyon uzmanı tüzel kişisi ile ilişkilidir @tr
label: példány restaurátor testülete a következő: @hu
label: té com a entitat corporativa restauradora d’un ítem @ca
label: vienības restaurators (institūcija) @lv
label: له هيئة مرممة لمفردة @ar
label: 有单件的修复者团体 @zh-hans
sub property of: a pour agent collectif restaurateur d’un item
sub property of: a pour collectivité modificatrice
definition: Bir kopyayı, orijinal durumuna mümkün olduğu kadar yakın bir duruma geri getirerek bir kopyanın bozulmasını telafi etmeyi amaçlayan teknik, yayın ve entelektüel prosedürler dizisinden sorumlu olan tüzel bir kişiyle ilişkilendirir. @tr
definition: Correla un item all'ente responsabile dell'insieme delle procedure tecniche, di cura e intellettuali finalizzate al risarcimento di un item in seguito alla sua degradazione, riportandolo a uno stato il più possibile vicino alla condizione originale. @it
definition: Hozzákapcsol egy példányt egy testülethez, amely felelős technikai, szerkesztői és intellektuális eljárások összességéért, amelyek célja egy példány romlásának ellensúlyozása, amivel azt az eredeti állapotához a lehető legközelebb képesek visszahozni. @hu
definition: Liittää kappaleen yhteisöön, joka vastaa teknisistä, toimituksellisista ja tiedollisista toimenpiteistä, joiden tarkoitus on palauttaa huonokuntoinen kappale mahdollisimman lähelle sen alkuperäistä kuntoa. @fi
definition: Met un item en relation avec une collectivité qui est responsable de l’ensemble des procédures techniques, éditoriales et intellectuelles destinées à compenser la dégradation d’un item en le ramenant à un état aussi près que possible de sa condition originelle.
definition: Relaciona un ítem amb una entitat corporativa que és responsable del conjunt de procediments tècnics, editorials i intel·lectuals destinats a compensar la degradació d’un ítem retornant-lo a un estat que s’aproximi al màxim a la seva condició original. @ca
definition: Relateert een item aan een corporatie die verantwoordelijk is voor de verzameling van technische, redactionele en intellectuele procedures gericht op het corrigeren van de achteruitgang van een item door het zo goed mogelijk terug te brengen tot de oorspronkelijke staat. @nl
definition: Relaterer et eksemplar til en korporasjon som har ansvar for de tekniske og intellektuelle metodene som brukes for å kompensere for nedbrytningen av et eksemplar ved å restaurere det til en tilstand som er så lik originaltilstanden som mulig. @no
definition: Relaterer et eksemplar til en korporation, som er ansvarlig for en række af tekniske, redaktionelle og intellektuelle procedurer, som forsøger at kompensere for nedslidningen af et eksemplar ved at føre det tilbage til en tilstand, der er så tæt som muligt på dets oprindelige tilstand. @da
definition: Relates an item to a corporate body who is responsible for the set of technical, editorial, and intellectual procedures aimed at compensating for the degradation of an item by bringing it back to a state as close as possible to its original condition. @en
definition: Sasaista vienību ar institūciju, kas ir atbildīga par tehnisko, redakcionālo un intelektuālo procedūru kopumu, kuru mērķis ir kompensēt vienības pakāpenisko bojāeju, atgriežot to, cik vien iespējams, tuvu tās sākotnējam stāvoklim. @lv
definition: Seostab eksemplari asutusega, kes vastutab rea tehniliste, toimetuslike ja intellektuaalsete toimingute eest, mille eesmärk on taastada kahjustatud eksemplari seisund võimalikult originaalseisundi lähedaseks. @et
definition: Setzt ein Exemplar in Beziehung zu einer Körperschaft, die für die technischen, redaktionellen und intellektuellen Verfahren verantwortlich ist, die darauf abzielen, die Zersetzung eines Exemplars auszugleichen, indem es in einen Zustand zurückversetzt wird, der seiner ursprünglichen Beschaffenheit möglichst nahe kommt. @de
definition: يربط مفردة بهيئة مسئولة عن مجموعة الإجراءات الفنية، والتحريرية، والفكرية التي تهدف إلى إصلاح التدهور الذي لحق بمفردة، وإعادتها إلى حالة أقرب ما تكون إلى حالتها الأصلية. @ar
definition: 将一个单件与负责为弥补单件的损毁而担负一系列技术、编辑和智力操作、使之尽可能恢复到原始状态的一个团体关联起来。 @zh-hans

a pour collectivité modificatrice
has element type: 2
toolkit definition: A corporate body who makes changes to an item without creating a new manifestation. @en
toolkit definition: Asutus, kes muudab eksemplari, loomata uut kehastust. @et
toolkit definition: Collectivité qui apporte des modifications à un item sans créer une nouvelle manifestation.
toolkit definition: Een corporatie die veranderingen aanbrengt aan een item zonder een nieuwe manifestatie te creëren. @nl
toolkit definition: Egy testület, amely új megjelenési forma létrehozása nélkül idéz elő változást a példányban. @hu
toolkit definition: Eine Körperschaft, die Änderungen an einem Exemplar vornimmt, ohne eine neue Manifestation zu erstellen. @de
toolkit definition: En korporasjon som gjør endringer på et eksemplar uten å skape en ny manifestasjon. @no
toolkit definition: Ente che apporta modifiche a un item senza creare una nuova manifestazione. @it
toolkit definition: Entitat corporativa que fa canvis a un ítem sense crear una manifestació nova. @ca
toolkit definition: Institūcija, kas veikusi izmaiņas vienībā, neradot jaunu manifestāciju. @lv
toolkit definition: Korporation, som ændrer i et eksemplar uden at skabe en ny manifestation. @da
toolkit definition: Yeni bir görünüm oluşturmadan bir kopyada değişiklik yapan bir tüzel kişi. @tr
toolkit definition: Yhteisö, joka tekee muutoksia kappaleeseen luomatta uutta manifestaatiota. @fi
toolkit definition: هيئة تُجري تغييرات على مفردة دون أن تنشئ تجسيدة جديدة. @ar
toolkit definition: 对一个单件作修改而不创建一个新的载体表现的一个团体 @zh-hans
toolkit label: Bearbeiterin/Bearbeiter eines Exemplars (Körperschaft) @de
toolkit label: Dönüştürücü tüzel kişi @tr
toolkit label: aanpasser-corporatie @nl
toolkit label: collectivité modificatrice
toolkit label: entitat corporativa modificadora @ca
toolkit label: korporation, som er tilpasser @da
toolkit label: modificatore ente @it
toolkit label: modificētājs (institūcija) @lv
toolkit label: modifier corporate body @en
toolkit label: muokkaaja (yhteisö) @fi
toolkit label: muutja (asutus) @et
toolkit label: módosító testülete: @hu
toolkit label: tilpasser (korporasjon) @no
toolkit label: هيئة مُعدِّلة @ar
toolkit label: 修改者团体 @zh-hans
has subproperty: a pour collectivité relieuse
has subproperty: a pour collectivité enlumineuse
has subproperty: a pour collectivité restauratrice d’un item
has subproperty: P40144
lexical alias: modifierCorporateBody.en
status: Published
type: Property
domain: C10003
label: düzenleyici tüzel kişisi ile ilişkilidir @tr
label: ha come modificatore ente @it
label: har korporation, som er tilpasser @da
label: har tilpasser (korporasjon) @no
label: has modifier corporate body @en
label: hat Bearbeiterin/Bearbeiter eines Exemplars (Körperschaft) @de
label: heeft aanpasser-corporatie @nl
label: modificētājs (institūcija) @lv
label: muokkaaja (yhteisö) @fi
label: muutja (asutus) @et
label: módosító testülete a következő: @hu
label: té com a entitat corporativa modificadora @ca
label: له هيئة مُعدِّلة @ar
label: 有修改者团体 @zh-hans
sub property of: a pour collectivité en relation avec un item
sub property of: a pour agent collectif modificateur
definition: Bir kopyayı, yeni bir görünüm oluşturmadan bir kopyada değişiklik yapan tüzel bir kişiyle ilişkilendirir. @tr
definition: Correla un item a un ente che apporta modifiche a un item senza creare una nuova manifestazione. @it
definition: Hozzákapcsol egy példányt egy testülethez, amely új megjelenési forma létrehozása nélkül idéz elő változást a példányban. @hu
definition: Liittää kappaleen yhteisöön, joka tekee muutoksia kappaleeseen luomatta uutta manifestaatiota. @fi
definition: Met un item en relation avec une collectivité qui apporte des modifications à un item sans créer une nouvelle manifestation.
definition: Relaciona un ítem amb una entitat corporativa que fa canvis a un ítem sense crear una manifestació nova. @ca
definition: Relateert een item aan een corporatie die veranderingen aanbrengt aan een item zonder een nieuwe manifestatie te creëren. @nl
definition: Relaterer et eksemplar til en korporasjon som gjør endringer på et eksemplar uten å skape en ny manifestasjon. @no
definition: Relaterer et eksemplar til en korporation, som ændrer i et eksemplar uden at skabe en ny manifestation. @da
definition: Relates an item to a corporate body that makes changes to an item without creating a new manifestation. @en
definition: Sasaista vienību ar institūciju, kas veikusi izmaiņas vienībā, neradot jaunu manifestāciju. @lv
definition: Seostab eksemplari asutusega, kes muudab eksemplari, loomata uut kehastust. @et
definition: Setzt ein Exemplar in Beziehung zu einer Körperschaft, die Änderungen an einem Exemplar vornimmt, ohne eine neue Manifestation zu erstellen. @de
definition: يربط مفردة بهيئة تجري تغييرات على مفردة دون أن تنشئ تجسيدة جديدة. @ar
definition: 将一个单件与对一个单件作修改而不创建一个新的载体表现的一个团体关联起来。 @zh-hans

a pour famille dédicataire d’un item
has element type: 2
toolkit definition: A family to whom an item is dedicated. @en
toolkit definition: Bir kopyanın ithaf edildiği bir aile. @tr
toolkit definition: Dzimta/ģimene, kam ir veltīta vienība. @lv
toolkit definition: Een familie aan wie een item is opgedragen. @nl
toolkit definition: Egy család, amelynek a példányt dedikálják. @hu
toolkit definition: Eine Familie, der ein Exemplar gewidmet ist. @de
toolkit definition: En familie som et eksemplar er dedisert til. @no
toolkit definition: Famiglia alla quale un item è dedicato. @it
toolkit definition: Familie, som et eksemplar er tilegnet. @da
toolkit definition: Famille à qui un item est dédié.
toolkit definition: Família a qui es dedica un ítem. @ca
toolkit definition: Perekond, kellele eksemplar on pühendatud. @et
toolkit definition: Suku, jolle kappale on omistettu. @fi
toolkit definition: عائلة أُهديت اليها مفردة. @ar
toolkit definition: 一个单件被题献给的一个家族 @zh-hans
toolkit label: Widmungsempfängerin/Widmungsempfänger eines Exemplars (Familie) @de
toolkit label: dedicatee family of item @en
toolkit label: eksemplari pühenduse saaja (perekond) @et
toolkit label: famiglia dedicataria di item @it
toolkit label: familie, som er tilegnet af eksemplar @da
toolkit label: famille dédicataire d’un item
toolkit label: família dedicatària d’un ítem @ca
toolkit label: kappaleen omistuksen kohde (suku) @fi
toolkit label: kopyanın adandığı aile @tr
toolkit label: opgedragen-familie van item @nl
toolkit label: példány dedikált családja @hu
toolkit label: tilegnet familie for eksemplar @no
toolkit label: veltījumvienība dzintai/ģimenei @lv
toolkit label: عائلة مُهدى إليها مفردة @ar
toolkit label: 单件的被题献者家族 @zh-hans
has subproperty: P40145
lexical alias: dedicateeFamilyOfItem.en
status: Published
type: Property
domain: C10003
label: eksemplari pühenduse saaja (perekond) @et
label: ha come dedicatario famiglia di item @it
label: har familie, som er tilegnet af eksemplar @da
label: har tilegnet familie for eksemplar @no
label: has dedicatee family of item @en
label: hat Widmungsempfängerin/Widmungsempfänger eines Exemplars (Familie) @de
label: heeft opgedragene-familie van item @nl
label: kappaleen omistuksen kohde (suku) @fi
label: kopyanın ithaf edilen ailesi ile ilişkilidir @tr
label: példány dedikált családja a következő: @hu
label: té com a família dedicatària d’un ítem @ca
label: veltījumvienība dzintai/ģimenei @lv
label: له عائلة مُهدى إليها مفردة @ar
label: 有单件的被题献者家族 @zh-hans
sub property of: a pour famille en relation avec un item
sub property of: a pour agent collectif dédicataire d’un item
definition: Bir kopyayı, bir kopyayı ithaf edildiği bir aileyle ilişkilendirir. @tr
definition: Correla un item a una famiglia alla quale un item è dedicato. @it
definition: Hozzákapcsol egy példányt egy családhoz, amelynek a példányt dedikálják. @hu
definition: Liittää kappaleen sukuun, jolle kappale on omistettu. @fi
definition: Met un item en relation avec une famille à qui un item est dédié.
definition: Relaciona un ítem amb una família a qui es dedica un ítem. @ca
definition: Relateert een item aan een familie aan wie een item is opgedragen. @nl
definition: Relaterer et eksemplar til en familie som et eksemplar er dedisert til. @no
definition: Relaterer et eksemplar til en familie, som et eksemplar er tilegnet. @da
definition: Relates an item to a family to whom an item is dedicated. @en
definition: Sasaista vienību ar dzimtu/ģimeni, kam ir veltīta vienība. @lv
definition: Seostab eksemplari perekonnaga, kellele eksemplar on pühendatud. @et
definition: Setzt ein Exemplar in Beziehung zu einer Familie, der ein Exemplar gewidmet ist. @de
definition: يربط مفردة بعائلة أُهديت اليها مفردة. @ar
definition: 将一个单件与一个单件被题献给的一个家族关联起来。 @zh-hans

a pour famille relieuse
has element type: 2
toolkit definition: A family who binds an item. @en
toolkit definition: Bir kopyayı ciltleyen bir aile. @tr
toolkit definition: Dzimta/ģimene, kas ir iesējusi vienību. @lv
toolkit definition: Een familie die een item bindt. @nl
toolkit definition: Egy család, amely beköt egy példányt. @hu
toolkit definition: Eine Familie, die ein Exemplar bindet. @de
toolkit definition: En familie som binder inn et eksemplar. @no
toolkit definition: Famiglia che rilega un item. @it
toolkit definition: Familie, som indbinder et eksemplar. @da
toolkit definition: Famille qui relie un item.
toolkit definition: Família que enquaderna un ítem. @ca
toolkit definition: Perekond, kes on eksemplari köitnud. @et
toolkit definition: Suku, joka sitoo kappaleen. @fi
toolkit definition: عائلة تجلد مفردة. @ar
toolkit definition: 装订单件的一个家族 @zh-hans
toolkit label: Buchbinderin/Buchbinder (Familie) @de
toolkit label: binder family @en
toolkit label: binder-familie @nl
toolkit label: bokbinder (familie) @no
toolkit label: ciltleyici aile @tr
toolkit label: familie, som er bogbinder @da
toolkit label: famille relieuse
toolkit label: família enquadernadora @ca
toolkit label: grāmatsējējs (dzimta/ģimene) @lv
toolkit label: köitja (perekond) @et
toolkit label: könyvkötő család @hu
toolkit label: rilegatore famiglia @it
toolkit label: sitoja (suku) @fi
toolkit label: عائلة مسئولة عن التجليد @ar
toolkit label: 装订者家族 @zh-hans
has subproperty: P40146
lexical alias: binderFamily.en
status: Published
type: Property
domain: C10003
label: ciltleyen aile ile ilişkilidir @tr
label: grāmatsējējs (dzimta/ģimene) @lv
label: ha come rilegatore famiglia @it
label: har bokbinder (familie) @no
label: har familie, som er bogbinder @da
label: has binder family @en
label: hat Buchbinderin/Buchbinder (Familie) @de
label: heeft binder-familie @nl
label: köitja (perekond) @et
label: könyvkötő családja a következő: @hu
label: sitoja (suku) @fi
label: té com a família enquadernadora @ca
label: له عائلة مسئولة عن التجليد @ar
label: 有装订者家族 @zh-hans
sub property of: a pour agent collectif relieur
sub property of: a pour famille modificatrice
definition: Bir kopyayı, bir kopyayı ciltleyen bir aileyle ilişkilendirir. @tr
definition: Correla un item a una famiglia che rilega un item. @it
definition: Hozzákapcsol egy példányt egy családhoz, amely beköt egy példányt. @hu
definition: Liittää kappaleen sukuun, joka sitoo kappaleen. @fi
definition: Met un item en relation avec une famille qui relie un item.
definition: Relaciona un ítem amb una família que enquaderna un ítem. @ca
definition: Relateert een item aan een familie die een item bindt. @nl
definition: Relaterer et eksemplar til en familie som binder inn et eksemplar. @no
definition: Relaterer et eksemplar til en familie, som indbinder et eksemplar. @da
definition: Relates an item to a family who binds an item. @en
definition: Sasaista vienību ar dzimtu/ģimeni, kas ir iesējusi vienību. @lv
definition: Seostab eksemplari perekonnaga, kes on eksemplari köitnud. @et
definition: Setzt ein Exemplar in Beziehung zu einer Familie, die ein Exemplar bindet. @de
definition: يربط مفردة بعائلة تُجلِّد مفردة. @ar
definition: 将一个单件与装订单件的一个家族关联起来。 @zh-hans

a pour famille conservatrice
has element type: 2
toolkit definition: A family who conceives or manages the aggregation of an item in an exhibition or collection. (Deprecated) @en
toolkit definition: Dzimta/ģimene, kas iecer un realizē vienības iekļaušanu izstādē vai kolekcijā. @lv
toolkit definition: Een familie die de samenstelling bedenkt of beheert van een item in een tentoonstelling of collectie. @nl
toolkit definition: Egy család, amely kigondolja vagy kezeli egy példány begyűjtését kiállítás keretébe vagy gyűjteménybe. @hu
toolkit definition: Eine Familie, die die Aggregation eines Exemplars in einer Ausstellung oder Sammlung konzipiert oder organisiert. @de
toolkit definition: En familie som har idéen til eller håndterer innsamlingen av et eksemplar i en utstilling eller samling. @no
toolkit definition: Famiglia che concepisce o gestisce l'aggregazione di un item all'interno di una mostra o collezione. @it
toolkit definition: Familie, som udtænker eller administrerer samlingen af et eksemplar til en udstilling eller samling. @da
toolkit definition: Famille qui conçoit ou gère l’agrégation d’un item dans une exposition ou une collection.
toolkit definition: Família que concep o gestiona l’agregació d’un ítem en una exposició o en una col·lecció. @ca
toolkit definition: Perekond, kes kavandab või korraldab eksemplari liitmise näituse või koguga. @et
toolkit definition: Suku, joka saa aikaan ja hallinnoi näyttelyn tai kokoelman kappaleaggregaatiota. @fi
toolkit definition: عائلة تطرح تجميعة لمفردة في معرض، أو في مجموعة أو تديرها. @ar
toolkit label: Kuratorin/Kurator (Familie) @de
toolkit label: curator family (Deprecated) @en
toolkit label: curator-familie @nl
toolkit label: curatore famiglia @it
toolkit label: familie, som er kurator @da
toolkit label: famille conservatrice
toolkit label: família conservadora @ca
toolkit label: kuraator (perekond) @et
toolkit label: kuraattori (suku) @fi
toolkit label: kurator (familie) @no
toolkit label: kurators (dzimta/ģimene) @lv
toolkit label: kurátor család @hu
toolkit label: عائلة أُمينة متحف @ar
has subproperty: a pour famille collectionneuse
has subproperty: a pour famille catalogueuse d’une collection de ressources
has subproperty: P40147
lexical alias: curatorFamily.en
status: Deprecated
type: Property
domain: C10003
label: ha come curatore famiglia @it
label: har familie, som er kurator @da
label: har kurator (familie) @no
label: has curator family (Deprecated) @en
label: hat Kuratorin/Kurator (Familie) @de
label: heeft curator-familie @nl
label: kuraator (perekond) @et
label: kuraattori (suku) @fi
label: kurators (dzimta/ģimene) @lv
label: kurátor családja a következő: @hu
label: té com a família conservadora @ca
label: له عائلة أمينة متحف @ar
sub property of: a pour famille en relation avec un item
sub property of: a pour agent collectif conservateur
definition: Correla un item a una famiglia che concepisce o gestisce l'aggregazione di un item nell'ambito di una mostra o collezione. @it
definition: Egy példányt hozzákapcsol egy családhoz, amely kigondolja vagy kezeli a példány begyűjtését kiállítás keretébe vagy gyűjteménybe. @hu
definition: Liittää kappaleen sukuun, joka saa aikaan ja hallinnoi näyttelyn tai kokoelman kappaleaggregaatiota. @fi
definition: Met un item en relation avec une famille qui conçoit ou gère l’agrégation d’un item dans une exposition ou une collection.
definition: Relaciona un ítem amb una família que concep o gestiona l’agregació d’un ítem en una exposició o en una col·lecció. @ca
definition: Relateert een item aan een familie die de samenstelling bedenkt of beheert van een item in een tentoonstelling of collectie. @nl
definition: Relaterer et eksemplar til en familie som har idéen til eller håndterer innsamlingen av et eksemplar i en utstilling eller samling. @no
definition: Relaterer et eksemplar til en familie, som udtænker eller administrerer samlingen af et eksemplar til en udstilling eller samling. @da
definition: Relates an item to a family who conceives or manages the aggregation of an item in an exhibition or collection. (Deprecated) @en
definition: Sasaista vienību ar dzimtu/ģimeni, kas iecer un realizē vienības iekļaušanu izstādē vai kolekcijā. @lv
definition: Seostab eksemplari perekonnaga, kes kavandab või korraldab eksemplari liitmise näituse või koguga. @et
definition: Setzt ein Exemplar in Beziehung zu einer Familie, die die Aggregation eines Exemplars in einer Ausstellung oder Sammlung konzipiert oder organisiert. @de
definition: يربط مفردة بعائلة تطرح تجميعة لمفردة في معرض، أو في مجموعة أو تديرها. @ar

a pour famille enlumineuse
has element type: 2
toolkit definition: A family who decorates a specific item using precious metals or colour, often with elaborate designs and motifs. @en
toolkit definition: Belirli bir kopyayı değerli metaller veya renkler kullanarak, genellikle özenle hazırlanmış tasarımlar ve motiflerle süsleyen bir aile. @tr
toolkit definition: Dzimta/ģimene, kas izgreznojusi konkrēto vienību, izmantojot krāsu un/vai dārgmetālus, bieži ar izsmalcinātiem un filigrāniem zīmējumiem, burtiem un motīviem. @lv
toolkit definition: Een familie die een specifiek item decoreert met edelmetalen of kleur, vaak met uitgebreide ontwerpen en motieven. @nl
toolkit definition: Egy család, amely egy adott példányt nemesfémekkel vagy színekkel díszít, gyakran gondosan kidolgozott kivitelezéssel és motívumok használával. @hu
toolkit definition: Eine Familie, die ein bestimmtes Exemplar durch Edelmetalle oder Farben, häufig mit kunstvollen Mustern und Motiven, (aus-)gestaltet. @de
toolkit definition: En familie som dekorerer et bestemt eksemplar med edle metaller eller farger, gjerne med intrikate former og motiver. @no
toolkit definition: Famiglia che decora uno specifico item utilizzando metalli o colori preziosi, spesso con progetti e motivi elaborati. @it
toolkit definition: Familie, som udsmykker et særligt eksemplar med ædelmetal eller farve, ofte med detaljerige mønstre og motiver. @da
toolkit definition: Famille qui orne un item spécifique en utilisant des métaux précieux ou de la couleur, souvent avec des dessins et des motifs élaborés.
toolkit definition: Família que decora un ítem concret amb metalls preciosos o amb color, sovint amb dissenys i motius elaborats. @ca
toolkit definition: Perekond, kes kaunistab väärismetallide ja värvidega üksikut eksemplari, sageli keeruliste kujundite ja motiividega. @et
toolkit definition: Suku, joka koristelee yksittäisen kappaleen käyttäen jalometalleja tai värejä, usein yksityiskohtaisissa kuvioissa tai motiiveissa. @fi
toolkit definition: عائلة تزين مفردة محددة باستخدام معادن ثمينة أو ألوان، غالبًا بتصاميم وزخارف منمقة. @ar
toolkit definition: 对特定单件用贵重的金属或色彩（通常有精心的设计和图案）进行装饰的一个家族 @zh-hans
toolkit label: Illuminatorin/Illuminator (Familie) @de
toolkit label: familie, som er illuminator @da
toolkit label: famille enlumineuse
toolkit label: família il·luminadora @ca
toolkit label: illuminator (familie) @no
toolkit label: illuminator family @en
toolkit label: illumineerija (perekond) @et
toolkit label: illuminoinnin tekijä (suku) @fi
toolkit label: illuminátor család @hu
toolkit label: iluminators (dzimta/ģimene) @lv
toolkit label: miniatore famiglia @it
toolkit label: tezhip sanatçısı ailesi ile ilişkilidir @tr
toolkit label: verluchter-familie @nl
toolkit label: عائلة مزخرفة @ar
toolkit label: 彩饰者家族 @zh-hans
has subproperty: P40148
lexical alias: illuminatorFamily.en
status: Published
type: Property
domain: C10003
label: ha come miniatore famiglia @it
label: har familie, som er illuminator @da
label: har illuminator (familie) @no
label: has illuminator family @en
label: hat Illuminatorin/Illuminator (Familie) @de
label: heeft verluchter-familie @nl
label: illumineerija (perekond) @et
label: illuminoinnin tekijä (suku) @fi
label: illuminátor családja a következő: @hu
label: iluminators (dzimta/ģimene) @lv
label: tezhip sanatçısı ailesi ile ilişkilidir @tr
label: té com a família il·luminadora @ca
label: له عائلة مزخرفة @ar
label: 有彩饰者家族 @zh-hans
sub property of: a pour agent collectif enlumineur
sub property of: a pour famille modificatrice
definition: Bir kopyayı, belirli bir kopyayı değerli metaller veya renkler kullanarak, genellikle ayrıntılı tasarımlar ve motiflerle süsleyen bir aileyle ilişkilendirir. @tr
definition: Correla un item a una famiglia che decora uno specifico item utilizzando metalli o colori preziosi, spesso con progetti e motivi elaborati. @it
definition: Hozzákapcsol egy példányt egy családhoz, amely egy adott példányt nemesfémekkel vagy színekkel díszít, gyakran gondosan kidolgozott kivitelezéssel és motívumok használával. @hu
definition: Liittää kappaleen sukuun, joka koristelee yksittäisen kappaleen käyttäen jalometalleja tai värejä, usein yksityiskohtaisissa kuvioissa tai motiiveissa. @fi
definition: Met un item en relation avec une famille qui orne un item spécifique en utilisant des métaux précieux ou de la couleur, souvent avec des dessins et des motifs élaborés.
definition: Relaciona un ítem amb una família que decora un ítem concret amb metalls preciosos o amb color, sovint amb dissenys i motius elaborats. @ca
definition: Relateert een item aan een familie die een specifiek item decoreert met edelmetalen of kleur, vaak met uitgebreide ontwerpen en motieven. @nl
definition: Relaterer et eksemplar til en familie som dekorerer et bestemt eksemplar med edle metaller eller farger, gjerne med intrikate former og motiver. @no
definition: Relaterer et eksemplar til en familie, som udsmykker et særligt eksemplar med ædelmetal eller farve, ofte med detaljerige mønstre og motiver. @da
definition: Relates an item to a family who decorates a specific item using precious metals or colour, often with elaborate designs and motifs. @en
definition: Sasaista vienību ar dzimtu/ģimeni, kas izgreznojusi konkrēto vienību, izmantojot krāsu un/vai dārgmetālus, bieži ar izsmalcinātiem un filigrāniem zīmējumiem, burtiem un motīviem. @lv
definition: Seostab eksemplari perekonnaga, kes kaunistab väärismetallide ja värvidega üksikut eksemplari, sageli keeruliste kujundite ja motiividega. @et
definition: Setzt ein Exemplar in Beziehung zu einer Familie, die ein bestimmtes Exemplar durch Edelmetalle oder Farben, häufig mit kunstvollen Mustern und Motiven, (aus-)gestaltet. @de
definition: يربط مفردة بعائلة تزين مفردة محددة باستخدام معادن ثمينة أو ألوان، غالبًا بتصاميم وزخارف منمقة. @ar
definition: 将一个单件与对特定单件用贵重的金属或色彩（通常有精心的设计和图案）进行装饰的一个家族关联起来。 @zh-hans

a pour famille propriétaire actuelle
has element type: 2
toolkit definition: A family who has current legal possession of an item. @en
toolkit definition: Bir kopyanın şu anda yasal mülkiyetine sahip olan bir aile. @tr
toolkit definition: Dzimta/ģimene, kas ir vienības pašreizējais likumīgais īpašnieks. @lv
toolkit definition: Een familie die huidig wettelijk bezit heeft van een item. @nl
toolkit definition: Egy család, amely jelenleg törvényesen birtokol.egy példányt @hu
toolkit definition: Eine Familie, die derzeit im rechtmäßigen Besitz eines Exemplars ist. @de
toolkit definition: En familie som for tiden er den rettmessige eieren av et eksemplar. @no
toolkit definition: Famiglia che detiene l'attuale proprietà giuridica di un item. @it
toolkit definition: Familie, som p.t. er i lovlig besiddelse af et eksemplar. @da
toolkit definition: Famille qui possède actuellement et légalement un item.
toolkit definition: Família que té la propietat legal actual d’un ítem. @ca
toolkit definition: Perekond, kellele praegu õiguspäraselt eksemplar kuulub. @et
toolkit definition: Suku, joka tällä hetkellä laillisesti omistaa kappaleen. @fi
toolkit definition: عائلة لديها حاليا الملكية القانونية لمفردة. @ar
toolkit definition: 拥有对一个单件当前法定所有权的一个家族 @zh-hans
toolkit label: Gegenwärtige Eigentümerin/Gegenwärtiger Eigentümer (Familie) @de
toolkit label: current owner family @en
toolkit label: familie, som er nuværende ejer @da
toolkit label: famille propriétaire actuelle
toolkit label: família propietària actual @ca
toolkit label: huidige eigenaar-familie @nl
toolkit label: jelenleg tulajdonos családja: @hu
toolkit label: nykyinen omistaja (suku) @fi
toolkit label: nåværende eier (familie) @no
toolkit label: pašreizējais īpašnieks (dzimta/ģimene) @lv
toolkit label: praegune omanik (perekond) @et
toolkit label: proprietario attuale famiglia @it
toolkit label: şu anki sahibi olan aile @tr
toolkit label: عائلة مالكة حاليا @ar
toolkit label: 当前拥有者家族 @zh-hans
has subproperty: a pour famille déposante
has subproperty: P40149
lexical alias: currentOwnerFamily.en
status: Published
type: Property
domain: C10003
label: ha come proprietario attuale famiglia @it
label: har familie, som er nuværende ejer @da
label: har nåværende eier (familie) @no
label: has current owner family @en
label: hat gegenwärtige Eigentümerin/gegenwärtigen Eigentümer (Familie) @de
label: heeft huidige eigenaar-familie @nl
label: jelenleg tulajdonos családja a következő: @hu
label: mevcut sahip ailesi ile ilişkilidir @tr
label: nykyinen omistaja (suku) @fi
label: pašreizējais īpašnieks (dzimta/ģimene) @lv
label: praegune omanik (perekond) @et
label: té com a família propietària actual @ca
label: له عائلة مالكة حاليا @ar
label: 有当前拥有者家族 @zh-hans
sub property of: a pour agent collectif propriétaire actuel
sub property of: a pour famille propriétaire
definition: Bir kopyayı, bir kopyanın mevcut yasal mülkiyetine sahip olan bir aileyle ilişkilendirir. @tr
definition: Correla un item a una famiglia che detiene l'attuale proprietà giuridica di un item. @it
definition: Egy példányt hozzákapcsol egy családhoz, amely jelenleg törvényesen birtokolja a példányt. @hu
definition: Liittää kappaleen sukuun, joka tällä hetkellä laillisesti omistaa kappaleen. @fi
definition: Met un item en relation avec une famille qui possède actuellement et légalement un item.
definition: Relaciona un ítem amb una família que té la propietat legal actual d’un ítem. @ca
definition: Relateert een item aan een familie die huidig wettelijk bezit heeft van een item. @nl
definition: Relaterer et eksemplar til en familie som for tiden er den rettmessige eieren av et eksemplar. @no
definition: Relaterer et eksemplar til en familie, som p.t. er i lovlig besiddelse af et eksemplar. @da
definition: Relates an item to a family who has current legal possession of an item. @en
definition: Sasaista vienību ar dzimtu/ģimeni, kas ir vienības pašreizējais likumīgais īpašnieks. @lv
definition: Seostab eksemplari perekonnaga, kellele praegu õiguspäraselt eksemplar kuulub. @et
definition: Setzt ein Exemplar in Beziehung zu einer Familie, die derzeit im rechtmäßigen Besitz eines Exemplars ist. @de
definition: يربط مفردة بعائلة لديها حاليا الملكية القانونية لمفردة. @ar
definition: 将一个家族与拥有对一个单件当前法定所有权的一个家族关联起来。 @zh-hans

a pour ancienne famille propriétaire
has element type: 2
toolkit definition: A family who has former legal possession of an item. @en
toolkit definition: Bir kopyanın daha önce yasal mülkiyetine sahip olan bir aile. @tr
toolkit definition: Dzimta/ģimene, kam vienība iepriekš ir bijusi juridiskā īpašumā. @lv
toolkit definition: Een familie die voormalig wettelijk bezit had van een item. @nl
toolkit definition: Egy család, amely korábban törvényesen birtokolt egy példányt. @hu
toolkit definition: Eine Familie, die früher im rechtmäßigen Besitz eines Exemplars war. @de
toolkit definition: En familie som tidligere var den rettmessige eieren av et eksemplar. @no
toolkit definition: Famiglia che ha detenuto in precedenza la proprietà giuridica di un item. @it
toolkit definition: Familie, som tidligere har været i lovlig besiddelse af et eksemplar. @da
toolkit definition: Famille qui a auparavant possédé légalement un item.
toolkit definition: Família que té la propietat legal anterior d’un ítem. @ca
toolkit definition: Perekond, kellele eksemplar varem õiguspäraselt kuulus. @et
toolkit definition: Suku, joka on aiemmin laillisesti omistanut kappaleen. @fi
toolkit definition: عائلة لديها سابقا الملكية القانونية لمفردة. @ar
toolkit definition: 拥有对一个单件先前法定所有权的一个家族 @zh-hans
toolkit label: Frühere Eigentümerin/Früherer Eigentümer (Familie) @de
toolkit label: agrākais īpašnieks (dzimta/ģimene) @lv
toolkit label: aiempi omistaja (suku) @fi
toolkit label: ancienne famille propriétaire
toolkit label: endine omanik (perekond) @et
toolkit label: familie, som er tidligere ejer @da
toolkit label: família propietària anterior @ca
toolkit label: former owner family @en
toolkit label: korábbi tulajdonos családja: @hu
toolkit label: proprietario precedente famiglia @it
toolkit label: tidligere eier (familie) @no
toolkit label: voormalige eigenaar-familie @nl
toolkit label: önceki sahibi olan aile @tr
toolkit label: عائلة مالكة سابقا @ar
toolkit label: 先前拥有者家族 @zh-hans
has subproperty: a pour famille donatrice
has subproperty: a pour famille vendeuse
has subproperty: P40150
lexical alias: formerOwnerFamily.en
status: Published
type: Property
domain: C10003
label: agrākais īpašnieks (dzimta/ģimene) @lv
label: aiempi omistaja (suku) @fi
label: endine omanik (perekond) @et
label: eski sahip ailesi ile ilişkilidir @tr
label: ha come proprietario precedente famiglia @it
label: har familie, som er tidligere ejer @da
label: har tidligere eier (familie) @no
label: has former owner family @en
label: hat frühere Eigentümerin/früheren Eigentümer (Familie) @de
label: heeft voormalige eigenaar-familie @nl
label: korábbi tulajdonos családja a következő: @hu
label: té com a família propietària anterior @ca
label: له عائلة مالكة سابقا @ar
label: 有先前拥有者家族 @zh-hans
sub property of: a pour ancien agent collectif propriétaire
sub property of: a pour famille propriétaire
definition: Bir kopyayı, bir kopyanın daha önce yasal mülkiyetine sahip olan bir ailyle ilişkilendirir. @tr
definition: Correla un item a una famiglia che ha detenuto in precedenza la proprietà giuridica di un item. @it
definition: Egy példányt hozzákapcsol egy családhoz, amely korábban törvényesen birtokolta a példányt. @hu
definition: Liittää kappaleen sukuun, joka on aiemmin laillisesti omistanut kappaleen. @fi
definition: Met un item en relation avec une famille qui a auparavant possédé légalement un item.
definition: Relaciona un ítem amb una família que té la propietat legal anterior d’un ítem. @ca
definition: Relateert een item aan een familie die voormalig wettelijk bezit had van een item. @nl
definition: Relaterer et eksemplar til en familie som tidligere var den rettmessige eieren av et eksemplar. @no
definition: Relaterer et eksemplar til en familie, som tidligere har været i lovlig besiddelse af et eksemplar. @da
definition: Relates an item to a family who has former legal possession of an item. @en
definition: Sasaista vienību ar dzimtu/ģimeni, kam vienība iepriekš ir bijusi juridiskā īpašumā. @lv
definition: Seostab eksemplari perekonnaga, kellele eksemplar varem õiguspäraselt kuulus. @et
definition: Setzt ein Exemplar in Beziehung zu einer Familie, die früher im rechtmäßigen Besitz eines Exemplars war. @de
definition: يربط مفردة بعائلة لديها سابقا الملكية القانونية لمفردة. @ar
definition: 将一个单件与拥有对一个单件先前法定所有权的一个家族关联起来。 @zh-hans

a pour famille dépositaire
has element type: 2
toolkit definition: A family who has legal custody of an item. @en
toolkit definition: Bir kopyanın yasal velayetine sahip olan bir aile. @tr
toolkit definition: Dzimta/ģimene, kas likumīgi glabā vienību. @lv
toolkit definition: Een familie die van rechtswege een item bewaart. @nl
toolkit definition: Egy család, amely egy példány törvényes megőrzője. @hu
toolkit definition: Eine Familie, der die rechtmäßige Verwahrung eines Exemplars obliegt. @de
toolkit definition: En familie som har et eksemplar i lovlig forvaring. @no
toolkit definition: Familie, som lovligt har et eksemplar i forvaring. @da
toolkit definition: Famille à qui est confiée la garde légale d’un item.
toolkit definition: Família que té la custodia legal d’un ítem. @ca
toolkit definition: Perekond, kelle õiguspärasel vastutaval hoiul eksemplar on. @et
toolkit definition: Suku, jolla on kappaleen laillinen säilyttämisoikeus. @fi
toolkit definition: Famiglia che detiene la custodia giuridica di un item. @it
toolkit definition: عائلة لديها الوصاية القانونية على مفردة. @ar
toolkit definition: 对一个单件拥有合法保管权的一个家族 @zh-hans
toolkit label: Verwahrerin/Verwahrer (Familie) @de
toolkit label: curatele-familie @nl
toolkit label: custodian family @en
toolkit label: depositario famiglia @it
toolkit label: familie, som er forvalter @da
toolkit label: famille dépositaire
toolkit label: família dipositària @ca
toolkit label: koruyucu aile @tr
toolkit label: letétkezető család @hu
toolkit label: oppbevarer (familie) @no
toolkit label: pārvaldītājs (dzimta/ģimene) @lv
toolkit label: säilyttäjä (suku) @fi
toolkit label: vastutav hoidja (perekond) @et
toolkit label: عائلة وصية @ar
toolkit label: 保管者家族 @zh-hans
has subproperty: P40151
lexical alias: custodianFamily.en
status: Published
type: Property
domain: C10003
label: ha come depositario famiglia @it
label: har familie, som er forvalter @da
label: har oppbevarer (familie) @no
label: has custodian family @en
label: hat Verwahrerin/Verwahrer (Familie) @de
label: heeft curatele-familie @nl
label: koruyucu ailesi ile ilişkilidir @tr
label: letétkezelőcsaládja a következő: @hu
label: pārvaldītājs (dzimta/ģimene) @lv
label: säilyttäjä (suku) @fi
label: té com a família dipositària @ca
label: vastutav hoidja (perekond) @et
label: له عائلة وصية @ar
label: 有保管者家族 @zh-hans
sub property of: a pour famille en relation avec un item
sub property of: a pour agent collectif dépositaire
definition: Bir kopyayı, bir kopyanın yasal velayetine sahip olan bir aileyle ilişkilendirir. @tr
definition: Correla un item a una famiglia che detiene la custodia giuridica di un item. @it
definition: Egy példányt hozzákapcsol egy családhoz, amely a példány törvényes megőrzője. @hu
definition: Liittää kappaleen sukuun, jolla on kappaleen laillinen säilyttämisoikeus. @fi
definition: Met un item en relation avec une famille à qui est confiée la garde légale d’un item.
definition: Relaciona un ítem amb una família que té la custodia legal d’un ítem. @ca
definition: Relateert een item aan een familie die van rechtswege een item bewaart. @nl
definition: Relaterer et eksemplar til en familie som har et eksemplar i lovlig forvaring. @no
definition: Relaterer et eksemplar til en familie, som lovligt har et eksemplar i forvaring. @da
definition: Relates an item to a family who has legal custody of an item. @en
definition: Sasaista vienību ar dzimtu/ģimeni, kas likumīgi glabā vienību. @lv
definition: Seostab eksemplari perekonnaga, kelle õiguspärasel vastutaval hoiul eksemplar on. @et
definition: Setzt ein Exemplar in Beziehung zu einer Familie, der die rechtmäßige Verwahrung eines Exemplars obliegt. @de
definition: يربط مفردة بعائلة لديها الوصاية القانونية على مفردة @ar
definition: 将一个单件与对一个单件拥有合法保管权的一个家族关联起来。 @zh-hans

a pour famille propriétaire
has element type: 2
toolkit definition: A family who has current or former legal possession of an item. @en
toolkit definition: Bir kopyanın mevcut veya eski yasal mülkiyetine sahip olan bir aile. @tr
toolkit definition: Dzimta/ģimene, kam ir vai ir bijušas likumīgas tiesības uz īpašumu. @lv
toolkit definition: Een familie die huidig of voormalig wettelijk bezit heeft van een item. @nl
toolkit definition: Egy család, amely törvényesen birtokol egy példányt. @hu
toolkit definition: Eine Familie, die gegenwärtig oder früher im rechtmäßigen Besitz eines Exemplars ist/war. @de
toolkit definition: En familie som er den rettmessige eieren av et eksemplar. @no
toolkit definition: Famiglia che detiene la proprietà giuridica di un item. @it
toolkit definition: Familie, som er i lovlig besiddelse af et eksemplar. @da
toolkit definition: Famille qui possède actuellement ou a auparavant possédé légalement un item.
toolkit definition: Família que té la propietat legal actual o anterior d’un ítem. @ca
toolkit definition: Perekond, kellele eksemplar praegu õiguspäraselt kuulub või varem kuulus. @et
toolkit definition: Suku, jolla on kappaleen nykyinen tai aiempi laillinen omistusoikeus. @fi
toolkit definition: عائلة لديها حاليا الملكية القانونية لمفردة @ar
toolkit definition: 拥有对一个单件当前或先前法定所有权的一个家族 @zh-hans
toolkit label: Eigentümerin/Eigentümer (Familie) @de
toolkit label: Sahip aile @tr
toolkit label: eier (familie) @no
toolkit label: eigenaar-familie @nl
toolkit label: familie, som er ejer @da
toolkit label: famille propriétaire
toolkit label: família propietària @ca
toolkit label: omanik (perekond) @et
toolkit label: omistaja (suku) @fi
toolkit label: owner family @en
toolkit label: proprietario famiglia @it
toolkit label: tulajdonos család @hu
toolkit label: īpašnieks (dzimta/ģimene) @lv
toolkit label: عائلة مالكة @ar
toolkit label: 拥有者家族 @zh-hans
has subproperty: a pour famille propriétaire actuelle
has subproperty: a pour ancienne famille propriétaire
has subproperty: P40152
lexical alias: ownerFamily.en
status: Published
type: Property
domain: C10003
label: ha come proprietario famiglia @it
label: har eier (familie) @no
label: har familie, som er ejer @da
label: has owner family @en
label: hat Eigentümerin/Eigentümer (Familie) @de
label: heeft eigenaar-familie @nl
label: omanik (perekond) @et
label: omistaja (suku) @fi
label: sahip ailesi ile ilişkilidir @tr
label: tulajdonos családja a következő: @hu
label: té com a família propietària @ca
label: īpašnieks (dzimta/ģimene) @lv
label: له عائلة مالكة @ar
label: 有拥有者家族 @zh-hans
sub property of: a pour famille en relation avec un item
sub property of: a pour agent collectif propriétaire
definition: Bir kopyayı, bir kopyanın mevcut veya daha önce yasal mülkiyetine sahip olan bir aileyle ilişkilendirir. @tr
definition: Correla un item con una famiglia che detiene la proprietà giuridica di un item. @it
definition: Egy példányt hozzákapcsol egy családhoz, amely törvényesen birtokol egy példányt. @hu
definition: Liittää kappaleen sukuun, jolla on kappaleen nykyinen tai aiempi laillinen omistusoikeus. @fi
definition: Met un item en relation avec une famille qui possède actuellement ou a auparavant possédé légalement un item.
definition: Relaciona un ítem amb una família que té la propietat legal actual o anterior d’un ítem. @ca
definition: Relateert een item aan een familie die huidig of voormalig wettelijk bezit heeft van een item. @nl
definition: Relaterer et eksemplar til en familie som er den rettmessige eieren av et eksemplar. @no
definition: Relaterer et eksemplar til en familie, som er i lovlig besiddelse af et eksemplar. @da
definition: Relates an item to a family who has current or former legal possession of an item. @en
definition: Sasaista vienību ar dzimtu/ģimeni, kam ir vai ir bijušas likumīgas tiesības uz īpašumu. @lv
definition: Seostab eksemplari perekonnaga, kellele eksemplar praegu õiguspäraselt kuulub või varem kuulus. @et
definition: Setzt ein Exemplar in Beziehung zu einer Familie, die gegenwärtig oder früher im rechtmäßigen Besitz eines Exemplars ist/war. @de
definition: يربط مفردة بعائلة لديها حاليا الملكية القانونية لمفردة @ar
definition: 将一个单件与拥有对一个单件当前或先前法定所有权的一个家族关联起来。 @zh-hans

a pour famille collectionneuse
has element type: 2
toolkit definition: A family who is a curator who brings together items from various sources that are arranged, described, or catalogued as a collection. (Deprecated) @en
toolkit definition: Dzimta/ģimene, kas apkopo vienības no dažādiem avotiem, kas ir sakārtotas, aprakstītas vai kataloģizētas kā kolekcija. @lv
toolkit definition: Een familie die een curator is die items samenbrengt uit diverse bronnen die gerangschikt, beschreven of gecatalogiseerd zijn als een collectie. @nl
toolkit definition: Egy család, amely különböző forrásokból származó, gyűjteményként rendezett, leírt és katalogizált példányokat fog össze. @hu
toolkit definition: Eine Kuratorin/Ein Kurator (Familie), die Materialien aus unterschiedlichen Quellen zusammenträgt, die dann als Sammlung geordnet, beschrieben oder katalogisiert werden. @de
toolkit definition: En familie som er en kurator som setter sammen eksemplarer fra ulike kilder og som er arrangert, beskrevet eller katalogisert som en samling. @no
toolkit definition: Famiglia curatore che raccoglie item da varie fonti, che sono organizzati, descritti o catalogati come una collezione. @it
toolkit definition: Familie, som er kurator, som indsamler eksemplarer fra forskellige kilder, som bliver arrangeret, beskrevet eller katalogiseret som en samling. @da
toolkit definition: Famille conservatrice qui rassemble des items de diverses sources qui sont arrangés, décrits et catalogués comme une collection.
toolkit definition: Família que és un conservador que aplega ítems de diverses fonts que s’arrangen, es descriuen o es cataloguen com una col·lecció. @ca
toolkit definition: Kuraattorina toimiva suku, joka kokoaa eri lähteistä järjestettävät, kuvailtavat ja luetteloitavat kappaleet kokoelmaksi. @fi
toolkit definition: Perekond, kes kuraatorina kogub eri allikatest kokku eksemplarid, mis korrastatakse, kirjeldatakse või kataloogitakse koguna. @et
toolkit definition: عائلة هي أمينة متحف تجمع معاً مفردات من مصادر مختلفة رتُبت، أو وُصفت، أو فُهرست كمجموعة. @ar
toolkit label: Sammlerin/Sammler (Familie) @de
toolkit label: collector family (Deprecated) @en
toolkit label: collezionista famiglia @it
toolkit label: familie, som er samler @da
toolkit label: famille collectionneuse
toolkit label: família col·leccionista @ca
toolkit label: kogu moodustaja (perekond) @et
toolkit label: kokoelman muodostaja (suku) @fi
toolkit label: kolekcionārs (dzimta/ģimene) @lv
toolkit label: kollektor család @hu
toolkit label: samler (familie) @no
toolkit label: verzamelaar-familie @nl
toolkit label: عائلة جامعة @ar
has subproperty: P40153
lexical alias: collectorFamily.en
status: Deprecated
type: Property
domain: C10003
label: ha come collezionista famiglia @it
label: har familie, som er samler @da
label: har samler (familie) @no
label: has collector family (Deprecated) @en
label: hat Sammlerin/Sammler (Familie) @de
label: heeft verzamelaar-familie @nl
label: kogu moodustaja (perekond) @et
label: kokoelman muodostaja (suku) @fi
label: kolekcionārs (dzimta/ģimene) @lv
label: kollektor családja a következő: @hu
label: té com a família col·leccionista @ca
label: له عائلة جامعة @ar
sub property of: a pour agent collectif collectionneur
sub property of: a pour famille conservatrice
definition: Correla un item alla famiglia curatore che raccoglie item da varie fonti, che sono organizzati, descritti o catalogati come una collezione. @it
definition: Hozzákapcsol egy példányt egy kurátor családhoz, amely különböző forrásokból származó, gyűjteményként rendezett, leírt és katalogizált példányokat fog össze. @hu
definition: Liittää kappaleen kuraattorina toimivaan sukuun, joka kokoaa eri lähteistä järjestettävät, kuvailtavat ja luetteloitavat kappaleet kokoelmaksi. @fi
definition: Met un item en relation avec une famille conservatrice qui rassemble des items de diverses sources qui sont arrangés, décrits et catalogués comme une collection.
definition: Relaciona un ítem amb una família que és un conservador que aplega ítems de diverses fonts que s’arrangen, es descriuen o es cataloguen com una col·lecció. @ca
definition: Relateert een item aan een familie die een curator is die items samenbrengt uit diverse bronnen die gerangschikt, beschreven of gecatalogiseerd zijn als een collectie. @nl
definition: Relaterer et eksemplar til en familie som er en kurator som setter sammen eksemplarer fra ulike kilder og som er arrangert, beskrevet eller katalogisert som en samling. @no
definition: Relaterer et eksemplar til en familie, som er kurator, som indsamler eksemplarer fra forskellige kilder, som bliver arrangeret, beskrevet eller katalogiseret som en samling. @da
definition: Relates an item to a family who is a curator who brings together items from various sources that are arranged, described, or catalogued as a collection. (Deprecated) @en
definition: Sasaista vienību ar dzimtu/ģimeni, kas apkopo vienības no dažādiem avotiem, kas ir sakārtotas, aprakstītas vai kataloģizētas kā kolekcija. @lv
definition: Seostab eksemplari perekonnaga, kes kuraatorina kogub eri allikatest kokku eksemplarid, mis korrastatakse, kirjeldatakse või kataloogitakse koguna. @et
definition: Setzt ein Exemplar in Beziehung zu einer Kuratorin/einem Kurator (Familie), die/der Materialien aus unterschiedlichen Quellen zusammenträgt, die dann als Sammlung geordnet, beschrieben oder katalogisiert werden. @de
definition: يربط مفردة بعائلة هي أمينة متحف تقوم بجمع مفردات معاً من مصادر مختلفة رتُبت، أو وُصفت، أو فُهرست كمجموعة. @ar

a pour famille catalogueuse d’une collection de ressources
has element type: 2
toolkit definition: A family who is a curator who lists or inventories items in a collection aggregate. (Deprecated) @en
toolkit definition: Dzimta/ģimene, kas kolekciju apkopojumā uzskaita vai inventarizē vienības. @lv
toolkit definition: Een familie die een curator is die een lijst of inventaris aanlegt van items in een collectie-aggregaat. @nl
toolkit definition: Egy kurátor család, amely példányokat sorol fel vagy leltároz egy gyűjteményi aggregátumban. @hu
toolkit definition: Eine Kuratorin/Ein Kurator (Familie), die die Exemplare in einem Sammlungsaggregat verzeichnet oder inventarisiert. @de
toolkit definition: En familie som er en kurator som lager lister eller oversikter over eksemplarene i en aggregert samling. @no
toolkit definition: Famiglia curatore che elenca o inventaria gli item in un aggregato collezione. @it
toolkit definition: Familie, som er kurator, som listefører eller opgører en inventarliste over eksemplarer i et samlingsaggregat. @da
toolkit definition: Famille conservatrice qui dresse une liste ou un inventaire des items faisant partie d’un agrégat par regroupement.
toolkit definition: Família que és un conservador que llista o inventaria els ítems en una col·lecció agregada. @ca
toolkit definition: Kuraattorina toimiva suku, joka luetteloi tai inventoi kokoelma-aggregaatin kappaleet. @fi
toolkit definition: Perekond, kes kuraatorina loetleb või inventeerib kogu eksemplarid. @et
toolkit definition: عائلة أمين متحف تقوم بتسجيل قوائم مفردات أو بجردها في مجموعة مجمعة. @ar
toolkit label: Registrarin/Registrar (Familie) @de
toolkit label: collectieregistrator-familie @nl
toolkit label: collection registrar family (Deprecated) @en
toolkit label: conservatore di collezione famiglia @it
toolkit label: familie, som er samlingsregistrator @da
toolkit label: famille catalogueuse d’une collection de ressources
toolkit label: família conservadora de col·leccions @ca
toolkit label: gyűjtemény-nyilvántartó család: @hu
toolkit label: kogu registreerija (perekond) @et
toolkit label: kokoelman luetteloija (suku) @fi
toolkit label: kolekcijas reģistrētājs (dzimta/ģimene) @lv
toolkit label: samlingsregistrator (familie) @no
toolkit label: عائلة مسجلة المجموعات @ar
has subproperty: P40154
lexical alias: collectionRegistrarFamily.en
status: Deprecated
type: Property
domain: C10003
label: gyűjtemény-nyilvántartó családja a következő: @hu
label: ha come conservatore di collezione famiglia @it
label: har familie, som er samlingsregistrator @da
label: har samlingsregistrator (familie) @no
label: has collection registrar family (Deprecated) @en
label: hat Registrarin/Registrar (Familie) @de
label: heeft collectieregistrator-familie @nl
label: kogu registreerija (perekond) @et
label: kokoelman luetteloija (suku) @fi
label: kolekcijas reģistrētājs (dzimta/ģimene) @lv
label: té com a família conservadora de col·leccions @ca
label: له عائلة مسجِلة المجموعات @ar
sub property of: a pour agent collectif catalogueur d’une collection de ressources
sub property of: a pour famille conservatrice
alternative label: famille conservatrice d’une collection de ressources
definition: Correla un item alla famiglia curatore che elenca o inventaria gli item in un aggregato collezione. @it
definition: Hozzákapcsol egy példányt egy kurátor családhoz, amely példányokat sorol fel vagy leltároz egy gyűjteményi aggregátumban. @hu
definition: Liittää kappaleen kuraattorina toimivaan sukuun, joka luetteloi tai inventoi kokoelma-aggregaatin kappaleet. @fi
definition: Met un item en relation avec une famille conservatrice qui dresse une liste ou un inventaire des items faisant partie d’un agrégat par regroupement.
definition: Relaciona un ítem amb una família que és un conservador que llista o inventaria els ítems en una col·lecció agregada. @ca
definition: Relateert een item aan een familie die een curator is die een lijst of inventaris aanlegt van items in een collectie-aggregaat. @nl
definition: Relaterer et eksemplar til en familie som er en kurator som lager lister eller oversikter over eksemplarene i en aggregert samling. @no
definition: Relaterer et eksemplar til en familie, som er kurator, som listefører eller opgører en inventarliste over eksemplarer i et samlingsaggregat. @da
definition: Relates an item to a family who is a curator who lists or inventories items in a collection aggregate. (Deprecated) @en
definition: Sasaista vienību ar dzimtu/ģimeni, kas kolekciju apkopojumā uzskaita vai inventarizē vienības. @lv
definition: Seostab eksemplari perekonnaga, kes kuraatorina loetleb või inventeerib kogu eksemplarid. @et
definition: Setzt ein Exemplar in Beziehung zu einer Kuratorin/einem Kurator (Familie), die die Exemplare in einem Sammlungsaggregat verzeichnet oder inventarisiert. @de
definition: يربط مفردة عائلة هي أمينة متحف تقوم بتسجيل قوائم مفردات أو بجردها في مجموعة مجمعة. @ar

a pour famille déposante
has element type: 2
toolkit definition: A family who is a current owner of an item who deposits the item into the custody of another agent without transferring ownership. @en
toolkit definition: Bir kopyanın şu anki sahibi olan ve mülkiyeti devretmeden kopyayı başka bir temsilcinin gözetimine teslim eden bir aile. @tr
toolkit definition: Dzimta/ģimene, pašreizējais vienības īpašnieks, kurš deponējis vienību cita aģenta uzglabāšanā, vienlaikus saglabājot īpašumtiesības. @lv
toolkit definition: Een familie die een huidige eigenaar is van een item die het item onderbrengt bij een andere actor zonder eigenaarschap over te dragen. @nl
toolkit definition: Egy család, amely egy példány jelenlegi tulajdonosa, és amely egy másik ágens megőrzésébe letétként helyezi el a példányt anélkül, hogy a tulajdonjogot átruházná. @hu
toolkit definition: Eine gegenwärtige Eigentümerin/Ein gegenwärtiger Eigentümer (Familie) eines Exemplars, die das Exemplar in die Obhut eines anderen Akteurs gibt, ohne das Eigentumsrecht zu übertragen. @de
toolkit definition: En familie som er en nåværende eier av et eksemplar som deponerer eksemplaret til forvaring til en annen agent uten at eierskapet blir overført. @no
toolkit definition: Familie, som er nuværende ejer af et eksemplar, som deponerer eksemplaret til forvaring hos en anden agent, men uden at overgive ejerskab. @da
toolkit definition: Famille propriétaire actuelle d’un item qui dépose l’item sous la garde d’un autre agent sans en transférer la propriété.
toolkit definition: Família que és un propietari actual d’un ítem que el diposita sota la custòdia d’un altre agent sense transferir-li la propietat. @ca
toolkit definition: Kappaleen nykyinen omistajasuku, joka tallettaa kappaleen toisen toimijan huostaan omistajuudesta luopumatta. @fi
toolkit definition: Perekond, kes praeguse omanikuna deponeerib eksemplari teise tegija vastutavale hoiule ilma omandiõiguse üleminekuta. @et
toolkit definition: Proprietario attuale famiglia di un item che deposita l'item sotto la custodia di un altro agente senza trasferirne la proprietà @it
toolkit definition: عائلة هي المالك الحالي لمفردة، قامت بإيداعها تحت وصاية وكيل آخر دون نقل ملكيتها. @ar
toolkit definition: 作为单件的当前拥有者将单件委托给另一个行为者保管但未转让所有权的一个家族 @zh-hans
toolkit label: Leihgeberin/Leihgeber (Familie) @de
toolkit label: bruikleen-familie @nl
toolkit label: deponeerija (perekond) @et
toolkit label: deponent (familie) @no
toolkit label: deponents (dzimta/ģimene) @lv
toolkit label: depositante famiglia @it
toolkit label: depositor family @en
toolkit label: familie, som er udlåner @da
toolkit label: famille déposante
toolkit label: família dipositadora @ca
toolkit label: letétbe helyező család @hu
toolkit label: mevduatçı aile @tr
toolkit label: tallettaja (suku) @fi
toolkit label: عائلة مودعة @ar
toolkit label: 托存者家族 @zh-hans
has subproperty: P40155
lexical alias: depositorFamily.en
status: Published
type: Property
domain: C10003
label: deponeerija (perekond) @et
label: deponents (dzimta/ģimene) @lv
label: ha come depositante famiglia @it
label: har deponent (familie) @no
label: har familie, som er udlåner @da
label: has depositor family @en
label: hat Leihgeberin/Leihgeber (Familie) @de
label: heeft bruikleen-familie @nl
label: letétbe helyező családja a következő: @hu
label: mevduatçı ailesi ile ilişkilidir @tr
label: tallettaja (suku) @fi
label: té com a família dipositadora @ca
label: له عائلة مودعة @ar
label: 有托存者家族 @zh-hans
sub property of: a pour agent collectif déposant
sub property of: a pour famille propriétaire actuelle
definition: Bir kopyayı, bir kopyanın mevcut sahibi olan ve mülkiyeti devretmeden eşyayı başka bir temsilcinin emanetine bırakan bir aileyle ilişkilendirir. @tr
definition: Correla un item al proprietario attuale famiglia di un item che deposita l'item sotto la custodia di un altro agente senza trasferirne la proprietà. @it
definition: Hozzákapcsol egy példányt egy családhoz, amely egy példány jelenlegi tulajdonosa, és amely egy másik ágens megőrzésébe letétként helyezi el a példányt anélkül, hogy a tulajdonjogot átruházná. @hu
definition: Liittää kappaleen sen nykyiseen omistajasukuun, joka tallettaa kappaleen toisen toimijan huostaan omistajuudesta luopumatta. @fi
definition: Met un item en relation avec une famille propriétaire actuelle d’un item qui dépose l’item sous la garde d’un autre agent sans en transférer la propriété.
definition: Relaciona un ítem amb una família que és un propietari actual d’un ítem que el diposita sota la custòdia d’un altre agent sense transferir-li la propietat. @ca
definition: Relateert een item aan een familie die een huidige eigenaar is van een item die het item onderbrengt bij een andere actor zonder eigenaarschap over te dragen. @nl
definition: Relaterer et eksemplar til en familie som er en nåværende eier av et eksemplar som deponerer eksemplaret til forvaring til en annen agent uten at eierskapet blir overført. @no
definition: Relaterer et eksemplar til en familie, som er nuværende ejer af et eksemplar, som deponerer eksemplaret til forvaring hos en anden agent, men uden at overgive ejerskab. @da
definition: Relates an item to a family who is a current owner of an item who deposits the item into the custody of another agent without transferring ownership. @en
definition: Sasaista vienību ar dzimtu/ģimeni, kas ir pašreizējais vienības īpašnieks, kurš deponējis vienību cita aģenta uzglabāšanā, vienlaikus saglabājot īpašumtiesības. @lv
definition: Seostab eksemplari perekonnaga, kes praeguse omanikuna deponeerib eksemplari teise tegija vastutavale hoiule ilma omandiõiguse üleminekuta. @et
definition: Setzt ein Exemplar in Beziehung zu einer gegenwärtigen Eigentümerin/einem gegenwärtigen Eigentümer (Familie) eines Exemplars, die das Exemplar in die Obhut eines anderen Akteurs gibt, ohne das Eigentumsrecht zu übertragen. @de
definition: يربط مفردة بعائلة هي المالك الحالي لمفردة، قامت بإيداعها تحت وصاية وكيل آخر دون نقل ملكيتها. @ar
definition: 将一个单件与作为单件的当前拥有者将单件委托给另一个行为者保管但未转让所有权的一个家族关联起来。 @zh-hans

a pour famille donatrice
has element type: 2
toolkit definition: A family who is a former owner of an item who donates the item to another owner. @en
toolkit definition: Ancienne famille propriétaire d’un item qui fait don de cet item à un autre propriétaire.
toolkit definition: Bir kopyanın eski sahibi olan ve kopyayı başka bir sahibine bağışlayan bir aile. @tr
toolkit definition: Dzimta/ģimene, agrākais vienības īpašnieks, kurš ziedojis šo vienību citam īpašniekam. @lv
toolkit definition: Een familie die een voormalige eigenaar is van een item die het item schenkt aan een andere eigenaar. @nl
toolkit definition: Egy család, amely egy példány korábbi tulajdonosa, és amely a példányt egy másik tulajdonosnak adományozta. @hu
toolkit definition: Eine frühere Eigentümerin/Ein früherer Eigentümer (Familie) eines Exemplars, die das Exemplar einer anderen Eigentümerin/einem anderen Eigentümer überlässt. @de
toolkit definition: En familie som er en tidligere eier av et eksemplar som har gitt eksemplaret til en annen eier. @no
toolkit definition: Famiglia proprietario precedente di un item che ha donato l'item a un altro proprietario. @it
toolkit definition: Familie, som er tidligere ejer af et eksemplar, som har doneret dette eksemplar til en anden ejer. @da
toolkit definition: Família que és un propietari anterior d’un ítem que dona l’ítem a un altre propietari. @ca
toolkit definition: Kappaleen aiempi omistajasuku, joka lahjoittaa sen toiselle omistajalle. @fi
toolkit definition: Perekond, kes eksemplari endise omanikuna on kinkinud selle teisele omanikule. @et
toolkit definition: عائلة هي المالك السابق لمفردة تبرعت بها لمالك آخر. @ar
toolkit definition: 作为先前拥有者将单件捐赠给另一个拥有者的一个家族 @zh-hans
toolkit label: Stifterin/Stifter (Familie) @de
toolkit label: adományozó család @hu
toolkit label: annetaja (perekond) @et
toolkit label: bağışçı aile @tr
toolkit label: donatore famiglia @it
toolkit label: donor family @en
toolkit label: familie, som er donor @da
toolkit label: famille donatrice
toolkit label: família donant @ca
toolkit label: giver (familie) @no
toolkit label: lahjoittaja (suku) @fi
toolkit label: schenker-familie @nl
toolkit label: ziedotājs (dzimta/ģimene) @lv
toolkit label: عائلة متبرعة @ar
toolkit label: 捐赠者家族 @zh-hans
has subproperty: P40156
lexical alias: donorFamily.en
status: Published
type: Property
domain: C10003
label: adományozó családja a következő: @hu
label: annetaja (perekond) @et
label: bağışçı ailesi ile ilişkilidir @tr
label: ha come donatore famiglia @it
label: har familie, som er donor @da
label: har giver (familie) @no
label: has donor family @en
label: hat Stifterin/Stifter (Familie) @de
label: heeft schenker-familie @nl
label: lahjoittaja (suku) @fi
label: té com a família donant @ca
label: ziedotājs (dzimta/ģimene) @lv
label: له عائلة متبرعة @ar
label: 有捐赠者家族 @zh-hans
sub property of: a pour agent collectif donateur
sub property of: a pour ancienne famille propriétaire
definition: Bir kopyayı, bir kopyanın eski sahibi olan ve kopyayı başka bir sahibine bağışlayan bir aileyle ilişkilendirir. @tr
definition: Correla un item alla famiglia proprietario precedente di un item che ha donato l'item a un altro proprietario. @it
definition: Hozzákapcsol egy példányt egy családhoz, amely egy példány korábbi tulajdonosa, és amely a példányt egy másik tulajdonosnak adományozta. @hu
definition: Liittää kappaleen sen aiempaan omistajasukuun, joka lahjoittaa sen toiselle omistajalle. @fi
definition: Met un item en relation avec une ancienne famille propriétaire d’un item qui fait don de cet item à un autre propriétaire.
definition: Relaciona un ítem amb una família que és un propietari anterior d’un ítem que dona l’ítem a un altre propietari. @ca
definition: Relateert een item aan een familie die een voormalige eigenaar is van een item die het item schenkt aan een andere eigenaar. @nl
definition: Relaterer et eksemplar til en familie som er en tidligere eier av et eksemplar som har gitt eksemplaret til en annen eier. @no
definition: Relaterer et eksemplar til en familie, som er tidligere ejer af et eksemplar, som har doneret dette eksemplar til en anden ejer. @da
definition: Relates an item to a family who is a former owner of an item who donates the item to another owner. @en
definition: Sasaista vienību ar dzimtu/ģimeni, kas ir agrākais vienības īpašnieks, kurš ziedojis šo vienību citam īpašniekam. @lv
definition: Seostab eksemplari perekonnaga, kes eksemplari endise omanikuna on kinkinud selle teisele omanikule. @et
definition: Setzt ein Exemplar in Beziehung zu einer früheren Eigentümerin/einem früheren Eigentümer (Familie) eines Exemplars, die das Exemplar einer anderen Eigentümerin/einem anderen Eigentümer überlässt. @de
definition: يربط مفردة بعائلة هي المالك السابق لمفردة تبرعت بها لمالك آخر. @ar
definition: 将一个单件与作为先前拥有者将单件捐赠给另一个拥有者的一个家族关联起来。 @zh-hans

a pour famille vendeuse
has element type: 2
toolkit definition: A family who is a former owner of an item who sells the item to another owner. @en
toolkit definition: Ancienne famille propriétaire d’un item qui vend cet item à un autre propriétaire.
toolkit definition: Bir kopyanın eski sahibi olan ve kopyayı başka bir sahibine satan bir aile. @tr
toolkit definition: Dzimta/ģimene - vienības agrākais īpašnieks, kura pārdod šo vienību citam īpašniekam. @lv
toolkit definition: Een familie die een voormalige eigenaar is van een item die het item verkoopt aan een andere eigenaar. @nl
toolkit definition: Egy család, amely egy példány korábbi tulajdonosa, és amely a példányt másik tulajdonosnak adja el. @hu
toolkit definition: Eine frühere Eigentümerin/Ein früherer Eigentümer (Familie) eines Exemplars, die das Exemplar an eine andere Eigentümerin/einen anderen Eigentümer verkauft. @de
toolkit definition: En familie som er en tidligere eier av et eksemplar, som har solgt eksemplaret til en annen eier. @no
toolkit definition: Famiglia proprietario precedente di un item che ha donato l'item a un altro proprietario. @it
toolkit definition: Familie, som er tidligere ejer af et eksemplar, som har solgt dette eksemplar til en anden ejer. @da
toolkit definition: Família que és un propietari anterior d’un ítem que ven l’ítem a un altre propietari. @ca
toolkit definition: Kappaleen aiempi omistajasuku, joka myy kappaleen toiselle omistajalle. @fi
toolkit definition: Perekond, kes eksemplari endise omanikuna on müünud selle teisele omanikule. @et
toolkit definition: عائلة هي المالك السابق لمفردة قامت ببيعها لمالك آخر. @ar
toolkit definition: 作为先前拥有者将单件出售给另一个拥有者的一个家族 @zh-hans
toolkit label: Verkäuferin/Verkäufer (Familie) @de
toolkit label: familie, som er sælger @da
toolkit label: famille vendeuse
toolkit label: família venedora @ca
toolkit label: myyjä (suku) @fi
toolkit label: müüja (perekond) @et
toolkit label: pārdevējs (dzimta/ģimene) @lv
toolkit label: satıcı aile @tr
toolkit label: selger (familie) @no
toolkit label: seller family @en
toolkit label: venditore famiglia @it
toolkit label: verkoper-familie @nl
toolkit label: értékesítő család @hu
toolkit label: عائلة بائعة @ar
toolkit label: 出售者家族 @zh-hans
has subproperty: P40157
lexical alias: sellerFamily.en
status: Published
type: Property
domain: C10003
label: ha come venditore famiglia @it
label: har familie, som er sælger @da
label: har selger (familie) @no
label: has seller family @en
label: hat Verkäuferin/Verkäufer (Familie) @de
label: heeft verkoper-familie @nl
label: myyjä (suku) @fi
label: müüja (perekond) @et
label: pārdevējs (dzimta/ģimene) @lv
label: satıcı ailesi ile ilişkilidir @tr
label: té com a família venedora @ca
label: értékesítő családja a következő: @hu
label: له عائلة بائعة @ar
label: 有出售者家族 @zh-hans
sub property of: a pour agent collectif vendeur
sub property of: a pour ancienne famille propriétaire
definition: Bir kopyayı, bir kopyayı başka bir sahibine satan bir kopyanın eski sahibi olan bir aileyle ilişkilendirir. @tr
definition: Correla un item alla famiglia proprietario precedente di un item che ha venduto l'item a un altro proprietario. @it
definition: Egy példányt hozzákapcsol egy családhoz, amely a példány korábbi tulajdonosa, és amely a példányt másik tulajdonosnak adja el. @hu
definition: Liittää kappaleen sen aiempaan omistajasukuun, joka myy kappaleen toiselle omistajalle. @fi
definition: Met un item en relation avec une ancienne famille propriétaire d’un item qui vend cet item à un autre propriétaire.
definition: Relaciona un ítem amb una família que és un propietari anterior d’un ítem que ven l’ítem a un altre propietari. @ca
definition: Relateert een item aan een familie die een voormalige eigenaar is van een item die het item verkoopt aan een andere eigenaar. @nl
definition: Relaterer et eksemplar til en familie som er en tidligere eier av et eksemplar, som har solgt eksemplaret til en annen eier. @no
definition: Relaterer et eksemplar til en familie, som er tidligere ejer af et eksemplar, som har solgt dette eksemplar til en anden ejer. @da
definition: Relates an item to a family who is a former owner of an item who sells the item to another owner. @en
definition: Sasaista vienību ar dzimtu/ģimeni, kas ir vienības agrākais īpašnieks, kura pārdod šo vienību citam īpašniekam. @lv
definition: Seostab eksemplari perekonnaga, kes eksemplari endise omanikuna on müünud selle teisele omanikule. @et
definition: Setzt ein Exemplar in Beziehung zu einer früheren Eigentümerin/einem früheren Eigentümer (Familie) eines Exemplars, die das Exemplar an eine andere Eigentümerin/einen anderen Eigentümer verkauft. @de
definition: يربط مفردة بعائلة هي المالك السابق لمفردة قامت ببيعها لمالك آخر. @ar
definition: 将一个的单件与作为先前拥有者将单件出售给另一个拥有者的一个家族关联起来。 @zh-hans

a pour famille honorée d’un item
has element type: 2
toolkit definition: A family who is honoured by an item. @en
toolkit definition: Bir kopya ile onurlandırılan bir aile. @tr
toolkit definition: Dzimta/ģimene, kas godināta ar vienību. @lv
toolkit definition: Een familie die geëerd wordt door een item. @nl
toolkit definition: Egy család, amelyet a példány méltat. @hu
toolkit definition: Eine Familie, die durch ein Exemplar geehrt wird. @de
toolkit definition: En familie som beæres av et eksemplar. @no
toolkit definition: Famiglia onorata da un item. @it
toolkit definition: Familie, som er hædret i et eksemplar. @da
toolkit definition: Famille qui est honorée par un item.
toolkit definition: Família que és homenatjada en un ítem. @ca
toolkit definition: Perekond, keda eksemplariga austatakse. @et
toolkit definition: Suku, jota kappaleella kunnioitetaan. @fi
toolkit definition: عائلة كُرمت بمفردة. @ar
toolkit definition: 被一个单件纪念的一个家族 @zh-hans
toolkit label: Gefeierte/Gefeierter eines Exemplars (Familie) @de
toolkit label: ar vienību godinātā dzimta/ģimene @lv
toolkit label: eksemplari austusavalduse saaja (perekond) @et
toolkit label: famiglia onorata di item @it
toolkit label: familie beæret av eksemplar @no
toolkit label: familie, som er beæret i eksemplar @da
toolkit label: famille honorée d’un item
toolkit label: família homenatjada d’un ítem @ca
toolkit label: geëerde-familie van item @nl
toolkit label: honouree family of item @en
toolkit label: kappaleella kunnioitettu suku @fi
toolkit label: kopyanın onurlandırılan ailesi ile ilişkilidir @tr
toolkit label: példány méltatott családja @hu
toolkit label: عائلة مكرمة بمفردة. @ar
toolkit label: 单件的被纪念者家族 @zh-hans
has subproperty: P40158
lexical alias: honoureeFamilyOfItem.en
status: Published
type: Property
domain: C10003
label: ar vienību godinātā dzimta/ģimene @lv
label: eksemplari austusavalduse saaja (perekond) @et
label: ha come onorato famiglia di item @it
label: har familie beæret av eksemplar @no
label: har familie, som er beæret i eksemplar @da
label: has honouree family of item @en
label: hat Gefeierte/Gefeierten eines Exemplars (Familie) @de
label: heeft geëerde-familie van item @nl
label: kappaleella kunnioitettu suku @fi
label: kopyanın onurlandırılan ailesi ile ilişkilidir @tr
label: példány méltatott családja a következő: @hu
label: té com a família homenatjada d’un ítem @ca
label: له عائلة مكرَمة بمفردة @ar
label: 有单件的被纪念者家族 @zh-hans
sub property of: a pour famille en relation avec un item
sub property of: a pour agent collectif honoré d’un item
definition: Bir kopyayı, bir kopyayla onurlandırılan bir aileyle ilişkilendirir. @tr
definition: Correla un item alla famiglia onorata da un item. @it
definition: Hozzákapcsol egy példányt egy családhoz, amelyet a példány méltat. @hu
definition: Liittää kappaleen sukuun, jota kappaleella kunnioitetaan. @fi
definition: Met un item en relation avec une famille qui est honorée par un item.
definition: Relaciona un ítem amb una família que és homenatjada en un ítem. @ca
definition: Relateert een item aan een familie die geëerd wordt door een item. @nl
definition: Relaterer et eksemplar til en familie som beæres av et eksemplar. @no
definition: Relaterer et eksemplar til en familie, som er hædret i et eksemplar. @da
definition: Relates an item to a family who is honoured by an item. @en
definition: Sasaista vienību ar dzimtu/ģimeni, kas godināta ar vienību. @lv
definition: Seostab eksemplari perekonnaga, keda eksemplariga austatakse. @et
definition: Setzt ein Exemplar in Beziehung zu einer Familie, die durch ein Exemplar geehrt wird. @de
definition: يربط مفردة بعائلة مكرمة بمفردة. @ar
definition: 将一个单件与被一个单件纪念的一个家族关联起来。 @zh-hans

a pour famille restauratrice d’un item
has element type: 2
toolkit definition: A family who is responsible for the set of technical, editorial, and intellectual procedures aimed at compensating for the degradation of an item by bringing it back to a state as close as possible to its original condition. @en
toolkit definition: Bir kopyanın bozulmasını orijinal durumuna mümkün olduğunca yakın bir duruma geri getirerek telafi etmeyi amaçlayan bir dizi teknik, editoryal ve entelektüel prosedürden sorumlu olan bir aile. @tr
toolkit definition: Dzimta/ģimene, kas ir atbildīga par tehnisko, redakcionālo un intelektuālo procedūru kopumu, kuru mērķis ir kompensēt vienības pakāpenisko bojāeju, atgriežot to, cik vien iespējams, tuvu tās sākotnējam stāvoklim. @lv
toolkit definition: Een familie die verantwoordelijk is voor de verzameling van technische, redactionele en intellectuele procedures gericht op het corrigeren van de achteruitgang van een item door het zo goed mogelijk terug te brengen tot de oorspronkelijke staat. @nl
toolkit definition: Egy család, amely felelős technikai, szerkesztői és intellektuális eljárások összességéért, amelyek célja egy példány romlásának ellensúlyozása, amivel azt az eredeti állapotához a lehető legközelebb képesek visszahozni. @hu
toolkit definition: Eine Familie, die für die technischen, redaktionellen und intellektuellen Verfahren verantwortlich ist, die darauf abzielen, die Zersetzung eines Exemplars auszugleichen, indem es in einen Zustand zurückversetzt wird, der seiner ursprünglichen Beschaffenheit möglichst nahe kommt. @de
toolkit definition: En familie som har ansvar for de tekniske og intellektuelle metodene som brukes for å kompensere for nedbrytningen av et eksemplar ved å restaurere det til en tilstand som er så lik originaltilstanden som mulig. @no
toolkit definition: Famiglia responsabile dell'insieme delle procedure tecniche, di cura e intellettuali finalizzate al risarcimento di un item in seguito alla sua degradazione, riportandolo a uno stato il più possibile vicino alla condizione originale. @it
toolkit definition: Familie, som er ansvarlig for en række af tekniske, redaktionelle og intellektuelle procedurer, som forsøger at kompensere for nedslidningen af et eksemplar ved at føre det tilbage til en tilstand, der er så tæt som muligt på dets oprindelige tilstand. @da
toolkit definition: Famille qui est responsable de l’ensemble des procédures techniques, éditoriales et intellectuelles destinées à compenser la dégradation d’un item en le ramenant à un état aussi près que possible de sa condition originelle.
toolkit definition: Família que és responsable del conjunt de procediments tècnics, editorials i intel·lectuals destinats a compensar la degradació d’un ítem retornant-lo a un estat que s’aproximi al màxim a la seva condició original. @ca
toolkit definition: Perekond, kes vastutab rea tehniliste, toimetuslike ja intellektuaalsete toimingute eest, mille eesmärk on taastada kahjustatud eksemplari seisund võimalikult originaalseisundi lähedaseks. @et
toolkit definition: Suku, joka vastaa teknisistä, toimituksellisista ja tiedollisista toimenpiteistä, joiden tarkoitus on palauttaa huonokuntoinen kappale mahdollisimman lähelle sen alkuperäistä kuntoa. @fi
toolkit definition: عائلة مسؤولة عن مجموعة الإجراءات الفنية، والتحريرية، والفكرية التي تهدف إلى إصلاح التدهور الذي لحق بمفردة، وإعادتها إلى حالة أقرب ما تكون إلى حالتها الأصلية. @ar
toolkit definition: 负责为弥补单件的损毁而担负一系列技术、编辑和智力操作、使之尽可能恢复到原始状态的一个家族 @zh-hans
toolkit label: Restauratorin/Restaurator eines Exemplars (Familie) @de
toolkit label: eksemplari restaureerija (perekond) @et
toolkit label: famiglia restauratore di item @it
toolkit label: familie, som er konservator af eksemplar @da
toolkit label: famille restauratrice d’un item
toolkit label: família restauradora d’un ítem @ca
toolkit label: kappaleen entisöijä (suku) @fi
toolkit label: konservator for eksemplar (familie) @no
toolkit label: kopyanın restorasyon uzmanı ailesi @tr
toolkit label: példány restaurátor családja @hu
toolkit label: restaurator-familie van item @nl
toolkit label: restorationist family of item @en
toolkit label: vienības restaurators (dzimta/ģimene) @lv
toolkit label: عائلة مرممة لمفردة @ar
toolkit label: 单件的修复者家族 @zh-hans
has subproperty: P40159
lexical alias: restorationistFamilyOfItem.en
status: Published
type: Property
domain: C10003
label: eksemplari restaureerija (perekond) @et
label: ha come famiglia restauratrice di item @it
label: har familie, som er konservator af eksemplar @da
label: har konservator for eksemplar (familie) @no
label: has restorationist family of item @en
label: hat Restauratorin/Restaurator eines Exemplars (Familie) @de
label: heeft restaurator-familie van item @nl
label: kappaleen entisöijä (suku) @fi
label: kopyanın restorasyon uzmanı ailesi ile ilişkilidir @tr
label: példány restaurátor családja a következő: @hu
label: té com a família restauradora d’un ítem @ca
label: vienības restaurators (dzimta/ģimene) @lv
label: له عائلة مرممة لمفردة @ar
label: 有单件的修复者家族 @zh-hans
sub property of: a pour agent collectif restaurateur d’un item
sub property of: a pour famille modificatrice
definition: Bir kopyayı, orijinal durumuna mümkün olduğu kadar yakın bir duruma geri getirerek bir kopyanın bozulmasını telafi etmeyi amaçlayan teknik, yayın ve entelektüel prosedürler dizisinden sorumlu olan bir aileyle ilişkilendirir. @tr
definition: Correla un item alla famiglia responsabile dell'insieme delle procedure tecniche, di cura e intellettuali finalizzate al risarcimento di un item in seguito alla sua degradazione, riportandolo a uno stato il più possibile vicino alla condizione originale. @it
definition: Hozzákapcsol egy példányt egy családhoz, amely felelős technikai, szerkesztői és intellektuális eljárások összességéért, amelyek célja egy példány romlásának ellensúlyozása, amivel azt az eredeti állapotához a lehető legközelebb képesek visszahozni. @hu
definition: Liittää kappaleen sukuun, joka vastaa teknisistä, toimituksellisista ja tiedollisista toimenpiteistä, joiden tarkoitus on palauttaa huonokuntoinen kappale mahdollisimman lähelle sen alkuperäistä kuntoa. @fi
definition: Met un item en relation avec une famille qui est responsable de l’ensemble des procédures techniques, éditoriales et intellectuelles destinées à compenser la dégradation d’un item en le ramenant à un état aussi près que possible de sa condition originelle.
definition: Relaciona un ítem amb una família que és responsable del conjunt de procediments tècnics, editorials i intel·lectuals destinats a compensar la degradació d’un ítem retornant-lo a un estat que s’aproximi al màxim a la seva condició original. @ca
definition: Relateert een item aan een familie die verantwoordelijk is voor de verzameling van technische, redactionele en intellectuele procedures gericht op het corrigeren van de achteruitgang van een item door het zo goed mogelijk terug te brengen tot de oorspronkelijke staat. @nl
definition: Relaterer et eksemplar til en familie som har ansvar for de tekniske og intellektuelle metodene som brukes for å kompensere for nedbrytningen av et eksemplar ved å restaurere det til en tilstand som er så lik originaltilstanden som mulig. @no
definition: Relaterer et eksemplar til en familie, som er ansvarlig for en række af tekniske, redaktionelle og intellektuelle procedurer, som forsøger at kompensere for nedslidningen af et eksemplar ved at føre det tilbage til en tilstand, der er så tæt som muligt på dets oprindelige tilstand. @da
definition: Relates an item to a family who is responsible for the set of technical, editorial, and intellectual procedures aimed at compensating for the degradation of an item by bringing it back to a state as close as possible to its original condition. @en
definition: Sasaista vienību ar dzimtu/ģimeni, kas ir atbildīga par tehnisko, redakcionālo un intelektuālo procedūru kopumu, kuru mērķis ir kompensēt vienības pakāpenisko bojāeju, atgriežot to, cik vien iespējams, tuvu tās sākotnējam stāvoklim. @lv
definition: Seostab eksemplari perekonnaga, kes vastutab rea tehniliste, toimetuslike ja intellektuaalsete toimingute eest, mille eesmärk on taastada kahjustatud eksemplari seisund võimalikult originaalseisundi lähedaseks. @et
definition: Setzt ein Exemplar in Beziehung zu einer Familie, die für die technischen, redaktionellen und intellektuellen Verfahren verantwortlich ist, die darauf abzielen, die Zersetzung eines Exemplars auszugleichen, indem es in einen Zustand zurückversetzt wird, der seiner ursprünglichen Beschaffenheit möglichst nahe kommt. @de
definition: يربط مفردة بعائلة مسئولة عن مجموعة الإجراءات الفنية، والتحريرية، والفكرية التي تهدف إلى إصلاح التدهور الذي لحق بمفردة، وإعادتها إلى حالة أقرب ما تكون إلى حالتها الأصلية. @ar
definition: 将一个单件与负责为弥补单件的损毁而担负一系列技术、编辑和智力操作、使之尽可能恢复到原始状态的一个家族关联起来。 @zh-hans

a pour famille modificatrice
has element type: 2
toolkit definition: A family who makes changes to an item without creating a new manifestation. @en
toolkit definition: Dzimta/ģimene, kas veikusi izmaiņas vienībā, neradot jaunu manifestāciju. @lv
toolkit definition: Een familie die veranderingen aanbrengt aan een item zonder een nieuwe manifestatie te creëren. @nl
toolkit definition: Egy család, amely új megjelenési forma létrehozása nélkül idéz elő változást a példányban @hu
toolkit definition: Eine Familie, die Änderungen an einem Exemplar vornimmt, ohne eine neue Manifestation zu erstellen. @de
toolkit definition: En familie som gjør endringer på et eksemplar uten å skape en ny manifestasjon. @no
toolkit definition: Famiglia che apporta modifiche a un item senza creare una nuova manifestazione. @it
toolkit definition: Familie, som ændrer i et eksemplar uden at skabe en ny manifestation. @da
toolkit definition: Famille qui apporte des modifications à un item sans créer une nouvelle manifestation.
toolkit definition: Família que fa canvis a un ítem sense crear una manifestació nova. @ca
toolkit definition: Perekond, kes muudab eksemplari, loomata uut kehastust. @et
toolkit definition: Suku, joka tekee muutoksia kappaleeseen luomatta uutta manifestaatiota. @fi
toolkit definition: Yeni bir görünüm oluşturmadan bir kopyada değişiklik yapan bir aile. @tr
toolkit definition: عائلة تُجري تغييرات على مفردة دون أن تنشئ تجسيدة جديدة. @ar
toolkit definition: 对一个单件作修改而不创建一个新的载体表现的一个家族 @zh-hans
toolkit label: Bearbeiterin/Bearbeiter eines Exemplars (Familie) @de
toolkit label: Dönüştürücü aile @tr
toolkit label: aanpasser-familie @nl
toolkit label: familie, som er tilpasser @da
toolkit label: famille modificatrice
toolkit label: família modificadora @ca
toolkit label: modificatore famiglia @it
toolkit label: modificētājs (dzimta/ģimene) @lv
toolkit label: modifier family @en
toolkit label: muokkaaja (suku) @fi
toolkit label: muutja (perekond) @et
toolkit label: módosító család @hu
toolkit label: tilpasser (familie) @no
toolkit label: عائلة مسئولة عن التعديل @ar
toolkit label: 修改者家族 @zh-hans
has subproperty: a pour famille relieuse
has subproperty: a pour famille enlumineuse
has subproperty: a pour famille restauratrice d’un item
has subproperty: P40160
lexical alias: modifierFamily.en
status: Published
type: Property
domain: C10003
label: düzenleyici ailesi ile ilişkilidir @tr
label: ha come modificatore famiglia @it
label: har familie, som er tilpasser @da
label: har tilpasser (familie) @no
label: has modifier family @en
label: hat Bearbeiterin/Bearbeiter eines Exemplars (Familie) @de
label: heeft aanpasser-familie @nl
label: modificētājs (dzimta/ģimene) @lv
label: muokkaaja (suku) @fi
label: muutja (perekond) @et
label: módosító családja a következő: @hu
label: té com a família modificadora @ca
label: له عائلة مسئولة عن التعديل @ar
label: 有修改者家族 @zh-hans
sub property of: a pour famille en relation avec un item
sub property of: a pour agent collectif modificateur
definition: Bir kopyayı, yeni bir gösterim oluşturmadan bir kopyada değişiklik yapan bir aileyle ilişkilendirir. @tr
definition: Correla un item a una famiglia che apporta modifiche a un item senza creare una nuova manifestazione. @it
definition: Hozzákapcsol egy példányt egy családhoz, amely új megjelenési forma létrehozása nélkül idéz elő változást a példányban. @hu
definition: Liittää kappaleen sukuun, joka tekee muutoksia kappaleeseen luomatta uutta manifestaatiota. @fi
definition: Met un item en relation avec une famille qui apporte des modifications à un item sans créer une nouvelle manifestation.
definition: Relaciona un ítem amb una família que fa canvis a un ítem sense crear una manifestació nova. @ca
definition: Relateert een item aan een familie die veranderingen aanbrengt aan een item zonder een nieuwe manifestatie te creëren. @nl
definition: Relaterer et eksemplar til en familie som gjør endringer på et eksemplar uten å skape en ny manifestasjon. @no
definition: Relaterer et eksemplar til en familie, som ændrer i et eksemplar uden at skabe en ny manifestation. @da
definition: Relates an item to a family that makes changes to an item without creating a new manifestation. @en
definition: Sasaista vienību ar dzimtu/ģimeni, kas veikusi izmaiņas vienībā, neradot jaunu manifestāciju. @lv
definition: Seostab eksemplari perekonnaga, kes muudab eksemplari, loomata uut kehastust. @et
definition: Setzt ein Exemplar in Beziehung zu einer Familie, die Änderungen an einem Exemplar vornimmt, ohne eine neue Manifestation zu erstellen. @de
definition: يربط مفردة بعائلة تُجري تغييرات على مفردة دون أن تنشئ تجسيدة جديدة. @ar
definition: 将一个单件与对一个单件作修改而不创建一个新的载体表现的一个家族关联起来。 @zh-hans

est conservé par
has element type: 2
toolkit definition: A manifestation of a collection work that includes the item. @en
toolkit definition: Kokoelmateoksen manifestaatio, joka sisältää kappaleen. @fi
toolkit definition: Kopyayı içeren bir koleksiyon eserinin gösterimi. @tr
toolkit definition: Manifestation d’une œuvre de collection de ressources qui comprend l’item.
toolkit definition: 包含该单件的一种收藏作品的一种载体表现 @zh-hans
toolkit label: conservé par
toolkit label: fons de @ca
toolkit label: holding of @en
toolkit label: kappale kokoelmassa @fi
toolkit label: koleksiyonunda bulunan kopyasıdır @tr
toolkit label: ……的馆藏 @zh-hans
has subproperty: P40161
lexical alias: holdingOf.en
status: Published
type: Property
domain: C10003
label: is holding of @en
label: kappale kokoelmassa @fi
label: koleksiyonda bulunan kopyasıdır @tr
label: és fons de @ca
label: 是……的馆藏 @zh-hans
sub property of: a pour manifestation en relation avec un item
definition: Bir kopyayı, kopyayı içeren bir koleksiyon eserinin gösterimiyle ilişkilendirir. @tr
definition: Liittää kappaleen kokoelmateoksen manifestaatioon, joka sisältää kappaleen. @fi
definition: Met un item en relation avec une manifestation d’une œuvre de collection de ressources qui comprend l’item.
definition: Relaciona un ítem amb una manifestació d’una obra de col·lecció de recursos que inclou l’ítem. @ca
definition: Relates an item to a manifestation of a collection work that includes the item. @en
definition: 将一个单件与包含该单件的一种收藏作品的一种载体表现关联起来。 @zh-hans

a pour emplacement d’un item
has element type: 2
toolkit definition: A place where an item is held, stored, or made available for access. @en
toolkit definition: Bir kopyanın tutulduğu, saklandığı veya erişim için hazır hale getirildiği yer. @tr
toolkit definition: Lieu où un item est conservé, entreposé ou rendu accessible.
toolkit definition: Lloc on un ítem és aplegat, emmagatzemat o fet disponible per a l’accés. @ca
toolkit definition: Paikka, jossa kappale säilytetään tai asetetaan saataville. @fi
toolkit definition: 一个单件被收藏、储存或提供存取的一个地点 @zh-hans
toolkit label: Kopyanın konumu @tr
toolkit label: emplacement d’un item
toolkit label: kappaleen sijainti @fi
toolkit label: localització d’ítem @ca
toolkit label: location of item @en
toolkit label: 单件的位置 @zh-hans
has subproperty: P40162
lexical alias: locationOfItem.en
status: Published
type: Property
domain: C10003
label: has location of item @en
label: kappaleen sijainti @fi
label: kopyanın konumu ile ilişkilidir @tr
label: té localització d’ítem @ca
label: 有单件的位置 @zh-hans
sub property of: a pour lieu en relation avec un item
definition: Bir kopyayı, bir kopyanın tutulduğu, saklandığı veya erişim için hazırlandığı bir yerle ilişkilendirir. @tr
definition: Liittää kappaleen paikkaan, jossa kappale säilytetään tai asetetaan saataville. @fi
definition: Met un item en relation avec un lieu où un item est conservé, entreposé ou rendu accessible.
definition: Relaciona un ítem amb un lloc on un ítem és aplegat, emmagatzemat o fet disponible per a l’accés. @ca
definition: Relates an item to a place where an item is held, stored, or made available for access. @en
definition: 将一个单件与一个单件被收藏、储存或提供存取的一个地点关联起来。 @zh-hans

est sur une manifestation avec
has element type: 2
toolkit definition: An item that is reproduced on the same manifestation as an item. @en
toolkit definition: Bir kopyayla aynı gösterimde yeniden üretilen bir kopya. @tr
toolkit definition: Item qui est reproduit sur la même manifestation qu’un item.
toolkit definition: Kappale, joka on jäljenteenä samassa manifestaatiossa kuin toinen kappale. @fi
toolkit definition: Ítem que es reprodueix a la mateixa manifestació com un ítem. @ca
toolkit definition: 被复制于和一个单件的同一种载体表现上的一个单件 @zh-hans
toolkit label: en manifestació amb @ca
toolkit label: ile gösterim üzerine @tr
toolkit label: manifestaatiossa toisen kappaleen kanssa @fi
toolkit label: on manifestation with @en
toolkit label: sur une manifestation avec
toolkit label: 在和……同一种载体表现上 @zh-hans
has subproperty: P40163
lexical alias: onManifestationWith.en
status: Published
type: Property
domain: C10003
label: ile aynı gösterimde yer alır @tr
label: is on manifestation with @en
label: manifestaatiossa toisen kappaleen kanssa @fi
label: és en manifestació amb @ca
label: 在和……同一种载体表现上 @zh-hans
sub property of: a pour item en relation avec un item
definition: Bir kopyayı, bir kopyayla aynı görünümde yeniden üretilmiş bir kopyayla ilişkilendirir. @tr
definition: Liittää kappaleen kappaleeseen, joka on jäljenteenä samassa manifestaatiossa kuin toinen kappale. @fi
definition: Met un item en relation avec un item qui est reproduit sur la même manifestation qu’un item.
definition: Relaciona un ítem amb un ítem que es reprodueix a la mateixa manifestació com un ítem. @ca
definition: Relates an item to an item that is reproduced on the same manifestation as an item. @en
definition: 将一个单件与被复制于和一个单件的同一种载体表现上的一个单件关联起来。 @zh-hans

est un item décrit avec des métadonnées par
has element type: 2
toolkit definition: A work that is a metadata work for an item. @en
toolkit definition: Bir kopya için üstveri çalışması olan bir eser. @tr
toolkit definition: Teos, joka on kappaleen metatietoteos. @fi
toolkit definition: Una obra que és una obra de metadades per a un ítem. @ca
toolkit definition: Œuvre qui consiste en une œuvre de métadonnées pour un item.
toolkit definition: 作为一个单件的一种元数据作品的一种作品 @zh-hans
toolkit label: item described with metadata by @en
toolkit label: item décrit avec des métadonnées par
toolkit label: kappaletta metatiedoilla kuvaileva teos @fi
toolkit label: tarafından üst verilerle açıklanan kopya @tr
toolkit label: ítem descrit amb metadades per @ca
toolkit label: 被……用元数据描述的单件 @zh-hans
has subproperty: P40164
lexical alias: itemDescribedWithMetadataBy.en
status: Published
type: Property
domain: C10003
label: is item described with metadata by @en
label: kappaletta metatiedoilla kuvaileva teos @fi
label: tarafından üstveri ile tanımlanan kopyadır @tr
label: és ítem descrit amb metadades per @ca
label: 是被……用元数据描述的单件 @zh-hans
sub property of: est un item décrit par
definition: Bir kopyayı, bir kopya için üstveri eseri olan bir eserle ilişkilendirir. @tr
definition: Liittää kappaleen teokseen, joka on kappaleen metatietoteos. @fi
definition: Met un item en relation avec une œuvre qui consiste en une œuvre de métadonnées pour un item.
definition: Relaciona un ítem amb una obra que és una obra de metadades per a un ítem. @ca
definition: Relates an item to a work that is a metadata work for an item. @en
definition: 将一个单件与作为一个单件的一种元数据作品的一种作品关联起来。 @zh-hans