Nomen properties
type: Ontology
description: Properties that represent the attribute and relationship elements of the RDA Nomen entity.
preferred namespace prefix: rdan
rights: Copyright © 2020 American Library Association, Canadian Federation of Library Associations, and CILIP: Chartered Institute of Library and Information Professionals
licence: deed.en US
creator: RDA Steering Committee
contributor: RSC Technical Working Group
publisher: ALA Digital Reference
type: http://rdaregistry.info/termList/RDALinkedDataWork/1003
issued: 2016-12-18
title: RDA:n nomenin ominaisuudet @fi
description: RDA-elementeistä johdetut ominaisuudet RDA:n nomenin määrittelyjoukossa. @fi
version info: v5.4.4
modified: 2025-06-18

is abbreviated title of
status: Published
type: Property
lexical alias: abbreviatedTitleOf.en
domain: C10012
toolkit label: abbreviated title of
sub property of: is variant title of manifestation of
has element type: 2
definition: Relates a nomen to a manifestation that has a title of manifestation that has been abbreviated for purposes of indexing or identification.
toolkit definition: A manifestation that has a title of manifestation that has been abbreviated for purposes of indexing or identification.
label: lyhennetty nimeke manifestaatiolle @fi
definition: Liittää nomenin manifestaatioon, jonka nimeke on lyhennetty indeksointia ja tunnistamista varten. @fi
toolkit label: lyhennetty nimeke manifestaatiolle @fi
toolkit definition: Manifestaatio, jonka nimeke on lyhennetty indeksointia ja tunnistamista varten. @fi
label: er forkortet tittel for @no
definition: Relaterer et nomen til en manifestasjon som har en tittel for manifestasjon som er blitt forkortet for bruk til indeksering og identifikasjon. @no
toolkit label: forkortet tittel for @no
toolkit definition: En manifestasjon som har en tittel for manifestasjon som er blitt forkortet for bruk til indeksering og identifikasjon. @no
label: est un titre abrégé de @fr
definition: Met un nomen en relation avec une manifestation qui possède un titre de manifestation qui a été abrégé à des fins d’indexation ou d’identification. @fr
toolkit label: titre abrégé de @fr
toolkit definition: Manifestation qui possède un titre de manifestation qui a été abrégé à des fins d’indexation ou d’identification. @fr
label: is afgekorte titel van @nl
definition: Relateert een nomen aan een manifestatie die een titel van manifestatie heeft die ingekort is ten behoeve van indexeren of identificatie. @nl
toolkit label: afgekorte titel van @nl
toolkit definition: Een manifestatie die een titel van manifestatie heeft die ingekort is ten behoeve van indexeren of identificatie. @nl
label: هو عنوان مختصر لـ @ar
definition: يربط تسمية بتجسيدة لها عنوان تجسيدة تم اختصاره لغرض التكشيف أو التعريف. @ar
toolkit label: عنوان مختصر لـ @ar
toolkit definition: تجسيدة لها عنوان تجسيدة تم اختصاره لغرض التكشيف أو التعريف. @ar
label: és títol abreujat de @ca
definition: Relaciona un nomen amb una manifestació que té un títol de manifestació que ha estat abreujat amb la finalitat de la indexació o la identificació. @ca
toolkit label: títol abreujat de @ca
toolkit definition: Manifestació que té un títol de manifestació que ha estat abreujat amb la finalitat de la indexació o la identificació. @ca
label: er forkortet titel på @da
definition: Relaterer et nomen til en manifestation, som har en titel på manifestation, som er blevet forkortet med henblik på indeksering eller identifikation. @da
toolkit label: forkortet titel på @da
toolkit definition: Manifestation, som har en titel på manifestation, som er blevet forkortet med henblik på indeksering eller identifikation. @da
label: lühendatud pealkiri kehastuses @et
definition: Seostab nomen'i kehastusega, milles on kehastuse pealkiri esitatud indekseerimise või identifitseerimise tarbeks lühendatud kujul. @et
toolkit label: lühendatud pealkiri kehastuses @et
toolkit definition: Kehastus, milles on kehastuse pealkiri esitatud indekseerimise või identifitseerimise tarbeks lühendatud kujul. @et
label: ist Kurztitel von @de
definition: Setzt ein Nomen in Beziehung zu einer Manifestation, die einen Titel einer Manifestation hat, der zum Zwecke der Indexierung oder der Identifizierung gekürzt wurde. @de
toolkit label: Kurztitel von @de
toolkit definition: Eine Manifestation, die einen Titel einer Manifestation hat, der zum Zwecke der Indexierung oder der Identifizierung gekürzt wurde. @de
label: rövidített címe a következőnek: @hu
definition: rövidített címe: @hu
toolkit label: Hozzákapcsol egy noment egy megjelenési formához, amelynek címét indexelés vagy azonosítás céljából rövidítették. @hu
toolkit definition: Egy megjelenési forma, amelynek címét indexelés vagy azonosítás céljából rövidítették. @hu
label: è titolo abbreviato di @it
definition: Correla un nomen a una manifestazione che ha un titolo della manifestazione che è stato abbreviato per finalità di indicizzazione o identificazione. @it
toolkit label: titolo abbreviato di @it
toolkit definition: Una manifestazione che ha un titolo della manifestazione che è stato abbreviato per finalità di indicizzazione o identificazione. @it
label: ir saīsināts nosaukums no @lv
toolkit label: ir saīsināts nosaukums no @lv
definition: Sasaista nomenu ar manifestāciju, kam ir manifestācijas nosaukums, kas ticis saīsināts priekšmetošanas vai idendeksēšanas vajadzībām. @lv
toolkit definition: Manifestācija, kam ir manifestācijas nosaukums, kas ticis saīsināts priekšmetošanas vai idendeksēšanas vajadzībām. @lv
label: 是……的缩略题名 @zh-hans
toolkit label: ……的缩略题名 @zh-hans
definition: 将一个命名与有用于索引或标识目的被缩略的载体表现题名的一种载体表现关联起来。 @zh-hans
toolkit definition: 有用于索引或标识目的被缩略的载体表现题名的一种载体表现 @zh-hans
has subproperty: P80057
label: kısaltılmış başlığıdır @tr
toolkit label: kısaltılmış başlık @tr
definition: Bir ismi, dizinleme veya tanımlama amacıyla kısaltılmış bir gösterim başlığına sahip bir gösterimle ilişkilendirir. @tr
toolkit definition: İndeksleme veya tanımlama amacıyla kısaltılmış bir gösterim başlığına sahip bir gösterim. @tr

is access point for agent of
status: Published
type: Property
lexical alias: accessPointForAgentOf.en
definition: Relates a nomen to an agent who has an appellation in natural language that is taken from a vocabulary encoding scheme or is constructed using a string encoding scheme.
domain: C10012
toolkit label: access point for agent of
toolkit definition: An agent who has an appellation in natural language that is taken from a vocabulary encoding scheme or is constructed using a string encoding scheme.
sub property of: is appellation of agent of
has element type: 2
sub property of: is access point for RDA entity of
label: hakutieto toimijalle @fi
definition: Liittää nomenin toimijaan, jonka luonnollisen kielen mukainen nimitys on otettu jostakin sanaston merkintäjärjestelmästä tai muodostettu jotakin merkkijonon merkintäjärjestelmää käyttäen. @fi
toolkit label: hakutieto toimijalle @fi
toolkit definition: Toimija, jonka luonnollisen kielen mukainen nimitys on otettu jostakin sanaston merkintäjärjestelmästä tai muodostettu jotakin merkkijonon merkintäjärjestelmää käyttäen. @fi
label: er søkeinngang for agent for @no
definition: Relaterer et nomen til en agent som har en betegnelse på et naturlig språk som er hentet fra et kodeskjema for vokabular eller som er konstruert ved hjelp av et kodeskjema for syntaks. @no
toolkit label: søkeinngang for agent for @no
toolkit definition: En agent som har en betegnelse på et naturlig språk som er hentet fra et kodeskjema for vokabular eller som er konstruert ved hjelp av et kodeskjema for syntaks. @no
label: est un point d’accès d’un agent de @fr
definition: Met un nomen en relation avec un agent qui possède une appellation en langage naturel provenant d’un schéma d’encodage de vocabulaire ou construite à l’aide d’un schéma d’encodage de chaînes. @fr
toolkit label: point d’accès d’un agent de @fr
toolkit definition: Agent qui possède une appellation en langage naturel provenant d’un schéma d’encodage de vocabulaire ou construite à l’aide d’un schéma d’encodage de chaînes. @fr
label: is ingang voor actor van @nl
definition: Relateert een nomen aan een actor die een benaming heeft in natuurlijke taal die ontleend is aan een vocabulair coderingsschema of gevormd is volgens een string coderingsschema. @nl
toolkit label: ingang voor actor van @nl
toolkit definition: Een actor die een benaming heeft in natuurlijke taal die ontleend is aan een vocabulair coderingsschema of gevormd is volgens een string coderingsschema. @nl
label: هي نقطة وصول لوكيل لـ @ar
definition: يربط تسمية بوكيل له اسم في لغة طبيعية مأخوذة من خطة ترميز مفردات، أو مبنية باستخدام خطة ترميز سلسلة تمثيلات. @ar
toolkit label: نقطة وصول لوكيل لـ @ar
toolkit definition: وكيل له اسم في لغة طبيعية مأخوذة من خطة ترميز مفردات أو مبنية باستخدام خطة ترميز سلسلة تمثيلات. @ar
label: és punt d’accés d’agent de @ca
definition: Relaciona un nomen amb un agent que té una apel·lació en llenguatge natural que s’obté d’un esquema de codificació de vocabulari o s’elabora usant un esquema de codificació de cadenes. @ca
toolkit label: punt d’accés d’agent de @ca
toolkit definition: Agent que té una apel·lació en llenguatge natural que s’obté d’un esquema de codificació de vocabulari o s’elabora usant un esquema de codificació de cadenes. @ca
label: er søgeindgang for agent af @da
definition: Relaterer et nomen til en agent, som har en benævnelse på normalsprog, som er taget fra et vokabularkodningsskema eller er konstrueret ved hjælp af et strengkodningsskema. @da
toolkit label: søgeindgang for agent af @da
toolkit definition: Agent, som har en benævnelse på normalsprog, som er taget fra et vokabularkodningsskema eller er konstrueret ved hjælp af et strengkodningsskema. @da
label: otsielement tegijale @et
definition: Seostab nomen'i tegijaga, kellel on loomulikus keeles nimetus, mis on võetud leksikaalsest märkimissüsteemist või moodustatud stringilise märkimissüsteemi alusel. @et
toolkit label: otsielement tegijale @et
toolkit definition: Tegija, kellel on loomulikus keeles nimetus, mis on võetud leksikaalsest märkimissüsteemist või moodustatud stringilise märkimissüsteemi alusel. @et
label: ist Sucheinstieg für einen Akteur von @de
definition: Setzt ein Nomen in Beziehung zu einem Akteur, der eine Bezeichnung in natürlicher Sprache hat, die einem Vocabulary Encoding Scheme entnommen oder mit einem String Encoding Scheme konstruiert wird. @de
toolkit label: Sucheinstieg für einen Akteur von @de
toolkit definition: Ein Akteur, der eine Bezeichnung in natürlicher Sprache hat, die einem Vocabulary Encoding Scheme entnommen oder mit einem String Encoding Scheme konstruiert wird. @de
label: hozzáférési pont a következő ágenshez: @hu
definition: Hozzákapcsol egy noment egy ágenshez, amelynek természetes nyelvű megnevezése egy szótárkódolási sémából származik, vagy egy karakterlánc-kódolási séma használatával szerkesztett. @hu
toolkit label: hozzáférési pont a következő ágenshez: @hu
toolkit definition: Egy ágens, amelynek természetes nyelvű megnevezése egy szótárkódolási sémából származik, vagy egy karakterlánc-kódolási séma használatával szerkesztett. @hu
label: è punto d'accesso per agente di @it
definition: Correla un nomen a un agente che ha una denominazione nel linguaggio naturale che è tratta da uno schema di codifica di vocabolario o è costruita usando uno schema di codifica di stringa. @it
toolkit label: punto d'accesso per agente di @it
toolkit definition: Un agente che ha una denominazione nel linguaggio naturale che è tratta da uno schema di codifica di vocabolario o è costruita usando uno schema di codifica di stringa. @it
label: ir pamatforma aģentam @lv
definition: Sasaista nomenu ar aģentu, kam ir vārds/nosaukums dabiskā valodā, kas ņemts no shēmas kontrolētu vārdnīcu kodēšanai vai tiek konstruēts, izmantojot virknes kodēšanas shēmu. @lv
toolkit label: ir pamatforma aģentam @lv
toolkit definition: Aģents, kam ir vārds/nosaukums dabiskā valodā, kas ņemts no shēmas kontrolētu vārdnīcu kodēšanai vai tiek konstruēts, izmantojot virknes kodēšanas shēmu. @lv
label: 是……的行为者的检索点 @zh-hans
definition: 将一个命名与有取自一个词表编码体系或者用一个串编码体系构建、用自然语言的一个称谓的一个行为者关联起来。 @zh-hans
toolkit label: 行为者的检索点 @zh-hans
toolkit definition: 有取自一个词表编码体系或者用一个串编码体系构建、用自然语言的一个称谓的一个行为者 @zh-hans
has subproperty: is access point for collective agent of
has subproperty: is access point for person of
has subproperty: is authorized access point for agent of
has subproperty: is variant access point for agent of
has subproperty: P80018
label: temsilcisi için erişim noktasıdır @tr
definition: Bir ismi, bir kelime kodlama şemasından alınan veya bir dize kodlama şeması kullanılarak oluşturulan doğal dilde bir yakıştırması olan bir temsilciyle ilişkilendirir. @tr
toolkit label: temsilci için erişim noktası @tr
toolkit definition: Bir kelime kodlama şemasından alınan veya bir dize kodlama şeması kullanılarak oluşturulan doğal dilde bir ünvanı olan bir temsilci. @tr

is access point for collective agent of
status: Published
type: Property
lexical alias: accessPointForCollectiveAgentOf.en
definition: Relates a nomen to a collective agent who has an appellation in natural language that is taken from a vocabulary encoding scheme or is constructed using a string encoding scheme.
domain: C10012
toolkit label: access point for collective agent of
toolkit definition: A collective agent who has an appellation in natural language that is taken from a vocabulary encoding scheme or is constructed using a string encoding scheme.
sub property of: is appellation of collective agent of
sub property of: is access point for agent of
has element type: 2
label: hakutieto yhteistoimijalle @fi
definition: Liittää nomenin yhteistoimijaan, jonka luonnollisen kielen mukainen nimitys on otettu jostakin sanaston merkintäjärjestelmästä tai muodostettu jotakin merkkijonon merkintäjärjestelmää käyttäen. @fi
toolkit label: hakutieto yhteistoimijalle @fi
toolkit definition: Yhteistoimija, jonka luonnollisen kielen mukainen nimitys on otettu jostakin sanaston merkintäjärjestelmästä tai muodostettu jotakin merkkijonon merkintäjärjestelmää käyttäen. @fi
label: er søkeinngang for kollektiv agent for @no
definition: Relaterer et nomen til en kollektiv agent som har en betegnelse på et naturlig språk som er hentet fra et kodeskjema for vokabular eller som er konstruert ved hjelp av et kodeskjema for syntaks. @no
toolkit label: søkeinngang for kollektiv agent for @no
toolkit definition: En kollektiv agent som har en betegnelse på et naturlig språk som er hentet fra et kodeskjema for vokabular eller som er konstruert ved hjelp av et kodeskjema for syntaks. @no
label: est un point d’accès d’un agent collectif de @fr
definition: Met un nomen en relation avec un agent collectif qui possède une appellation en langage naturel provenant d’un schéma d’encodage de vocabulaire ou construite à l’aide d’un schéma d’encodage de chaînes. @fr
toolkit label: point d’accès d’un agent collectif de @fr
toolkit definition: Agent collectif qui possède une appellation en langage naturel provenant d’un schéma d’encodage de vocabulaire ou construite à l’aide d’un schéma d’encodage de chaînes. @fr
label: is ingang voor collectieve actor van @nl
definition: Relateert een nomen aan een collectieve actor die een benaming heeft in natuurlijke taal die ontleend is aan een vocabulair coderingsschema of gevormd is volgens een string coderingsschema. @nl
toolkit label: ingang voor collectieve actor van @nl
toolkit definition: Een collectieve actor die een benaming heeft in natuurlijke taal die ontleend is aan een vocabulair coderingsschema of gevormd is volgens een string coderingsschema. @nl
label: هي نقطة وصول لوكيل جماعي لـ @ar
definition: يربط تسمية بوكيل جماعي له اسم في لغة طبيعية مأخوذة من خطة ترميز مفردات أو مبنية باستخدام خطة ترميز سلسلة تمثيلات. @ar
toolkit label: نقطة وصول لوكيل جماعي لـ @ar
toolkit definition: وكيل جماعي له اسم في لغة طبيعية مأخوذة من خطة ترميز مفردات أو مبنية باستخدام خطة ترميز سلسلة تمثيلات. @ar
label: és punt d’accés d’agent col·lectiu de @ca
definition: Relaciona un nomen amb un agent col·lectiu que té una apel·lació en llenguatge natural que s’obté d’un esquema de codificació de vocabulari o s’elabora usant un esquema de codificació de cadenes. @ca
toolkit label: punt d’accés d’agent col·lectiu de @ca
toolkit definition: Agent col·lectiu que té una apel·lació en llenguatge natural que s’obté d’un esquema de codificació de vocabulari o s’elabora usant un esquema de codificació de cadenes. @ca
label: er søgeindgang for kollektiv agent af @da
definition: Relaterer et nomen til en kollektiv agent, som har en benævnelse på normalsprog, som er taget fra et vokabularkodningsskema eller er konstrueret ved hjælp af et strengkodningsskema. @da
toolkit label: søgeindgang for kollektiv agent af @da
toolkit definition: Kollektiv agent, som har en benævnelse på normalsprog, som er taget fra et vokabularkodningsskema eller er konstrueret ved hjælp af et strengkodningsskema. @da
label: otsielement kollektiivile @et
definition: Seostab nomen'i kollektiiviga, kellel on loomulikus keeles nimetus, mis on võetud leksikaalsest märkimissüsteemist või moodustatud stringilise märkimissüsteemi alusel. @et
toolkit label: otsielement kollektiivile @et
toolkit definition: Kollektiiv, kellel on loomulikus keeles nimetus, mis on võetud leksikaalsest märkimissüsteemist või moodustatud stringilise märkimissüsteemi alusel. @et
label: ist Sucheinstieg für einen gemeinschaftlichen Akteur von @de
definition: Setzt ein Nomen in Beziehung zu einem gemeinschaftlichen Akteur, der eine Bezeichnung in natürlicher Sprache hat, die einem Vocabulary Encoding Scheme entnommen oder mit einem String Encoding Scheme konstruiert wird. @de
toolkit label: Sucheinstieg für einen gemeinschaftlichen Akteur von @de
toolkit definition: Ein gemeinschaftlicher Akteur, der eine Bezeichnung in natürlicher Sprache hat, die einem Vocabulary Encoding Scheme entnommen oder mit einem String Encoding Scheme konstruiert wird. @de
label: hozzáférési pont a következő kollektív ágenshez: @hu
definition: Hozzákapcsol egy noment egy kollektív ágenshez, amelynek természetes nyelvű megnevezése egy szótárkódolási sémából származik, vagy egy karakterlánc-kódolási séma használatával szerkesztett. @hu
toolkit label: hozzáférési pont a következő kollektív ágenshez: @hu
toolkit definition: Egy kollektív ágens, amelynek természetes nyelvű megnevezése egy szótárkódolási sémából származik, vagy egy karakterlánc-kódolási séma használatával szerkesztett. @hu
label: è punto d'accesso per agente collettivo di @it
definition: Correla un nomen a un agente collettivo che ha una denominazione nel linguaggio naturale che è tratta da uno schema di codifica di vocabolario o è costruita usando uno schema di codifica di stringa. @it
toolkit label: punto d'accesso per agente collettivo di @it
toolkit definition: Un agente collettivo che ha una denominazione nel linguaggio naturale che è tratta da uno schema di codifica di vocabolario o è costruita usando uno schema di codifica di stringa. @it
label: ir pamatforma grupai @lv
definition: Sasaista nomenu ar grupu, kam ir vārds/nosaukums dabiskā valodā, kas ņemts no shēmas kontrolētu vārdnīcu kodēšanai vai tiek konstruēts, izmantojot virknes kodēšanas shēmu. @lv
toolkit label: ir pamatforma grupai @lv
toolkit definition: Grupa, kam ir vārds/nosaukums dabiskā valodā, kas ņemts no shēmas kontrolētu vārdnīcu kodēšanai vai tiek konstruēts, izmantojot virknes kodēšanas shēmu. @lv
label: 是集体行为者的检索点 @zh-hans
definition: 将一个命名与有取自一个词表编码体系或者用一个串编码体系构建、用自然语言的一个称谓的一个集体行为者关联起来。 @zh-hans
toolkit label: 集体行为者的检索点 @zh-hans
toolkit definition: 有取自一个词表编码体系或者用一个串编码体系构建、用自然语言的一个称谓的一个集体行为者 @zh-hans
has subproperty: is access point for corporate body of
has subproperty: is access point for family of
has subproperty: is authorized access point for collective agent of
has subproperty: is variant access point for collective agent of
has subproperty: P80019
label: kolektif temsilcisi için erişim noktasıdır @tr
definition: Bir ismi, bir kelime kodlama şemasından alınan veya bir dize kodlama şeması kullanılarak oluşturulan doğal dilde bir ünvanı olan kolektif bir temsilciyle ilişkilendirir. @tr
toolkit label: Kolektif temsilci için erişim noktası @tr
toolkit definition: Bir kelime kodlama şemasından alınan veya bir dize kodlama şeması kullanılarak oluşturulan doğal dilde bir unvana sahip kolektif bir temsilci. @tr

is access point for corporate body of
status: Published
type: Property
lexical alias: accessPointForCorporateBodyOf.en
definition: Relates a nomen to a corporate body who has an appellation in natural language that is taken from a vocabulary encoding scheme or is constructed using a string encoding scheme.
domain: C10012
toolkit label: access point for corporate body of
toolkit definition: A corporate body who has an appellation in natural language that is taken from a vocabulary encoding scheme or is constructed using a string encoding scheme.
sub property of: is appellation of corporate body of
sub property of: is access point for collective agent of
has element type: 2
label: hakutieto yhteisölle @fi
definition: Liittää nomenin yhteisöön, jonka luonnollisen kielen mukainen nimitys on otettu jostakin sanaston merkintäjärjestelmästä tai muodostettu jotakin merkkijonon merkintäjärjestelmää käyttäen. @fi
toolkit label: hakutieto yhteisölle @fi
toolkit definition: Yhteisö, jonka luonnollisen kielen mukainen nimitys on otettu jostakin sanaston merkintäjärjestelmästä tai muodostettu jotakin merkkijonon merkintäjärjestelmää käyttäen. @fi
label: er søkeinngang for korporasjon for @no
definition: Relaterer et nomen til en korporasjon som har en betegnelse på et naturlig språk som er hentet fra et kodeskjema for vokabular eller som er konstruert ved hjelp av et kodeskjema for syntaks. @no
toolkit label: søkeinngang for korporasjon for @no
toolkit definition: En korporasjon som har en betegnelse på et naturlig språk som er hentet fra et kodeskjema for vokabular eller som er konstruert ved hjelp av et kodeskjema for syntaks. @no
label: est un point d’accès d’une collectivité de @fr
definition: Met un nomen en relation avec une collectivité qui possède une appellation en langage naturel provenant d’un schéma d’encodage de vocabulaire ou construite à l’aide d’un schéma d’encodage de chaînes. @fr
toolkit label: point d’accès d’une collectivité de @fr
toolkit definition: Collectivité qui possède une appellation en langage naturel provenant d’un schéma d’encodage de vocabulaire ou construite à l’aide d’un schéma d’encodage de chaînes. @fr
label: is ingang voor corporatie van @nl
definition: Relateert een nomen aan een corporatie die een benaming heeft in natuurlijke taal die ontleend is aan een vocabulair coderingsschema of gevormd is volgens een string coderingsschema. @nl
toolkit label: ingang voor corporatie van @nl
toolkit definition: Een corporatie die een benaming heeft in natuurlijke taal die ontleend is aan een vocabulair coderingsschema of gevormd is volgens een string coderingsschema. @nl
label: هي نقطة وصول لهيئة لـ @ar
definition: يربط تسمية بهيئة لها اسم في لغة طبيعية مأخوذة من خطة ترميز مفردات أو مبنية باستخدام خطة ترميز سلسلة تمثيلات. @ar
toolkit label: نقطة وصول لهيئة لـ @ar
toolkit definition: هيئة لها اسم في لغة طبيعية مأخوذة من خطة ترميز مفردات أو مبنية باستخدام خطة ترميز سلسلة تمثيلات. @ar
label: és punt d’accés d’entitat corporativa de @ca
definition: Relaciona un nomen amb una entitat corporativa que té una apel·lació en llenguatge natural que s’obté d’un esquema de codificació de vocabulari o s’elabora usant un esquema de codificació de cadenes. @ca
toolkit label: punt d’accés d’entitat corporativa de @ca
toolkit definition: Entitat corporativa que té una apel·lació en llenguatge natural que s’obté d’un esquema de codificació de vocabulari o s’elabora usant un esquema de codificació de cadenes. @ca
label: er søgeindgang for korporation af @da
definition: Relaterer et nomen til en korporation, som har en benævnelse på normalsprog, som er taget fra et vokabularkodningsskema eller er konstrueret ved hjælp af et strengkodningsskema. @da
toolkit label: søgeindgang for korporation af @da
toolkit definition: Korporation, som har en benævnelse på normalsprog, som er taget fra et vokabularkodningsskema eller er konstrueret ved hjælp af et strengkodningsskema. @da
label: otsielement asutusele @et
definition: Seostab nomen'i asutusega, kellel on loomulikus keeles nimetus, mis on võetud leksikaalsest märkimissüsteemist või moodustatud stringilise märkimissüsteemi alusel. @et
toolkit label: otsielement asutusele @et
toolkit definition: Asutus, kellel on loomulikus keeles nimetus, mis on võetud leksikaalsest märkimissüsteemist või moodustatud stringilise märkimissüsteemi alusel. @et
label: ist Sucheinstieg für eine Körperschaft von @de
definition: Setzt ein Nomen in Beziehung zu einer Körperschaft, die eine Bezeichnung in natürlicher Sprache hat, die einem Vocabulary Encoding Scheme entnommen oder mit einem String Encoding Scheme konstruiert wird. @de
toolkit label: Sucheinstieg für eine Körperschaft von @de
toolkit definition: Eine Körperschaft, die eine Bezeichnung in natürlicher Sprache hat, die einem Vocabulary Encoding Scheme entnommen oder mit einem String Encoding Scheme konstruiert wird. @de
label: hozzáférési pont a következő testülethez: @hu
definition: Hozzákapcsol egy noment egy testülethez, amelynek természetes nyelvű megnevezése egy szótárkódolási sémából származik, vagy egy karakterlánc-kódolási séma használatával szerkesztett. @hu
toolkit label: hozzáférési pont a következő testülethez: @hu
toolkit definition: Egy testület, amelynek természetes nyelvű megnevezése egy szótárkódolási sémából származik, vagy egy karakterlánc-kódolási séma használatával szerkesztett. @hu
label: è punto d'accesso per ente di @it
definition: Correla un nomen a un ente che ha una denominazione nel linguaggio naturale che è tratta da uno schema di codifica di vocabolario o è costruita usando uno schema di codifica di stringa. @it
toolkit label: punto d'accesso per ente di @it
toolkit definition: Un ente che ha una denominazione nel linguaggio naturale che è tratta da uno schema di codifica di vocabolario o è costruita usando uno schema di codifica di stringa. @it
label: ir pamatforma institūcijai @lv
definition: Sasaista nomenu ar institūciju, kam ir vārds/nosaukums dabiskā valodā, kas ņemts no shēmas kontrolētu vārdnīcu kodēšanai vai tiek konstruēts, izmantojot virknes kodēšanas shēmu. @lv
toolkit label: ir pamatforma institūcijai @lv
toolkit definition: Institūcija, kam ir vārds/nosaukums dabiskā valodā, kas ņemts no shēmas kontrolētu vārdnīcu kodēšanai vai tiek konstruēts, izmantojot virknes kodēšanas shēmu. @lv
label: 有团体的检索点 @zh-hans
definition: 将一个命名与有取自一个词表编码体系或者用一个串编码体系构建、用自然语言的一个称谓的一个团体关联起来。 @zh-hans
toolkit label: 团体的检索点 @zh-hans
toolkit definition: 有取自一个词表编码体系或者用一个串编码体系构建、用自然语言的一个称谓的一个团体 @zh-hans
has subproperty: is authorized access point for corporate body of
has subproperty: is variant access point for corporate body of
has subproperty: P80020
label: tüzel kişisi için erişim noktasıdır @tr
definition: Bir ismi, bir kelime kodlama şemasından alınan veya bir dize kodlama şeması kullanılarak oluşturulan doğal dilde bir ünvanı olan bir tüzel kişiyle ilişkilendirir. @tr
toolkit label: Tüzel kişi için erişim noktası @tr
toolkit definition: Bir kelime kodlama şemasından alınan veya bir dize kodlama şeması kullanılarak oluşturulan doğal dilde bir ünvanı olan bir tüzel kişilik. @tr

is access point for expression of
status: Published
type: Property
lexical alias: accessPointForExpressionOf.en
definition: Relates a nomen to an expression that has an appellation in natural language that is taken from a vocabulary encoding scheme or is constructed using a string encoding scheme.
domain: C10012
toolkit label: access point for expression of
toolkit definition: An expression that has an appellation in natural language that is taken from a vocabulary encoding scheme or is constructed using a string encoding scheme.
sub property of: is appellation of expression of
has element type: 2
sub property of: is access point for RDA entity of
label: hakutieto ekspressiolle @fi
definition: Liittää nomenin ekspressioon, jonka luonnollisen kielen mukainen nimitys on otettu jostakin sanaston merkintäjärjestelmästä tai muodostettu jotakin merkkijonon merkintäjärjestelmää käyttäen. @fi
toolkit label: hakutieto ekspressiolle @fi
toolkit definition: Ekspressio, jonka luonnollisen kielen mukainen nimitys, joka on otettu jostakin sanaston merkintäjärjestelmästä tai muodostettu jotakin merkkijonon merkintäjärjestelmää käyttäen. @fi
label: er søkeinngang for uttrykk for @no
definition: Relaterer et nomen til et uttrykk som har en betegnelse på et naturlig språk som er hentet fra et kodeskjema for vokabular eller som er konstruert ved hjelp av et kodeskjema for syntaks. @no
toolkit label: søkeinngang for uttrykk for @no
toolkit definition: Et uttrykk som har en betegnelse på et naturlig språk som er hentet fra et kodeskjema for vokabular eller som er konstruert ved hjelp av et kodeskjema for syntaks. @no
label: est un point d’accès d’une expression de @fr
definition: Met un nomen en relation avec une expression qui possède une appellation en langage naturel provenant d’un schéma d’encodage de vocabulaire ou construite à l’aide d’un schéma d’encodage de chaînes. @fr
toolkit label: point d’accès d’une expression de @fr
toolkit definition: Expression qui possède une appellation en langage naturel provenant d’un schéma d’encodage de vocabulaire ou construite à l’aide d’un schéma d’encodage de chaînes. @fr
label: is ingang voor expressie van @nl
definition: Relateert een nomen aan een expressie die een benaming heeft in natuurlijke taal die ontleend is aan een vocabulair coderingsschema of gevormd is volgens een string coderingsschema. @nl
toolkit label: ingang voor expressie van @nl
toolkit definition: Een expressie die een benaming heeft in natuurlijke taal die ontleend is aan een vocabulair coderingsschema of gevormd is volgens een string coderingsschema. @nl
label: هي نقطة وصول لتعبيرة لـ @ar
definition: يربط تسمية بتعبيرة لها اسم في لغة طبيعية مأخوذة من خطة ترميز مفردات أو مبنية باستخدام خطة ترميز سلسلة تمثيلات. @ar
toolkit label: نقطة وصول لتعبيرة لـ @ar
toolkit definition: تعبيرة لها اسم في لغة طبيعية مأخوذة من خطة ترميز مفردات أو مبنية باستخدام خطة ترميز سلسلة تمثيلات. @ar
label: és punt d’accés d’expressió de @ca
definition: Relaciona un nomen amb una expressió que té una apel·lació en llenguatge natural que s’obté d’un esquema de codificació de vocabulari o s’elabora usant un esquema de codificació de cadenes. @ca
toolkit label: punt d’accés d’expressió de @ca
toolkit definition: Expressió que té una apel·lació en llenguatge natural que s’obté d’un esquema de codificació de vocabulari o s’elabora usant un esquema de codificació de cadenes. @ca
label: er søgeindgang for udtryk af @da
definition: Relaterer et nomen til et udtryk, som har en benævnelse på normalsprog, som er taget fra et vokabularkodningsskema eller er konstrueret ved hjælp af et strengkodningsskema. @da
toolkit label: søgeindgang for udtryk af @da
toolkit definition: Udtryk, som har en benævnelse på normalsprog, som er taget fra et vokabularkodningsskema eller er konstrueret ved hjælp af et strengkodningsskema. @da
label: otsielement väljendusele @et
definition: Seostab nomen'i väljendusega, millel on loomulikus keeles nimetus, mis on võetud leksikaalsest märkimissüsteemist või moodustatud stringilise märkimissüsteemi alusel. @et
toolkit label: otsielement väljendusele @et
toolkit definition: Väljendus, millel on loomulikus keeles nimetus, mis on võetud leksikaalsest märkimissüsteemist või moodustatud stringilise märkimissüsteemi alusel. @et
label: ist Sucheinstieg für eine Expression von @de
definition: Setzt ein Nomen in Beziehung zu einer Expression, die eine Bezeichnung in natürlicher Sprache hat, die einem Vocabulary Encoding Scheme entnommen oder mit einem String Encoding Scheme konstruiert wird. @de
toolkit label: Sucheinstieg für eine Expression von @de
toolkit definition: Eine Expression, die eine Bezeichnung in natürlicher Sprache hat, die einem Vocabulary Encoding Scheme entnommen oder mit einem String Encoding Scheme konstruiert wird. @de
label: hozzáférési pont a következő kifejezési formához: @hu
definition: Hozzákapcsol egy noment egy kifejezési formához, amelynek van egy olyan természetes nyelvű megnevezése, amely egy szótárkódolási sémából származik, vagy egy karakterlánc-kódolási séma használatával szerkesztett. @hu
toolkit label: hozzáférési pont a következő kifejezési formához: @hu
toolkit definition: Egy kifejezési forma, amelynek van egy olyan természetes nyelvű megnevezése, amely egy szótárkódolási sémából származik, vagy egy karakterlánc-kódolási séma használatával szerkesztett. @hu
label: è punto d'accesso per espressione di @it
definition: Correla un nomen a un'espressione che ha una denominazione nel linguaggio naturale che è tratta da uno schema di codifica di vocabolario o è costruita usando uno schema di codifica di stringa. @it
toolkit label: punto d'accesso per espressione di @it
toolkit definition: Un'espressione che ha una denominazione nel linguaggio naturale che è tratta da uno schema di codifica di vocabolario o è costruita usando uno schema di codifica di stringa. @it
label: ir vārdforma izteiksmei @lv
definition: Sasaista nomenu ar izteiksmi, kam ir vārds/nosaukums dabiskā valodā, kas ņemts no shēmas kontrolētu vārdnīcu kodēšanai vai tiek konstruēts, izmantojot virknes kodēšanas shēmu. @lv
toolkit label: ir vārdforma izteiksmei @lv
toolkit definition: Izteiksme, kam ir vārds/nosaukums dabiskā valodā, kas ņemts no shēmas kontrolētu vārdnīcu kodēšanai vai tiek konstruēts, izmantojot virknes kodēšanas shēmu. @lv
label: 是……的内容表达的检索点 @zh-hans
definition: 将一个命名与有取自一个词表编码体系或者用一个串编码体系构建、用自然语言的一个称谓的一个内容表达关联起来。 @zh-hans
toolkit label: ……的内容表达的检索点 @zh-hans
toolkit definition: 有取自一个词表编码体系或者用一个串编码体系构建、用自然语言的一个称谓的一个内容表达 @zh-hans
has subproperty: is authorized access point for expression of
has subproperty: is variant access point for expression of
has subproperty: P80023
label: anlatımı için erişim noktasıdır @tr
definition: Bir ismi, bir kelime kodlama şemasından alınan veya bir dize kodlama şeması kullanılarak oluşturulan doğal dilde bir adlandırmaya sahip bir anlatımla ilişkilendirir. @tr
toolkit label: anlatım için erişim noktası @tr
toolkit definition: Bir sözcük kodlama şemasından alınan veya bir dize kodlama şeması kullanılarak oluşturulan, doğal dilde bir unvana sahip bir anlatım. @tr

is access point for family of
status: Published
type: Property
lexical alias: accessPointForFamilyOf.en
definition: Relates a nomen to a family who has an appellation in natural language that is taken from a vocabulary encoding scheme or is constructed using a string encoding scheme.
domain: C10012
toolkit label: access point for family of
toolkit definition: A family who has an appellation in natural language that is taken from a vocabulary encoding scheme or is constructed using a string encoding scheme.
sub property of: is appellation of family of
sub property of: is access point for collective agent of
has element type: 2
label: hakutieto suvulle @fi
definition: Liittää nomenin sukuun, jonka luonnollisen kielen mukainen nimitykseen on otettu jostakin sanaston merkintäjärjestelmästä tai muodostettu jotakin merkkijonon merkintäjärjestelmää käyttäen. @fi
toolkit label: hakutieto suvulle @fi
toolkit definition: Suku, jonka luonnollisen kielen mukainen nimitys on otettu jostakin sanaston merkintäjärjestelmästä tai muodostettu jotakin merkkijonon merkintäjärjestelmää käyttäen. @fi
label: er søkeinngang for familie for @no
definition: Relaterer et nomen til en familie som har en betegnelse på et naturlig språk som er hentet fra et kodeskjema for vokabular eller som er konstruert ved hjelp av et kodeskjema for syntaks. @no
toolkit label: søkeinngang for familie for @no
toolkit definition: En familie som har en betegnelse på et naturlig språk som er hentet fra et kodeskjema for vokabular eller som er konstruert ved hjelp av et kodeskjema for syntaks. @no
label: est un point d’accès d’une famille de @fr
definition: Met un nomen en relation avec une famille qui possède une appellation en langage naturel provenant d’un schéma d’encodage de vocabulaire ou construite à l’aide d’un schéma d’encodage de chaînes. @fr
toolkit label: point d’accès d’une famille de @fr
toolkit definition: Famille qui possède une appellation en langage naturel provenant d’un schéma d’encodage de vocabulaire ou construite à l’aide d’un schéma d’encodage de chaînes. @fr
label: is ingang voor familie van @nl
definition: Relateert een nomen aan een familie die een benaming heeft in natuurlijke taal die ontleend is aan een vocabulair coderingsschema of gevormd is volgens een string coderingsschema. @nl
toolkit label: ingang voor familie van @nl
toolkit definition: Een familie die een benaming heeft in natuurlijke taal die ontleend is aan een vocabulair coderingsschema of gevormd is volgens een string coderingsschema. @nl
label: نقطة وصول لعائلة لـ @ar
definition: يربط تسمية بعائلة لها اسم في لغة طبيعية مأخوذة من خطة ترميز مفردات أو مبنية باستخدام خطة ترميز سلسلة تمثيلات. @ar
toolkit label: نقطة وصول لعائلة لـ @ar
toolkit definition: عائلة لها اسم في لغة طبيعية مأخوذة من خطة ترميز مفردات أو مبنية باستخدام خطة ترميز سلسلة تمثيلات. @ar
label: és punt d’accés de família de @ca
definition: Relaciona un nomen amb una família que té una apel·lació en llenguatge natural que s’obté d’un esquema de codificació de vocabulari o s’elabora usant un esquema de codificació de cadenes. @ca
toolkit label: punt d’accés de família de @ca
toolkit definition: Família que té una apel·lació en llenguatge natural que s’obté d’un esquema de codificació de vocabulari o s’elabora usant un esquema de codificació de cadenes. @ca
label: er søgeindgang for familie af @da
definition: Relaterer et nomen til en familie, som har en benævnelse på normalsprog, som er taget fra et vokabularkodningsskema eller er konstrueret ved hjælp af et strengkodningsskema. @da
toolkit label: søgeindgang for familie af @da
toolkit definition: Familie, som har en benævnelse på normalsprog, som er taget fra et vokabularkodningsskema eller er konstrueret ved hjælp af et strengkodningsskema. @da
label: otsielement perekonnale @et
definition: Seostab nomen'i perekonnaga, kellel on loomulikus keeles nimetus, mis on võetud leksikaalsest märkimissüsteemist või moodustatud stringilise märkimissüsteemi alusel. @et
toolkit label: otsielement perekonnale @et
toolkit definition: Perekond, kellel on loomulikus keeles nimetus, mis on võetud leksikaalsest märkimissüsteemist või moodustatud stringilise märkimissüsteemi alusel. @et
label: ist Sucheinstieg für eine Familie von @de
definition: Setzt ein Nomen in Beziehung zu einer Familie, die eine Bezeichnung in natürlicher Sprache hat, die einem Vocabulary Encoding Scheme entnommen oder mit einem String Encoding Scheme konstruiert wird. @de
toolkit label: Sucheinstieg für eine Familie von @de
toolkit definition: Eine Familie, die eine Bezeichnung in natürlicher Sprache hat, die einem Vocabulary Encoding Scheme entnommen oder mit einem String Encoding Scheme konstruiert wird. @de
label: hozzáférési pont a következő családhoz: @hu
definition: Hozzákapcsol egy noment egy családhoz, amelynek természetes nyelvű megnevezése egy szótárkódolási sémából származik, vagy egy karakterlánc-kódolási séma használatával szerkesztett. @hu
toolkit label: hozzáférési pont a következő családhoz: @hu
toolkit definition: Egy család, amelynek természetes nyelvű megnevezése egy szótárkódolási sémából származik, vagy egy karakterlánc-kódolási séma használatával szerkesztett. @hu
label: è punto d'accesso per famiglia di @it
definition: Correla un nomen a una famiglia che ha una denominazione nel linguaggio naturale che è tratta da uno schema di codifica di vocabolario o è costruita usando uno schema di codifica di stringa. @it
toolkit label: punto d'accesso per famiglia di @it
toolkit definition: Una famiglia che ha una denominazione nel linguaggio naturale che è tratta da uno schema di codifica di vocabolario o è costruita usando uno schema di codifica di stringa. @it
label: ir pamatforma dzimtai/ģimenei @lv
definition: Sasaista nomenu ar dzimtu/ģimeni, kam ir vārds/nosaukums dabiskā valodā, kas ņemts no shēmas kontrolētu vārdnīcu kodēšanai vai tiek konstruēts, izmantojot virknes kodēšanas shēmu. @lv
toolkit label: ir pamatforma dzimtai/ģimenei @lv
toolkit definition: Dzimta/ģimene, kam ir vārds/nosaukums dabiskā valodā, kas ņemts no shēmas kontrolētu vārdnīcu kodēšanai vai tiek konstruēts, izmantojot virknes kodēšanas shēmu @lv
label: 是家族的检索点 @zh-hans
definition: 将一个命名与有取自一个词表编码体系或者用一个串编码体系构建、用自然语言的一个称谓的一个家族关联起来。 @zh-hans
toolkit label: 家族的检索点 @zh-hans
toolkit definition: 有取自一个词表编码体系或者用一个串编码体系构建、用自然语言的一个称谓的一个家族 @zh-hans
has subproperty: is authorized access point for family of
has subproperty: is variant access point for family of
has subproperty: P80021
label: ailesi için erişim noktasıdır @tr
definition: Bir ismi, bir kelime kodlama şemasından alınan veya bir dize kodlama şeması kullanılarak oluşturulan doğal dilde bir adlandırması olan bir aile ile ilişkilendirir. @tr
toolkit label: Aile için erişim noktası @tr
toolkit definition: Bir kelime kodlama şemasından alınan veya bir dize kodlama şeması kullanılarak inşa edilen doğal dilde bir unvanı olan bir aile. @tr

is access point for item of
status: Published
type: Property
lexical alias: accessPointForItemOf.en
definition: Relates a nomen to an item that has an appellation in natural language that is taken from a vocabulary encoding scheme or is constructed using a string encoding scheme.
domain: C10012
toolkit label: access point for item of
toolkit definition: An item that has an appellation in natural language that is taken from a vocabulary encoding scheme or is constructed using a string encoding scheme.
sub property of: is appellation of item of
has element type: 2
sub property of: is access point for RDA entity of
label: hakutieto kappaleelle @fi
definition: Liittää nomenin kappaleeseen, jonka luonnollisen kielen mukainen nimitykseen on otettu jostakin sanaston merkintäjärjestelmästä tai muodostettu jotakin merkkijonon merkintäjärjestelmää käyttäen. @fi
toolkit label: hakutieto kappaleelle @fi
toolkit definition: Kappale, jonka luonnollisen kielen mukainen nimitys on otettu jostakin sanaston merkintäjärjestelmästä tai joka on muodostettu jotakin merkkijonon merkintäjärjestelmää käyttäen. @fi
label: er søkeinngang for eksemplar for @no
definition: Relaterer et nomen til et eksemplar som har en betegnelse på et naturlig språk som er hentet fra et kodeskjema for vokabular eller som er konstruert ved hjelp av et kodeskjema for syntaks. @no
toolkit label: søkeinngang for eksemplar for @no
toolkit definition: Et eksemplar som har en betegnelse på et naturlig språk som er hentet fra et kodeskjema for vokabular eller som er konstruert ved hjelp av et kodeskjema for syntaks. @no
label: est un point d’accès d’un item de @fr
definition: Met un nomen en relation avec un item qui possède une appellation en langage naturel provenant d’un schéma d’encodage de vocabulaire ou construite à l’aide d’un schéma d’encodage de chaînes. @fr
toolkit label: point d’accès d’un item de @fr
toolkit definition: Item qui possède une appellation en langage naturel provenant d’un schéma d’encodage de vocabulaire ou construite à l’aide d’un schéma d’encodage de chaînes. @fr
label: is ingang voor item van @nl
definition: Relateert een nomen aan een item dat een benaming heeft in natuurlijke taal die ontleend is aan een vocabulair coderingsschema of gevormd is volgens een string coderingsschema. @nl
toolkit label: ingang voor item van @nl
toolkit definition: Een item dat een benaming heeft in natuurlijke taal die ontleend is aan een vocabulair coderingsschema of gevormd is volgens een string coderingsschema. @nl
label: هي نقطة وصول لمفردة لـ @ar
definition: يربط تسمية بمفردة لها اسم في لغة طبيعية مأخوذة من خطة ترميز مفردات أو مبنية باستخدام خطة ترميز سلسلة تمثيلات. @ar
toolkit label: نقطة وصول لمفردة لـ @ar
toolkit definition: مفردة لها اسم في لغة طبيعية مأخوذة من خطة ترميز مفردات أو مبنية باستخدام خطة ترميز سلسلة تمثيلات. @ar
label: és punt d’accés d’ítem de @ca
definition: Relaciona un nomen amb un ítem que té una apel·lació en llenguatge natural que s’obté d’un esquema de codificació de vocabulari o s’elabora usant un esquema de codificació de cadenes. @ca
toolkit label: punt d’accés d’ítem de @ca
toolkit definition: Ítem que té una apel·lació en llenguatge natural que s’obté d’un esquema de codificació de vocabulari o s’elabora usant un esquema de codificació de cadenes. @ca
label: er søgeindgang for eksemplar af @da
definition: Relaterer et nomen til et eksemplar, som har en benævnelse på normalsprog, som er taget fra et vokabularkodningsskema eller er konstrueret ved hjælp af et strengkodningsskema. @da
toolkit label: søgeindgang for eksemplar af @da
toolkit definition: Eksemplar, som har en benævnelse på normalsprog, som er taget fra et vokabularkodningsskema eller er konstrueret ved hjælp af et strengkodningsskema. @da
label: otsielement eksemplarile @et
definition: Seostab nomen'i eksemplariga, millel on loomulikus keeles nimetus, mis on võetud leksikaalsest märkimissüsteemist või moodustatud stringilise märkimissüsteemi alusel. @et
toolkit label: otsielement eksemplarile @et
toolkit definition: Eksemplar, millel on loomulikus keeles nimetus, mis on võetud leksikaalsest märkimissüsteemist või moodustatud stringilise märkimissüsteemi alusel. @et
label: ist Sucheinstieg für ein Exemplar von @de
definition: Setzt ein Nomen in Beziehung zu einem Exemplar, das eine Bezeichnung in natürlicher Sprache hat, die einem Vocabulary Encoding Scheme entnommen oder mit einem String Encoding Scheme konstruiert wird. @de
toolkit label: Sucheinstieg für ein Exemplar von @de
toolkit definition: Ein Exemplar, das eine Bezeichnung in natürlicher Sprache hat, die einem Vocabulary Encoding Scheme entnommen oder mit einem String Encoding Scheme konstruiert wird. @de
label: hozzáférési pont a következő példányhoz: @hu
definition: Hozzákapcsol egy noment egy példányhoz, amelynek van egy olyan természetes nyelvű megnevezése, amely egy szótárkódolási sémából származik, vagy egy karakterlánc-kódolási séma használatával szerkesztett. @hu
toolkit label: hozzáférési pont a következő példányhoz: @hu
toolkit definition: Egy példány, amelynek van egy olyan természetes nyelvű megnevezése, amely egy szótárkódolási sémából származik, vagy egy karakterlánc-kódolási séma használatával szerkesztett. @hu
label: è punto d'accesso per item di @it
definition: Correla un nomen a un item che ha una denominazione nel linguaggio naturale che è tratta da uno schema di codifica di vocabolario o è costruita usando uno schema di codifica di stringa. @it
toolkit label: punto d'accesso per item di @it
toolkit definition: Un item che ha una denominazione nel linguaggio naturale che è tratta da uno schema di codifica di vocabolario o è costruita usando uno schema di codifica di stringa. @it
label: ir pamatforma vienībai @lv
definition: Sasaista nomenu ar vienību, kurai ir apzīmējums/nosaukums saprotamā valodā, kas ņemts no kodēšanas vārdnīcas vai tiek veidots, izmantojot kodēšanas shēmu. @lv
toolkit label: ir pamatforma vienībai @lv
toolkit definition: Vienība, kurai ir apzīmējums/nosaukums saprotamā valodā, kas ņemts no kodēšanas vārdnīcas vai tiek veidots, izmantojot kodēšanas shēmu @lv
label: 是……的单件的检索点 @zh-hans
definition: 将一个命名与有取自一个词表编码体系或者用一个串编码体系构建、用自然语言的一个称谓的一个单件关联起来。 @zh-hans
toolkit label: ……的单件的检索点 @zh-hans
toolkit definition: 有取自一个词表编码体系或者用一个串编码体系构建、用自然语言的一个称谓的一个单件 @zh-hans
has subproperty: is authorized access point for item of
has subproperty: is variant access point for item of
has subproperty: P80015
label: kopyası için erişim noktasıdır @tr
definition: Bir ismi, bir kelime kodlama şemasından alınan veya bir dize kodlama şeması kullanılarak oluşturulan doğal dilde bir adı olan bir kopyayla ilişkilendirir. @tr
toolkit label: Kopya için erişim noktası @tr
toolkit definition: Bir kelime kodlama şemasından alınan veya bir dize kodlama şeması kullanılarak oluşturulan doğal dilde bir unvana sahip bir kopya. @tr

is access point for manifestation of
status: Published
type: Property
lexical alias: accessPointForManifestationOf.en
definition: Relates a nomen to a manifestation that has an appellation in natural language that is taken from a vocabulary encoding scheme or is constructed using a string encoding scheme.
domain: C10012
toolkit label: access point for manifestation of
toolkit definition: A manifestation that has an appellation in natural language that is taken from a vocabulary encoding scheme or is constructed using a string encoding scheme.
sub property of: is appellation of manifestation of
has element type: 2
sub property of: is access point for RDA entity of
label: hakutieto manifestaatiolle @fi
definition: Liittää nomenin manifestaatioon, jonka luonnollisen kielen mukainen nimitys on otettu jostakin sanaston merkintäjärjestelmästä tai muodostettu jotakin merkkijonon merkintäjärjestelmää käyttäen. @fi
toolkit label: hakutieto manifestaatiolle @fi
toolkit definition: Manifestaatio, jonka luonnollisen kielen mukainen nimitys on otettu jostakin sanaston merkintäjärjestelmästä tai muodostettu jotakin merkkijonon merkintäjärjestelmää käyttäen. @fi
label: er søkeinngang for manifestasjon for @no
definition: Relaterer et nomen til en manifestasjon som har en betegnelse på et naturlig språk som er hentet fra et kodeskjema for vokabular eller som er konstruert ved hjelp av et kodeskjema for syntaks. @no
toolkit label: søkeinngang for manifestasjon for @no
toolkit definition: En manifestasjon som har en betegnelse på et naturlig språk som er hentet fra et kodeskjema for vokabular eller som er konstruert ved hjelp av et kodeskjema for syntaks. @no
label: est un point d’accès d’une manifestation de @fr
definition: Met un nomen en relation avec une manifestation qui possède une appellation en langage naturel provenant d’un schéma d’encodage de vocabulaire ou construite à l’aide d’un schéma d’encodage de chaînes. @fr
toolkit label: point d’accès d’une manifestation de @fr
toolkit definition: Manifestation qui possède une appellation en langage naturel provenant d’un schéma d’encodage de vocabulaire ou construite à l’aide d’un schéma d’encodage de chaînes. @fr
label: is ingang voor manifestatie van @nl
definition: Relateert een nomen aan een manifestatie die een benaming heeft in natuurlijke taal die ontleend is aan een vocabulair coderingsschema of gevormd is volgens een string coderingsschema. @nl
toolkit label: ingang voor manifestatie van @nl
toolkit definition: Een manifestatie die een benaming heeft in natuurlijke taal die ontleend is aan een vocabulair coderingsschema of gevormd is volgens een string coderingsschema. @nl
label: هي نقطة وصول لتجسيدة لـ @ar
definition: يربط تسمية بتجسيدة لها اسم في لغة طبيعية مأخوذة من خطة ترميز مفردات أو مبنية باستخدام خطة ترميز سلسلة تمثيلات. @ar
toolkit label: نقطة وصول لتجسيدة لـ @ar
toolkit definition: تجسيدة لها اسم في لغة طبيعية مأخوذة من خطة ترميز مفردات أو مبنية باستخدام خطة ترميز سلسلة تمثيلات. @ar
label: és punt d’accés de manifestació de @ca
definition: Relaciona un nomen amb una manifestació que té una apel·lació en llenguatge natural que s’obté d’un esquema de codificació de vocabulari o s’elabora usant un esquema de codificació de cadenes. @ca
toolkit label: punt d’accés de manifestació de @ca
toolkit definition: Manifestació que té una apel·lació en llenguatge natural que s’obté d’un esquema de codificació de vocabulari o s’elabora usant un esquema de codificació de cadenes. @ca
label: er søgeindgang for manifestation af @da
definition: Relaterer et nomen til en manifestation, som har en benævnelse på normalsprog, som er taget fra et vokabularkodningsskema eller er konstrueret ved hjælp af et strengkodningsskema. @da
toolkit label: søgeindgang for manifestation af @da
toolkit definition: Manifestation, som har en benævnelse på normalsprog, som er taget fra et vokabularkodningsskema eller er konstrueret ved hjælp af et strengkodningsskema. @da
label: otsielement kehastusele @et
definition: Seostab nomen'i kehastusega, millel on loomulikus keeles nimetus, mis on võetud leksikaalsest märkimissüsteemist või moodustatud stringilise märkimissüsteemi alusel. @et
toolkit label: otsielement kehastusele @et
toolkit definition: Kehastus, millel on loomulikus keeles nimetus, mis on võetud leksikaalsest märkimissüsteemist või moodustatud stringilise märkimissüsteemi alusel. @et
label: ist Sucheinstieg für eine Manifestation von @de
definition: Setzt ein Nomen in Beziehung zu einer Manifestation, die eine Bezeichnung in natürlicher Sprache hat, die einem Vocabulary Encoding Scheme entnommen oder mit einem String Encoding Scheme konstruiert wird. @de
toolkit label: Sucheinstieg für eine Manifestation von @de
toolkit definition: Eine Manifestation, die eine Bezeichnung in natürlicher Sprache hat, die einem Vocabulary Encoding Scheme entnommen oder mit einem String Encoding Scheme konstruiert wird. @de
label: hozzáférési pont a következő megjelenési formához: @hu
definition: Hozzákapcsol egy noment egy megjelenési formához, amelynek természetes nyelvű megnevezése egy szótárkódolási sémából származik, vagy egy karakterlánc-kódolási séma használatával szerkesztett. @hu
toolkit label: hozzáférési pont a következő megjelenési formához: @hu
toolkit definition: Egy megjelenési forma, amelynek természetes nyelvű megnevezése egy szótárkódolási sémából származik, vagy egy karakterlánc-kódolási séma használatával szerkesztett. @hu
label: è punto d'accesso per manifestazione di @it
definition: Correla un nomen a una manifestazione che ha una denominazione nel linguaggio naturale che è tratta da uno schema di codifica di vocabolario o è costruita usando uno schema di codifica di stringa. @it
toolkit label: punto d'accesso per manifestazione di @it
toolkit definition: Una manifestazione che ha una denominazione nel linguaggio naturale che è tratta da uno schema di codifica di vocabolario o è costruita usando uno schema di codifica di stringa. @it
label: ir vārdforma manifestācijai @lv
definition: Sasaista nomenu ar manifestāciju, kam ir apzīmējums dabiskā valodā, kas ņemts no shēmas kontrolētu vārdnīcu kodēšanai vai tiek konstruēts, izmantojot virknes kodēšanas shēmu. @lv
toolkit label: ir vārdforma manifestācijai @lv
toolkit definition: Manifestācija, kam ir apzīmējums dabiskā valodā, kas ņemts no shēmas kontrolētu vārdnīcu kodēšanai vai tiek konstruēts, izmantojot virknes kodēšanas shēmu @lv
label: 是……的载体表现的检索点 @zh-hans
definition: 将一个命名与有取自一个词表编码体系或者用一个串编码体系构建、用自然语言的一个称谓的一种载体表现关联起来。 @zh-hans
toolkit label: ……的载体表现的检索点 @zh-hans
toolkit definition: 有取自一个词表编码体系或者用一个串编码体系构建、用自然语言的一个称谓的一种载体表现 @zh-hans
has subproperty: is authorized access point for manifestation of
has subproperty: is variant access point for manifestation of
has subproperty: P80024
label: gösterimi için erişim noktasıdır @tr
definition: Bir ismi, bir kelime kodlama şemasından alınan veya bir dize kodlama şeması kullanılarak oluşturulan doğal dilde bir adlandırmaya sahip bir gösterimle ilişkilendirir. @tr
toolkit label: Gösterim için erişim noktası @tr
toolkit definition: Bir sözlük kodlama şemasından alınan ya da bir dizi kodlama şeması kullanılarak oluşturulan, doğal dilde bir unvana sahip bir gösterim @tr

is access point for person of
status: Published
type: Property
lexical alias: accessPointForPersonOf.en
definition: Relates a nomen to a person who has an appellation in natural language that is taken from a vocabulary encoding scheme or is constructed using a string encoding scheme.
domain: C10012
toolkit label: access point for person of
toolkit definition: A person who has an appellation in natural language that is taken from a vocabulary encoding scheme or is constructed using a string encoding scheme.
sub property of: is appellation of person of
sub property of: is access point for agent of
has element type: 2
label: hakutieto henkilölle @fi
definition: Liittää nomenin henkilöön, jonka luonnollisen kielen mukainen nimitykseen on otettu jostakin sanaston merkintäjärjestelmästä tai muodostettu jotakin merkkijonon merkintäjärjestelmää käyttäen. @fi
toolkit label: hakutieto henkilölle @fi
toolkit definition: Henkilö, jonka luonnollisen kielen mukainen nimitys on otettu jostakin sanaston merkintäjärjestelmästä tai muodostettu jotakin merkkijonon merkintäjärjestelmää käyttäen. @fi
label: er søkeinngang for person for @no
definition: Relaterer et nomen til en person som har en betegnelse på et naturlig språk som er hentet fra et kodeskjema for vokabular eller som er konstruert ved hjelp av et kodeskjema for syntaks. @no
toolkit label: søkeinngang for person for @no
toolkit definition: En person som har en betegnelse på et naturlig språk som er hentet fra et kodeskjema for vokabular eller som er konstruert ved hjelp av et kodeskjema for syntaks. @no
label: est un point d’accès d’une personne de @fr
definition: Met un nomen en relation avec une personne qui possède une appellation en langage naturel provenant d’un schéma d’encodage de vocabulaire ou construite à l’aide d’un schéma d’encodage de chaînes. @fr
toolkit label: point d’accès d’une personne de @fr
toolkit definition: Personne qui possède une appellation en langage naturel provenant d’un schéma d’encodage de vocabulaire ou construite à l’aide d’un schéma d’encodage de chaînes. @fr
label: is ingang voor persoon van @nl
definition: Relateert een nomen aan een persoon die een benaming heeft in natuurlijke taal die ontleend is aan een vocabulair coderingsschema of gevormd is volgens een string coderingsschema. @nl
toolkit label: ingang voor persoon van @nl
toolkit definition: Een persoon die een benaming heeft in natuurlijke taal die ontleend is aan een vocabulair coderingsschema of gevormd is volgens een string coderingsschema. @nl
label: هي نقطة وصول لشخص لـ @ar
definition: يربط تسمية بشخص له اسم في لغة طبيعية مأخوذة من خطة ترميز مفردات أو مبنية باستخدام خطة ترميز سلسلة تمثيلات. @ar
toolkit label: نقطة وصول لشخص لـ @ar
toolkit definition: شخص له اسم في لغة طبيعية مأخوذة من خطة ترميز مفردات أو مبنية باستخدام خطة ترميز سلسلة تمثيلات. @ar
label: és punt d’accés de persona de @ca
definition: Relaciona un nomen amb una persona que té una apel·lació en llenguatge natural que s’obté d’un esquema de codificació de vocabulari o s’elabora usant un esquema de codificació de cadenes. @ca
toolkit label: punt d’accés de persona de @ca
toolkit definition: Persona que té una apel·lació en llenguatge natural que s’obté d’un esquema de codificació de vocabulari o s’elabora usant un esquema de codificació de cadenes. @ca
label: er søgeindgang for person af @da
definition: Relaterer et nomen til en person, som har en benævnelse på normalsprog, som er taget fra et vokabularkodningsskema eller er konstrueret ved hjælp af et strengkodningsskema. @da
toolkit label: søgeindgang for person af @da
toolkit definition: Person, som har en benævnelse på normalsprog, som er taget fra et vokabularkodningsskema eller er konstrueret ved hjælp af et strengkodningsskema. @da
label: otsielement isikule @et
definition: Seostab nomen'i isikuga, kellel on loomulikus keeles nimetus, mis on võetud leksikaalsest märkimissüsteemist või moodustatud stringilise märkimissüsteemi alusel. @et
toolkit label: otsielement isikule @et
toolkit definition: Isik, kellel on loomulikus keeles nimetus, mis on võetud leksikaalsest märkimissüsteemist või moodustatud stringilise märkimissüsteemi alusel. @et
label: ist Sucheinstieg für eine Person von @de
definition: Setzt ein Nomen in Beziehung zu einer Person, die eine Bezeichnung in natürlicher Sprache hat, die einem Vocabulary Encoding Scheme entnommen oder mit einem String Encoding Scheme konstruiert wird. @de
toolkit label: Sucheinstieg für eine Person von @de
toolkit definition: Eine Person, die eine Bezeichnung in natürlicher Sprache hat, die einem Vocabulary Encoding Scheme entnommen oder mit einem String Encoding Scheme konstruiert wird. @de
label: hozzáférési pont a következő személyhez: @hu
definition: Hozzákapcsol egy noment egy személyhez, akinek természetes nyelvű megnevezése egy szótárkódolási sémából származik, vagy egy karakterlánc-kódolási séma használatával szerkesztett. @hu
toolkit label: hozzáférési pont a következő személyhez: @hu
toolkit definition: Egy személy, akinek természetes nyelvű megnevezése egy szótárkódolási sémából származik, vagy egy karakterlánc-kódolási séma használatával szerkesztett. @hu
label: è punto d'accesso per presona di @it
definition: Correla un nomen a una persona che ha una denominazione nel linguaggio naturale che è tratta da uno schema di codifica di vocabolario o è costruita usando uno schema di codifica di stringa. @it
toolkit label: punto d'accesso per presona di @it
toolkit definition: Una persona che ha una denominazione nel linguaggio naturale che è tratta da uno schema di codifica di vocabolario o è costruita usando uno schema di codifica di stringa. @it
label: ir pamatforma personai @lv
definition: Sasaista nomenu ar personu, kurai ir vārds/nosaukums dabiskā valodā, kas ņemts no shēmas kontrolētu vārdnīcu kodēšanai vai tiek konstruēts, izmantojot virknes kodēšanas shēmu. @lv
toolkit label: ir pamatforma personai @lv
toolkit definition: Persona, kurai ir vārds/nosaukums dabiskā valodā, kas ņemts no shēmas kontrolētu vārdnīcu kodēšanai vai tiek konstruēts, izmantojot virknes kodēšanas shēmu @lv
label: 是个人的检索点 @zh-hans
definition: 将一个命名与有取自一个词表编码体系或者用一个串编码体系构建、用自然语言的一个称谓的一个个人关联起来。 @zh-hans
toolkit label: 个人的检索点 @zh-hans
toolkit definition: 有取自一个词表编码体系或者用一个串编码体系构建、用自然语言的一个称谓的一个个人 @zh-hans
has subproperty: is authorized access point for person of
has subproperty: is variant access point for person of
has subproperty: P80022
label: kişisi için erişim noktasıdır @tr
definition: Bir ismi, bir kelime kodlama şemasından alınan veya bir dize kodlama şeması kullanılarak oluşturulan doğal dilde bir ünvanı olan bir kişiyle ilişkilendirir. @tr
toolkit label: Kişi için erişim noktası @tr
toolkit definition: Bir kelime kodlama şemasından alınan veya bir dize kodlama şeması kullanılarak oluşturulan doğal dilde bir unvanı olan kişi. @tr

is access point for place of
status: Published
type: Property
lexical alias: accessPointForPlaceOf.en
definition: Relates a nomen to a place that has an appellation in natural language that is taken from a vocabulary encoding scheme or is constructed using a string encoding scheme.
domain: C10012
toolkit label: access point for place of
toolkit definition: A place that has an appellation in natural language that is taken from a vocabulary encoding scheme or is constructed using a string encoding scheme.
sub property of: is appellation of place of
has element type: 2
sub property of: is access point for RDA entity of
label: hakutieto paikalle @fi
definition: Liittää nomenin paikkaan, jonka luonnollisen kielen mukainen nimitys on otettu jostakin sanaston merkintäjärjestelmästä tai muodostettu jotakin merkkijonon merkintäjärjestelmää käyttäen. @fi
toolkit label: hakutieto paikalle @fi
toolkit definition: Paikka, jonka luonnollisen kielen mukainen nimitys on otettu jostakin sanaston merkintäjärjestelmästä tai muodostettu jotakin merkkijonon merkintäjärjestelmää käyttäen. @fi
label: er søkeinngang for sted for @no
definition: Relaterer et nomen til et sted som har en betegnelse på et naturlig språk som er hentet fra et kodeskjema for vokabular eller som er konstruert ved hjelp av et kodeskjema for syntaks. @no
toolkit label: søkeinngang for sted for @no
toolkit definition: Et sted som har en betegnelse på et naturlig språk som er hentet fra et kodeskjema for vokabular eller som er konstruert ved hjelp av et kodeskjema for syntaks. @no
label: est un point d’accès d’un lieu de @fr
definition: Met un nomen en relation avec un lieu qui possède une appellation en langage naturel provenant d’un schéma d’encodage de vocabulaire ou construite à l’aide d’un schéma d’encodage de chaînes. @fr
toolkit label: point d’accès d’un lieu de @fr
toolkit definition: Lieu qui possède une appellation en langage naturel provenant d’un schéma d’encodage de vocabulaire ou construite à l’aide d’un schéma d’encodage de chaînes. @fr
label: is ingang voor plaats van @nl
definition: Relateert een nomen aan een plaats die een benaming heeft in natuurlijke taal die ontleend is aan een vocabulair coderingsschema of gevormd is volgens een string coderingsschema. @nl
toolkit label: ingang voor plaats van @nl
toolkit definition: Een plaats die een benaming heeft in natuurlijke taal die ontleend is aan een vocabulair coderingsschema of gevormd is volgens een string coderingsschema. @nl
label: هي نقطة وصول لمكان لـ @ar
definition: يربط تسمية بمكان له اسم في لغة طبيعية مأخوذة من خطة ترميز مفردات أو مبنية باستخدام خطة ترميز سلسلة تمثيلات. @ar
toolkit label: نقطة وصول لمكان لـ @ar
toolkit definition: مكان له اسم في لغة طبيعية مأخوذة من خطة ترميز مفردات أو مبنية باستخدام خطة ترميز سلسلة تمثيلات. @ar
label: és punt d’accés de lloc de @ca
definition: Relaciona un nomen amb un lloc que té una apel·lació en llenguatge natural que s’obté d’un esquema de codificació de vocabulari o s’elabora usant un esquema de codificació de cadenes. @ca
toolkit label: punt d’accés de lloc de @ca
toolkit definition: Lloc que té una apel·lació en llenguatge natural que s’obté d’un esquema de codificació de vocabulari o s’elabora usant un esquema de codificació de cadenes. @ca
label: er søgeindgang for sted af @da
definition: Relaterer et nomen til et sted, som har en benævnelse på normalsprog, som er taget fra et vokabularkodningsskema eller er konstrueret ved hjælp af et strengkodningsskema. @da
toolkit label: søgeindgang for sted af @da
toolkit definition: Sted, som har en benævnelse på normalsprog, som er taget fra et vokabularkodningsskema eller er konstrueret ved hjælp af et strengkodningsskema. @da
label: otsielement kohale @et
definition: Seostab nomen'i kohaga, millel on loomulikus keeles nimetus, mis on võetud leksikaalsest märkimissüsteemist või moodustatud stringilise märkimissüsteemi alusel. @et
toolkit label: otsielement kohale @et
toolkit definition: Koht, millel on loomulikus keeles nimetus, mis on võetud leksikaalsest märkimissüsteemist või moodustatud stringilise märkimissüsteemi alusel. @et
label: ist Sucheinstieg für ein Geografikum von @de
definition: Setzt ein Nomen in Beziehung zu einem Geografikum, das eine Bezeichnung in natürlicher Sprache hat, die einem Vocabulary Encoding Scheme entnommen oder mit einem String Encoding Scheme konstruiert wird. @de
toolkit label: Sucheinstieg für ein Geografikum von @de
toolkit definition: Ein Geografikum, das eine Bezeichnung in natürlicher Sprache hat, die einem Vocabulary Encoding Scheme entnommen oder mit einem String Encoding Scheme konstruiert wird. @de
label: hozzáférési pont a következő helyhez: @hu
definition: Hozzákapcsol egy noment egy helyhez, amelynek természetes nyelvű megnevezése egy szótárkódolási sémából származik, vagy egy karakterlánc-kódolási séma használatával szerkesztett. @hu
toolkit label: hozzáférési pont a következő helyhez: @hu
toolkit definition: Egy hely, amelynek természetes nyelvű megnevezése egy szótárkódolási sémából származik, vagy egy karakterlánc-kódolási séma használatával szerkesztett. @hu
label: è punto d'accesso per luogo di @it
definition: Correla un nomen a un luogo che ha una denominazione nel linguaggio naturale che è tratta da uno schema di codifica di vocabolario o è costruita usando uno schema di codifica di stringa @it
toolkit label: punto d'accesso per luogo di @it
toolkit definition: Un luogo che ha una denominazione nel linguaggio naturale che è tratta da uno schema di codifica di vocabolario o è costruita usando uno schema di codifica di stringa. @it
label: ir pamatforma vietai @lv
definition: Sasaista nomenu ar vietu, kurai ir vārds/nosaukums dabiskā valodā, kas ņemts no shēmas kontrolētu vārdnīcu kodēšanai vai tiek konstruēts, izmantojot virknes kodēšanas shēmu. @lv
toolkit label: ir pamatforma vietai @lv
toolkit definition: Vieta, kurai ir vārds/nosaukums dabiskā valodā, kas ņemts no shēmas kontrolētu vārdnīcu kodēšanai vai tiek konstruēts, izmantojot virknes kodēšanas shēmu @lv
label: 有……的地点的检索点 @zh-hans
definition: 将一个命名与有取自一个词表编码体系或者用一个串编码体系构建、用自然语言的一个称谓的一个地点关联起来。 @zh-hans
toolkit label: ……的地点的检索点 @zh-hans
toolkit definition: 有取自一个词表编码体系或者用一个串编码体系构建、用自然语言的一个称谓的一个地点 @zh-hans
has subproperty: is authorized access point for place of
has subproperty: is variant access point for place of
has subproperty: P80025
label: yeri için erişim noktasıdır @tr
definition: Bir ismi, bir kelime kodlama şemasından alınan veya bir dize kodlama şeması kullanılarak oluşturulan doğal dilde bir adı olan bir yerle ilişkilendirir. @tr
toolkit label: Yer için erişim noktası @tr
toolkit definition: Bir kelime kodlama şemasından alınan veya bir dize kodlama şeması kullanılarak yapılandırılan doğal dilde bir unvanı olan bir yer. @tr

is access point for RDA entity of
status: Published
type: Property
lexical alias: accessPointForRDAEntityOf.en
definition: Relates a nomen to an RDA entity that has an appellation in natural language that is taken from a vocabulary encoding scheme or is constructed using a string encoding scheme.
domain: C10012
toolkit label: access point for RDA entity of
toolkit definition: An RDA entity that has an appellation in natural language that is taken from a vocabulary encoding scheme or is constructed using a string encoding scheme.
has element type: 2
sub property of: is appellation of RDA entity of
label: hakutieto RDA-entiteetille @fi
definition: Liittää nomenin RDA-entiteettiin, jonka luonnollisen kielen mukainen nimitys on otettu jostakin sanaston merkintäjärjestelmästä tai muodostettu jotakin merkkijonon merkintäjärjestelmää käyttäen. @fi
toolkit label: hakutieto RDA-entiteetille @fi
toolkit definition: RDA-entiteetti, jonka luonnollisen kielen mukainen nimitys on otettu jostakin sanaston merkintäjärjestelmästä tai muodostettu jotakin merkkijonon merkintäjärjestelmää käyttäen. @fi
label: er søkeinngang for RDA-entitet for @no
definition: Relaterer et nomen til en RDA-entitet som har en betegnelse på et naturlig språk som er hentet fra et kodeskjema for vokabular eller som er konstruert ved hjelp av et kodeskjema for syntaks. @no
toolkit label: søkeinngang for RDA-entitet for @no
toolkit definition: En RDA-entitet som har en betegnelse på et naturlig språk som er hentet fra et kodeskjema for vokabular eller som er konstruert ved hjelp av et kodeskjema for syntaks. @no
label: est un point d’accès d’une entité RDA de @fr
definition: Met un nomen en relation avec une entité RDA qui possède une appellation en langage naturel provenant d’un schéma d’encodage de vocabulaire ou construite à l’aide d’un schéma d’encodage de chaînes. @fr
toolkit label: point d’accès d’une entité RDA de @fr
toolkit definition: Entité RDA qui possède une appellation en langage naturel provenant d’un schéma d’encodage de vocabulaire ou construite à l’aide d’un schéma d’encodage de chaînes. @fr
label: is ingang voor RDA-entiteit van @nl
definition: Relateert een nomen aan een RDA-entiteit die een benaming heeft in natuurlijke taal ontleend aan een vocabulair coderingssysteem of gevormd is volgens een string coderingsschema. @nl
toolkit label: ingang voor RDA-entiteit van @nl
toolkit definition: Een RDA-entiteit die een benaming heeft in natuurlijke taal ontleend aan een vocabulair coderingssysteem of gevormd is volgens een string coderingsschema. @nl
label: هي نقطة وصول لكيان "وام" لـ @ar
definition: يربط تسمية بكيان "وام" له اسم في لغة طبيعية مأخوذة من خطة ترميز مفردات أو مبنية باستخدام خطة ترميز سلسلة تمثيلات. @ar
toolkit label: نقطة وصول لكيان "وام" لـ @ar
toolkit definition: كيان "وام" له اسم في لغة طبيعية مأخوذ من خطة ترميز مفردات أو مبني باستخدام خطة ترميز سلسلة تمثيلات. @ar
label: és punt d’accés d’entitat RDA de @ca
definition: Relaciona un nomen amb una entitat RDA que té una apel·lació en llenguatge natural que s’obté d’un esquema de codificació de vocabulari o s’elabora usant un esquema de codificació de cadenes. @ca
toolkit label: punt d’accés d’entitat RDA de @ca
toolkit definition: Entitat RDA que té una apel·lació en llenguatge natural que s’obté d’un esquema de codificació de vocabulari o s’elabora usant un esquema de codificació de cadenes. @ca
label: er søgeindgang for RDA-entitet af @da
definition: Relaterer et nomen til en RDA-entitet, som har en benævnelse på normalsprog, som er taget fra et vokabularkodningsskema eller er konstrueret ved hjælp af et strengkodningsskema. @da
toolkit label: søgeindgang for RDA-entitet af @da
toolkit definition: RDA-entitet, som har en benævnelse på normalsprog, som er taget fra et vokabularkodningsskema eller er konstrueret ved hjælp af et strengkodningsskema. @da
label: otsielement RDA olemile @et
definition: Seostab nomen'i RDA olemiga, millel on loomulikus keeles nimetus, mis on võetud leksikaalsest märkimissüsteemist või moodustatud stringilise märkimissüsteemi alusel. @et
toolkit label: otsielement RDA olemile @et
toolkit definition: RDA olem, millel on loomulikus keeles nimetus, mis on võetud leksikaalsest märkimissüsteemist või moodustatud stringilise märkimissüsteemi alusel. @et
label: ist Sucheinstieg für eine RDA-Entität von @de
definition: Setzt ein Nomen in Beziehung zu einer RDA-Entität, die eine Bezeichnung in natürlicher Sprache hat, die einem Vocabulary Encoding Scheme entnommen oder mit einem String Encoding Scheme konstruiert wird. @de
toolkit label: Sucheinstieg für eine RDA-Entität von @de
toolkit definition: Eine RDA-Entität, die eine Bezeichnung in natürlicher Sprache hat, die einem Vocabulary Encoding Scheme entnommen oder mit einem String Encoding Scheme konstruiert wird. @de
label: hozzáférési pont a következő RDA-entitás számára: @hu
definition: Hozzákapcsol egy noment egy RDA-entitáshoz, amelynek van egy olyan természetes nyelvű megnevezése, amely egy szótárkódolási sémából származik, vagy egy karakterlánc-kódolási séma használatával szerkesztett. @hu
toolkit label: hozzáférési pont a következő RDA-entitás számára: @hu
toolkit definition: Egy RDA-entitás, amelynek van egy olyan természetes nyelvű megnevezése, amely egy szótárkódolási sémából származik, vagy egy karakterlánc-kódolási séma használatával szerkesztett. @hu
label: è punto d'accesso per l'entità RDA di @it
definition: Correla un nomen a un'entità RDA che ha una denominazione nel linguaggio naturale che è tratta da uno schema di codifica di vocabolario o è costruita usando uno schema di codifica di stringa. @it
toolkit label: punto d'accesso per l'entità RDA di @it
toolkit definition: Un'entità RDA che ha una denominazione nel linguaggio naturale che è tratta da uno schema di codifica di vocabolario o è costruita usando uno schema di codifica di stringa. @it
label: ir pamatforma RDA entītei @lv
definition: Sasaista nomenu ar RDA entīti, kurai ir vārds/nosaukums dabiskā valodā, kas ņemts no shēmas kontrolētu vārdnīcu kodēšanai vai tiek konstruēts, izmantojot virknes kodēšanas shēmu. @lv
toolkit label: ir pamatforma RDA entītei @lv
toolkit definition: RDA entīte, kurai ir vārds/nosaukums dabiskā valodā, kas ņemts no shēmas kontrolētu vārdnīcu kodēšanai vai tiek konstruēts, izmantojot virknes kodēšanas shēmu @lv
label: 是……的RDA实体的检索点 @zh-hans
definition: 将一个命名与有取自一个词表编码体系或者用一个串编码体系构建、用自然语言的一个称谓的一个RDA实体关联起来。 @zh-hans
toolkit label: ……的RDA实体的检索点 @zh-hans
toolkit definition: 有取自一个词表编码体系或者用一个串编码体系构建、用自然语言的一个称谓的一个RDA实体 @zh-hans
has subproperty: is access point for agent of
has subproperty: is access point for expression of
has subproperty: is access point for item of
has subproperty: is access point for manifestation of
has subproperty: is access point for place of
has subproperty: is access point for timespan of
has subproperty: is access point for work of
has subproperty: is authorized access point for RDA entity of
has subproperty: is variant access point for RDA entity of
has subproperty: P80159
label: RDA varlığı için erişim noktasıdır @tr
definition: Bir ismi, bir kelime kodlama şemasından alınan veya bir dize kodlama şeması kullanılarak oluşturulan doğal dilde adlandırılan bir RDA varlığıyla ilişkilendirir. @tr
toolkit label: RDA varlığı için erişim noktası @tr
toolkit definition: Bir kelime kodlama şemasından alınan veya bir dize kodlama şeması kullanılarak oluşturulan doğal dilde bir unvana sahip bir RDA varlığı. @tr

is access point for timespan of
status: Published
type: Property
lexical alias: accessPointForTimespanOf.en
definition: Relates a nomen to a timespan that has an appellation in natural language that is taken from a vocabulary encoding scheme or is constructed using a string encoding scheme.
domain: C10012
toolkit label: access point for timespan of
toolkit definition: A timespan that has an appellation in natural language that is taken from a vocabulary encoding scheme or is constructed using a string encoding scheme.
sub property of: is appellation of timespan of
has element type: 2
sub property of: is access point for RDA entity of
label: hakutieto ajanjaksolle @fi
definition: Liittää nomenin ajanjaksoon, jonka luonnollisen kielen mukainen nimitys on otettu jostakin sanaston merkintäjärjestelmästä tai muodostettu jotakin merkkijonon merkintäjärjestelmää käyttäen. @fi
toolkit label: hakutieto ajanjaksolle @fi
toolkit definition: Ajanjakso, jonka luonnollisen kielen mukainen nimitys on otettu jostakin sanaston merkintäjärjestelmästä tai muodostettu jotakin merkkijonon merkintäjärjestelmää käyttäen. @fi
label: er søkeinngang for tidsrom for @no
definition: Relaterer et nomen til et tidsrom som har en betegnelse på et naturlig språk som er hentet fra et kodeskjema for vokabular eller som er konstruert ved hjelp av et kodeskjema for syntaks. @no
toolkit label: søkeinngang for tidsrom for @no
toolkit definition: Et tidsrom som har en betegnelse på et naturlig språk som er hentet fra et kodeskjema for vokabular eller som er konstruert ved hjelp av et kodeskjema for syntaks. @no
label: est un point d’accès d’un laps de temps de @fr
definition: Met un nomen en relation avec un laps de temps qui possède une appellation en langage naturel provenant d’un schéma d’encodage de vocabulaire ou construite à l’aide d’un schéma d’encodage de chaînes. @fr
toolkit label: point d’accès d’un laps de temps de @fr
toolkit definition: Laps de temps qui possède une appellation en langage naturel provenant d’un schéma d’encodage de vocabulaire ou construite à l’aide d’un schéma d’encodage de chaînes. @fr
label: is ingang voor tijdspanne van @nl
definition: Relateert een nomen aan een tijdspanne die een benaming heeft in natuurlijke taal die ontleend is aan een vocabulair coderingsschema of gevormd is volgens een string coderingsschema. @nl
toolkit label: ingang voor tijdspanne van @nl
toolkit definition: Een tijdspanne die een benaming heeft in natuurlijke taal die ontleend is aan een vocabulair coderingsschema of gevormd is volgens een string coderingsschema. @nl
label: هي نقطة وصول لفترة زمنية لـ @ar
definition: يربط تسمية بفترة زمنية لها اسم في لغة طبيعية مأخوذة من خطة ترميز مفردات أو مبنية باستخدام خطة ترميز سلسلة تمثيلات. @ar
toolkit label: نقطة وصول لفترة زمنية لـ @ar
toolkit definition: فترة زمنية لها اسم في لغة طبيعية مأخوذة من خطة ترميز مفردات أو مبنية باستخدام خطة ترميز سلسلة تمثيلات. @ar
label: és punt d’accés d’interval de temps de @ca
definition: Relaciona un nomen amb un interval de temps que té una apel·lació en llenguatge natural que s’obté d’un esquema de codificació de vocabulari o s’elabora usant un esquema de codificació de cadenes. @ca
toolkit label: punt d’accés d’interval de temps de @ca
toolkit definition: Interval de temps que té una apel·lació en llenguatge natural que s’obté d’un esquema de codificació de vocabulari o s’elabora usant un esquema de codificació de cadenes. @ca
label: er søgeindgang for tidsperiode af @da
definition: Relaterer et nomen til en tidsperiode, som har en benævnelse på normalsprog, som er taget fra et vokabularkodningsskema eller er konstrueret ved hjælp af et strengkodningsskema. @da
toolkit label: søgeindgang for tidsperiode af @da
toolkit definition: Tidsperiode, som har en benævnelse på normalsprog, som er taget fra et vokabularkodningsskema eller er konstrueret ved hjælp af et strengkodningsskema. @da
label: otsielement ajavahemikule @et
definition: Seostab nomen'i ajavahemikuga, millel on loomulikus keeles nimetus, mis on võetud leksikaalsest märkimissüsteemist või moodustatud stringilise märkimissüsteemi alusel. @et
toolkit label: otsielement ajavahemikule @et
toolkit definition: Ajavahemik, millel on loomulikus keeles nimetus, mis on võetud leksikaalsest märkimissüsteemist või moodustatud stringilise märkimissüsteemi alusel. @et
label: ist Sucheinstieg für einen Zeitraum von @de
definition: Setzt ein Nomen in Beziehung zu einem Zeitraum, der eine Bezeichnung in natürlicher Sprache hat, die einem Vocabulary Encoding Scheme entnommen oder mit einem String Encoding Scheme konstruiert wird. @de
toolkit label: Sucheinstieg für einen Zeitraum von @de
toolkit definition: Ein Zeitraum, der eine Bezeichnung in natürlicher Sprache hat, die einem Vocabulary Encoding Scheme entnommen oder mit einem String Encoding Scheme konstruiert wird. @de
label: hozzáférési pont a következő időtartamhoz: @hu
definition: Hozzákapcsol egy noment egy időtartamhoz, amelynek természetes nyelvű megnevezése egy szótárkódolási sémából származik, vagy egy karakterlánc-kódolási séma használatával szerkesztett. @hu
toolkit label: hozzáférési pont a következő időtartamhoz: @hu
toolkit definition: Egy időtartam, amelynek természetes nyelvű megnevezése egy szótárkódolási sémából származik, vagy egy karakterlánc-kódolási séma használatával szerkesztett. @hu
label: è punto d'accesso per arco di tempo di @it
definition: Correla un nomen a un arco di tempo che ha una denominazione nel linguaggio naturale che è tratta da uno schema di codifica di vocabolario o è costruita usando uno schema di codifica di stringa. @it
toolkit label: piunto d'accesso per arco di tempo di @it
toolkit definition: Un arco di tempo che ha una denominazione nel linguaggio naturale che è tratta da uno schema di codifica di vocabolario o è costruita usando uno schema di codifica di stringa. @it
label: ir pamatforma laikposmam @lv
definition: Sasaista nomenu ar laikposmu, kuram ir vārds/nosaukums dabiskā valodā, kas ņemts no shēmas kontrolētu vārdnīcu kodēšanai vai tiek konstruēts, izmantojot virknes kodēšanas shēmu. @lv
toolkit label: ir pamatforma laikposmam @lv
toolkit definition: Laikposms, kuram ir vārds/nosaukums dabiskā valodā, kas ņemts no shēmas kontrolētu vārdnīcu kodēšanai vai tiek konstruēts, izmantojot virknes kodēšanas shēmu @lv
label: 是……的时间段的检索点 @zh-hans
definition: 将一个命名与有取自一个词表编码体系或者用一个串编码体系构建、用自然语言的一个称谓的一个时间段关联起来。 @zh-hans
toolkit label: ……的时间段的检索点 @zh-hans
toolkit definition: 有取自一个词表编码体系或者用一个串编码体系构建、用自然语言的一个称谓的一个时间段 @zh-hans
has subproperty: is authorized access point for timespan of
has subproperty: is variant access point for timespan of
has subproperty: P80026
label: zaman aralığı için erişim noktasıdır. @tr
definition: Bir ismi, bir kelime kodlama şemasından alınan veya bir dize kodlama şeması kullanılarak oluşturulan doğal dilde bir adlandırmaya sahip bir zaman aralığı ile ilişkilendirir. @tr
toolkit label: Zaman aralığı erişim noktası @tr
toolkit definition: Bir kelime kodlama şemasından alınan veya bir dize kodlama şeması kullanılarak oluşturulan doğal dilde bir unvana sahip bir zaman aralığı. @tr

is access point for work of
status: Published
type: Property
lexical alias: accessPointForWorkOf.en
definition: Relates a nomen to a work that has an appellation in natural language that is taken from a vocabulary encoding scheme or is constructed using a string encoding scheme.
domain: C10012
toolkit label: access point for work of
toolkit definition: A work that has an appellation in natural language that is taken from a vocabulary encoding scheme or is constructed using a string encoding scheme.
sub property of: is appellation of work of
has element type: 2
sub property of: is access point for RDA entity of
label: hakutieto teokselle @fi
definition: Liittää nomenin teokseen, jonka luonnollisen kielen mukainen nimitys on otettu jostakin sanaston merkintäjärjestelmästä tai muodostettu jotakin merkkijonon merkintäjärjestelmää käyttäen. @fi
toolkit label: hakutieto teokselle @fi
toolkit definition: Teos, jonka luonnollisen kielen mukainen nimitys on otettu jostakin sanaston merkintäjärjestelmästä tai muodostettu jotakin merkkijonon merkintäjärjestelmää käyttäen. @fi
label: er søkeinngang for verk for @no
definition: Relaterer et nomen til et verk som har en betegnelse på et naturlig språk som er hentet fra et kodeskjema for vokabular eller som er konstruert ved hjelp av et kodeskjema for syntaks. @no
toolkit label: søkeinngang for verk for @no
toolkit definition: Et verk som har en betegnelse på et naturlig språk som er hentet fra et kodeskjema for vokabular eller som er konstruert ved hjelp av et kodeskjema for syntaks. @no
label: est un point d’accès d’une œuvre de @fr
definition: Met un nomen en relation avec une œuvre qui possède une appellation en langage naturel provenant d’un schéma d’encodage de vocabulaire ou construite à l’aide d’un schéma d’encodage de chaînes. @fr
toolkit label: point d’accès d’une œuvre de @fr
toolkit definition: Œuvre qui possède une appellation en langage naturel provenant d’un schéma d’encodage de vocabulaire ou construite à l’aide d’un schéma d’encodage de chaînes. @fr
label: is ingang voor werk van @nl
definition: Relateert een nomen aan een werk dat een benaming heeft in natuurlijke taal die ontleend is aan een vocabulair coderingsschema of gevormd is volgens een string coderingsschema. @nl
toolkit label: ingang voor werk van @nl
toolkit definition: Een werk dat een benaming heeft in natuurlijke taal die ontleend is aan een vocabulair coderingsschema of gevormd is volgens een string coderingsschema. @nl
label: هي نقطة وصول لعمل لـ @ar
definition: يربط تسمية بعمل له اسم في لغة طبيعية مأخوذة من خطة ترميز مفردات، أو مبنية باستخدام خطة ترميز سلسلة تمثيلات. @ar
toolkit label: نقطة وصول لعمل لـ @ar
toolkit definition: عمل له اسم في لغة طبيعية مأخوذة من خطة ترميز مفردات أو مبنية باستخدام خطة ترميز سلسلة تمثيلات. @ar
label: és punt d’accés d’obra de @ca
definition: Relaciona un nomen amb una obra que té una apel·lació en llenguatge natural que s’obté d’un esquema de codificació de vocabulari o s’elabora usant un esquema de codificació de cadenes. @ca
toolkit label: punt d’accés d’obra de @ca
toolkit definition: Obra que té una apel·lació en llenguatge natural que s’obté d’un esquema de codificació de vocabulari o s’elabora usant un esquema de codificació de cadenes. @ca
label: er søgeindgang for værk af @da
definition: Relaterer et nomen til et værk, som har en benævnelse på normalsprog, som er taget fra et vokabularkodningsskema eller er konstrueret ved hjælp af et strengkodningsskema. @da
toolkit label: søgeindgang for værk af @da
toolkit definition: Værk, som har en benævnelse på normalsprog, som er taget fra et vokabularkodningsskema eller er konstrueret ved hjælp af et strengkodningsskema. @da
label: otsielement teosele @et
definition: Seostab nomen'i teosega, millel on loomulikus keeles nimetus, mis on võetud leksikaalsest märkimissüsteemist või moodustatud stringilise märkimissüsteemi alusel. @et
toolkit label: otsielement teosele @et
toolkit definition: Teos, millel on loomulikus keeles nimetus, mis on võetud leksikaalsest märkimissüsteemist või moodustatud stringilise märkimissüsteemi alusel. @et
label: ist Sucheinstieg für ein Werk von @de
definition: Setzt ein Nomen in Beziehung zu einem Werk, das eine Bezeichnung in natürlicher Sprache hat, die einem Vocabulary Encoding Scheme entnommen oder mit einem String Encoding Scheme konstruiert wird. @de
toolkit label: Sucheinstieg für ein Werk von @de
toolkit definition: Ein Werk, das eine Bezeichnung in natürlicher Sprache hat, die einem Vocabulary Encoding Scheme entnommen oder mit einem String Encoding Scheme konstruiert wird. @de
label: hozzáférési pont a következő műhöz: @hu
definition: Hozzákapcsol egy noment egy műhöz, amelynek természetes nyelvű megnevezése egy szótárkódolási sémából származik, vagy egy karakterlánc-kódolási séma használatával szerkesztett. @hu
toolkit label: hozzáférési pont a következő műhöz: @hu
toolkit definition: Egy mű, amelynek természetes nyelvű megnevezése egy szótárkódolási sémából származik, vagy egy karakterlánc-kódolási séma használatával szerkesztett. @hu
label: è punto d'accesso per opera di @it
definition: Correla un nomen a un'opera che ha una denominazione nel linguaggio naturale che è tratta da uno schema di codifica di vocabolario o è costruita usando uno schema di codifica di stringa. @it
toolkit label: punto d'accesso per opera di @it
toolkit definition: Un'opera che ha una denominazione nel linguaggio naturale che è tratta da uno schema di codifica di vocabolario o è costruita usando uno schema di codifica di stringa. @it
label: ir vārdforma darbam @lv
definition: Sasaista nomenu ar darbu, kam ir nosaukums dabiskā valodā, kas ņemts no kontrolētas vārdnīcas shēmas vai tiek konstruēts, izmantojot virknes kodēšanas shēmu. @lv
toolkit label: ir vārdforma darbam @lv
toolkit definition: Darbs, kam ir nosaukums dabiskā valodā, kas ņemts no kontrolētas vārdnīcas shēmas vai tiek konstruēts, izmantojot virknes kodēšanas shēmu @lv
label: 有……的作品的检索点 @zh-hans
definition: 将一个命名与有取自一个词表编码体系或者用一个串编码体系构建、用自然语言的一个称谓的一种作品关联起来。 @zh-hans
toolkit label: ……的作品的检索点 @zh-hans
toolkit definition: 有取自一个词表编码体系或者用一个串编码体系构建、用自然语言的一个称谓的一种作品 @zh-hans
has subproperty: is authorized access point for work of
has subproperty: is variant access point for work of
has subproperty: P80027
label: eseri için erişim noktasıdır @tr
definition: Bir ismi, bir kelime kodlama şemasından alınan veya bir dize kodlama şeması kullanılarak oluşturulan doğal dilde bir adı olan bir eserle ilişkilendirir. @tr
toolkit label: Eser için erişim noktası @tr
toolkit definition: Bir kelime kodlama şemasından alınan veya bir dize kodlama şeması kullanılarak oluşturulan doğal dilde bir unvanı olan bir eser. @tr

is address of agent of (Deprecated)
status: Deprecated
type: Property
has subproperty: P80153

is address of collective agent of (Deprecated)
status: Deprecated
type: Property
has subproperty: P80154

is address of corporate body of (Deprecated)
status: Deprecated
type: Property
has subproperty: P80150

is address of family of (Deprecated)
status: Deprecated
type: Property
has subproperty: P80152

is address of person of (Deprecated)
status: Deprecated
type: Property
has subproperty: P80151

is alternate identity of person of
status: Published
type: Property
lexical alias: alternateIdentityOfPersonOf.en
domain: C10012
toolkit label: alternate identity of person of
has element type: 2
sub property of: is appellation of person of
definition: Relates a nomen to a person who has an appellation of person that is a pseudonym or other assumed identity.
toolkit definition: A person who has an appellation of person that is a pseudonym or other assumed identity.
label: toinen identiteetti henkilölle @fi
definition: Liittää nomenin henkilöön, jonka nimitys on pseudonyymi tai muu omaksuttu identiteetti. @fi
toolkit label: toinen identiteetti henkilölle @fi
toolkit definition: Henkilö, jonka nimitys on pseudonyymi tai muu omaksuttu identiteetti. @fi
label: er alternativ identitet for person for @no
definition: Relaterer et nomen til en person som har en betegnelse for person som er et pseudonym eller annen antatt identitet. @no
toolkit label: alternativ identitet for person for @no
toolkit definition: En person som har en betegnelse for person som er et pseudonym eller annen antatt identitet. @no
label: est une identité alternative d’une personne de @fr
definition: Met un nomen en relation avec une personne qui possède une appellation de personne consistant en un pseudonyme ou en une autre identité d’emprunt. @fr
toolkit label: identité alternative d’une personne de @fr
toolkit definition: Personne qui possède une appellation de personne consistant en un pseudonyme ou en une autre identité d’emprunt. @fr
label: is alternatieve identiteit van persoon van @nl
definition: Relateert een nomen aan een persoon die een benaming van persoon heeft die een pseudoniem is of andere aangenomen identiteit. @nl
toolkit label: alternatieve identiteit van persoon van @nl
toolkit definition: Een persoon die een benaming van persoon heeft die een pseudoniem is of andere aangenomen identiteit. @nl
label: هي هوية بديلة لشخص لـ @ar
definition: يربط تسمية بشخص له اسم شخص عبارة عن اسم مستعار أو أي هوية أخرى زائفة . @ar
toolkit label: هوية بديلة لشخص لـ @ar
toolkit definition: شخص له اسم شخص عبارة عن اسم مستعار أو أي هوية أخرى زائفة. @ar
label: és identitat alternativa de persona de @ca
definition: Relaciona un nomen amb una persona que té una apel·lació de persona que és un pseudònim o qualsevol altra identitat adoptada. @ca
toolkit label: identitat alternativa de persona de @ca
toolkit definition: Persona que té una apel·lació de persona que és un pseudònim o qualsevol altra identitat adoptada. @ca
label: er alternativ identitet for person af @da
definition: Relaterer et nomen til en person, som har en benævnelse på person, som er et pseudonym eller anden antaget identitet. @da
toolkit label: alternativ identitet for person af @da
toolkit definition: Person, som har en benævnelse på person, som er et pseudonym eller anden antaget identitet. @da
label: teine identiteet isikule @et
definition: Seostab nomen'i isikuga, kellel on isiku nimetuseks pseudonüüm või muu endale võetud identiteet. @et
toolkit label: teine identiteet isikule @et
toolkit definition: Isik, kellel on isiku nimetuseks pseudonüüm või muu endale võetud identiteet. @et
label: ist andere Identität einer Person von @de
definition: Setzt ein Nomen in Beziehung zu einer Person, die über eine Bezeichnung für eine Person verfügt, bei der es sich um ein Pseudonym oder eine andere angenommene Identität handelt. @de
toolkit label: Andere Identität einer Person von @de
toolkit definition: Eine Person, die über eine Bezeichnung für eine Person verfügt, bei der es sich um ein Pseudonym oder eine andere angenommene Identität handelt. @de
label: alternatív identitása a következő személynek: @hu
definition: Egy személy, akinek olyan személymegnevezése van, amely álnév vagy más feltételezett identitás. @hu
toolkit label: alternatív identitása a következő személynek: @hu
toolkit definition: Hozzákapcsol egy noment egy személyhez, akinek olyan személymegnevezése van, amely álnév vagy más feltételezett identitás. @hu
label: è identità alternativa della persona di @it
definition: Correla un nomen a una persona che ha una designazione di persona che è uno pseudonimo o un'altra identità assunta. @it
toolkit label: identità alternativa pdella persona di @it
toolkit definition: Una persona che ha una designazione di persona che è uno pseudonimo o un'altra identità assunta. @it
label: ir cita identitāte personai @lv
toolkit label: ir cita identitāte personai @lv
definition: Sasaista nomenu ar personu, kuras vārds ir pseidonīms vai cita pieņemta identitāte. @lv
toolkit definition: Persona, kuras vārds ir pseidonīms vai cita pieņemta identitāte. @lv
label: 是……的个人的交替身份 @zh-hans
toolkit label: ……的个人的交替身份 @zh-hans
definition: 将一个命名与有化名或其他假定身份作为个人称谓的一个个人关联起来。 @zh-hans
toolkit definition: 有化名或其他假定身份作为个人称谓的一个个人 @zh-hans
has subproperty: P80157
label: kişisinin alternatif kimliğidir @tr
toolkit label: Kişisinin alternatif kimliği @tr
definition: Bir ismi, takma ad veya kabul edilen farklı bir kimliği olan bir kişi ile ilişkilendirir. @tr
toolkit definition: Takma ad veya başka bir varsayılan kimlikle kişi unvanına sahip olan kişi. @tr

is appellation of agent of
status: Published
type: Property
lexical alias: appellationOfAgentOf.en
definition: Relates a nomen to an agent who is referred to by a nomen used within a given scheme or context.
domain: C10012
toolkit label: appellation of agent of
toolkit definition: An agent who is referred to by a nomen used within a given scheme or context.
sub property of: has related agent of nomen
sub property of: is appellation of RDA entity of
has element type: 2
label: nimitys toimijalle @fi
definition: Liittää nomenin toimijaan, johon viitataan tietyssä järjestelmässä tai kontekstissa käytetyllä nomenilla. @fi
toolkit label: nimitys toimijalle @fi
toolkit definition: Toimija, johon viitataan tietyssä järjestelmässä tai kontekstissa käytetyllä nomenilla. @fi
label: er betegnelse for agent for @no
definition: Relaterer et nomen til en agent som refereres til med et nomen brukt innenfor et bestemt skjema eller kontekst. @no
toolkit label: betegnelse for agent for @no
toolkit definition: En agent som refereres til med et nomen brukt innenfor et bestemt skjema eller kontekst. @no
label: est une appellation d’agent de @fr
definition: Met un nomen en relation avec un agent qui est désigné par un nomen utilisé à l’intérieur d’un schéma ou d’un contexte donnés. @fr
toolkit label: appellation d’agent de @fr
toolkit definition: Agent qui est désigné par un nomen utilisé à l’intérieur d’un schéma ou d’un contexte donnés. @fr
label: is benaming van actor van @nl
definition: Relateert een nomen aan een actor die aangeduid wordt door een nomen gebruikt binnen een bepaald schema of context @nl
toolkit label: benaming van actor van @nl
toolkit definition: Een actor die aangeduid wordt door een nomen gebruikt binnen een bepaald schema of context @nl
label: هو اسم وكيل لـ @ar
definition: يربط تسمية بوكيل يشار إليه بتسمية مستخدمة في خطة أو في سياق معين. @ar
toolkit label: اسم وكيل لـ @ar
toolkit definition: وكيل يشار إليه بتسمية مستخدمة في خطة أو في سياق معين. @ar
label: és apel·lació d’agent de @ca
definition: Relaciona un nomen amb un agent que fa referència a un nomen usat en un esquema o un context determinat. @ca
toolkit label: apel·lació d’agent de @ca
toolkit definition: Agent que fa referència a un nomen usat en un esquema o un context determinat. @ca
label: er benævnelse på agent af @da
definition: Relaterer et nomen til en agent, som henvises til af et nomen, som anvendes inden for et givet skema eller kontekst. @da
toolkit label: benævnelse på agent af @da
toolkit definition: Agent, som henvises til af et nomen, som anvendes inden for et givet skema eller kontekst. @da
label: nimetus tegijale @et
definition: Seostab nomen'i tegijaga, kellele antud süsteemis või kontekstis nomen'iga viidatakse. @et
toolkit label: nimetus tegijale @et
toolkit definition: Tegija, kellele antud süsteemis või kontekstis nomen'iga viidatakse. @et
label: ist Bezeichnung für einen Akteur von @de
definition: Setzt ein Nomen in Beziehung zu einem Akteur, auf den mit einem Nomen referenziert wird, das in einem bestimmten Schema oder Kontext verwendet wird. @de
toolkit label: Bezeichnung für einen Akteur von @de
toolkit definition: Ein Akteur, auf den mit einem Nomen referenziert wird, das in einem bestimmten Schema oder Kontext verwendet wird. @de
label: megnevezése a következő ágensnek: @hu
definition: Hozzákapcsol egy noment egy ágenshez, amelyre egy adott sémában vagy kontextusban használt nomen hivatkozik. @hu
toolkit label: megnevezése a következő ágensnek: @hu
toolkit definition: Egy ágens, amelyre egy adott sémában vagy kontextusban használt nomen hivatkozik. @hu
label: è denominazione di agente di @it
definition: Correla un nomen a un agente a cui si fa riferimento con un nomen usato in un dato schema o contesto. @it
toolkit label: denominazione di agente di @it
toolkit definition: Un agente a cui si fa riferimento con un nomen usato in un dato schema o contesto. @it
label: ir apzīmējums aģentam @lv
definition: Sasaista nomenu ar aģentu, uz kuru attiecas nomens, ko lieto konkretājā sistēmā vai kontekstā. @lv
toolkit label: ir apzīmējums aģentam @lv
toolkit definition: Aģents, uz kuru attiecas nomens, ko lieto konkretājā sistēmā vai kontekstā. @lv
label: 是……的行为者的称谓 @zh-hans
definition: 将一个命名与在一个给定的体系或语境中用一个命名指称的一个行为者关联起来。 @zh-hans
toolkit label: ……的行为者的称谓 @zh-hans
toolkit definition: 在一个给定的体系或语境中用一个命名指称的一个行为者 @zh-hans
has subproperty: is access point for agent of
has subproperty: is appellation of collective agent of
has subproperty: is appellation of person of
has subproperty: is identifier for agent of
has subproperty: is name of agent of
has subproperty: P80028
label: temsilcisinin unvanıdır @tr
definition: Bir ismi, belirli bir şema veya bağlam içinde kullanılan bir isim tarafından atıfta bulunulan temsilciyle ilişkilendirir. @tr
toolkit label: temsilcinin unvanı @tr
toolkit definition: Belirli bir şema veya bağlam içinde kullanılan bir isimle anılan bir temsilci. @tr

is appellation of collective agent of
status: Published
type: Property
lexical alias: appellationOfCollectiveAgentOf.en
definition: Relates a nomen to a collective agent who is referred to by a nomen used within a given scheme or context.
domain: C10012
toolkit label: appellation of collective agent of
toolkit definition: A collective agent who is referred to by a nomen used within a given scheme or context.
sub property of: has related collective agent of nomen
sub property of: is appellation of agent of
has element type: 2
label: nimitys yhteistoimijalle @fi
definition: Liittää nomenin yhteistoimijaan, johon viitataan tietyssä järjestelmässä tai kontekstissa käytetyllä nomenilla. @fi
toolkit label: nimitys yhteistoimijalle @fi
toolkit definition: Yhteistoimija, johon viitataan tietyssä järjestelmässä tai kontekstissa käytetyllä nomenilla. @fi
label: er betegnelse for kollektiv agent for @no
definition: Relaterer et nomen til en kollektiv agent som refereres til med et nomen brukt innenfor et bestemt skjema eller kontekst. @no
toolkit label: betegnelse for kollektiv agent for @no
toolkit definition: En kollektiv agent som refereres til med et nomen brukt innenfor et bestemt skjema eller kontekst. @no
label: est une appellation d’agent collectif de @fr
definition: Met un nomen en relation avec un agent collectif qui est désigné par un nomen utilisé à l’intérieur d’un schéma ou d’un contexte donnés. @fr
toolkit label: appellation d’agent collectif de @fr
toolkit definition: Agent collectif qui est désigné par un nomen utilisé à l’intérieur d’un schéma ou d’un contexte donnés. @fr
label: is benaming van collectieve actor van @nl
definition: Relateert een nomen aan een collectieve actor die aangeduid wordt door een nomen gebruikt binnen een bepaald schema of context @nl
toolkit label: benaming van collectieve actor van @nl
toolkit definition: Een collectieve actor die aangeduid wordt door een nomen gebruikt binnen een bepaald schema of context @nl
label: هو اسم وكيل جماعي لـ @ar
definition: يربط تسمية بوكيل جماعي يشار إليه بتسمية مستخدمة في خطة أو في سياق معين. @ar
toolkit label: اسم وكيل جماعي لـ @ar
toolkit definition: وكيل جماعي يُشار إليه بتسمية مستخدمة في خطة أو في سياق معين. @ar
label: és apel·lació d’agent col·lectiu de @ca
definition: Relaciona un nomen amb un agent col·lectiu que fa referència a un nomen usat en un esquema o un context determinat. @ca
toolkit label: apel·lació d’agent col·lectiu de @ca
toolkit definition: Agent col·lectiu que fa referència a un nomen usat en un esquema o un context determinat. @ca
label: er benævnelse på kollektiv agent af @da
definition: Relaterer et nomen til en kollektiv agent, som henvises til af et nomen, som anvendes inden for et givet skema eller kontekst. @da
toolkit label: benævnelse på kollektiv agent af @da
toolkit definition: Kollektiv agent, som henvises til af et nomen, som anvendes inden for et givet skema eller kontekst. @da
label: nimetus kollektiivile @et
definition: Seostab nomen'i kollektiiviga, kellele antud süsteemis või kontekstis nomen'iga viidatakse. @et
toolkit label: nimetus kollektiivile @et
toolkit definition: Kollektiiv, kellele antud süsteemis või kontekstis nomen'iga viidatakse. @et
label: ist Bezeichnung für einen gemeinschaftlichen Akteur von @de
definition: Setzt ein Nomen in Beziehung zu einem gemeinschaftlichen Akteur, auf den mit einem Nomen referenziert wird, das in einem bestimmten Schema oder Kontext verwendet wird. @de
toolkit label: Bezeichnung für einen gemeinschaftlichen Akteur von @de
toolkit definition: Ein gemeinschaftlichen Akteur, auf den mit einem Nomen referenziert wird, das in einem bestimmten Schema oder Kontext verwendet wird. @de
label: megnevezése a következő kollektív ágensnek: @hu
definition: Hozzákapcsol egy noment egy kollektív ágenshez, amelyre egy adott sémában vagy kontextusban használt nomen hivatkozik. @hu
toolkit label: megnevezése a következő kollektív ágensnek: @hu
toolkit definition: Egy kollektív ágens, amelyre egy adott sémában vagy kontextusban használt nomen hivatkozik. @hu
label: è denominazione di agente collettivo di @it
definition: Correla un nomen a un agente collettivo a cui si fa riferimento con un nomen usato in un dato schema o contesto. @it
toolkit label: denominazione di agente collettivo di @it
toolkit definition: Un agente collettivo a cui si fa riferimento con un nomen usato in un dato schema o contesto. @it
label: ir apzīmējums grupai @lv
definition: Sasaista nomenu ar grupu, uz kuru attiecas nomens, ko lieto konkrētājā sistēmā vai kontekstā. @lv
toolkit label: ir apzīmējums grupai @lv
toolkit definition: Grupa, uz kuru attiecas nomens, ko lieto konkrētājā sistēmā vai kontekstā. @lv
label: 是……的集体行为者的称谓 @zh-hans
definition: 将一个命名与在一个给定的体系或语境中用一个命名指称的一个集体行为者关联起来。 @zh-hans
toolkit label: ……的集体行为者的称谓 @zh-hans
toolkit definition: 在一个给定的体系或语境中用一个命名指称的一个集体行为者 @zh-hans
has subproperty: is access point for collective agent of
has subproperty: is appellation of corporate body of
has subproperty: is appellation of family of
has subproperty: is identifier for collective agent of
has subproperty: is name of collective agent of
has subproperty: P80029
label: kolektif temsilcisinin unvanıdır @tr
definition: Bir ismi, belirli bir şema veya bağlam içinde kullanılan bir nomen tarafından atıfta bulunulan kolektif bir aracıyla ilişkilendirir. @tr
toolkit label: kolektif temsilcinin unvanı @tr
toolkit definition: Belirli bir şema veya bağlam içinde kullanılan bir nomenle anılan kolektif bir temsilci. @tr

is appellation of corporate body of
status: Published
type: Property
lexical alias: appellationOfCorporateBodyOf.en
definition: Relates a nomen to a corporate body who is referred to by a nomen used within a given scheme or context.
domain: C10012
toolkit label: appellation of corporate body of
toolkit definition: A corporate body who is referred to by a nomen used within a given scheme or context.
sub property of: has related corporate body of nomen
sub property of: is appellation of collective agent of
has element type: 2
label: nimitys yhteisölle @fi
definition: Liittää nomenin yhteisöön, johon viitataan tietyssä järjestelmässä tai kontekstissa käytetyllä nomenilla. @fi
toolkit label: nimitys yhteisölle @fi
toolkit definition: Yhteisö, johon viitataan tietyssä järjestelmässä tai kontekstissa käytetyllä nomenilla. @fi
label: er betegnelse for korporasjon for @no
definition: Relaterer et nomen til en korporasjon som refereres til med et nomen brukt innenfor et bestemt skjema eller kontekst. @no
toolkit label: betegnelse for korporasjon for @no
toolkit definition: En korporasjon som refereres til med et nomen brukt innenfor et bestemt skjema eller kontekst. @no
label: est une appellation de collectivité de @fr
definition: Met un nomen en relation avec une collectivité qui est désignée par un nomen utilisé à l’intérieur d’un schéma ou d’un contexte donnés. @fr
toolkit label: appellation de collectivité de @fr
toolkit definition: Collectivité qui est désignée par un nomen utilisé à l’intérieur d’un schéma ou d’un contexte donnés. @fr
label: is benaming van corporatie van @nl
definition: Relateert een nomen aan een corporatie die aangeduid wordt door een nomen gebruikt binnen een bepaald schema of context @nl
toolkit label: benaming van corporatie van @nl
toolkit definition: Een corporatie die aangeduid wordt door een nomen gebruikt binnen een bepaald schema of context @nl
label: هو اسم هيئة لـ @ar
definition: يربط تسمية بهيئة يشار إليها بتسمية مستخدمة في خطة أو في سياق معين. @ar
toolkit label: اسم هيئة لـ @ar
toolkit definition: هيئة يشار إليها بتسمية مستخدمة في خطة أو في سياق معين. @ar
label: és apel·lació d’entitat corporativa de @ca
definition: Relaciona un nomen amb una entitat corporativa que fa referència a un nomen usat en un esquema o un context determinat. @ca
toolkit label: apel·lació d’entitat corporativa de @ca
toolkit definition: Entitat corporativa que fa referència a un nomen usat en un esquema o un context determinat. @ca
label: er benævnelse på korporation af @da
definition: Relaterer et nomen til en korporation, som henvises til af et nomen, som anvendes inden for et givet skema eller kontekst. @da
toolkit label: benævnelse på korporation af @da
toolkit definition: Korporation, som henvises til af et nomen, som anvendes inden for et givet skema eller kontekst. @da
label: nimetus asutusele @et
definition: Seostab nomen'i asutusega, kellele antud süsteemis või kontekstis nomen'iga viidatakse. @et
toolkit label: nimetus asutusele @et
toolkit definition: Asutus, kellele antud süsteemis või kontekstis nomen'iga viidatakse. @et
label: ist Bezeichnung für eine Körperschaft von @de
definition: Setzt ein Nomen in Beziehung zu einer Körperschaft, auf die mit einem Nomen referenziert wird, das in einem bestimmten Schema oder Kontext verwendet wird. @de
toolkit label: Bezeichnung für eine Körperschaft von @de
toolkit definition: Eine Körperschaft, auf die mit einem Nomen referenziert wird, das in einem bestimmten Schema oder Kontext verwendet wird. @de
label: megnevezése a következő testületnek: @hu
definition: Hozzákapcsol egy noment egy testülethez, amelyre egy adott sémában vagy kontextusban használt nomen hivatkozik. @hu
toolkit label: megnevezése a következő testületnek: @hu
toolkit definition: Egy testület, amelyre egy adott sémában vagy kontextusban használt nomen hivatkozik. @hu
label: è denominazione di ente di @it
definition: Correla un nomen a un ente a cui si fa riferimento con un nomen usato in un dato schema o contesto. @it
toolkit label: denominazione di ente di @it
toolkit definition: Un ente a cui si fa riferimento con un nomen usato in un dato schema o contesto. @it
label: ir apzīmējums institūcijai @lv
definition: Sasaista nomenu ar institūciju, uz kuru attiecas nomens, ko lieto konkrētajā sistēmā vai kontekstā. @lv
toolkit label: ir apzīmējums institūcijai @lv
toolkit definition: Institūcija, uz kuru attiecas nomens, ko lieto konkrētajā sistēmā vai kontekstā. @lv
label: 是……的团体的称谓 @zh-hans
definition: 将一个命名与在一个给定的体系或语境中用一个命名指称的一个团体关联起来。 @zh-hans
toolkit label: ……的团体的称谓 @zh-hans
toolkit definition: 在一个给定的体系或语境中用一个命名指称的一个团体 @zh-hans
has subproperty: is access point for corporate body of
has subproperty: is identifier for corporate body of
has subproperty: is name of corporate body of
has subproperty: P80030
label: tüzel kişisinin unvanıdır @tr
definition: Bir ismi, belirli bir şema veya bağlam içinde kullanılan bir isimle atıfta bulunulan bir tüzel kişilikle ilişkilendirir. @tr
toolkit label: tüzel kişinin unvanı @tr
toolkit definition: Belirli bir şema veya bağlam içinde kullanılan bir nomenle anılan tüzel kişi. @tr

is appellation of expression of
status: Published
type: Property
lexical alias: appellationOfExpressionOf.en
definition: Relates a nomen to an expression that is referred to by a nomen used within a given scheme or context.
domain: C10012
toolkit label: appellation of expression of
toolkit definition: An expression that is referred to by a nomen used within a given scheme or context.
sub property of: has related expression of nomen
sub property of: is appellation of RDA entity of
has element type: 2
label: nimitys ekspressiolle @fi
definition: Liittää nomenin ekspressioon, johon viitataan tietyssä järjestelmässä tai kontekstissa käytetyllä nomenilla. @fi
toolkit label: nimitys ekspressiolle @fi
toolkit definition: Ekspressio, johon viitataan tietyssä järjestelmässä tai kontekstissa käytetyllä nomenilla. @fi
label: er betegnelse for uttrykk for @no
definition: Relaterer et nomen til et uttrykk som refereres til med et nomen brukt innenfor et bestemt skjema eller kontekst. @no
toolkit label: betegnelse for uttrykk for @no
toolkit definition: Et uttrykk som refereres til med et nomen brukt innenfor et bestemt skjema eller kontekst. @no
label: est une appellation d’expression de @fr
definition: Met un nomen en relation avec une expression qui est désignée par un nomen utilisé à l’intérieur d’un schéma ou d’un contexte donnés. @fr
toolkit label: appellation d’expression de @fr
toolkit definition: Expression qui est désignée par un nomen utilisé à l’intérieur d’un schéma ou d’un contexte donnés. @fr
label: is benaming van expressie van @nl
definition: Relateert een nomen aan een expressie die aangeduid wordt door een nomen gebruikt binnen een bepaald schema of context @nl
toolkit label: benaming van expressie van @nl
toolkit definition: Een expressie die aangeduid wordt door een nomen gebruikt binnen een bepaald schema of context @nl
label: هو اسم تعبيرة لـ @ar
definition: يربط تسمية بتعبيرة يشار إليها بتسمية مستخدمة في خطة أو في سياق معين. @ar
toolkit label: اسم تعبيرة لـ @ar
toolkit definition: تعبيرة يشار إليها بتسمية مستخدمة في خطة أو في سياق معين. @ar
label: és apel·lació d’expressió de @ca
definition: Relaciona un nomen amb una expressió que fa referència a un nomen usat en un esquema o un context determinat. @ca
toolkit label: apel·lació d’expressió de @ca
toolkit definition: Expressió que fa referència a un nomen usat en un esquema o un context determinat. @ca
label: er benævnelse på udtryk af @da
definition: Relaterer et nomen til et udtryk, som henvises til af et nomen, som anvendes inden for et givet skema eller kontekst. @da
toolkit label: benævnelse på udtryk af @da
toolkit definition: Udtryk, som henvises til af et nomen, som anvendes inden for et givet skema eller kontekst. @da
label: nimetus väljendusele @et
definition: Seostab nomen'i väljendusega, millele antud süsteemis või kontekstis nomen'iga viidatakse. @et
toolkit label: nimetus väljendusele @et
toolkit definition: Väljendus, millele antud süsteemis või kontekstis nomen'iga viidatakse. @et
label: ist Bezeichnung für eine Expression von @de
definition: Setzt ein Nomen in Beziehung zu einer Expression, auf die mit einem Nomen referenziert wird, das in einem bestimmten Schema oder Kontext verwendet wird. @de
toolkit label: Bezeichnung für eine Expression @de
toolkit definition: Eine Expression, auf die mit einem Nomen referenziert wird, das in einem bestimmten Schema oder Kontext verwendet wird. @de
label: megnevezése a következő kifejezési formának: @hu
definition: Hozzákapcsol egy noment egy kifejezési formához, amelyre egy adott sémában vagy kontextusban használt nomen hivatkozik. @hu
toolkit label: megnevezése a következő kifejezési formának: @hu
toolkit definition: Egy kifejezési forma, amelyre egy adott sémában vagy kontextusban használt nomen hivatkozik. @hu
label: è denominazione di espressione di @it
definition: Correla un nomen a un'espressione a cui si fa riferimento con un nomen usato in un dato schema o contesto. @it
toolkit label: denominazione di espressione di @it
toolkit definition: Un'espressione a cui si fa riferimento con un nomen usato in un dato schema o contesto. @it
label: ir apzīmējums izteiksmei @lv
definition: Sasaista nomenu ar izteiksmi, uz kuru attiecas nomens, ko lieto konkrētajā sistēmā vai kontekstā. @lv
toolkit label: apzīmējums izteiksmei @lv
toolkit definition: Izteiksme, uz kuru attiecas nomens, ko lieto konkrētajā sistēmā vai kontekstā. @lv
label: 是……的内容表达的称谓 @zh-hans
definition: 将一个命名与在一个给定的体系或语境中用一个命名指称的一种内容表达关联起来。 @zh-hans
toolkit label: ……的内容表达的称谓 @zh-hans
toolkit definition: 在一个给定的体系或语境中用一个命名指称的一种内容表达 @zh-hans
has subproperty: is access point for expression of
has subproperty: is identifier for expression of
has subproperty: is title of expression of
has subproperty: P80038
label: anlatımının unvanıdır @tr
definition: Bir ismi, belirli bir şema veya bağlam içinde kullanılan bir isim tarafından atıfta bulunulan bir anlatımla ilişkilendirir. @tr
toolkit label: anlatımın unvanı @tr
toolkit definition: Belirli bir şema veya bağlam içinde kullanılan bir isimle anılan bir anlatım. @tr

is appellation of family of
status: Published
type: Property
lexical alias: appellationOfFamilyOf.en
definition: Relates a nomen to a family who is referred to by a nomen used within a given scheme or context.
domain: C10012
toolkit label: appellation of family of
toolkit definition: A family who is referred to by a nomen used within a given scheme or context.
sub property of: has related family of nomen
sub property of: is appellation of collective agent of
has element type: 2
label: nimitys suvulle @fi
definition: Liittää nomenin sukuun, johon viitataan tietyssä järjestelmässä tai kontekstissa käytetyllä nomenilla. @fi
toolkit label: nimitys suvulle @fi
toolkit definition: Suku, johon viitataan tietyssä järjestelmässä tai kontekstissa käytetyllä nomenilla. @fi
label: er betegnelse for familie for @no
definition: Relaterer et nomen til en familie som refereres til med et nomen brukt innenfor et bestemt skjema eller kontekst. @no
toolkit label: betegnelse for familie for @no
toolkit definition: En familie som refereres til med et nomen brukt innenfor et bestemt skjema eller kontekst. @no
label: est une appellation de famille de @fr
definition: Met un nomen en relation avec une famille qui est désignée par un nomen utilisé à l’intérieur d’un schéma ou d’un contexte donnés. @fr
toolkit label: appellation de famille de @fr
toolkit definition: Famille qui est désignée par un nomen utilisé à l’intérieur d’un schéma ou d’un contexte donnés. @fr
label: is benaming van familie van @nl
definition: Relateert een nomen aan een familie die aangeduid wordt door een nomen gebruikt binnen een bepaald schema of context @nl
toolkit label: benaming van familie van @nl
toolkit definition: Een familie die aangeduid wordt door een nomen gebruikt binnen een bepaald schema of context @nl
label: هو اسم عائلة لـ @ar
definition: يربط تسمية بعائلة يشار إليها بتسمية مستخدمة في خطة أو في سياق معين. @ar
toolkit label: اسم عائلة لـ @ar
toolkit definition: عائلة يشار إليها بتسمية مستخدمة في خطة أو في سياق معين. @ar
label: és apel·lació de família de @ca
definition: Relaciona un nomen amb una família que fa referència a un nomen usat en un esquema o un context determinat. @ca
toolkit label: apel·lació de família de @ca
toolkit definition: Família que fa referència a un nomen usat en un esquema o un context determinat. @ca
label: er benævnelse på familie af @da
definition: Relaterer et nomen til en familie, som henvises til af et nomen, som anvendes inden for et givet skema eller kontekst. @da
toolkit label: benævnelse på familie af @da
toolkit definition: Familie, som henvises til af et nomen, som anvendes inden for et givet skema eller kontekst. @da
label: nimetus perekonnale @et
definition: Seostab nomen'i perekonnaga, kellele antud süsteemis või kontekstis nomen'iga viidatakse. @et
toolkit label: nimetus perekonnale @et
toolkit definition: Perekond, kellele antud süsteemis või kontekstis nomen'iga viidatakse. @et
label: ist Bezeichnung für eine Familie von @de
definition: Setzt ein Nomen in Beziehung zu einer Familie, auf die mit einem Nomen referenziert wird, das in einem bestimmten Schema oder Kontext verwendet wird. @de
toolkit label: Bezeichnung für eine Familie von @de
toolkit definition: Eine Familie, auf die mit einem Nomen referenziert wird, das in einem bestimmten Schema oder Kontext verwendet wird. @de
label: megnevezése a következő családnak: @hu
definition: Hozzákapcsol egy noment egy családhoz, amelyre egy adott sémában vagy kontextusban használt nomen hivatkozik. @hu
toolkit label: megnevezése a következő családnak: @hu
toolkit definition: Egy család, amelyre egy adott sémában vagy kontextusban használt nomen hivatkozik. @hu
label: è denominazione di famiglia di @it
definition: Correla un nomen a una famiglia a cui si fa riferimento con un nomen usato in un dato schema o contesto @it
toolkit label: denominazione di famiglia di @it
toolkit definition: Una famiglia a cui si fa riferimento con un nomen usato in un dato schema o contesto. @it
label: ir apzīmējums dzimtai/ģimenei @lv
definition: Sasaista nomenu ar dzimtu/ģimeni, uz kuru attiecas nomens, ko lieto konkrētajā sistēmā vai kontekstā. @lv
toolkit label: ir apzīmējums dzimtai/ģimenei @lv
toolkit definition: Dzimta/ģimene, uz kuru attiecas nomens, ko lieto konkrētajā sistēmā vai kontekstā. @lv
label: 是……的家族的称谓 @zh-hans
definition: 将一个命名与在一个给定的体系或语境中用一个命名指称的一个家族关联起来。 @zh-hans
toolkit label: ……的家族的称谓 @zh-hans
toolkit definition: 在一个给定的体系或语境中用一个命名指称的一个家族 @zh-hans
has subproperty: is access point for family of
has subproperty: is identifier for family of
has subproperty: is name of family of
has subproperty: P80031
label: ailesinin unvanıdır @tr
definition: Bir ismi, belirli bir şema veya bağlam içinde kullanılan bir isim tarafından atıfta bulunulan bir aileyle ilişkilendirir. @tr
toolkit label: ailenin unvanı @tr
toolkit definition: Belirli bir şema veya bağlam içinde kullanılan bir nomenle anılan bir aile. @tr

is appellation of item of
status: Published
type: Property
lexical alias: appellationOfItemOf.en
definition: Relates a nomen to an item that is referred to by a nomen used within a given scheme or context.
domain: C10012
toolkit label: appellation of item of
toolkit definition: An item that is referred to by a nomen used within a given scheme or context.
sub property of: has related item of nomen
sub property of: is appellation of RDA entity of
has element type: 2
label: nimitys kappaleelle @fi
definition: Liittää nomenin kappaleeseen, johon viitataan tietyssä järjestelmässä tai kontekstissa käytetyllä nomenilla. @fi
toolkit label: nimitys kappaleelle @fi
toolkit definition: Kappale, johon viitataan tietyssä järjestelmässä tai kontekstissa käytetyllä nomenilla. @fi
label: er betegnelse for eksemplar for @no
definition: Relaterer et nomen til et eksemplar som refereres til med et nomen brukt innenfor et bestemt skjema eller kontekst. @no
toolkit label: betegnelse for eksemplar for @no
toolkit definition: Et eksemplar som refereres til med et nomen brukt innenfor et bestemt skjema eller kontekst. @no
label: est une appellation d’item de @fr
definition: Met un nomen en relation avec un item qui est désigné par un nomen utilisé à l’intérieur d’un schéma ou d’un contexte donnés. @fr
toolkit label: appellation d’item de @fr
toolkit definition: Item qui est désigné par un nomen utilisé à l’intérieur d’un schéma ou d’un contexte donnés. @fr
label: is benaming van item van @nl
definition: Relateert een nomen aan een item dat aangeduid wordt door een nomen gebruikt binnen een bepaald schema of context @nl
toolkit label: benaming van item van @nl
toolkit definition: Een item dat aangeduid wordt door een nomen gebruikt binnen een bepaald schema of context @nl
label: هي اسم مفردة لـ @ar
definition: يربط تسمية بمفردة يُشار إليها بتسمية مستخدمة في خطة أو في سياق معين. @ar
toolkit label: اسم مفردة لـ @ar
toolkit definition: مفردة يشار إليها بتسمية مستخدمة في خطة أو في سياق معين. @ar
label: és apel·lació d’ítem de @ca
definition: Relaciona un nomen amb un ítem que fa referència a un nomen usat en un esquema o un context determinat. @ca
toolkit label: apel·lació d’ítem de @ca
toolkit definition: Ítem que fa referència a un nomen usat en un esquema o un context determinat. @ca
label: er benævnelse på eksemplar af @da
definition: Relaterer et nomen til et eksemplar, som henvises til af et nomen, som anvendes inden for et givet skema eller kontekst. @da
toolkit label: benævnelse på eksemplar af @da
toolkit definition: Eksemplar, som henvises til af et nomen, som anvendes inden for et givet skema eller kontekst. @da
label: nimetus eksemplarile @et
definition: Seostab nomen'i eksemplariga, millele antud süsteemis või kontekstis nomen'iga viidatakse. @et
toolkit label: nimetus eksemplarile @et
toolkit definition: Eksemplar, millele antud süsteemis või kontekstis nomen'iga viidatakse. @et
label: ist Bezeichnung für ein Exemplar von @de
definition: Setzt ein Nomen in Beziehung zu einem Exemplar, auf das mit einem Nomen referenziert wird, das in einem bestimmten Schema oder Kontext verwendet wird. @de
toolkit label: Bezeichnung für ein Exemplar von @de
toolkit definition: Ein Exemplar, auf das mit einem Nomen referenziert wird, das in einem bestimmten Schema oder Kontext verwendet wird. @de
label: megnevezése a következő példánynak: @hu
definition: Hozzákapcsol egy noment egy példányhoz, amelyre egy adott sémában vagy kontextusban használt nomen hivatkozik. @hu
toolkit label: megnevezése a következő példánynak: @hu
toolkit definition: Egy példány, amelyre egy adott sémában vagy kontextusban használt nomen hivatkozik. @hu
label: è denominazione di item di @it
definition: Correla un nomen a un item a cui si fa riferimento con un nomen usato in un dato schema o contesto @it
toolkit label: denominazione di item di @it
toolkit definition: Un item a cui si fa riferimento con un nomen usato in un dato schema o contesto. @it
label: ir apzīmējums vienībai @lv
definition: Sasaista nomenu ar vienību, uz ko attiecas nomens, ko lieto konkrētāja sistēmā vai kontekstā. @lv
toolkit label: ir apzīmējums vienībai @lv
toolkit definition: Vienība, uz ko attiecas nomens, ko lieto konkrētāja sistēmā vai kontekstā. @lv
label: 是……的单件的称谓 @zh-hans
definition: 将一个命名与在一个给定的体系或语境中用一个命名指称的一个单件关联起来。 @zh-hans
toolkit label: ……的单件的称谓 @zh-hans
toolkit definition: 在一个给定的体系或语境中用一个命名指称的一个单件 @zh-hans
has subproperty: is access point for item of
has subproperty: is identifier for item of
has subproperty: is title of item of
has subproperty: P80016
label: kopyasının unvanıdır @tr
definition: Bir ismi, belirli bir şema veya bağlam içinde kullanılan bir isim tarafından atıfta bulunulan bir kopyayla ilişkilendirir. @tr
toolkit label: kopyanın unvanı @tr
toolkit definition: Belirli bir şema veya bağlam içinde kullanılan bir isimle anılan bir kopya. @tr

is appellation of manifestation of
status: Published
type: Property
lexical alias: appellationOfManifestationOf.en
definition: Relates a nomen to a manifestation that is referred to by a nomen used within a given scheme or context.
domain: C10012
toolkit label: appellation of manifestation of
toolkit definition: A manifestation that is referred to by a nomen used within a given scheme or context.
sub property of: has related manifestation of nomen
sub property of: is appellation of RDA entity of
has element type: 2
label: nimitys manifestaatiolle @fi
definition: Liittää nomenin manifestaatioon, johon viitataan tietyssä järjestelmässä tai kontekstissa käytetyllä nomenilla. @fi
toolkit label: nimitys manifestaatiolle @fi
toolkit definition: Manifestaatio, johon viitataan tietyssä järjestelmässä tai kontekstissa käytetyllä nomenilla. @fi
label: er betegnelse for manifestasjon for @no
definition: Relaterer et nomen til en manifestasjon som refereres til med et nomen brukt innenfor et bestemt skjema eller kontekst. @no
toolkit label: betegnelse for manifestasjon for @no
toolkit definition: En manifestasjon som refereres til med et nomen brukt innenfor et bestemt skjema eller kontekst. @no
label: est une appellation de manifestation de @fr
definition: Met un nomen en relation avec une manifestation qui est désignée par un nomen utilisé à l’intérieur d’un schéma ou d’un contexte donnés. @fr
toolkit label: appellation de manifestation de @fr
toolkit definition: Manifestation qui est désignée par un nomen utilisé à l’intérieur d’un schéma ou d’un contexte donnés. @fr
label: is benaming van manifestatie van @nl
definition: Relateert een nomen aan een manifestatie die aangeduid wordt door een nomen gebruikt binnen een bepaald schema of context @nl
toolkit label: benaming van manifestatie van @nl
toolkit definition: Een manifestatie die aangeduid wordt door een nomen gebruikt binnen een bepaald schema of context @nl
label: هي تسمية لتجسيدة لـ @ar
definition: يربط تسمية بتجسيدة يشار إليها بتسمية مستخدمة في خطة أو في سياق معين. @ar
toolkit label: اسم تجسيدة لـ @ar
toolkit definition: تجسيدة يشار إليها بتسمية مستخدمة في خطة أو في سياق معين. @ar
label: és apel·lació de manifestació de @ca
definition: Relaciona un nomen amb una manifestació que fa referència a un nomen usat en un esquema o un context determinat. @ca
toolkit label: apel·lació de manifestació de @ca
toolkit definition: Manifestació que fa referència a un nomen usat en un esquema o un context determinat. @ca
label: er benævnelse på manifestation af @da
definition: Relaterer et nomen til en manifestation, som henvises til af et nomen, som anvendes inden for et givet skema eller kontekst. @da
toolkit label: benævnelse på manifestation af @da
toolkit definition: Manifestation, som henvises til af et nomen, som anvendes inden for et givet skema eller kontekst. @da
label: nimetus kehastusele @et
definition: Seostab nomen'i kehastusega, millele antud süsteemis või kontekstis nomen'iga viidatakse. @et
toolkit label: nimetus kehastusele @et
toolkit definition: Kehastus, millele antud süsteemis või kontekstis nomen'iga viidatakse. @et
label: ist Bezeichnung für eine Manifestation von @de
definition: Setzt ein Nomen in Beziehung zu einer Manifestation, auf die mit einem Nomen referenziert wird, das in einem bestimmten Schema oder Kontext verwendet wird. @de
toolkit label: Bezeichnung für eine Manifestation von @de
toolkit definition: Eine Manifestation, auf die mit einem Nomen referenziert wird, das in einem bestimmten Schema oder Kontext verwendet wird. @de
label: megnevezése a következő megjelenési formának: @hu
definition: Hozzákapcsol egy noment egy megjelenési formához, amelyre egy adott sémában vagy kontextusban használt nomen hivatkozik. @hu
toolkit label: megnevezése a következő megjelenésiformának: @hu
toolkit definition: Egy megjelenési forma, amelyre egy adott sémában vagy kontextusban használt nomen hivatkozik. @hu
label: è denominazione di manifestazione di @it
definition: Correla un nomen a una manifestazione a cui si fa riferimento con un nomen usato in un dato schema o contesto @it
toolkit label: denominazione di manifestazione di @it
toolkit definition: Una manifestazione a cui si fa riferimento con un nomen usato in un dato schema o contesto. @it
label: ir apzīmējums manifestācijai @lv
definition: Sasaista nomenu ar manifestāciju, uz ko attiecas nomens, ko lieto konkrētāja sistēmā vai kontekstā. @lv
toolkit label: ir apzīmējums manifestācijai @lv
toolkit definition: Manifestācija, uz ko attiecas nomens, ko lieto konkrētāja sistēmā vai kontekstā. @lv
label: 是……的载体表现的称谓 @zh-hans
definition: 将一个命名与在一个给定的体系或语境中用一个命名指称的一种载体表现关联起来。 @zh-hans
toolkit label: ……的载体表现的称谓 @zh-hans
toolkit definition: 在一个给定的体系或语境中用一个命名指称的一种载体表现 @zh-hans
has subproperty: is access point for manifestation of
has subproperty: is identifier for manifestation of
has subproperty: is title of manifestation of
has subproperty: P80040
label: gösteriminin unvanıdır @tr
definition: Bir ismi, belirli bir şema veya bağlam içinde kullanılan bir isim tarafından atıfta bulunulan bir gösterimle ilişkilendirir. @tr
toolkit label: gösterimin unvanı @tr
toolkit definition: Belirli bir şema veya bağlam içinde kullanılan bir nomenle anılan bir gösterim. @tr

is appellation of person of
status: Published
type: Property
lexical alias: appellationOfPersonOf.en
definition: Relates a nomen to a person who is referred to by a nomen used within a given scheme or context.
domain: C10012
toolkit label: appellation of person of
toolkit definition: A person who is referred to by a nomen used within a given scheme or context.
sub property of: has related person of nomen
sub property of: is appellation of agent of
has element type: 2
label: nimitys henkilölle @fi
definition: Liittää nomenin henkilöön, johon viitataan tietyssä järjestelmässä tai kontekstissa käytetyllä nomenilla. @fi
toolkit label: nimitys henkilölle @fi
toolkit definition: Henkilö, johon viitataan tietyssä järjestelmässä tai kontekstissa käytetyllä nomenilla. @fi
label: er betegnelse for person for @no
definition: Relaterer et nomen til en person som refereres til med et nomen brukt innenfor et bestemt skjema eller kontekst. @no
toolkit label: betegnelse for person for @no
toolkit definition: En person som refereres til med et nomen brukt innenfor et bestemt skjema eller kontekst. @no
label: est une appellation de personne de @fr
definition: Met un nomen en relation avec une personne qui est désignée par un nomen utilisé à l’intérieur d’un schéma ou d’un contexte donnés. @fr
toolkit label: appellation de personne de @fr
toolkit definition: Personne qui est désignée par un nomen utilisé à l’intérieur d’un schéma ou d’un contexte donnés. @fr
label: is benaming van persoon van @nl
definition: Relateert een nomen aan een persoon die aangeduid wordt door een nomen gebruikt binnen een bepaald schema of context @nl
toolkit label: benaming van persoon van @nl
toolkit definition: Een persoon die aangeduid wordt door een nomen gebruikt binnen een bepaald schema of context @nl
label: هو اسم شخص لـ @ar
definition: يربط تسمية بشخص يشار إليه بتسمية مستخدمة في خطة أو في سياق معين. @ar
toolkit label: اسم شخص لـ @ar
toolkit definition: شخص يشار إليه بتسمية مستخدمة في خطة أو في سياق معين. @ar
label: és apel·lació de persona de @ca
definition: Relaciona un nomen amb una persona que fa referència a un nomen usat en un esquema o un context determinat. @ca
toolkit label: apel·lació de persona de @ca
toolkit definition: Persona que fa referència a un nomen usat en un esquema o un context determinat. @ca
label: er benævnelse på person af @da
definition: Relaterer et nomen til en person, som henvises til af et nomen, som anvendes inden for et givet skema eller kontekst. @da
toolkit label: benævnelse på person af @da
toolkit definition: Person, som henvises til af et nomen, som anvendes inden for et givet skema eller kontekst. @da
label: nimetus isikule @et
definition: Seostab nomen'i isikuga, kellele antud süsteemis või kontekstis nomen'iga viidatakse. @et
toolkit label: nimetus isikule @et
toolkit definition: Isik, kellele antud süsteemis või kontekstis nomen'iga viidatakse. @et
label: ist Bezeichnung für eine Person von @de
definition: Setzt ein Nomen in Beziehung zu einer Person, auf die mit einem Nomen referenziert wird, das in einem bestimmten Schema oder Kontext verwendet wird. @de
toolkit label: Bezeichnung für eine Person von @de
toolkit definition: Eine Person, auf die mit einem Nomen referenziert wird, das in einem bestimmten Schema oder Kontext verwendet wird. @de
label: megnevezése a következő személynek: @hu
definition: Hozzákapcsol egy noment egy személyhez, akire egy adott sémában vagy kontextusban használt nomen hivatkozik. @hu
toolkit label: megnevezése a következő személynek: @hu
toolkit definition: Egy személy, akire egy adott sémában vagy kontextusban használt nomen hivatkozik. @hu
label: è denominazione di persona di @it
definition: Correla un nomen a una persona a cui si fa riferimento con un nomen usato in un dato schema o contesto @it
toolkit label: denominazione di persona di @it
toolkit definition: Una persona a cui si fa riferimento con un nomen usato in un dato schema o contesto. @it
label: ir apzīmējums personai @lv
definition: Sasaista nomenu ar personu, uz kuru attiecas nomens, ko lieto konkrētajā sistēmā vai kontekstā. @lv
toolkit label: ir apzīmējums personai @lv
toolkit definition: Persona, uz kuru attiecas nomens, ko lieto konkrētajā sistēmā vai kontekstā. @lv
label: 是……的个人的称谓 @zh-hans
definition: 将一个命名与在一个给定的体系或语境中用一个命名指称的一个个人关联起来。 @zh-hans
toolkit label: ……的个人的称谓 @zh-hans
toolkit definition: 在一个给定的体系或语境中用一个命名指称的一个个人 @zh-hans
has subproperty: is access point for person of
has subproperty: is alternate identity of person of
has subproperty: is identifier for person of
has subproperty: is name of person of
has subproperty: is real identity of person of
has subproperty: P80032
label: kişisinin unvanıdır @tr
definition: Bir ismi, belirli bir şema veya bağlam içinde kullanılan bir isim tarafından atıfta bulunulan bir kişiyle ilişkilendirir. @tr
toolkit label: kişinin unvanı @tr
toolkit definition: Belirli bir şema veya bağlam içinde kullanılan bir isimle anılan kişi. @tr

is appellation of place of
status: Published
type: Property
lexical alias: appellationOfPlaceOf.en
definition: Relates a nomen to a place that is referred to by a nomen used within a given scheme or context.
domain: C10012
toolkit label: appellation of place of
toolkit definition: A place that is referred to by a nomen used within a given scheme or context.
sub property of: has related place of nomen
sub property of: is appellation of RDA entity of
has element type: 2
label: nimitys paikalle @fi
definition: Liittää nomenin paikkaan, johon viitataan tietyssä järjestelmässä tai kontekstissa käytetyllä nomenilla. @fi
toolkit label: nimitys paikalle @fi
toolkit definition: Paikka, johon viitataan tietyssä järjestelmässä tai kontekstissa käytetyllä nomenilla. @fi
label: er betegnelse for sted for @no
definition: Relaterer et nomen til et sted som refereres til med et nomen brukt innenfor et bestemt skjema eller kontekst. @no
toolkit label: betegnelse for sted for @no
toolkit definition: Et sted som refereres til med et nomen brukt innenfor et bestemt skjema eller kontekst. @no
label: est une appellation de lieu de @fr
definition: Met un nomen en relation avec un lieu qui est désigné par un nomen utilisé à l’intérieur d’un schéma ou d’un contexte donnés. @fr
toolkit label: appellation de lieu de @fr
toolkit definition: Lieu qui est désigné par un nomen utilisé à l’intérieur d’un schéma ou d’un contexte donnés. @fr
label: is benaming van plaats van @nl
definition: Relateert een nomen aan een plaats die aangeduid wordt door een nomen gebruikt binnen een bepaald schema of context @nl
toolkit label: benaming van plaats van @nl
toolkit definition: Een plaats die aangeduid wordt door een nomen gebruikt binnen een bepaald schema of context @nl
label: هي تسمية لمكان لـ @ar
definition: يربط تسمية بمكان يشار إليه بتسمية مستخدمة في خطة أو في سياق معين. @ar
toolkit label: اسم مكان لـ @ar
toolkit definition: مكان يشار إليه بتسمية مستخدمة في خطة أو في سياق معين. @ar
label: és apel·lació de lloc de @ca
definition: Relaciona un nomen amb un lloc que fa referència a un nomen usat en un esquema o un context determinat. @ca
toolkit label: apel·lació de lloc de @ca
toolkit definition: Lloc que fa referència a un nomen usat en un esquema o un context determinat. @ca
label: er benævnelse på sted af @da
definition: Relaterer et nomen til et sted, som henvises til af et nomen, som anvendes inden for et givet skema eller kontekst. @da
toolkit label: benævnelse på sted af @da
toolkit definition: Sted, som henvises til af et nomen, som anvendes inden for et givet skema eller kontekst. @da
label: nimetus kohale @et
definition: Seostab nomen'i kohaga, millele antud süsteemis või kontekstis nomen'iga viidatakse. @et
toolkit label: nimetus kohale @et
toolkit definition: Koht, millele antud süsteemis või kontekstis nomen'iga viidatakse. @et
label: ist Bezeichnung für ein Geografikum von @de
definition: Setzt ein Nomen in Beziehung zu einem Geografikum, auf das mit einem Nomen referenziert wird, das in einem bestimmten Schema oder Kontext verwendet wird. @de
toolkit label: Bezeichnung für ein Geografikum von @de
toolkit definition: Ein Geografikum, auf das mit einem Nomen referenziert wird, das in einem bestimmten Schema oder Kontext verwendet wird. @de
label: megnevezése a következő helynek: @hu
definition: Hozzákapcsol egy noment egy helyhez, amelyre egy adott sémában vagy kontextusban használt nomen hivatkozik. @hu
toolkit label: megnevezése a következő helynek: @hu
toolkit definition: Egy hely, amelyre egy adott sémában vagy kontextusban használt nomen hivatkozik. @hu
label: è denominazione di luogo di @it
definition: Correla un nomen a un luogo a cui si fa riferimento con un nomen usato in un dato schema o contesto @it
toolkit label: denominazione di luogo di @it
toolkit definition: Un luogo a cui si fa riferimento con un nomen usato in un dato schema o contesto. @it
label: ir apzīmējums vietai @lv
definition: Sasaista nomenu ar vietu, uz kuru attiecas nomens, ko lieto konkrētajā sistēmā vai kontekstā. @lv
toolkit label: apzīmējums vietai @lv
toolkit definition: Vieta, uz kuru attiecas nomens, ko lieto konkrētajā sistēmā vai kontekstā. @lv
label: 是……的地点的称谓 @zh-hans
definition: 将一个命名与在一个给定的体系或语境中用一个命名指称的一个地点关联起来。 @zh-hans
toolkit label: ……的地点的称谓 @zh-hans
toolkit definition: 在一个给定的体系或语境中用一个命名指称的一个地点 @zh-hans
has subproperty: is access point for place of
has subproperty: is identifier for place of
has subproperty: is name of place of
has subproperty: P80041
label: yerinin unvanıdır @tr
definition: Bir ismi, belirli bir şema veya bağlam içinde kullanılan bir isim tarafından atıfta bulunulan bir yerle ilişkilendirir. @tr
toolkit label: yerin unvanı @tr
toolkit definition: Belirli bir şema veya bağlam içinde kullanılan bir isimle anılan bir yer. @tr

is appellation of RDA entity of
status: Published
type: Property
lexical alias: appellationOfRDAEntityOf.en
definition: Relates a nomen to an RDA entity that is referred to by a nomen used within a given scheme or context.
domain: C10012
toolkit label: appellation of RDA entity of
toolkit definition: An RDA entity that is referred to by a nomen used within a given scheme or context.
sub property of: has related RDA entity of nomen
has element type: 2
label: nimitys RDA-entiteetille @fi
definition: Liittää nomenin RDA-entiteettiin, johon viitataan tietyssä järjestelmässä tai kontekstissa käytetyllä nomenilla. @fi
toolkit label: nimitys RDA-entiteetille @fi
toolkit definition: RDA-entiteetti, johon viitataan tietyssä järjestelmässä tai kontekstissa käytetyllä nomenilla. @fi
label: er betegnelse for RDA-entitet for @no
definition: Relaterer et nomen til en RDA-entitet som refereres til med et nomen brukt innenfor et bestemt skjema eller kontekst. @no
toolkit label: betegnelse for RDA-entitet for @no
toolkit definition: En RDA-entitet som refereres til med et nomen brukt innenfor et bestemt skjema eller kontekst. @no
label: est une appellation d’entité RDA de @fr
definition: Met un nomen en relation avec une entité RDA qui est désignée par un nomen utilisé à l’intérieur d’un schéma ou d’un contexte donnés. @fr
toolkit label: appellation d’entité RDA de @fr
toolkit definition: Entité RDA qui est désignée par un nomen utilisé à l’intérieur d’un schéma ou d’un contexte donnés. @fr
label: is benaming van RDA-entiteit van @nl
definition: Relateert een nomen aan een RDA-entiteit die aangeduid wordt door een nomen gebruikt binnen een bepaald schema of context @nl
toolkit label: benaming van RDA-entiteit van @nl
toolkit definition: Een RDA-entiteit die aangeduid wordt door een nomen gebruikt binnen een bepaald schema of context @nl
label: هو اسم كيان "وام" لـ @ar
definition: يربط تسمية بكيان "وام" يشار إليه بتسمية مستخدمة في خطة أو في سياق معين. @ar
toolkit label: اسم لكيان "وام" لـ @ar
toolkit definition: كيان "وام" يشار إليه بتسمية مستخدمة في خطة أو في سياق معين. @ar
label: és apel·lació d’entitat RDA de @ca
definition: Relaciona un nomen amb una entitat RDA que fa referència a un nomen usat en un esquema o un context determinat. @ca
toolkit label: apel·lació d’entitat RDA de @ca
toolkit definition: Entitat RDA que fa referència a un nomen usat en un esquema o un context determinat. @ca
label: er benævnelse på RDA-entitet af @da
definition: Relaterer et nomen til en RDA-entitet, som henvises til af et nomen, som anvendes inden for et givet skema eller kontekst. @da
toolkit label: benævnelse på RDA-entitet af @da
toolkit definition: RDA-entitet, som henvises til af et nomen, som anvendes inden for et givet skema eller kontekst. @da
label: nimetus RDA olemile @et
definition: Seostab nomen'i RDA olemiga, millele antud süsteemis või kontekstis nomen'iga viidatakse. @et
toolkit label: nimetus RDA olemile @et
toolkit definition: RDA olem, millele antud süsteemis või kontekstis nomen'iga viidatakse. @et
label: ist Bezeichnung für eine RDA-Entität von @de
definition: Setzt ein Nomen in Beziehung zu einer RDA-Entität, auf die mit einem Nomen referenziert wird, das in einem bestimmten Schema oder Kontext verwendet wird. @de
toolkit label: Bezeichnung für eine RDA-Entität von @de
toolkit definition: Eine RDA-Entität, auf die ein Nomen verweist, das in einem bestimmten Schema oder Kontext verwendet wird. @de
label: megnevezése a következő RDA-entitásnak: @hu
definition: Hozzákapcsol egy noment egy RDA-entitáshoz, amelyre egy adott sémában vagy kontextusban használt nomen hivatkozik. @hu
toolkit label: megnevezése a következő RDA-entitásnak: @hu
toolkit definition: Egy RDA-entitás, amelyre egy adott sémában vagy kontextusban használt nomen hivatkozik. @hu
label: è denominazione di entità RDA di @it
definition: Correla un nomen a un'entità RDA a cui si fa riferimento con un nomen usato in un dato schema o contesto. @it
toolkit label: denominazione di entità RDA di @it
toolkit definition: Un'entità RDA a cui si fa riferimento con un nomen usato in un dato schema o contesto. @it
label: ir apzīmējums RDA entītei @lv
definition: Sasaista nomenu ar RDA entīti, uz kuru attiecas nomens, ko lieto konkrētajā sistēmā vai kontekstā. @lv
toolkit label: apzīmējums RDA entītei @lv
toolkit definition: RDA entīte, uz kuru attiecas nomens, ko lieto konkrētajā sistēmā vai kontekstā. @lv
label: 是……的RDA实体的称谓 @zh-hans
definition: 将一个命名与在一个给定的体系或语境中用一个命名指称的一个RDA实体关联起来。 @zh-hans
toolkit label: ……的RDA实体的称谓 @zh-hans
toolkit definition: 在一个给定的体系或语境中用一个命名指称的一个RDA实体 @zh-hans
has subproperty: is access point for RDA entity of
has subproperty: is appellation of agent of
has subproperty: is appellation of expression of
has subproperty: is appellation of item of
has subproperty: is appellation of manifestation of
has subproperty: is appellation of place of
has subproperty: is appellation of timespan of
has subproperty: is appellation of work of
has subproperty: is identifier for RDA entity of
has subproperty: is name of RDA entity of
has subproperty: P80112
label: RDA varlığının unvanıdır @tr
definition: Bir ismi, belirli bir şema veya bağlam içinde kullanılan bir niteleyici isim tarafından başvurulan bir RDA varlığıyla ilişkilendirir. @tr
toolkit label: RDA varlığının unvanı @tr
toolkit definition: Belirli bir şema veya bağlamda kullanılan bir isimle anılan bir RDA varlığı. @tr

is appellation of timespan of
status: Published
type: Property
lexical alias: appellationOfTimespanOf.en
definition: Relates a nomen to a timespan that is referred to by a nomen used within a given scheme or context.
domain: C10012
toolkit label: appellation of timespan of
toolkit definition: A timespan that is referred to by a nomen used within a given scheme or context.
sub property of: has related timespan of nomen
sub property of: is appellation of RDA entity of
has element type: 2
label: nimitys ajanjaksolle @fi
definition: Liittää nomenin ajanjaksoon, johon viitataan tietyssä järjestelmässä tai kontekstissa käytetyllä nomenilla. @fi
toolkit label: nimitys ajanjaksolle @fi
toolkit definition: Ajanjakso, johon viitataan tietyssä järjestelmässä tai kontekstissa käytetyllä nomenilla. @fi
label: er betegnelse for tidrom for @no
definition: Relaterer et nomen til et tidsrom som refereres til med et nomen brukt innenfor et bestemt skjema eller kontekst. @no
toolkit label: betegnelse for tidrom for @no
toolkit definition: Et tidsrom som refereres til med et nomen brukt innenfor et bestemt skjema eller kontekst. @no
label: est une appellation de laps de temps de @fr
definition: Met un nomen en relation avec un laps de temps qui est désigné par un nomen utilisé à l’intérieur d’un schéma ou d’un contexte donnés. @fr
toolkit label: appellation de laps de temps de @fr
toolkit definition: Laps de temps qui est désigné par un nomen utilisé à l’intérieur d’un schéma ou d’un contexte donnés. @fr
label: is benaming van tijdspanne van @nl
definition: Relateert een nomen aan een tijdspanne die aangeduid wordt door een nomen gebruikt binnen een bepaald schema of context @nl
toolkit label: benaming van tijdspanne van @nl
toolkit definition: Een tijdspanne die aangeduid wordt door een nomen gebruikt binnen een bepaald schema of context @nl
label: هو اسم فترة زمنية لـ @ar
definition: يربط تسمية بفترة زمنية يشار إليها بتسمية مستخدمة في خطة أو في سياق معين. @ar
toolkit label: اسم فترة زمنية لـ @ar
toolkit definition: فترة زمنية يشار إليها بتسمية مستخدمة في خطة أو في سياق معين. @ar
label: és apel·lació d’interval de temps de @ca
definition: Relaciona un nomen amb un interval de temps que fa referència a un nomen usat en un esquema o un context determinat. @ca
toolkit label: apel·lació d’interval de temps de @ca
toolkit definition: Interval de temps que fa referència a un nomen usat en un esquema o un context determinat. @ca
label: er benævnelse på tidsperiode af @da
definition: Relaterer et nomen til en tidsperiode, som henvises til af et nomen, som anvendes inden for et givet skema eller kontekst. @da
toolkit label: benævnelse på tidsperiode af @da
toolkit definition: Tidsperiode, som henvises til af et nomen, som anvendes inden for et givet skema eller kontekst. @da
label: nimetus ajavahemikule @et
definition: Seostab nomen'i ajavahemikuga, millele antud süsteemis või kontekstis nomen'iga viidatakse. @et
toolkit label: nimetus ajavahemikule @et
toolkit definition: Ajavahemik, millele antud süsteemis või kontekstis nomen'iga viidatakse. @et
label: ist Bezeichnung für einen Zeitraum von @de
definition: Setzt ein Nomen in Beziehung zu einem Zeitraum, auf den mit einem Nomen referenziert wird, das in einem bestimmten Schema oder Kontext verwendet wird. @de
toolkit label: Bezeichnung für einen Zeitraum von @de
toolkit definition: Ein Zeitraum, auf den mit einem Nomen referenziert wird, das in einem bestimmten Schema oder Kontext verwendet wird. @de
label: megnevezése a következő időtartamnak: @hu
definition: Hozzákapcsol egy noment egy időtartamhoz, amelyre egy adott sémában vagy kontextusban használt nomen hivatkozik. @hu
toolkit label: megnevezése a következő időtartamnak: @hu
toolkit definition: Egy időtartam, amelyre egy adott sémában vagy kontextusban használt nomen hivatkozik. @hu
label: è denominazione di arco di tempo di @it
definition: Correla un nomen a un arco di tempo a cui si fa riferimento con un nomen usato in un dato schema o contesto. @it
toolkit label: denominazione di arco di tempo di @it
toolkit definition: Un arco di tempo a cui si fa riferimento con un nomen usato in un dato schema o contesto. @it
label: ir apzīmējums laikposmam @lv
definition: Sasaista nomenu ar laikposmu, uz kuru attiecas nomens, ko lieto konkrētajā sistēmā vai kontekstā. @lv
toolkit label: apzīmējums laikposmam @lv
toolkit definition: Laikposms, uz kuru attiecas nomens, ko lieto konkrētajā sistēmā vai kontekstā. @lv
label: 是……的时间段的称谓 @zh-hans
definition: 将一个命名与在一个给定的体系或语境中用一个命名指称的一个时间段关联起来。 @zh-hans
toolkit label: ……的时间段的称谓 @zh-hans
toolkit definition: 在一个给定的体系或语境中用一个命名指称的一个时间段 @zh-hans
has subproperty: is access point for timespan of
has subproperty: is identifier for timespan of
has subproperty: is name of timespan of
has subproperty: P80043
label: zaman aralığının unvanıdır @tr
definition: Bir ismi, belirli bir şema veya bağlam içinde kullanılan bir isim tarafından atıfta bulunulan bir zaman aralığı ile ilişkilendirir. @tr
toolkit label: zaman aralığının unvanı @tr
toolkit definition: Belirli bir şema veya bağlam içerisinde kullanılan bir ismin ifade ettiği zaman aralığı. @tr

is appellation of work group of
status: Published
lexical alias: appellationOfWorkGroupOf.en
definition: Relates a nomen to work that is referred to by a nomen used within a given scheme or context to refer to a work as a member of a work group.
toolkit label: appellation of work group of
toolkit definition: A work that is referred to by a nomen used within a given scheme or context to refer to a work as a member of a work group.
type: Property
domain: C10012
sub property of: is appellation of work of
has element type: 2
label: nimitys teosryhmälle @fi
definition: Liittää nomenin teosryhmään kuuluvaan teokseen, johon viitataan tietyssä järjestelmässä tai kontekstissa käytetyllä nomenilla. @fi
toolkit label: nimitys teosryhmälle @fi
toolkit definition: Teosryhmään kuuluva teos, johon viitataan tietyssä järjestelmässä tai kontekstissa käytetyllä nomenilla. @fi
label: er betegnelse for verksgruppe for @no
definition: Relaterer et nomen til et verk som refereres til av et nomen som brukes innen et gitt skjema eller kontekst for å referere til et verk som et medlem av en verksgruppe. @no
toolkit label: betegnelse for verksgruppe for @no
toolkit definition: Et verk som refereres til av et nomen som brukes innen et gitt skjema eller kontekst for å referere til et verk som et medlem av en verksgruppe. @no
label: est une appellation de groupe d’œuvres de @fr
definition: Met un nomen en relation avec une œuvre qui est désignée par un nomen utilisé à l’intérieur d’un schéma ou d’un contexte donnés pour désigner une œuvre en tant que membre d’un groupe d’œuvres. @fr
toolkit label: appellation de groupe d’œuvres de @fr
toolkit definition: Œuvre qui est désignée par un nomen utilisé à l’intérieur d’un schéma ou d’un contexte donnés pour désigner une œuvre en tant que membre d’un groupe d’œuvres. @fr
label: is benaming van werkgroep van @nl
definition: Relateert een nomen aan een werk dat aangeduid wordt door een nomen gebruikt binnen een bepaald schema of context om een werk aan te duiden als lid van een werkgroep. @nl
toolkit label: benaming van werkgroep van @nl
toolkit definition: Een werk dat aangeduid wordt door een nomen gebruikt binnen een bepaald schema of context om een werk aan te duiden als lid van een werkgroep. @nl
label: هو اسم مجموعة عمل لـ @ar
definition: يربط تسمية بعمل يشار إليه بتسمية مستخدمة في خطة أو سياق معين للإشارة إلى عمل ضمن مجموعة عمل. @ar
toolkit label: اسم مجموعة عمل لـ @ar
toolkit definition: عمل يشار إليه بتسمية مستخدمة في خطة أو في سياق معين للإشارة إلى عمل ضمن مجموعة عمل. @ar
label: és apel·lació de grup d’obres de @ca
definition: Relaciona un nomen amb una obra a la qual fa referència un nomen usat en un esquema o un context determinat per referir-se a una obra com a membre d’un grup d’obres. @ca
toolkit label: apel·lació de grup d’obres de @ca
toolkit definition: Obra a la qual fa referència un nomen usat en un esquema o un context determinat per referir-se a una obra com a membre d’un grup d’obres. @ca
label: er benævnelse på værksgruppe af @da
definition: Relaterer et nomen til værk, som henvises til af et nomen, som anvendes inden for et givet skema eller kontekst for at referere til et værk, som et medlem af en værksgruppe. @da
toolkit label: benævnelse på værksgruppe af @da
toolkit definition: Værk, som henvises til af et nomen, som anvendes inden for et givet skema eller kontekst for at referere til et værk, som et medlem af en værksgruppe. @da
label: teoserühma nimetus teoses @et
definition: Seostab nomen'i teosega, millele viidatakse nomen'iga, mida antud süsteemis või kontekstis kasutatakse viitamiseks teosele kui teoserühma liikmele. @et
toolkit label: teoserühma nimetus teoses @et
toolkit definition: Teos, millele viidatakse nomen'iga, mida antud süsteemis või kontekstis kasutatakse viitamiseks teosele kui teoserühma liikmele. @et
label: ist Bezeichnung einer Werkgruppe von @de
definition: Setzt ein Nomen in Beziehung zu einem Werk, auf das mit einem Nomen referenziert wird, das in einem bestimmten Schema oder Kontext verwendet wird, um zu einem Werk als Teil einer Werkgruppe zu referenzieren. @de
toolkit label: Bezeichnung einer Werkgruppe von @de
toolkit definition: Ein Werk, auf das mit einem Nomen referenziert wird, das in einem bestimmten Schema oder Kontext verwendet wird, um zu einem Werk als Teil einer Werkgruppe zu referenzieren. @de
label: műcsoport-megnevezése a következőnek: @hu
definition: Hozzákapcsol egy noment egy műhöz, amelyre egy adott sémában vagy kontextusban használt nomen hivatkozik. @hu
toolkit label: műcsoport-megnevezése: @hu
toolkit definition: Egy mű, amelyre egy adott sémában vagy kontextusban használt nomen hivatkozik. @hu
label: è denominazione di gruppo di opere di @it
definition: Correla un nomen a un'opera a cui ci si riferisce con un nomen usato in un dato schema o contesto per riferirsi all'opera come membro di un gruppo di opere. @it
toolkit label: denominazione di gruppo di opere di @it
toolkit definition: Un'opera a cui ci si riferisce con un nomen usato in un dato schema o contesto per riferirsi all'opera come membro di un gruppo di opere. @it
label: ir apzīmējums darba grupai @lv
definition: Sasaista nomenu ar darbu, uz kuru attiecas nomens, ko lieto konkrētajā sistēmā vai kontekstā, lai atsauktos uz darbu kā darbu sakopojumu. @lv
toolkit label: ir apzīmējums darba grupai @lv
toolkit definition: Darbs, uz kuru attiecas nomens, ko lieto konkrētajā sistēmā vai kontekstā, lai atsauktos uz darbu kā darbu sakopojumu @lv
label: 是……的作品群的称谓 @zh-hans
definition: 将一个命名与在一个特定的体系或语境中被用来指称作为一个作品群之一个成员的一种作品的一个命名又被用来指称的一种作品关联起来。 @zh-hans
toolkit label: ……的作品群的称谓 @zh-hans
toolkit definition: 在一个特定的体系或语境中被用来指称作为一个作品群之一个成员的一种作品的一个命名又被用来指称的一种作品 @zh-hans
has subproperty: is authorized access point for work group of
has subproperty: is identifier for work group of
has subproperty: P80171
label: çalışma grubunun unvanıdır @tr
definition: Bir ismi, bir çalışma grubunun üyesi olarak bir çalışmaya atıfta bulunmak için belirli bir şema veya bağlamda kullanılan atıfta bulunulan eserle ilişkilendirir. @tr
toolkit label: eser grubunun unvanı @tr
toolkit definition: Bir çalışma grubunun üyesi olarak bir çalışmaya atıfta bulunmak için belirli bir şema veya bağlamda kullanılan bir isimle anılan bir çalışma. @tr

is appellation of work of
status: Published
type: Property
lexical alias: appellationOfWorkOf.en
definition: Relates a nomen to a work that is referred to by a nomen used within a given scheme or context.
domain: C10012
toolkit label: appellation of work of
toolkit definition: A work that is referred to by a nomen used within a given scheme or context.
sub property of: has related work of nomen
sub property of: is appellation of RDA entity of
has element type: 2
label: nimitys teokselle @fi
definition: Liittää nomenin teokseen, johon viitataan tietyssä järjestelmässä tai kontekstissa käytetyllä nomenilla. @fi
toolkit label: nimitys teokselle @fi
toolkit definition: Teos, johon viitataan tietyssä järjestelmässä tai kontekstissa käytetyllä nomenilla. @fi
label: er betegnelse for verk for @no
definition: Relaterer et nomen til et verk som refereres til med et nomen brukt innenfor et bestemt skjema eller kontekst. @no
toolkit label: betegnelse for verk for @no
toolkit definition: Et verk som refereres til med et nomen brukt innenfor et bestemt skjema eller kontekst. @no
label: est une appellation d’œuvre de @fr
definition: Met un nomen en relation avec une œuvre qui est désignée par un nomen utilisé à l’intérieur d’un schéma ou d’un contexte donnés. @fr
toolkit label: appellation d’œuvre de @fr
toolkit definition: Œuvre qui est désignée par un nomen utilisé à l’intérieur d’un schéma ou d’un contexte donnés. @fr
label: is benaming van werk van @nl
definition: Relateert een nomen aan een werk dat aangeduid wordt door een nomen gebruikt binnen een bepaald schema of context @nl
toolkit label: benaming van werk van @nl
toolkit definition: Een werk dat aangeduid wordt door een nomen gebruikt binnen een bepaald schema of context @nl
label: هو اسم عمل لـ @ar
definition: يربط تسمية بعمل يشار إليه بتسمية مستخدمة في خطة أو في سياق معين. @ar
toolkit label: اسم عمل لـ @ar
toolkit definition: عمل يشار إليه بتسمية مستخدمة في خطة أو في سياق معين. @ar
label: és apel·lació d’obra de @ca
definition: Relaciona un nomen amb una obra que fa referència a un nomen usat en un esquema o un context determinat. @ca
toolkit label: apel·lació d’obra de @ca
toolkit definition: Obra que fa referència a un nomen usat en un esquema o un context determinat. @ca
label: er benævnelse på værk af @da
definition: Relaterer et nomen til et værk, som henvises til af et nomen, som anvendes inden for et givet skema eller kontekst. @da
toolkit label: benævnelse på værk af @da
toolkit definition: Værk, som henvises til af et nomen, som anvendes inden for et givet skema eller kontekst. @da
label: nimetus teosele @et
definition: Seostab nomen'i teosega, millele antud süsteemis või kontekstis nomen'iga viidatakse. @et
toolkit label: nimetus teosele @et
toolkit definition: Teos, millele antud süsteemis või kontekstis nomen'iga viidatakse. @et
label: ist Bezeichnung für ein Werk von @de
definition: Setzt ein Nomen in Beziehung zu einem Werk, auf das mit einem Nomen referenziert wird, das in einem bestimmten Schema oder Kontext verwendet wird. @de
toolkit label: Bezeichnung für ein Werk von @de
toolkit definition: Ein Werk, auf das mit einem Nomen referenziert wird, das in einem bestimmten Schema oder Kontext verwendet wird. @de
label: megnevezése a következő műnek: @hu
definition: Hozzákapcsol egy noment egy műhöz, amelyre egy adott sémában vagy kontextusban használt nomen hivatkozik. @hu
toolkit label: megnevezése a következő műnek: @hu
toolkit definition: Egy mű, amelyre egy adott sémában vagy kontextusban használt nomen hivatkozik. @hu
label: è denominazione di opera di @it
definition: Correla un nomen a un'opera a cui si fa riferimento con un nomen usato in un dato schema o contesto. @it
toolkit label: denominazione di opera di @it
toolkit definition: Un'opera a cui si fa riferimento con un nomen usato in un dato schema o contesto. @it
label: ir apzīmējums darbam @lv
definition: Sasaista nomenu ar darbu, uz kuru attiecas nomens, ko lieto konkrētajā sistēmā vai kontekstā. @lv
toolkit label: apzīmējums darbam @lv
toolkit definition: Darbs, uz kuru attiecas nomens, ko lieto konkrētajā sistēmā vai kontekstā. @lv
label: 是……的作品的称谓 @zh-hans
definition: 将一个命名与在一个给定的体系或语境中用一个命名指称的一种作品关联起来。 @zh-hans
toolkit label: ……的作品的称谓 @zh-hans
toolkit definition: 在一个给定的体系或语境中用一个命名指称的一种作品 @zh-hans
has subproperty: is access point for work of
has subproperty: is appellation of work group of
has subproperty: is identifier for work of
has subproperty: is title of work of
has subproperty: P80045
label: eserin unvanıdır @tr
definition: Bir ismi, belirli bir şema veya bağlam içinde kullanılan bir isim tarafından atıfta bulunulan bir eserle ilişkilendirir. @tr
toolkit label: eserin unvanı @tr
toolkit definition: Belirli bir şema veya bağlam içinde kullanılan bir isimle anılan bir eser. @tr

is assigned by agent
status: Published
type: Property
lexical alias: assignedByAgent.en
domain: C10012
toolkit label: assigned by agent
definition: Relates a nomen to an agent who assigns a nomen to an entity.
toolkit definition: An agent who assigns a nomen to an entity.
sub property of: has related agent of nomen
has element type: 2
label: nomenin antava toimija @fi
definition: Liittää nomenin toimijaan, joka antaa entiteetille nomenin. @fi
toolkit label: nomenin antava toimija @fi
toolkit definition: Toimija, joka antaa entiteetille nomenin. @fi
label: er angitt av agent @no
definition: Relaterer et nomen til en agent som angir et nomen til en entitet. @no
toolkit label: angitt av agent @no
toolkit definition: En agent som angir et nomen til en entitet. @no
label: est attribué par un agent @fr
definition: Met un nomen en relation avec un agent qui attribue un nomen à une entité. @fr
toolkit label: attribué par un agent @fr
toolkit definition: Agent qui attribue un nomen à une entité. @fr
label: is toegekend door actor @nl
definition: Relateert een nomen aan een actor die een nomen toekent aan een entiteit. @nl
toolkit label: toegekend door actor @nl
toolkit definition: Een actor die een nomen toekent aan een entiteit. @nl
label: هي خصصها وكيل @ar
definition: يربط تسمية بوكيل يخصص تسمية لكيان. @ar
toolkit label: خصصها وكيل @ar
toolkit definition: وكيل يخصص تسمية لكيان. @ar
label: és assignat per un agent @ca
definition: Relaciona un nomen amb un agent que assigna un nomen a una entitat. @ca
toolkit label: assignat per un agent @ca
toolkit definition: Agent que assigna un nomen a una entitat. @ca
label: er angivet af agent @da
definition: Relaterer et nomen til en agent, som angiver et nomen til en entitet. @da
toolkit label: angivet af agent @da
toolkit definition: Agent, som angiver et nomen til en entitet. @da
label: nomen'i määranud tegija @et
definition: Seostab nomen'i tegijaga, kes on määranud nomen'i olemile. @et
toolkit label: nomen'i määranud tegija @et
toolkit definition: Tegija, kes on määranud nomen'i olemile. @et
label: ist von einem Akteur zugewiesen @de
definition: Setzt ein Nomen in Beziehung zu einem Akteur, der einer Entität ein Nomen zuweist. @de
toolkit label: von einem Akteur zugewiesen @de
toolkit definition: Ein Akteur, der einer Entität ein Nomen zuweist. @de
label: hozzárendelve a következő ágens által: @hu
definition: Hozzákapcsol egy noment egy ágenshez, amely hozzárendel egy noment egy entitáshoz. @hu
toolkit label: hozzárendelve a következő ágens által: @hu
toolkit definition: Egy ágens, amely hozzárendel egy noment egy entitáshoz. @hu
label: è assegnato da agente @it
definition: Correla un nomen a un agente che assegna un nomen a un'entità. @it
toolkit label: assegnato da agente @it
toolkit definition: Un agente che assegna un nomen a un'entità. @it
label: ir nomenu piešķīris (aģents) @lv
toolkit label: nomenu piešķīris (aģents) @lv
definition: Sasaista nomenu ar aģentu, kas piešķir entītei nomenu. @lv
toolkit definition: Aģents, kas piešķir entītei nomenu. @lv
label: 是被一个行为者分配 @zh-hans
toolkit label: 被一个行为者分配 @zh-hans
definition: 将一个命名与给一个实体分配一个命名的一个行为者关联起来。 @zh-hans
toolkit definition: 给一个实体分配一个命名的一个行为者 @zh-hans
has subproperty: is assigned by collective agent
has subproperty: is assigned by person
has subproperty: P80073
label: temsilci tarafından atanmıştır @tr
toolkit label: temsilci tarafından atanan @tr
definition: Bir ismi, bir varlığa bir niteleyici isim atayan bir temsilciyle ilişkilendirir. @tr
toolkit definition: Bir varlığa bir isim atayan bir temsilci. @tr

is assigned by collective agent
status: Published
type: Property
lexical alias: assignedByCollectiveAgent.en
domain: C10012
toolkit label: assigned by collective agent
definition: Relates a nomen to a collective agent who assigns a nomen to an entity.
toolkit definition: A collective agent who assigns a nomen to an entity.
sub property of: has related collective agent of nomen
sub property of: is assigned by agent
has element type: 2
label: nomenin antava yhteistoimija @fi
definition: Liittää nomenin yhteistoimijaan, joka antaa entiteetille nomenin. @fi
toolkit label: nomenin antava yhteistoimija @fi
toolkit definition: Yhteistoimija, joka antaa entiteetille nomenin. @fi
label: er angitt av kollektiv agent @no
definition: Relaterer et nomen til en kollektiv agent som angir et nomen til en entitet. @no
toolkit label: angitt av kollektiv agent @no
toolkit definition: En kollektiv agent som angir et nomen til en entitet. @no
label: est attribué par un agent collectif @fr
definition: Met un nomen en relation avec un agent collectif qui attribue un nomen à une entité. @fr
toolkit label: attribué par un agent collectif @fr
toolkit definition: Agent collectif qui attribue un nomen à une entité. @fr
label: is toegekend door collectieve actor @nl
definition: Relateert een nomen aan een collectieve actor die een nomen toekent aan een entiteit. @nl
toolkit label: toegekend door collectieve actor @nl
toolkit definition: Een collectieve actor die een nomen toekent aan een entiteit. @nl
label: هي خصصها وكيل جماعي @ar
definition: يربط تسمية بوكيل جماعي يخصص تسمية لكيان. @ar
toolkit label: خصصها وكيل جماعي @ar
toolkit definition: وكيل جماعي يخصص تسمية لكيان. @ar
label: és assignat per un agent col·lectiu @ca
definition: Relaciona un nomen amb un agent col·lectiu que assigna un nomen a una entitat. @ca
toolkit label: assignat per un agent col·lectiu @ca
toolkit definition: Agent col·lectiu que assigna un nomen a una entitat. @ca
label: er angivet af kollektiv agent @da
definition: Relaterer et nomen til en kollektiv agent, som angiver et nomen til en entitet. @da
toolkit label: angivet af kollektiv agent @da
toolkit definition: Kollektiv agent, som angiver et nomen til en entitet. @da
label: nomen'i määranud kollektiiv @et
definition: Seostab nomen'i kollektiiviga, kes on määranud nomen'i olemile. @et
toolkit label: nomen'i määranud kollektiiv @et
toolkit definition: Kollektiiv, kes on määranud nomen'i olemile. @et
label: ist von einem gemeinschaftlichen Akteur zugewiesen @de
definition: Setzt ein Nomen in Beziehung zu einem gemeinschaftlicher Akteur, der einer Entität ein Nomen zuweist. @de
toolkit label: von einem gemeinschaftlichen Akteur zugewiesen @de
toolkit definition: Ein gemeinschaftlicher Akteur, der einer Entität ein Nomen zuweist. @de
label: hozzárendelve a következő kollektív ágens által: @hu
definition: Hozzákapcsol egy noment egy kollektív ágenshez, amely hozzárendel egy noment egy entitáshoz. @hu
toolkit label: hozzárendelve a következő kollektív ágens által: @hu
toolkit definition: Egy kollektív ágens, amely hozzárendel egy noment egy entitáshoz. @hu
label: è assegnato da agente collettivo @it
definition: Correla un nomen a un agente collettivo che assegna un nomen a un'entità. @it
toolkit label: assegnato da agente collettivo @it
toolkit definition: Un agente collettivo che assegna un nomen a un'entità. @it
label: ir nomenu piešķīris (grupa) @lv
toolkit label: nomenu piešķīris (grupa) @lv
definition: Sasaista nomenu ar grupu, kas piešķir entītei nomenu. @lv
toolkit definition: Grupa, kas piešķir entītei nomenu. @lv
label: 是被一个集体行为者分配 @zh-hans
toolkit label: 被一个集体行为者分配 @zh-hans
definition: 将一个命名与给一个实体分配一个命名的一个集体行为者关联起来。 @zh-hans
toolkit definition: 给一个实体分配一个命名的一个集体行为者 @zh-hans
has subproperty: is assigned by corporate body
has subproperty: is assigned by family
has subproperty: P80074
label: kolektif temsilci tarafından atanmıştır @tr
toolkit label: kolektif temsilci tarafından atanan @tr
definition: Bir ismi, bir varlığa bir niteleyici isim atayan bir kolektif temsilciyle ilişkilendirir. @tr
toolkit definition: Bir varlığa nomen atayan kolektif bir temsilci. @tr

is assigned by corporate body
status: Published
type: Property
lexical alias: assignedByCorporateBody.en
domain: C10012
toolkit label: assigned by corporate body
definition: Relates a nomen to a corporate body who assigns a nomen to an entity.
toolkit definition: A corporate body who assigns a nomen to an entity.
sub property of: has related corporate body of nomen
sub property of: is assigned by collective agent
has element type: 2
label: nomenin antava yhteisö @fi
definition: Liittää nomenin yhteisöön, joka antaa entiteetille nomenin. @fi
toolkit label: nomenin antava yhteisö @fi
toolkit definition: Yhteisö, joka antaa entiteetille nomenin. @fi
label: er angitt av korporasjon @no
definition: Relaterer et nomen til en korporasjon som angir et nomen til en entitet. @no
toolkit label: angitt av korporasjon @no
toolkit definition: En korporasjon som angir et nomen til en entitet. @no
label: est attribué par une collectivité @fr
definition: Met un nomen en relation avec une collectivité qui attribue un nomen à une entité. @fr
toolkit label: attribué par une collectivité @fr
toolkit definition: Collectivité qui attribue un nomen à une entité. @fr
label: is toegekend door corporatie @nl
definition: Relateert een nomen aan een corporatie die een nomen toekent aan een entiteit. @nl
toolkit label: toegekend door corporatie @nl
toolkit definition: Een corporatie die een nomen toekent aan een entiteit. @nl
label: هي خصصتها هيئة @ar
definition: يربط تسمية بهيئة تخصص تسمية لكيان. @ar
toolkit label: خصصتها هيئة @ar
toolkit definition: هيئة تخصص تسمية لكيان. @ar
label: és assignat per una entitat corporativa @ca
definition: Relaciona un nomen amb una entitat corporativa que assigna un nomen a una entitat. @ca
toolkit label: assignat per una entitat corporativa @ca
toolkit definition: Entitat corporativa que assigna un nomen a una entitat. @ca
label: er angivet af korporation @da
definition: Relaterer et nomen til en korporation, som angiver et nomen til en entitet. @da
toolkit label: angivet af korporation @da
toolkit definition: Korporation, som angiver et nomen til en entitet. @da
label: nomen'i määranud asutus @et
definition: Seostab nomen'i asutusega, kes on määranud nomen'i olemile. @et
toolkit label: nomen'i määranud asutus @et
toolkit definition: Asutus, kes on määranud nomen'i olemile. @et
label: ist von einer Körperschaft zugewiesen @de
definition: Setzt ein Nomen in Beziehung zu einer Körperschaft, die einer Entität ein Nomen zuweist. @de
toolkit label: von einer Körperschaft zugewiesen @de
toolkit definition: Eine Körperschaft, die einer Entität ein Nomen zuweist. @de
label: hozzárendelve a következő testület által: @hu
definition: Hozzákapcsol egy noment egy testülethez, amely hozzárendel egy noment egy entitáshoz. @hu
toolkit label: hozzárendelve a következő testület által: @hu
toolkit definition: Egy testület, amely hozzárendel egy noment egy entitáshoz. @hu
label: è assegnato da ente @it
definition: Correla un nomen a un ente che assegna un nomen a un'entità. @it
toolkit label: assegnato da ente @it
toolkit definition: Un ente che assegna un nomen a un'entità. @it
label: ir nomenu piešķīris (institūcija) @lv
toolkit label: nomenu piešķīris (institūcija) @lv
definition: Sasaista nomenu ar institūciju, kas piešķir entītei nomenu. @lv
toolkit definition: Institūcija, kas piešķir entītei nomenu. @lv
label: 是被一个团体分配 @zh-hans
toolkit label: 被一个团体分配 @zh-hans
definition: 将一个命名与给一个实体分配一个命名的一个团体关联起来。 @zh-hans
toolkit definition: 给一个实体分配一个命名的一个团体 @zh-hans
has subproperty: P80075
label: tüzel kişi tarafından atanmıştır @tr
toolkit label: tüzel kişi tarafından atanan @tr
definition: Bir ismi bir varlığa bir niteleyici isim atayan bir tüzel kişiyle ilişkilendirir. @tr
toolkit definition: Bir varlığa bir nomen atayan bir tüzel kişi. @tr

is assigned by family
status: Published
type: Property
lexical alias: assignedByFamily.en
domain: C10012
toolkit label: assigned by family
definition: Relates a nomen to a family who assigns a nomen to an entity.
toolkit definition: A family who assigns a nomen to an entity.
sub property of: has related family of nomen
sub property of: is assigned by collective agent
has element type: 2
label: nomenin antava suku @fi
definition: Liittää nomenin sukuun, joka antaa entiteetille nomenin. @fi
toolkit label: nomenin antava suku @fi
toolkit definition: Suku, joka antaa entiteetille nomenin. @fi
label: er angitt av familie @no
definition: Relaterer et nomen til en familie som angir et nomen til en entitet. @no
toolkit label: angitt av familie @no
toolkit definition: En familie som angir et nomen til en entitet. @no
label: est attribué par une famille @fr
definition: Met un nomen en relation avec une famille qui attribue un nomen à une entité. @fr
toolkit label: attribué par une famille @fr
toolkit definition: Famille qui attribue un nomen à une entité. @fr
label: is toegekend door familie @nl
definition: Relateert een nomen aan een familie die een nomen toekent aan een entiteit. @nl
toolkit label: toegekend door familie @nl
toolkit definition: Een familie die een nomen toekent aan een entiteit. @nl
label: هي خصصتها عائلة @ar
definition: يربط تسمية بعائلة تخصص تسمية لكيان. @ar
toolkit label: خصصتها عائلة @ar
toolkit definition: عائلة تخصص تسمية لكيان. @ar
label: és assignat per una família @ca
definition: Relaciona un nomen amb una família que assigna un nomen a una entitat. @ca
toolkit label: assignat per una família @ca
toolkit definition: Família que assigna un nomen a una entitat. @ca
label: er angivet af familie @da
definition: Relaterer et nomen til en familie, som angiver et nomen til en entitet. @da
toolkit label: angivet af familie @da
toolkit definition: Familie, som angiver et nomen til en entitet. @da
label: nomen'i määranud perekond @et
definition: Seostab nomen'i perekonnaga, kes on määranud nomen'i olemile. @et
toolkit label: nomen'i määranud perekond @et
toolkit definition: Perekond, kes on määranud nomen'i olemile. @et
label: ist von einer Familie zugewiesen @de
definition: Setzt ein Nomen in Beziehung zu einer Familie, die einer Entität ein Nomen zuweist. @de
toolkit label: von einer Familie zugewiesen @de
toolkit definition: Eine Familie, die einer Entität ein Nomen zuweist. @de
label: hozzárendelve a következő család által: @hu
definition: Hozzákapcsol egy noment egy családhoz, amely hozzárendel egy noment egy entitáshoz. @hu
toolkit label: hozzárendelve a következő család által: @hu
toolkit definition: Egy család, amely hozzárendel egy noment egy entitáshoz. @hu
label: è assegnato da famiglia @it
definition: Correla un nomen a una famiglia che assegna un nomen a un'entità. @it
toolkit label: assegnato da famiglia @it
toolkit definition: Una famiglia che assegna un nomen a un'entità. @it
label: ir nomenu piešķīris (dzimta/ģimene) @lv
toolkit label: nomenu piešķīris (dzimta/ģimene) @lv
definition: Sasaista nomenu ar dzimtu/ģimeni, kas piešķir entītei nomenu. @lv
toolkit definition: Dzimta/ģimene, kas piešķir entītei nomenu. @lv
label: 是被一个家族分配 @zh-hans
toolkit label: 被一个家族分配 @zh-hans
definition: 将一个命名与给一个实体分配一个命名的一个家族关联起来。 @zh-hans
toolkit definition: 给一个实体分配一个命名的一个家族 @zh-hans
has subproperty: P80076
label: aile tarafından atanmıştır @tr
toolkit label: aile tarafından atanan @tr
definition: Bir ismi, bir varlığa niteleyici bir isim atayan bir aile ile niteleyici bir ismi ilişkilendirir. @tr
toolkit definition: Bir varlığa nomen atayan bir aile. @tr

is assigned by person
status: Published
type: Property
lexical alias: assignedByPerson.en
domain: C10012
toolkit label: assigned by person
definition: Relates a nomen to a person who assigns a nomen to an entity.
toolkit definition: A person who assigns a nomen to an entity.
sub property of: has related person of nomen
sub property of: is assigned by agent
has element type: 2
label: nomenin antava henkilö @fi
definition: Liittää nomenin henkilöön, joka antaa entiteetille nomenin. @fi
toolkit label: nomenin antava henkilö @fi
toolkit definition: Henkilö, joka antaa entiteetille nomenin. @fi
label: er angitt av person @no
definition: Relaterer et nomen til en person som angir et nomen til en entitet. @no
toolkit label: angitt av person @no
toolkit definition: En person som angir et nomen til en entitet. @no
label: est attribué par une personne @fr
definition: Met un nomen en relation avec une personne qui attribue un nomen à une entité. @fr
toolkit label: attribué par une personne @fr
toolkit definition: Personne qui attribue un nomen à une entité. @fr
label: is toegekend door persoon @nl
definition: Relateert een nomen aan een persoon die een nomen toekent aan een entiteit. @nl
toolkit label: toegekend door persoon @nl
toolkit definition: Een persoon die een nomen toekent aan een entiteit. @nl
label: هي خصصها شخص @ar
definition: يربط تسمية بشخص يخصص تسمية لكيان. @ar
toolkit label: خصصها شخص @ar
toolkit definition: شخص يخصص تسمية لكيان. @ar
label: és assignat per una persona @ca
definition: Relaciona un nomen amb una persona que assigna un nomen a una entitat. @ca
toolkit label: assignat per una persona @ca
toolkit definition: Persona que assigna un nomen a una entitat. @ca
label: er angivet af person @da
definition: Relaterer et nomen til en person, som angiver et nomen til en entitet. @da
toolkit label: angivet af person @da
toolkit definition: Person, som angiver et nomen til en entitet. @da
label: nomen'i määranud isik @et
definition: Seostab nomen'i isikuga, kes on määranud nomen'i olemile. @et
toolkit label: nomen'i määranud isik @et
toolkit definition: Isik, kes on määranud nomen'i olemile. @et
label: ist von einer Person zugewiesen @de
definition: Setzt ein Nomen in Beziehung zu einer Person, die einer Entität ein Nomen zuweist. @de
toolkit label: von einer Person zugewiesen @de
toolkit definition: Eine Person, die einer Entität ein Nomen zuweist. @de
label: hozzárendelve a következő személy által: @hu
definition: Hozzákapcsol egy noment egy személyhez, aki hozzárendel egy noment egy entitáshoz. @hu
toolkit label: hozzárendelve a következő személy által: @hu
toolkit definition: Egy személy, aki hozzárendel egy noment egy entitáshoz. @hu
label: è assegnato da persona @it
definition: Correla un nomen a una persona che assegna un nomen a un'entità. @it
toolkit label: assegnato da persona @it
toolkit definition: Una persona che assegna un nomen a un'entità. @it
label: ir nomenu piešķīris (persona) @lv
toolkit label: nomenu piešķīris (persona) @lv
definition: Sasaista nomenu ar personu, kura piešķir entītei nomenu. @lv
toolkit definition: Persona, kura piešķir entītei nomenu. @lv
label: 是被一个个人分配 @zh-hans
toolkit label: 被一个个人分配 @zh-hans
definition: 将一个命名与给一个实体分配一个命名的一个个人关联起来。 @zh-hans
toolkit definition: 给一个实体分配一个命名的一个个人 @zh-hans
has subproperty: P80077
label: kişi tarafından atanmıştır @tr
toolkit label: kişi tarafından atanan @tr
definition: Bir ismi, bir varlığa niteleyici isim atayan bir kişiyle ilişkilendirir. @tr
toolkit definition: Bir varlığa bir isim atayan kişi. @tr

is authorized access point for agent of
status: Published
type: Property
lexical alias: authorizedAccessPointForAgentOf.en
definition: Relates a nomen to an agent who has an access point for agent that is selected for preference in a specific vocabulary encoding scheme.
domain: C10012
toolkit label: authorized access point for agent of
toolkit definition: An agent who has an access point for agent that is selected for preference in a specific vocabulary encoding scheme.
sub property of: is access point for agent of
has element type: 2
sub property of: is authorized access point for RDA entity of
label: auktorisoitu hakutieto toimijalle @fi
definition: Liittää nomenin toimijaan, jolla on tietyssä sanaston merkintäjärjestelmässä ensisijaiseksi valittu hakutieto. @fi
toolkit label: auktorisoitu hakutieto toimijalle @fi
toolkit definition: Toimija, jolla on tietyssä sanaston merkintäjärjestelmässä ensisijaiseksi valittu hakutieto. @fi
label: er autorisert søkeinngang for agent for @no
definition: Relaterer et nomen til en agent som har en søkeinngang for agent som er valgt som preferanse i et bestemt kodeskjema for vokabular. @no
toolkit label: autorisert søkeinngang for agent for @no
toolkit definition: En agent som har en søkeinngang for agent som er valgt som preferanse i et bestemt kodeskjema for vokabular. @no
label: est un point d’accès autorisé d’un agent de @fr
definition: Met un nomen en relation avec un agent qui possède un point d’accès d’un agent faisant l’objet d’un choix privilégié dans un schéma d’encodage de vocabulaire spécifique. @fr
toolkit label: point d’accès autorisé d’un agent de @fr
toolkit definition: Agent qui possède un point d’accès d’un agent faisant l’objet d’un choix privilégié dans un schéma d’encodage de vocabulaire spécifique. @fr
label: is geautoriseerde ingang voor actor van @nl
definition: Relateert een nomen aan een actor die een ingang voor actor heeft die als voorkeursterm geselecteerd is in een specifiek vocabulair coderingssysteem. @nl
toolkit label: geautoriseerde ingang voor actor van @nl
toolkit definition: Een actor die een ingang voor actor heeft die als voorkeursterm geselecteerd is in een specifiek vocabulair coderingssysteem. @nl
label: هي نقطة وصول مقننة لوكيل لـ @ar
definition: يربط تسمية بوكيل له نقطة وصول لوكيل اختيرت للتفضيل في خطة ترميز مفردات محددة. @ar
toolkit label: نقطة وصول مقننة لوكيل لـ @ar
toolkit definition: وكيل له نقطة وصول لوكيل اختيرت للتفضيل في خطة ترميز مفردات محددة. @ar
label: és punt d’accés autoritzat d’agent de @ca
definition: Relaciona un nomen amb un agent que té un punt d’accés d’agent que se selecciona com a preferent en un esquema de codificació de vocabulari específic. @ca
toolkit label: punt d’accés autoritzat d’agent de @ca
toolkit definition: Agent que té un punt d’accés d’agent que se selecciona com a preferent en un esquema de codificació de vocabulari específic. @ca
label: er autoriseret søgeindgang for agent af @da
definition: Relaterer et nomen til en agent, som har en søgeindgang for agent, som er valgt som præference i et specifikt vokabularkodningsskema. @da
toolkit label: autoriseret søgeindgang for agent af @da
toolkit definition: Agent, som har en søgeindgang for agent, som er valgt som præference i et specifikt vokabularkodningsskema. @da
label: normitud otsielement tegijale @et
definition: Seostab nomen'i tegijaga, kellel on vastavas leksikaalses märkimissüsteemis eelistatuks valitud otsielement. @et
toolkit label: normitud otsielement tegijale @et
toolkit definition: Tegija, kellel on vastavas leksikaalses märkimissüsteemis eelistatuks valitud otsielement. @et
label: ist normierter Sucheinstieg für einen Akteur von @de
definition: Setzt ein Nomen in Beziehung zu einem Akteur, der über einen Sucheinstieg verfügt, der in einem bestimmten Vocabulary Encoding Scheme als Vorzugsform bestimmt wird. @de
toolkit label: Normierter Sucheinstieg für einen Akteur von @de
toolkit definition: Ein Akteur, der über einen Sucheinstieg verfügt, der in einem bestimmten Vocabulary Encoding Scheme als Vorzugsform bestimmt wird. @de
label: autorizált hozzáférési pont a következő ágenshez: @hu
definition: Hozzákapcsol egy noment egy ágenshez, amelynek van egy előnyben részesített hozzáférési pontja az ágenshez, amelyet egy adott szótárkódolási sémából választanak ki. @hu
toolkit label: autorizált hozzáférési pont a következő ágenshez: @hu
toolkit definition: Egy ágens, amelynek van egy előnyben részesített hozzáférési pontja az ágenshez, amelyet egy adott szótárkódolási sémából választanak ki. @hu
label: è punto d'accesso autorizzato per agente di @it
definition: Correla un nomen a un agente che ha un punto d'accesso per l'agente che è stato selezionato come preferito in uno specifico schema di codifica di vocabolario. @it
toolkit label: punto d'accesso autorizzato per agente di @it
toolkit definition: Un agente che ha un punto d'accesso per l'agente che è stato selezionato come preferito in uno specifico schema di codifica di vocabolario. @it
label: ir aģenta autoritatīvā pamatforma @lv
definition: Sasaista nomenu ar aģentu, kam ir aģenta pamatforma, kas izvēlēta no konkrētas vārdnīcas. @lv
toolkit label: ir aģenta autoritatīvā pamatforma @lv
toolkit definition: Aģents, kam ir aģenta pamatforma, kas izvēlēta no konkrētas vārdnīcas. @lv
label: 是……的行为者的规范检索点 @zh-hans
definition: 将一个命名与有在一个特定的词表编码体系中被首选的行为者检索点的一个行为者关联起来。 @zh-hans
toolkit label: ……的行为者的规范检索点 @zh-hans
toolkit definition: 有在一个特定的词表编码体系中被首选的行为者检索点的一个行为者 @zh-hans
has subproperty: is authorized access point for collective agent of
has subproperty: is authorized access point for person of
has subproperty: P80099
label: temsilcisi için yetkili erişim noktasıdır @tr
definition: Bir ismi, belirli bir kelime kodlama şemasında tercih edilmek üzere seçilen bir temsilciya erişim noktası olan bir temsilciyle ilişkilendirir. @tr
toolkit label: temsilci için yetkili erişim noktası @tr
toolkit definition: Belirli bir kelime kodlama şemasında tercih edilmek için seçilen temsilci için erişim noktası olan bir temsilci. @tr

is authorized access point for collective agent of
status: Published
type: Property
lexical alias: authorizedAccessPointForCollectiveAgentOf.en
definition: Relates a nomen to a collective agent who has an access point for collective agent that is selected for preference in a specific vocabulary encoding scheme.
domain: C10012
toolkit label: authorized access point for collective agent of
toolkit definition: A collective agent who has an access point for collective agent that is selected for preference in a specific vocabulary encoding scheme.
sub property of: is access point for collective agent of
sub property of: is authorized access point for agent of
has element type: 2
label: auktorisoitu hakutieto yhteistoimijalle @fi
definition: Liittää nomenin yhteistoimijaan, jolla on tietyssä sanaston merkintäjärjestelmässä ensisijaiseksi valittu hakutieto. @fi
toolkit label: auktorisoitu hakutieto yhteistoimijalle @fi
toolkit definition: Yhteistoimija, jolla on tietyssä sanaston merkintäjärjestelmässä ensisijaiseksi valittu hakutieto. @fi
label: er autorisert søkeinngang for kollektiv agent for @no
definition: Relaterer et nomen til en kollektiv agent som har en søkeinngang for kollektiv agent som er valgt som preferanse i et bestemt kodeskjema for vokabular. @no
toolkit label: autorisert søkeinngang for kollektiv agent for @no
toolkit definition: En kollektiv agent som har en søkeinngang for kollektiv agent som er valgt som preferanse i et bestemt kodeskjema for vokabular. @no
label: est un point d’accès autorisé d’un agent collectif de @fr
definition: Met un nomen en relation avec un agent collectif qui possède un point d’accès d’un agent collectif faisant l’objet d’un choix privilégié dans un schéma d’encodage de vocabulaire spécifique. @fr
toolkit label: point d’accès autorisé d’un agent collectif de @fr
toolkit definition: Agent collectif qui possède un point d’accès d’un agent collectif faisant l’objet d’un choix privilégié dans un schéma d’encodage de vocabulaire spécifique. @fr
label: is geautoriseerde ingang voor collectieve actor van @nl
definition: Relateert een nomen aan een collectieve actor die een ingang voor collectieve actor heeft die als voorkeursterm geselecteerd is in een specifiek vocabulair coderingssysteem. @nl
toolkit label: geautoriseerde ingang voor collectieve actor van @nl
toolkit definition: Een collectieve actor die een ingang voor collectieve actor heeft die als voorkeursterm geselecteerd is in een specifiek vocabulair coderingssysteem. @nl
label: هي نقطة وصول مقننة لوكيل جماعي لـ @ar
definition: يربط تسمية بوكيل جماعي له نقطة وصول اختيرت للتفضيل في خطة ترميز مفردات محددة. @ar
toolkit label: نقطة وصول مقننة لوكيل جماعي لـ @ar
toolkit definition: وكيل جماعي له نقطة وصول لوكيل جماعي اختيرت للتفضيل في خطة ترميز مفردات محددة. @ar
label: és punt d’accés autoritzat d’agent col·lectiu de @ca
definition: Relaciona un nomen amb un agent col·lectiu que té un punt d’accés d’agent col·lectiu que se selecciona com a preferent en un esquema de codificació de vocabulari específic. @ca
toolkit label: punt d’accés autoritzat d’agent col·lectiu de @ca
toolkit definition: Agent col·lectiu que té un punt d’accés d’agent col·lectiu que se selecciona com a preferent en un esquema de codificació de vocabulari específic. @ca
label: er autoriseret søgeindgang for kollektiv agent af @da
definition: Relaterer et nomen til en kollektiv agent, som har en søgeindgang for kollektiv agent, som er valgt som præference i et specifikt vokabularkodningsskema. @da
toolkit label: autoriseret søgeindgang for kollektiv agent af @da
toolkit definition: Kollektiv agent, som har en søgeindgang for kollektiv agent, som er valgt som præference i et specifikt vokabularkodningsskema. @da
label: normitud otsielement kollektiivile @et
definition: Seostab nomen'i kollektiiviga, kellel on vastavas leksikaalses märkimissüsteemis eelistatuks valitud otsielement. @et
toolkit label: normitud otsielement kollektiivile @et
toolkit definition: Kollektiiv, kellel on vastavas leksikaalses märkimissüsteemis eelistatuks valitud otsielement. @et
label: ist normierter Sucheinstieg für einen gemeinschaftlichen Akteur von @de
definition: Setzt ein Nomen in Beziehung zu einem gemeinschaftlichen Akteur, der über einen Sucheinstieg verfügt, der in einem bestimmten Vocabulary Encoding Scheme als Vorzugsform bestimmt wird. @de
toolkit label: Normierter Sucheinstieg für einen gemeinschaftlichen Akteur von @de
toolkit definition: Ein gemeinschaftlicher Akteur, der über einen Sucheinstieg verfügt, der in einem bestimmten Vocabulary Encoding Scheme als Vorzugsform bestimmt wird. @de
label: autorizált hozzáférési pont a következő kollektív ágenshez: @hu
definition: Hozzákapcsol egy noment egy kollektív ágenshez, amelynek van egy előnyben részesített hozzáférési pontja a kollektív ágenshez, amelyet egy adott szótárkódolási sémából választanak ki. @hu
toolkit label: autorizált hozzáférési pont a következő kollektív ágenshez: @hu
toolkit definition: Egy kollektív ágens, amelynek van egy előnyben részesített hozzáférési pontja a kollektív ágenshez, amelyet egy adott szótárkódolási sémából választanak ki. @hu
label: è punto d'accesso autorizzato per agente collettivo di @it
definition: Correla un nomen a un agente collettivo che ha un punto d'accesso per l'agente collettivo che è stato selezionato come preferito in uno specifico schema di codifica di vocabolario. @it
toolkit label: punto d'accesso autorizzato per agente collettivo di @it
toolkit definition: Un agente collettivo che ha un punto d'accesso per l'agente collettivo che è stato selezionato come preferito in uno specifico schema di codifica di vocabolario. @it
label: ir grupas autoritatīvā pamatforma @lv
definition: Sasaista nomenu ar grupu, kam ir grupas pamatforma, kas izvēlēta no konkrētas vārdnīcas. @lv
toolkit label: ir grupas autoritatīvā pamatforma @lv
toolkit definition: Grupa, kam ir grupas pamatforma, kas izvēlēta no konkrētas vārdnīcas. @lv
label: 是……的集体行为者的规范检索点 @zh-hans
definition: 将一个命名与有在一个特定的词表编码体系中被首选的集体行为者检索点的一个集体行为者关联起来。 @zh-hans
toolkit label: ……的集体行为者的规范检索点 @zh-hans
toolkit definition: 有在一个特定的词表编码体系中被首选的集体行为者检索点的一个集体行为者 @zh-hans
has subproperty: is authorized access point for corporate body of
has subproperty: is authorized access point for family of
has subproperty: P80101
label: kolektif temsilcisi için yetkili erişim noktasıdır @tr
definition: Bir ismi, belirli bir kelime kodlama şemasında tercih edilmek üzere seçilen kolektif temsilci için bir erişim noktasına sahip olan kolektif temsilciyle ilişkilendirir. @tr
toolkit label: kolektif temsilci için yetkili erişim noktası @tr
toolkit definition: Belirli bir kelime kodlama şemasında tercih için seçilen kolektif temsilci için bir erişim noktasına sahip olan kolektif temsilci. @tr

is authorized access point for corporate body of
status: Published
type: Property
lexical alias: authorizedAccessPointForCorporateBodyOf.en
definition: Relates a nomen to a corporate body who has an access point for corporate body that is selected for preference in a specific vocabulary encoding scheme.
domain: C10012
toolkit label: authorized access point for corporate body of
toolkit definition: A corporate body who has an access point for corporate body that is selected for preference in a specific vocabulary encoding scheme.
sub property of: is access point for corporate body of
sub property of: is authorized access point for collective agent of
has element type: 2
label: auktorisoitu hakutieto yhteisölle @fi
definition: Liittää nomenin yhteisöön, jolla on tietyssä sanaston merkintäjärjestelmässä ensisijaiseksi valittu hakutieto. @fi
toolkit label: auktorisoitu hakutieto yhteisölle @fi
toolkit definition: Yhteisö, jolla on tietyssä sanaston merkintäjärjestelmässä ensisijaiseksi valittu hakutieto. @fi
label: er autorisert søkeinngang for korporasjon for @no
definition: Relaterer et nomen til en korporasjon som har en søkeinngang for korporasjon som er valgt som preferanse i et bestemt kodeskjema for vokabular. @no
toolkit label: autorisert søkeinngang for korporasjon for @no
toolkit definition: En korporasjon som har en søkeinngang for korporasjon som er valgt som preferanse i et bestemt kodeskjema for vokabular. @no
label: est un point d’accès autorisé d’une collectivité de @fr
definition: Met un nomen en relation avec une collectivité qui possède un point d’accès d’une collectivité faisant l’objet d’un choix privilégié dans un schéma d’encodage de vocabulaire spécifique. @fr
toolkit label: point d’accès autorisé d’une collectivité de @fr
toolkit definition: Collectivité qui possède un point d’accès d’une collectivité faisant l’objet d’un choix privilégié dans un schéma d’encodage de vocabulaire spécifique. @fr
label: is geautoriseerde ingang voor corporatie van @nl
definition: Relateert een nomen aan een corporatie die een ingang voor corporatie heeft die als voorkeursterm geselecteerd is in een specifiek vocabulair coderingssysteem. @nl
toolkit label: geautoriseerde ingang voor corporatie van @nl
toolkit definition: Een corporatie die een ingang voor corporatie heeft die als voorkeursterm geselecteerd is in een specifiek vocabulair coderingssysteem. @nl
label: هي نقطة وصول مقننة لهيئة لـ @ar
definition: يربط تسمية بهيئة لها نقطة وصول لهيئة، اختيرت للتفضيل في خطة ترميز مفردات محددة. @ar
toolkit label: نقطة وصول مقننة لهيئة لـ @ar
toolkit definition: هيئة لها نقطة وصول لهيئة اختيرت للتفضيل في خطة ترميز مفردات محددة. @ar
label: és punt d’accés autoritzat d’entitat corporativa de @ca
definition: Relaciona un nomen amb una entitat corporativa que té un punt d’accés d’entitat corporativa que se selecciona com a preferent en un esquema de codificació de vocabulari específic. @ca
toolkit label: punt d’accés autoritzat d’entitat corporativa de @ca
toolkit definition: Entitat corporativa que té un punt d’accés d’entitat corporativa que se selecciona com a preferent en un esquema de codificació de vocabulari específic. @ca
label: er autoriseret søgeindgang for korporation af @da
definition: Relaterer et nomen til en korporation, som har en søgeindgang for korporation, som er valgt som præference i et specifikt vokabularkodningsskema. @da
toolkit label: autoriseret søgeindgang for korporation af @da
toolkit definition: Korporation, som har en søgeindgang for korporation, som er valgt som præference i et specifikt vokabularkodningsskema. @da
label: normitud otsielement asutusele @et
definition: Seostab nomen'i asutusega, kellel on vastavas leksikaalses märkimissüsteemis eelistatuks valitud otsielement. @et
toolkit label: normitud otsielement asutusele @et
toolkit definition: Asutus, kellel on vastavas leksikaalses märkimissüsteemis eelistatuks valitud otsielement. @et
label: ist normierter Sucheinstieg für eine Körperschaft von @de
definition: Setzt ein Nomen in Beziehung zu einer Körperschaft, die über einen Sucheinstieg verfügt, der in einem bestimmten Vocabulary Encoding Scheme als Vorzugsform bestimmt wird. @de
toolkit label: Normierter Sucheinstieg für eine Körperschaft von @de
toolkit definition: Eine Körperschaft, die über einen Sucheinstieg verfügt, der in einem bestimmten Vocabulary Encoding Scheme als Vorzugsform bestimmt wird. @de
label: autorizált hozzáférési pont a következő testülethez: @hu
definition: Hozzákapcsol egy noment egy testülethez, amelynek van egy előnyben részesített hozzáférési pontja a testülethez, amelyet egy adott szótárkódolási sémából választanak ki. @hu
toolkit label: autorizált hozzáférési pont a következő testülethez: @hu
toolkit definition: Egy testület, amelynek van egy előnyben részesített hozzáférési pontja a testülethez, amelyet egy adott szótárkódolási sémából választanak ki. @hu
label: è punto d'accesso autorizzato per ente di @it
definition: Correla un nomen a un ente che ha un punto d'accesso per l'ente che è stato selezionato come preferito in uno specifico schema di codifica di vocabolario. @it
toolkit label: punto d'accesso autorizzato per ente di @it
toolkit definition: Un ente che ha un punto d'accesso per l'ente che è stato selezionato come preferito in uno specifico schema di codifica di vocabolario. @it
label: ir institūcijas autoritatīvā pamatforma @lv
definition: Sasaista nomenu ar institūciju, kam ir institūcijas pamatforma, kas izvēlēta no konkrētas vārdnīcas. @lv
toolkit label: ir institūcijas autoritatīvā pamatforma @lv
toolkit definition: Institūcija, kam ir institūcijas pamatforma, kas izvēlēta no konkrētas vārdnīcas. @lv
label: 是……的团体的规范检索点 @zh-hans
definition: 将一个命名与有在一个特定的词表编码体系中被首选的团体检索点的一个团体关联起来。 @zh-hans
toolkit label: ……的团体的规范检索点 @zh-hans
toolkit definition: 有在一个特定的词表编码体系中被首选的团体检索点的一个团体 @zh-hans
has subproperty: P80103
label: tüzel kişisi için yetkili erişim noktasıdır @tr
definition: Bir ismi, belirli bir kelime kodlama şemasında tercih edilmek üzere seçilen tüzel kişi için erişim noktası olan bir tüzel kişiyle ilişkilendirir. @tr
toolkit label: tüzel kişi için yetkili erişim noktası @tr
toolkit definition: Belirli bir kelime kodlama şemasında tercih edilmek üzere seçilen tüzel kişi için bir erişim noktasına sahip olan bir tüzel kişi. @tr

is authorized access point for expression of
status: Published
type: Property
lexical alias: authorizedAccessPointForExpressionOf.en
definition: Relates a nomen to an expression that has an access point for expression that is selected for preference in a specific vocabulary encoding scheme.
domain: C10012
toolkit label: authorized access point for expression of
toolkit definition: An expression that has an access point for expression that is selected for preference in a specific vocabulary encoding scheme.
sub property of: is access point for expression of
has element type: 2
sub property of: is authorized access point for RDA entity of
label: auktorisoitu hakutieto ekspressiolle @fi
definition: Liittää nomenin ekspressioon, jolla on tietyssä sanaston merkintäjärjestelmässä ensisijaiseksi valittu hakutieto. @fi
toolkit label: auktorisoitu hakutieto ekspressiolle @fi
toolkit definition: Ekspressio, jolla on tietyssä sanaston merkintäjärjestelmässä ensisijaiseksi valittu hakutieto. @fi
label: er autorisert søkeinngang for uttrykk for @no
definition: Relaterer et nomen til et uttrykk som har en søkeinngang for uttrykk som er valgt som preferanse i et bestemt kodeskjema for vokabular. @no
toolkit label: autorisert søkeinngang for uttrykk for @no
toolkit definition: Et uttrykk som har en søkeinngang for uttrykk som er valgt som preferanse i et bestemt kodeskjema for vokabular. @no
label: est un point d’accès autorisé d’une expression de @fr
definition: Met un nomen en relation avec une expression qui possède un point d’accès d’une expression faisant l’objet d’un choix privilégié dans un schéma d’encodage de vocabulaire spécifique. @fr
toolkit label: point d’accès autorisé d’une expression de @fr
toolkit definition: Expression qui possède un point d’accès d’une expression faisant l’objet d’un choix privilégié dans un schéma d’encodage de vocabulaire spécifique. @fr
label: is geautoriseerde ingang voor expressie van @nl
definition: Relateert een nomen aan een expressie die een ingang voor expressie heeft die als voorkeursterm geselecteerd is in een specifiek vocabulair coderingssysteem. @nl
toolkit label: geautoriseerde ingang voor expressie van @nl
toolkit definition: Een expressie die een ingang voor expressie heeft die als voorkeursterm geselecteerd is in een specifiek vocabulair coderingssysteem. @nl
label: نقطة وصول مقننة لتعبيرة لـ @ar
definition: يربط تسمية بتعبيرة لها نقطة وصول لتعبيرة اختيرت للتفضيل في خطة ترميز مفردات محددة. @ar
toolkit label: نقطة وصول مقننة لتعبيرة لـ @ar
toolkit definition: تعبيرة لها نقطة وصول لتعبيرة اختيرت للتفضيل في خطة ترميز مفردات محددة. @ar
label: és punt d’accés autoritzat d’expressió de @ca
definition: Relaciona un nomen amb una expressió que té un punt d’accés d’expressió que se selecciona com a preferent en un esquema de codificació de vocabulari específic. @ca
toolkit label: punt d’accés autoritzat d’expressió de @ca
toolkit definition: Expressió que té un punt d’accés d’expressió que se selecciona com a preferent en un esquema de codificació de vocabulari específic. @ca
label: er autoriseret søgeindgang for udtryk af @da
definition: Relaterer et nomen til et udtryk, som har en søgeindgang for udtryk, som er valgt som præference i et specifikt vokabularkodningsskema. @da
toolkit label: autoriseret søgeindgang for korporation af @da
toolkit definition: Udtryk, som har en søgeindgang for udtryk, som er valgt som præference i et specifikt vokabularkodningsskema. @da
label: normitud otsielement väljendusele @et
definition: Seostab nomen'i väljendusega, millel on vastavas leksikaalses märkimissüsteemis eelistatuks valitud otsielement. @et
toolkit label: normitud otsielement väljendusele @et
toolkit definition: Väljendus, millel on vastavas leksikaalses märkimissüsteemis eelistatuks valitud otsielement. @et
label: ist normierter Sucheinstieg für eine Expression von @de
definition: Setzt ein Nomen in Beziehung zu einer Expression, die über einen Sucheinstieg verfügt, der in einem bestimmten Vocabulary Encoding Scheme als Vorzugsform bestimmt wird. @de
toolkit label: Normierter Sucheinstieg für eine Expression von @de
toolkit definition: Eine Expression, die über einen Sucheinstieg für eine Expression verfügt, der in einem bestimmten Vocabulary Encoding Scheme als Vorzugsform bestimmt wird. @de
label: autorizált hozzáférési pont a következő kifejezési formához: @hu
definition: Hozzákapcsol egy noment egy kifejezési formához, amelynek van egy olyan hozzáférési pontja a kifejezési forma számára, amelyet egy adott szótárkódolási sémából kiválasztva előnyben részesítenek. @hu
toolkit label: autorizált hozzáférési pont a következő kifejezési formának: @hu
toolkit definition: Egy kifejezési forma, amelynek van egy olyan hozzáférési pontja a kifejezési forma számára, amelyet egy adott szótárkódolási sémából kiválasztva előnyben részesítenek. @hu
label: è punto d'accesso autorizzato per espressione di @it
definition: Correla un nomen a un'espressione che ha un punto d'accesso per l'espressione che è stato selezionato come preferito in uno specifico schema di codifica di vocabolario. @it
toolkit label: punto d'accesso autorizzato per espressione di @it
toolkit definition: Un'espressione che ha un punto d'accesso per l'espressione che è stato selezionato come preferito in uno specifico schema di codifica di vocabolario. @it
label: ir autoritatīvā vārdforma izteiksmei @lv
definition: Sasaista nomenu ar izteiksmi, kam ir izteiksmes pamatforma, kas izvēlēta no konkrētas vārdnīcas. @lv
toolkit label: ir autoritatīvā vārdforma izteiksmei @lv
toolkit definition: Izteiksme, kam ir izteiksmes pamatforma, kas izvēlēta no konkrētas vārdnīcas. @lv
label: 是……的内容表达的规范检索点 @zh-hans
definition: 将一个命名与有在一个特定的词表编码体系中被首选的内容表达检索点的一种内容表达关联起来。 @zh-hans
toolkit label: ……的内容表达的规范检索点 @zh-hans
toolkit definition: 有在一个特定的词表编码体系中被首选的内容表达检索点的一种内容表达 @zh-hans
has subproperty: P80095
label: anlatımı için yetkili erişim noktası @tr
definition: Bir ismi, belirli bir kelime kodlama şemasında tercih için seçilen anlatım için bir erişim noktası olan bir anlatımla ilişkilendirir. @tr
toolkit label: anlatım için yetkili erişim noktası @tr
toolkit definition: Belirli bir kelime kodlama şemasında tercih için seçilen bir erişim noktasına sahip bir anlatım. @tr

is authorized access point for family of
status: Published
type: Property
lexical alias: authorizedAccessPointForFamilyOf.en
definition: Relates a nomen to a family who has an access point for family that is selected for preference in a specific vocabulary encoding scheme.
domain: C10012
toolkit label: authorized access point for family of
toolkit definition: A family who has an access point for family that is selected for preference in a specific vocabulary encoding scheme.
sub property of: is access point for family of
sub property of: is authorized access point for collective agent of
has element type: 2
label: auktorisoitu hakutieto suvulle @fi
definition: Liittää nomenin sukuun, jolla on tietyssä sanaston merkintäjärjestelmässä ensisijaiseksi valittu hakutieto. @fi
toolkit label: auktorisoitu hakutieto suvulle @fi
toolkit definition: Suku, jolla on tietyssä sanaston merkintäjärjestelmässä ensisijaiseksi valittu hakutieto. @fi
label: er autorisert søkeinngang for familie for @no
definition: Relaterer et nomen til en familie som har en søkeinngang for familie som er valgt som preferanse i et bestemt kodeskjema for vokabular. @no
toolkit label: autorisert søkeinngang for familie for @no
toolkit definition: En familie som har en søkeinngang for familie som er valgt som preferanse i et bestemt kodeskjema for vokabular. @no
label: est un point d’accès autorisé d’une famille de @fr
definition: Met un nomen en relation avec une famille qui possède un point d’accès d’une famille faisant l’objet d’un choix privilégié dans un schéma d’encodage de vocabulaire spécifique. @fr
toolkit label: point d’accès autorisé d’une famille de @fr
toolkit definition: Famille qui possède un point d’accès d’une famille faisant l’objet d’un choix privilégié dans un schéma d’encodage de vocabulaire spécifique. @fr
label: is geautoriseerde ingang voor familie van @nl
definition: Relateert een nomen aan een familie die een ingang voor familie heeft die als voorkeursterm geselecteerd is in een specifiek vocabulair coderingssysteem. @nl
toolkit label: geautoriseerde ingang voor familie van @nl
toolkit definition: Een familie die een ingang voor familie heeft die als voorkeursterm geselecteerd is in een specifiek vocabulair coderingssysteem. @nl
label: هي نقطة وصول مقننة لعائلة لـ @ar
definition: يربط تسمية بعائلة لها نقطة وصول لعائلة اختيرت للتفضيل في خطة ترميز مفردات محددة. @ar
toolkit label: نقطة وصول مقننة لعائلة لـ @ar
toolkit definition: عائلة لها نقطة وصول لعائلة اختيرت للتفضيل في خطة ترميز مفردات محددة. @ar
label: és punt d’accés autoritzat de família de @ca
definition: Relaciona un nomen amb una família que té un punt d’accés de família que se selecciona com a preferent en un esquema de codificació de vocabulari específic. @ca
toolkit label: punt d’accés autoritzat de família de @ca
toolkit definition: Família que té un punt d’accés de família que se selecciona com a preferent en un esquema de codificació de vocabulari específic. @ca
label: er autoriseret søgeindgang for familie af @da
definition: Relaterer et nomen til en familie, som har en søgeindgang for familie, som er valgt som præference i et specifikt vokabularkodningsskema. @da
toolkit label: autoriseret søgeindgang for familie af @da
toolkit definition: Familie, som har en søgeindgang for familie, som er valgt som præference i et specifikt vokabularkodningsskema. @da
label: normitud otsielement perekonnale @et
definition: Seostab nomen'i perekonnaga, kellel on vastavas leksikaalses märkimissüsteemis eelistatuks valitud otsielement. @et
toolkit label: normitud otsielement perekonnale @et
toolkit definition: Perekond, kellel on vastavas leksikaalses märkimissüsteemis eelistatuks valitud otsielement. @et
label: ist normierter Sucheinstieg für eine Familie von @de
definition: Setzt ein Nomen in Beziehung zu einer Familie, die über einen Sucheinstieg für eine Familie verfügt, der in einem bestimmten Vocabulary Encoding Scheme als Vorzugsform bestimmt wird. @de
toolkit label: Normierter Sucheinstieg für eine Familie von @de
toolkit definition: Eine Familie, die über einen Sucheinstieg für eine Familie verfügt, der in einem bestimmten Vocabulary Encoding Scheme als Vorzugsform bestimmt wird. @de
label: autorizált hozzáférési pont a következő családhoz: @hu
definition: Hozzákapcsol egy noment egy családhoz, amelynek van egy előnyben részesített hozzáférési pontja a családhoz, amelyet egy adott szótárkódolási sémából választanak ki. @hu
toolkit label: autorizált hozzáférési pont a következő családhoz: @hu
toolkit definition: Egy család, amelynek van egy előnyben részesített hozzáférési pontja a családhoz, amelyet egy adott szótárkódolási sémából választanak ki. @hu
label: è punto d'accesso autorizzato per famiglia di @it
definition: Correla un nomen a una famiglia che ha un punto d'accesso per la famiglia che è stato selezionato come preferito in uno specifico schema di codifica di vocabolario. @it
toolkit label: punto d'accesso autorizzato per famiglia di @it
toolkit definition: Una famiglia che ha un punto d'accesso per la famiglia che è stato selezionato come preferito in uno specifico schema di codifica di vocabolario. @it
label: ir dzimtas/ģimenes autoritatīvā pamatforma @lv
definition: Sasaista nomenu ar dzimtu/ģimeni, kam ir dzimtas/ģimenes pamatforma, kas izvēlēta no konkrētas vārdnīcas. @lv
toolkit label: ir dzimtas/ģimenes autoritatīvā pamatforma @lv
toolkit definition: Dzimta/ģimene, kam ir dzimtas/ģimenes pamatforma, kas izvēlēta no konkrētas vārdnīcas. @lv
label: 是……的家族的规范检索点 @zh-hans
definition: 将一个命名与有在一个特定的词表编码体系中被首选的家族检索点的一个家族关联起来。 @zh-hans
toolkit label: ……的家族的规范检索点 @zh-hans
toolkit definition: 有在一个特定的词表编码体系中被首选的家族检索点的一个家族 @zh-hans
has subproperty: P80105
label: ailesi için yetkili erişim noktasıdır @tr
definition: Bir ismi, belirli bir kelime kodlama şemasında tercih edilmek üzere seçilen aile için bir erişim noktası olan bir aileyle ilişkilendirir. @tr
toolkit label: aile için yetkili erişim noktası @tr
toolkit definition: Belirli bir kelime kodlama şemasında tercih edilmek üzere seçilen aile için erişim noktası olan bir aile. @tr

is authorized access point for item of
status: Published
type: Property
lexical alias: authorizedAccessPointForItemOf.en
definition: Relates a nomen to an item that has an access point for item that is selected for preference in a specific vocabulary encoding scheme.
domain: C10012
toolkit label: authorized access point for item of
toolkit definition: An item that has an access point for item that is selected for preference in a specific vocabulary encoding scheme.
sub property of: is access point for item of
has element type: 2
sub property of: is authorized access point for RDA entity of
label: auktorisoitu hakutieto kappaleelle @fi
definition: Liittää nomenin kappaleeseen, jolla on tietyssä sanaston merkintäjärjestelmässä ensisijaiseksi valittu hakutieto. @fi
toolkit label: auktorisoitu hakutieto kappaleelle @fi
toolkit definition: Kappale, jolla on tietyssä sanaston merkintäjärjestelmässä ensisijaiseksi valittu hakutieto. @fi
label: er autorisert søkeinngang for eksemplar for @no
definition: Relaterer et nomen til et eksemplar som har en søkeinngang for eksemplar som er valgt som preferanse i et bestemt kodeskjema for vokabular. @no
toolkit label: autorisert søkeinngang for eksemplar for @no
toolkit definition: Et eksemplar som har en søkeinngang for eksemplar som er valgt som preferanse i et bestemt kodeskjema for vokabular. @no
label: est un point d’accès autorisé d’un item de @fr
definition: Met un nomen en relation avec un item qui possède un point d’accès d’un item faisant l’objet d’un choix privilégié dans un schéma d’encodage de vocabulaire spécifique. @fr
toolkit label: point d’accès autorisé d’un item de @fr
toolkit definition: Item qui possède un point d’accès d’un item faisant l’objet d’un choix privilégié dans un schéma d’encodage de vocabulaire spécifique. @fr
label: is geautoriseerde ingang voor item van @nl
definition: Relateert een nomen aan een item dat een ingang voor item heeft die als voorkeursterm geselecteerd is in een specifiek vocabulair coderingssysteem. @nl
toolkit label: geautoriseerde ingang voor item van @nl
toolkit definition: Een item dat een ingang voor item heeft die als voorkeursterm geselecteerd is in een specifiek vocabulair coderingssysteem. @nl
label: هي نقطة وصول مقننة لمفردة لـ @ar
definition: يربط تسمية بمفردة لها نقطة وصول لمفردة اختيرت للتفضيل في خطة ترميز مفردات محددة. @ar
toolkit label: نقطة وصول مقننة لمفردة لـ @ar
toolkit definition: مفردة لها نقطة وصول لمفردة اختيرت للتفضيل في خطة ترميز مفردات محددة. @ar
label: és punt d’accés autoritzat d’ítem de @ca
definition: Relaciona un nomen amb un ítem que té un punt d’accés d’ítem que se selecciona com a preferent en un esquema de codificació de vocabulari específic. @ca
toolkit label: punt d’accés autoritzat d’ítem de @ca
toolkit definition: Ítem que té un punt d’accés d’ítem que se selecciona com a preferent en un esquema de codificació de vocabulari específic. @ca
label: er autoriseret søgeindgang for eksemplar af @da
definition: Relaterer et nomen til et eksemplar, som har en søgeindgang for eksemplar, som er valgt som præference i et specifikt vokabularkodningsskema. @da
toolkit label: autoriseret søgeindgang for eksemplar af @da
toolkit definition: Eksemplar, som har en søgeindgang for eksemplar, som er valgt som præference i et specifikt vokabularkodningsskema. @da
label: normitud otsielement eksemplarile @et
definition: Seostab nomen'i eksemplariga, millel on vastavas leksikaalses märkimissüsteemis eelistatuks valitud otsielement. @et
toolkit label: normitud otsielement eksemplarile @et
toolkit definition: Eksemplar, millel on vastavas leksikaalses märkimissüsteemis eelistatuks valitud otsielement. @et
label: ist normierter Sucheinstieg für ein Exemplar von @de
definition: Setzt ein Nomen in Beziehung zu einem Exemplar, das über einen Sucheinstieg für ein Exemplar verfügt, der in einem bestimmten Vocabulary Encoding Scheme als Vorzugsform bestimmt wird. @de
toolkit label: Normierter Sucheinstieg für ein Exemplar von @de
toolkit definition: Ein Exemplar, das über einen Sucheinstieg für eine Familie verfügt, der in einem bestimmten Vocabulary Encoding Scheme als Vorzugsform bestimmt wird. @de
label: autorizált hozzáférési pont a következő példányhoz: @hu
definition: Hozzákapcsol egy noment egy példányhoz, amelynek van egy olyan hozzáférési pontja a példányhoz, amelyet egy adott szótárkódolási sémából kiválasztva előnyben részesítenek. @hu
toolkit label: autorizált hozzáférési pont a következő példányhoz: @hu
toolkit definition: Egy példány, amelynek van egy olyan hozzáférési pontja a példányhoz, amelyet egy adott szótárkódolási sémából kiválasztva előnyben részesítenek. @hu
label: è punto d'accesso autorizzato per item di @it
definition: Correla un nomen a un item che ha un punto d'accesso per l'item che è stato selezionato come preferito in uno specifico schema di codifica di vocabolario. @it
toolkit label: punto d'accesso autorizzato per item di @it
toolkit definition: Un item che ha un punto d'accesso per l'item che è stato selezionato come preferito in uno specifico schema di codifica di vocabolario. @it
label: ir vienības autoritatīvā pamatforma @lv
definition: Sasaista nomenu ar vienību, kurai ir vienības pamatforma, kas izvēlēta no konkrētas vārdnīcas. @lv
toolkit label: ir vienības autoritatīvā pamatforma @lv
toolkit definition: Vienība, kurai ir vienības pamatforma, kas izvēlēta no konkrētas vārdnīcas. @lv
label: 是……的单件的规范检索点 @zh-hans
definition: 将一个命名与有在一个特定的词表编码体系中被首选的单件检索点的一个单件关联起来。 @zh-hans
toolkit label: ……的单件的规范检索点 @zh-hans
toolkit definition: 有在一个特定的词表编码体系中被首选的单件检索点的一个单件 @zh-hans
has subproperty: P80091
label: kopyası için yetkili erişim noktasıdır @tr
definition: Bir ismi, belirli bir kelime kodlama şemasında tercih için seçilen kopya için bir erişim noktasına sahip olan bir kopyayla ilişkilendirir. @tr
toolkit label: kopya için yetkili erişim noktası @tr
toolkit definition: Belirli bir kelime kodlama şemasında tercih için seçilen bir kopya için erişim noktası olan bir kopya. @tr

is authorized access point for manifestation of
status: Published
type: Property
lexical alias: authorizedAccessPointForManifestationOf.en
definition: Relates a nomen to a manifestation that has an access point for manifestation that is selected for preference in a specific vocabulary encoding scheme.
domain: C10012
toolkit label: authorized access point for manifestation of
toolkit definition: A manifestation that has an access point for manifestation that is selected for preference in a specific vocabulary encoding scheme.
sub property of: is access point for manifestation of
has element type: 2
sub property of: is authorized access point for RDA entity of
label: auktorisoitu hakutieto manifestaatiolle @fi
definition: Liittää nomenin manifestaatioon, jolla on tietyssä sanaston merkintäjärjestelmässä ensisijaiseksi valittu hakutieto. @fi
toolkit label: auktorisoitu hakutieto manifestaatiolle @fi
toolkit definition: Manifestaatio, jolla on tietyssä sanaston merkintäjärjestelmässä ensisijaiseksi valittu hakutieto. @fi
label: er autorisert søkeinngang for manifestasjon for @no
definition: Relaterer et nomen til en manifestasjon som har en søkeinngang for manifestasjon som er valgt som preferanse i et bestemt kodeskjema for vokabular. @no
toolkit label: autorisert søkeinngang for manifestasjon for @no
toolkit definition: En manifestasjon som har en søkeinngang for manifestasjon som er valgt som preferanse i et bestemt kodeskjema for vokabular. @no
label: est un point d’accès autorisé d’une manifestation de @fr
definition: Met un nomen en relation avec une manifestation qui possède un point d’accès d’une manifestation faisant l’objet d’un choix privilégié dans un schéma d’encodage de vocabulaire spécifique. @fr
toolkit label: point d’accès autorisé d’une manifestation de @fr
toolkit definition: Manifestation qui possède un point d’accès d’une manifestation faisant l’objet d’un choix privilégié dans un schéma d’encodage de vocabulaire spécifique. @fr
label: is geautoriseerde ingang voor manifestatie van @nl
definition: Relateert een nomen aan een manifestatie die een ingang voor manifestatie heeft die als voorkeursterm geselecteerd is in een specifiek vocabulair coderingssysteem. @nl
toolkit label: geautoriseerde ingang voor manifestatie van @nl
toolkit definition: Een manifestatie die een ingang voor manifestatie heeft die als voorkeursterm geselecteerd is in een specifiek vocabulair coderingssysteem. @nl
label: هي نقطة وصول مقننة لتجسيدة لـ @ar
definition: يربط تسمية بتجسيدة لها نقطة وصول لتجسيدة اختيرت للتفضيل في خطة ترميز مفردات محددة. @ar
toolkit label: نقطة وصول مقننة لتجسيدة لـ @ar
toolkit definition: تجسيدة لها نقطة وصول لتجسيدة اختيرت للتفضيل في خطة ترميز مفردات محددة. @ar
label: és punt d’accés autoritzat de manifestació de @ca
definition: Relaciona un nomen amb una manifestació que té un punt d’accés de manifestació que se selecciona com a preferent en un esquema de codificació de vocabulari específic. @ca
toolkit label: punt d’accés autoritzat de manifestació de @ca
toolkit definition: Manifestació que té un punt d’accés de manifestació que se selecciona com a preferent en un esquema de codificació de vocabulari específic. @ca
label: er autoriseret søgeindgang for manifestation af @da
definition: Relaterer et nomen til en manifestation, som har en søgeindgang for manifestation, som er valgt som præference i et specifikt vokabularkodningsskema. @da
toolkit label: autoriseret søgeindgang for manifestation af @da
toolkit definition: Manifestation, som har en søgeindgang for manifestation, som er valgt som præference i et specifikt vokabularkodningsskema. @da
label: normitud otsielement kehastusele @et
definition: Seostab nomen'i kehastusega, millel on vastavas leksikaalses märkimissüsteemis eelistatuks valitud otsielement. @et
toolkit label: normitud otsielement kehastusele @et
toolkit definition: Kehastus, millel on vastavas leksikaalses märkimissüsteemis eelistatuks valitud otsielement. @et
label: ist normierter Sucheinstieg für eine Manifestation von @de
definition: Setzt ein Nomen in Beziehung zu einer Manifestation, die über einen Sucheinstieg für eine Manifestation verfügt, der in einem bestimmten Vocabulary Encoding Scheme als Vorzugsform bestimmt wird. @de
toolkit label: Normierter Sucheinstieg für eine Manifestation von @de
toolkit definition: Eine Manifestation, die über einen Sucheinstieg für eine Manifestation verfügt, der in einem bestimmten Vocabulary Encoding Scheme als Vorzugsform bestimmt wird. @de
label: autorizált hozzáférési pont a következő megjelenési formához: @hu
definition: Hozzákapcsol egy noment egy megjelenési formához, amelynek van egy előnyben részesített hozzáférési pontja a megjelenési formához, amelyet egy speciális szótárkódolási sémából választanak ki. @hu
toolkit label: autorizált hozzáférési pont a következő megjelenési formához: @hu
toolkit definition: Egy megjelenési forma, amelynek van egy előnyben részesített hozzáférési pontja a megjelenési formához, amelyet egy speciális szótárkódolási sémából választanak ki. @hu
label: è punto d'accesso autorizzato per manifestazione di @it
definition: Correla un nomen a una manifestazione che ha un punto d'accesso per la manifestazione che è stato selezionato come preferito in uno specifico schema di codifica di vocabolario. @it
toolkit label: punto d'accesso autorizzato per manifestazione di @it
toolkit definition: Una manifestazione che ha un punto d'accesso per la manifestazione che è stato selezionato come preferito in uno specifico schema di codifica di vocabolario. @it
label: ir autoritatīvā vārdforma manifestācijai @lv
definition: Sasaista nomenu ar manifestāciju, kam ir manifetācijas pamatforma, kas izvēlēta no konkrētas vārdnīcas. @lv
toolkit label: ir autoritatīvā vārdforma manifestācijai @lv
toolkit definition: Manifestācija, kam ir manifetācijas pamatforma, kas izvēlēta no konkrētas vārdnīcas. @lv
label: 是……的载体表现的规范检索点 @zh-hans
definition: 将一个命名与有在一个特定的词表编码体系中被首选的载体表现检索点的一种载体表现关联起来。 @zh-hans
toolkit label: ……的载体表现的规范检索点 @zh-hans
toolkit definition: 有在一个特定的词表编码体系中被首选的载体表现检索点的一种载体表现 @zh-hans
has subproperty: P80089
label: gösterimi için yetkili erişim noktasıdır @tr
definition: Bir ismi, belirli bir kelime kodlama şemasında tercih için seçilen gösterim için bir erişim noktasına sahip olan bir gösterimle ilişkilendirir. @tr
toolkit label: gösterim için yetkili erişim noktası @tr
toolkit definition: Belirli bir kelime kodlama şemasında tercih edilmek üzere seçilmeyen bir gösterim için bir erişim noktasına sahip olan bir gösterim. @tr

is authorized access point for person of
status: Published
type: Property
lexical alias: authorizedAccessPointForPersonOf.en
definition: Relates a nomen to a person who has an access point for person that is selected for preference in a specific vocabulary encoding scheme.
domain: C10012
toolkit label: authorized access point for person of
toolkit definition: A person who has an access point for person that is selected for preference in a specific vocabulary encoding scheme.
sub property of: is access point for person of
sub property of: is authorized access point for agent of
has element type: 2
label: auktorisoitu hakutieto henkilölle @fi
definition: Liittää nomenin henkilöön, jolla on tietyssä sanaston merkintäjärjestelmässä ensisijaiseksi valittu hakutieto. @fi
toolkit label: auktorisoitu hakutieto henkilölle @fi
toolkit definition: Henkilö, jolla on tietyssä sanaston merkintäjärjestelmässä ensisijaiseksi valittu hakutieto. @fi
label: er autorisert søkeinngang for person for @no
definition: Relaterer et nomen til en person som har en søkeinngang for person som er valgt som preferanse i et bestemt kodeskjema for vokabular. @no
toolkit label: autorisert søkeinngang for person for @no
toolkit definition: En person som har en søkeinngang for person som er valgt som preferanse i et bestemt kodeskjema for vokabular. @no
label: est un point d’accès autorisé d’une personne de @fr
definition: Met un nomen en relation avec une personne qui possède un point d’accès d’une personne faisant l’objet d’un choix privilégié dans un schéma d’encodage de vocabulaire spécifique. @fr
toolkit label: point d’accès autorisé d’une personne de @fr
toolkit definition: Personne qui possède un point d’accès d’une personne faisant l’objet d’un choix privilégié dans un schéma d’encodage de vocabulaire spécifique. @fr
label: is geautoriseerde ingang voor persoon van @nl
definition: Relateert een nomen aan een persoon die een ingang voor persoon heeft die als voorkeursterm geselecteerd is in een specifiek vocabulair coderingssysteem. @nl
toolkit label: geautoriseerde ingang voor persoon van @nl
toolkit definition: Een persoon die een ingang voor persoon heeft die als voorkeursterm geselecteerd is in een specifiek vocabulair coderingssysteem. @nl
label: هي نقطة وصول مقننة لشخص لـ @ar
definition: يربط تسمية بشخص له نقطة وصول لشخص اختيرت للتفضيل في خطة ترميز مفردات محددة. @ar
toolkit label: نقطة وصول مقننة لشخص لـ @ar
toolkit definition: شخص له نقطة وصول لشخص اختيرت للتفضيل في خطة ترميز مفردات محددة. @ar
label: és punt d’accés autoritzat de persona de @ca
definition: Relaciona un nomen amb una persona que té un punt d’accés de persona que se selecciona com a preferent en un esquema de codificació de vocabulari específic. @ca
toolkit label: punt d’accés autoritzat de persona de @ca
toolkit definition: Persona que té un punt d’accés de persona que se selecciona com a preferent en un esquema de codificació de vocabulari específic. @ca
label: er autoriseret søgeindgang for person af @da
definition: Relaterer et nomen til en person, som har en søgeindgang for person, som er valgt som præference i et specifikt vokabularkodningsskema. @da
toolkit label: autoriseret søgeindgang for person af @da
toolkit definition: Person, som har en søgeindgang for person, som er valgt som præference i et specifikt vokabularkodningsskema. @da
label: normitud otsielement isikule @et
definition: Seostab nomen'i isikuga, kellel on vastavas leksikaalses märkimissüsteemis eelistatuks valitud otsielement. @et
toolkit label: normitud otsielement isikule @et
toolkit definition: Isik, kellel on vastavas leksikaalses märkimissüsteemis eelistatuks valitud otsielement. @et
label: ist normierter Sucheinstieg für eine Person von @de
definition: Setzt ein Nomen in Beziehung zu einer Person, die über einen Sucheinstieg für eine Person verfügt, der in einem bestimmten Vocabulary Encoding Scheme als Vorzugsform bestimmt wird. @de
toolkit label: Normierter Sucheinstieg für eine Person von @de
toolkit definition: Eine Person, die über einen Sucheinstieg für eine Person verfügt, der in einem bestimmten Vocabulary Encoding Scheme als Vorzugsform bestimmt wird. @de
label: autorizált hozzáférési pont a következő személyhez: @hu
definition: Hozzákapcsol egy noment egy személyhez, akinek van egy előnyben részesített hozzáférési pontja a személyhez, amelyet egy adott szótárkódolási sémából választanak ki. @hu
toolkit label: autorizált hozzáférési pont a következő személyhez: @hu
toolkit definition: Egy személy, akinek van egy előnyben részesített hozzáférési pontja a személyhez, amelyet egy adott szótárkódolási sémából választanak ki. @hu
label: è punto d'accesso autorizzato per persona di @it
definition: Correla un nomen a una persona che ha un punto d'accesso per la persona che è stato selezionato come preferito in uno specifico schema di codifica di vocabolario. @it
toolkit label: punto d'accesso autorizzato per persona di @it
toolkit definition: Una persona che ha un punto d'accesso per la persona che è stato selezionato come preferito in uno specifico schema di codifica di vocabolario. @it
label: ir personas autoritatīvā pamatforma @lv
definition: Sasaista nomenu ar personu, kurai ir personas pamatforma, kas izvēlēta no konkrētas vārdnīcas. @lv
toolkit label: ir personas autoritatīvā pamatforma @lv
toolkit definition: Persona, kurai ir personas pamatforma, kas izvēlēta no konkrētas vārdnīcas. @lv
label: 是……的个人的规范检索点 @zh-hans
definition: 将一个命名与有在一个特定的词表编码体系中被首选的个人检索点的一个个人关联起来。 @zh-hans
toolkit label: ……的个人的规范检索点 @zh-hans
toolkit definition: 有在一个特定的词表编码体系中被首选的个人检索点的一个个人 @zh-hans
has subproperty: P80107
label: kişisi için yetkili erişim noktası @tr
definition: Bir ismi, belirli bir kelime kodlama şemasında tercih için seçilen kişi için erişim noktası olan bir kişiyle ilişkilendirir. @tr
toolkit label: kişi için yetkili erişim noktası @tr
toolkit definition: Belirli bir kelime kodlama şemasında tercih için seçilen kişi için erişim noktası olan bir kişi. @tr

is authorized access point for place of
status: Published
type: Property
lexical alias: authorizedAccessPointForPlaceOf.en
definition: Relates a nomen to a place that has an access point for place that is selected for preference in a specific vocabulary encoding scheme.
domain: C10012
toolkit label: authorized access point for place of
toolkit definition: A place that has an access point for place that is selected for preference in a specific vocabulary encoding scheme.
sub property of: is access point for place of
has element type: 2
sub property of: is authorized access point for RDA entity of
label: auktorisoitu hakutieto paikalle @fi
definition: Liittää nomenin paikkaan, jolla on tietyssä sanaston merkintäjärjestelmässä ensisijaiseksi valittu hakutieto. @fi
toolkit label: auktorisoitu hakutieto paikalle @fi
toolkit definition: Paikka, jolla on tietyssä sanaston merkintäjärjestelmässä ensisijaiseksi valittu hakutieto. @fi
label: er autorisert søkeinngang for sted for @no
definition: Relaterer et nomen til et sted som har en søkeinngang for sted som er valgt som preferanse i et bestemt kodeskjema for vokabular. @no
toolkit label: autorisert søkeinngang for sted for @no
toolkit definition: Et sted som har en søkeinngang for sted som er valgt som preferanse i et bestemt kodeskjema for vokabular. @no
label: est un point d’accès autorisé d’un lieu de @fr
definition: Met un nomen en relation avec un lieu qui possède un point d’accès d’un lieu faisant l’objet d’un choix privilégié dans un schéma d’encodage de vocabulaire spécifique. @fr
toolkit label: point d’accès autorisé d’un lieu de @fr
toolkit definition: Lieu qui possède un point d’accès d’un lieu faisant l’objet d’un choix privilégié dans un schéma d’encodage de vocabulaire spécifique. @fr
label: is geautoriseerde ingang voor plaats van @nl
definition: Relateert een nomen aan een plaats die een ingang voor plaats heeft die als voorkeursterm geselecteerd is in een specifiek vocabulair coderingssysteem. @nl
toolkit label: geautoriseerde ingang voor plaats van @nl
toolkit definition: Een plaats die een ingang voor plaats heeft die als voorkeursterm geselecteerd is in een specifiek vocabulair coderingssysteem. @nl
label: هي نقطة وصول مقننة لمكان لـ @ar
definition: يربط تسمية بمكان له نقطة وصول لمكان اختيرت للتفضيل في خطة ترميز مفردات محددة. @ar
toolkit label: نقطة وصول مقننة لمكان لـ @ar
toolkit definition: مكان له نقطة وصول لمكان اختيرت للتفضيل في خطة ترميز مفردات محددة. @ar
label: és punt d’accés autoritzat de lloc de @ca
definition: Relaciona un nomen amb un lloc que té un punt d’accés de lloc que se selecciona com a preferent en un esquema de codificació de vocabulari específic. @ca
toolkit label: punt d’accés autoritzat de lloc de @ca
toolkit definition: Lloc que té un punt d’accés de lloc que se selecciona com a preferent en un esquema de codificació de vocabulari específic. @ca
label: er autoriseret søgeindgang for sted af @da
definition: Relaterer et nomen til et sted, som har en søgeindgang for sted, som er valgt som præference i et specifikt vokabularkodningsskema. @da
toolkit label: autoriseret søgeindgang for sted af @da
toolkit definition: Sted, som har en søgeindgang for sted, som er valgt som præference i et specifikt vokabularkodningsskema. @da
label: normitud otsielement kohale @et
definition: Seostab nomen'i kohaga, millel on vastavas leksikaalses märkimissüsteemis eelistatuks valitud otsielement. @et
toolkit label: normitud otsielement kohale @et
toolkit definition: Koht, millel on vastavas leksikaalses märkimissüsteemis eelistatuks valitud otsielement. @et
label: ist normierter Sucheinstieg für ein Geografikum von @de
definition: Setzt ein Nomen in Beziehung zu einem Geografikum, das über einen Sucheinstieg für ein Geografikum verfügt, der in einem bestimmten Vocabulary Encoding Scheme als Vorzugsform bestimmt wird. @de
toolkit label: Normierter Sucheinstieg für Geografikum von @de
toolkit definition: Ein Geografikum, das über einen Sucheinstieg für ein Geografikum verfügt, der in einem bestimmten Vocabulary Encoding Scheme als Vorzugsform bestimmt wird. @de
label: autorizált hozzáférési pont a következő helyhez: @hu
definition: Hozzákapcsol egy noment egy helyhez, amelynek van egy előnyben részesített hozzáférési pontja a helyhez, amelyet egy adott szótárkódolási sémából választanak ki. @hu
toolkit label: autorizált hozzáférési pont a következő helyhez: @hu
toolkit definition: Egy hely, amelynek van egy előnyben részesített hozzáférési pontja a helyhez, amelyet egy adott szótárkódolási sémából választanak ki. @hu
label: è punto d'accesso autorizzato per luogo di @it
definition: Correla un nomen a un luogo che ha un punto d'accesso per il luogo che è stato selezionato come preferito in uno specifico schema di codifica di vocabolario. @it
toolkit label: punto d'accesso autorizzato per luogo di @it
toolkit definition: Un luogo che ha un punto d'accesso per il luogo che è stato selezionato come preferito in uno specifico schema di codifica di vocabolario. @it
label: ir vietas autoritatīvā pamatforma @lv
definition: Sasaista nomenu ar vietu, kurai ir vietas pamatforma, kas izvēlēta no konkrētas vārdnīcas. @lv
toolkit label: ir vietas autoritatīvā pamatforma @lv
toolkit definition: Vieta, kurai ir vietas pamatforma, kas izvēlēta no konkrētas vārdnīcas. @lv
label: 是……的地点的规范检索点 @zh-hans
definition: 将一个命名与有在一个特定的词表编码体系中被首选的地点检索点的一个地点关联起来。 @zh-hans
toolkit label: ……的地点的规范检索点 @zh-hans
toolkit definition: 有在一个特定的词表编码体系中被首选的地点检索点的一个地点 @zh-hans
has subproperty: P80085
label: yeri için yetkili erişim noktasıdır @tr
definition: Bir ismi, belirli bir kelime kodlama şemasında tercih edilmek üzere seçilen bir yer için erişim noktası olan bir yerle ilişkilendirir. @tr
toolkit label: yer için yetkili erişim noktası @tr
toolkit definition: Belirli bir kelime kodlama şemasında tercih edilmek üzere seçilen bir yer için erişim noktası olan bir yer. @tr

is authorized access point for RDA entity of
status: Published
type: Property
lexical alias: authorizedAccessPointForRDAEntityOf.en
definition: Relates a nomen to an RDA entity that has an access point for RDA entity that is selected for preference in a specific vocabulary encoding scheme.
domain: C10012
toolkit label: authorized access point for RDA entity of
toolkit definition: An RDA entity that has an access point for RDA entity that is selected for preference in a specific vocabulary encoding scheme.
has element type: 2
sub property of: is access point for RDA entity of
label: auktorisoitu hakutieto RDA-entiteetille @fi
definition: Liittää nomenin RDA-entiteettiin, jolla on tietyssä sanaston merkintäjärjestelmässä ensisijaiseksi valittu hakutieto. @fi
toolkit label: auktorisoitu hakutieto RDA-entiteetille @fi
toolkit definition: RDA-entiteetti, jolla on tietyssä sanaston merkintäjärjestelmässä ensisijaiseksi valittu hakutieto. @fi
label: er autorisert søkeinngang for RDA-entitet for @no
definition: Relaterer et nomen til en RDA-entitet som har en søkeinngang for RDA-entitet som er valgt som preferanse i et bestemt kodeskjema for vokabular. @no
toolkit label: autorisert søkeinngang for RDA-entitet for @no
toolkit definition: En RDA-entitet som har en søkeinngang for RDA-entitet som er valgt som preferanse i et bestemt kodeskjema for vokabular. @no
label: est un point d’accès autorisé d’une entité RDA de @fr
definition: Met un nomen en relation avec une entité RDA qui possède un point d’accès d’une entité RDA faisant l’objet d’un choix privilégié dans un schéma d’encodage de vocabulaire spécifique. @fr
toolkit label: point d’accès autorisé d’une entité RDA de @fr
toolkit definition: Entité RDA qui possède un point d’accès d’une entité RDA faisant l’objet d’un choix privilégié dans un schéma d’encodage de vocabulaire spécifique. @fr
label: is geautoriseerde ingang voor RDA-entiteit van @nl
definition: Relateert een nomen aan een RDA-entiteit die een ingang voor RDA-entiteit heeft die als voorkeursterm geselecteerd is in een specifiek vocabulair coderingssysteem. @nl
toolkit label: geautoriseerde ingang voor RDA-entiteit van @nl
toolkit definition: Een RDA-entiteit die een ingang voor RDA-entiteit heeft die als voorkeursterm geselecteerd is in een specifiek vocabulair coderingssysteem. @nl
label: هي نقطة وصول مقننة لكيان "وام" لـ @ar
definition: يربط تسمية بكيان "وام" له نقطة وصول لكيان "وام" اختيرت للتفضيل في خطة ترميز مفردات محددة. @ar
toolkit label: نقطة وصول مقننة لكيان "وام" لـ @ar
toolkit definition: كيان "وام" له نقطة وصول لكيان "وام" اختيرت للتفضيل في خطة ترميز مفردات محددة. @ar
label: és punt d’accés autoritzat d’entitat RDA de @ca
definition: Relaciona un nomen amb una entitat RDA que té un punt d’accés d’entitat RDA que se selecciona en un esquema de codificació de vocabulari específic. @ca
toolkit label: punt d’accés autoritzat d’entitat RDA de @ca
toolkit definition: Entitat RDA que té un punt d’accés d’entitat RDA que se selecciona en un esquema de codificació de vocabulari específic. @ca
label: er autoriseret søgeindgang for RDA-entitet af @da
definition: Relaterer et nomen til en RDA-entitet, som har en søgeindgang for RDA-entitet, som er valgt som præference i et specifikt vokabularkodningsskema. @da
toolkit label: autoriseret søgeindgang for RDA-entitet af @da
toolkit definition: RDA-entitet, som har en søgeindgang for RDA-entitet, som er valgt som præference i et specifikt vokabularkodningsskema. @da
label: normitud otsielement RDA olemile @et
definition: Seostab nomen'i RDA olemiga, millel on vastavas leksikaalses märkimissüsteemis eelistatuks valitud otsielement. @et
toolkit label: normitud otsielement RDA olemile @et
toolkit definition: RDA olem, millel on vastavas leksikaalses märkimissüsteemis eelistatuks valitud otsielement. @et
label: ist normierter Sucheinstieg für eine RDA-Entität von @de
definition: Setzt ein Nomen in Beziehung zu einer RDA-Entität, die über einen Sucheinstieg für eine RDA-Entität verfügt, der in einem bestimmten Vocabulary Encoding Scheme als Vorzugsform bestimmt wird. @de
toolkit label: Normierter Sucheinstieg für eine RDA-Entität von @de
toolkit definition: Eine RDA-Entität, die über einen Sucheinstieg für eine RDA-Entität verfügt, der in einem bestimmten Vocabulary Encoding Scheme als Vorzugsform bestimmt wird. @de
label: autorizált hozzáférési pont a következő RDA-entitás számára: @hu
definition: Hozzákapcsol egy noment egy RDA-entitáshoz, amelynek van egy olyan hozzáférési pontja az RDA-entitás számára, amelyet egy adott szótárkódolási sémából kiválasztva előnyben részesítenek. @hu
toolkit label: autorizált hozzáférési pont a következő RDA-entitás számára: @hu
toolkit definition: Egy RDA-entitás, amelynek van egy olyan hozzáférési pontja az RDA-entitás számára, amelyet egy adott szótárkódolási sémából kiválasztva előnyben részesítenek. @hu
label: è punto d'accesso autorizzato per l'entità RDA di @it
definition: Correla un nomen a un'entità RDA che ha un punto d'accesso per l'entità RDA che è stato selezionato come preferito in uno specifico schema di codifica di vocabolario. @it
toolkit label: punto d'accesso autorizzato per l'entità RDA di @it
toolkit definition: Un'entità RDA che ha un punto d'accesso per l'entità RDA che è stato selezionato come preferito in uno specifico schema di codifica di vocabolario. @it
label: ir RDA entītes autoritatīvā pamatforma @lv
definition: Sasaista nomenu ar RDA entīti, kurai ir Sasaista nomenu ar RDA entītis pamatforma, kas izvēlēta no konkrētas vārdnīcas. @lv
toolkit label: ir RDA entītes autoritatīvā pamatforma @lv
toolkit definition: RDA entīte, kurai ir RDA entītes pamatforma, kas izvēlēta no konkrētas vārdnīcas. @lv
label: 是……的RDA实体的规范检索点 @zh-hans
definition: 将一个命名与有在一个特定的词表编码体系中被首选的RDA实体检索点的一个RDA实体关联起来。 @zh-hans
toolkit label: ……的RDA实体的规范检索点 @zh-hans
toolkit definition: 有在一个特定的词表编码体系中被首选的RDA实体检索点的一个RDA实体 @zh-hans
has subproperty: is authorized access point for agent of
has subproperty: is authorized access point for expression of
has subproperty: is authorized access point for item of
has subproperty: is authorized access point for manifestation of
has subproperty: is authorized access point for place of
has subproperty: is authorized access point for timespan of
has subproperty: is authorized access point for work of
has subproperty: P80162
label: RDA varlığı için yetkili erişim noktasıdır @tr
definition: Bir ismi, belirli bir kelime kodlama şemasında tercih edilmek üzere seçilen RDA varlığına erişim noktası olan bir RDA varlığıyla ilişkilendirir. @tr
toolkit label: RDA varlığı için yetkili erişim noktası @tr
toolkit definition: Belirli bir kelime kodlama şemasında tercih edilmek üzere seçilen bir RDA varlığına erişim noktası olan bir RDA varlığı. @tr

is authorized access point for timespan of
status: Published
type: Property
lexical alias: authorizedAccessPointForTimespanOf.en
definition: Relates a nomen to a timespan that has an access point for timespan that is selected for preference in a specific vocabulary encoding scheme.
domain: C10012
toolkit label: authorized access point for timespan of
toolkit definition: A timespan that has an access point for timespan that is selected for preference in a specific vocabulary encoding scheme.
sub property of: is access point for timespan of
has element type: 2
sub property of: is authorized access point for RDA entity of
label: auktorisoitu hakutieto ajanjaksolle @fi
definition: Liittää nomenin ajanjaksoon, jolla on tietyssä sanaston merkintäjärjestelmässä ensisijaiseksi valittu hakutieto. @fi
toolkit label: auktorisoitu hakutieto ajanjaksolle @fi
toolkit definition: Ajanjakso, jolla on tietyssä sanaston merkintäjärjestelmässä ensisijaiseksi valittu hakutieto. @fi
label: er autorisert søkeinngang for tidsrom for @no
definition: Relaterer et nomen til et tidsrom som har en søkeinngang for tidsrom som er valgt som preferanse i et bestemt kodeskjema for vokabular. @no
toolkit label: autorisert søkeinngang for tidsrom for @no
toolkit definition: Et tidsrom som har en søkeinngang for tidsrom som er valgt som preferanse i et bestemt kodeskjema for vokabular. @no
label: est un point d’accès autorisé d’un laps de temps de @fr
definition: Met un nomen en relation avec un laps de temps qui possède un point d’accès d’un laps de temps faisant l’objet d’un choix privilégié dans un schéma d’encodage de vocabulaire spécifique. @fr
toolkit label: point d’accès autorisé d’un laps de temps de @fr
toolkit definition: Laps de temps qui possède un point d’accès d’un laps de temps faisant l’objet d’un choix privilégié dans un schéma d’encodage de vocabulaire spécifique. @fr
label: is geautoriseerde ingang voor tijdspanne van @nl
definition: Relateert een nomen aan een tijdspanne die een ingang voor tijdspanne heeft die als voorkeursterm geselecteerd is in een specifiek vocabulair coderingssysteem. @nl
toolkit label: geautoriseerde ingang voor tijdspanne van @nl
toolkit definition: Een tijdspanne die een ingang voor tijdspanne heeft die als voorkeursterm geselecteerd is in een specifiek vocabulair coderingssysteem. @nl
label: هي نقطة وصول مقننة لفترة زمنية لـ @ar
definition: يربط تسمية بفترة زمنية لها نقطة وصول لفترة زمنية، اختيرت للتفضيل في خطة ترميز مفردات محددة. @ar
toolkit label: نقطة وصول مقننة لفترة زمنية لـ @ar
toolkit definition: فترة زمنية لها نقطة وصول لفترة زمنية، اختيرت للتفضيل في خطة ترميز مفردات محددة. @ar
label: és punt d’accés autoritzat d’interval de temps de @ca
definition: Relaciona un nomen amb un interval de temps que té un punt d’accés d’interval de temps que se selecciona com a preferent en un esquema de codificació de vocabulari específic. @ca
toolkit label: punt d’accés autoritzat d’interval de temps de @ca
toolkit definition: Interval de temps que té un punt d’accés d’interval de temps que se selecciona com a preferent en un esquema de codificació de vocabulari específic. @ca
label: er autoriseret søgeindgang for tidsperiode af @da
definition: Relaterer et nomen til en tidsperiode, som har en søgeindgang for tidsperiode, som er valgt som præference i et specifikt vokabularkodningsskema. @da
toolkit label: autoriseret søgeindgang for tidsperiode af @da
toolkit definition: Tidsperiode, som har en søgeindgang for tidsperiode, som er valgt som præference i et specifikt vokabularkodningsskema. @da
label: normitud otsielement ajavahemikule @et
definition: Seostab nomen'i ajavahemikuga, millel on vastavas leksikaalses märkimissüsteemis eelistatuks valitud otsielement. @et
toolkit label: normitud otsielement ajavahemikule @et
toolkit definition: Ajavahemik, millel on vastavas leksikaalses märkimissüsteemis eelistatuks valitud otsielement. @et
label: ist normierter Sucheinstieg für einen Zeitraum von @de
definition: Setzt ein Nomen in Beziehung zu einem Zeitraum, der über einen Sucheinstieg für einen Zeitraum verfügt, der in einem bestimmten Vocabulary Encoding Scheme als Vorzugsform bestimmt wird. @de
toolkit label: Normierter Sucheinstieg für einen Zeitraum von @de
toolkit definition: Ein Zeitraum, der über einen Sucheinstieg für einen Zeitraum verfügt, der in einem bestimmten Vocabulary Encoding Scheme als Vorzugsform bestimmt wird. @de
label: autorizált hozzáférési pont a következő időtartamhoz: @hu
definition: Hozzákapcsol egy noment egy időtartamhoz, amelynek van egy előnyben részesített hozzáférési pontja az időtartamhoz, amelyet egy adott szótárkódolási sémából választanak ki. @hu
toolkit label: autorizált hozzáférési pont a következő időtartamhoz: @hu
toolkit definition: Egy időtartam, amelynek van egy előnyben részesített hozzáférési pontja az időtartamhoz, amelyet egy adott szótárkódolási sémából választanak ki. @hu
label: è punto d'accesso autorizzato per arco di tempo di @it
definition: Correla un nomen a un arco di tempo che ha un punto d'accesso per l'arco di tempo che è stato selezionato come preferito in uno specifico schema di codifica di vocabolario. @it
toolkit label: punto d'accesso autorizzato per arco di tempo di @it
toolkit definition: Un arco di tempo che ha un punto d'accesso per l'arco di tempo che è stato selezionato come preferito in uno specifico schema di codifica di vocabolario. @it
label: ir laikposma autoritatīvā pamatforma @lv
definition: Sasaista nomenu ar laikposmu, kuram ir laikposma pamatforma, kas izvēlēta no konkrētas vārdnīcas. @lv
toolkit label: ir laikposma autoritatīvā pamatforma @lv
toolkit definition: Laikposma, kuram ir laikposma pamatforma, kas izvēlēta no konkrētas vārdnīcas. @lv
label: 是……的时间段的规范检索点 @zh-hans
definition: 将一个命名与有在一个特定的词表编码体系中被首选的时间段检索点的一个时间段关联起来。 @zh-hans
toolkit label: ……的时间段的规范检索点 @zh-hans
toolkit definition: 有在一个特定的词表编码体系中被首选的时间段检索点的一个时间段 @zh-hans
has subproperty: P80081
label: zaman aralığı için yetkili erişim noktasıdır @tr
definition: Bir ismi, belirli bir kelime kodlama şemasında tercih için seçilen zaman aralığı için erişim noktası olan bir zaman aralığıyla ilişkilendirir. @tr
toolkit label: zaman aralığı için yetkili erişim noktası @tr
toolkit definition: Belirli bir kelime kodlama şemasında tercih için seçilen zaman aralığı için bir erişim noktası olan bir zaman aralığı. @tr

is authorized access point for work group of
status: Published
lexical alias: authorizedAccessPointForWorkGroupOf.en
definition: Relates a nomen to a work that has an authorized access point for work used in a specific vocabulary encoding scheme to identify a work group.
toolkit label: authorized access point for work group of
toolkit definition: A work that has an authorized access point for work used in a specific vocabulary encoding scheme to identify a work group.
type: Property
domain: C10012
has element type: 2
sub property of: is appellation of work group of
sub property of: is authorized access point for work of
label: auktorisoitu hakutieto teosryhmälle @fi
definition: Liittää nomenin teokseen, jolla on tietyssä sanaston merkintäjärjestelmässä ensisijaiseksi valittu teosryhmän hakutieto. @fi
toolkit label: auktorisoitu hakutieto teosryhmälle @fi
toolkit definition: Teos, jolla on tietyssä sanaston merkintäjärjestelmässä ensisijaiseksi valittu teosryhmän hakutieto. @fi
label: er autorisert søkeinngang for verksgruppe for @no
definition: Relaterer et nomen til et verk som har en søkeinngang for verk som er valgt som preferanse i et bestemt kodeskjema for vokabular som brukes for å identifisere en verksgruppe. @no
toolkit label: autorisert søkeinngang for verksgruppe for @no
toolkit definition: Et verk som har en søkeinngang for verk som er valgt som preferanse i et bestemt kodeskjema for vokabular som brukes for å identifisere en verksgruppe. @no
label: est un point d’accès autorisé d’un groupe d’œuvres de @fr
definition: Met un nomen en relation avec une œuvre qui possède un point d’accès autorisé d’une œuvre utilisé dans un schéma d’encodage de vocabulaire spécifique pour identifier un groupe d’œuvres. @fr
toolkit label: point d’accès autorisé d’un groupe d’œuvres de @fr
toolkit definition: Œuvre qui possède un point d’accès autorisé d’une œuvre utilisé dans un schéma d’encodage de vocabulaire spécifique pour identifier un groupe d’œuvres. @fr
label: is geautoriseerde ingang voor werkgroep van @nl
definition: Relateert een nomen aan een werk dat een voorkeursingang voor werk heeft in een specifiek vocabulair coderingssysteem gebruikt om een werkgroep te identificeren. @nl
toolkit label: geautoriseerde ingang voor werkgroep van @nl
toolkit definition: Een werk dat een voorkeursingang voor werk heeft in een specifiek vocabulair coderingssysteem gebruikt om een werkgroep te identificeren. @nl
label: هي نقطة وصول مقننة لمجموعة عمل لـ @ar
definition: يربط تسمية بعمل له نقطة وصول لعمل اختيرت للتفضيل في خطة ترميز مفردات محددة مستخدمة لتعريف مجموعة عمل. @ar
toolkit label: نقطة وصول مقننة لمجموعة عمل لـ @ar
toolkit definition: عمل له نقطة وصول لعمل اختيرت للتفضيل في خطة ترميز مفردات محددة مستخدمة لتعريف مجموعة عمل. @ar
label: és punt d’accés autoritzat de grup d’obres de @ca
definition: Relaciona un nomen amb una obra que té un punt d’accés autoritzat d’obra usat en un esquema de codificació de vocabulari específic per identificar un grup d’obres. @ca
toolkit label: punt d’accés autoritzat de grup d’obres de @ca
toolkit definition: Obra que té un punt d’accés autoritzat d’obra usat en un esquema de codificació de vocabulari específic per identificar un grup d’obres. @ca
label: er autoriseret søgeindgang for værksgruppe af @da
definition: Relaterer et nomen til et værk, som har en søgeindgang for værk, som er valgt som præference i et specifikt vokabularkodningsskema, som bruges for at identificere en værksgruppe. @da
toolkit label: autoriseret søgeindgang for værksgruppe af @da
toolkit definition: Værk, som har en søgeindgang for værk, som er valgt som præference i et specifikt vokabularkodningsskema, som bruges for at identificere en værksgruppe. @da
label: teoserühma otsielement teosele @et
definition: Seostab nomen'i teosega, millel on vastavas leksikaalses märkimissüsteemis eelistatuks valitud, teoserühma identifitseeriv otsielement. @et
toolkit label: teoserühma otsielement teosele @et
toolkit definition: Teos, millel on vastavas leksikaalses märkimissüsteemis eelistatuks valitud, teoserühma identifitseeriv otsielement. @et
label: ist normierter Sucheinstieg für eine Werkgruppe von @de
definition: Setzt ein Nomen in Beziehung zu einem Werk, das über einen Sucheinstieg für ein Werk verfügt, der in einem bestimmten Vocabulary Encoding Scheme als Vorzugsform bestimmt wird, um eine Werkgruppe zu identifizieren. @de
toolkit label: Normierter Sucheinstieg für eine Werkgruppe von @de
toolkit definition: Ein Werk, das über einen Sucheinstieg für ein Werk verfügt, der in einem bestimmten Vocabulary Encoding Scheme als Vorzugsform bestimmt wird, um eine Werkgruppe zu identifizieren. @de
label: autorizált hozzáférési pont a következő műcsoport számára: @hu
definition: Hozzákapcsol egy noment egy műhöz, amelynek van egy előnyben részesített hozzáférési pontja a műhöz, amelyet egy speciális szótárkódolási sémából választanak ki. @hu
toolkit label: autorizált hozzáférési pont a következő műhöz: @hu
toolkit definition: Egy mű, amelynek van egy előnyben részesített hozzáférési pontja a műhöz, amelyet egy speciális szótárkódolási sémából választanak ki. @hu
label: è punto d'accesso autorizzato per gruppo di opere di @it
definition: Correla un nomen a un'opera che ha un punto d'accesso per l'opera che è stato selezionato come preferito in uno specifico schema di codifica di vocabolario. @it
toolkit label: punto d'accesso autorizzato per gruppo di opere di @it
toolkit definition: Un'opera che ha un punto d'accesso per l'opera che è stato selezionato come preferito in uno specifico schema di codifica di vocabolario. @it
label: ir autoritatīvā vārdforma darbu grupai @lv
definition: Sasaista nomenu ar darbu, kam ir vārdforma, kas ir izvēlēta kā prioritāra noteiktai kontrolētas vārdnīcas shēmai, lai identificētu darbu grupu. @lv
toolkit label: ir autoritatīvā vārdforma darbu grupai @lv
toolkit definition: Darbs, kam ir vārdforma, kas ir izvēlēta kā prioritāra noteiktai kontrolētas vārdnīcas shēmai, lai identificētu darbu grupu. @lv
label: 是……的作品群的规范检索点 @zh-hans
definition: 将一个命名与有在一个特定的词表编码体系中被首选用于标识一个作品群的作品检索点的一种作品关联起来。 @zh-hans
toolkit label: ……的作品群的规范检索点 @zh-hans
toolkit definition: 有在一个特定的词表编码体系中被首选用于标识一个作品群的作品检索点的一种作品 @zh-hans
has subproperty: P80173
label: çalışma grubunun yetkili erişim noktasıdır @tr
definition: Bir ismi, çalışma grubunu tanımlamak için kullanılan belirli bir sözcük kodlama düzeninde tercih için seçilen eser için bir erişim noktasına sahip olan bir eserle ilişkilendirir. @tr
toolkit label: eser grubu için yetkili erişim noktası @tr
toolkit definition: Eser grubunu tanımlamak için kullanılan belirli bir kelime kodlama şemasında tercihen seçilen eser için bir erişim noktasına sahip olan bir eser. @tr

is authorized access point for work of
status: Published
type: Property
lexical alias: authorizedAccessPointForWorkOf.en
definition: Relates a nomen to a work that has an access point for work that is selected for preference in a specific vocabulary encoding scheme.
domain: C10012
toolkit label: authorized access point for work of
toolkit definition: A work that has an access point for work that is selected for preference in a specific vocabulary encoding scheme.
sub property of: is access point for work of
has element type: 2
sub property of: is authorized access point for RDA entity of
label: auktorisoitu hakutieto teokselle @fi
definition: Liittää nomenin teokseen, jolla on tietyssä sanaston merkintäjärjestelmässä ensisijaiseksi valittu hakutieto. @fi
toolkit label: auktorisoitu hakutieto teokselle @fi
toolkit definition: Teos, jolla on tietyssä sanaston merkintäjärjestelmässä ensisijaiseksi valittu hakutieto. @fi
label: er autorisert søkeinngang for verk for @no
definition: Relaterer et nomen til et verk som har en søkeinngang for verk som er valgt som preferanse i et bestemt kodeskjema for vokabular. @no
toolkit label: autorisert søkeinngang for verk for @no
toolkit definition: Et verk som har en søkeinngang for verk som er valgt som preferanse i et bestemt kodeskjema for vokabular. @no
label: est un point d’accès autorisé d’une œuvre de @fr
definition: Met un nomen en relation avec une œuvre qui possède un point d’accès d’une œuvre faisant l’objet d’un choix privilégié dans un schéma d’encodage de vocabulaire spécifique. @fr
toolkit label: point d’accès autorisé d’une œuvre de @fr
toolkit definition: Œuvre qui possède un point d’accès d’une œuvre faisant l’objet d’un choix privilégié dans un schéma d’encodage de vocabulaire spécifique. @fr
label: is geautoriseerde ingang voor werk van @nl
definition: Relateert een nomen aan een werk dat een ingang voor werk heeft die als voorkeursterm geselecteerd is in een specifiek vocabulair coderingssysteem. @nl
toolkit label: geautoriseerde ingang voor werk van @nl
toolkit definition: Een werk dat een ingang voor werk heeft die als voorkeursterm geselecteerd is in een specifiek vocabulair coderingssysteem. @nl
label: هي نقطة وصول مقننة لعمل لـ @ar
definition: يربط تسمية بعمل له نقطة وصول لعمل، اختيرت للتفضيل في خطة ترميز مفردات محددة. @ar
toolkit label: نقطة وصول مقننة لعمل لـ @ar
toolkit definition: عمل له نقطة وصول لعمل، اختيرت للتفضيل في خطة ترميز مفردات محددة. @ar
label: és punt d’accés autoritzat d’obra de @ca
definition: Relaciona un nomen amb una obra que té un punt d’accés d’obra que se selecciona com a preferent en un esquema de codificació de vocabulari específic. @ca
toolkit label: punt d’accés autoritzat d’obra de @ca
toolkit definition: Obra que té un punt d’accés d’obra que se selecciona com a preferent en un esquema de codificació de vocabulari específic. @ca
label: er autoriseret søgeindgang for værk af @da
definition: Relaterer et nomen til et værk, som har en søgeindgang for værk, som er valgt som præference i et specifikt vokabularkodningsskema. @da
toolkit label: autoriseret søgeindgang for værk af @da
toolkit definition: Værk, som har en søgeindgang for værk, som er valgt som præference i et specifikt vokabularkodningsskema. @da
label: normitud otsielement teosele @et
definition: Seostab nomen'i teosega, millel on vastavas leksikaalses märkimissüsteemis eelistatuks valitud otsielement. @et
toolkit label: normitud otsielement teosele @et
toolkit definition: Teos, millel on vastavas leksikaalses märkimissüsteemis eelistatuks valitud otsielement. @et
label: ist normierter Sucheinstieg für ein Werk von @de
definition: Setzt ein Nomen in Beziehung zu einem Werk, das über einen Sucheinstieg für ein Werk verfügt, der in einem bestimmten Vocabulary Encoding Scheme als Vorzugsform bestimmt wird. @de
toolkit label: Normierter Sucheinstieg für ein Werk von @de
toolkit definition: Ein Werk, das über einen Sucheinstieg für ein Werk verfügt, der in einem bestimmten Vocabulary Encoding Scheme als Vorzugsform bestimmt wird. @de
label: autorizált hozzáférési pont a következő műhöz: @hu
definition: Hozzákapcsol egy noment egy műhöz, amelynek van egy olyan előnyben részesített hozzáférési pontja a műhöz, amelyet egy adott szótárkódolási sémából választanak ki. @hu
toolkit label: autorizált hozzáférési pont a következő műhöz: @hu
toolkit definition: Egy mű, amelynek van egy olyan előnyben részesített hozzáférési pontja a műhöz, amelyet egy adott szótárkódolási sémából választanak ki. @hu
label: è punto d'accesso autorizzato per opera di @it
definition: Correla un nomen a un'opera che ha un punto d'accesso per l'opera che è stato selezionato come preferito in uno specifico schema di codifica di vocabolario. @it
toolkit label: punto d'accesso autorizzato per opera di @it
toolkit definition: Un'opera che ha un punto d'accesso per l'opera che è stato selezionato come preferito in uno specifico schema di codifica di vocabolario. @it
label: ir autoritatīvā vārdforma darbam @lv
definition: Sasaista nomenu ar darbu, kam ir vārdforma, kas ir izvēlēta kā prioritāra noteiktai kontrolētas vārdnīcas shēmai. @lv
toolkit label: ir autoritatīvā vārdforma darbam @lv
toolkit definition: Darbs, kam ir vārdforma, kas ir izvēlēta kā prioritāra noteiktai kontrolētas vārdnīcas shēmai. @lv
label: 是……的作品的规范检索点 @zh-hans
definition: 将一个命名与有在一个特定的词表编码体系中被首选的作品检索点的一种作品关联起来。 @zh-hans
toolkit label: ……的作品的规范检索点 @zh-hans
toolkit definition: 有在一个特定的词表编码体系中被首选的作品检索点的一种作品 @zh-hans
has subproperty: is authorized access point for work group of
has subproperty: P80079
label: eser için yetkili erişim noktasıdır @tr
definition: Bir ismi, belirli bir kelime kodlama şemasında tercih için seçilen eser için bir erişim noktasına sahip olan bir eserle ilişkilendirir. @tr
toolkit label: eser için yetkili erişim noktası @tr
toolkit definition: Belirli bir kelime kodlama şemasında tercihen seçilen eser için bir erişim noktasına sahip bir eser. @tr

has category of nomen
status: Published
type: Property
lexical alias: categoryOfNomen.en
domain: C10012
toolkit label: category of nomen
definition: Relates a nomen to a type to which a nomen belongs.
toolkit definition: A type to which a nomen belongs.
has element type: 5
alternative label: type of nomen
sub property of: P00029
label: nomenin kategoria @fi
definition: Liittää nomenin tyyppiin, johon nomen kuuluu. @fi
alternative label: nomenin tyyppi @fi
toolkit label: nomenin kategoria @fi
toolkit definition: Tyyppi, johon nomen kuuluu. @fi
label: har kategori av nomen @no
definition: Relaterer et nomen til en type som et nomen tilhører. @no
alternative label: type nomen @no
toolkit label: kategori av nomen @no
toolkit definition: En type som et nomen tilhører. @no
label: a pour catégorie de nomen @fr
definition: Met un nomen en relation avec un type auquel un nomen appartient. @fr
alternative label: type de nomen @fr
toolkit label: catégorie de nomen @fr
toolkit definition: Type auquel un nomen appartient. @fr
label: heeft categorie van nomen @nl
definition: Relateert een nomen aan een type waartoe een nomen behoort. @nl
toolkit label: categorie van nomen @nl
toolkit definition: Een type waartoe een nomen behoort. @nl
label: له فئة تسمية @ar
definition: يربط التسمية بفئة تنتمي إليها تسمية. @ar
alternative label: نوع تسمية @ar
toolkit label: فئة تسمية @ar
toolkit definition: فئة تنتمي إليها تسمية. @ar
label: té com a categoria de nomen @ca
definition: Relaciona un nomen amb un tipus al qual pertany un nomen. @ca
alternative label: tipus de nomen @ca
toolkit label: categoria de nomen @ca
toolkit definition: Tipus al qual pertany un nomen. @ca
label: har kategori af nomen @da
definition: Relaterer et nomen til en type, som et nomen tilhører. @da
alternative label: type af nomen @da
toolkit label: kategori af nomen @da
toolkit definition: Type, som et nomen tilhører. @da
label: nomen'i kategooria @et
definition: Seostab nomen'i tüübiga, millesse nomen kuulub. @et
alternative label: nomen'i tüüp @et
toolkit label: nomen'i kategooria @et
toolkit definition: Tüüp, millesse nomen kuulub. @et
label: hat Kategorie eines Nomens @de
definition: Setzt ein Nomen in Beziehung zu einer Art, zu der ein Nomen gehört. @de
toolkit label: Kategorie eines Nomens @de
toolkit definition: Eine Art, zu der ein Nomen gehört. @de
label: nomen kategóriája a következő: @hu
definition: Hozzákapcsol egy noment ahhoz a típushoz, amelyhez a nomen tartozik. @hu
toolkit label: nomen kategóriája: @hu
toolkit definition: A típus, amelyhez a nomen tartozik. @hu
label: ha come categoria del nomen @it
definition: Correla un nomen a un tipo al quale il nome appartiene. @it
alternative label: tipo di nomen @it
toolkit label: categoria del nomen @it
toolkit definition: Un tipo al quale il nome appartiene. @it
label: nomena kategorija @lv
toolkit label: nomena kategorija @lv
definition: Sasaista nomenu ar veidu, pie kura pieder nomens. @lv
toolkit definition: Veids, pie kura pieder nomens. @lv
alternative label: Art eines Nomens @de
alternative label: 命名的类型 @zh-hans
label: 有命名的类别 @zh-hans
toolkit label: 命名的类别 @zh-hans
definition: 将一个命名与一个命名所属于的一个类型关联起来。 @zh-hans
toolkit definition: 一个命名所属于的一个类型 @zh-hans
alternative label: nomentípus: @hu
has subproperty: P80078
alternative label: isimin türü @tr
label: ismin kategorisi ile ilişkilidir @tr
toolkit label: isim kategorisi @tr
definition: Bir ismi, bir ismin ait olduğu bir eserle ilişkilendirir. @tr
toolkit definition: Bir ismin ait olduğu bir tür. @tr

has context of use
status: Published
type: Property
lexical alias: contextOfUse.en
definition: Relates a nomen to the circumstances or situation in which a nomen is used.
domain: C10012
toolkit label: context of use
toolkit definition: The circumstances or situation in which a nomen is used.
has element type: 6
alternative label: scope of usage
label: käyttökonteksti @fi
definition: Liittää nomenin olosuhteeseen tai tilanteeseen, jossa RDA-entiteetin nimitystä käytetään. @fi
alternative label: käytön soveltamisala @fi
toolkit label: käyttökonteksti @fi
toolkit definition: Olosuhde tai tilanne, jossa RDA-entiteetin nimitystä käytetään. @fi
label: har kontekst for bruk @no
definition: Relaterer et nomen til omstendighetene eller situasjonen for når en betegnelse for en RDA-entitet brukes. @no
alternative label: rekkevidde for bruk @no
toolkit label: kontekst for bruk @no
toolkit definition: Omstendighetene eller situasjonen for når en betegnelse for en RDA-entitet brukes. @no
label: a pour contexte d’utilisation @fr
definition: Met un nomen en relation avec des circonstances ou une situation dans laquelle est utilisé un nomen. @fr
alternative label: champ d’utilisation @fr
toolkit label: contexte d’utilisation @fr
toolkit definition: Circonstances ou situation dans laquelle est utilisé un nomen. @fr
label: heeft context van gebruik @nl
definition: Relateert een nomen aan de omstandigheden of situatie waarin de benaming van een RDA-entiteit gebruikt wordt. @nl
toolkit label: context van gebruik @nl
toolkit definition: De omstandigheden of situatie waarin de benaming van een RDA-entiteit gebruikt wordt. @nl
label: لها سياق استخدام @ar
definition: يربط تسمية بالظروف أو الحالة التي يُستُخدم فيها اسم كيان "وام". @ar
alternative label: مجال الاستخدام @ar
toolkit label: سياق الاستخدام @ar
toolkit definition: الظروف أو الحالة التي يُستخدم فيها اسم كيان "وام". @ar
label: té com a context d’ús @ca
definition: Relaciona un nomen amb les circumstàncies o situació en què s’usa un nomen. @ca
alternative label: abast d’ús @ca
toolkit label: context d’ús @ca
toolkit definition: Circumstàncies o situació en què s’usa un nomen. @ca
label: har kontekst for brug @da
definition: Relaterer et nomen til omstændighederne eller situationen, hvori en benævnelse på en RDA-entitet bruges. @da
alternative label: rækkevidde for brug @da
toolkit label: kontekst for brug @da
toolkit definition: Omstændighederne eller situationen, hvori en benævnelse på en RDA-entitet bruges. @da
label: kasutuskontekst @et
definition: Seostab nomen'i tingimuste või olukorraga, mille puhul RDA olemi nimetust kasutatakse. @et
alternative label: kasutusulatus @et
toolkit label: kasutuskontekst @et
toolkit definition: Tingimused või olukord, mille puhul RDA olemi nimetust kasutatakse. @et
label: hat Verwendungskontext @de
definition: Setzt ein Nomen in Beziehung zu den Umständen oder der Situation, in denen/der eine Bezeichnung für eine RDA-Entität verwendet wird. @de
toolkit label: Verwendungskontext @de
toolkit definition: Die Umstände oder Situation, in denen/der eine Bezeichnung für eine RDA-Entität verwendet wird. @de
label: használati környezete a következő: @hu
definition: Hozzákapcsol egy noment egy körülményhez vagy szituációhoz, amelyben egy RDA-entitás megnevezését használják. @hu
toolkit label: használati környezete: @hu
toolkit definition: Egy körülmény vagy szituáció, amelyben egy RDA-entitás megnevezését használják. @hu
label: ha come contesto d'uso @it
definition: Correla un nomen alle circostanze o alla situazione in cui una denfominazione di un'entità RDA è usata. @it
alternative label: ambito d'uso @it
toolkit label: contesto d'uso @it
toolkit definition: Le circostanze o alla situazione in cui una denfominazione di un'entità RDA è usata. @it
label: lietojumkonteksts @lv
definition: Sasaista nomenu ar apstākļiem vai situāciju, kurā tiek izmantots RDA entītes apzīmējums. @lv
toolkit label: lietojumkonteksts @lv
toolkit definition: Apstākļi vai situācija, kurā tiek izmantots RDA entītes apzīmējums. @lv
alternative label: Verwendungsbereich @de
alternative label: 使用范围 @zh-hans
label: 有使用语境 @zh-hans
definition: 将一个命名与一个命名被使用的环境和情况关联起来。 @zh-hans
toolkit label: 使用语境 @zh-hans
toolkit definition: 一个命名被使用的环境和情况 @zh-hans
alternative label: felhasználási területe: @hu
has subproperty: P80067
alternative label: kullanım kapsamı @tr
label: kullanım bağlamı ile ilişkilidir @tr
definition: Bir ismi, bir niteleyici ismin kullanıldığı koşullar veya durumla ilişkilendirir. @tr
toolkit label: kullanım bağlamı @tr
toolkit definition: Bir niteleyici ismin kullanıldığı koşullar veya durum. @tr

has date of usage
status: Published
lexical alias: dateOfUsage.en
definition: Relates a nomen to a timespan that is a date or range of dates that is associated with the use of a nomen.
toolkit label: date of usage
toolkit definition: A timespan that is a date or range of dates that is associated with the use of a nomen.
type: Property
domain: C10012
has element type: 3
sub property of: has related timespan of nomen
label: käyttöajankohta @fi
definition: Liittää nomenin ajanjaksoon, joka on ajankohta tai aikaväli, joka liittyy RDA-entiteetin nimityksen käyttöön. @fi
toolkit label: käyttöajankohta @fi
toolkit definition: Ajanjakso, joka on ajankohta tai aikaväli, joka liittyy RDA-entiteetin nimityksen käyttöön. @fi
label: har dato for bruk @no
definition: Relaterer et nomen til en dato eller et tidsspenn som forbindes med anvendelsen av en betegnelse for en RDA-entitet. @no
toolkit label: dato for bruk @no
toolkit definition: En dato eller et tidsspenn som forbindes med anvendelsen av en betegnelse for en RDA-entitet. @no
label: a pour date d’utilisation @fr
definition: Met un nomen en relation avec un laps de temps qui consiste en une date ou une fourchette de dates associée à l’utilisation d’un nomen. @fr
toolkit label: date d’utilisation @fr
toolkit definition: Laps de temps qui consise en une date ou une fourchette de dates associée à l’utilisation d’un nomen. @fr
label: heeft datum van gebruik @nl
definition: Relateert een nomen aan een tijdspanne die is een datum of bereik van data die geassocieerd wordt met het gebruik van een benaming van een RDA-entiteit. @nl
toolkit label: datum van gebruik @nl
toolkit definition: Een tijdspanne die is een datum of bereik van data die geassocieerd wordt met het gebruik van een benaming van een RDA-entiteit. @nl
label: له تاريخ استخدام @ar
definition: يربط تسمية بتاريخ أو مدى من التواريخ مرتبط باستخدام اسم لكيان "وام". @ar
toolkit label: تاريخ استخدام @ar
toolkit definition: تاريخ أو مدى تواريخ مرتبط باستخدام اسم لكيان "وام". @ar
label: té com a data d’ús @ca
definition: Relaciona un nomen amb un interval de temps que és una data o un rang de dates que s’associa amb l’ús d’un nomen. @ca
toolkit label: data d’ús @ca
toolkit definition: Interval de temps que és una data o un rang de dates que s’associa amb l’ús d’un nomen. @ca
label: har dato for brug @da
definition: Relaterer et nomen til en dato eller flere datoer, som er knyttet til anvendelsen af en benævnelse på en RDA-entitet. @da
toolkit label: dato for brug @da
toolkit definition: Dato eller flere datoer, som er knyttet til anvendelsen af en benævnelse på en RDA-entitet. @da
label: kasutusaeg @et
definition: Seostab nomen'i daatumi või daatumite vahemikuga, mis on seotud RDA olemi nimetuse kasutusega. @et
toolkit label: kasutusaeg @et
toolkit definition: Daatum või daatumite vahemik, mis on seotud RDA olemi nimetuse kasutusega. @et
label: hat Verwendungsdatum @de
definition: Setzt ein Nomen in Beziehung zu einem Zeitraum, bei dem es sich um ein Datum oder einen Datumsbereich handelt, der mit der Verwendung einer Bezeichnung für eine RDA-Entität in Verbindung steht. @de
toolkit label: Verwendungsdatum @de
toolkit definition: Ein Zeitraum, bei dem es sich um ein Datum oder einen Datumsbereich handelt, der mit der Verwendung einer Bezeichnung für eine RDA-Entität in Verbindung steht. @de
label: használat időpontja a következő: @hu
definition: Hozzákapcsol egy noment egy időtartamhoz, egy dátumhoz vagy dátumtartományhoz, amelyet egy RDA-entitás megnevezésének használatával társítottak. @hu
toolkit label: használat időpontja: @hu
toolkit definition: Egy időtartam, egy dátum vagy dátumtartomány, amelyet egy RDA-entitás megnevezésének használatával társítottak. @hu
label: ha come data d'uso @it
definition: Correla un nomen a una data o intervallo di date che è associata con l'uso di una designazione di un'entità RDA. @it
toolkit label: data d'uso @it
toolkit definition: Una data o intervallo di date che è associata con l'uso di una designazione di un'entità RDA. @it
label: lietojuma datējums @lv
definition: Sasaista nomenu ar laikposmu, kas ir viens vai vairāki datējumi, kas saistīti ar RDA entītes nosaukuma lietojumu. @lv
toolkit label: lietojuma datējums @lv
toolkit definition: Laikposms, kas ir viens vai vairāki datējumi, kas saistīti ar RDA entītes nosaukuma lietojumu. @lv
label: 有利用日期 @zh-hans
definition: 将一个命名与作为和一个命名的使用有关的一个日期或者日期范围的一个时间段关联起来。 @zh-hans
toolkit label: 利用日期 @zh-hans
toolkit definition: 作为和一个命名的使用有关的一个日期或者日期范围的一个时间段 @zh-hans
has subproperty: P80166
label: kullanım tarihi ile ilişkilidir @tr
definition: Bir ismi, ismin kullanımı ile ilişkili bir tarih veya tarih aralığı olan bir zaman aralığı ile ilişkilendirir. @tr
toolkit label: kullanım tarihi @tr
toolkit definition: Bir ismin kullanımı ile bağlantılı olan bir tarih veya belirli bir tarih dilimi olan bir zaman aralığı. @tr

has derivation
status: Published
type: Property
lexical alias: derivation.en
definition: Relates a nomen to a nomen that is based on another nomen.
domain: C10012
toolkit label: derivation
toolkit definition: A nomen that is based on another nomen.
has element type: 2
sub property of: has related nomen of nomen
label: johdos @fi
definition: Liittää nomenin nomeniin, joka perustuu toiseen nomeniin. @fi
toolkit label: johdos @fi
toolkit definition: Nomen, joka perustuu toiseen nomeniin. @fi
label: har avledning @no
definition: Relaterer et nomen til et nomen som er basert på et annet nomen. @no
toolkit label: avledning @no
toolkit definition: Et nomen som er basert på et annet nomen. @no
label: a pour dérivation @fr
definition: Met un nomen en relation avec un nomen qui est basé sur un autre nomen. @fr
toolkit label: dérivation @fr
toolkit definition: Nomen qui est basé sur un autre nomen. @fr
label: heeft afleiding @nl
definition: Relateert een nomen aan een nomen dat gebaseerd is op een andere nomen. @nl
toolkit label: afleiding @nl
toolkit definition: Een nomen dat gebaseerd is op een andere nomen. @nl
label: لها اشتقاق @ar
definition: يربط تسمية بتسمية مأخوذة من تسمية أخرى. @ar
toolkit label: اشتقاق @ar
toolkit definition: تسمية مأخوذة من تسمية أخرى. @ar
label: té com a derivació @ca
definition: Relaciona un nomen amb un nomen que es basa en un altre nomen. @ca
toolkit label: derivació @ca
toolkit definition: Nomen que es basa en un altre nomen. @ca
label: har afledning @da
definition: Relaterer et nomen til et nomen, som er baseret på et andet nomen. @da
toolkit label: afledning @da
toolkit definition: Nomen, som er baseret på et andet nomen. @da
label: tuletis @et
definition: Seostab nomen'i nomen'iga, mis põhineb teisel nomen'il. @et
toolkit label: tuletis @et
toolkit definition: Nomen, mis põhineb teisel nomen'il. @et
label: hat Ableitung @de
definition: Setzt ein Nomen in Beziehung zu einem Nomen, das auf einem anderen Nomen basiert. @de
toolkit label: Ableitung @de
toolkit definition: Ein Nomen, das auf einem anderen Nomen basiert. @de
label: leágazása a következő: @hu
definition: Hozzákapcsol egy noment egy nomenhez, amely egy másik nomenen alapul. @hu
toolkit label: leágazása: @hu
toolkit definition: Egy nomen, amely egy másik nomenen alapul. @hu
label: ha come derivazione @it
definition: Correla un nomen a un nomen che è basato su un altro nomen. @it
toolkit label: derivazione @it
toolkit definition: Un nomen che è basato su un altro nomen. @it
label: atvasinājums @lv
definition: Sasaista nomenu ar nomenu, kas balstīts uz citu nomenu. @lv
toolkit label: atvasinājums @lv
toolkit definition: Nomens, kas balstīts uz citu nomenu. @lv
label: 有衍生命名 @zh-hans
definition: 将一个命名与基于另一个命名的一个命名关联起来。 @zh-hans
toolkit label: 衍生命名 @zh-hans
toolkit definition: 基于另一个命名的一个命名 @zh-hans
has subproperty: P80060
label: türetim ile ilişkilidir @tr
definition: Bir ismi, başka bir niteleyici ismi temel alan bir niteleyici isimle ilişkilendirir. @tr
toolkit label: türetme @tr
toolkit definition: Başka bir isme dayanan bir isim. @tr

is derivation of
status: Published
type: Property
lexical alias: derivationOf.en
definition: Relates a nomen to a nomen that is used as the basis of another nomen.
domain: C10012
toolkit label: derivation of
toolkit definition: A nomen that is used as the basis of another nomen.
has element type: 2
sub property of: has related nomen of nomen
label: johdos nomenista @fi
definition: Liittää nomenin nomeniin, joka on toisen nomenin perusta. @fi
toolkit label: johdos nomenista @fi
toolkit definition: Nomen, joka on toisen nomenin perusta. @fi
label: er avledning av @no
definition: Relaterer et nomen til et nomen som er brukt som utgangspunkt for et annet nomen. @no
toolkit label: avledning av @no
toolkit definition: Et nomen som er brukt som utgangspunkt for et annet nomen. @no
label: est une dérivation de @fr
definition: Met un nomen en relation avec un nomen qui sert de base à un autre nomen. @fr
toolkit label: dérivation de @fr
toolkit definition: Nomen qui sert de base à un autre nomen. @fr
label: is afgeleid van @nl
definition: Relateert een nomen aan een nomen dat gebruikt is als basis voor een andere nomen. @nl
toolkit label: afgeleid van @nl
toolkit definition: Een nomen dat gebruikt is als basis voor een andere nomen. @nl
label: هو اشتقاق من @ar
definition: يربط تسمية بتسمية أُخذت من تسمية أخرى. @ar
toolkit label: مشتقة من @ar
toolkit definition: تسمية أُخذت من تسمية أخرى. @ar
label: és derivació de @ca
definition: Relaciona un nomen amb un nomen que s’usa com a base d’un altre nomen. @ca
toolkit label: derivació de @ca
toolkit definition: Nomen que s’usa com a base d’un altre nomen. @ca
label: er afledning af @da
definition: Relaterer et nomen til et nomen, som bruges som basis for et andet nomen. @da
toolkit label: afledning af @da
toolkit definition: Nomen, som bruges som basis for et andet nomen. @da
label: tuletis nomen'ist @et
definition: Seostab nomen'i nomen'iga, mida on kasutatud teise nomen'i alusena. @et
toolkit label: tuletis nomen'ist @et
toolkit definition: Nomen, mida on kasutatud teise nomen'i alusena. @et
label: ist Ableitung von @de
definition: Setzt ein Nomen in Beziehung zu einem Nomen, das als Grundlage für ein anderes Nomen verwendet wird. @de
toolkit label: Ableitung von @de
toolkit definition: Ein Nomen, das als Grundlage für ein anderes Nomen verwendet wird. @de
label: leágazása a következőnek: @hu
definition: Hozzákapcsol egy noment egy nomenhez, amelyet egy másik nomen alapjaként használnak. @hu
toolkit label: leágazása: @hu
toolkit definition: Egy nomen, amelyet egy másik nomen alapjaként használnak. @hu
label: è derivazione di @it
definition: Correla un nomen a un nomen che è usato come base per un altro nomen. @it
toolkit label: derivazione di @it
toolkit definition: Un nomen che è usato come base per un altro nomen. @it
label: ir atvasinājums @lv
definition: Sasaista nomenu ar nomenu, kas izmantots kā pamats citam nomenam. @lv
toolkit label: ir atvasinājums @lv
toolkit definition: Nomens, kas izmantots kā pamats citam nomenam. @lv
label: 是……的衍生命名 @zh-hans
definition: 将一个命名与被用作另一个命名之基础的一个命名关联起来。 @zh-hans
toolkit label: ……的衍生命名 @zh-hans
toolkit definition: 被用作另一个命名之基础的一个命名 @zh-hans
has subproperty: P80061
label: türevidir @tr
definition: Bir ismi, başka bir niteleyici ismin temeli olarak kullanılan bir niteleyici isimle ilişkilendirir. @tr
toolkit label: türetme @tr
toolkit definition: Başka bir ismin temeli olarak kullanılan bir isim. @tr

is earlier title proper of (Deprecated)
status: Deprecated
type: Property
has subproperty: P80123

is equivalent to
status: Published
type: Property
lexical alias: equivalentTo.en
definition: Relates a nomen to a nomen that is an appellation of the same entity as another nomen.
domain: C10012
toolkit label: equivalent to
toolkit definition: A nomen that is an appellation of the same entity as another nomen.
has element type: 2
sub property of: has related nomen of nomen
label: vastaava nomen @fi
definition: Liittää nomenin nomeniin, joka on saman entiteetin nimitys kuin toinen nomen. @fi
toolkit label: vastaava nomen @fi
toolkit definition: Nomen, joka on saman entiteetin nimitys kuin toinen nomen. @fi
label: er tilsvarende til @no
definition: Relaterer et nomen til et nomen som er en betegnelse for den samme entiteten som et annet nomen. @no
toolkit label: tilsvarende til @no
toolkit definition: Et nomen som er en betegnelse for den samme entiteten som et annet nomen. @no
label: est un équivalent de @fr
definition: Met un nomen en relation avec un nomen qui est une appellation de la même entité qu’un autre nomen. @fr
toolkit label: équivalent de @fr
toolkit definition: Nomen qui est une appellation de la même entité qu’un autre nomen. @fr
label: is equivalent aan @nl
definition: Relateert een nomen aan een nomen dat een benaming is van dezelfde entiteit als een andere nomen. @nl
toolkit label: equivalent aan @nl
toolkit definition: Een nomen dat een benaming is van dezelfde entiteit als een andere nomen. @nl
label: هو مكافئ لـ @ar
definition: يربط تسمية بتسمية عبارة عن اسم للكيان نفسه، كتسمية أخرى. @ar
toolkit label: مكافئ لـ @ar
toolkit definition: تسمية عبارة عن اسم للكيان نفسه كتسمية أخرى. @ar
label: és equivalent a @ca
definition: Relaciona un nomen amb un nomen que és una apel·lació de la mateixa entitat com un altre nomen. @ca
toolkit label: equivalent a @ca
toolkit definition: Nomen que és una apel·lació de la mateixa entitat com un altre nomen. @ca
label: er svarende til @da
definition: Relaterer et nomen til et nomen, som er en benævnelse på den samme entitet som et andet nomen. @da
toolkit label: svarende til @da
toolkit definition: Nomen, som er en benævnelse på den samme entitet som et andet nomen. @da
label: ekvivalentne nomen'iga @et
definition: Seostab nomen'i nomen'iga, mis on sama olemi nimetus kui teine nomen. @et
toolkit label: ekvivalentne nomen'iga @et
toolkit definition: Nomen, mis on sama olemi nimetus kui teine nomen. @et
label: ist äquivalent zu @de
definition: Setzt ein Nomen in Beziehung zu einem Nomen, das eine Bezeichnung für dieselbe Entität ist wie ein anderes Nomen. @de
toolkit label: äquivalent zu @de
toolkit definition: Ein Nomen, das eine Bezeichnung für dieselbe Entität ist wie ein anderes Nomen. @de
label: egyenértékű a következővel: @hu
definition: Hozzákapcsol egy noment egy nomenhez, amely ugyanannak az entitásnak a megnevezése, ami a másik nomen. @hu
toolkit label: egyenértékű a következővel: @hu
toolkit definition: Egy nomen, amely ugyanannak az entitásnak a megnevezése, ami egy másik nomen. @hu
label: è equivalente a @it
definition: Correla un nomen a un nomen che è una designazione della stessa entità come altro nomen. @it
toolkit label: equivalente a @it
toolkit definition: Un nomen che è una designazione della stessa entità come altro nomen. @it
label: ir tas pats, kas @lv
definition: Sasaista nomenu ar nomenu, kas ir tās pašas entītes apzīmējums kā cits nomens. @lv
toolkit label: ir tas pats, kas @lv
toolkit definition: Nomens, kas ir tās pašas entītes apzīmējums kā cits nomens. @lv
label: 是等同于…… @zh-hans
definition: 将一个命名与和另一个命名一样作为同一个实体的一个称谓的一个命名关联起来。 @zh-hans
toolkit label: 等同于…… @zh-hans
toolkit definition: 和另一个命名一样作为同一个实体的一个称谓的一个命名 @zh-hans
has subproperty: P80113
label: eşdeğeridir @tr
definition: Bir ismi, başka bir niteleyici isim ile aynı varlığın adı olan bir niteleyici isimle ilişkilendirir. @tr
toolkit label: eşittir @tr
toolkit definition: Başka bir isim ile aynı varlığa ait olan bir unvan. @tr

is fingerprint of
status: Published
type: Property
lexical alias: fingerprintOf.en
domain: C10012
toolkit label: fingerprint of
has element type: 2
sub property of: is identifier for manifestation of
definition: Relates a nomen to a manifestation that has an identifier for manifestation that consists of a group of characters from specified locations in a manifestation combined with a date of publication or other element.
toolkit definition: A manifestation that has an identifier for manifestation that consists of a group of characters from specified locations in a manifestation combined with a date of publication or other element.
label: sormenjälkitunniste manifestaatiolle @fi
definition: Liittää nomenin manifestaatioon, jonka tunniste muodostuu manifestaation tietyistä kohdista poimittujen merkkien yhdistämisestä julkaisuaikaan tai muihin elementteihin. @fi
toolkit label: sormenjälkitunniste manifestaatiolle @fi
toolkit definition: Manifestaatio, jonka tunniste muodostuu manifestaation tietyistä kohdista poimittujen merkkien yhdistämisestä julkaisuaikaan tai muihin elementteihin. @fi
label: er fingeravtrykk for @no
definition: Relaterer et nomen til en manifestasjon som har en identifikator for manifestasjon som består av en gruppe tegn fra bestemte steder i en manifestasjon kombinert med en dato for utgivelse eller annet element. @no
toolkit label: fingeravtrykk for @no
toolkit definition: En manifestasjon som har en identifikator for manifestasjon som består av en gruppe tegn fra bestemte steder i en manifestasjon kombinert med en dato for utgivelse eller annet element. @no
label: est une empreinte de @fr
definition: Met un nomen en relation avec une manifestation qui possède un identifiant de manifestation consistant en un groupe de caractères provenant d’endroits précis dans une manifestation et combiné à une date de publication ou à un autre élément. @fr
toolkit label: empreinte de @fr
toolkit definition: Manifestation qui possède un identifiant de manifestation consistant en un groupe de caractères provenant d’endroits précis dans une manifestation et combiné à une date de publication ou à un autre élément. @fr
label: is vingerafdruk van @nl
definition: Relateert een nomen aan een manifestatie die een identificatie voor manifestatie heeft die bestaat uit een groep karakters genomen van specifieke locaties binnen een manifestatie gecombineerd met een datum van publicatie of ander element. @nl
toolkit label: vingerafdruk van @nl
toolkit definition: Een manifestatie die een identificatie voor manifestatie heeft die bestaat uit een groep karakters genomen van specifieke locaties binnen een manifestatie gecombineerd met een datum van publicatie of ander element. @nl
label: هي بصمة لـ @ar
definition: يربط تسمية بتجسيدة لها مُعرِّف لتجسيدة يتكون من مجموعة تمثيلات من مواقع محددة في تجسيدة مدمجة مع تاريخ نشر أو مع عنصر آخر. @ar
toolkit label: بصمة لـ @ar
toolkit definition: تجسيدة لها مُعرِّف لتجسيدة يتكون من مجموعة تمثيلات من مواقع محددة في تجسيدة مدمجة مع تاريخ نشر أو مع عنصر آخر. @ar
label: és empremta de @ca
definition: Relaciona un nomen amb una manifestació que té un identificador de manifestació que consisteix en un grup de caràcters de localitzacions específiques en una manifestació combinats amb una data de publicació o amb un altre element. @ca
toolkit label: empremta de @ca
toolkit definition: Manifestació que té un identificador de manifestació que consisteix en un grup de caràcters de localitzacions específiques en una manifestació combinats amb una data de publicació o amb un altre element. @ca
label: er fingeraftryk af @da
definition: Relaterer et nomen til en manifestation, som har en identifikator for manifestation, som består af en gruppe tegn fra bestemte steder i en manifestation kombineret med en dato for udgivelse eller andet element. @da
toolkit label: fingeraftryk af @da
toolkit definition: Manifestation, som har en identifikator for manifestation, som består af en gruppe tegn fra bestemte steder i en manifestation kombineret med en dato for udgivelse eller andet element. @da
label: fingerprint kehastuses @et
definition: Seostab nomen'i kehastusega, millel on identifikaator, mis koosneb kindlaksmääratud andmeallikatest võetud märkidest koos ilmumisaasta või muu elemendiga. @et
toolkit label: fingerprint kehastuses @et
toolkit definition: Kehastus, millel on identifikaator, mis koosneb kindlaksmääratud andmeallikatest võetud märkidest koos ilmumisaasta või muu elemendiga. @et
label: ist Fingerabdruck von @de
definition: Setzt ein Nomen in Beziehung zu einer Manifestation, die über einen Identifikator für eine Manifestation verfügt, der aus einer Kombination von einer Gruppe von Zeichen von bestimmten Stellen einer Manifestation und einem Veröffentlichungsdatum oder einem anderen Element besteht. @de
toolkit label: Fingerabdruck von @de
toolkit definition: Eine Manifestation, der über einen Identifikator für eine Manifestation verfügt, der aus einer Kombination von einer Gruppe von Zeichen von bestimmten Stellen einer Manifestation und einem Veröffentlichungsdatum oder einem anderen Element besteht. @de
label: ujjlenyomata a következőnek: @hu
definition: Hozzákapcsol egy noment egy megjelenési formához, amely rendelkezik olyan megjelenésiforma-azonosítóval, amely a megjelenési forma meghatározott helyeiről származó karakterek csoportjából áll, kombinálva a kiadás dátumával vagy más elemmel. @hu
toolkit label: ujjlenyomata: @hu
toolkit definition: Egy megjelenési forma, amely rendelkezik olyan megjelenésiforma-azonosítóval, amely a megjelenési forma meghatározott helyeiről származó karakterek csoportjából áll, kombinálva a kiadás dátumával vagy más elemmel. @hu
label: è impronta di @it
definition: Correla un nomen a una manifestazione che ha un identificatore che è costituito da un gruppo di caratteri rilevato da specifiche parti nella manifestazione combinato con una data di pubblicazione o altro elemento. @it
toolkit label: impronta di @it
toolkit definition: Una manifestazione che ha un identificatore che è costituito da un gruppo di caratteri rilevato da specifiche parti nella manifestazione combinato con una data di pubblicazione o altro elemento. @it
label: ir identificējošā zīmju virkne @lv
toolkit label: ir identificējošā zīmju virkne @lv
definition: Sasaista nomenu ar manifestāciju, kam ir identifikators, kas sastāv no rakstzīmju grupas, kas ņemta no noteiktām manifestācijas vietām apvienojumā ar publikācijas datējumu vai citu elementu. @lv
toolkit definition: Manifestācija, kam ir identifikators, kas sastāv no rakstzīmju grupas, kas ņemta no noteiktām manifestācijas vietām apvienojumā ar publikācijas datējumu vai citu elementu. @lv
label: 是……的指纹 @zh-hans
toolkit label: ……的指纹 @zh-hans
definition: 将一个命名与有由载体表现中取自特定位置的一组字符与出版日期或其他元素结合而组成的载体表现的一个标识符的一种载体表现关联起来。 @zh-hans
toolkit definition: 有由载体表现中取自特定位置的一组字符与出版日期或其他元素结合而组成的载体表现的一个标识符的一种载体表现 @zh-hans
has subproperty: P80138
label: parmak izidir @tr
toolkit label: parmak izi @tr
definition: Bir ismi, bir yayın tarihi veya başka bir öğe ile birleştirilmiş bir gösterimde belirtilen konumlardan bir grup karakterden oluşan gösterim tanımlayıcısına sahip bir gösterimle ilişkilendirir. @tr
toolkit definition: Bir yayın tarihi veya başka bir öğe ile birleştirilmiş bir gösterimde belirtilen konumlardan bir grup karakterden oluşan gösterim tanımlayıcısına sahip bir gösterim. @tr

is fuller form of name of
status: Published
lexical alias: fullerFormOfNameOf.en
definition: Relates a nomen to a person who has a fuller form of a name or part of a name represented by an initial, abbreviation, or shortened or otherwise modified form.
toolkit label: fuller form of name of
toolkit definition: A person who has a fuller form of a name or part of a name represented by an initial, abbreviation, or shortened or otherwise modified form.
type: Property
domain: C10012
sub property of: is name of person of
has element type: 2
label: nimen täydellisempi muoto henkilölle @fi
definition: Liittää nomenin henkilöön, jolla on alkukirjaimin, lyhenteellä tai muuten lyhennetyn tai muokatun nimen tai nimen osan täydellisempi muoto. @fi
toolkit label: nimen täydellisempi muoto henkilölle @fi
toolkit definition: Henkilö, jolla on alkukirjaimin, lyhenteellä tai muuten lyhennetyn tai muokatun nimen tai nimen osan täydellisempi muoto. @fi
label: er mer fullstendig navneform for @no
definition: Relaterer et nomen til en person som har en mer fullstendig navneform eller del av navnet representert av en initital, forkortelse eller på annen modifisert form. @no
toolkit label: mer fullstendig navneform for @no
toolkit definition: En person som har en mer fullstendig navneform eller del av navnet representert av en initital, forkortelse eller på annen modifisert form. @no
label: est une forme développée du nom de @fr
definition: Met un nomen en relation avec une personne qui possède une forme développée d’un nom ou d’une partie d’un nom représentée par une initiale, une abréviation ou une forme raccourcie ou autrement modifiée. @fr
toolkit label: forme développée du nom de @fr
toolkit definition: Personne qui possède une forme développée d’un nom ou d’une partie d’un nom représentée par une initiale, une abréviation ou une forme raccourcie ou autrement modifiée. @fr
label: is meer volledige vorm van naam van @nl
definition: Relateert een nomen aan een persoon die een meer volledige vorm van een naam heeft of deel van een naam vertegenwoordigd door een initiaal, afkorting, of ingekort of op andere wijze aangepaste vorm. @nl
toolkit label: meer volledige vorm van naam van @nl
toolkit definition: Een persoon die een meer volledige vorm van een naam heeft of deel van een naam vertegenwoordigd door een initiaal, afkorting, of ingekort of op andere wijze aangepaste vorm. @nl
label: هي صيغة أكمل لاسم لـ @ar
definition: يربط تسمية بشخص له صيغة أكمل لاسم، أو لجزء من اسم يُعبر عنه بحروف استهلالية، أو باختصار، أو أو بأي شكل مختصر أو مُعدل بطريقة أخرى. @ar
toolkit label: صيغة أكمل لاسم لـ @ar
toolkit definition: شخص له صيغة أكمل لاسم، أو لجزء من اسم يُعبر عنه بحروف استهلالية، أو باختصار، أو بأي شكل مختصر أو مُعدل بطريقة أخرى. @ar
label: és forma més completa d’un nom de @ca
definition: Relaciona un nomen amb una persona que té una forma més completa o una part d’un nom, representada per una inicial, una abreviació, o una forma escurçada o modificada altrament. @ca
toolkit label: forma més completa d’un nom de @ca
toolkit definition: Persona que té una forma més completa o una part d’un nom, representada per una inicial, una abreviació, o una forma escurçada o modificada altrament. @ca
label: er mere fuldstændig navneform for @da
definition: Relaterer et nomen til en person, som har en mere fuldstændig navneform eller del af et navn repræsenteret af et initial, forkortelse eller lignende tilpasninger. @da
toolkit label: mere fuldstændig navneform for @da
toolkit definition: Person, som har en mere fuldstændig navneform eller del af et navn repræsenteret af et initial, forkortelse eller lignende tilpasninger. @da
label: täielikum nimevorm isikule @et
definition: Seostab nomen'i isikuga, kellel on nime täielikum vorm või see osa nimest, mis on esitatud initsiaalina, lühendina või lühendatud või muul viisil muudetud vormina. @et
toolkit label: täielikum nimevorm isikule @et
toolkit definition: Isik, kellel on nime täielikum vorm või see osa nimest, mis on esitatud initsiaalina, lühendina või lühendatud või muul viisil muudetud vormina. @et
label: ist vollständigere Namensform von @de
definition: Setzt ein Nomen in Beziehung zu einer Person, die über eine vollständigere Namensform oder einen Teil eines Namens verfügt, der nur durch eine Initiale, eine Abkürzung oder sonst irgendwie gekürzte oder anderweitig veränderte Form dargestellt wird. @de
toolkit label: Vollständigere Namensform von @de
toolkit definition: Eine Person, die über eine vollständigere Namensform oder einen Teil eines Namens verfügt, der nur durch eine Initiale, eine Abkürzung oder sonst irgendwie gekürzte oder anderweitig veränderte Form dargestellt wird. @de
label: teljesebb névformája a következőnek: @hu
definition: Hozzákapcsol egy noment egy személyhez, akinek van egy teljesebb névformája, vagy nevének egy részét egy kezdőbetű, rövidítés vagy rövidített, illetve más módosító forma reprezentálja. @hu
toolkit label: teljesebb névformája: @hu
toolkit definition: Egy személy, akinek van egy teljesebb névformája, vagy nevének egy részét egy kezdőbetű, rövidítés vagy rövidített, illetve más módosító forma reprezentálja. @hu
label: è forma completa del nome di @it
definition: Correla un nomen a una persona che ha una forma completa di un nome o parte di un nome rappresentato da un'iniziale, abbreviazione o abbreviata o forma modificata in altro modo. @it
toolkit label: forma completa del nome di @it
toolkit definition: Una persona che ha una forma completa di un nome o parte di un nome rappresentato da un'iniziale, abbreviazione o abbreviata o forma modificata in altro modo. @it
label: ir personvārda pilnīgāka forma @lv
definition: Sasaista nomenu ar personu, kurai ir pilnīgāka vārda forma vai nosaukuma daļa, ko attēlo ar iniciāli, abreviatūru vai saīsinājumu, vai citādi pārveidotu formu. @lv
toolkit label: ir personvārda pilnīgāka forma @lv
toolkit definition: Persona, kurai ir pilnīgāka vārda forma vai nosaukuma daļa, ko attēlo ar iniciāli, abreviatūru vai saīsinājumu, vai citādi pārveidotu formu. @lv
label: 是……的名称的较完整形式 @zh-hans
definition: 将一个命名与有用首字母缩写、缩略语、缩短或其他修改形式表示的一个名称或一个名称的部分的较完整的形式的一个个人关联起来。 @zh-hans
toolkit label: ……的名称的较完整形式 @zh-hans
toolkit definition: 有用首字母缩写、缩略语、缩短或其他修改形式表示的一个名称或一个名称的部分的较完整的形式的一个个人 @zh-hans
has subproperty: P80177
label: isminin tam halidir @tr
definition: Bir ismi, bir ismin daha tam bir biçimine veya baş harf, kısaltma veya kısaltılmış veya başka bir şekilde değiştirilmiş biçimle temsil edilen bir ismin bir kısmına sahip olan bir kişiyle ilişkilendirir. @tr
toolkit label: ismin tam hali @tr
toolkit definition: Bir ismin tam biçimine veya bir baş harf, kısaltma veya kısaltılmış veya başka bir şekilde değiştirilmiş biçimle temsil edilen bir ismin bir kısmına sahip olan kişi. @tr

is given name of
status: Published
lexical alias: givenNameOf.en
definition: Relates a nomen to a person who uses a name given at birth or at some later point in addition to, or instead of, a surname.
toolkit label: given name of
toolkit definition: A person who uses a name given at birth or at some later point in addition to, or instead of, a surname.
type: Property
domain: C10012
sub property of: is name of person of
has element type: 2
label: etunimi henkilölle @fi
definition: Liittää nomenin henkilöön, joka käyttää sukunimen lisäksi tai sen sijaan syntymässä tai jossain myöhemmässä vaiheessa annettua nimeä. @fi
toolkit label: etunimi henkilölle @fi
toolkit definition: Henkilö, joka käyttää sukunimen lisäksi tai sen sijaan syntymässä tai jossain myöhemmässä vaiheessa annettua nimeä. @fi
label: er fornavn for @no
definition: Relaterer et nomen til en person som bruker et navn gitt ved fødsel eller ved et senere tidspunkt i tillegg til eller i stedet for et etternavn. @no
toolkit label: fornavn for @no
toolkit definition: En person som bruker et navn gitt ved fødsel eller ved et senere tidspunkt i tillegg til eller i stedet for et etternavn. @no
label: est un prénom de @fr
definition: Met un nomen en relation avec une personne qui utilise un nom donné à la naissance ou plus tard en plus ou au lieu d’un nom de famille. @fr
toolkit label: prénom de @fr
toolkit definition: Personne qui utilise un nom donné à la naissance ou plus tard en plus ou au lieu d’un nom de famille. @fr
label: is voornaam van @nl
definition: Relateert een nomen aan een persoon die een naam gebruikt gegeven bij geboorte of later in aanvulling op, of in plaats van, een achternaam. @nl
alternative label: gegeven naam van @nl
toolkit label: voornaam van @nl
toolkit definition: Een persoon die een naam gebruikt gegeven bij geboorte of later in aanvulling op, of in plaats van, een achternaam. @nl
label: هو الاسم الأول لـ @ar
definition: يربط تسمية بشخص يستخدم اسما سُمي به عند الولادة، أو في وقت لاحق، إضافة إلى أو عوضا عن اسم عائلة. @ar
toolkit label: الاسم الأول لـ @ar
toolkit definition: شخص يستخدم اسما سُمي به عند الولادة، أو في وقت لاحق، إضافة إلى أو عوضا عن اسم عائلة. @ar
label: és nom de pila de @ca
definition: Relaciona un nomen amb una persona que usa un nom de pila donat al naixement o en un moment posterior a més de, o en lloc d’un cognom. @ca
toolkit label: nom de pila de @ca
toolkit definition: Persona que usa un nom de pila donat al naixement o en un moment posterior a més de, o en lloc d’un cognom. @ca
definition: Relaterer et nomen til en person, som anvendet et navn givet ved fødslen eller på et senere tidspunkt oveni, eller i stedet for, et efternavn. @da
toolkit definition: Person, som anvendet et navn givet ved fødslen eller på et senere tidspunkt oveni, eller i stedet for, et efternavn. @da
label: eesnimi isikule @et
definition: Seostab nomen'i isikuga, kes kasutab nime, mis on antud pärast sündi või hiljem perekonnanimele lisaks või selle asemel. @et
toolkit label: eesnimi isikule @et
toolkit definition: Isik, kes kasutab nime, mis on antud pärast sündi või hiljem perekonnanimele lisaks või selle asemel. @et
label: ist Vorname von @de
definition: Setzt ein Nomen in Beziehung zu einer Person, die einen Namen verwendet, der ihr bei der Geburt oder zu einem späteren Zeitpunkt, zusätzlich oder anstatt eines Nachnamens, gegeben wird. @de
toolkit label: Vorname von @de
toolkit definition: Eine Person, die einen Namen verwendet, der ihr bei der Geburt oder zu einem späteren Zeitpunkt, zusätzlich oder anstatt eines Nachnamens, gegeben wird. @de
label: utóneve a következőnek: @hu
definition: Hozzákapcsol egy noment egy személyhez, aki születésekor kapott utónevét használja, vagy később vette fel, vagy a vezetékneve helyett használja. @hu
toolkit label: utóneve: @hu
toolkit definition: Egy személy, aki születésekor kapott utónevét használja, vagy később vette fel, vagy a vezetékneve helyett használja. @hu
label: è nome proprio di @it
definition: Correla un nomen a una persona che usa un nome proprio dato alla nascita o in un momento successivo in aggiunta a, o al posto di, un cognome. @it
toolkit label: nome proprio di @it
toolkit definition: Una persona che usa un nome proprio dato alla nascita o in un momento successivo in aggiunta a, o in luogo di, un cognome. @it
label: ir vārds @lv
definition: Sasaista nomenu ar personu, kura papildus uzvārdam vai tā vietā izmanto vārdu, kas dots piedzimstot vai vēlāk. @lv
toolkit label: ir vārds @lv
toolkit definition: Persona, kura papildus uzvārdam vai tā vietā izmanto vārdu, kas dots piedzimstot vai vēlāk. @lv
label: 是……的名 @zh-hans
definition: 将一个命名与使用出生时或以后某个时间点被赋予的姓以外或取代姓的一个名的一个个人关联起来。 @zh-hans
toolkit label: ……的名 @zh-hans
toolkit definition: 使用出生时或以后某个时间点被赋予的姓以外或取代姓的一个名的一个个人 @zh-hans
has subproperty: P80175
label: adıdır @tr
definition: Bir ismi, soyadına ek olarak veya soyadı yerine doğumda veya daha sonraki bir noktada verilen bir adı kullanan bir kişiyle ilişkilendirir. @tr
toolkit label: verilen ad @tr
toolkit definition: Soyadına ek olarak veya soyadı yerine doğumda veya daha sonraki bir noktada verilen bir adı kullanan bir kişi. @tr

is identifier for agent of
status: Published
type: Property
lexical alias: identifierForAgentOf.en
definition: Relates a nomen to an agent who has an appellation of agent that is a reference code taken from a vocabulary encoding scheme.
domain: C10012
toolkit label: identifier for agent of
toolkit definition: An agent who has an appellation of agent that is a reference code taken from a vocabulary encoding scheme.
sub property of: is appellation of agent of
has element type: 2
sub property of: is identifier for RDA entity of
label: tunniste toimijalle @fi
definition: Liittää nomenin toimijaan, jolla on sanaston merkintäjärjestelmästä otettu viitekoodi nimityksenään. @fi
toolkit label: tunniste toimijalle @fi
toolkit definition: Toimija, jolla on sanaston merkintäjärjestelmästä otettu viitekoodi nimityksenään. @fi
label: er identifikator for agent for @no
definition: Relaterer et nomen til en agent som har en betegnelse for agent som er en referansekode hentet fra et kodeskjema for vokabular. @no
toolkit label: identifikator for agent for @no
toolkit definition: En agent som har en betegnelse for agent som er en referansekode hentet fra et kodeskjema for vokabular. @no
label: est un identifiant d’agent de @fr
definition: Met un nomen en relation avec un agent qui possède une appellation d’agent consistant en un code de référence provenant d’un schéma d’encodage de vocabulaire. @fr
toolkit label: identifiant d’agent de @fr
toolkit definition: Agent qui possède une appellation d’agent consistant en un code de référence provenant d’un schéma d’encodage de vocabulaire. @fr
label: is identificatie voor actor van @nl
definition: Relateert een nomen aan een actor die een benaming van actor heeft die een referentiecode is ontleend aan een vocabulair coderingssysteem. @nl
toolkit label: identificatie voor actor van @nl
toolkit definition: Een actor die een benaming van actor heeft die een referentiecode is ontleend aan een vocabulair coderingssysteem. @nl
label: هو مُعرِّف لوكيل لـ @ar
definition: يربط تسمية بوكيل له اسم وكيل عبارة عن رمز إحالة مأخوذ من خطة ترميز مفردات. @ar
toolkit label: مُعرِّف لوكيل لـ @ar
toolkit definition: وكيل له اسم عبارة عن رمز إحالة مأخوذ من خطة ترميز مفردات. @ar
label: és identificador d’agent de @ca
definition: Relaciona un nomen amb un agent que té una apel·lació d’agent que és un codi de referència obtingut d’un esquema de codificació de vocabulari. @ca
toolkit label: identificador d’agent de @ca
toolkit definition: Agent que té una apel·lació d’agent que és un codi de referència obtingut d’un esquema de codificació de vocabulari. @ca
label: er identifikator for agent af @da
definition: Relaterer et nomen til en agent, som har en benævnelse på agent, som er en referencekode hentet fra et vokabularkodningsskema. @da
toolkit label: identifikator for agent af @da
toolkit definition: Agent, som har en benævnelse på agent, som er en referencekode hentet fra et vokabularkodningsskema. @da
label: identifikaator tegijale @et
definition: Seostab nomen'i tegijaga, kellel on tegija nimetuseks leksikaalsest märkimissüsteemist võetud viitekood. @et
toolkit label: identifikaator tegijale @et
toolkit definition: Tegija, kellel on tegija nimetuseks leksikaalsest märkimissüsteemist võetud viitekood. @et
label: ist Identifikator für einen Akteur von @de
definition: Setzt ein Nomen in Beziehung zu einem Akteur, der über eine Bezeichnung für einen Akteur verfügt, die einen Referenzcode darstellt, der aus einem Vocabulary Encoding Scheme entnommen wird. @de
toolkit label: Identifikator für einen Akteur von @de
toolkit definition: Ein Akteur, der über eine Bezeichnung für einen Akteur verfügt, die einen Referenzcode darstellt, der aus einem Vocabulary Encoding Scheme entnommen wird. @de
label: ágensazonosítója a következőnek: @hu
definition: Hozzákapcsol egy noment egy ágenshez, amelynek van olyan ágensmegnevezése, amely egy szótárkódolási sémából származó hivatkozási kód. @hu
toolkit label: ágensazonosítója: @hu
toolkit definition: Egy ágens, amelynek van olyan ágensmegnevezése, amely egy szótárkódolási sémából származó hivatkozási kód. @hu
label: è identificatore per agente di @it
definition: Correla un nomen a un agente che ha una denominazione di agente che è un codice di riferimento tratto da uno schema di codifica di vocabolario. @it
toolkit label: identificatore per agente di @it
toolkit definition: Un agente che ha una denominazione di agente che è un codice di riferimento tratto da uno schema di codifica di vocabolario. @it
label: ir identifikators aģentam @lv
definition: Sasaista nomenu ar aģentu, kam ir aģenta apzīmējums kodētā vārdnīcā. @lv
toolkit label: ir identifikators aģentam @lv
toolkit definition: Aģents, kam ir aģenta apzīmējums kodētā vārdnīcā. @lv
label: 是……的行为者的标识符 @zh-hans
definition: 将一个命名与有一个取自一个词表编码体系的指称代码作为行为者称谓的一个行为者关联起来。 @zh-hans
toolkit label: ……的行为者的标识符 @zh-hans
toolkit definition: 有一个取自一个词表编码体系的指称代码作为行为者称谓的一个行为者 @zh-hans
has subproperty: is identifier for collective agent of
has subproperty: is identifier for person of
has subproperty: P80033
label: temsilcisinin tanımlayıcısıdır @tr
definition: Bir ismi, bir kelime kodlama şemasından alınan bir referans kodu olan bir temsilci ünvanına sahip bir temsilciyle ilişkilendirir. @tr
toolkit label: temsilcisinin tanımlayıcısıdır @tr
toolkit definition: Bir kelime kodlama şemasından alınan bir referans kodu olan bir temsilci ünvanına sahip bir temsilci. @tr

is identifier for collective agent of
status: Published
type: Property
lexical alias: identifierForCollectiveAgentOf.en
definition: Relates a nomen to a collective agent who has an appellation of collective agent that is a reference code taken from a vocabulary encoding scheme.
domain: C10012
toolkit label: identifier for collective agent of
toolkit definition: A collective agent who has an appellation of collective agent that is a reference code taken from a vocabulary encoding scheme.
sub property of: is appellation of collective agent of
sub property of: is identifier for agent of
has element type: 2
label: tunniste yhteistoimijalle @fi
definition: Liittää nomenin yhteistoimijaan, jolla on sanaston merkintäjärjestelmästä otettu viitekoodi nimityksenään. @fi
toolkit label: tunniste yhteistoimijalle @fi
toolkit definition: Yhteistoimija, jolla on sanaston merkintäjärjestelmästä otettu viitekoodi nimityksenään. @fi
label: er identifikator for kollektiv agent for @no
definition: Relaterer et nomen til en kollektiv agent som har en betegnelse for kollektiv agent som er en referansekode hentet fra et kodeskjema for vokabular. @no
toolkit label: identifikator for kollektiv agent for @no
toolkit definition: En kollektiv agent som har en betegnelse for kollektiv agent som er en referansekode hentet fra et kodeskjema for vokabular. @no
label: est un identifiant d’agent collectif de @fr
definition: Met un nomen en relation avec un agent collectif qui possède une appellation d’agent collectif consistant en un code de référence provenant d’un schéma d’encodage de vocabulaire. @fr
toolkit label: identifiant d’agent collectif de @fr
toolkit definition: Agent collectif qui possède une appellation d’agent collectif consistant en un code de référence provenant d’un schéma d’encodage de vocabulaire. @fr
label: is identificatie voor collectieve actor van @nl
definition: Relateert een nomen aan een collectieve actor die een benaming van collectieve actor heeft die een referentiecode is ontleend aan een vocabulair coderingssysteem. @nl
toolkit label: identificatie voor collectieve actor van @nl
toolkit definition: Een collectieve actor die een benaming van collectieve actor heeft die een referentiecode is ontleend aan een vocabulair coderingssysteem. @nl
label: هو مُعرِّف لوكيل جماعي لـ @ar
definition: يربط تسمية بوكيل جماعي له اسم وكيل جماعي عبارة عن رمز إحالة مأخوذ من خطة ترميز مفردات. @ar
toolkit label: مُعرِّف لوكيل جماعي لـ @ar
toolkit definition: وكيل جماعي له اسم وكيل جماعي عبارة عن رمز إحالة مأخوذ من خطة ترميز مفردات. @ar
label: és identificador d’agent col·lectiu de @ca
definition: Relaciona un nomen amb un agent col·lectiu que té una apel·lació d’agent col·lectiu que és un codi de referència obtingut d’un esquema de codificació de vocabulari. @ca
toolkit label: identificador d’agent col·lectiu de @ca
toolkit definition: Agent col·lectiu que té una apel·lació d’agent col·lectiu que és un codi de referència obtingut d’un esquema de codificació de vocabulari. @ca
label: er identifikator for kollektiv agent af @da
definition: Relaterer et nomen til en kollektiv agent, som har en benævnelse på kollektiv agent, som er en referencekode hentet fra et vokabularkodningsskema. @da
toolkit label: identifikator for kollektiv agent af @da
toolkit definition: Kollektiv agent, som har en benævnelse på kollektiv agent, som er en referencekode hentet fra et vokabularkodningsskema. @da
label: identifikaator kollektiivile @et
definition: Seostab nomen'i kollektiiviga, kellel on kollektiivi nimetuseks leksikaalsest märkimissüsteemist võetud viitekood. @et
toolkit label: identifikaator kollektiivile @et
toolkit definition: Kollektiiv, kellel on kollektiivi nimetuseks leksikaalsest märkimissüsteemist võetud viitekood. @et
label: ist Identifikator für einen gemeinschaftlichen Akteur von @de
definition: Setzt ein Nomen in Beziehung zu einem gemeinschaftlichen Akteur, der über eine Bezeichnung für einen gemeinschaftlicher Akteur verfügt, die einen Referenzcode darstellt, der aus einem Vocabulary Encoding Scheme entnommen wird. @de
toolkit label: Identifikator für einen gemeinschaftlichen Akteur von @de
toolkit definition: Ein gemeinschaftlichen Akteur, der über eine Bezeichnung für einen gemeinschaftlicher Akteur verfügt, die einen Referenzcode darstellt, der aus einem Vocabulary Encoding Scheme entnommen wird. @de
label: kollektívágens-azonosítója a következőnek: @hu
definition: Hozzákapcsol egy noment egy kollektív ágenshez, amelynek van olyan kollektívágens-megnevezése, amely egy szótárkódolási sémából származó hivatkozási kód. @hu
toolkit label: kollektívágens-azonosítója: @hu
toolkit definition: Egy kollektív ágens, amelynek van olyan kollektívágens-megnevezése, amely egy szótárkódolási sémából származó hivatkozási kód. @hu
label: è identificatore per agente collettivo di @it
definition: Correla un nomen a un agente collettivo che ha una denominazione di agente collettivo che è un codice di riferimento tratto da uno schema di codifica di vocabolario. @it
toolkit label: identificatore per agente collettivo di @it
toolkit definition: Un agente collettivo che ha una denominazione di agente collettivo che è un codice di riferimento tratto da uno schema di codifica di vocabolario. @it
label: ir identifikators grupai @lv
definition: Sasaista nomenu ar grupu, kam ir grupas apzīmējums kodētā vārdnīcā. @lv
toolkit label: ir identifikators grupai @lv
toolkit definition: Grupa, kam ir grupas apzīmējums kodētā vārdnīcā. @lv
label: 是……的集体行为者的标识符 @zh-hans
definition: 将一个命名与有一个取自一个词表编码体系的指称代码作为集体行为者称谓的一个集体行为者关联起来。 @zh-hans
toolkit label: ……的集体行为者的标识符 @zh-hans
toolkit definition: 有一个取自一个词表编码体系的指称代码作为集体行为者称谓的一个集体行为者 @zh-hans
has subproperty: is identifier for corporate body of
has subproperty: is identifier for family of
has subproperty: P80034
label: kolektif temsilcisinin tanımlayıcısıdır @tr
definition: Bir ismi, bir kelime kodlama şemasından alınan bir referans kodu olan bir kolektif temsilci ünvanına sahip bir kolektif temsilciyle ilişkilendirir. @tr
toolkit label: kolektif temsilcisinin tanımlayıcısıdır @tr
toolkit definition: Bir kelime kodlama şemasından alınan bir referans kodu olan bir kolektif temsilci ünvanına sahip kolektif bir temsilci. @tr

is identifier for corporate body of
status: Published
type: Property
lexical alias: identifierForCorporateBodyOf.en
definition: Relates a nomen to a corporate body who has an appellation of corporate body that is a reference code taken from a vocabulary encoding scheme.
domain: C10012
toolkit label: identifier for corporate body of
toolkit definition: A corporate body who has an appellation of corporate body that is a reference code taken from a vocabulary encoding scheme.
sub property of: is appellation of corporate body of
sub property of: is identifier for collective agent of
has element type: 2
label: tunniste yhteisölle @fi
definition: Liittää nomenin yhteisöön, jolla on sanaston merkintäjärjestelmästä otettu viitekoodi nimityksenään. @fi
toolkit label: tunniste yhteisölle @fi
toolkit definition: Yhteisö, jolla on sanaston merkintäjärjestelmästä otettu viitekoodi nimityksenään. @fi
label: er identifikator for korporasjon for @no
definition: Relaterer et nomen til en korporasjon som har en betegnelse for korporasjon som er en referansekode hentet fra et kodeskjema for vokabular. @no
toolkit label: identifikator for korporasjon for @no
toolkit definition: En korporasjon som har en betegnelse for korporasjon som er en referansekode hentet fra et kodeskjema for vokabular. @no
label: est un identifiant de collectivité de @fr
definition: Met un nomen en relation avec une collectivité qui possède une appellation de collectivité consistant en un code de référence provenant d’un schéma d’encodage de vocabulaire. @fr
toolkit label: identifiant de collectivité de @fr
toolkit definition: Collectivité qui possède une appellation de collectivité consistant en un code de référence provenant d’un schéma d’encodage de vocabulaire. @fr
label: is identificatie voor corporatie van @nl
definition: Relateert een nomen aan een corporatie die een benaming van corporatie heeft die een referentiecode is ontleend aan een vocabulair coderingssysteem. @nl
toolkit label: identificatie voor corporatie van @nl
toolkit definition: Een corporatie die een benaming van corporatie heeft die een referentiecode is ontleend aan een vocabulair coderingssysteem. @nl
label: هو مُعرِّف لهيئة لـ @ar
definition: يربط تسمية بهيئة لها اسم هيئة عبارة عن رمز إحالة مأخوذة من خطة ترميز مفردات. @ar
toolkit label: مُعرِّف لهيئة لـ @ar
toolkit definition: هيئة لها تسمية لهيئة عبارة عن رمز إحالة مأخوذة من خطة ترميز مفردات. @ar
label: és identificador d’entitat corporativa de @ca
definition: Relaciona un nomen amb una entitat corporativa que té una apel·lació d’entitat corporativa que és un codi de referència obtingut d’un esquema de codificació de vocabulari. @ca
toolkit label: identificador d’entitat corporativa de @ca
toolkit definition: Entitat corporativa que té una apel·lació d’entitat corporativa que és un codi de referència obtingut d’un esquema de codificació de vocabulari. @ca
label: er identifikator for korporation af @da
definition: Relaterer et nomen til en korporation, som har en benævnelse på korporation, som er en referencekode hentet fra et vokabularkodningsskema. @da
toolkit label: identifikator for korporation af @da
toolkit definition: Korporation, som har en benævnelse på korporation, som er en referencekode hentet fra et vokabularkodningsskema. @da
label: identifikaator asutusele @et
definition: Seostab nomen'i asutusega, kellel on asutuse nimetuseks leksikaalsest märkimissüsteemist võetud viitekood. @et
toolkit label: identifikaator asutusele @et
toolkit definition: Asutus, kellel on asutuse nimetuseks leksikaalsest märkimissüsteemist võetud viitekood. @et
label: ist Identifikator für eine Körperschaft von @de
definition: Setzt ein Nomen in Beziehung zu einer Körperschaft, die über eine Bezeichnung für eine Körperschaft verfügt, die einen Referenzcode darstellt, der aus einem Vocabulary Encoding Scheme entnommen wird. @de
toolkit label: Identifikator für eine Körperschaft von @de
toolkit definition: Eine Körperschaft, die über eine Bezeichnung für eine Körperschaft verfügt, die einen Referenzcode darstellt, der aus einem Vocabulary Encoding Scheme entnommen wird. @de
label: testület-azonosítója a következőnek: @hu
definition: Hozzákapcsol egy noment egy testülethez, amelynek van olyan testület-megnevezése, amely egy szótárkódolási sémából származó hivatkozási kód. @hu
toolkit label: testület-azonosítója: @hu
toolkit definition: Egy testület, amelynek van olyan testület-megnevezése, amely egy szótárkódolási sémából származó hivatkozási kód. @hu
label: è identificatore per ente di @it
definition: Correla un nomen a un ente che ha una denominazione di ente che è un codice di riferimento tratto da uno schema di codifica di vocabolario. @it
toolkit label: identificatore per ente di @it
toolkit definition: Un ente che ha una denominazione di ente che è un codice di riferimento tratto da uno schema di codifica di vocabolario. @it
label: ir identifikators institūcijai @lv
definition: Sasaista nomenu ar institūciju, kam ir institūcijas apzīmējums kodētā vārdnīcā. @lv
toolkit label: ir identifikators institūcijai @lv
toolkit definition: Institūcija, kam ir institūcijas apzīmējums kodētā vārdnīcā. @lv
label: 是……的团体的标识符 @zh-hans
definition: 将一个命名与有一个取自一个词表编码体系的指称代码作为团体称谓的一个团体关联起来。 @zh-hans
toolkit label: ……的团体的标识符 @zh-hans
toolkit definition: 有一个取自一个词表编码体系的指称代码作为团体称谓的一个团体 @zh-hans
has subproperty: P80035
label: tüzel kişisinin tanımlayıcısıdır @tr
definition: Bir ismi, bir kelime kodlama şemasından alınan bir referans kodu olan bir tüzel kişilik ünvanına sahip bir tüzel kişilikle ilişkilendirir. @tr
toolkit label: tüzel kişisinin tanımlayıcısıdır @tr
toolkit definition: Bir kelime kodlama şemasından alınan bir referans kodu olan bir tüzel kişilik ünvanına sahip bir tüzel kişilik. @tr

is identifier for expression of
status: Published
type: Property
lexical alias: identifierForExpressionOf.en
definition: Relates a nomen to an expression that has an appellation of expression that is a reference code taken from a vocabulary encoding scheme.
domain: C10012
toolkit label: identifier for expression of
toolkit definition: An expression that has an appellation of expression that is a reference code taken from a vocabulary encoding scheme.
sub property of: is appellation of expression of
has element type: 2
sub property of: is identifier for RDA entity of
label: tunniste ekspressiolle @fi
definition: Liittää nomenin ekspressioon, jolla on sanaston merkintäjärjestelmästä otettu viitekoodi nimityksenään. @fi
toolkit label: tunniste ekspressiolle @fi
toolkit definition: Ekspressio, jolla on sanaston merkintäjärjestelmästä otettu viitekoodi nimityksenään. @fi
label: er identifikator for uttrykk for @no
definition: Relaterer et nomen til et uttrykk som har en betegnelse for uttrykk som er en referansekode hentet fra et kodeskjema for vokabular. @no
toolkit label: identifikator for uttrykk for @no
toolkit definition: Et uttrykk som har en betegnelse for uttrykk som er en referansekode hentet fra et kodeskjema for vokabular. @no
label: est un identifiant d’expression de @fr
definition: Met un nomen en relation avec une expression qui possède une appellation d’expression consistant en un code de référence provenant d’un schéma d’encodage de vocabulaire. @fr
toolkit label: identifiant d’expression de @fr
toolkit definition: Expression qui possède une appellation d’expression consistant en un code de référence provenant d’un schéma d’encodage de vocabulaire. @fr
label: is identificatie voor expressie van @nl
definition: Relateert een nomen aan een expressie die een benaming van expressie heeft die een referentiecode is ontleend aan een vocabulair coderingssysteem. @nl
toolkit label: identificatie voor expressie van @nl
toolkit definition: Een expressie die een benaming van expressie heeft die een referentiecode is ontleend aan een vocabulair coderingssysteem. @nl
label: هو مُعرِّف لتعبيرة لـ @ar
definition: يربط تسمية بتعبيرة لها اسم تعبيرة عبارة عن رمز إحالة مأخوذ من خطة ترميز مفردات. @ar
toolkit label: مُعرِّف لتعبيرة لـ @ar
toolkit definition: تعبيرة لها اسم تعبيرة عبارة عن رمز إحالة مأخوذ من خطة ترميز مفردات. @ar
label: és identificador d’expressió de @ca
definition: Relaciona un nomen amb una expressió que té una apel·lació d’expressió que és un codi de referència obtingut d’un esquema de codificació de vocabulari. @ca
toolkit label: identificador d’expressió de @ca
toolkit definition: Expressió que té una apel·lació d’expressió que és un codi de referència obtingut d’un esquema de codificació de vocabulari. @ca
label: er identifikator for udtryk af @da
definition: Relaterer et nomen til et udtryk, som har en benævnelse på udtryk, som er en referencekode hentet fra et vokabularkodningsskema. @da
toolkit label: identifikator for udtryk af @da
toolkit definition: Udtryk, som har en benævnelse på udtryk, som er en referencekode hentet fra et vokabularkodningsskema. @da
label: identifikaator väljendusele @et
definition: Seostab nomen'i väljendusega, millel on väljenduse nimetuseks leksikaalsest märkimissüsteemist võetud viitekood. @et
toolkit label: identifikaator väljendusele @et
toolkit definition: Väljendus, millel on väljenduse nimetuseks leksikaalsest märkimissüsteemist võetud viitekood. @et
label: ist Identifikator für eine Expression von @de
definition: Setzt ein Nomen in Beziehung zu einer Expression, die über eine Bezeichnung für eine Expression verfügt, die einen Referenzcode darstellt, der aus einem Vocabulary Encoding Scheme entnommen wird. @de
toolkit label: Identifikator für eine Expression von @de
toolkit definition: Eine Expression, die über eine Bezeichnung für eine Expression verfügt, die einen Referenzcode darstellt, der aus einem Vocabulary Encoding Scheme entnommen wird. @de
label: azonosítója a következő kifejezési formának: @hu
definition: Hozzákapcsol egy noment egy kifejezési formához, amelynek van olyan kifejezésiforma-megnevezése, amely egy szótárkódolási sémából származó hivatkozási kód. @hu
toolkit label: kifejezésiforma-azonosítója: @hu
toolkit definition: Egy kifejezési forma, amelynek van olyan kifejezésiforma-megnevezése, amely egy szótárkódolási sémából származó hivatkozási kód. @hu
label: è identificatore per espressione di @it
definition: Correla un nomen a un'espressione che ha una denominazione di espressione che è un codice di riferimento tratto da uno schema di codifica di vocabolario. @it
toolkit label: identificatore per espressione di @it
toolkit definition: Un'espressione che ha una denominazione di espressione che è un codice di riferimento tratto da uno schema di codifica di vocabolario. @it
label: ir identifikators izteiksmei @lv
definition: Sasaista nomenu ar izteiksmi, kam ir izteiksmes apzīmējums kodētā vārdnīcā. @lv
toolkit label: ir identifikators izteiksmei @lv
toolkit definition: Izteiksme, kam ir izteiksmes apzīmējums kodētā vārdnīcā. @lv
label: 是……的内容表达的标识符 @zh-hans
definition: 将一个命名与有一个取自一个词表编码体系的指称代码作为内容表达称谓的一种内容表达关联起来。 @zh-hans
toolkit label: ……的内容表达的标识符 @zh-hans
toolkit definition: 有一个取自一个词表编码体系的指称代码作为内容表达称谓的一种内容表达 @zh-hans
has subproperty: P80046
label: anlatımının tanımlayıcısıdır @tr
definition: Bir ismi, bir kelime kodlama şemasından alınan bir referans kodu olan bir anlatım yakıştırmasına sahip bir anlatımla ilişkilendirir. @tr
toolkit label: anlatımının tanımlayıcısıdır @tr
toolkit definition: Bir kelime kodlama şemasından alınan, referans kodu olan bir anlatımın unvanına sahip bir anlatım. @tr

is identifier for family of
status: Published
type: Property
lexical alias: identifierForFamilyOf.en
definition: Relates a nomen to a family who has an appellation of family that is a reference code taken from a vocabulary encoding scheme.
domain: C10012
toolkit label: identifier for family of
toolkit definition: A family who has an appellation of family that is a reference code taken from a vocabulary encoding scheme.
sub property of: is appellation of family of
sub property of: is identifier for collective agent of
has element type: 2
label: tunniste suvulle @fi
definition: Liittää nomenin sukuun, jolla on sanaston merkintäjärjestelmästä otettu viitekoodi nimityksenään. @fi
toolkit label: tunniste suvulle @fi
toolkit definition: Suku, jolla on sanaston merkintäjärjestelmästä otettu viitekoodi nimityksenään. @fi
label: er identifikator for familie for @no
definition: Relaterer et nomen til en familie som har en betegnelse for familie som er en referansekode hentet fra et kodeskjema for vokabular. @no
toolkit label: identifikator for familie for @no
toolkit definition: En familie som har en betegnelse for familie som er en referansekode hentet fra et kodeskjema for vokabular. @no
label: est un identifiant de famille de @fr
definition: Met un nomen en relation avec une famille qui possède une appellation de famille consistant en un code de référence provenant d’un schéma d’encodage de vocabulaire. @fr
toolkit label: identifiant de famille de @fr
toolkit definition: Famille qui possède une appellation de famille consistant en un code de référence provenant d’un schéma d’encodage de vocabulaire. @fr
label: is identificatie voor familie van @nl
definition: Relateert een nomen aan een familie die een benaming van familie heeft die een referentiecode is ontleend aan een vocabulair coderingssysteem. @nl
toolkit label: identificatie voor familie van @nl
toolkit definition: Een familie die een benaming van familie heeft die een referentiecode is ontleend aan een vocabulair coderingssysteem. @nl
label: هو مُعرِّف لعائلة لـ @ar
definition: يربط تسمية بعائلة لها اسم عائلة عبارة عن رمز إحالة مأخوذ من خطة ترميز مفردات. @ar
toolkit label: مُعرِّف لعائلة لـ @ar
toolkit definition: عائلة لها اسم عائلة عبارة عن رمز إحالة مأخوذ من خطة ترميز مفردات. @ar
label: és identificador de família de @ca
definition: Relaciona un nomen amb una família que té una apel·lació de família que és un codi de referència obtingut d’un esquema de codificació de vocabulari. @ca
toolkit label: identificador de família de @ca
toolkit definition: Família que té una apel·lació de família que és un codi de referència obtingut d’un esquema de codificació de vocabulari. @ca
label: er identifikator for familie af @da
definition: Relaterer et nomen til en familie, som har en benævnelse på familie, som er en referencekode hentet fra et vokabularkodningsskema. @da
toolkit label: identifikator for familie af @da
toolkit definition: Familie, som har en benævnelse på familie, som er en referencekode hentet fra et vokabularkodningsskema. @da
label: identifikaator perekonnale @et
definition: Seostab nomen'i perekonnaga, kellel on perekonna nimetuseks leksikaalsest märkimissüsteemist võetud viitekood. @et
toolkit label: identifikaator perekonnale @et
toolkit definition: Perekond, kellel on perekonna nimetuseks leksikaalsest märkimissüsteemist võetud viitekood. @et
label: ist Identifikator für eine Familie von @de
definition: Setzt ein Nomen in Beziehung zu einer Familie, die über eine Bezeichnung für eine Familie verfügt, die einen Referenzcode darstellt, der aus einem Vocabulary Encoding Scheme entnommen wird. @de
toolkit label: Identifikator für eine Familie von @de
toolkit definition: Eine Familie, die über eine Bezeichnung für eine Familie verfügt, die einen Referenzcode darstellt, der aus einem Vocabulary Encoding Scheme entnommen wird. @de
label: család-azonosítója a következőnek: @hu
definition: Hozzákapcsol egy noment egy családhoz, amelynek van olyan családmegnevezése, amely egy szótárkódolási sémából származó hivatkozási kód. @hu
toolkit label: család-azonosítója: @hu
toolkit definition: Egy család, amelynek van olyan családmegnevezése, amely egy szótárkódolási sémából származó hivatkozási kód. @hu
label: è identificatore per famiglia di @it
definition: Correla un nomen a una famiglia che ha una denominazione di famiglia che è un codice di riferimento tratto da uno schema di codifica di vocabolario. @it
toolkit label: identificatore per famiglia di @it
toolkit definition: Una famiglia che ha una denominazione di famiglia che è un codice di riferimento tratto da uno schema di codifica di vocabolario. @it
label: ir identifikators dzimtai/ģimenei @lv
definition: Sasaista nomenu ar dzimtu/ģimeni, kam ir izteiksmes apzīmējums kodētā vārdnīcā. @lv
toolkit label: ir identifikators dzimtai/ģimenei @lv
toolkit definition: Dzimta/ģimene, kam ir izteiksmes apzīmējums kodētā vārdnīcā. @lv
label: 是……的家族的标识符 @zh-hans
definition: 将一个命名与有一个取自一个词表编码体系的指称代码作为家族称谓的一个家族关联起来。 @zh-hans
toolkit label: ……的家族的标识符 @zh-hans
toolkit definition: 有一个取自一个词表编码体系的指称代码作为家族称谓的一个家族 @zh-hans
has subproperty: P80036
label: ailesinin tanımlayıcısıdır @tr
definition: Bir ismi, bir kelime kodlama şemasından alınan bir referans kodu olan bir aile ünvanına sahip bir aile ile ilişkilendirir. @tr
toolkit label: ailesinin tanımlayıcısıdır @tr
toolkit definition: Bir kelime kodlama şemasından alınan bir referans kodu olan bir aile unvanına sahip olan bir aile. @tr

is identifier for item of
status: Published
type: Property
lexical alias: identifierForItemOf.en
definition: Relates a nomen to an item that has an appellation of item that is a reference code taken from a vocabulary encoding scheme.
domain: C10012
toolkit label: identifier for item of
toolkit definition: An item that has an appellation of item that is a reference code taken from a vocabulary encoding scheme.
sub property of: is appellation of item of
has element type: 2
sub property of: is identifier for RDA entity of
label: tunniste kappaleelle @fi
definition: Liittää nomenin kappaleeseen, jolla on sanaston merkintäjärjestelmästä otettu viitekoodi nimityksenään. @fi
toolkit label: tunniste kappaleelle @fi
toolkit definition: Kappale, jolla on sanaston merkintäjärjestelmästä otettu viitekoodi nimityksenään. @fi
label: er identifikator for eksemplar for @no
definition: Relaterer et nomen til et eksemplar som har en betegnelse for eksemplar som er en referansekode hentet fra et kodeskjema for vokabular. @no
toolkit label: identifikator for eksemplar for @no
toolkit definition: Et eksemplar som har en betegnelse for eksemplar som er en referansekode hentet fra et kodeskjema for vokabular. @no
label: est un identifiant d’item de @fr
definition: Met un nomen en relation avec un item qui possède une appellation d’item consistant en un code de référence provenant d’un schéma d’encodage de vocabulaire. @fr
toolkit label: identifiant d’item de @fr
toolkit definition: Item qui possède une appellation d’item consistant en un code de référence provenant d’un schéma d’encodage de vocabulaire. @fr
label: is identificatie voor item van @nl
definition: Relateert een nomen aan een item dat een benaming van item heeft die een referentiecode is ontleend aan een vocabulair coderingssysteem. @nl
toolkit label: identificatie voor item van @nl
toolkit definition: Een item dat een benaming van item heeft die een referentiecode is ontleend aan een vocabulair coderingssysteem. @nl
label: هو مُعرِّف لمفردة لـ @ar
definition: يربط تسمية بمفردة لها اسم مفردة عبارة عن رمز إحالة مأخوذة من خطة ترميز مفردات. @ar
toolkit label: مُعرِّف لمفردة لـ @ar
toolkit definition: مفردة لها اسم مفردة عبارة عن رمز إحالة مأخوذة من خطة ترميز مفردات. @ar
label: és identificador d’ítem de @ca
definition: Relaciona un nomen amb un ítem que té una apel·lació d’ítem que és un codi de referència obtingut d’un esquema de codificació de vocabulari. @ca
toolkit label: identificador d’ítem de @ca
toolkit definition: Ítem que té una apel·lació d’ítem que és un codi de referència obtingut d’un esquema de codificació de vocabulari. @ca
label: er identifikator for eksemplar af @da
definition: Relaterer et nomen til et eksemplar, som har en benævnelse på eksemplar, som er en referencekode hentet fra et vokabularkodningsskema. @da
toolkit label: identifikator for eksemplar af @da
toolkit definition: Eksemplar, som har en benævnelse på eksemplar, som er en referencekode hentet fra et vokabularkodningsskema. @da
label: identifikaator eksemplarile @et
definition: Seostab nomen'i eksemplariga, millel on eksemplari nimetuseks leksikaalsest märkimissüsteemist võetud viitekood. @et
toolkit label: identifikaator eksemplarile @et
toolkit definition: Eksemplar, millel on eksemplari nimetuseks leksikaalsest märkimissüsteemist võetud viitekood. @et
label: ist Identifikator für ein Exemplar von @de
definition: Setzt ein Nomen in Beziehung zu einem Exemplar, das über eine Bezeichnung für ein Exemplar verfügt, die einen Referenzcode darstellt, der aus einem Vocabulary Encoding Scheme entnommen wird. @de
toolkit label: Identifikator für ein Exemplar von @de
toolkit definition: Eine Exemplar, das über eine Bezeichnung für ein Exemplar verfügt, die einen Referenzcode darstellt, der aus einem Vocabulary Encoding Scheme entnommen wird. @de
label: azonosítója a következő példánynak: @hu
definition: Hozzákapcsol egy noment egy példányhoz, amelynek van olyan példánymegnevezése, amely egy szótárkódolási sémából származó hivatkozási kód. @hu
toolkit label: azonosítója a következő példánynak: @hu
toolkit definition: Egy példány, amelynek van olyan példánymegnevezése, amely egy szótárkódolási sémából származó hivatkozási kód. @hu
label: è identificatore per item di @it
definition: Correla un nomen a un item che ha una denominazione di item che è un codice di riferimento tratto da uno schema di codifica di vocabolario. @it
toolkit label: identificatore per item di @it
toolkit definition: Un item che ha una denominazione di item che è un codice di riferimento tratto da uno schema di codifica di vocabolario. @it
label: ir identifikators vienībai @lv
definition: Sasaista nomenu ar vienību, kurai ir izteiksmes apzīmējums kodētā vārdnīcā. @lv
toolkit label: ir identifikators vienībai @lv
toolkit definition: Vienība, kurai ir izteiksmes apzīmējums kodētā vārdnīcā. @lv
label: 是……的单件的标识符 @zh-hans
definition: 将一个命名与有一个取自一个词表编码体系的指称代码作为单件称谓的一个单件关联起来。 @zh-hans
toolkit label: ……的单件的标识符 @zh-hans
toolkit definition: 有一个取自一个词表编码体系的指称代码作为单件称谓的一个单件 @zh-hans
has subproperty: P80047
label: kopyasının tanımlayıcısıdır @tr
definition: Bir ismi, bir kelime kodlama şemasından alınan bir referans kodu olan bir kopya ünvanına sahip bir kopyayla ilişkilendirir. @tr
toolkit label: kopyasının tanımlayıcısıdır @tr
toolkit definition: Bir kelime kodlama şemasından alınan bir referans kodu olan bir kopya unvanına sahip bir kopya. @tr

is identifier for manifestation of
status: Published
type: Property
lexical alias: identifierForManifestationOf.en
definition: Relates a nomen to a manifestation that has an appellation of manifestation that is a reference code taken from a vocabulary encoding scheme.
domain: C10012
toolkit label: identifier for manifestation of
toolkit definition: A manifestation that has an appellation of manifestation that is a reference code taken from a vocabulary encoding scheme.
sub property of: is appellation of manifestation of
has element type: 2
sub property of: is identifier for RDA entity of
label: tunniste manifestaatiolle @fi
definition: Liittää nomenin manifestaatioon, jolla on sanaston merkintäjärjestelmästä otettu viitekoodi nimityksenään. @fi
toolkit label: tunniste manifestaatiolle @fi
toolkit definition: Manifestaatio, jolla on sanaston merkintäjärjestelmästä otettu viitekoodi nimityksenään. @fi
label: er identifikator for manifestasjon for @no
definition: Relaterer et nomen til en manifestasjon som har en betegnelse for manifestasjon som er en referansekode hentet fra et kodeskjema for vokabular. @no
toolkit label: identifikator for manifestasjon for @no
toolkit definition: En manifestasjon som har en betegnelse for manifestasjon som er en referansekode hentet fra et kodeskjema for vokabular. @no
label: est un identifiant de manifestation de @fr
definition: Met un nomen en relation avec une manifestation qui possède une appellation de manifestation consistant en un code de référence provenant d’un schéma d’encodage de vocabulaire. @fr
toolkit label: identifiant de manifestation de @fr
toolkit definition: Manifestation qui possède une appellation de manifestation consistant en un code de référence provenant d’un schéma d’encodage de vocabulaire. @fr
label: is identificatie voor manifestatie van @nl
definition: Relateert een nomen aan een manifestatie die een benaming van manifestatie heeft die een referentiecode is ontleend aan een vocabulair coderingssysteem. @nl
toolkit label: identificatie voor manifestatie van @nl
toolkit definition: Een manifestatie die een benaming van manifestatie heeft die een referentiecode is ontleend aan een vocabulair coderingssysteem. @nl
label: هو مُعرِّف لتجسيدة لـ @ar
definition: يربط تسمية بتجسيدة لها اسم تجسيدة عبارة عن رمز إحالة مأخوذة من خطة ترميز مفردات. @ar
toolkit label: مُعرِّف لتجسيدة لـ @ar
toolkit definition: تجسيدة لها اسم تجسيدة عبارة عن رمز إحالة مأخوذة من خطة ترميز مفردات. @ar
label: és identificador de manifestació de @ca
definition: Relaciona un nomen amb una manifestació que té una apel·lació de manifestació que és un codi de referència obtingut d’un esquema de codificació de vocabulari. @ca
toolkit label: identificador de manifestació de @ca
toolkit definition: Manifestació que té una apel·lació de manifestació que és un codi de referència obtingut d’un esquema de codificació de vocabulari. @ca
label: er identifikator for manifestation af @da
definition: Relaterer et nomen til en manifestation, som har en benævnelse på manifestation, som er en referencekode hentet fra et vokabularkodningsskema. @da
toolkit label: identifikator for manifestation af @da
toolkit definition: Manifestation, som har en benævnelse på manifestation, som er en referencekode hentet fra et vokabularkodningsskema. @da
label: identifikaator kehastusele @et
definition: Seostab nomen'i kehastusega, millel on kehastuse nimetuseks leksikaalsest märkimissüsteemist võetud viitekood. @et
toolkit label: identifikaator kehastusele @et
toolkit definition: Kehastus, millel on kehastuse nimetuseks leksikaalsest märkimissüsteemist võetud viitekood. @et
label: ist Identifikator für eine Manifestation von @de
definition: Setzt ein Nomen in Beziehung zu einer Manifestation, die über eine Bezeichnung für eine Manifestation verfügt, die einen Referenzcode darstellt, der aus einem Vocabulary Encoding Scheme entnommen wird. @de
toolkit label: Identifikator für eine Manifestation von @de
toolkit definition: Eine Manifestation, die über eine Bezeichnung für eine Manifestation verfügt, die einen Referenzcode darstellt, der aus einem Vocabulary Encoding Scheme entnommen wird. @de
label: megjelenésiforma-azonosítója a következőnek: @hu
definition: Hozzákapcsol egy noment egy megjelenési formához, amelynek van olyan megjelenésiforma-megnevezése, amely egy szótárkódolási sémából származó hivatkozási kód. @hu
toolkit label: megjelenésiforma-azonosítója: @hu
toolkit definition: Egy megjelenési forma, amelynek van olyan megjelenésiforma-megnevezése, amely egy szótárkódolási sémából származó hivatkozási kód. @hu
label: è identificatore per manifestazione di @it
definition: Correla un nomen a una manifestazione che ha una denominazione di manifestazione che è un codice di riferimento tratto da uno schema di codifica di vocabolario. @it
toolkit label: identificatore per manifestazione di @it
toolkit definition: Una manifestazione che ha una denominazione di manifestazione che è un codice di riferimento tratto da uno schema di codifica di vocabolario. @it
label: ir identifikators manifestācijai @lv
definition: Sasaista nomenu ar manifestāciju, kam ir izteiksmes apzīmējums kodētā vārdnīcā. @lv
toolkit label: ir identifikators manifestācijai @lv
toolkit definition: Manifestācija, kam ir izteiksmes apzīmējums kodētā vārdnīcā. @lv
label: 是……的载体表现的标识符 @zh-hans
definition: 将一个命名与有一个取自一个词表编码体系的指称代码作为载体表现称谓的一种载体表现关联起来。 @zh-hans
toolkit label: ……的载体表现的标识符 @zh-hans
toolkit definition: 有一个取自一个词表编码体系的指称代码作为载体表现称谓的一种载体表现 @zh-hans
has subproperty: is fingerprint of
has subproperty: is plate number for notated music of
has subproperty: is publisher number for notated music of
has subproperty: P80048
label: gösteriminin tanımlayıcısıdır @tr
definition: Bir ismi, bir kelime kodlama şemasından alınan bir referans kodu olan bir gösterim yakıştırmasına sahip bir gösterimle ilişkilendirir. @tr
toolkit label: gösteriminin tanımlayıcısıdır @tr
toolkit definition: Bir kelime kodlama şemasından alınan bir referans kodu içeren bir gösterim unvanına sahip bir gösterim @tr

is identifier for person of
status: Published
type: Property
lexical alias: identifierForPersonOf.en
definition: Relates a nomen to a person who has an appellation of person that is a reference code taken from a vocabulary encoding scheme.
domain: C10012
toolkit label: identifier for person of
toolkit definition: A person who has an appellation of person that is a reference code taken from a vocabulary encoding scheme.
sub property of: is appellation of person of
sub property of: is identifier for agent of
has element type: 2
label: tunniste henkilölle @fi
definition: Liittää nomenin henkilöön, jolla on sanaston merkintäjärjestelmästä otettu viitekoodi nimityksenään. @fi
toolkit label: tunniste henkilölle @fi
toolkit definition: Henkilö, jolla on sanaston merkintäjärjestelmästä otettu viitekoodi nimityksenään. @fi
label: er identifikator for person for @no
definition: Relaterer et nomen til en person som har en betegnelse for person som er en referansekode hentet fra et kodeskjema for vokabular. @no
toolkit label: identifikator for person for @no
toolkit definition: En person som har en betegnelse for person som er en referansekode hentet fra et kodeskjema for vokabular. @no
label: est un identifiant de personne de @fr
definition: Met un nomen en relation avec une personne qui possède une appellation de personne consistant en un code de référence provenant d’un schéma d’encodage de vocabulaire. @fr
toolkit label: identifiant de personne de @fr
toolkit definition: Personne qui possède une appellation de personne consistant en un code de référence provenant d’un schéma d’encodage de vocabulaire. @fr
label: is identificatie voor persoon van @nl
definition: Relateert een nomen aan een persoon die een benaming van persoon heeft die een referentiecode is ontleend aan een vocabulair coderingssysteem. @nl
toolkit label: identificatie voor persoon van @nl
toolkit definition: Een persoon die een benaming van persoon heeft die een referentiecode is ontleend aan een vocabulair coderingssysteem. @nl
label: هو مُعرِّف لشخص لـ @ar
definition: يربط تسمية بشخص له اسم شخص عبارة عن رمز إحالة مأخوذ من خطة ترميز مفردات. @ar
toolkit label: مُعرِّف لشخص لـ @ar
toolkit definition: شخص له اسم شخص عبارة عن رمز إحالة مأخوذ من خطة ترميز مفردات. @ar
label: és identificador de persona de @ca
definition: Relaciona un nomen amb una persona que té una apel·lació de persona que és un codi de referència obtingut d’un esquema de codificació de vocabulari. @ca
toolkit label: identificador de persona de @ca
toolkit definition: Persona que té una apel·lació de persona que és un codi de referència obtingut d’un esquema de codificació de vocabulari. @ca
label: er identifikator for person af @da
definition: Relaterer et nomen til en person, som har en benævnelse på person, som er en referencekode hentet fra et vokabularkodningsskema. @da
toolkit label: identifikator for person af @da
toolkit definition: Person, som har en benævnelse på person, som er en referencekode hentet fra et vokabularkodningsskema. @da
label: identifikaator isikule @et
definition: Seostab nomen'i isikuga, kellel on isiku nimetuseks leksikaalsest märkimissüsteemist võetud viitekood. @et
toolkit label: identifikaator isikule @et
toolkit definition: Isik, kellel on isiku nimetuseks leksikaalsest märkimissüsteemist võetud viitekood. @et
label: ist Identifikator für eine Person von @de
definition: Setzt ein Nomen in Beziehung zu einer Person, die über eine Bezeichnung für eine Person verfügt, die einen Referenzcode darstellt, der aus einem Vocabulary Encoding Scheme entnommen wird. @de
toolkit label: Identifikator für eine Person von @de
toolkit definition: Eine Person, die über eine Bezeichnung für eine Person verfügt, die einen Referenzcode darstellt, der aus einem Vocabulary Encoding Scheme entnommen wird. @de
label: személy-azonosítója a következőnek: @hu
definition: Hozzákapcsol egy noment egy személyhez, amelynek van olyan személymegnevezése, amely egy szótárkódolási sémából származó hivatkozási kód. @hu
toolkit label: személy-azonosítója: @hu
toolkit definition: Egy személy, amelynek van olyan személymegnevezése, amely egy szótárkódolási sémából származó hivatkozási kód. @hu
label: è identificatore per persona di @it
definition: Correla un nomen a una persona che ha una denominazione di persona che è un codice di riferimento tratto da uno schema di codifica di vocabolario. @it
toolkit label: identificatore per persona di @it
toolkit definition: Una persona che ha una denominazione di persona che è un codice di riferimento tratto da uno schema di codifica di vocabolario. @it
label: ir identifikators personai @lv
definition: Sasaista nomenu ar personu, kurai ir izteiksmes apzīmējums kodētā vārdnīcā. @lv
toolkit label: ir identifikators personai @lv
toolkit definition: Persona, kurai ir izteiksmes apzīmējums kodētā vārdnīcā. @lv
label: 是……的个人的标识符 @zh-hans
definition: 将一个命名与有一个取自一个词表编码体系的指称代码作为个人称谓的一个个人关联起来。 @zh-hans
toolkit label: ……的个人的标识符 @zh-hans
toolkit definition: 有一个取自一个词表编码体系的指称代码作为个人称谓的一个个人 @zh-hans
has subproperty: P80037
label: kişisinin tanımlayıcısıdır @tr
definition: Bir ismi, bir kelime kodlama şemasından alınan bir referans kodu olan bir kişi ünvanına sahip bir kişiyle ilişkilendirir. @tr
toolkit label: kişisinin tanımlayıcısıdır @tr
toolkit definition: Bir kelime kodlama şemasından alınan bir referans kodu olan bir kişi ünvanına sahip olan bir kişi. @tr

is identifier for place of
status: Published
type: Property
lexical alias: identifierForPlaceOf.en
definition: Relates a nomen to a place that has an appellation of place that is a reference code taken from a vocabulary encoding scheme.
domain: C10012
toolkit label: identifier for place of
toolkit definition: A place that has an appellation of place that is a reference code taken from a vocabulary encoding scheme.
sub property of: is appellation of place of
has element type: 2
sub property of: is identifier for RDA entity of
label: tunniste paikalle @fi
definition: Liittää nomenin paikkaan, jolla on sanaston merkintäjärjestelmästä otettu viitekoodi nimityksenään. @fi
toolkit label: tunniste paikalle @fi
toolkit definition: Paikka, jolla on sanaston merkintäjärjestelmästä otettu viitekoodi nimityksenään. @fi
label: er identifikator for sted for @no
definition: Relaterer et nomen til et sted som har en betegnelse for sted som er en referansekode hentet fra et kodeskjema for vokabular. @no
toolkit label: identifikator for sted for @no
toolkit definition: Et sted som har en betegnelse for sted som er en referansekode hentet fra et kodeskjema for vokabular. @no
label: est un identifiant de lieu de @fr
definition: Met un nomen en relation avec un lieu qui possède une appellation de lieu consistant en un code de référence provenant d’un schéma d’encodage de vocabulaire. @fr
toolkit label: identifiant de lieu de @fr
toolkit definition: Lieu qui possède une appellation de lieu consistant en un code de référence provenant d’un schéma d’encodage de vocabulaire. @fr
label: is identificatie voor plaats van @nl
definition: Relateert een nomen aan een plaats die een benaming van plaats heeft die een referentiecode is ontleend aan een vocabulair coderingssysteem. @nl
toolkit label: identificatie voor plaats van @nl
toolkit definition: Een plaats die een benaming van plaats heeft die een referentiecode is ontleend aan een vocabulair coderingssysteem. @nl
label: هو مُعرِّف لمكان لـ @ar
definition: يربط تسمية بمكان له اسم مكان عبارة عن رمز إحالة مأخوذ من خطة ترميز مفردات. @ar
toolkit label: مُعرِّف لمكان لـ @ar
toolkit definition: مكان له اسم مكان عبارة عن رمز إحالة مأخوذ من خطة ترميز مفردات. @ar
label: és identificador de lloc de @ca
definition: Relaciona un nomen amb un lloc que té una apel·lació de lloc que és un codi de referència obtingut d’un esquema de codificació de vocabulari. @ca
toolkit label: identificador de lloc de @ca
toolkit definition: Lloc que té una apel·lació de lloc que és un codi de referència obtingut d’un esquema de codificació de vocabulari. @ca
label: er identifikator for sted af @da
definition: Relaterer et nomen til et sted, som har en benævnelse på sted, som er en referencekode hentet fra et vokabularkodningsskema. @da
toolkit label: identifikator for sted af @da
toolkit definition: Sted, som har en benævnelse på sted, som er en referencekode hentet fra et vokabularkodningsskema. @da
label: identifikaator kohale @et
definition: Seostab nomen'i kohaga, millel on koha nimetuseks leksikaalsest märkimissüsteemist võetud viitekood. @et
toolkit label: identifikaator kohale @et
toolkit definition: Koht, millel on koha nimetuseks leksikaalsest märkimissüsteemist võetud viitekood. @et
label: ist Identifikator für ein Geografikum von @de
definition: Setzt ein Nomen in Beziehung zu einem Geografikum, das über eine Bezeichnung für ein Geografikum verfügt, die einen Referenzcode darstellt, der aus einem Vocabulary Encoding Scheme entnommen wird. @de
toolkit label: Identifikator für ein Geografikum von @de
toolkit definition: Ein Geografikum, das über eine Bezeichnung für ein Geografikum verfügt, die einen Referenzcode darstellt, der aus einem Vocabulary Encoding Scheme entnommen wird. @de
label: azonosítója a következő helynek: @hu
definition: Hozzákapcsol egy noment egy helyhez, amelynek van olyan helymegnevezése, amely egy szótárkódolási sémából származó hivatkozási kód. @hu
toolkit label: azonosítója a következő helynek: @hu
toolkit definition: Egy hely, amelynek van olyan helymegnevezése, amely egy szótárkódolási sémából származó hivatkozási kód. @hu
label: è identificatore per luogo di @it
definition: Correla un nomen a un luogo che ha una denominazione di luogo che è un codice di riferimento tratto da uno schema di codifica di vocabolario. @it
toolkit label: identificatore per luogo di @it
toolkit definition: Un luogo che ha una denominazione di luogo che è un codice di riferimento tratto da uno schema di codifica di vocabolario. @it
label: ir identifikators vietai @lv
definition: Sasaista nomenu ar vietu, kurai ir izteiksmes apzīmējums kodētā vārdnīcā. @lv
toolkit label: ir identifikators vietai @lv
toolkit definition: Vieta, kurai ir izteiksmes apzīmējums kodētā vārdnīcā. @lv
label: 是……的地点的标识符 @zh-hans
definition: 将一个命名与有一个取自一个词表编码体系的指称代码作为地点称谓的一个地点关联起来。 @zh-hans
toolkit label: ……的地点的标识符 @zh-hans
toolkit definition: 有一个取自一个词表编码体系的指称代码作为地点称谓的一个地点 @zh-hans
has subproperty: P80042
label: yerinin tanımlayıcısıdır @tr
definition: Bir ismi, bir kelime kodlama şemasından alınan bir referans kodu olan bir yer ünvanına sahip bir yerle ilişkilendirir. @tr
toolkit label: yerinin tanımlayıcısıdır @tr
toolkit definition: Bir kelime kodlama şemasından alınan bir referans kodu olan bir yer unvanına sahip bir yer. @tr

is identifier for RDA entity of
status: Published
type: Property
lexical alias: identifierForRDAEntityOf.en
definition: Relates a nomen to an RDA entity that has an appellation of RDA Entity that is a reference code taken from a vocabulary encoding scheme.
domain: C10012
toolkit label: identifier for RDA entity of
toolkit definition: An RDA entity that has an appellation of RDA entity that is a reference code taken from a vocabulary encoding scheme.
has element type: 2
sub property of: is appellation of RDA entity of
label: tunniste RDA-entiteetille @fi
definition: Liittää nomenin RDA-entiteettiin, jolla on RDA-entiteetin nimitys, joka on sanaston merkintäjärjestelmästä otettu viitekoodi. @fi
toolkit label: tunniste RDA-entiteetille @fi
toolkit definition: RDA-entiteetti, jolla on RDA-entiteetin nimitys, joka on sanaston merkintäjärjestelmästä otettu viitekoodi. @fi
label: er identifikator for RDA-entitet for @no
definition: Relaterer et nomen til en RDA-entitet som har en betegnelse for verk som er en referansekode som er hentet fra et kodeskjema for vokabular. @no
toolkit label: identifikator for RDA-entitet for @no
toolkit definition: En RDA-entitet som har en betegnelse for verk som er en referansekode som er hentet fra et kodeskjema for vokabular. @no
label: est un identifiant d’entité RDA de @fr
definition: Met un nomen en relation avec une entité RDA qui possède une appellation d’entité RDA consistant en un code de référence provenant d’un schéma d’encodage de vocabulaire. @fr
toolkit label: identifiant d’entité RDA de @fr
toolkit definition: Entité RDA qui possède une appellation d’entité RDA consistant en un code de référence provenant d’un schéma d’encodage de vocabulaire. @fr
label: is identificatie voor RDA-entiteit van @nl
definition: Relateert een nomen aan een RDA-entiteit die een benaming van RDA-entiteit heeft die een referentiecode is ontleend aan een vocabulair coderingssysteem. @nl
toolkit label: identificatie voor RDA-entiteit van @nl
toolkit definition: Een RDA-entiteit die een benaming van RDA-entiteit heeft die een referentiecode is ontleend aan een vocabulair coderingssysteem. @nl
label: هو مُعرِّف لكيان "وام" لـ @ar
definition: يربط تسمية بكيان "وام" له اسم لكيان "وام" عبارة عن رمز إحالة مأخوذ من خطة ترميز مفردات. @ar
toolkit label: مُعرِّف لكيان "وام" لـ @ar
toolkit definition: كيان "وام" له اسم كيان "وام" عبارة عن رمز إحالة مأخوذ من خطة ترميز مفردات. @ar
label: és identificador d’entitat RDA de @ca
definition: Relaciona un nomen amb una entitat RDA que té una apel·lació d’entitat RDA que és un codi de referència obtingut d’un esquema de codificació de vocabulari. @ca
toolkit label: identificador d’entitat RDA de @ca
toolkit definition: Entitat RDA que té una apel·lació d’entitat RDA que és un codi de referència obtingut d’un esquema de codificació de vocabulari. @ca
label: er identifikator for RDA-entitet af @da
definition: Relaterer et nomen til en RDA-entitet, som har en benævnelse på RDA-entitet, som er en referencekode hentet fra et vokabularkodningsskema. @da
toolkit label: identifikator for RDA-entitet af @da
toolkit definition: RDA-entitet, som har en benævnelse på RDA-entitet, som er en referencekode hentet fra et vokabularkodningsskema. @da
label: identifikaator RDA olemile @et
definition: Seostab nomen'i RDA olemiga, millel on RDA olemi nimetuseks leksikaalsest märkimissüsteemist võetud viitekood. @et
toolkit label: identifikaator RDA olemile @et
toolkit definition: RDA olem, millel on RDA olemi nimetuseks leksikaalsest märkimissüsteemist võetud viitekood. @et
label: ist Identifikator für eine RDA-Entität von @de
definition: Setzt ein Nomen in Beziehung zu einer RDA-Entität, die über eine Bezeichnung für eine RDA-Entität verfügt, die einen Referenzcode darstellt, der aus einem Vocabulary Encoding Scheme entnommen wird. @de
toolkit label: Identifikator für eine RDA-Entität von @de
toolkit definition: Eine RDA-Entität, die über eine Bezeichnung für eine RDA-Entität verfügt, die einen Referenzcode darstellt, der aus einem Vocabulary Encoding Scheme entnommen wird. @de
label: azonosító a következő RDA-entitás számára: @hu
definition: Hozzákapcsol egy noment egy RDA-entitáshoz, amelynek van olyan RDA-entitás-megnevezése, amely egy szótárkódolási sémából származó hivatkozási kód. @hu
toolkit label: azonosító a következő RDA-entitás számára: @hu
toolkit definition: Egy RDA-entitás, amelynek van olyan RDA-entitás-megnevezése, amely egy szótárkódolási sémából származó hivatkozási kód. @hu
label: è identificatore per l'entità RDA di @it
definition: Correla un nomen a un'entità RDA che ha una denominazione di Entità RDA che è un codice di riferimento tratto da uno schema di codifica di vocabolario. @it
toolkit label: identificatore per l'entità RDA di @it
toolkit definition: Un'entità RDA che ha una denominazione di Entità RDA che è un codice di riferimento tratto da uno schema di codifica di vocabolario. @it
label: ir identifikators RDA entītei @lv
definition: Sasaista nomenu ar RDA entīti, kurai ir izteiksmes apzīmējums kodētā vārdnīcā. @lv
toolkit label: ir identifikators RDA entītei @lv
toolkit definition: RDA entīte, kurai ir izteiksmes apzīmējums kodētā vārdnīcā. @lv
label: 是……的RDA实体的标识符 @zh-hans
definition: 将一个命名与有一个取自一个词表编码体系的指称代码作为RDA实体称谓的一个RDA实体关联起来。 @zh-hans
toolkit label: ……的RDA实体的标识符 @zh-hans
toolkit definition: 有一个取自一个词表编码体系的指称代码作为RDA实体称谓的一个RDA实体 @zh-hans
has subproperty: is identifier for agent of
has subproperty: is identifier for expression of
has subproperty: is identifier for item of
has subproperty: is identifier for manifestation of
has subproperty: is identifier for place of
has subproperty: is identifier for timespan of
has subproperty: is identifier for work of
has subproperty: P80160
label: RDA varlığının tanımlayıcısıdır @tr
definition: Bir ismi bir kelime kodlama şemasından alınan bir referans kodu olan RDA varlığı ifadesine sahip bir RDA varlığıyla ilişkilendirir. @tr
toolkit label: RDA varlığının tanımlayıcısıdır @tr
toolkit definition: Bir kelime kodlama şemasından alınan bir referans kodu olan RDA varlığı unvanına sahip bir RDA varlığı. @tr

is identifier for timespan of
status: Published
type: Property
lexical alias: identifierForTimespanOf.en
definition: Relates a nomen to a timespan that has an appellation of timespan that is a reference code taken from a vocabulary encoding scheme.
domain: C10012
toolkit label: identifier for timespan of
toolkit definition: A timespan that has an appellation of timespan that is a reference code taken from a vocabulary encoding scheme.
sub property of: is appellation of timespan of
has element type: 2
sub property of: is identifier for RDA entity of
label: tunniste ajanjaksolle @fi
definition: Liittää nomenin ajanjaksoon, jolla on sanaston merkintäjärjestelmästä otettu viitekoodi nimityksenään. @fi
toolkit label: tunniste ajanjaksolle @fi
toolkit definition: Ajanjakso, jolla on sanaston merkintäjärjestelmästä otettu viitekoodi nimityksenään. @fi
label: er identifikator for tidsrom for @no
definition: Relaterer et nomen til et tidsrom som har en betegnelse for tidsrom som er en referansekode hentet fra et kodeskjema for vokabular. @no
toolkit label: identifikator for tidsrom for @no
toolkit definition: Et tidsrom som har en betegnelse for tidsrom som er en referansekode hentet fra et kodeskjema for vokabular. @no
label: est un identifiant de laps de temps de @fr
definition: Met un nomen en relation avec un laps de temps qui possède une appellation de laps de temps consistant en un code de référence provenant d’un schéma d’encodage de vocabulaire. @fr
toolkit label: identifiant de laps de temps de @fr
toolkit definition: Laps de temps qui possède une appellation de laps de temps consistant en un code de référence provenant d’un schéma d’encodage de vocabulaire. @fr
label: is ingang voor tijdspanne van @nl
definition: Relateert een nomen aan een tijdspanne die een benaming van tijdspanne heeft die een referentiecode is ontleend aan een vocabulair coderingssysteem. @nl
toolkit label: ingang voor tijdspanne van @nl
toolkit definition: Een tijdspanne die een benaming van tijdspanne heeft die een referentiecode is ontleend aan een vocabulair coderingssysteem. @nl
label: هو مُعرِّف لفترة زمنية لـ @ar
definition: يربط تسمية بفترة زمنية لها اسم فترة زمنية عبارة عن رمز إحالة مأخوذ من خطة ترميز مفردات. @ar
toolkit label: مُعرِّف لفترة زمنية لـ @ar
toolkit definition: فترة زمنية لها اسم فترة زمنية عبارة عن رمز إحالة مأخوذ من خطة ترميز مفردات. @ar
label: és identificador d’interval de temps de @ca
definition: Relaciona un nomen amb un interval de temps que té una apel·lació d’interval de temps que és un codi de referència obtingut d’un esquema de codificació de vocabulari. @ca
toolkit label: identificador d’interval de temps de @ca
toolkit definition: Interval de temps que té una apel·lació d’interval de temps que és un codi de referència obtingut d’un esquema de codificació de vocabulari. @ca
label: er identifikator for tidsperiode af @da
definition: Relaterer et nomen til en tidsperiode, som har en benævnelse på tidsperiode, som er en referencekode hentet fra et vokabularkodningsskema. @da
toolkit label: identifikator for tidsperiode af @da
toolkit definition: Tidsperiode, som har en benævnelse på tidsperiode, som er en referencekode hentet fra et vokabularkodningsskema. @da
label: identifikaator ajavahemikule @et
definition: Seostab nomen'i ajavahemikuga, millel on ajavahemiku nimetuseks leksikaalsest märkimissüsteemist võetud viitekood. @et
toolkit label: identifikaator ajavahemikule @et
toolkit definition: Ajavahemik, millel on ajavahemiku nimetuseks leksikaalsest märkimissüsteemist võetud viitekood. @et
label: ist Identifikator für einen Zeitraum von @de
definition: Setzt ein Nomen in Beziehung zu einem Zeitraum, der über eine Bezeichnung für einen Zeitraum verfügt, die einen Referenzcode darstellt, der aus einem Vocabulary Encoding Scheme entnommen wird. @de
toolkit label: Identifikator für einen Zeitraum von @de
toolkit definition: Ein Zeitraum, der über eine Bezeichnung für einen Zeitraum verfügt, die einen Referenzcode darstellt, der aus einem Vocabulary Encoding Scheme entnommen wird. @de
label: azonosítója a következő időtartamnak: @hu
definition: Hozzákapcsol egy noment egy időtartamhoz, amelynek van olyan időtartam-megnevezése, amely egy szótárkódolási sémából származó hivatkozási kód. @hu
toolkit label: azonosítója a következő időtartamnak: @hu
toolkit definition: Egy időtartam, amelynek van olyan időtartam-megnevezése, amely egy szótárkódolási sémából származó hivatkozási kód. @hu
label: è identificatore per arco di tempo di @it
definition: Correla un nomen a un arco di tempo che ha una denominazione di arco di tempo che è un codice di riferimento tratto da uno schema di codifica di vocabolario. @it
toolkit label: identificatore per arco di tempo di @it
toolkit definition: Un arco di tempo che ha una denominazione di arco di tempo che è un codice di riferimento tratto da uno schema di codifica di vocabolario. @it
label: ir identifikators laikposms @lv
definition: Sasaista nomenu ar laikposmu, kuram ir izteiksmes apzīmējums kodētā vārdnīcā. @lv
toolkit label: ir identifikators laikposms @lv
toolkit definition: Laikposms, kuram ir izteiksmes apzīmējums kodētā vārdnīcā. @lv
label: 是……的时间段的标识符 @zh-hans
definition: 将一个命名与有一个取自一个词表编码体系的指称代码作为时间段称谓的一个时间段关联起来。 @zh-hans
toolkit label: ……的时间段的标识符 @zh-hans
toolkit definition: 有一个取自一个词表编码体系的指称代码作为时间段称谓的一个时间段 @zh-hans
has subproperty: P80050
label: zaman aralığının tanımlayıcısıdır @tr
definition: Bir ismi, bir kelime kodlama şemasından alınan bir referans kodu olan bir zaman aralığı yakıştırmasına sahip bir zaman aralığı ile ilişkilendirir. @tr
toolkit label: zaman aralığının tanımlayıcısıdır @tr
toolkit definition: Bir kelime kodlama şemasından alınan bir referans kodu olan bir zaman aralığı unvanına sahip olan bir zaman aralığı. @tr

is identifier for work group of
status: Published
lexical alias: identifierForWorkGroupOf.en
definition: Relates a nomen to a work that has an appellation of work that is a reference code taken from a vocabulary encoding scheme used to identify a work group.
toolkit label: identifier for work group of
toolkit definition: A work that has an appellation of work that is a reference code taken from a vocabulary encoding scheme used to identify a work group.
type: Property
domain: C10012
has element type: 2
sub property of: is appellation of work group of
sub property of: is identifier for work of
label: tunniste teosryhmälle @fi
definition: Liittää nomenin teokseen, jolla on sanaston merkintäjärjestelmästä otettu teosryhmän viitekoodi nimityksenään. @fi
toolkit label: tunniste teosryhmälle @fi
toolkit definition: Teos, jolla on sanaston merkintäjärjestelmästä otettu teosryhmän viitekoodi nimityksenään. @fi
label: er identifikator for verksgruppe for @no
definition: Relaterer et nomen til et verk som har en betegnelse for verk som er en referansekode hentet fra et kodeskjema for vokabular som brukes for å identifisere en verksgruppe. @no
toolkit label: identifikator for verksgruppe for @no
toolkit definition: Et verk som har en betegnelse for verk som er en referansekode hentet fra et kodeskjema for vokabular som brukes for å identifisere en verksgruppe. @no
label: est un identifiant de groupe d’œuvres de @fr
definition: Met un nomen en relation avec une œuvre qui possède une appellation d’œuvre consistant en un code de référence provenant d’un schéma d’encodage de vocabulaire utilisé pour identifier un groupe d’œuvres. @fr
toolkit label: identifiant de groupe d’œuvres de @fr
toolkit definition: Œuvre qui possède une appellation d’œuvre consistant en un code de référence provenant d’un schéma d’encodage de vocabulaire utilisé pour identifier un groupe d’œuvres. @fr
label: is identificatie van werkgroep van @nl
definition: Relateert een nomen aan een werk dat een benaming voor werk heeft die een referentiecode is ontleend aan een vocabulair coderingssysteem gebruikt om een werkgroep te identificeren. @nl
toolkit label: identificatie van werkgroep van @nl
toolkit definition: Een werk dat een benaming voor werk heeft die een referentiecode is ontleend aan een vocabulair coderingssysteem gebruikt om een werkgroep te identificeren. @nl
label: هو مُعرِّف لمجموعة عمل لـ @ar
definition: يربط تسمية بعمل له اسم لعمل عبارة عن رمز إحالة مأخوذ من خطة ترميز مفردات مستخدم لتعريف مجموعة عمل. @ar
toolkit label: مُعرِّف لمجموعة عمل @ar
toolkit definition: عمل له اسم لعمل عبارة عن رمز إحالة مأخوذ من خطة ترميز مفردات مستخدم لتعريف مجموعة عمل. @ar
label: és identificador de grup d’obres de @ca
definition: Relaciona un nomen amb una obra que té una apel·lació d’obra que és un codi de referència obtingut d’un esquema de codificació de vocabulari usat per identificar un grup d’obres. @ca
toolkit label: identificador de grup d’obres de @ca
toolkit definition: Obra que té una apel·lació d’obra que és un codi de referència obtingut d’un esquema de codificació de vocabulari usat per identificar un grup d’obres. @ca
label: er identifikator for værksgruppe af @da
definition: Relaterer et nomen til et værk, som har en benævnelse på værk, som er en referencekode hentet fra et vokabularkodningsskema, som bruges for at identificere en værksgruppe. @da
toolkit label: identifikator for værksgruppe af @da
toolkit definition: Værk, som har en benævnelse på værk, som er en referencekode hentet fra et vokabularkodningsskema, som bruges for at identificere en værksgruppe. @da
label: teoserühma identifikaator teosele @et
definition: Seostab nomen'i teosega, millel on teose nimetuseks leksikaalsest märkimissüsteemist võetud, teoserühma identifitseeriv viitekood. @et
toolkit label: teoserühma identifikaator teosele @et
toolkit definition: Teos, millel on teose nimetuseks leksikaalsest märkimissüsteemist võetud, teoserühma identifitseeriv viitekood. @et
label: ist Identifikator für eine Werkgruppe von @de
definition: Setzt ein Nomen in Beziehung zu einem Werk, das über eine Bezeichnung für ein Werk verfügt, die einen Referenzcode darstellt, der aus einem Vocabulary Encoding Scheme entnommen wird, um eine Werkgruppe zu identifizieren. @de
toolkit label: Identifikator für eine Werkgruppe von @de
toolkit definition: Eine Werk, das über eine Bezeichnung für ein Werk verfügt, die einen Referenzcode darstellt, der aus einem Vocabulary Encoding Scheme entnommen wird, um eine Werkgruppe zu identifizieren. @de
label: azonosító a következő műcsoport számára: @hu
definition: Hozzákapcsol egy noment egy műhöz, amelynek van olyan műmegnevezése, amely egy szótárkódolási sémából származó hivatkozási kód. @hu
toolkit label: azonosító a következő műcsoport számára: @hu
toolkit definition: Egy mű, amelynek van olyan műmegnevezése, amely egy szótárkódolási sémából származó hivatkozási kód. @hu
label: è identificatore per gruppo di opere di @it
definition: Correla un nomen a un'opera che ha una denominazione di opera che è un codice di riferimento tratto da uno schema di codifica di vocabolario. @it
toolkit label: identificatore per gruppo di opere di @it
toolkit definition: Un'opera che ha una denominazione di opera che è un codice di riferimento tratto da uno schema di codifica di vocabolario. @it
label: ir identifikators darbu grupai @lv
definition: Sasaista nomenu ar darbu, kam ir darba apzīmējums kodētā vārdnīcā, lai identificētu darbu grupu. @lv
toolkit label: ir identifikators darbu grupai @lv
toolkit definition: Darbs, kam ir darba apzīmējums kodētā vārdnīcā, lai identificētu darbu grupu. @lv
label: 是……的作品群的标识符 @zh-hans
definition: 将一个命名与有一个作品的称谓而且它也是用于标识一个作品群的取自一个词表编码体系的指称代码的一种作品关联起来。 @zh-hans
toolkit label: ……的作品群的标识符 @zh-hans
toolkit definition: 有一个作品的称谓而且它也是用于标识一个作品群的取自一个词表编码体系的指称代码的一种作品 @zh-hans
has subproperty: P80172
label: eser grubunun tanımlayıcısıdır @tr
definition: Bir ismi, çalışma grubunu tanımlamak için kullanılan bir kelime kodlama şemasından alınan referans kodu olan bir unvana sahip bir eserle ilişkilendirir. @tr
toolkit label: eser grubunun tanımlayıcısıdır @tr
toolkit definition: Bir eser grubunu tanımlamak için kullanılan bir kelime kodlama şemasından alınan referans kodu olan bir unvana sahip bir eser. @tr

is identifier for work of
status: Published
type: Property
lexical alias: identifierForWorkOf.en
definition: Relates a nomen to a work that has an appellation of work that is a reference code taken from a vocabulary encoding scheme.
domain: C10012
toolkit label: identifier for work of
toolkit definition: A work that has an appellation of work that is a reference code taken from a vocabulary encoding scheme.
sub property of: is appellation of work of
has element type: 2
sub property of: is identifier for RDA entity of
label: tunniste teokselle @fi
definition: Liittää nomenin teokseen, jolla on sanaston merkintäjärjestelmästä otettu viitekoodi nimityksenään. @fi
toolkit label: tunniste teokselle @fi
toolkit definition: Teos, jolla on sanaston merkintäjärjestelmästä otettu viitekoodi nimityksenään. @fi
label: er identifikator for verk for @no
definition: Relaterer et nomen til et verk som har en betegnelse for verk som er en referansekode hentet fra et kodeskjema for vokabular. @no
toolkit label: identifikator for verk for @no
toolkit definition: Et verk som har en betegnelse for verk som er en referansekode hentet fra et kodeskjema for vokabular. @no
label: est un identifiant d’œuvre de @fr
definition: Met un nomen en relation avec une œuvre qui possède une appellation d’œuvre consistant en un code de référence provenant d’un schéma d’encodage de vocabulaire. @fr
toolkit label: identifiant d’œuvre de @fr
toolkit definition: Œuvre qui possède une appellation d’œuvre consistant en un code de référence provenant d’un schéma d’encodage de vocabulaire. @fr
label: is ingang voor werk van @nl
definition: Relateert een nomen aan een werk dat een benaming van werk heeft die een referentiecode is ontleend aan een vocabulair coderingssysteem. @nl
toolkit label: ingang voor werk van @nl
toolkit definition: Een werk dat een benaming van werk heeft die een referentiecode is ontleend aan een vocabulair coderingssysteem. @nl
label: هو مُعرِّف لعمل لـ @ar
definition: يربط تسمية بعمل له اسم عمل عبارة عن رمز إحالة مأخوذ من خطة ترميز مفردات. @ar
toolkit label: مُعرِّف لعمل لـ @ar
toolkit definition: عمل له اسم عمل عبارة عن رمز إحالة مأخوذ من خطة ترميز مفردات. @ar
label: és identificador d’obra de @ca
definition: Relaciona un nomen amb una obra que té una apel·lació d’obra que és un codi de referència obtingut d’un esquema de codificació de vocabulari. @ca
toolkit label: identificador d’obra de @ca
toolkit definition: Obra que té una apel·lació d’obra que és un codi de referència obtingut d’un esquema de codificació de vocabulari. @ca
label: er identifikator for værk af @da
definition: Relaterer et nomen til et værk, som har en benævnelse på værk, som er en referencekode hentet fra et vokabularkodningsskema. @da
toolkit label: identifikator for værk af @da
toolkit definition: Værk, som har en benævnelse på værk, som er en referencekode hentet fra et vokabularkodningsskema. @da
label: identifikaator teosele @et
definition: Seostab nomen'i teosega, millel on teose nimetuseks leksikaalsest märkimissüsteemist võetud viitekood. @et
toolkit label: identifikaator teosele @et
toolkit definition: Teos, millel on teose nimetuseks leksikaalsest märkimissüsteemist võetud viitekood. @et
label: ist Identifikator für ein Werk von @de
definition: Setzt ein Nomen in Beziehung zu einem Werk, das über eine Bezeichnung für ein Werk verfügt, die einen Referenzcode darstellt, der aus einem Vocabulary Encoding Scheme entnommen wird. @de
toolkit label: Identifikator für ein Werk von @de
toolkit definition: Eine Werk, das über eine Bezeichnung für ein Werk verfügt, die einen Referenzcode darstellt, der aus einem Vocabulary Encoding Scheme entnommen wird. @de
label: azonosítója a következő műnek: @hu
definition: Hozzákapcsol egy noment egy műhöz, amelynek van olyan műmegnevezése, amely egy szótárkódolási sémából származó hivatkozási kód. @hu
toolkit label: mű-azonosítója: @hu
toolkit definition: Egy mű, amelynek van olyan műmegnevezése, amely egy szótárkódolási sémából származó hivatkozási kód. @hu
label: è identificatore per opera di @it
definition: Correla un nomen a un'opera che ha una denominazione di opera che è un codice di riferimento tratto da uno schema di codifica di vocabolario. @it
toolkit label: identificatore per opera di @it
toolkit definition: Un'opera che ha una denominazione di opera che è un codice di riferimento tratto da uno schema di codifica di vocabolario. @it
label: ir identifikators darbam @lv
definition: Sasaista nomenu ar darbu, kam ir darba apzīmējums kodētā vārdnīcā. @lv
toolkit label: ir identifikators darbam @lv
toolkit definition: Darbs, kam ir darba apzīmējums kodētā vārdnīcā. @lv
label: 是……的作品的标识符 @zh-hans
definition: 将一个命名与有一个取自一个词表编码体系的指称代码作为作品称谓的一种作品关联起来。 @zh-hans
toolkit label: ……的作品的标识符 @zh-hans
toolkit definition: 有一个取自一个词表编码体系的指称代码作为作品称谓的一种作品 @zh-hans
has subproperty: is identifier for work group of
has subproperty: is ISSN of
has subproperty: is numeric designation of musical work of
has subproperty: P80049
label: eserinin tanımlayıcısıdır @tr
definition: Bir ismi, bir kelime kodlama şemasından alınan bir referans kodu olan bir iş ünvanına sahip bir eserle ilişkilendirir. @tr
toolkit label: eserinin tanımlayıcısıdır @tr
toolkit definition: Bir kelime kodlama şemasından alınan bir referans kodu olan bir eser unvanına sahip bir eser. @tr

has intended audience of nomen
status: Published
type: Property
lexical alias: intendedAudienceOfNomen.en
definition: Relates a nomen to a class of users for which a nomen is intended.
domain: C10012
toolkit label: intended audience of nomen
toolkit definition: A class of users for which a nomen is intended.
has element type: 5
label: nomenin kohderyhmä @fi
definition: Liittää nomenin käyttäjäkategoriaan, jolle nomen on suunnattu. @fi
toolkit label: nomenin kohderyhmä @fi
toolkit definition: Käyttäjänkategoria, jolle nomen on suunnattu. @fi
label: har målgruppe for nomen @no
definition: Relaterer et nomen til en klasse av brukere som et nomen er tenkt for. @no
toolkit label: målgruppe for nomen @no
toolkit definition: En klasse av brukere som et nomen er tenkt for. @no
label: a pour public cible d’un nomen @fr
definition: Met un nomen en relation avec une classe d’utilisateurs à laquelle un nomen est destiné. @fr
toolkit label: public cible d’un nomen @fr
toolkit definition: Classe d’utilisateurs à laquelle un nomen est destiné. @fr
label: heeft beoogd publiek van nomen @nl
definition: Relateert een nomen aan een klasse gebruikers waarvoor een nomen bedoeld is. @nl
toolkit label: beoogd publiek van nomen @nl
toolkit definition: Een klasse gebruikers waarvoor een nomen bedoeld is. @nl
label: له جمهور خُصصت له تسمية @ar
definition: يربط تسمية بفئة مستخدمين خُصصت لهم تسمية. @ar
toolkit label: جمهور خُصصت له تسمية @ar
toolkit definition: فئة مستفيدين خُصصت لهم تسمية. @ar
label: té com a destinataris previstos d’un nomen @ca
definition: Relaciona un nomen amb una classe d’usuaris a la qual es destina un nomen. @ca
toolkit label: destinataris previstos d’un nomen @ca
toolkit definition: Classe d’usuaris a la qual es destina un nomen. @ca
definition: Relaterer et nomen til en klasse af brugere, som et nomen er tiltænkt. @da
toolkit definition: Klasse af brugere, som et nomen er tiltænkt. @da
label: nomen'i sihtrühm @et
definition: Seostab nomen'i kasutajarühmaga, kellele nomen on suunatud. @et
toolkit label: nomen'i sihtrühm @et
toolkit definition: Kasutajarühm, kellele nomen on suunatud. @et
label: hat Zielgruppe eines Nomens @de
definition: Setzt ein Nomen in Beziehung zu einer Gruppe von Benutzenden, für die ein Nomen gedacht ist. @de
toolkit label: Zielgruppe eines Nomens @de
toolkit definition: Eine Gruppe von Benutzenden, für die ein Nomen gedacht ist. @de
label: nomen célközönsége a következő: @hu
definition: Hozzákapcsol egy noment egy olyan használói osztályhoz, amelynek a noment szánják. @hu
toolkit label: nomen célközönsége: @hu
toolkit definition: Egy olyan használói osztály, amelynek a noment szánják. @hu
label: ha come destinatari del nomen @it
definition: Correla un nomen a una classe di utenti per la quale il nomen è destinato. @it
toolkit label: destinatari del nomen @it
toolkit definition: Una classe di utenti per la quale il nomen è destinato. @it
label: nomena mērķauditorija @lv
definition: Sasaista nomenu ar lietotāju klasi, kurai ir paredzēts nomens. @lv
toolkit label: nomena mērķauditorija @lv
toolkit definition: Lietotāju klase, kurai ir paredzēts nomens. @lv
label: 有命名的目标受众 @zh-hans
definition: 将一个命名与一个命名的目标使用者的类关联起来。 @zh-hans
toolkit label: 命名的目标受众 @zh-hans
toolkit definition: 一个命名的目标使用者的类 @zh-hans
has subproperty: P80065
label: ismin hedef kitlesi ile ilişkilidir @tr
definition: Bir ismi, bir niteleyici ismin amaçlandığı bir kullanıcı sınıfıyla ilişkilendirir. @tr
toolkit label: ismin hedef kitlesi ile ilişkilidir @tr
toolkit definition: Nomenin amaçlandığı bir kullanıcı sınıfı. @tr

is ISSN of
status: Published
lexical alias: issnOf.en
definition: Relates a nomen to a work that has an identifier assigned by an ISSN registration agency.
alternative label: International Standard Serial Number of
toolkit label: ISSN of
toolkit definition: A work that has an identifier assigned by an ISSN registration agency.
type: Property
domain: C10012
sub property of: is identifier for work of
has element type: 2
label: ISSN teokselle @fi
definition: Liittää nomenin teokseen, jolla on ISSN-rekisteröintiyksikön antama tunniste. @fi
toolkit label: ISSN teokselle @fi
toolkit definition: Teos, jolla on ISSN-rekisteröintiyksikön antama tunniste. @fi
label: er ISSN for @no
definition: Relaterer et nomen til et verk som har en identifikator som er tildelt av et ISSN-kontor. @no
alternative label: International Standard Serial Number for @no
toolkit label: ISSN for @no
toolkit definition: Et verk som har en identifikator som er tildelt av et ISSN-kontor. @no
label: est un ISSN de @fr
definition: Met un nomen en relation avec une œuvre qui possède un identifiant attribué par une agence d’enregistrement de l’ISSN. @fr
alternative label: numéro international normalisé des publications en série de @fr
toolkit label: ISSN de @fr
toolkit definition: Œuvre qui possède un identifiant attribué par une agence d’enregistrement de l’ISSN. @fr
label: is ISSN van @nl
definition: Relateert een nomen aan een werk dat een identificatie heeft toegekend door een ISSN-registratiebureau. @nl
toolkit label: ISSN van @nl
toolkit definition: Een werk dat een identificatie heeft toegekend door een ISSN-registratiebureau. @nl
label: és ISSN de @ca
definition: Relaciona un nomen amb una obra que té un identificador assignat per una agència de registre de l’ISSN. @ca
alternative label: Número Internacional Normalitzat per a Publicacions en Sèrie de @ca
toolkit definition: Obra que té un identificador assignat per una agència de registre de l’ISSN. @ca
definition: Relaterer et nomen til et værk, som har en identifikator tildelt af et ISSN-kontor. @da
toolkit definition: Værk, som har en identifikator tildelt af et ISSN-kontor. @da
label: ISSN teosele @et
definition: Seostab nomen'i teosega, millel on ISSN registreerimise agentuuri määratud identifikaator. @et
alternative label: rahvusvaheline jadaväljaande standardnumber teosele @et
toolkit label: ISSN teosele @et
toolkit definition: Teos, millel on ISSN registreerimise agentuuri määratud identifikaator. @et
label: ist ISSN einer Reihe von @de
definition: Setzt ein Nomen in Beziehung zu einem Werk, das über einen Identifikator verfügt, der von einem ISSN-Zentrum vergeben wird. @de
toolkit label: ISSN einer Reihe von @de
toolkit definition: Ein Werk, das über einen Identifikator verfügt, der von einem ISSN-Zentrum vergeben wird. @de
label: ISSN-je a következőnek: @hu
definition: Hozzákapcsol egy noment egy műhöz, amelynek van egy ISSN regisztrációs ügynökség által jegyzett azonosítója. @hu
toolkit label: ISSN-je: @hu
toolkit definition: Egy mű, amelynek van egy ISSN regisztrációs ügynökség által jegyzett azonosítója. @hu
label: è ISSN di @it
definition: Correla un nomen a un'opera che ha un identificatore assegnato da una agenzia di registrazione dell'ISSN. @it
toolkit label: ISSN di @it
toolkit definition: Un'opera che ha un identificatore assegnato da una agenzia di registrazione dell'ISSN. @it
label: ir ISSN no @lv
definition: Sasaista nomenu ar darbu, kam ir ISSN reģistrācijas aģentūras piešķirts identifikators. @lv
toolkit label: ir ISSN no @lv
toolkit definition: Darbs, kam ir ISSN reģistrācijas aģentūras piešķirts identifikators. @lv
alternative label: International Standard Serial Number teokselle @fi
label: هو ردمد لـ @ar
definition: يربط تسمية بعمل له مُعرِّف خصصته له وكالة تسجيل ردمد. @ar
alternative label: الرقم المعياري الدولي للدوريات لـ @ar
toolkit label: ردمد لـ @ar
toolkit definition: عمل له مُعرِّف خصصته له وكالة تسجيل ردمد. @ar
alternative label: International Standard Serial Number von @de
alternative label: ……的国际标准连续出版物号 @zh-hans
label: 是……的国际标准连续出版物号 @zh-hans
definition: 将一个命名与被一个国际标准连续出版物号注册机构分配一个标识符的一种作品关联起来。 @zh-hans
toolkit label: ……的国际标准连续出版物号 @zh-hans
toolkit definition: 被一个国际标准连续出版物号注册机构分配一个标识符的一种作品 @zh-hans
alternative label: időszaki kiadványok nemzetközi azonosító száma: @hu
has subproperty: P80170
label: ISSN'idir @tr
definition: Bir ismi, ISSN kayıt ajansı tarafından atanmış bir tanımlayıcıya sahip bir eserle ilişkilendirir. @tr
toolkit label: ISSN'idir @tr
toolkit definition: ISSN kayıt ajansı tarafından atanmış bir tanımlayıcıya sahip bir eser. @tr

is key title of
status: Published
type: Property
lexical alias: keyTitleOf.en
domain: C10012
toolkit label: key title of
has element type: 2
sub property of: is title of work of
definition: Relates a nomen to a work that has a title of work that is assigned by an ISSN registration agency.
toolkit definition: A work that has a title of work that is assigned by an ISSN registration agency.
label: avainnimeke teokselle @fi
definition: Liittää nomenin teokseen, jolla on ISSN-rekisteröintiyksikön antama teoksen nimeke. @fi
toolkit label: avainnimeke teokselle @fi
toolkit definition: Teos, jolla on ISSN-rekisteröintiyksikön antama teoksen nimeke. @fi
label: er nøkkeltittel for @no
definition: Relaterer et nomen til et verk som har en verkstittel som er tildelt av et ISSN-kontor. @no
toolkit label: nøkkeltittel for @no
toolkit definition: Et verk som har en verkstittel som er tildelt av et ISSN-kontor. @no
label: est un titre-clé de @fr
definition: Met un nomen en relation avec une œuvre qui possède un titre d'œuvre attribué par une agence d’enregistrement de l’ISSN. @fr
toolkit label: titre-clé de @fr
toolkit definition: Œuvre qui possède un titre d'œuvre attribué par une agence d’enregistrement de l’ISSN. @fr
label: is key title van @nl
definition: Relateert een nomen aan een werk dat een titel van werk heeft dat toegekend is door een ISSN-registratiebureau. @nl
toolkit label: key title van @nl
toolkit definition: Een werk dat een titel van werk heeft dat toegekend is door een ISSN-registratiebureau. @nl
label: هو عنوان مفتاحي لـ @ar
definition: يربط تسمية بعمل له عنوان عمل خصصته وكالة تسجيل ردمد. @ar
toolkit label: عنوان مفتاحي لـ @ar
toolkit definition: عمل له عنوان عمل خصصته وكالة تسجيل ردمد. @ar
label: és títol clau de @ca
definition: Relaciona un nomen amb una obra que té un títol d’obra que és assignat per una agència de registre de l’ISSN. @ca
toolkit label: títol clau de @ca
toolkit definition: Obra que té un títol d’obra que és assignat per una agència de registre de l’ISSN. @ca
label: er nøgletitel af @da
definition: Relaterer et nomen til et værk, som har en titel på værk, som er tildelt af et ISSN-kontor. @da
toolkit label: nøgletitel af @da
toolkit definition: Værk, som har en titel på værk, som er tildelt af et ISSN-kontor. @da
label: võtmepealkiri teosele @et
definition: Seostab nomen'i teosega, millel on ISSN registreerimise agentuuri määratud pealkiri. @et
toolkit label: võtmepealkiri teosele @et
toolkit definition: Teos, millel on ISSN registreerimise agentuuri määratud pealkiri. @et
label: ist Key Title von @de
definition: Setzt ein Nomen in Beziehung zu einem Werk, das über einen Titel eines Werks verfügt, der von einem ISSN-Zentrum vergeben wird. @de
toolkit label: Key Title von @de
toolkit definition: Ein Werk, das über einen Titel eines Werks verfügt, der von einem ISSN-Zentrum vergeben wird. @de
label: kulcscíme a következőnek: @hu
definition: Hozzákapcsol egy noment egy műhöz, amelynek van egy olyan műhöz tartozó címe, amelyet egy ISSN regisztrációs ügynökség jegyez. @hu
toolkit label: kulcscíme: @hu
toolkit definition: Egy mű, amelynek van egy olyan műhöz tartozó címe, amelyet egy ISSN regisztrációs ügynökség jegyez. @hu
label: è titolo chiave di @it
definition: Correla un nomen a un'opera che ha un titolo dell'opera che è assegnato da una agenzia di registrazone dell'ISSN. @it
toolkit label: titolo chiave di @it
toolkit definition: Un'opera che ha un titolo dell'opera che è assegnato da una agenzia di registrazone dell'ISSN. @it
label: ir atslēgnosaukums @lv
toolkit label: ir atslēgnosaukums @lv
definition: Sasaista nomenu ar darbu, kam ir darba nosaukums, kuru piešķīrusi ISSN reģistrācijas aģentūra. @lv
toolkit definition: Darbs, kam ir darba nosaukums, kuru piešķīrusi ISSN reģistrācijas aģentūra. @lv
label: 有……的识别题名 @zh-hans
toolkit label: ……的识别题名 @zh-hans
definition: 将一个命名与有被国际标准连续出版物号一个注册机构分配之作品的一个题名的一种作品关联起来。 @zh-hans
toolkit definition: 有被国际标准连续出版物号一个注册机构分配之作品的一个题名的一种作品 @zh-hans
has subproperty: P80072
label: ana başlığıdır @tr
toolkit label: anahtar başlığı @tr
definition: Bir ismi, bir ISSN kayıt ajansı tarafından atanan bir eser başlığına sahip bir eserle ilişkilendirir. @tr
toolkit definition: Bir ISSN kayıt ajansı tarafından atanan bir eser başlığına sahip bir eser. @tr

has language of nomen
status: Published
type: Property
lexical alias: languageOfNomen.en
definition: Relates a nomen to a language of a nomen.
domain: C10012
toolkit label: language of nomen
toolkit definition: A language of a nomen.
has element type: 5
label: nomenin kieli @fi
definition: Liittää nomenin nimityksen kieleen. @fi
toolkit label: nomenin kieli @fi
toolkit definition: Nimityksen kieli. @fi
label: har språk for nomen @no
definition: Relaterer et nomen til et språk for en betegnelse. @no
toolkit label: språk for nomen @no
toolkit definition: Et språk for en betegnelse. @no
label: a pour langue d’un nomen @fr
definition: Met un nomen en relation avec une langue d’un nomen. @fr
toolkit label: langue d’un nomen @fr
toolkit definition: Langue d’un nomen. @fr
label: heeft taal van nomen @nl
definition: Relateert een nomen aan een taal van een benaming. @nl
toolkit label: taal van nomen @nl
toolkit definition: Een taal van een benaming. @nl
label: لها لغة تسمية @ar
definition: يربط تسمية بلغة اسم. @ar
toolkit label: لغة تسمية @ar
toolkit definition: لغة اسم. @ar
label: té com a llengua d’un nomen @ca
definition: Relaciona un nomen amb una llengua d’un nomen . @ca
toolkit label: llengua d’un nomen @ca
toolkit definition: Llengua d’un nomen. @ca
label: har sprog for nomen @da
definition: Relaterer et nomen til et sprog for en benævnelse. @da
toolkit label: sprog for nomen @da
toolkit definition: Sprog for en benævnelse. @da
label: nomen'i keel @et
definition: Seostab nomen'i nimetuse keelega. @et
toolkit label: nomen'i keel @et
toolkit definition: Nimetuse keel. @et
label: hat Sprache eines Nomens @de
definition: Setzt ein Nomen in Beziehung zu einer Sprache von einer Bezeichnung. @de
toolkit label: Sprache eines Nomens @de
toolkit definition: Eine Sprache von einer Bezeichnung. @de
label: nomen nyelve a következő: @hu
definition: Hozzákapcsol egy noment egy megnevezés nyelvéhez. @hu
toolkit label: nomen nyelve: @hu
toolkit definition: Egy megnevezés nyelve. @hu
label: ha come lingua del nomen @it
definition: Correla un nomen a una lingua di una designazione. @it
toolkit label: lingua del nomen @it
toolkit definition: Una lingua di una designazione. @it
label: nomena valoda @lv
definition: Sasaista nomenu ar apzīmējuma valodu. @lv
toolkit label: nomena valoda @lv
toolkit definition: Apzīmējuma valoda. @lv
label: 有命名的语言 @zh-hans
definition: 将一个命名与一个命名的一种语言关联起来。 @zh-hans
toolkit label: 命名的语言 @zh-hans
toolkit definition: 一个命名的一种语言 @zh-hans
has subproperty: P80066
label: ismin dili ile ilişkilidir @tr
definition: Bir ismi, bir niteleyici isim diliyle ilişkilendirir. @tr
toolkit label: niteleyici ismin dili @tr
toolkit definition: Bir nomenin dili. @tr

is later title proper of (Deprecated)
status: Deprecated
type: Property
lexical alias: laterTitleProperOf.en
has subproperty: P80124

is name of agent of
status: Published
type: Property
lexical alias: nameOfAgentOf.en
definition: Relates a nomen to an agent who has an appellation of agent in natural language and phrasing used in common discourse.
domain: C10012
toolkit label: name of agent of
toolkit definition: An agent who has an appellation of agent in natural language and phrasing used in common discourse.
sub property of: is appellation of agent of
has element type: 2
sub property of: is name of RDA entity of
label: nimi toimijalle @fi
definition: Liittää nomenin toimijaan, jolla on luonnollisen kielen ja yleisen diskurssin sanamuodon mukainen nimitys. @fi
toolkit label: nimi toimijalle @fi
toolkit definition: Toimija, jolla on luonnollisen kielen ja yleisen diskurssin sanamuodon mukainen nimitys. @fi
label: er navn på agent for @no
definition: Relaterer et nomen til en agent som har en betegnelse for agent på et naturlig språk og med frasering brukt i alminnelig diskurs. @no
toolkit label: navn på agent for @no
toolkit definition: En agent som har en betegnelse for agent på et naturlig språk og med frasering brukt i alminnelig diskurs. @no
label: est un nom d’agent de @fr
definition: Met un nomen en relation avec un agent qui possède une appellation d’agent exprimée dans un langage et une formulation naturels et utilisée dans le langage courant. @fr
toolkit label: nom d’agent de @fr
toolkit definition: Agent qui possède une appellation d’agent exprimée dans un langage et une formulation naturels et utilisée dans le langage courant. @fr
label: is naam van actor van @nl
definition: Relateert een nomen aan een actor die een benaming van actor heeft in natuurlijke taal en terminologie in gebruikelijke bewoording. @nl
toolkit label: naam van actor van @nl
toolkit definition: Een actor die een benaming van actor heeft in natuurlijke taal en terminologie in gebruikelijke bewoording. @nl
label: هو اسم وكيل لـ @ar
definition: يربط تسمية بوكيل له اسم وكيل في اللغة الطبيعية المستخدمة في الخطاب العام. @ar
toolkit label: اسم وكيل لـ @ar
toolkit definition: وكيل له اسم وكيل في اللغة الطبيعية المستخدمة في الخطاب العام. @ar
label: és nom d’agent de @ca
definition: Relaciona un nomen amb un agent que té una apel·lació d’agent en llenguatge i frases naturals usada en el discurs comú. @ca
toolkit definition: Agent que té una apel·lació d’agent en llenguatge i frases naturals usada en el discurs comú. @ca
label: er navn på agent af @da
definition: Relaterer et nomen til en agent, som har en benævnelse på agent på normalsprog og med formuleringer, som bruges alment. @da
toolkit label: navn på agent af @da
toolkit definition: Agent, som har en benævnelse på agent på normalsprog og med formuleringer, som bruges alment. @da
label: nimi tegijale @et
definition: Seostab nomen'i tegijaga, kellel on nimetus loomulikus keeles ja sõnastuses, mida kasutatakse ühises diskursuses. @et
toolkit label: nimi tegijale @et
toolkit definition: Tegija, kellel on nimetus loomulikus keeles ja sõnastuses, mida kasutatakse ühises diskursuses. @et
label: ist Name eines Akteurs von @de
definition: Setzt ein Nomen in Beziehung zu einem Akteur, der über eine Bezeichnung für einen Akteur in natürlicher Sprache und Ausdrucksweise verfügt, die beim normalen Sprechen und Schreiben verwendet wird. @de
toolkit label: Name eines Akteurs von @de
toolkit definition: Ein Akteur, der über eine Bezeichnung für einen Akteur in natürlicher Sprache und Ausdrucksweise verfügt, die beim normalen Sprechen und Schreiben verwendet wird. @de
label: ágensneve a következőnek: @hu
definition: Hozzákapcsol egy noment egy ágenshez, amelynek van egy ágensmegnevezése természetes nyelven és közbeszédben használt kifejezéssel. @hu
toolkit label: ágensneve: @hu
toolkit definition: Egy ágens, amelynek van egy ágensmegnevezése természetes nyelven és közbeszédben használt kifejezéssel. @hu
label: è nome di agente di @it
definition: Correla un nomen a un agente che ha una designazione di agente in linguaggio e frasi naturali usati nel discorso comune. @it
toolkit label: nome di agente di @it
toolkit definition: Un agente che ha una designazione di agente in linguaggio e frasi naturali usati nel discorso comune. @it
label: ir vārds/nosaukums aģentam @lv
definition: Sasaista nomenu ar aģentu, kam ir apzīmējums dabiskajā valodā, ko izmanto savstarpējā saziņā. @lv
toolkit label: ir vārds/nosaukums aģentam @lv
toolkit definition: Aģents, kam ir apzīmējums dabiskajā valodā, ko izmanto savstarpējā saziņā. @lv
label: 是……的行为者的名称 @zh-hans
definition: 将一个命名与有用自然语言和普通话语措词表达的行为者的称谓的一个行为者关联起来。 @zh-hans
toolkit label: ……的行为者的名称 @zh-hans
toolkit definition: 有用自然语言和普通话语措词表达的行为者的称谓的一个行为者 @zh-hans
has subproperty: is name of collective agent of
has subproperty: is name of person of
has subproperty: is preferred name of agent of
has subproperty: is variant name of agent of
has subproperty: P80052
label: temsilcisinin adıdır @tr
definition: Bir ismi, doğal dilde ve ortak söylemde kullanılan ifadelerde bir temsilci unvanına sahip bir temsilciyle ilişkilendirir. @tr
toolkit label: temsilcinin adı @tr
toolkit definition: Doğal dilde ve ortak söylemde kullanılan ifadelerde temsilci ünvanına sahip bir temsilci. @tr

is name of agent of manifestation of
status: Published
type: Property
lexical alias: nameOfAgentOfManifestationOf.en
domain: C10012
toolkit label: name of agent of manifestation of
sub property of: has related manifestation of nomen
has element type: 2
definition: Relates a nomen to a manifestation that has a name of agent who is responsible for distribution, printing, duplication, casting, publication, release, issue, etc., or inscription, fabrication, construction, etc.
toolkit definition: A manifestation that has a name of agent who is responsible for distribution, printing, duplication, casting, publication, release, issue, etc., or inscription, fabrication, construction, etc.
label: nimi manifestaation toimijalle @fi
definition: Liittää nomenin manifestaatioon, jolla on jakelusta, painamisesta, monistamisesta, kirjainten valamisesta, kustantamisesta, julkaisemisesta, ilmestymisestä tms. tai kaivertamisesta, valmistamisesta, koostamisesta tms. vastuussa olevan toimijan nimi. @fi
toolkit label: nimi manifestaation toimijalle @fi
toolkit definition: Manifestaatio, jolla on jakelusta, painamisesta, monistamisesta, kirjainten valamisesta, kustantamisesta, julkaisemisesta, ilmestymisestä tms. tai kaivertamisesta, valmistamisesta, koostamisesta tms. vastuussa olevan toimijan nimi. @fi
label: er navn på agent for manifestasjon for @no
definition: Relaterer et nomen til en manifestasjon som har et navn på agent som er ansvarlig for distribusjon, trykking, mangfoldiggjøring, støping, publisering, tilgjengeliggjøring, utgitt etc., eller inskripsjon, fabrikasjon, konstruksjon etc. @no
toolkit label: navn på agent for manifestasjon for @no
toolkit definition: En manifestasjon som har et navn på agent som er ansvarlig for distribusjon, trykking, mangfoldiggjøring, støping, publisering, tilgjengeliggjøring, utgitt etc., eller inskripsjon, fabrikasjon, konstruksjon etc. @no
label: est un nom d’agent d’une manifestation de @fr
definition: Met un nomen en relation avec une manifestation qui possède un nom d’agent responsable de la diffusion ou de la distribution, de l’impression, de la reproduction, du moulage, de la publication, de la mise à disposition, de l’édition, etc. ou de la scription, de la fabrication, de la construction, etc. @fr
toolkit label: nom d’agent d’une manifestation de @fr
toolkit definition: Manifestation qui possède un nom d’agent responsable de la diffusion ou de la distribution, de l’impression, de la reproduction, du moulage, de la publication, de la mise à disposition, de l’édition, etc. ou de la scription, de la fabrication, de la construction, etc. @fr
label: is naam van actor van manifestatie van @nl
definition: Relateert een nomen aan een manifestatie die een naam van actor heeft die verantwoordelijk is voor distributie, drukken, dupliceren, gieten, uitgeven, uitbrengen, uitvaardigen etc. of afschrijven, fabriceren, construeren etc. @nl
toolkit label: naam van actor van manifestatie van @nl
toolkit definition: Een manifestatie die een naam van actor heeft die verantwoordelijk is voor distributie, drukken, dupliceren, gieten, uitgeven, uitbrengen, uitvaardigen etc. of afschrijven, fabriceren, construeren etc. @nl
label: هو اسم وكيل لتجسيدة لـ @ar
definition: يربط تسمية بتجسيدة لها اسم وكيل مسئول عن التوزيع، أو الطباعة، أو النسخ، أو البث، أو النشر، أو التحرير، أو الإصدار إلخ. أو عن التدوين، أو التأليف، أو الإنشاء، إلخ. @ar
toolkit label: اسم وكيل لتجسيدة لـ @ar
toolkit definition: تجسيدة لها اسم وكيل مسئول عن التوزيع، أو الطباعة، أو النسخ، أو البث، أو النشر، أو التحرير، أو الإصدار إلخ. أو عن التدوين، أو التأليف، أو الإنشاء، إلخ. @ar
label: és nom d’agent d’una manifestació de @ca
definition: Relaciona un nomen amb una manifestació que té un nom d’agent el qual és responsable de la distribució, la impressió, la reproducció, el modelat, la publicació, la posada en circulació, l’emissió, etc., o de la inscripció, la fabricació, la construcció, etc. @ca
toolkit label: nom d’agent d’una manifestació de @ca
toolkit definition: Manifestació que té un nom d’agent el qual és responsable de la distribució, la impressió, la reproducció, el modelat, la publicació, la posada en circulació, l’emissió, etc., o de la inscripció, la fabricació, la construcció, etc. @ca
label: er navn på agent af manifestation af @da
definition: Relaterer et nomen til en manifestation, som har et navn på agent, som er ansvarlig for distribution, trykning, duplikering, støbning, publikation, frigivelse, udgivelse ect. eller indskrivning, fremstilling, konstruktion ect. @da
toolkit label: navn på agent af manifestation af @da
toolkit definition: Manifestation, som har et navn på agent, som er ansvarlig for distribution, trykning, duplikering, støbning, publikation, frigivelse, udgivelse ect. eller indskrivning, fremstilling, konstruktion ect. @da
label: kehastuse tegija nimi kehastuses @et
definition: Seostab nomen'i kehastusega, milles on levitamise, trükkimise, paljundamise, valamise, avaldamise, väljalaskmise, väljaandmise, inskribeerimise, tootmise, ehitamise vms eest vastutava tegija nimi. @et
toolkit label: kehastuse tegija nimi kehastuses @et
toolkit definition: Kehastus, milles on levitamise, trükkimise, paljundamise, valamise, avaldamise, väljalaskmise, väljaandmise, inskribeerimise, tootmise, ehitamise vms eest vastutava tegija nimi. @et
label: ist Name eines Akteurs einer Manifestation von @de
definition: Setzt ein Nomen in Beziehung zu einer Manifestation, die über einen Namen eines Akteurs verfügt, der für den Vertrieb, den Druck, die Vervielfältigung, den Guss, das Veröffentlichen, das Release, die Herausgabe und so weiter oder für das Gravieren, Fabrizieren, Konstruieren und so weiter verantwortlich ist. @de
toolkit label: Name eines Akteurs einer Manifestation von @de
toolkit definition: Eine Manifestation, die über einen Namen eines Akteurs verfügt, der für den Vertrieb, den Druck, die Vervielfältigung, den Guss, das Veröffentlichen, das Release, die Herausgabe und so weiter oder für das Gravieren, Fabrizieren, Konstruieren und so weiter verantwortlich ist. @de
label: ágensneve a következő megjelenési formának: @hu
definition: Hozzákapcsol egy noment egy megjelenési formához, amelyhez hozzátartozik egy olyan ágensnek a neve, amely felelős a terjesztésért, nyomtatásért, sokszorosításért, öntéséért, kiadásért, kibocsájtásért, megjelentetésért stb., vagy írásáért, összeállításért, készítéséért, stb. @hu
toolkit label: ágensneve a következő megjelenési formának: @hu
toolkit definition: Egy megjelenési forma, amelyhez hozzátartozik egy olyan ágensnek a neve, amely felelős a terjesztésért, nyomtatásért, sokszorosításért, öntéséért, kiadásért, kibocsájtásért, megjelentetésért stb., vagy írásáért, összeállításért, készítéséért, stb. @hu
label: è nome di agente della manifestazione di @it
definition: Correla un nomen a una manifestazione ha un nome di agente che è responsabile per la distribuzione, stampa, duplicazione, casting, pubblicazione, rilascio, emissione, etc. o incisione, fabbricazione, costruzione, etc. @it
toolkit label: nome di agente della manifestazione di @it
toolkit definition: Una manifestazione ha un nome di agente che è responsabile per la distribuzione, stampa, duplicazione, casting, pubblicazione, rilascio, emissione, etc. o incisione, fabbricazione, costruzione, etc. @it
label: ir aģenta vārds/nosaukums manifestācijai @lv
toolkit label: ir aģenta vārds/nosaukums manifestācijai @lv
definition: Sasaista nomenu ar manifestāciju, kam ir aģents ar vārdu/nosaukumu, kurš ir atbildīgs par publicētas manifestācijas izplatīšanu, iespiešanu, pavairošanu, publicēšanu, izdošanu u.tml. vai nepublicētas manifestācijas pierakstīšanu, izgatavošanu, izveidošanu u.tml. @lv
toolkit definition: Manifestācija, kam ir aģents ar vārdu/nosaukumu, kurš ir atbildīgs par publicētas manifestācijas izplatīšanu, iespiešanu, pavairošanu, publicēšanu, izdošanu u.tml. vai nepublicētas manifestācijas pierakstīšanu, izgatavošanu, izveidošanu u.tml. @lv
label: 是……的载体表现的行为者的名称 @zh-hans
toolkit label: ……的载体表现的行为者的名称 @zh-hans
definition: 将一个命名与有负责发行、印刷、复制、铸造、出版、发布、经销等或者镌刻、制造、构建等的行为者的名称的一种载体表现关联起来。 @zh-hans
toolkit definition: 有负责发行、印刷、复制、铸造、出版、发布、经销等或者镌刻、制造、构建等的行为者的名称的一种载体表现 @zh-hans
has subproperty: is name of distributor of
has subproperty: is name of manufacturer of
has subproperty: is name of producer of
has subproperty: is name of publisher of
has subproperty: P80114
label: gösteriminin temsilcisinin adıdır @tr
toolkit label: gösterimin temsilcisinin adı @tr
definition: Bir ismi, dağıtım, basım, çoğaltma, döküm, yayım, ihraç, piyasaya sürüm vb. veya yazım, üretim, imalat vb.den sorumlu olan temsilcinin adına sahip bir gösterimle ilişkilendirir. @tr
toolkit definition: Dağıtım, basım, çoğaltma, döküm, yayınlama vb. veya yazım, üretim, yapım vb. işlemlerden sorumlu olan bir temsilcinin adı olan bir gösterim. @tr

is name of collective agent of
status: Published
type: Property
lexical alias: nameOfCollectiveAgentOf.en
definition: Relates a nomen to a collective agent who has an appellation of collective agent in natural language and phrasing used in common discourse.
domain: C10012
toolkit label: name of collective agent of
toolkit definition: A collective agent who has an appellation of collective agent in natural language and phrasing used in common discourse.
sub property of: is appellation of collective agent of
sub property of: is name of agent of
has element type: 2
label: nimi yhteistoimijalle @fi
definition: Liittää nomenin yhteistoimijaan, jolla on luonnollisen kielen ja yleisen diskurssin sanamuodon mukainen nimitys. @fi
toolkit label: nimi yhteistoimijalle @fi
toolkit definition: Yhteistoimija, jolla on luonnollisen kielen ja yleisen diskurssin sanamuodon mukainen nimitys. @fi
label: er navn på kollektiv agent for @no
definition: Relaterer et nomen til en kollektiv agent som har en betegnelse for kollektiv agent på et naturlig språk og med frasering brukt i alminnelig diskurs. @no
toolkit label: navn på kollektiv agent for @no
toolkit definition: En kollektiv agent som har en betegnelse for kollektiv agent på et naturlig språk og med frasering brukt i alminnelig diskurs. @no
label: est un nom d’agent collectif de @fr
definition: Met un nomen en relation avec un agent collectif qui possède une appellation d’agent collectif exprimée dans un langage et une formulation naturels et utilisée dans le langage courant. @fr
toolkit label: nom d’agent collectif de @fr
toolkit definition: Agent collectif qui possède une appellation d’agent collectif exprimée dans un langage et une formulation naturels et utilisée dans le langage courant. @fr
label: is naam van collectieve actor van @nl
definition: Relateert een nomen aan een collectieve actor die een benaming van collectieve actor heeft in natuurlijke taal en terminologie in gebruikelijke bewoording. @nl
toolkit label: naam van collectieve actor van @nl
toolkit definition: Een collectieve actor die een benaming van collectieve actor heeft in natuurlijke taal en terminologie in gebruikelijke bewoording. @nl
label: هو اسم وكيل جماعي لـ @ar
definition: يربط تسمية بوكيل جماعي له اسم وكيل جماعي في اللغة الطبيعية وفي العبارات المستخدمة في الخطاب العام. @ar
toolkit label: اسم وكيل جماعي لـ @ar
toolkit definition: وكيل جماعي له اسم وكيل جماعي في اللغة الطبيعية وفي العبارات المستخدمة في الخطاب العام. @ar
label: és nom d’agent col·lectiu de @ca
definition: Relaciona un nomen amb un agent col·lectiu que té una apel·lació d’agent col·lectiu en llenguatge i frases naturals usada en el discurs comú. @ca
toolkit label: nom d’agent col·lectiu de @ca
toolkit definition: Agent col·lectiu que té una apel·lació d’agent col·lectiu en llenguatge i frases naturals usada en el discurs comú. @ca
label: er navn på kollektiv agent af @da
definition: Relaterer et nomen til en kollektiv agent, som har en benævnelse på kollektiv agent på normalsprog og med formuleringer, som bruges alment. @da
toolkit label: navn på kollektiv agent af @da
toolkit definition: Kollektiv agent, som har en benævnelse på kollektiv agent på normalsprog og med formuleringer, som bruges alment. @da
label: nimi kollektiivile @et
definition: Seostab nomen'i kollektiiviga, kellel on nimetus loomulikus keeles ja sõnastuses, mida kasutatakse ühises diskursuses. @et
toolkit label: nimi kollektiivile @et
toolkit definition: Kollektiiv, kellel on nimetus loomulikus keeles ja sõnastuses, mida kasutatakse ühises diskursuses. @et
label: ist Name eines gemeinschaftlichen Akteurs von @de
definition: Setzt ein Nomen in Beziehung zu einem gemeinschaftlichen Akteur, der über eine Bezeichnung für einen gemeinschaftlicher Akteur in natürlicher Sprache und Ausdrucksweise verfügt, die beim normalen Sprechen und Schreiben verwendet wird. @de
toolkit label: Name eines gemeinschaftlichen Akteurs von @de
toolkit definition: Ein gemeinschaftlicher Akteur, der über eine Bezeichnung für einen gemeinschaftlicher Akteur in natürlicher Sprache und Ausdrucksweise verfügt, die beim normalen Sprechen und Schreiben verwendet wird. @de
label: kollektívágens-neve a következőnek: @hu
definition: Hozzákapcsol egy noment egy kollektív ágenshez, amelynek van egy kollektív ágenshez tartozó megnevezése természetes nyelven és közbeszédben használt kifejezéssel. @hu
toolkit label: kollektívágens-neve: @hu
toolkit definition: Egy kollektív ágens, amelynek van egy kollektív ágenshez tartozó megnevezése természetes nyelven és közbeszédben használt kifejezéssel. @hu
label: è nome di agente collettivo di @it
definition: Correla un nomen a un agente collettivo che ha una designazione di agente collettivo in linguaggio e frasi naturali usati nel discorso comune. @it
toolkit label: nome di agente collettivo di @it
toolkit definition: Un agente collettivo che ha una designazione di agente collettivo in linguaggio e frasi naturali usati nel discorso comune. @it
label: ir vārds/nosaukums grupai @lv
definition: Sasaista nomenu ar grupu, kam ir apzīmējums dabiskajā valodā, ko izmanto savstarpējā saziņā. @lv
toolkit label: ir vārds/nosaukums grupai @lv
toolkit definition: Grupa, kam ir apzīmējums dabiskajā valodā, ko izmanto savstarpējā saziņā. @lv
label: 是……的集体行为者的名称 @zh-hans
definition: 将一个命名与有用自然语言和普通话语措词表达的集体行为者的称谓的一个集体行为者关联起来。 @zh-hans
toolkit label: ……的集体行为者的名称 @zh-hans
toolkit definition: 有用自然语言和普通话语措词表达的集体行为者的称谓的一个集体行为者 @zh-hans
has subproperty: is name of corporate body of
has subproperty: is name of family of
has subproperty: is preferred name of collective agent of
has subproperty: is variant name of collective agent of
has subproperty: P80053
label: kolektif temsilcisinin adıdır @tr
definition: Bir ismi, doğal dilde ve ortak söylemde kullanılan ifadelerde kolektif temsilci unvanına sahip olan kolektif bir temsilciyle ilişkilendirir. @tr
toolkit label: kolektif temsilcisinin adı @tr
toolkit definition: Doğal dilde ve ortak söylemde kullanılan ifadelerde kolektif temsilci unvanına sahip kolektif bir temsilci. @tr

is name of corporate body of
status: Published
type: Property
lexical alias: nameOfCorporateBodyOf.en
definition: Relates a nomen to a corporate body who has an appellation of corporate body in natural language and phrasing used in common discourse.
domain: C10012
toolkit label: name of corporate body of
toolkit definition: A corporate body who has an appellation of corporate body in natural language and phrasing used in common discourse.
sub property of: is appellation of corporate body of
sub property of: is name of collective agent of
has element type: 2
label: nimi yhteisölle @fi
definition: Liittää nomenin yhteisöön, jolla on luonnollisen kielen ja yleisen diskurssin sanamuodon mukainen nimitys. @fi
toolkit label: nimi yhteisölle @fi
toolkit definition: Yhteisö, jolla on luonnollisen kielen ja yleisen diskurssin sanamuodon mukainen nimitys. @fi
label: er navn på korporasjon for @no
definition: Relaterer et nomen til en korporasjon som har en betegnelse for korporasjon på et naturlig språk og med frasering brukt i alminnelig diskurs. @no
toolkit label: navn på korporasjon for @no
toolkit definition: En korporasjon som har en betegnelse for korporasjon på et naturlig språk og med frasering brukt i alminnelig diskurs. @no
label: est un nom de collectivité de @fr
definition: Met un nomen en relation avec une collectivité qui possède une appellation de collectivité exprimée dans un langage et une formulation naturels et utilisée dans le langage courant. @fr
toolkit label: nom de collectivité de @fr
toolkit definition: Collectivité qui possède une appellation de collectivité exprimée dans un langage et une formulation naturels et utilisée dans le langage courant. @fr
label: is naam van corporatie van @nl
definition: Relateert een nomen aan een corporatie die een benaming van corporatie heeft in natuurlijke taal en terminologie in gebruikelijke bewoording. @nl
toolkit label: naam van corporatie van @nl
toolkit definition: Een corporatie die een benaming van corporatie heeft in natuurlijke taal en terminologie in gebruikelijke bewoording. @nl
label: هو اسم هيئة لـ @ar
definition: يربط تسمية بهيئة لها تسمية هيئة في اللغة الطبيعية وفي العبارات المستخدمة في الخطاب العام. @ar
toolkit label: اسم هيئة لـ @ar
toolkit definition: هيئة لها اسم هيئة في اللغة الطبيعية وفي العبارات المستخدمة في الخطاب العام. @ar
label: és nom d’entitat corporativa de @ca
definition: Relaciona un nomen amb una entitat corporativa que té una apel·lació d’entitat corporativa en llenguatge i frases naturals usada en el discurs comú. @ca
toolkit label: nom d’entitat corporativa de @ca
toolkit definition: Entitat corporativa que té una apel·lació d’entitat corporativa en llenguatge i frases naturals usada en el discurs comú. @ca
label: er navn på korporation af @da
definition: Relaterer et nomen til en korporation, som har en benævnelse på korporation på normalsprog og med formuleringer, som bruges alment. @da
toolkit label: navn på korporation af @da
toolkit definition: Korporation, som har en benævnelse på korporation på normalsprog og med formuleringer, som bruges alment. @da
label: nimi asutusele @et
definition: Seostab nomen'i asutusega, kellel on nimetus loomulikus keeles ja sõnastuses, mida kasutatakse ühises diskursuses. @et
toolkit label: nimi asutusele @et
toolkit definition: Asutus, kellel on nimetus loomulikus keeles ja sõnastuses, mida kasutatakse ühises diskursuses. @et
label: ist Name einer Körperschaft von @de
definition: Setzt ein Nomen in Beziehung zu einer Körperschaft, die über eine Bezeichnung für eine Körperschaft in natürlicher Sprache und Ausdrucksweise verfügt, die beim normalen Sprechen und Schreiben verwendet wird. @de
toolkit label: Name einer Körperschaft von @de
toolkit definition: Eine Körperschaft, die über eine Bezeichnung für eine Körperschaft in natürlicher Sprache und Ausdrucksweise verfügt, die beim normalen Sprechen und Schreiben verwendet wird. @de
label: tárgya a következő testületnek: @hu
definition: Hozzákapcsol egy noment egy testülethez, amelynek van egy testülethez tartozó megnevezése természetes nyelven és közbeszédben használt kifejezéssel. @hu
toolkit label: tárgya a következő testületnek: @hu
toolkit definition: Egy testület, amelynek van egy testülethez tartozó megnevezése természetes nyelven és közbeszédben használt kifejezéssel. @hu
label: è nome di ente di @it
definition: Correla un nomen a un ente che ha una designazione di ente in linguaggio e frasi naturali usati nel discorso comune. @it
toolkit label: nome di ente di @it
toolkit definition: Un ente che ha una designazione di ente nel linguaggio naturale e una formulazione usata nel linguaggio comune. @it
label: ir vārds/nosaukums institūcijai @lv
definition: Sasaista nomenu ar institūciju, kam ir apzīmējums dabiskajā valodā, ko izmanto savstarpējā saziņā. @lv
toolkit label: ir vārds/nosaukums institūcijai @lv
toolkit definition: Institūcija, kam ir apzīmējums dabiskajā valodā, ko izmanto savstarpējā saziņā. @lv
label: 是……的团体的名称 @zh-hans
definition: 将一个命名与有用自然语言和普通话语措词表达的团体的称谓的一个团体关联起来。 @zh-hans
toolkit label: ……的团体的名称 @zh-hans
toolkit definition: 有用自然语言和普通话语措词表达的团体的称谓的一个团体 @zh-hans
has subproperty: is preferred name of corporate body of
has subproperty: is variant name of corporate body of
has subproperty: P80054
label: tüzel kişisinin adıdır @tr
definition: Bir ismi, doğal dilde ve ortak söylemde kullanılan ifadelerde tüzel kişi unvanına sahip bir tüzel kişiyle ilişkilendirir. @tr
toolkit label: tüzel kişiliğin adı @tr
toolkit definition: Doğal dilde ve ortak söylemde kullanılan ifadelerde tüzel kişi unvanına sahip bir tüzel kişi. @tr

is name of distributor of
status: Published
type: Property
lexical alias: nameOfDistributorOf.en
domain: C10012
toolkit label: name of distributor of
sub property of: is name of agent of manifestation of
has element type: 2
definition: Relates a nomen to a manifestation that is published that has a name of agent who is responsible for distribution.
toolkit definition: A manifestation that is published that has a name of agent who is responsible for distribution.
label: nimi jakelijalle @fi
definition: Liittää nomenin julkaistuun manifestaatioon, jolla on jakelusta vastaavan toimijan nimi. @fi
toolkit label: nimi jakelijalle @fi
toolkit definition: Julkaistu manifestaatio, jolla on jakelusta vastaavan toimijan nimi. @fi
label: er navn på distributør for @no
definition: Relaterer et nomen til en manifestasjon som er publisert som har et navn på en agent som er ansvarlig for distribusjon. @no
toolkit label: navn på distributør for @no
toolkit definition: En manifestasjon som er publisert som har et navn på en agent som er ansvarlig for distribusjon. @no
label: est un nom de diffuseur ou de distributeur de @fr
definition: Met un nomen en relation avec une manifestation publiée qui possède un nom d’agent responsable de la diffusion ou de la distribution. @fr
toolkit label: nom de diffuseur ou de distributeur de @fr
toolkit definition: Manifestation publiée qui possède un nom d’agent responsable de la diffusion ou de la distribution. @fr
label: is naam van distributeur van @nl
definition: Relateert een nomen aan een manifestatie die gepubliceerd is die een naam van actor heeft die verantwoordelijk is voor distributie. @nl
toolkit label: naam van distributeur van @nl
toolkit definition: Een manifestatie die gepubliceerd is die een naam van actor heeft die verantwoordelijk is voor distributie. @nl
label: هو اسم موزع لـ @ar
definition: يربط تسمية بتجسيدة منشورة لها اسم وكيل مسئول عن التوزيع. @ar
toolkit label: اسم موزع لـ @ar
toolkit definition: تجسيدة منشورة لها اسم وكيل مسئول عن التوزيع. @ar
label: és nom de distribuïdor de @ca
definition: Relaciona un nomen amb una manifestació que es publica i que té un nom d’agent el qual és responsable de la distribució. @ca
toolkit label: nom de distribuïdor de @ca
toolkit definition: Manifestació que es publica i que té un nom d’agent el qual és responsable de la distribució. @ca
label: er navn på distributør af @da
definition: Relaterer et nomen til en manifestation, som er udgivet og som har navn på agent, som er ansvarlig for distribution. @da
toolkit label: navn på distributør af @da
toolkit definition: Manifestation, som er udgivet og som har navn på agent, som er ansvarlig for distribution. @da
label: levitaja nimi kehastuses @et
definition: Seostab nomen'i avaldatud kehastusega, milles on levitamise eest vastutava tegija nimi. @et
toolkit label: levitaja nimi kehastuses @et
toolkit definition: Avaldatud kehastus, milles on levitamise eest vastutava tegija nimi. @et
label: ist Vertriebsname von @de
definition: Setzt ein Nomen in Beziehung zu einer veröffentlichten Manifestation, die über einen Namen eines Akteurs verfügt, der für den Vertrieb verantwortlich ist. @de
toolkit label: Vertriebsname von @de
toolkit definition: Eine veröffentlichte Manifestation, die über einen Namen eines Akteurs verfügt, der für den Vertrieb verantwortlich ist. @de
label: neve a következő terjesztőjének: @hu
definition: Egy noment hozzákapcsol egy közzétett megjelenési formához, amelyhez tartozik egy olyan ágensnek a neve, aki/amely felelős a terjesztésért. @hu
toolkit label: neve a következő terjesztőjének: @hu
toolkit definition: Egy közzétett megjelenési forma, amelyhez tartozik egy olyan ágensnek a neve, aki/amely felelős a terjesztésért. @hu
label: è nome di distributore di @it
definition: Correla un nomen a una manifestazione pubblicata che ha un nome di agente che è responsabile per la distribuzione. @it
toolkit label: nome di distributore di @it
toolkit definition: Una manifestazione pubblicata che ha un nome di agente che è responsabile per la distribuzione. @it
label: ir izplatītāja vārds/nosaukums manifestācijai @lv
toolkit label: ir izplatītāja vārds/nosaukums manifestācijai @lv
definition: Sasaista nomenu ar manifestāciju, kas ir publicēta un kurai ir aģenta vārds/nosaukums, kurš ir atbildīgs par izplatīšanu. @lv
toolkit definition: Manifestācija, kas ir publicēta un kurai ir aģenta vārds/nosaukums, kurš ir atbildīgs par izplatīšanu. @lv
label: 是……的发行者的名称 @zh-hans
toolkit label: ……的发行者的名称 @zh-hans
definition: 将一个命名与已经出版并有负责发行的行为者的名称的一种载体表现关联起来。 @zh-hans
toolkit definition: 已经出版并有负责发行的行为者的名称的一种载体表现 @zh-hans
has subproperty: is parallel name of distributor of
has subproperty: P80115
label: dağıtımcısının adıdır @tr
toolkit label: Distribitör adı @tr
definition: Bir ismi, dağıtımdan sorumlu temsilcinin adına sahip yayınlanan bir gösterimle ilişkilendirir. @tr
toolkit definition: Dağıtımdan sorumlu bir temsilcinin adı ile yayınlanan bir gösterim. @tr

is name of family of
status: Published
type: Property
lexical alias: nameOfFamilyOf.en
definition: Relates a nomen to a family who has an appellation of family in natural language and phrasing used in common discourse.
domain: C10012
toolkit label: name of family of
toolkit definition: A family who has an appellation of family in natural language and phrasing used in common discourse.
sub property of: is appellation of family of
sub property of: is name of collective agent of
has element type: 2
label: nimi suvulle @fi
definition: Liittää nomenin sukuun, jolla on luonnollisen kielen ja yleisen diskurssin sanamuodon mukainen nimitys. @fi
toolkit label: nimi suvulle @fi
toolkit definition: Suku, jolla on luonnollisen kielen ja yleisen diskurssin sanamuodon mukainen nimitys. @fi
label: er navn på familie for @no
definition: Relaterer et nomen til en familie som har en betegnelse for familie på et naturlig språk og med frasering brukt i alminnelig diskurs. @no
toolkit label: navn på familie for @no
toolkit definition: En familie som har en betegnelse for familie på et naturlig språk og med frasering brukt i alminnelig diskurs. @no
label: est un nom d’une famille de @fr
definition: Met un nomen en relation avec une famille qui possède une appellation de famille exprimée dans un langage et une formulation naturels et utilisée dans le langage courant. @fr
toolkit label: nom d’une famille de @fr
toolkit definition: Famille qui possède une appellation de famille exprimée dans un langage et une formulation naturels et utilisée dans le langage courant. @fr
label: is naam van familie van @nl
definition: Relateert een nomen aan een familie die een benaming van familie heeft in natuurlijke taal en terminologie in gebruikelijke bewoording. @nl
toolkit label: naam van familie van @nl
toolkit definition: Een familie die een benaming van familie heeft in natuurlijke taal en terminologie in gebruikelijke bewoording. @nl
label: هو اسم عائلة لـ @ar
definition: يربط تسمية بعائلة لها اسم في اللغة الطبيعية وفي العبارات المستخدمة في الخطاب العام. @ar
toolkit label: اسم عائلة لـ @ar
toolkit definition: عائلة لها اسم في اللغة الطبيعية وفي العبارات المستخدمة في الخطاب العام. @ar
label: és nom de família de @ca
definition: Relaciona un nomen amb una família que té una apel·lació de família en llenguatge i frases naturals usada en el discurs comú. @ca
toolkit label: nom de família de @ca
toolkit definition: Família que té una apel·lació de família en llenguatge i frases naturals usada en el discurs comú. @ca
label: er navn på familie af @da
definition: Relaterer et nomen til en familie, som har en benævnelse på familie på normalsprog og med formuleringer, som bruges alment. @da
toolkit label: navn på familie af @da
toolkit definition: Familie, som har en benævnelse på familie på normalsprog og med formuleringer, som bruges alment. @da
label: nimi perekonnale @et
definition: Seostab nomen'i perekonnaga, kellel on nimetus loomulikus keeles ja sõnastuses, mida kasutatakse ühises diskursuses. @et
toolkit label: nimi perekonnale @et
toolkit definition: Perekond, kellel on nimetus loomulikus keeles ja sõnastuses, mida kasutatakse ühises diskursuses. @et
label: ist Name einer Familie von @de
definition: Setzt ein Nomen in Beziehung zu einer Familie, die über eine Bezeichnung für eine Familie in natürlicher Sprache und Ausdrucksweise verfügt, die beim normalen Sprechen und Schreiben verwendet wird. @de
toolkit label: Name einer Familie von @de
toolkit definition: Einer Familie, die über eine Bezeichnung für eine Familie in natürlicher Sprache und Ausdrucksweise verfügt, die beim normalen Sprechen und Schreiben verwendet wird. @de
label: családneve a következőnek: @hu
definition: Hozzákapcsol egy noment egy családhoz, amelynek van egy családhoz tartozó megnevezése természetes nyelven és közbeszédben használt kifejezéssel. @hu
toolkit label: családneve: @hu
toolkit definition: Egy család, amelynek van egy családhoz tartozó megnevezése természetes nyelven és közbeszédben használt kifejezéssel. @hu
label: è nome di famiglia di @it
definition: Correla un nomen a una famiglia che ha una designazione di famiglia in linguaggio e frasi naturali usati nel discorso comune. @it
toolkit label: nome di famiglia di @it
toolkit definition: Una famiglia che ha una designazione di famiglia in linguaggio e frasi naturali usati nel discorso comune. @it
label: ir vārds/nosaukums dzimtai/ģimenei @lv
definition: Sasaista nomenu ar dzimtu/ģimeni, kam ir apzīmējums dabiskajā valodā, ko izmanto savstarpējā saziņā. @lv
toolkit label: ir vārds/nosaukums dzimtai/ģimenei @lv
toolkit definition: Dzimta/ģimene, kam ir apzīmējums dabiskajā valodā, ko izmanto savstarpējā saziņā. @lv
label: 是……的家族的名称 @zh-hans
definition: 将一个命名与有用自然语言和普通话语措词表达的家族的称谓的一个家族关联起来。 @zh-hans
toolkit label: ……的家族的名称 @zh-hans
toolkit definition: 有用自然语言和普通话语措词表达的家族的称谓的一个家族 @zh-hans
has subproperty: is preferred name of family of
has subproperty: is variant name of family of
has subproperty: P80055
label: ailesinin adıdır @tr
definition: Bir ismi, doğal dilde ve ortak söylemde kullanılan ifadelerde aile unvanına sahip bir aileyle ilişkilendirir. @tr
toolkit label: aile adı @tr
toolkit definition: Doğal dilde ve ortak söylemde kullanılan anlatımlarda aile unvanına sahip bir aile. @tr

is name of manufacturer of
status: Published
type: Property
lexical alias: nameOfManufacturerOf.en
domain: C10012
toolkit label: name of manufacturer of
sub property of: is name of agent of manifestation of
has element type: 2
definition: Relates a nomen to a manifestation that is published that has a name of agent who is responsible for printing, duplication, casting, etc.
toolkit definition: A manifestation that is published that has a name of agent who is responsible for printing, duplication, casting, etc.
label: nimi valmistajalle @fi
definition: Liittää nomenin julkaistuun manifestaatioon, jolla on painamisesta, monistamisesta, kirjainten valamisesta tms. vastaavan toimijan nimi. @fi
toolkit label: nimi valmistajalle @fi
toolkit definition: Manifestaatio, jolla on painamisesta, monistamisesta, kirjainten valamisesta tms. vastaavan toimijan nimi. @fi
label: er navn på tilvirker for @no
definition: Relaterer et nomen til en manifestasjon som er publisert som har et navn på en agent som er ansvarlig for trykking, mangfoldiggjøring, støping etc. @no
toolkit label: navn på tilvirker for @no
toolkit definition: En manifestasjon som er publisert som har et navn på en agent som er ansvarlig for trykking, mangfoldiggjøring, støping etc. @no
label: est un nom de fabricant de @fr
definition: Met un nomen en relation avec une manifestation publiée qui possède un nom d’agent responsable de l’impression, de la reproduction, du moulage, etc. @fr
toolkit label: nom de fabricant de @fr
toolkit definition: Manifestation publiée qui possède un nom d’agent responsable de l’impression, de la reproduction, du moulage, etc. @fr
label: is naam van vervaardiger van @nl
definition: Relateert een nomen aan een manifestatie die gepubliceerd is die een naam van actor heeft die verantwoordelijk is voor drukken, dupliceren, gieten etc. @nl
toolkit label: naam van vervaardiger van @nl
toolkit definition: Een manifestatie die gepubliceerd is die een naam van actor heeft die verantwoordelijk is voor drukken, dupliceren, gieten etc. @nl
label: هو اسم صانع لـ @ar
definition: يربط تسمية بتجسيدة منشورة لها اسم وكيل مسئول عن الطباعة، النسخ، والبث، الخ. @ar
toolkit label: اسم صانع لـ @ar
toolkit definition: تجسيدة منشورة لها اسم وكيل مسئول مسؤول عن الطباعة، النسخ، والبث، الخ. @ar
label: és nom de fabricant de @ca
definition: Relaciona un nomen amb una manifestació que es publica i que té un nom d’agent el qual és responsable de la impressió, la reproducció, el modelat, etc. @ca
toolkit definition: Manifestació que es publica i que té un nom d’agent el qual és responsable de la impressió, la reproducció, el modelat, etc. @ca
label: er navn på producent af @da
definition: Relaterer et nomen til en manifestation, som er publiceret og som har navn på agent, som er ansvarlig for trykning, duplikering, støbning etc. @da
toolkit label: navn på producent af @da
toolkit definition: Manifestation, som er udgivet og som har navn på agent, som er ansvarlig for trykning, duplikering, støbning etc. @da
label: valmistaja nimi kehastuses @et
definition: Seostab nomen'i avaldatud kehastusega, milles on trükkimise, paljundamise, valamise vms eest vastutava tegija nimi. @et
toolkit label: valmistaja nimi kehastuses @et
toolkit definition: Avaldatud kehastus, milles on trükkimise, paljundamise, valamise vms eest vastutava tegija nimi. @et
label: ist Herstellername von @de
definition: Setzt ein Nomen in Beziehung zu einer veröffentlichten Manifestation, die über einen Namen eines Akteurs verfügt, der für den Druck, die Vervielfältigung, den Guss und so weiter verantwortlich ist. @de
toolkit label: Herstellername von @de
toolkit definition: Eine veröffentlichte Manifestation, die über einen Namen eines Akteurs verfügt, der für den Druck, die Vervielfältigung, den Guss und so weiter verantwortlich ist. @de
label: neve a következő gyártójának: @hu
definition: Egy noment hozzákapcsol egy közzétett megjelenési formához , amelyhez tartozik egy olyan ágensnek a neve, aki/amely felelős a nyomtatásért, többszörözésért, öntésért stb. @hu
toolkit label: neve a következő gyártójának: @hu
toolkit definition: Egy közzétett megjelenési forma, amelyhez tartozik egy olyan ágensnek a neve, aki/amely felelős a nyomtatásért, többszörözésért, öntésért stb. @hu
label: è nome di manifattore di @it
definition: Correla un nomen a una manifestazione pubblicata che ha un nome di agente che è responsabile per la stampa, duplicazione, casting, etc. @it
toolkit label: nome di manifattore di @it
toolkit definition: Una manifestazione pubblicata che ha un nome di agente che è responsabile per la stampa, duplicazione, casting, etc. @it
label: ir ražotāja vārds/nosaukums manifestācijai @lv
toolkit label: ir ražotāja vārds/nosaukums manifestācijai @lv
definition: Sasaista nomenu ar manifestāciju, kas ir publicēta un kurai ir aģenta vārds/nosaukums, kurš ir atbildīgs par iespiešanu, pavairošanu, iesiešanu u.tml. @lv
toolkit definition: Manifestācija, kas ir publicēta un kurai ir aģenta vārds/nosaukums, kurš ir atbildīgs par iespiešanu, pavairošanu, iesiešanu u.tml. @lv
label: 是……的生产者的名称 @zh-hans
toolkit label: ……的生产者的名称 @zh-hans
definition: 将一个命名与已经出版并有负责印刷、复制、铸造等的行为者的名称的一种载体表现关联起来。 @zh-hans
toolkit definition: 已经出版并有负责印刷、复制、铸造等的行为者的名称的一种载体表现 @zh-hans
has subproperty: is parallel name of manufacturer of
has subproperty: P80116
label: üreticisinin adıdır @tr
toolkit label: imalatçısının adı @tr
definition: Bir ismi, basım, çoğaltma, döküm vb. işlemlerden sorumlu temsilcinin adına sahip yayınlanan bir gösterimle ilişkilendirir. @tr
toolkit definition: Basım, çoğaltma, döküm vb. işlemlerden sorumlu olan bir temsilcinin adı ile yayınlanan bir gösterim. @tr

is name of person of
status: Published
type: Property
lexical alias: nameOfPersonOf.en
definition: Relates a nomen to a person who has an appellation of person in natural language and phrasing used in common discourse.
domain: C10012
toolkit label: name of person of
toolkit definition: A person who has an appellation of person in natural language and phrasing used in common discourse.
sub property of: is appellation of person of
sub property of: is name of agent of
has element type: 2
label: nimi henkilölle @fi
definition: Liittää nomenin henkilöön, jolla on luonnollisen kielen ja yleisen diskurssin sanamuodon mukainen nimitys. @fi
toolkit label: nimi henkilölle @fi
toolkit definition: Henkilö, jolla on luonnollisen kielen ja yleisen diskurssin sanamuodon mukainen nimitys. @fi
label: er navn på person for @no
definition: Relaterer et nomen til en person som har en betegnelse for person på et naturlig språk og med frasering brukt i alminnelig diskurs. @no
toolkit label: navn på person for @no
toolkit definition: En person som har en betegnelse for person på et naturlig språk og med frasering brukt i alminnelig diskurs. @no
label: est un nom de personne de @fr
definition: Met un nomen en relation avec une personne qui possède une appellation de personne exprimée dans un langage et une formulation naturels et utilisée dans le langage courant. @fr
toolkit label: nom de personne de @fr
toolkit definition: Personne qui possède une appellation de personne exprimée dans un langage et une formulation naturels et utilisée dans le langage courant. @fr
label: is naam van persoon van @nl
definition: Relateert een nomen aan een persoon die een benaming van persoon heeft in natuurlijke taal en terminologie in gebruikelijke bewoording. @nl
toolkit label: naam van persoon van @nl
toolkit definition: Een persoon die een benaming van persoon heeft in natuurlijke taal en terminologie in gebruikelijke bewoording. @nl
label: هو اسم شخص لـ @ar
definition: يربط تسمية بشخص له اسم شخص في اللغة الطبيعية والعبارات المستخدمة في الخطاب العام. @ar
toolkit label: اسم شخص لـ @ar
toolkit definition: شخص له اسم شخص في اللغة الطبيعية والعبارات المستخدمة في الخطاب العام. @ar
label: és nom de persona de @ca
definition: Relaciona un nomen amb una persona que té una apel·lació de persona en llenguatge i frases naturals usada en el discurs comú. @ca
toolkit label: nom de persona de @ca
toolkit definition: Persona que té una apel·lació de persona en llenguatge i frases naturals usada en el discurs comú. @ca
label: er navn på person af @da
definition: Relaterer et nomen til en person, som har en benævnelse på person på normalsprog og med formuleringer, som bruges alment. @da
toolkit label: navn på person af @da
toolkit definition: Person, som har en benævnelse på person på normalsprog og med formuleringer, som bruges alment. @da
label: nimi isikule @et
definition: Seostab nomen'i isikuga, kellel on nimetus loomulikus keeles ja sõnastuses, mida kasutatakse ühises diskursuses. @et
toolkit label: nimi isikule @et
toolkit definition: Isik, kellel on nimetus loomulikus keeles ja sõnastuses, mida kasutatakse ühises diskursuses. @et
label: ist Name einer Person von @de
definition: Setzt ein Nomen in Beziehung zu einer Person, die über eine Bezeichnung für eine Person in natürlicher Sprache und Ausdrucksweise verfügt, die beim normalen Sprechen und Schreiben verwendet wird. @de
toolkit label: Name einer Person von @de
toolkit definition: Eine Person, die über eine Bezeichnung für eine Person in natürlicher Sprache und Ausdrucksweise verfügt, die beim normalen Sprechen und Schreiben verwendet wird. @de
label: személyneve a következőnek: @hu
definition: Hozzákapcsol egy noment egy személyhez, amelynek van egy személyhez tartozó megnevezése természetes nyelven és közbeszédben használt kifejezéssel. @hu
toolkit label: személyneve: @hu
toolkit definition: Egy személy, amelynek van egy személyhez tartozó megnevezése természetes nyelven és közbeszédben használt kifejezéssel. @hu
label: è nome di persona di @it
definition: Correla un nomen a una persona che ha una designazione di persona in linguaggio e frasi naturali usati nel discorso comune. @it
toolkit label: nome di persona di @it
toolkit definition: Una persona che ha una designazione di persona in linguaggio e frasi naturali usati nel discorso comune. @it
label: ir vārds personai @lv
definition: Sasaista nomenu ar personu, kurai ir apzīmējums dabiskajā valodā, ko izmanto savstarpējā saziņā. @lv
toolkit label: ir vārds personai @lv
toolkit definition: Persona, kurai ir apzīmējums dabiskajā valodā, ko izmanto savstarpējā saziņā. @lv
label: 是……的个人的名称 @zh-hans
definition: 将一个命名与有用自然语言和普通话语措词表达的个人的称谓的一个个人关联起来。 @zh-hans
toolkit label: ……的个人的名称 @zh-hans
toolkit definition: 有用自然语言和普通话语措词表达的个人的称谓的一个个人 @zh-hans
has subproperty: is fuller form of name of
has subproperty: is given name of
has subproperty: is preferred name of person of
has subproperty: is surname of
has subproperty: is variant name of person of
has subproperty: P80056
label: kişisinin adıdır @tr
definition: Bir ismi, doğal dilde ve ortak söylemde kullanılan ifadelerde kişi unvanına sahip bir kişiyle ilişkilendirir. @tr
toolkit label: kişi adı @tr
toolkit definition: Doğal dilde ve ortak söylemde kullanılan ifadelerde kişi unvanına sahip bir kişi. @tr

is name of place of
status: Published
type: Property
lexical alias: nameOfPlaceOf.en
definition: Relates a nomen to a place that has an appellation of place in natural language and phrasing used in common discourse.
domain: C10012
toolkit label: name of place of
toolkit definition: A place that has an appellation of place in natural language and phrasing used in common discourse.
sub property of: is appellation of place of
has element type: 2
sub property of: is name of RDA entity of
label: nimi paikalle @fi
definition: Liittää nomenin paikkaan, jolla on luonnollisen kielen ja yleisen diskurssin sanamuodon mukainen nimitys. @fi
toolkit label: nimi paikalle @fi
toolkit definition: Paikka, jolla on luonnollisen kielen ja yleisen diskurssin sanamuodon mukainen nimitys. @fi
label: er navn på sted for @no
definition: Relaterer et nomen til et sted som har en betegnelse for sted på et naturlig språk og med frasering brukt i alminnelig diskurs. @no
toolkit label: navn på sted for @no
toolkit definition: Et sted som har en betegnelse for sted på et naturlig språk og med frasering brukt i alminnelig diskurs. @no
label: est un nom de lieu de @fr
definition: Met un nomen en relation avec un lieu qui possède une appellation de lieu exprimée dans un langage et une formulation naturels et utilisée dans le langage courant. @fr
toolkit label: nom de lieu de @fr
toolkit definition: Lieu qui possède une appellation de lieu exprimée dans un langage et une formulation naturels et utilisée dans le langage courant. @fr
label: is naam van plaats van @nl
definition: Relateert een nomen aan een plaats die een benaming van plaats heeft in natuurlijke taal en terminologie in gebruikelijke bewoording. @nl
toolkit label: naam van plaats van @nl
toolkit definition: Een plaats die een benaming van plaats heeft in natuurlijke taal en terminologie in gebruikelijke bewoording. @nl
label: هو اسم مكان لـ @ar
definition: يربط تسمية بمكان له اسم مكان في اللغة الطبيعية وفي العبارات المستخدمة في الخطاب العام. @ar
toolkit label: اسم مكان لـ @ar
toolkit definition: مكان له اسم مكان في اللغة الطبيعية وفي العبارات المستخدمة في الخطاب العام. @ar
label: és nom de lloc de @ca
definition: Relaciona un nomen amb un lloc que té una apel·lació de lloc en llenguatge i frases naturals usada en el discurs comú. @ca
toolkit label: nom de lloc de @ca
toolkit definition: Lloc que té una apel·lació de lloc en llenguatge i frases naturals usada en el discurs comú. @ca
label: er navn på sted af @da
definition: Relaterer et nomen til et sted, som har en benævnelse på sted på normalsprog og med formuleringer, som bruges alment. @da
toolkit label: navn på sted af @da
toolkit definition: Sted, som har en benævnelse på sted på normalsprog og med formuleringer, som bruges alment. @da
label: nimi kohale @et
definition: Seostab nomen'i kohaga, millel on nimetus loomulikus keeles ja sõnastuses, mida kasutatakse ühises diskursuses. @et
toolkit label: nimi kohale @et
toolkit definition: Koht, millel on nimetus loomulikus keeles ja sõnastuses, mida kasutatakse ühises diskursuses. @et
label: ist Name eines Geografikums von @de
definition: Setzt ein Nomen in Beziehung zu einem Geografikum, das über eine Bezeichnung für ein Geografikum in natürlicher Sprache und Ausdrucksweise verfügt, die beim normalen Sprechen und Schreiben verwendet wird. @de
toolkit label: Name eines Geografikums von @de
toolkit definition: Ein Geografikum, das über eine Bezeichnung für ein Geografikum in natürlicher Sprache und Ausdrucksweise verfügt, die beim normalen Sprechen und Schreiben verwendet wird. @de
label: helyneve a következőnek: @hu
definition: Hozzákapcsol egy noment egy helyhez, amelynek van egy helyhez tartozó megnevezése természetes nyelven és közbeszédben használt kifejezéssel. @hu
toolkit label: helyneve: @hu
toolkit definition: Egy hely, amelynek van egy helyhez tartozó megnevezése természetes nyelven és közbeszédben használt kifejezéssel. @hu
label: è nome di luogo di @it
definition: Correla un nomen a un luogo che ha una designazione di luogo in linguaggio e frasi naturali usati nel discorso comune. @it
toolkit label: nome di luogo di @it
toolkit definition: Un luogo che ha una designazione di luogo in linguaggio e frasi naturali usati nel discorso comune. @it
label: ir nosaukums vietai @lv
definition: Sasaista nomenu ar vietu, kurai ir apzīmējums dabiskajā valodā, ko izmanto savstarpējā saziņā. @lv
toolkit label: nosaukums vietai @lv
toolkit definition: Vieta, kurai ir apzīmējums dabiskajā valodā, ko izmanto savstarpējā saziņā. @lv
label: 是……的地点的名称 @zh-hans
definition: 将一个命名与有用自然语言和普通话语措词表达的地点的称谓的一个地点关联起来。 @zh-hans
toolkit label: ……的地点的名称 @zh-hans
toolkit definition: 有用自然语言和普通话语措词表达的地点的称谓的一个地点 @zh-hans
has subproperty: is preferred name of place of
has subproperty: is variant name of place of
has subproperty: P80051
label: yerinin adıdır @tr
definition: Bir ismi, doğal dilde bir yer unvanına ve ortak söylemde kullanılan ifadelere sahip bir yerle ilişkilendirir. @tr
toolkit label: yer adı @tr
toolkit definition: Doğal dilde bir yer unvanına ve ortak söylemde kullanılan ifadelere sahip bir yer. @tr

is name of producer of
status: Published
type: Property
lexical alias: nameOfProducerOf.en
domain: C10012
toolkit label: name of producer of
sub property of: is name of agent of manifestation of
has element type: 2
definition: Relates a nomen to a manifestation that is unpublished that has a name of agent who is responsible for inscription, fabrication, construction, etc.
toolkit definition: A manifestation that is unpublished that has a name of agent who is responsible for inscription, fabrication, construction, etc.
label: nimi tuottajalle @fi
definition: Liittää nomenin julkaisemattomaan manifestaatioon, jolla on kaivertamisesta, valmistamisesta, koostamisesta tms. vastaavan toimijan nimi. @fi
toolkit label: nimi tuottajalle @fi
toolkit definition: Julkaisematon manifestaatio, jolla on kaivertamisesta, valmistamisesta, koostamisesta tms. vastaavan toimijan nimi. @fi
label: er navn på produsent for @no
definition: Relaterer et nomen til en manifestasjon som er upublisert som har et navn på en agent som er ansvarlig for inskripsjon, fabrikasjon, konstruksjon etc. @no
toolkit label: navn på produsent for @no
toolkit definition: En manifestasjon som er upublisert som har et navn på en agent som er ansvarlig for inskripsjon, fabrikasjon, konstruksjon etc. @no
label: est un nom de producteur de @fr
definition: Met un nomen en relation avec une manifestation non publiée qui possède un nom d’agent responsable de la scription, de la fabrication, de la construction, etc. @fr
toolkit label: nom de producteur de @fr
toolkit definition: Manifestation non publiée qui possède un nom d’agent responsable de la scription, de la fabrication, de la construction, etc. @fr
label: is naam van producent van @nl
definition: Relateert een nomen aan een manifestatie die ongepubliceerd is die een naam van actor heeft die verantwoordelijk is voor afschrijven, fabriceren, construeren etc. @nl
toolkit label: naam van producent van @nl
toolkit definition: Een manifestatie die ongepubliceerd is die een naam van actor heeft die verantwoordelijk is voor afschrijven, fabriceren, construeren etc. @nl
label: هو اسم مُنْتِج لـ @ar
definition: يربط تسمية بتجسيدة غير منشورة لها اسم وكيل مسئول عن التدوين، والتأليف، والإنشاء، الخ. @ar
toolkit label: اسم مُنْتِج لـ @ar
toolkit definition: تجسيدة غير منشورة لها اسم وكيل مسئول عن التدوين، والتأليف، والإنشاء، الخ. @ar
label: és nom de productor de @ca
definition: Relaciona un nomen amb una manifestació que no és publicada i que té un nom d’agent el qual és responsable de la inscripció, la fabricació, la construcció, etc. @ca
toolkit label: nom de productor de @ca
toolkit definition: Manifestació que no és publicada i que té un nom d’agent el qual és responsable de la inscripció, la fabricació, la construcció, etc. @ca
label: er navn på producer af @da
definition: Relaterer et nomen til en manifestation, som ikke er publiceret og som har navn på agent, som er ansvarlig for indskrivning, fremstilling, konstruktion ect. @da
toolkit label: navn på producer af @da
toolkit definition: Manifestation, som ikke er publiceret og som har navn på agent, som er ansvarlig for indskrivning, fremstilling, konstruktion ect. @da
label: tootja nimi kehastuses @et
definition: Seostab nomen'i avaldamata kehastusega, milles on inskribeerimise, tootmise, ehitamise vms eest vastutava tegija nimi. @et
toolkit label: tootja nimi kehastuses @et
toolkit definition: Avaldamata kehastus, milles on inskribeerimise, tootmise, ehitamise vms eest vastutava tegija nimi. @et
label: ist Erzeugername von @de
definition: Setzt ein Nomen in Beziehung zu einer unveröffentlichten Manifestation, die über einen Namen eines Akteurs verfügt, der für das Gravieren, Fabrizieren, Konstruieren und so weiter verantwortlich ist. @de
toolkit label: Erzeugername von @de
toolkit definition: Eine unveröffentlichte Manifestation, die über einen Namen eines Akteurs verfügt, der für das Gravieren, Fabrizieren, Konstruieren und so weiter verantwortlich ist. @de
label: neve a következő előállítójának: @hu
definition: Egy noment hozzákapcsol egy közzé nem tett megjelenési formához, amelyhez tartozik egy olyan ágensnek a neve, aki/amely felelős bejegyzésért, gyártásért, kivitelezésért. @hu
toolkit label: neve a következő előállítójának: @hu
toolkit definition: Egy közzé nem tett megjelenési forma, amelyhez tartozik egy olyan ágensnek a neve, aki/amely felelős bejegyzésért, gyártásért, kivitelezésért. @hu
label: è nome di produttore di @it
definition: Correla un nomen a una manifestazione non pubblicata che ha un nome di agente che è responsabile per l'incisione, fabbricazione, costruzione, etc. @it
toolkit label: nome di produttore di @it
toolkit definition: Una manifestazione non pubblicata che ha un nome di agente che è responsabile per l'incisione, fabbricazione, costruzione, etc. @it
label: ir izgatavotāja vārds/nosaukums manifestācijai @lv
toolkit label: ir izgatavotāja vārds/nosaukums manifestācijai @lv
definition: Sasaista nomenu ar manifestāciju, kas ir nepublicēta un kurai ir aģenta vārds/nosaukums, kurš ir atbildīgs par pierakstīšanu, izgatavošanu, izveidošanu u.tml. @lv
toolkit definition: Manifestācija, kas ir nepublicēta un kurai ir aģenta vārds/nosaukums, kurš ir atbildīgs par pierakstīšanu, izgatavošanu, izveidošanu u.tml. @lv
label: 是……的制作者的名称 @zh-hans
toolkit label: ……的制作者的名称 @zh-hans
definition: 将一种命名与非出版并有负责镌刻、制造、构建等的行为者的名称的一种载体表现关联起来。 @zh-hans
toolkit definition: 非出版并有负责镌刻、制造、构建等的行为者的名称的一种载体表现 @zh-hans
has subproperty: is parallel name of producer of
has subproperty: P80117
label: yapımcısının adıdır @tr
toolkit label: Yapımcı adı @tr
definition: Bir ismi, yazım, üretim, yapım vb.den sorumlu olan temsilcinin adına sahip, yayınlanmamış bir gösterimle ilişkilendirir. @tr
toolkit definition: Yazım, üretim, yapım vb. işlerden sorumlu olan bir temsilcinin adı ile yayınlanmamış bir gösterim. @tr

is name of publisher of
status: Published
type: Property
lexical alias: nameOfPublisherOf.en
domain: C10012
toolkit label: name of publisher of
sub property of: is name of agent of manifestation of
has element type: 2
definition: Relates a nomen to a manifestation that is published that has a name of agent who is responsible for publication.
toolkit definition: A manifestation that is published that has a name of agent who is responsible for publication.
scope note: Publication includes release and issuance.
label: nimi kustantajalle @fi
definition: Liittää nomenin julkaistuun manifestaatioon, jolla on kustantamisesta vastaavan toimijan nimi. @fi
scope note: Kustantaminen pitää sisällään myös julkaisemisen ja ilmestymisen. @fi
toolkit label: nimi kustantajalle @fi
toolkit definition: Julkaistu manifestaatio, jolla on kustantamisesta vastaavan toimijan nimi. @fi
label: er navn på utgiver for @no
definition: Relaterer et nomen til en manifestasjon som er publisert som har et navn på en agent som er ansvarlig for dens publisering. @no
scope note: Publisering inkluderer tilgjengeliggjøring og utstedelse. @no
toolkit label: navn på utgiver for @no
toolkit definition: En manifestasjon som er publisert som har et navn på en agent som er ansvarlig for dens publisering. @no
label: est un nom d’éditeur de @fr
definition: Met un nomen en relation avec une manifestation publiée qui possède un nom d’agent responsable de la publication. @fr
scope note: La publication comprend la mise à disposition et l’édition. @fr
toolkit label: nom d’éditeur de @fr
toolkit definition: Manifestation publiée qui possède un nom d’agent responsable de la publication. @fr
label: is naam van uitgever van @nl
definition: Relateert een nomen aan een manifestatie die gepubliceerd is die een naam van actor heeft die verantwoordelijk is voor publicatie. @nl
scope note: Uitgeven omvat uitbrengen en uitvaardigen. @nl
toolkit label: naam van uitgever van @nl
toolkit definition: Een manifestatie die gepubliceerd is die een naam van actor heeft die verantwoordelijk is voor publicatie. @nl
label: هو اسم ناشر لـ @ar
definition: يربط تسمية بتجسيدة منشورة لها اسم وكيل مسئول عن النشر. @ar
scope note: النشر يشمل التحرير والإصدار. @ar
toolkit label: اسم ناشر لـ @ar
toolkit definition: تجسيدة منشورة لها اسم وكيل مسئول عن النشر. @ar
label: és nom d’editor de @ca
definition: Relaciona un nomen amb una manifestació que es publica i que té un nom d’agent el qual és responsable de la publicació. @ca
scope note: Publicació inclou la posada en circulació i l’emissió. @ca
toolkit label: nom d’editor de @ca
toolkit definition: Manifestació que es publica i que té un nom d’agent el qual és responsable de la publicació. @ca
label: er navn på udgiver af @da
definition: Relaterer et nomen til en manifestation, som er publiceret og som har navn på agent, som er ansvarlig for dens publikation. @da
scope note: Publikation omfatter frigivelse og udstedelse. @da
toolkit label: navn på udgiver af @da
toolkit definition: Manifestation, som er publiceret og som har navn på agent, som er ansvarlig for dens publikation. @da
label: kirjastaja nimi kehastuses @et
definition: Seostab nomen'i avaldatud kehastusega, milles on avaldamise eest vastutava tegija nimi. @et
scope note: Avaldamine hõlmab ka väljalaskmist ja väljaandmist. @et
toolkit label: kirjastaja nimi kehastuses @et
toolkit definition: Avaldatud kehastus, milles on avaldamise eest vastutava tegija nimi. @et
label: ist Verlagsname von @de
definition: Setzt ein Nomen in Beziehung zu einer veröffentlichten Manifestation, die einen Namen eines Akteurs enthält, der für die Veröffentlichung verantwortlich ist. @de
scope note: Darunter fallen Freigaben und Herausgaben. @de
toolkit label: Verlagsname von @de
toolkit definition: Eine veröffentlichte Manifestation, die einen Namen eines Akteurs enthält, der für die Veröffentlichung verantwortlich ist. @de
label: neve a következő kiadójának: @hu
definition: Egy noment hozzákapcsol egy közzétett megjelenési formához , amelyhez tartozik egy olyan ágensnek a neve, aki/amely felelős annak kiadványáért. @hu
scope note: A közzététel megjelenést és kibocsátást foglal magába. @hu
toolkit label: neve a következő kiadójának: @hu
toolkit definition: Egy közzétett megjelenési forma, amelyhez tartozik egy olyan ágensnek a neve, aki/amely felelős annak kiadványáért. @hu
label: è nome di editore di @it
definition: Correla un nomen a una manifestazione pubblicata che ha un nome di agente che è responsabile della sua pubblicazione. @it
scope note: La pubblicazione comprende la distribuzione e l'emissione. @it
toolkit label: nome di editore di @it
toolkit definition: Una manifestazione pubblicata che ha un nome di agente che è responsabile della sua pubblicazione. @it
label: ir izdevēja vārds/nosaukums manifestācijai @lv
toolkit label: ir izdevēja vārds/nosaukums manifestācijai @lv
definition: Sasaista nomenu ar manifestāciju, kas ir publicēta un kurai ir aģenta vārds/nosaukums, kurš ir atbildīgs par tās publicēšanu. @lv
toolkit definition: Manifestācija, kas ir publicēta un kurai ir aģenta vārds/nosaukums, kurš ir atbildīgs par tās publicēšanu. @lv
scope note: Publicēšana ir izlaišana vai izdošana. @lv
label: 是……的出版者的名称 @zh-hans
toolkit label: ……的出版者的名称 @zh-hans
definition: 将一个命名与已经出版并有负责出版的行为者的名称的一种载体表现关联起来。 @zh-hans
toolkit definition: 已经出版并有负责出版的行为者的名称的一种载体表现 @zh-hans
scope note: 出版包括发布。 @zh-hans
has subproperty: is parallel name of publisher of
has subproperty: P80118
label: yayıncısının adıdır @tr
toolkit label: Yayıncı adı @tr

is name of RDA entity of
status: Published
type: Property
lexical alias: nameOfRDAEntityOf.en
definition: Relates a nomen to an RDA entity that has an appellation of RDA entity in natural language and phrasing used in common discourse.
domain: C10012
toolkit label: name of RDA entity of
toolkit definition: An RDA entity that has an appellation of RDA entity in natural language and phrasing used in common discourse.
has element type: 2
sub property of: is appellation of RDA entity of
label: nimi RDA-entiteetille @fi
definition: Liittää nomenin RDA-entiteettiin, jolla on luonnollisen kielen ja yleisen diskurssin sanamuodon mukainen nimitys. @fi
toolkit label: nimi RDA-entiteetille @fi
toolkit definition: RDA-entiteetti, jolla on luonnollisen kielen ja yleisen diskurssin sanamuodon mukainen nimitys. @fi
label: er navn for RDA-entitet for @no
definition: Relaterer et nomen til en RDA-entitet som har en betegnelse for RDA-entitet på en naturlig språk og med frasering brukt i alminnelig diskurs. @no
toolkit label: navn for RDA-entitet for @no
toolkit definition: En RDA-entitet som har en betegnelse for RDA-entitet på en naturlig språk og med frasering brukt i alminnelig diskurs. @no
label: est un nom d’entité RDA de @fr
definition: Met un nomen en relation avec une entité RDA qui possède une appellation d’entité RDA exprimée dans un langage et une formulation naturels et utilisée dans le langage courant. @fr
toolkit label: nom d’entité RDA de @fr
toolkit definition: Entité RDA qui possède une appellation d’entité RDA exprimée dans un langage et une formulation naturels et utilisée dans le langage courant. @fr
label: is naam van RDA-entiteit van @nl
definition: Relateert een nomen aan een RDA-entiteit die een benaming van RDA-entiteit heeft in natuurlijke taal en terminologie in gebruikelijke bewoording. @nl
toolkit label: naam van RDA-entiteit van @nl
toolkit definition: Een RDA-entiteit die een benaming van RDA-entiteit heeft in natuurlijke taal en terminologie in gebruikelijke bewoording. @nl
label: هو اسم كيان "وام" لـ @ar
definition: يربط تسمية بكيان "وام" له اسم لكيان "وام" في لغة طبيعية مستخدم في الخطاب العام. @ar
toolkit label: اسم كيان "وام" لـ @ar
toolkit definition: كيان "وام" له اسم لكيان "وام" في لغة طبيعية مستخدم في الخطاب العام. @ar
label: és nom d’entitat RDA de @ca
definition: Relaciona un nomen amb una entitat RDA que té una apel·lació d’entitat RDA en llenguatge i frases naturals usada en el discurs comú. @ca
toolkit label: nom d’entitat RDA de @ca
toolkit definition: Entitat RDA que té una apel·lació d’entitat RDA en llenguatge i frases naturals usada en el discurs comú. @ca
label: er navn på RDA-entitet af @da
definition: Relaterer et nomen til en RDA-entitet, som har en benævnelse på RDA-entitet på normalsprog og med formuleringer, som bruges alment. @da
toolkit label: navn på RDA-entitet af @da
toolkit definition: RDA-entitet, som har en benævnelse på RDA-entitet på normalsprog og med formuleringer, som bruges alment. @da
label: nimi RDA olemile @et
definition: Seostab nomen'i RDA olemiga, millel on nimetus loomulikus keeles ja sõnastuses, mida kasutatakse ühises diskursuses. @et
toolkit label: nimi RDA olemile @et
toolkit definition: RDA olem, millel on nimetus loomulikus keeles ja sõnastuses, mida kasutatakse ühises diskursuses. @et
label: ist Name einer RDA-Entität von @de
definition: Setzt ein Nomen in Beziehung zu einer RDA-Entität, die über eine Bezeichnung für eine RDA-Entität in natürlicher Sprache und Ausdrucksweise verfügt, die beim normalen Sprechen und Schreiben verwendet wird. @de
toolkit label: Name einer RDA-Entität von @de
toolkit definition: Eine RDA-Entität, die über eine Bezeichnung für eine RDA-Entität in natürlicher Sprache und Ausdrucksweise verfügt, die beim normalen Sprechen und Schreiben verwendet wird. @de
label: RDA-entitás neve a következőnek: @hu
definition: Hozzákapcsol egy noment egy RDA-entitáshoz, amelynek van egy RDA-entitás-megnevezése természetes nyelven és közbeszédben használt kifejezéssel. @hu
toolkit label: RDA-entitás neve: @hu
toolkit definition: Egy RDA-entitás, amelynek van egy RDA-entitás-megnevezése természetes nyelven és közbeszédben használt kifejezéssel. @hu
label: è nome dell'entità RDA di @it
definition: Correla un nomen a un'entità RDA che ha una designazione di entità RDA in linguaggio e frasi naturali usati nel discorso comune. @it
toolkit label: nome dell'entità RDA di @it
toolkit definition: Un'entità RDA che ha una designazione di entità RDA in linguaggio e frasi naturali usati nel discorso comune. @it
label: ir nosaukums RDA entītei @lv
definition: Sasaista nomenu ar RDA entīti, kurai ir Sasaista nomenu ar RDA entītis apzīmējums dabiskajā valodā, ko izmanto savstarpējā saziņā. @lv
toolkit label: nosaukums RDA entītei @lv
toolkit definition: RDA entīte, kurai ir RDA entītes apzīmējums dabiskajā valodā, ko izmanto savstarpējā saziņā. @lv
label: 是……的RDA实体的名称 @zh-hans
definition: 将一个命名与有用自然语言和普通话语措词表达的RDA实体称谓的一个RDA实体关联起来。 @zh-hans
toolkit label: ……的RDA实体的名称 @zh-hans
toolkit definition: 有用自然语言和普通话语措词表达的RDA实体称谓的一个RDA实体 @zh-hans
has subproperty: is name of agent of
has subproperty: is name of place of
has subproperty: is name of timespan of
has subproperty: is preferred name of RDA entity of
has subproperty: is title of expression of
has subproperty: is title of item of
has subproperty: is title of manifestation of
has subproperty: is title of work of
has subproperty: is variant name of RDA entity of
has subproperty: P80161
label: RDA varlığının adıdır @tr
definition: Bir ismi, doğal dilde ve yaygın söylemde kullanılan ifadelerde RDA varlığı olarak adlandırılan bir RDA varlığıyla ilişkilendirir. @tr
toolkit label: RDA varlığının adı @tr
toolkit definition: Doğal dilde ve yaygın söylemde kullanılan ifadelerde RDA varlığı unvanına sahip bir RDA varlığı. @tr

is name of timespan of
status: Published
type: Property
lexical alias: nameOfTimespanOf.en
definition: Relates a nomen to a timespan that has an appellation of timespan in natural language and phrasing used in common discourse.
domain: C10012
toolkit label: name of timespan of
toolkit definition: A timespan that has an appellation of timespan in natural language and phrasing used in common discourse.
sub property of: is appellation of timespan of
has element type: 2
sub property of: is name of RDA entity of
label: nimi ajanjaksolle @fi
definition: Liittää nomenin ajanjaksoon, jolla on luonnollisen kielen ja yleisen diskurssin sanamuodon mukainen nimitys. @fi
toolkit label: nimi ajanjaksolle @fi
toolkit definition: Ajanjakso, jolla on luonnollisen kielen ja yleisen diskurssin sanamuodon mukainen nimitys. @fi
label: er navn på tidsrom for @no
definition: Relaterer et nomen til et tidsrom som har en betegnelse for tidsrom på et naturlig språk og med frasering brukt i alminnelig diskurs. @no
toolkit label: navn på tidsrom for @no
toolkit definition: Et tidsrom som har en betegnelse for tidsrom på et naturlig språk og med frasering brukt i alminnelig diskurs. @no
label: est un nom de laps de temps de @fr
definition: Met un nomen en relation avec un laps de temps qui possède une appellation de laps de temps exprimée dans un langage et une formulation naturels et utilisée dans le langage courant. @fr
toolkit label: nom de laps de temps de @fr
toolkit definition: Laps de temps qui possède une appellation de laps de temps exprimée dans un langage et une formulation naturels et utilisée dans le langage courant. @fr
label: is naam van tijdspanne van @nl
definition: Relateert een nomen aan een tijdspanne die een benaming van tijdspanne heeft in natuurlijke taal en terminologie in gebruikelijke bewoording. @nl
toolkit label: naam van tijdspanne van @nl
toolkit definition: Een tijdspanne die een benaming van tijdspanne heeft in natuurlijke taal en terminologie in gebruikelijke bewoording. @nl
label: هو اسم فترة زمنية لـ @ar
definition: يربط تسمية بفترة زمنية لها اسم فترة زمنية في اللغة الطبيعية وفي العبارات المستخدمة في الخطاب العام. @ar
toolkit label: اسم فترة زمنية لـ @ar
toolkit definition: فترة زمنية لها اسم فترة زمنية في اللغة الطبيعية وفي العبارات المستخدمة في الخطاب العام. @ar
label: és nom d’interval de temps de @ca
definition: Relaciona un nomen amb un interval de temps que té una apel·lació d’interval de temps en llenguatge i frases naturals usada en el discurs comú. @ca
toolkit label: nom d’interval de temps de @ca
toolkit definition: Interval de temps que té una apel·lació d’interval de temps en llenguatge i frases naturals usada en el discurs comú. @ca
label: er navn på tidsperiode af @da
definition: Relaterer et nomen til en tidsperiode, som har en benævnelse på tidsperiode på normalsprog og med formuleringer, som bruges alment. @da
toolkit label: navn på tidsperiode af @da
toolkit definition: Tidsperiode, som har en benævnelse på tidsperiode på normalsprog og med formuleringer, som bruges alment. @da
label: nimi ajavahemikule @et
definition: Seostab nomen'i ajavahemikuga, millel on nimetus loomulikus keeles ja sõnastuses, mida kasutatakse ühises diskursuses. @et
toolkit label: nimi ajavahemikule @et
toolkit definition: Ajavahemik, millel on nimetus loomulikus keeles ja sõnastuses, mida kasutatakse ühises diskursuses. @et
label: ist Name eines Zeitraums von @de
definition: Setzt ein Nomen in Beziehung zu einem Zeitraum, der über eine Bezeichnung für einen Zeitraum in natürlicher Sprache und Ausdrucksweise verfügt, die beim normalen Sprechen und Schreiben verwendet wird. @de
toolkit label: Name eines Zeitraums von @de
toolkit definition: Ein Zeitraum, der über eine Bezeichnung für einen Zeitraum in natürlicher Sprache und Ausdrucksweise verfügt, die beim normalen Sprechen und Schreiben verwendet wird. @de
label: időtartamneve a következőnek: @hu
definition: Hozzákapcsol egy noment egy időtartamhoz, amelynek van egy időtartamhoz tartozó megnevezése természetes nyelven és közbeszédben használt kifejezéssel. @hu
toolkit label: időtartamneve: @hu
toolkit definition: Egy időtartam, amelynek van egy időtartamhoz tartozó megnevezése természetes nyelven és közbeszédben használt kifejezéssel. @hu
label: è nome di arco di tempo di @it
definition: Correla un nomen a un arco di tempo che ha una designazione di arco di tempo in linguaggio e frasi naturali usati nel discorso comune. @it
toolkit label: nome di arco di tempo di @it
toolkit definition: Un arco di tempo che ha una designazione di arco di tempo in linguaggio e frasi naturali usati nel discorso comune. @it
label: ir nosaukums laikposmam @lv
definition: Sasaista nomenu ar laikposmu, kam ir apzīmējums dabiskā valodā un teicienos, ko izmanto sarunvalodā. @lv
toolkit label: nosaukums laikposmam @lv
toolkit definition: Laikposms, kam ir apzīmējums dabiskā valodā un teicienos, ko izmanto sarunvalodā. @lv
label: 是……的时间段的名称 @zh-hans
definition: 将一个命名与有用自然语言和普通话语措词表达的时间段的称谓的一个时间段关联起来。 @zh-hans
toolkit label: ……的时间段的名称 @zh-hans
toolkit definition: 有用自然语言和普通话语措词表达的时间段的称谓的一个时间段 @zh-hans
has subproperty: is preferred name of timespan of
has subproperty: is variant name of timespan of
has subproperty: P80044
label: zaman aralığının adıdır @tr
definition: Bir ismi, doğal dilde ve ortak söylemde kullanılan ifadelerde zaman aralığı yakıştırması olan bir zaman aralığı ile ilişkilendirir. @tr
toolkit label: zaman aralığının adı @tr
toolkit definition: Doğal dilde ve ortak söylemde kullanılan bir zaman aralığının unvanı sahip olan bir zaman aralığı. @tr

is nomen described by
status: Published
definition: Relates a nomen to a work that describes a nomen.
toolkit label: nomen described by
toolkit definition: A work that is a description of a nomen.
type: Property
domain: C10012
sub property of: is subject nomen of
has element type: 2
label: nomenia kuvaava teos @fi
definition: Liittää nomenin teokseen, joka kuvaa nomenia. @fi
toolkit label: nomenia kuvaava teos @fi
toolkit definition: Teos, joka kuvaa nomenia. @fi
label: er nomen beskrevet i @no
definition: Relaterer et nomen til et verk som beskriver et nomen. @no
toolkit label: nomen beskrevet i @no
toolkit definition: Et verk som beskriver et nomen. @no
label: est un nomen décrit par @fr
definition: Met un nomen en relation avec une œuvre qui consiste en une description d’un nomen. @fr
toolkit label: nomen décrit par @fr
toolkit definition: Œuvre qui consiste en une description d’un nomen. @fr
label: is nomen beschreven in @nl
definition: Relateert een nomen aan een werk dat een nomen beschrijft. @nl
toolkit label: nomen beschreven in @nl
toolkit definition: Een werk dat een nomen beschrijft. @nl
label: هي تسمية موصوفة في @ar
definition: يربط تسمية بعمل يصف تسمية. @ar
toolkit label: تسمية موصوفة في @ar
toolkit definition: عمل يصف تسمية. @ar
label: és nomen descrit per @ca
definition: Relaciona un nomen amb una obra que descriu un nomen. @ca
toolkit label: nomen descrit per @ca
toolkit definition: Obra que és una descripció d’un nomen. @ca
definition: Relaterer et nomen til et værk, som beskriver et nomen. @da
toolkit label: nomen beskrevet i @da
toolkit definition: Værk, som beskriver et nomen. @da
label: nomen'i kirjeldus @et
definition: Seostab nomen'i teosega, milles nomen'it kirjeldatakse. @et
toolkit label: nomen'i kirjeldus @et
toolkit definition: Teos, milles nomen'it kirjeldatakse. @et
label: ist Nomen beschrieben in @de
definition: Setzt ein Nomen in Beziehung zu einem Werk, das ein Nomen beschreibt. @de
toolkit label: Nomen beschrieben in @de
toolkit definition: Ein Werk, das ein Nomen beschreibt. @de
label: nomen leírva a következőben: @hu
definition: Hozzákapcsol egy noment egy műhöz, amelyet egy noment ír le. @hu
toolkit label: nomen leírva a következőben: @hu
toolkit definition: Egy mű, amely leír egy noment. @hu
label: è nomen descritto in @it
definition: Correla un nomen a un'opera che che descrive un nomen. @it
toolkit label: nomen descritto in @it
toolkit definition: Un'opera che che descrive un nomen. @it
alternative label: nomen described in
lexical alias: nomenDescribedBy.en
label: ir nomena apraksts @lv
definition: Sasaista nomenu ar darbu, kurā aprakstīts konkrētais nomens. @lv
toolkit label: nomena apraksts @lv
toolkit definition: Darbs, kurā aprakstīts konkrētais nomens. @lv
alternative label: nomenia kuvattu teoksessa @fi
alternative label: 被描述于……的命名 @zh-hans
label: 是被……描述的命名 @zh-hans
definition: 将一个命名与作为一个命名之描述的一种作品关联起来。 @zh-hans
toolkit label: 被……描述的命名 @zh-hans
toolkit definition: 作为一个命名之描述的一种作品 @zh-hans
alternative label: nomen descrit en @ca
alternative label: nomen décrit dans @fr
has subproperty: is nomen described with metadata by
has subproperty: P80178
alternative label: tanımlanan isim @tr
label: tarafından tanımlanan isimdir @tr
definition: Bir ismi, bir niteleyici isim tanımlayan bir eserle ilişkilendirir. @tr
toolkit label: Tarafından tanımlanan isim @tr
toolkit definition: Bir ismin tanımı olan bir eser @tr

has nomen string
status: Published
type: Property
lexical alias: nomenString.en
definition: Relates a nomen to the combination of signs that forms an appellation associated with an entity.
scope note: The string can be expressed as a notation in any form, such as a combination of signs within a writing system, chemical structure symbols, mathematical notation, or by any other kind of sign, such as sounds, etc.
domain: C10012
toolkit label: nomen string
toolkit definition: The combination of signs that forms an appellation associated with an entity.
has element type: 6
label: nomenin merkkijono @fi
definition: Liittää nomenin merkkien yhdistelmään, joka muodostaa entiteettiin liittyvän nimityksen. @fi
scope note: Merkkijono voidaan ilmaista missä merkkijärjestelmässä tahansa, kuten kirjoitusjärjestelmän merkkien yhdistelmänä, kemiallisen rakenteen symboleina, matemaattisena lukujärjestelmänä tai muina merkkeinä, esim. ääninä. @fi
toolkit label: nomenin merkkijono @fi
toolkit definition: Merkkien yhdistelmä, joka muodostaa entiteettiin liittyvän nimityksen. @fi
label: har nomenstreng @no
definition: Relaterer et nomen til en kombinasjon av tegn som danner en betegnelse som forbindes med en entitet. @no
scope note: Strengen kan uttrykkes som en notasjon i hvilken som helst form, som en kombinasjon av tegn innen et skriftlig system, kjemiske struktursymboler, matematisk notasjon, eller ved andre typer tegn som lyder etc. @no
toolkit label: nomenstreng @no
toolkit definition: En kombinasjon av tegn som danner en betegnelse som forbindes med en entitet. @no
label: a pour chaîne de nomen @fr
definition: Met un nomen en relation avec une combinaison de signes qui forme une appellation associée à une entité. @fr
scope note: La chaîne peut être exprimée sous n’importe quelle forme de notation, telle qu’une combinaison de signes dans un système d’écriture, de symboles de structure chimique, de notation mathématique ou de tout autre type de signe, tel que des sons, etc. @fr
toolkit label: chaîne de nomen @fr
toolkit definition: Combinaison de signes qui forme une appellation associée à une entité. @fr
label: heeft nomenstring @nl
definition: Relateert een nomen aan de combinatie van tekens die een benaming vormen geassocieerd met een entiteit. @nl
scope note: De string kan uitgedrukt worden als een notatie in elke vorm, zoals een combinatie van tekens binnen alfabet, symbolen voor chemische structuren, wiskundige notatie of door andere soorten tekens, zoals geluiden etc. @nl
toolkit label: nomenstring @nl
toolkit definition: De combinatie van tekens die een benaming vormen geassocieerd met een entiteit. @nl
label: لها شريط بيانات التسمية @ar
definition: يربط تسمية بمجموعة علامات تُكوِّن اسما ذا صلة بكيان. @ar
scope note: سلسلة يمكن التعبير عنها برموز من أي شكل، مثل مجموعة علامات في نظام للكتابة، أو في رموز تركيبة كيميائية، أو تدوين رياضي، أو بأي نوع أخر من العلامات، مثل الأصوات، الخ. @ar
toolkit label: شريط بيانات التسمية @ar
toolkit definition: مجموعة علامات تشكل تسمية ذات صلة بكيان. @ar
label: té com a cadena de nomen @ca
definition: Relaciona un nomen amb la combinació de signes que forma una apel·lació associada a una entitat. @ca
scope note: La cadena es pot expressar com una notació en qualsevol forma com ara una combinació de signes dins un sistema d’escriptura, símbols d’estructura química, notació matemàtica, o per qualsevol altre tipus de signes, com ara sons, etc. @ca
toolkit label: cadena de nomen @ca
toolkit definition: Combinació de signes que forma una apel·lació associada a una entitat. @ca
definition: Relaterer et nomen til en kombination af tegn, som danner en benævnelse tilknyttet en entitet. @da
scope note: Strengen kan udtrykkes som en notation i hvilken som helst form, såsom en kombination af tegn fra et skriftsystem, kemiske struktursymboler, matematisk notation eller ved enhver anden form for tegn, såsom lyde etc. @da
toolkit definition: Kombination af tegn, som danner en benævnelse tilknyttet en entitet. @da
label: nomen'i string @et
definition: Seostab nomen'i märgikombinatsiooniga, mis moodustab olemiga seotud nimetuse. @et
scope note: Märgijada võib olla väljendatud mis tahes vormis notatsiooniga, nt kirjasüsteemi märkide kombinatsiooniga, keemilise struktuuri sümbolitega, matemaatika notatsiooniga, või muud liiki märkidega, nt helidega. @et
toolkit label: nomen'i string @et
toolkit definition: Märgikombinatsioon, mis moodustab olemiga seotud nimetuse. @et
label: hat Nomen-Zeichenkette @de
definition: Setzt ein Nomen in Beziehung zu einer Kombination von Zeichen, die eine Bezeichnung bildet, die mit einer Entität in Verbindung steht. @de
scope note: Die Zeichenkette kann als Notation in beliebiger Form ausgedrückt werden, zum Beispiel als eine Kombination von Zeichen innerhalb eines Schreibsystems, als Symbole einer chemischen Struktur, als mathematische Notation oder durch ein anderes beliebiges Zeichen, wie zum Beispiel Töne und so weiter. @de
toolkit label: Nomen-Zeichenkette @de
toolkit definition: Die Kombination von Zeichen, die eine Bezeichnung bildet, die mit einer Entität in Verbindung steht. @de
label: noment alkotó karakterlánca a következő: @hu
definition: Hozzákapcsol egy noment jelek kombinációjához, amely így egy entitással társított megnevezést formál. @hu
scope note: A karakterlánc kifejezhet bármilyen formában lévő jelölést, úgymint jelek kombinációja egy írásrendszerben, kémiai struktúra szimbólumai, matematikai jelölés vagy bármely más jel, például hangok stb. @hu
toolkit label: noment alkotó karakterlánca: @hu
toolkit definition: Jelek kombinációja, amely így egy entitással társított megnevezést formál. @hu
label: ha come stringa del nomen @it
definition: Correla un nomen alla combinazione di segni che forma una designazione associata con un'entità. @it
scope note: La stringa può essere espressa come una notazione in qualsiasi forma, come una combinazione di segni in un sistema di scrittura, formule chimiche, notazione matematica, o per mezzo di altri tipi di segni, come suoni, etc. @it
toolkit label: stringa del nomen @it
toolkit definition: La combinazione di segni che forma una designazione associata con un'entità. @it
label: nomena virkne @lv
definition: Sasaista nomenu ar zīmju kombināciju, kas veido ar entīti saistītu apzīmējumu. @lv
scope note: Virkne var tikt izteikta kā apzīmējums jebkurā formā, piemēram, zīmju kombinācijā, ķīmiskās struktūras simbolus, matemātisko apzīmējumu vai jebkāda cita veida zīmes, piemēram, skaņas u.tml. @lv
toolkit label: nomena virkne @lv
toolkit definition: Zīmju kombinācija, kas veido ar entīti saistītu apzīmējumu. @lv
label: 有命名串 @zh-hans
definition: 将一个命名与和一个实体有关的形成一个称谓的符号的组合关联起来。 @zh-hans
scope note: 串可以被表达为任何形式的标记，例如一种书写体系内的记号的组合、化学结构符号、数学标记、或者诸如声音等任何其他种类的记号。 @zh-hans
toolkit label: 命名串 @zh-hans
toolkit definition: 和一个实体有关的形成一个称谓的符号的组合 @zh-hans
has subproperty: P80068
label: isim dizgesi ile ilişkilidir @tr
definition: Bir ismi, bir varlıkla ilişkili bir unvan oluşturan işaretlerin birleşimiyle ilişkilendirir. @tr
scope note: Dizi, bir yazı sistemindeki işaretlerin bir kombinasyonu, kimyasal yapı sembolleri, matematiksel gösterim veya sesler vb. gibi başka herhangi bir işaret türü gibi herhangi bir biçimde bir gösterim olarak ifade edilebilir. @tr
toolkit label: niteleyici isim dizisi @tr
toolkit definition: Bir varlıkla bağlantılı olan bir unvan oluşturan işaretlerin birleşimi. @tr

has note on nomen
status: Published
type: Property
lexical alias: noteOnNomen.en
definition: Relates a nomen to a broad unstructured description of one or more attributes of a nomen.
domain: C10012
toolkit label: note on nomen
toolkit definition: A broad unstructured description of one or more attributes of a nomen.
has element type: 6
sub property of: P00015
label: huomautus nomenista @fi
definition: Liittää nomenin yleisluonteiseen rakenteistamattomaan kuvailuun, joka sisältää nomenin yhden tai useamman attribuutin. @fi
toolkit label: huomautus nomenista @fi
toolkit definition: Yleisluonteinen rakenteistamaton kuvailu, joka sisältää nomenin yhden tai useamman attribuutin. @fi
label: har note for nomen @no
definition: Relaterer et nomen til en bred, ustrukturert beskrivelse av ett eller flere attributter for et nomen. @no
toolkit label: note for nomen @no
toolkit definition: En bred, ustrukturert beskrivelse av ett eller flere attributter for et nomen. @no
label: a pour note sur un nomen @fr
definition: Met un nomen en relation avec une description non structurée générale d’un ou plusieurs attributs d’un nomen. @fr
toolkit label: note sur un nomen @fr
toolkit definition: Description non structurée générale d’un ou plusieurs attributs d’un nomen. @fr
label: heeft noot bij nomen @nl
definition: Relateert een nomen aan een algemene ongestructureerde beschrijving van één of meer attributen van een nomen. @nl
toolkit label: noot bij nomen @nl
toolkit definition: Een algemene ongestructureerde beschrijving van één of meer attributen van een nomen. @nl
label: له تبصرة عن تسمية @ar
definition: يربط تسمية بوصف واسع غير محدد لخاصية أو أكثر من خصائص تسمية. @ar
toolkit label: تبصرة عن تسمية @ar
toolkit definition: وصف واسع غير محدد لخاصية أو أكثر من خصائص تسمية. @ar
label: té com a nota sobre un nomen @ca
definition: Relaciona un nomen amb una descripció no estructurada àmplia d’un o més atributs d’un nomen. @ca
toolkit label: nota sobre un nomen @ca
toolkit definition: Descripció no estructurada àmplia d’un o més atributs d’un nomen. @ca
label: har note om nomen @da
definition: Relaterer et nomen til en bred, ustruktureret beskrivelse af en eller flere af et nomens attributter. @da
toolkit label: note om nomen @da
toolkit definition: Bred, ustruktureret beskrivelse af en eller flere af et nomens attributter. @da
label: märkus nomen'i kohta @et
definition: Seostab nomen'i üldise struktureerimata kirjeldusega, mis iseloomustab üht või mitut nomen'i omadust. @et
toolkit label: märkus nomen'i kohta @et
toolkit definition: Üldine struktureerimata kirjeldus, mis iseloomustab üht või mitut nomen'i omadust. @et
label: hat Anmerkung zum Nomen @de
definition: Setzt ein Nomen in Beziehung zu einer umfassenden, unstrukturierten Beschreibung eines Merkmals oder mehrerer Merkmale eines Nomens. @de
toolkit label: Anmerkung zum Nomen @de
toolkit definition: Eine umfassende, unstrukturierte Beschreibung eines Merkmals oder mehrerer Merkmale eines Nomens. @de
label: nomenre vonatkozó megjegyzése a következő: @hu
definition: Hozzákapcsol egy noment egy nomen egy vagy több ismérvének szabad szöveges, strukturálatlan leírásához. @hu
toolkit label: nomenre vonatkozó megjegyzése: @hu
toolkit definition: Egy nomen egy vagy több ismérvének szabad szöveges, strukturálatlan leírása. @hu
label: ha come nota sul nomen @it
definition: Correla un nomen a una descrizione non strutturata più ampia di uno o più attributi di un nomen @it
toolkit label: nota sul nomen @it
toolkit definition: Una descrizione non strutturata più ampia di uno o più attributi di un nomen. @it
label: piezīme par nomenu @lv
definition: Sasaista nomenu ar plašu nestrukturētu nomena viena vai vairāku atribūtu aprakstu. @lv
toolkit label: piezīme par nomenu @lv
toolkit definition: Plašs nestrukturēts nomena viena vai vairāku atribūtu apraksts. @lv
label: 有关于命名的附注 @zh-hans
definition: 将一个命名与一个命名的一个或多个属性的宽泛的、非结构化的描述关联起来。 @zh-hans
toolkit label: 关于命名的附注 @zh-hans
toolkit definition: 一个命名的一个或多个属性的宽泛的、非结构化的描述 @zh-hans
has subproperty: P80071
label: isim hakkında not ile ilişkilidir @tr
definition: Bir ismi, bir niteleyici ismin bir veya daha fazla niteliğinin geniş, yapılandırılmamış bir tanımıyla ilişkilendirir. @tr
toolkit label: niteleyici isim not @tr
toolkit definition: Bir niteleyici ismin bir veya daha fazla niteliğinin yapılandırılmamış geniş tanımı. @tr

is numeric designation of musical work of
status: Published
type: Property
lexical alias: numericDesignationOfMusicalWorkOf.en
domain: C10012
toolkit label: numeric designation of musical work of
sub property of: is identifier for work of
has element type: 2
definition: Relates a nomen to a work that is a musical work that has an identifier for work that is a serial number, opus number, or thematic index number assigned to a musical work by a composer, publisher, or a musicologist.
toolkit definition: A work that is a musical work that has an identifier for work that is a serial number, opus number, or thematic index number assigned to a musical work by a composer, publisher, or a musicologist.
label: numerointi musiikkiteokselle @fi
definition: Liittää nomenin teokseen, joka on musiikkiteos, jolla on säveltäjän, julkaisijan tai musiikintutkijan antama järjestysnumero, opusnumero tai temaattinen teosluettelon numero teoksen tunnisteena. @fi
toolkit label: numerointi musiikkiteokselle @fi
toolkit definition: Teos, joka on musiikkiteos, jolla on säveltäjän, julkaisijan tai musiikintutkijan antama järjestysnumero, opusnumero tai temaattinen teosluettelon numero teoksen tunnisteena. @fi
label: er numerisk betegnelse for musikalsk verk for @no
definition: Relaterer et nomen til et musikalsk verk som har en identifikator for verk som er et serienummer, opusnummer eller et tematisk indeksnummer tildelt et musikals verk av en komponist, utgiver eller musikolog. @no
toolkit label: numerisk betegnelse for musikalsk verk for @no
toolkit definition: Et musikalsk verk som har en identifikator for verk som er et serienummer, opusnummer eller et tematisk indeksnummer tildelt et musikals verk av en komponist, utgiver eller musikolog. @no
label: est une désignation numérique d’une œuvre musicale de @fr
definition: Met un nomen en relation avec une œuvre musicale qui possède un identifiant d’œuvre consistant en un numéro d’ordre, un numéro d’opus ou un numéro de catalogue thématique attribué à une œuvre musicale par un compositeur, un éditeur ou un musicologue. @fr
toolkit label: désignation numérique d’une œuvre musicale de @fr
toolkit definition: Œuvre musicale qui possède un identifiant d’œuvre consistant en un numéro d’ordre, un numéro d’opus ou un numéro de catalogue thématique attribué à une œuvre musicale par un compositeur, un éditeur ou un musicologue. @fr
label: is numerieke aanduiding van muziekwerk van @nl
definition: Relateert een nomen aan een werk dat is een muziekwerk dat een identificatie voor werk heeft dat een serienummer is, een opusnummer of thematisch indexnummer toegekend aan een muziekwerk door een componist, uitgever of een musicoloog. @nl
toolkit label: numerieke aanduiding van muziekwerk van @nl
toolkit definition: Een werk dat is een muziekwerk dat een identificatie voor werk heeft dat een serienummer is, een opusnummer of thematisch indexnummer toegekend aan een muziekwerk door een componist, uitgever of een musicoloog. @nl
label: هو رمز رقمي لعمل موسيقى لـ @ar
definition: يربط تسمية بعمل عبارة عن عمل موسيقي له مُعرِّف لعمل عبارة عن رقم مسلسل، أو رقم قطعة موسيقية، أو رقم كشاف موضوعي مخصص لعمل موسيقى لملحن، أو ناشر، أو عالم في الموسيقى. @ar
toolkit label: رمز رقمي لعمل موسيقى لـ @ar
toolkit definition: عمل هو عمل موسيقي له مُعرِّف لعمل عبارة عن رقم مسلسل، أو رقم قطعة موسيقية، أو رقم كشاف موضوعي مُخصص لعمل موسيقى لملحن، أو لناشر، أو لعالم في الموسيقى. @ar
label: és designació numèrica d’una obra musical de @ca
definition: Relaciona un nomen amb una obra que és una obra musical que té un identificador d’obra que és un número d’ordre, un número d’opus o un número d’índex temàtic assignat a una obra musical per un compositor, un editor o un musicòleg. @ca
toolkit label: designació numèrica d’una obra musical de @ca
toolkit definition: Obra que és una obra musical que té un identificador d’obra que és un número d’ordre, un número d’opus o un número d’índex temàtic assignat a una obra musical per un compositor, un editor o un musicòleg. @ca
label: er numerisk betegnelse for musikværk af @da
definition: Relaterer et nomen til et musikværk, som har en identifikator for værk, som er et serienummer, opusnummer eller et tematisk indeksnummer tildelt et musikværk af en komponist, udgiver eller en musikolog. @da
toolkit label: numerisk betegnelse for musikværk af @da
toolkit definition: Musikværk, som har en identifikator for værk, som er et serienummer, opusnummer eller et tematisk indeksnummer tildelt et musikværk af en komponist, udgiver eller en musikolog. @da
label: muusikateose numbriline tähistus teoses @et
definition: Seostab nomen'i muusikateosega, millel on teose identifikaatoriks järjenumber, oopuse number või temaatilise kataloogi number, mille on muusikateosele andnud helilooja, kirjastaja või muusikateadlane. @et
toolkit label: muusikateose numbriline tähistus teoses @et
toolkit definition: Muusikateos, millel on teose identifikaatoriks järjenumber, oopuse number või temaatilise kataloogi number, mille on muusikateosele andnud helilooja, kirjastaja või muusikateadlane. @et
label: ist numerische Bezeichnung eines Musikwerks von @de
definition: Setzt ein Nomen in Beziehung zu einem Musikwerk, das über einen Identifikator für ein Werk verfügt, der eine laufende Nummer, eine Opus-Nummer oder eine Werkverzeichnisnummer darstellt, die einem Musikwerk durch eine Komponistin/einen Komponisten, einen Verlag oder eine Musikwissenschaftlerin/einen Musikwissenschaftler zugewiesen wird. @de
toolkit label: Numerische Bezeichnung eines Musikwerks von @de
toolkit definition: Ein Musikwerk, das über einen Identifikator für ein Werk verfügt, der eine laufende Nummer, eine Opus-Nummer oder eine Werkverzeichnisnummer darstellt, die einem Musikwerk durch eine Komponistin/einen Komponisten, einen Verlag oder eine Musikwissenschaftlerin/einen Musikwissenschaftler zugewiesen wird. @de
label: számjelzése a következő zeneműnek: @hu
definition: Hozzákapcsol egy noment egy zeneműhöz, amely rendelkezik egy olyan műazonosítóval, amely egy zeneszerzőtől, kiadótól vagy egy zenetudóstól származó, a zeneművet jelölő sorozati szám, opusszám vagy egy tematikus indexszám. @hu
toolkit label: számjelzése a következő zeneműnek: @hu
toolkit definition: Egy zenemű, amely rendelkezik egy olyan műazonosítóval, amely egy zeneszerzőtől, kiadótól vagy egy zenetudóstól származó, a zeneművet jelölő sorozati szám, opusszám vagy egy tematikus indexszám. @hu
label: è designazione numerica di opera musicale di @it
definition: Correla un nomen a un'opera musicale che ha un identificatore per l'opera che è un numero di serie numero di opus, o numero di indice tematico assegnato all'oopera musicla eda un compositore, editore o musicologo. @it
toolkit label: designazione numerica di opera musicale di @it
toolkit definition: Un'opera musicale che ha un identificatore per l'opera che è un numero di serie numero di opus, o numero di indice tematico assegnato all'opera musicla eda un compositore, editore o musicologo. @it
label: ir skaitlisks apzīmējums mūzikas darbam @lv
toolkit label: ir skaitlisks apzīmējums mūzikas darbam @lv
definition: Sasaista nomenu ar darbu, kas ir mūzikas darbs, kam ir darba identifikators, kas ir darba kārtas numurs, opusa numurs vai tematiskā rādītāja numurs, ko mūzikas darbam piešķīris komponists, izdevējs vai muzikologs. @lv
toolkit definition: Mūzikas darbs, kam ir darba identifikators, kas ir darba kārtas numurs, opusa numurs vai tematiskā rādītāja numurs, ko mūzikas darbam piešķīris komponists, izdevējs vai muzikologs. @lv
label: 是……的音乐作品的数字标识 @zh-hans
toolkit label: ……的音乐作品的数字标识 @zh-hans
definition: 将一个命名与作为一种音乐作品并有一个作品标识符（即作曲者、出版者或者音乐学家给作品分配的序列号、作品号或主题索引号）的一种作品关联起来。 @zh-hans
toolkit definition: 作为一种音乐作品并有一个作品标识符（即作曲者、出版者或者音乐学家给作品分配的序列号、作品号或主题索引号）的一种作品 @zh-hans
has subproperty: is opus number of
has subproperty: is serial number of musical work of
has subproperty: is thematic index number of
has subproperty: P80119
label: müzik eserinin sayısal tanımlamasıdır @tr
toolkit label: müzik eserinin sayısal tanımı @tr
definition: Bir ismi, bir bestecinin bestenin kronolojik sırasını gösteren eserler listesinden atanan sayısal bir müzik eseri atamasına sahip bir eserle ilişkilendirir. @tr
toolkit definition: Bir besteci, yayıncı veya bir müzikolog tarafından bir müzik eserine atanan seri numarası, eser numarası veya tematik dizin numarası gibi eser tanımlayıcısına sahip bir müzik eseri olan bir eser. @tr

is opus number of
status: Published
type: Property
lexical alias: opusNumberOf.en
domain: C10012
toolkit label: opus number of
sub property of: is numeric designation of musical work of
has element type: 2
definition: Relates a nomen to a work that has a numeric designation of musical work that is assigned from a list of works of a composer indicating chronological order of composition.
toolkit definition: A work that has a numeric designation of musical work that is assigned from a list of works of a composer indicating chronological order of composition.
label: opusnumero teokselle @fi
definition: Liittää nomenin teokseen, jolla on musiikkiteoksen numeerinen määrite, joka on sävellykset aikajärjestyksessä esittävästä säveltäjän teosluettelosta otettu numerointi. @fi
toolkit label: opusnumero teokselle @fi
toolkit definition: Teos, jolla on musiikkiteoksen numeerinen määrite, joka on sävellykset aikajärjestyksessä esittävästä säveltäjän teosluettelosta otettu numerointi. @fi
label: er opusnummer for @no
definition: Relaterer et nomen til et musikalsk verk som har en identifikator for verk som er en numerisk betegnelse som er angitt fra en liste over verk av en komponist som indikerer kronologisk rekkefølge over komposisjoner. @no
toolkit label: opusnummer for @no
toolkit definition: Et musikalsk verk som har en identifikator for verk som er en numerisk betegnelse som er angitt fra en liste over verk av en komponist som indikerer kronologisk rekkefølge over komposisjoner. @no
label: est un numéro d’opus de @fr
definition: Met un nomen en relation avec une œuvre qui possède une désignation numérique d’une œuvre musicale attribuée à partir d’une liste des œuvres d’un compositeur indiquant l’ordre chronologique de composition. @fr
toolkit label: numéro d’opus de @fr
toolkit definition: Œuvre qui possède une désignation numérique d’une œuvre musicale attribuée à partir d’une liste des œuvres d’un compositeur indiquant l’ordre chronologique de composition. @fr
label: is opusnummer van @nl
definition: Relateert een nomen aan een werk dat een numerieke aanduiding van muziekwerk heeft die is toegekend uit een lijst van werken van een componist die de chronologische volgorde van compositie aangeeft. @nl
toolkit label: opusnummer van @nl
toolkit definition: Een werk dat een numerieke aanduiding van muziekwerk heeft die is toegekend uit een lijst van werken van een componist die de chronologische volgorde van compositie aangeeft. @nl
label: هو رقم القطعة الموسيقية لـ @ar
definition: يربط تسمية بعمل له رمز رقمي لعمل موسيقي خُصص له من قائمة أعمال مؤلف موسيقي، يوضح الترتيب زمنى للقطع الموسيقية. @ar
toolkit label: رقم القطعة الموسيقية لـ @ar
toolkit definition: عمل له رمز رقمي لعمل موسيقي خُصص له من قائمة أعمال مؤلف موسيقي، يوضح الترتيب الزمنى للقطع الموسيقية. @ar
label: és número d’opus de @ca
definition: Relaciona un nomen amb una obra que té una designació numèrica d’obra musical que s’assigna a partir d’una llista d’obres d’un compositor indicant l’ordre cronològic de composició. @ca
toolkit label: número d’opus de @ca
toolkit definition: Obra que té una designació numèrica d’obra musical que s’assigna a partir d’una llista d’obres d’un compositor indicant l’ordre cronològic de composició. @ca
definition: Relaterer et nomen til et musikværk, som har en identifikator for værk, som er en numerisk betegnelse, tildelt udfra en liste over en komponists værker, som angiver den kronologiske rækkefølge for kompositionen. @da
toolkit definition: Musikværk, som har en identifikator for værk, som er en numerisk betegnelse, tildelt udfra en liste over en komponists værker, som angiver den kronologiske rækkefølge for kompositionen. @da
label: oopuse number teoses @et
definition: Seostab nomen'i muusikateosega, millel on teose identifikaatoriks muusikateose numbriline tähistus, mis on võetud helilooja teoste nimestikust ja näitab heliteose kronoloogilist järjestust. @et
toolkit label: oopuse number teoses @et
toolkit definition: Muusikateos, millel on teose identifikaatoriks muusikateose numbriline tähistus, mis on võetud helilooja teoste nimestikust ja näitab heliteose kronoloogilist järjestust. @et
label: ist Opus-Nummer von @de
definition: Setzt ein Nomen in Beziehung zu einem Werk, das über eine numerische Bezeichnung eines Musikwerks verfügt, die von einer Komponistin/einem Komponisten oder einem Verlag vergeben wird oder gemäß einem Nachschlagewerk oder Werkverzeichnis verwendet wird. Sie gibt meist Aufschluss über die chronologische Reihenfolge der Komposition innerhalb eines Gesamtwerks. @de
toolkit label: Opus-Nummer von @de
toolkit definition: Ein Werk, das über eine numerische Bezeichnung eines Musikwerks verfügt, die von einer Komponistin/einem Komponisten oder einem Verlag vergeben wird oder gemäß einem Nachschlagewerk oder Werkverzeichnis verwendet wird. Sie gibt meist Aufschluss über die chronologische Reihenfolge der Komposition innerhalb eines Gesamtwerks. @de
label: opusszáma a következőnek: @hu
definition: Hozzákapcsol egy noment egy műhöz, amely rendelkezik egy a zeneszerző műveinek jegyzékéből vett olyan zenemű-azonosítóval, amely egy számjelzéssel jelzi a kompozíció kronológiai sorrendjét. @hu
toolkit label: opusszáma: @hu
toolkit definition: Egy mű, amely rendelkezik egy a zeneszerző műveinek jegyzékéből vett olyan zenemű-azonosítóval, amely egy számjelzéssel jelzi a kompozíció kronológiai sorrendjét. @hu
label: è numero di opus di @it
definition: Correla un nomen a un'opera musicale che ha un identificatore per l'opera che è una designazione numerica assegnata da una lista di opere di un compositore che indica l'ordine cronologico di composizione. @it
toolkit label: numero di opus di @it
toolkit definition: Un'opera musicale che ha un identificatore per l'opera che è una designazione numerica assegnata da una lista di opere di un compositore che indica l'ordine cronologico di composizione. @it
label: ir opusa numurs @lv
toolkit label: ir opusa numurs @lv
definition: Sasaista nomenu ar darbu, kas ir mūzikas darbs, kam ir darba identifikators, kas piešķirts no komponista darbu saraksta, norādot kompozīcijas hronoloģisko secību. @lv
toolkit definition: Mūzikas darbs, kam ir darba identifikators, kas piešķirts no komponista darbu saraksta, norādot kompozīcijas hronoloģisko secību. @lv
label: 是……的作品号 @zh-hans
toolkit label: ……的作品号 @zh-hans
definition: 将一个命名与有根据作曲者作品列表分配、表示作曲时间顺序的音乐作品的数字标识的一种作品关联起来。 @zh-hans
toolkit definition: 有根据作曲者作品列表分配、表示作曲时间顺序的音乐作品的数字标识的一种作品 @zh-hans
has subproperty: P80120
label: opus numarasıdır @tr
toolkit label: Beste numarası @tr
definition: Bir ismi, bir bestecinin bestenin kronolojik sırasını gösteren eserler listesinden atanan sayısal bir müzik eseri atamasına sahip bir eserle ilişkilendirir. @tr
toolkit definition: Bir bestecinin eserlerinin kronolojik sırasını gösteren bir listeden atanan müzik eserinin sayısal bir tanımına sahip bir eser. @tr

is parallel name of distributor of
status: Published
type: Property
lexical alias: parallelNameOfDistributorOf.en
domain: C10012
toolkit label: parallel name of distributor of
sub property of: is name of distributor of
has element type: 2
definition: Relates a nomen to a manifestation that has a name of distributor in another language or script.
toolkit definition: A manifestation that has a name of distributor in another language or script.
label: rinnakkainen jakelijan nimi manifestaatiolle @fi
definition: Liittää nomenin manifestaatioon, jonka jakelijan nimi on toisella kielellä tai kirjoitusjärjestelmällä. @fi
toolkit label: rinnakkainen jakelijan nimi manifestaatiolle @fi
toolkit definition: Manifestaatio, jonka jakelijan nimi on toisella kielellä tai kirjoitusjärjestelmällä. @fi
label: er parallelt navn på distributør for @no
definition: Relaterer et nomen til en manifestasjon som har et navn på distributør på et annet språk eller i et annet skriftsystem. @no
toolkit label: parallelt navn på distributør for @no
toolkit definition: En manifestasjon som har et navn på distributør på et annet språk eller i et annet skriftsystem. @no
label: est une forme parallèle d’un nom de diffuseur ou de distributeur de @fr
definition: Met un nomen en relation avec une manifestation qui possède un nom de diffuseur ou de distributeur dans une autre langue ou écriture. @fr
toolkit label: forme parallèle d’un nom de diffuseur ou de distributeur de @fr
toolkit definition: Manifestation qui possède un nom de diffuseur ou de distributeur dans une autre langue ou écriture. @fr
label: is parallelle naam van distributeur van @nl
definition: Relateert een nomen aan een manifestatie die een naam van distributeur heeft in een andere taal of schrift. @nl
toolkit label: parallelle naam van distributeur van @nl
toolkit definition: Een manifestatie die een naam van distributeur heeft in een andere taal of schrift. @nl
label: هو اسم مواز لموزع لـ @ar
definition: يربط تسمية بتجسيدة لها اسم موزع في لغة أو في نص آخر. @ar
toolkit label: اسم مواز لموزع لـ @ar
toolkit definition: تجسيدة لها اسم موزع في لغة أو في نص آخر. @ar
label: és nom paral·lel de distribuïdor de @ca
definition: Relaciona un nomen amb una manifestació que té un nom de distribuïdor en una altra llengua o escriptura. @ca
toolkit label: nom paral·lel de distribuïdor de @ca
toolkit definition: Manifestació que té un nom de distribuïdor en una altra llengua o escriptura. @ca
label: er parallelt navn på distributør af @da
definition: Relaterer et nomen til en manifestation, som har et navn på distributør på et andet sprog eller skriftsystem. @da
toolkit label: parallelt navn på distributør af @da
toolkit definition: Manifestation, som har et navn på distributør på et andet sprog eller skriftsystem. @da
label: levitaja rööpnimi kehastuses @et
definition: Seostab nomen'i kehastusega, millel on levitaja nimi teises keeles või kirjasüsteemis. @et
toolkit label: levitaja rööpnimi kehastuses @et
toolkit definition: Kehastus, millel on levitaja nimi teises keeles või kirjasüsteemis. @et
label: ist paralleler Vertriebsname von @de
definition: Setzt ein Nomen in Beziehung zu einer Manifestation, die einen Vertriebsnamen in einer anderen Sprache oder einer anderen Schrift hat. @de
toolkit label: Paralleler Vertriebsname von @de
toolkit definition: Eine Manifestation, die einen Vertriebsnamen in einer anderen Sprache oder einer anderen Schrift hat. @de
label: terjesztő párhuzamos neve a következő: @hu
definition: Hozzákapcsol egy noment egy megjelenési formához, amely terjesztőjének van neve más nyelven vagy írásrendszerben. @hu
toolkit label: terjesztő párhuzamos neve a következő: @hu
toolkit definition: Egy megjelenési forma, amely terjesztőjének van neve más nyelven vagy írásrendszerben. @hu
label: è nome parallelo del distributore di @it
definition: Correla un nomen a una manifestazione che ha un nome di distributore in un'altra lingua o scrittura. @it
toolkit label: nome parallelo del distributore di @it
toolkit definition: Una manifestazione che ha un nome di distributore in un'altra lingua o scrittura. @it
label: ir izplatītāja paralēlais vārds/nosaukums @lv
toolkit label: ir izplatītāja paralēlais vārds/nosaukums @lv
definition: Sasaista nomenu ar manifestāciju, kam ir izplatītāja vārds/nosaukums citā valodā vai rakstībā. @lv
toolkit definition: Manifestācija, kam ir izplatītāja vārds/nosaukums citā valodā vai rakstībā. @lv
label: 是……的发行者的并列名称 @zh-hans
toolkit label: ……的发行者的并列名称 @zh-hans
definition: 将一个命名与有用另一种语言或文字的发行者名称的一种载体表现关联起来。 @zh-hans
toolkit definition: 有用另一种语言或文字的发行者名称的一种载体表现 @zh-hans
has subproperty: P80127
label: dağıtımcısının paralel adıdır @tr
toolkit label: dağıtıcısının paralel ismi @tr
definition: Bir isimı, başka bir dilde veya alfabede dağıtıcı adına sahip bir gösterimle ilişkilendirir. @tr
toolkit definition: Başka bir dilde veya alfabede dağıtıcı adına sahip bir gösterim. @tr

is parallel name of manufacturer of
status: Published
type: Property
lexical alias: parallelNameOfManufacturerOf.en
domain: C10012
toolkit label: parallel name of manufacturer of
sub property of: is name of manufacturer of
has element type: 2
definition: Relates a nomen to a manifestation that has a name of manufacturer in another language or script.
toolkit definition: A manifestation that has a name of manufacturer in another language or script.
label: rinnakkainen valmistajan nimi manifestaatiolle @fi
definition: Liittää nomenin manifestaatioon, jonka valmistajan nimi on toisella kielellä tai kirjoitusjärjestelmällä. @fi
toolkit label: rinnakkainen valmistajan nimi manifestaatiolle @fi
toolkit definition: Manifestaatio, jonka valmistajan nimi on toisella kielellä tai kirjoitusjärjestelmällä. @fi
label: er parallelt navn på tilvirker for @no
definition: Relaterer et nomen til en manifestasjon som har et navn på tilvirker på et annet språk eller i et annet skriftsystem. @no
toolkit label: parallelt navn på tilvirker for @no
toolkit definition: En manifestasjon som har et navn på tilvirker på et annet språk eller i et annet skriftsystem. @no
label: est une forme parallèle d’un nom de fabricant de @fr
definition: Met un nomen en relation avec une manifestation qui possède un nom de fabricant dans une autre langue ou écriture. @fr
toolkit label: forme parallèle d’un nom de fabricant de @fr
toolkit definition: Manifestation qui possède un nom de fabricant dans une autre langue ou écriture. @fr
label: is parallelle naam van vervaardiger van @nl
definition: Relateert een nomen aan een manifestatie die een naam van vervaardiger heeft in een andere taal of schrift. @nl
toolkit label: parallelle naam van vervaardiger van @nl
toolkit definition: Een manifestatie die een naam van vervaardiger heeft in een andere taal of schrift. @nl
label: هو اسم مواز لصانع لـ @ar
definition: يربط تسمية بتجسيدة لها اسم صانع في لغة أو في نص آخر. @ar
toolkit label: اسم مواز لصانع لـ @ar
toolkit definition: تجسيدة لها اسم صانع في لغة أو في نص آخر. @ar
label: és nom paral·lel de fabricant de @ca
definition: Relaciona un nomen amb una manifestació que té un nom de fabricant en una altra llengua o escriptura. @ca
toolkit label: nom paral·lel de fabricant de @ca
toolkit definition: Manifestació que té un nom de fabricant en una altra llengua o escriptura. @ca
label: er parallelt navn på producent af @da
definition: Relaterer et nomen til en manifestation, som har et navn på producent på et andet sprog eller skriftsystem. @da
toolkit label: parallelt navn på producent af @da
toolkit definition: Manifestation, som har et navn på producent på et andet sprog eller skriftsystem. @da
label: valmistaja rööpnimi kehastuses @et
definition: Seostab nomen'i kehastusega, millel on valmistaja nimi teises keeles või kirjasüsteemis. @et
toolkit label: valmistaja rööpnimi kehastuses @et
toolkit definition: Kehastus, millel on valmistaja nimi teises keeles või kirjasüsteemis. @et
label: ist paralleler Herstellername von @de
definition: Setzt ein Nomen in Beziehung zu einer Manifestation, die einen Herstellernamen in einer anderen Sprache oder einer anderen Schrift hat. @de
toolkit label: Paralleler Herstellername von @de
toolkit definition: Eine Manifestation, die einen Herstellernamen in einer anderen Sprache oder einer anderen Schrift hat. @de
label: gyártó párhuzamos neve a következő: @hu
definition: Hozzákapcsol egy noment egy megjelenési formához, amely gyártójának van neve más nyelven vagy írásrendszerben. @hu
toolkit label: gyártó párhuzamos neve a következő: @hu
toolkit definition: Egy megjelenési forma, amely gyártójának van neve más nyelven vagy írásrendszerben. @hu
label: è nome parallelo del manifattore di @it
definition: Correla un nomen a una manifestazione che ha un nome di manifattore in un'altra lingua o scrittura. @it
toolkit label: nome parallelo del manifattore di @it
toolkit definition: Una manifestazione che ha un nome di manifattore in un'altra lingua o scrittura. @it
label: ir ražotāja paralēlais vārds/nosaukums @lv
toolkit label: ir ražotāja paralēlais vārds/nosaukums @lv
definition: Sasaista nomenu ar manifestāciju, kam ir ražotāja vārds/nosaukums citā valodā vai rakstībā. @lv
toolkit definition: Manifestācija, kam ir ražotāja vārds/nosaukums citā valodā vai rakstībā. @lv
label: 是……的生产者的并列名称 @zh-hans
toolkit label: ……的生产者的并列名称 @zh-hans
definition: 将一个命名与有用另一种语言或文字的生产者名称的一种载体表现关联起来。 @zh-hans
toolkit definition: 有用另一种语言或文字的生产者名称的一种载体表现 @zh-hans
has subproperty: P80128
label: üreticisinin paralel adıdır @tr
toolkit label: imatlatçısının paralel ismi @tr
definition: Bir ismi, başka bir dilde veya alfabede üretici adına sahip bir gösterimle ilişkilendirir. @tr
toolkit definition: Başka bir dilde veya alfabede yapımcı adına sahip bir gösterim. @tr

is parallel name of producer of
status: Published
type: Property
lexical alias: parallelNameOfProducerOf.en
domain: C10012
toolkit label: parallel name of producer of
sub property of: is name of producer of
has element type: 2
definition: Relates a nomen to a manifestation that has a name of producer in another language or script.
toolkit definition: A manifestation that has a name of producer in another language or script.
label: rinnakkainen tuottajan nimi manifestaatiolle @fi
definition: Liittää nomenin manifestaatioon, jonka tuottajan nimi on toisella kielellä tai kirjoitusjärjestelmällä. @fi
toolkit label: rinnakkainen tuottajan nimi manifestaatiolle @fi
toolkit definition: Manifestaatio, jonka tuottajan nimi on toisella kielellä tai kirjoitusjärjestelmällä. @fi
label: er parallelt navn på produsent for @no
definition: Relaterer et nomen til en manifestasjon som har et navn på produsent på et annet språk eller i et annet skriftsystem. @no
toolkit label: parallelt navn på produsent for @no
toolkit definition: En manifestasjon som har et navn på produsent på et annet språk eller i et annet skriftsystem. @no
label: est une forme parallèle d’un nom de producteur de @fr
definition: Met un nomen en relation avec une manifestation qui possède un nom de producteur dans une autre langue ou écriture. @fr
toolkit label: forme parallèle d’un nom de producteur de @fr
toolkit definition: Manifestation qui possède un nom de producteur dans une autre langue ou écriture. @fr
label: is parallelle naam van producent van @nl
definition: Relateert een nomen aan een manifestatie die een naam van producent heeft in een andere taal of schrift. @nl
toolkit label: parallelle naam van producent van @nl
toolkit definition: Een manifestatie die een naam van producent heeft in een andere taal of schrift. @nl
label: هو اسم موازِ لمنتج لـ @ar
definition: يربط تسمية بتجسيدة لها اسم منتِج في لغة أو في نص آخر. @ar
toolkit label: اسم مواز لمنتِج لـ @ar
toolkit definition: تجسيدة لها اسم منتِج في لغة أو في نص آخر. @ar
label: és nom paral·lel de productor de @ca
definition: Relaciona un nomen amb una manifestació que té un nom de productor en una altra llengua o escriptura. @ca
toolkit label: nom paral·lel de productor de @ca
toolkit definition: Manifestació que té un nom de productor en una altra llengua o escriptura. @ca
label: er parallelt navn på producer af @da
definition: Relaterer et nomen til en manifestation, som har et navn på producer på et andet sprog eller skriftsystem. @da
toolkit label: parallelt navn på producer af @da
toolkit definition: Manifestation, som har et navn på producer på et andet sprog eller skriftsystem. @da
label: tootja rööpnimi kehastuses @et
definition: Seostab nomen'i kehastusega, millel on tootja nimi teises keeles või kirjasüsteemis. @et
toolkit label: tootja rööpnimi kehastuses @et
toolkit definition: Kehastus, millel on tootja nimi teises keeles või kirjasüsteemis. @et
label: ist paralleler Erzeugername von @de
definition: Setzt ein Nomen in Beziehung zu einer Manifestation, die einen Erzeugernamen in einer anderen Sprache oder einer anderen Schrift hat. @de
toolkit label: Paralleler Erzeugername von @de
toolkit definition: Eine Manifestation, die einen Erzeugernamen in einer anderen Sprache oder einer anderen Schrift hat. @de
label: neve a következő előállítójának: @hu
definition: Hozzákapcsol egy noment egy megjelenési formához, amely előállítójának van neve más nyelven vagy írásrendszerben. @hu
toolkit label: neve a következő előállítójának: @hu
toolkit definition: Egy megjelenési forma, amely előállítójának van neve más nyelven vagy írásrendszerben. @hu
label: è nome parallelo del produttore di @it
definition: Correla un nomen a una manifestazione che ha un nome di produttore in un'altra lingua o scrittura. @it
toolkit label: nome parallelo del produttore di @it
toolkit definition: Una manifestazione che ha un nome di produttore in un'altra lingua o scrittura @it
label: ir izgatavotāja paralēlais vārds/nosaukums @lv
toolkit label: ir izgatavotāja paralēlais vārds/nosaukums @lv
definition: Sasaista nomenu ar manifestāciju, kam ir izgatavotāja vārds/nosaukums citā valodā vai rakstībā. @lv
toolkit definition: Manifestācija, kam ir izgatavotāja vārds/nosaukums citā valodā vai rakstībā. @lv
label: 是……的制作者的并列名称 @zh-hans
toolkit label: ……的制作者的并列名称 @zh-hans
definition: 将一个命名与有用另一种语言或文字的制作者名称的一种载体表现关联起来。 @zh-hans
toolkit definition: 有用另一种语言或文字的制作者名称的一种载体表现 @zh-hans
has subproperty: P80129
label: yapımcısının paralel adıdır @tr
toolkit label: Yapımcının paralel ismi @tr
definition: Bir ismi, başka bir dilde veya alfabede yapımcı adına sahip bir gösterimle ilişkilendirir. @tr
toolkit definition: Başka bir dilde veya alfabede üretici adına sahip bir gösterim. @tr

is parallel name of publisher of
status: Published
type: Property
lexical alias: parallelNameOfPublisherOf.en
domain: C10012
toolkit label: parallel name of publisher of
sub property of: is name of publisher of
has element type: 2
definition: Relates a nomen to a manifestation that has a name of publisher in another language or script.
toolkit definition: A manifestation that has a name of publisher in another language or script.
label: rinnakkainen kustantajan nimi manifestaatiolle @fi
definition: Liittää nomenin manifestaatioon, jonka kustantajan nimi on toisella kielellä tai kirjoitusjärjestelmällä. @fi
toolkit label: rinnakkainen kustantajan nimi manifestaatiolle @fi
toolkit definition: Manifestaatio, jonka kustantajan nimi on toisella kielellä tai kirjoitusjärjestelmällä. @fi
label: er parallelt navn på utgiver for @no
definition: Relaterer et nomen til en manifestasjon som har et navn på utgiver på et annet språk eller i et annet skriftsystem. @no
toolkit label: parallelt navn på utgiver for @no
toolkit definition: En manifestasjon som har et navn på utgiver på et annet språk eller i et annet skriftsystem. @no
label: est une forme parallèle d’un nom d’éditeur de @fr
definition: Met un nomen en relation avec une manifestation qui possède un nom d’éditeur dans une autre langue ou écriture. @fr
toolkit label: forme parallèle d’un nom d’éditeur de @fr
toolkit definition: Manifestation qui possède un nom d’éditeur dans une autre langue ou écriture. @fr
label: is parallelle naam van uitgever van @nl
definition: Relateert een nomen aan een manifestatie die een naam van uitgever heeft in een andere taal of schrift. @nl
toolkit label: parallelle naam van uitgever van @nl
toolkit definition: Een manifestatie die een naam van uitgever heeft in een andere taal of schrift. @nl
label: هو اسم موازِ لناشر لـ @ar
definition: يربط تسمية بتجسيدة لها اسم ناشر في لغة أو في نص آخر. @ar
toolkit label: اسم مواز لناشر لـ @ar
toolkit definition: تجسيدة لها اسم ناشر في لغة أو في نص آخر. @ar
label: és nom paral·lel d’editor de @ca
definition: Relaciona un nomen amb una manifestació que té un nom d’editor en una altra llengua o escriptura. @ca
toolkit label: nom paral·lel d’editor de @ca
toolkit definition: Manifestació que té un nom d’editor en una altra llengua o escriptura. @ca
label: er parallelt navn på udgiver af @da
definition: Relaterer et nomen til en manifestation, som har et navn på udgiver på et andet sprog eller skriftsystem. @da
toolkit label: parallelt navn på udgiver af @da
toolkit definition: Manifestation, som har et navn på udgiver på et andet sprog eller skriftsystem. @da
label: kirjastaja rööpnimi kehastuses @et
definition: Seostab nomen'i kehastusega, millel on kirjastaja nimi teises keeles või kirjasüsteemis. @et
toolkit label: kirjastaja rööpnimi kehastuses @et
toolkit definition: Kehastus, millel on kirjastaja nimi teises keeles või kirjasüsteemis. @et
label: ist paralleler Verlagsname von @de
definition: Setzt ein Nomen in Beziehung zu einer Manifestation, die einen Verlagsnamen in einer anderen Sprache oder einer anderen Schrift hat. @de
toolkit label: Paralleler Verlagsname von @de
toolkit definition: Eine Manifestation, die einen Verlagsnamen in einer anderen Sprache oder einer anderen Schrift hat. @de
label: párhuzamos neve a következő közreadónak: @hu
definition: Hozzákapcsol egy noment egy megjelenési formához, amelynek van egy kiadóneve más nyelven vagy írásrendszerben. @hu
toolkit label: párhuzamos neve a következő kiadónak: @hu
toolkit definition: Egy megjelenési forma, amelynek van egy kiadóneve más nyelven vagy írásrendszerben. @hu
label: è nome parallelo dell'editore di @it
definition: Correla un nomen a una manifestazione che ha un nome di editore in un'altra lingua o scrittura. @it
toolkit label: nome parallelo dell'editore di @it
toolkit definition: Una manifestazione che ha un nome di editore in un'altra lingua o scrittura. @it
label: ir izdevēja paralēlais vārds/nosaukums @lv
toolkit label: ir izdevēja paralēlais vārds/nosaukums @lv
definition: Sasaista nomenu ar manifestāciju, kam ir izdevēja vārds/nosaukums citā valodā vai rakstībā. @lv
toolkit definition: Manifestācija, kam ir izdevēja vārds/nosaukums citā valodā vai rakstībā. @lv
label: 是……的出版者的并列名称 @zh-hans
toolkit label: ……的出版者的并列名称 @zh-hans
definition: 将一个命名与有用另一种语言或文字的出版者名称的一种载体表现关联起来。 @zh-hans
toolkit definition: 有用另一种语言或文字的出版者名称的一种载体表现 @zh-hans
has subproperty: P80130
label: yayıncısının paralel adıdır @tr
toolkit label: yayıncısının paralel ismi @tr
definition: Bir ismi, başka bir dilde veya alfabede yayıncı adına sahip bir gösterimle ilişkilendirir. @tr
toolkit definition: Başka bir dilde veya alfabede yayımcı adına sahip bir gösterim. @tr

is parallel title of series of
status: Published
type: Property
lexical alias: parallelTitleOfSeriesOf.en
domain: C10012
toolkit label: parallel title of series of
sub property of: is title of series of
sub property of: is parallel title proper of
has element type: 2
definition: Relates a nomen to a manifestation that has a title of series in another language or script.
toolkit definition: A manifestation that has a title of series in another language or script.
label: rinnakkainen sarjan nimeke manifestaatiolle @fi
definition: Liittää nomenin manifestaatioon, jonka sarjan nimi on toisella kielellä tai kirjoitusjärjestelmällä. @fi
toolkit label: rinnakkainen sarjan nimeke manifestaatiolle @fi
toolkit definition: Manifestaatio, jonka sarjan nimeke on toisella kielellä tai kirjoitusjärjestelmällä. @fi
label: er parallell serietittel for @no
definition: Relaterer et nomen til en manifestasjon som har en serietittel på et annet språk eller i et annet skriftsystem. @no
toolkit label: parallell serietittel for @no
toolkit definition: En manifestasjon som har en serietittel på et annet språk eller i et annet skriftsystem. @no
label: est un titre parallèle de collection de @fr
definition: Met un nomen en relation avec une manifestation qui possède un titre de collection dans une autre langue ou écriture. @fr
toolkit label: titre parallèle de collection de @fr
toolkit definition: Manifestation qui possède un titre de collection dans une autre langue ou écriture. @fr
label: is parallelle reekstitel van @nl
definition: Relateert een nomen aan een manifestatie die een titel van reeks heeft in een andere taal of schrift. @nl
toolkit label: parallelle reekstitel van @nl
toolkit definition: Een manifestatie die een titel van reeks heeft in een andere taal of schrift. @nl
label: هو عنوان موازِ لسلسلة لـ @ar
definition: يربط تسمية بتجسيدة لها عنوان سلسلة في لغة أو في نص آخر. @ar
toolkit label: عنوان مواز لسلسلة لـ @ar
toolkit definition: تجسيدة لها عنوان سلسلة في لغة أو في نص آخر. @ar
label: és títol paral·lel de col·lecció de @ca
definition: Relaciona un nomen amb una manifestació que té un títol de col·lecció en una altra llengua o escriptura. @ca
toolkit label: títol paral·lel de col·lecció de @ca
toolkit definition: Manifestació que té un títol de col·lecció en una altra llengua o escriptura. @ca
label: er parallel serietitel på @da
definition: Relaterer et nomen til en manifestation, som har en serietitel på et andet sprog eller skriftsystem. @da
toolkit label: parallel serietitel på @da
toolkit definition: Manifestation, som har en serietitel på et andet sprog eller skriftsystem. @da
label: seeria rööppealkiri kehastuses @et
definition: Seostab nomen'i kehastusega, millel on seeria pealkiri teises keeles või kirjasüsteemis. @et
toolkit label: seeria rööppealkiri kehastuses @et
toolkit definition: Kehastus, millel on seeria pealkiri teises keeles või kirjasüsteemis. @et
label: ist Paralleltitel einer Reihe von @de
definition: Setzt ein Nomen in Beziehung zu einer Manifestation, die einen Titel einer Reihe in einer anderen Sprache oder einer anderen Schrift hat. @de
toolkit label: Paralleltitel einer Reihe von @de
toolkit definition: Eine Manifestation, die einen Titel einer Reihe in einer anderen Sprache oder einer anderen Schrift hat. @de
label: párhuzamos sorozati címe a következőnek: @hu
definition: Hozzákapcsol egy noment egy megjelenési formához, amelynek van egy sorozatcíme más nyelven vagy írásrendszerben. @hu
toolkit label: párhuzamos sorozati címe: @hu
toolkit definition: Egy megjelenési forma, amelynek van egy sorozatcíme más nyelven vagy írásrendszerben. @hu
label: è titolo parallelo della serie di @it
definition: Correla un nomen a una manifestazione che ha un titolo di serie in un'altra lingua o scrittura. @it
toolkit label: titolo parallelo della serie di @it
toolkit definition: Una manifestazione che ha un titolo di serie in un'altra lingua o scrittura. @it
label: ir paralēlais sērijas nosaukums @lv
toolkit label: ir paralēlais sērijas nosaukums @lv
definition: Sasaista nomenu ar manifestāciju, kam ir sērijas nosaukums citā valodā vai rakstībā. @lv
toolkit definition: Manifestācija, kam ir sērijas nosaukums citā valodā vai rakstībā. @lv
label: 是……的并列丛编题名 @zh-hans
toolkit label: ……的并列丛编题名 @zh-hans
definition: 将一个命名与有用另一种语言或文字的丛编题名的一种载体表现关联起来。 @zh-hans
toolkit definition: 有用另一种语言或文字的丛编题名的一种载体表现 @zh-hans
has subproperty: is parallel title proper of subseries of (Deprecated)
has subproperty: P80136
label: serisinin paralel başlığıdır @tr
toolkit label: dizinin paralel başlığı @tr
definition: Bir ismi, başka bir dilde veya alfabede bir dizinin başlığına sahip bir gösterimle ilişkilendirir. @tr
toolkit definition: Başka bir dilde veya alfabede bir dizinin başlığına sahip bir gösterim. @tr

is parallel title proper of
status: Published
type: Property
lexical alias: parallelTitleProperOf.en
domain: C10012
toolkit label: parallel title proper of
sub property of: is title proper of
has element type: 2
definition: Relates a nomen to a manifestation that has a title proper in another language or script.
toolkit definition: A manifestation that has a title proper in another language or script.
label: rinnakkainen päänimeke manifestaatiolle @fi
definition: Liittää nomenin manifestaatioon, jonka päänimeke on toisella kielellä tai kirjoitusjärjestelmällä. @fi
toolkit label: rinnakkainen päänimeke manifestaatiolle @fi
toolkit definition: Manifestaatio, jonka päänimeke on toisella kielellä tai kirjoitusjärjestelmällä. @fi
label: er parallell hovedtittel for @no
definition: Relaterer et nomen til en manifestasjon som har en hovedtittel på et annet språk eller i et annet skriftsystem. @no
toolkit label: parallell hovedtittel for @no
toolkit definition: En manifestasjon som har en hovedtittel på et annet språk eller i et annet skriftsystem. @no
label: est un titre propre parallèle de @fr
definition: Met un nomen en relation avec une manifestation qui possède un titre propre dans une autre langue ou écriture. @fr
toolkit label: titre propre parallèle de @fr
toolkit definition: Manifestation qui possède un titre propre dans une autre langue ou écriture. @fr
label: is parallelle hoofdtitel van @nl
definition: Relateert een nomen aan een manifestatie die een hoofdtitel heeft in een andere taal of schrift. @nl
toolkit label: parallelle hoofdtitel van @nl
toolkit definition: Een manifestatie die een hoofdtitel heeft in een andere taal of schrift. @nl
label: هو عنوان فعلي مواز لـ @ar
definition: يربط تسمية بتجسيدة لها عنوان فعلي في لغة أو في نص آخر. @ar
toolkit label: عنوان فعلي مواز لـ @ar
toolkit definition: تجسيدة لها عنوان فعلي في لغة أو في نص آخر. @ar
label: és títol propi paral·lel de @ca
definition: Relaciona un nomen amb una manifestació que té un títol propi en una altra llengua o escriptura. @ca
toolkit label: títol propi paral·lel de @ca
toolkit definition: Manifestació que té un títol propi en una altra llengua o escriptura. @ca
label: er parallel hovedtitel på @da
definition: Relaterer et nomen til en manifestation, som har en hovedtitel på et andet sprog eller skriftsystem. @da
toolkit label: parallel hovedtitel på @da
toolkit definition: Manifestation, som har en hovedtitel på et andet sprog eller skriftsystem. @da
label: rööppõhipealkiri kehastuses @et
definition: Seostab nomen'i kehastusega, millel on põhipealkiri teises keeles või kirjasüsteemis. @et
toolkit label: rööppõhipealkiri kehastuses @et
toolkit definition: Kehastus, millel on põhipealkiri teises keeles või kirjasüsteemis. @et
label: ist Paralleltitel von @de
definition: Setzt ein Nomen in Beziehung zu einer Manifestation, die einen Haupttitel in einer anderen Sprache oder einer anderen Schrift hat. @de
toolkit label: Paralleltitel von @de
toolkit definition: Eine Manifestation, die einen Haupttitel in einer anderen Sprache oder einer anderen Schrift hat. @de
label: párhuzamos főcíme a következőnek: @hu
definition: Hozzákapcsol egy noment egy megjelenési formához, amelynek más nyelven vagy írásrendszerben is van főcíme. @hu
toolkit label: párhuzamos főcíme: @hu
toolkit definition: Egy megjelenési forma, amelynek más nyelven vagy írásrendszerben is van főcíme. @hu
label: è titolo proprio parallelo di @it
definition: Correla un nomen a una manifestazione che ha un titolo proprio in un'altra lingua o scrittura. @it
toolkit label: titolo proprio parallelo di @it
toolkit definition: Una manifestazione che ha un titolo proprio in un'altra lingua o scrittura @it
label: ir paralēlais pamatnosaukums @lv
toolkit label: ir paralēlais pamatnosaukums @lv
definition: Sasaista nomenu ar manifestāciju, kam ir pamatnosaukums citā valodā vai rakstībā. @lv
toolkit definition: Manifestācija, kam ir pamatnosaukums citā valodā vai rakstībā. @lv
label: 是……的并列正题名 @zh-hans
toolkit label: ……的并列正题名 @zh-hans
definition: 将一个命名与有用另一种语言或文字的正题名的一种载体表现关联起来。 @zh-hans
toolkit definition: 有用另一种语言或文字的正题名的一种载体表现 @zh-hans
has subproperty: is parallel title of series of
has subproperty: P80135
label: paralel başlığıdır @tr
toolkit label: uygun paralel başlık @tr
definition: Bir ismi, başka bir dilde veya alfabede uygun bir başlığı olan bir gösterimle ilişkilendirir. @tr
toolkit definition: Başka bir dilde veya alfabede uygun bir başlığa sahip bir gösterim. @tr

is parallel title proper of subseries of (Deprecated)
status: Deprecated
type: Property
lexical alias: parallelTitleProperOfSubseriesOf.en
domain: C10012
toolkit label: parallel title proper of subseries of (Deprecated)
sub property of: is title proper of subseries of (Deprecated)
sub property of: is parallel title of series of
definition: Relates a nomen to a manifestation that has a title proper of subseries in another language or script. (Deprecated)
toolkit definition: A manifestation that has a title proper of subseries in another language or script. (Deprecated)
has subproperty: P80137

has part nomen
status: Published
type: Property
lexical alias: partNomen.en
definition: Relates a nomen to a nomen that is a discrete component of another nomen.
domain: C10012
toolkit label: part nomen
toolkit definition: A nomen that is a discrete component of another nomen.
sub property of: has related nomen of nomen
has element type: 2
label: nomenin osa @fi
definition: Liittää nomenin nomeniin, joka on itsenäinen osa toista nomenia. @fi
toolkit label: nomenin osa @fi
toolkit definition: Nomen, joka on itsenäinen osa toista nomenia. @fi
label: har del av nomen @no
definition: Relaterer et nomen til et nomen som er en avgrenset del av et annet nomen. @no
toolkit label: del av nomen @no
toolkit definition: Et nomen som er en avgrenset del av et annet nomen. @no
label: a pour partie de nomen @fr
definition: Met un nomen en relation avec un nomen qui constitue une composante distincte d’un autre nomen. @fr
toolkit label: partie de nomen @fr
toolkit definition: Nomen qui constitue une composante distincte d’un autre nomen. @fr
label: heeft deel nomen @nl
definition: Relateert een nomen aan een nomen dat een afzonderlijk deel is van een andere nomen. @nl
toolkit label: deel nomen @nl
toolkit definition: Een nomen dat een afzonderlijk deel is van een andere nomen. @nl
label: لها تسمية جزئية @ar
definition: يربط تسمية بتسمية هي جزء منفصل من تسمية أخرى. @ar
toolkit label: تسمية جزئية @ar
toolkit definition: تسمية عبارة عن جزء منفصل عن تسمية أخرى. @ar
label: té com a nomen de part @ca
definition: Relaciona un nomen amb un nomen que és un component discret d’un altre nomen. @ca
toolkit label: nomen de part @ca
toolkit definition: Nomen que és un component discret d’un altre nomen. @ca
label: har del af nomen @da
definition: Relaterer et nomen til et nomen, som er en adskilt komponent af et andet nomen. @da
toolkit label: del af nomen @da
toolkit definition: Nomen, som er en adskilt komponent af et andet nomen. @da
label: nomen'i osa @et
definition: Seostab nomen'i nomen'iga, mis on teise nomen'i iseseisev koostisosa. @et
toolkit label: nomen'i osa @et
toolkit definition: Nomen, mis on teise nomen'i iseseisev koostisosa. @et
label: hat Teil-Nomen @de
definition: Setzt ein Nomen in Beziehung zu einem Nomen, das ein eigenständiger Bestandteil eines anderen Nomens ist. @de
toolkit label: Teil-Nomen @de
toolkit definition: Ein Nomen, das ein eigenständiger Bestandteil eines anderen Nomens ist. @de
label: résznomenje a következő: @hu
definition: Hozzákapcsol egy noment egy nomenhez, amely egy másik nomen elkülöníthető alkotóeleme. @hu
toolkit label: résznomenje: @hu
toolkit definition: Egy nomen, amely egy másik nomen elkülöníthető alkotórésze. @hu
label: ha come parte di nomen @it
definition: Correla un nomen a un nomen che è una componente separata di un altro nomen. @it
toolkit label: parte di nomen @it
toolkit definition: Un nomen che è una componente separata di un altro nomen. @it
label: nomens: daļa @lv
definition: Sasaista nomenu ar nomenu, kas ir cita nomena sastāvdaļa. @lv
toolkit label: nomens: daļa @lv
toolkit definition: Nomens, kas ir cita nomena sastāvdaļa. @lv
label: 有部分命名 @zh-hans
definition: 将一个命名与作为另一个命名之独立组成部分的一个命名关联起来。 @zh-hans
toolkit label: 部分命名 @zh-hans
toolkit definition: 作为另一个命名之独立组成部分的一个命名 @zh-hans
has subproperty: P80058
label: isim bileşeni ile ilişkilidir @tr
definition: Bir ismi, başka bir niteleyici ismin ayrı bir bileşeni olan bir niteleyici isimle ilişkilendirir. @tr
toolkit label: niteleyici ismin bölümü @tr
toolkit definition: Başka bir ismin ayrı bir bileşeni olan bir isim. @tr

is part of nomen
status: Published
type: Property
lexical alias: partOfNomen.en
definition: Relates a nomen to a nomen that has another nomen as a discrete component.
domain: C10012
toolkit label: part of nomen
toolkit definition: A nomen that has another nomen as a discrete component.
sub property of: has related nomen of nomen
has element type: 2
label: osa nomenia @fi
definition: Liittää nomenin nomeniin, jonka itsenäinen osa toinen nomen on. @fi
toolkit label: osa nomenia @fi
toolkit definition: Nomen, jonka itsenäinen osa toinen nomen on. @fi
label: er del av nomen @no
definition: Relaterer et nomen til et nomen som har et annet nomen som en avgrenset del. @no
toolkit label: del av nomen @no
toolkit definition: Et nomen som har et annet nomen som en avgrenset del. @no
label: est une partie de nomen de @fr
definition: Met un nomen en relation avec une œuvre qui a pour composante distincte un autre nomen. @fr
toolkit label: partie de nomen de @fr
toolkit definition: Œuvre qui a pour composante distincte un autre nomen. @fr
label: is deel van nomen @nl
definition: Relateert een nomen aan een nomen dat een andere nomen als afzonderlijk deel heeft. @nl
toolkit label: deel van nomen @nl
toolkit definition: Een nomen dat een andere nomen als afzonderlijk deel heeft. @nl
label: هي جزء من تسمية @ar
definition: يربط تسمية بتسمية لها تسمية أخرى كجزء منفصل. @ar
toolkit label: جزء من تسمية @ar
toolkit definition: تسمية لها تسمية أخرى كجزء منفصل. @ar
label: és part d’un nomen @ca
definition: Relaciona un nomen amb un nomen que té un altre nomen com a component discret. @ca
toolkit label: part d’un nomen @ca
toolkit definition: Nomen que té un altre nomen com a component discret. @ca
label: er del af nomen @da
definition: Relaterer et nomen til et nomen, som har et andet nomen som en adskilt komponent. @da
toolkit label: del af nomen @da
toolkit definition: Nomen, som har et andet nomen som en adskilt komponent. @da
label: osa nomen'ist @et
definition: Seostab nomen'i nomen'iga, millesse kuulub iseseisva koostisosana teine nomen. @et
toolkit label: osa nomen'ist @et
toolkit definition: Nomen, millesse kuulub iseseisva koostisosana teine nomen. @et
label: ist Teil von (Nomen) @de
definition: Setzt ein Nomen in Beziehung zu einem Nomen, das ein anderes Nomen als einzelnen Bestandteil enthält. @de
toolkit label: Teil von (Nomen) @de
toolkit definition: Ein Nomen, das ein anderes Nomen als einzelnen Bestandteil enthält. @de
label: résznomene a következőnek: @hu
definition: Hozzákapcsol egy noment egy nomenhez, amelynek van egy másik nomenje, mint elkülöníthető alkotóelem. @hu
toolkit label: résznomene: @hu
toolkit definition: Egy nomen, amelynek van egy másik nomenje, mint elkülöníthető alkotóelem. @hu
label: è parte del nomen @it
definition: Correla un nomen a un nomen che ha un altro nomen come componente separata. @it
toolkit label: parte del nomen @it
toolkit definition: Un nomen che ha un altro nomen come componente distinta. @it
label: ir daļa nomenā @lv
definition: Sasaista nomenu ar nomenu, kuram ir cits nomens kā atsevišķa sastāvdaļa. @lv
toolkit label: daļa nomenā @lv
toolkit definition: Nomens, kuram ir cits nomens kā atsevišķa sastāvdaļa. @lv
label: 是命名的部分 @zh-hans
definition: 将一个命名与有另一个命名作为独立组成部分的一个命名关联起来。 @zh-hans
toolkit label: 命名的部分 @zh-hans
toolkit definition: 有另一个命名作为独立组成部分的一个命名 @zh-hans
has subproperty: P80059
label: ismin bir bileşenidir @tr
definition: Bir ismi, ayrı bir bileşen olarak başka bir niteleyici isme sahip olan bir niteleyici isimle ilişkilendirir. @tr
toolkit label: niteleyici ismin bölümü @tr
toolkit definition: Başka bir ismi ayrık olarak içeren bir isim. @tr

is plate number for notated music of
status: Published
type: Property
lexical alias: plateNumberForNotatedMusicOf.en
domain: C10012
sub property of: is identifier for manifestation of
toolkit label: plate number for notated music of
has element type: 2
definition: Relates a nomen to a manifestation of a notated music expression that has an identifier for manifestation other than a publisher number for notated music, assigned by a publisher to indicate the printing plate used in the printing process.
toolkit definition: A manifestation of a notated music expression that has an identifier for manifestation other than a publisher number for notated music, assigned by a publisher to indicate the printing plate used in the printing process.
scope note: The number normally appears at the bottom of each page, and sometimes on the title page. The number may include initials, abbreviations, or words identifying the publisher, or be followed by a number corresponding to the number of pages or plates or a number corresponding to an individual page or plate.
label: nuottiaineiston laatan numero manifestaatiolle @fi
definition: Liittää nomenin nuottiaineiston ekspression manifestaatioon, jonka tunniste ei ole kustantajan nuottiaineistolle antama numero vaan nuottiaineiston laatan numero. Nuottiaineiston laatan numero ilmaisee, mitä painolaattaa on käytetty painamisprosessissa. @fi
scope note: Numero esiintyy yleensä jokaisen sivun alalaidassa ja joskus nimiösivulla. Numero voi sisältää kustantajaa identifioivia alkukirjaimia, lyhenteitä tai sanoja. Numeron perässä voi olla vastaavien sivujen tai laattojen numerot tai yksittäisten sivujen ja laattojen numerot. @fi
toolkit label: nuottiaineiston laatan numero manifestaatiolle @fi
toolkit definition: Nuottiaineiston ekspression manifestaatio, jonka tunniste ei ole kustantajan nuottiaineistolle antama numero vaan nuottiaineiston laatan numero. Nuottiaineiston laatan numero ilmaisee, mitä painolaattaa on käytetty painamisprosessissa. @fi
label: er platenummer for nedskrevet musikk for @no
definition: Relaterer et nomen til en manifestasjon av uttrykk av nedskrevet musikk som har en identifikator for manifestasjon som er en annen enn utgivelsesnummer for nedskrevet musikk, tildelt av en utgiver for å vise til hvilken trykkeplate som er brukt i trykkeprosessen. @no
scope note: Nummeret forekommer vanligvis på bunnen av hver side, og noen ganger på tittelsiden. Nummeret kan inkludere initialer, forkortelser eller ord som identifiserer utgiveren, eller etterfulgt av et nummer som korresponderer med en enkeltside eller plate. @no
toolkit label: platenummer for nedskrevet musikk for @no
toolkit definition: En manifestasjon av uttrykk av nedskrevet musikk som har en identifikator for manifestasjon som er en annen enn utgivelsesnummer for nedskrevet musikk, tildelt av en utgiver for å vise til hvilken trykkeplate som er brukt i trykkeprosessen. @no
label: est un cotage pour la musique notée de @fr
definition: Met un nomen en relation avec une manifestation d’une expression de musique notée qui possède un identifiant de manifestation, autre qu’un numéro d’éditeur pour la musique notée, attribué par un éditeur pour identifier la planche utilisée pour l’impression. @fr
scope note: Le numéro figure habituellement au bas de chaque page et parfois sur la page de titre. Le numéro peut comprendre des initiales, des abréviations ou des mots identifiant l’éditeur, ou être suivi d’un numéro correspondant au nombre de pages ou de planches ou d’un numéro correspondant à une page ou une planche individuelle. @fr
toolkit label: cotage pour la musique notée de @fr
toolkit definition: Manifestation d’une expression de musique notée qui possède un identifiant de manifestation, autre qu’un numéro d’éditeur pour la musique notée, attribué par un éditeur pour identifier la planche utilisée pour l’impression. @fr
label: is plaatnummer voor bladmuziek van @nl
definition: Relateert een nomen aan een manifestatie van een bladmuziek-expressie die een identificatie voor manifestatie heeft anders dan een uitgeversnummer voor bladmuziek, toegekend door een uitgever om de drukplaat aan te geven gebruikt in het drukprocédé. @nl
scope note: Het nummer verschijnt normaliter onderaan elke pagina en soms op de titelpagina. Het nummer kan initialen, afkortingen of woorden bevatten die de uitgever identificeren, of gevolgd worden door ofwel een nummer dat correspondeert met het aantal pagina's of platen ofwel een nummer dat correspondeert met een individuele pagina of plaat. @nl
toolkit label: plaatnummer voor bladmuziek van @nl
toolkit definition: Een manifestatie van een bladmuziek-expressie die een identificatie voor manifestatie heeft anders dan een uitgeversnummer voor bladmuziek, toegekend door een uitgever om de drukplaat aan te geven gebruikt in het drukprocédé. @nl
label: هو رقم لوحة لموسيقى مدونة لـ @ar
definition: يربط تسمية بتجسيدة لتعبيرة عن موسيقى مدونة لها مُعرِّف للتجسيدة غير رقم الناشر للموسيقى المدونة، خصصه ناشر لبيان لوحة الطباعة المستخدمة في عملية الطباعة. @ar
scope note: يظهر الرقم عادًة أسفل كل صفحة، وفي بعض الأحيان في صفحة العنوان. قد يتضمن الرقم أحرفا استهلالية، أو اختصارات، أو كلمات تدل على الناشر، أو قد يُتبع برقم مناظر لعدد الصفحات أو اللوحات، أو رقم مناظر لصفحة أو للوحة مفردة. @ar
toolkit label: رقم لوحة لموسيقى مدونة لـ @ar
toolkit definition: تجسيدة لتعبيرة موسيقى مدونة لها مُعرِّف لتجسيدة غير رقم الناشر للموسيقى المدونة، خصصه ناشر لبيان اللوحة المطبوعة المستخدمة في عملية الطباعة. @ar
label: és número de planxa de música notada de @ca
definition: Relaciona un nomen amb una manifestació d’una expressió de música notada que té un identificador de manifestació diferent d’un número d’editor de música notada, assignat per un editor per indicar la planxa utilitzada en el procés d’impressió. @ca
scope note: Normalment el número figura al peu de cada pàgina, i a vegades a la portada. El número pot incloure inicials, abreviacions o paraules que identifiquen l’editor, o anar seguit d’un número que correspon al nombre de pàgines o de planxes o a un número que correspon a una pàgina o una planxa individual. @ca
toolkit label: número de planxa de música notada de @ca
toolkit definition: Manifestació d’una expressió de música notada que té un identificador de manifestació diferent d’un número d’editor de música notada, assignat per un editor per indicar la planxa utilitzada en el procés d’impressió. @ca
label: er pladenummer for noteret musik af @da
definition: Relaterer et nomen til en manifestation af et udtryk af noteret musik, som har en identifikator for manifestation andet end et editionsnummer for noteret musik, angivet af en udgiver for at angive den trykplade, som er brugt i trykprocessen. @da
scope note: Nummeret fremtræder normalt nederst på hver side og sommetider på titelsiden. Nummeret kan sommetider indeholde intialer, forkortelser eller ord, som identificerer udgiveren, eller er efterfulgt af et nummer tilsvarende sideantal eller plader eller et nummer, som tilsvarer en enkeltside eller plade. @da
toolkit label: pladenummer for noteret musiknot af @da
toolkit definition: Manifestation af et udtryk af noteret musik, som har en identifikator for manifestation andet end et editionsnummer for noteret musik, angivet af en udgiver for at angive den trykplade, som er brugt i trykprocessen. @da
label: noodi trükiplaadinumber kehastuses @et
definition: Seostab nomen'i noodi väljenduse kehastusega, mille identifikaator ei ole noodi kirjastajanumber, vaid kirjastaja määratud number, mis osutab trükkimiseks kasutatud trükiplaadile. @et
scope note: Number asub tavaliselt iga lehekülje jaluses ja mõnikord tiitellehel. Number võib sisaldada kirjastajat identifitseerivaid initsiaale, lühendeid või sõnu, sellele võib järgneda arv, mis vastab lehekülgede või trükiplaatide arvule, või arv, mis vastab üksikule leheküljele või trükiplaadile. @et
toolkit label: noodi trükiplaadinumber kehastuses @et
toolkit definition: Noodi väljenduse kehastus, mille identifikaator ei ole noodi kirjastajanumber, vaid kirjastaja määratud number, mis osutab trükkimiseks kasutatud trükiplaadile. @et
label: ist Druckplattennummer für Noten von @de
definition: Setzt ein Nomen in Beziehung zu einer Manifestation einer Noten-Expression, die über einen Identifikator für eine Manifestation verfügt, der von einem Verlag zugewiesen wird, um die im Druckprozess verwendete Druckplatte anzugeben, und bei dem es sich nicht um die Noten-Bestellnummer handelt. @de
scope note: Die Nummer erscheint normalerweise am Ende jeder Seite und manchmal auf der Titelseite. Die Nummer kann aus Initialen, Abkürzungen oder Wörtern bestehen, die den Verlag identifizieren; gefolgt von einer Zahl, die der Zahl der Seiten oder Platten entspricht oder einer Zahl, die einer einzelnen Seite oder Platte entspricht. @de
toolkit label: Druckplattennummer für Noten von @de
toolkit definition: Eine Manifestation einer Noten-Expression, die über einen Identifikator für eine Manifestation verfügt, der von einem Verlag zugewiesen wird, um die im Druckprozess verwendete Druckplatte anzugeben, und bei dem es sich nicht um die Noten-Bestellnummer handelt. @de
label: zenei műjegyzéki lemezszáma a következőnek: @hu
definition: Egy zeneilejegyzés-kifejezési forma megjelenési formája, amelynek a megjelenésiforma-azonosítója eltér a kiadói műjegyzékszámtól, amellyel a kiadó a nyomtatás során használt nyomólemezt jelöli. @hu
scope note: Az azonosító általában a lapok alján látható, azonban előfordulhat a címoldalon is. A műjegyzéki lemezszám néha magába foglal kezdőbetűket, rövidítéseket vagy a kiadót megnevező szavakat. Időnként egy szám követi, amely megfelel az oldalak vagy lemezek számának vagy egy szám, amely megfelel egyedi oldalnak vagy lemeznek. @hu
toolkit label: zenei műjegyzéki lemezszáma: @hu
toolkit definition: Hozzákapcsol egy noment egy zeneilejegyzés-kifejezési forma megjelenési formájához, amelynek a megjelenésiforma-azonosítója eltér a kiadói műjegyzékszámtól, amellyel a kiadó a nyomtatás során használt nyomólemezt jelöli. @hu
label: è numero di lastra per la musica notata @it
definition: Correla un nomen a una manifestazione di una espressione di musica notata che ha un identificatore per la manifestazione diverso dal numero di editore per la musica notata, assegnato da un editore per indicare la lastra usata nel processo di stampa. @it
scope note: Il numero di solito è presente alla base di ciascuna pagina e a volte sul frontespizio. Il numero può comprendere iniziali, abbreviazioni, o parole che identificano l'editore, o seguito da un numero corrispondente al numero di pagine o lastre o un numero che corrisponde una singola pagina o lastra. @it
toolkit label: numero di lastra per la musica notata @it
toolkit definition: Una manifestazione di una espressione di musica notata che ha un identificatore per la manifestazione diverso dal numero di editore per la musica notata, assegnato da un editore per indicare la lastra usata nel processo di stampa. @it
label: ir plātnes numurs @lv
toolkit label: ir plātnes numurs @lv
definition: Sasaista nomenu ar manifestāciju, kurai piešķirts nošu izdevēja numerācijas apzīmējums. Plātnes numurs reizēm ietver iniciāļus, saīsinājumus vai vārdus, kas identificē izdevēju. Dažreiz tam seko skaitlis, kas atbilst lappušu vai plātnes skaitam vai skaitlim, kas atbilst atsevišķai lapai vai plātnei. @lv
toolkit definition: Manifestācija, kurai piešķirts nošu izdevēja numerācijas apzīmējums. Plātnes numurs reizēm ietver iniciāļus, saīsinājumus vai vārdus, kas identificē izdevēju. Dažreiz tam seko skaitlis, kas atbilst lappušu vai plātnes skaitam vai skaitlim, kas atbilst atsevišķai lapai vai plātnei. @lv
scope note: Numurs parasti atrodas katras lapas apakšā, kā arī var būt titullapā. Numurs var ietvert iniciāļus, saīsinājumus vai vārdus, kas identificē izdevēju, vai tam var sekot numurs, kas atbilst lapu vai plātņu skaitam, vai numurs, kas atbilst atsevišķai lapai vai plātnei. @lv
label: 是……的乐谱的版号 @zh-hans
toolkit label: ……的乐谱的版号 @zh-hans
definition: 将一个命名与有出版者分配以表示印刷过程中所用印版的除乐谱出版者编号以外的一种载体表现的标识符的一种乐谱内容表达的一种载体表现关联起来。 @zh-hans
toolkit definition: 有出版者分配以表示印刷过程中所用印版的除乐谱出版者编号以外的一种载体表现的标识符的一种乐谱内容表达的一种载体表现 @zh-hans
scope note: 该编号通常出现在每页的底部，有时候出现在题名页上。该编号可以包括标识出版者的首字母缩写、缩略语或词，或者后随一个对应于页码、版号或对应于一个页或版的数字。 @zh-hans
has subproperty: P80155
label: notaya alınmış müziğinin plaka numarasıdır @tr
toolkit label: müzik notasının plaka numarası @tr
definition: Bir ismi, bir yayıncı tarafından baskı sürecinde kullanılan baskı plakasını belirtmek üzere atanan, notalı müzik için bir yayıncı numarasından başka bir belirleyici tanımlayıcıya sahip notalı bir müzik ifadesinin gösterimiyle ilişkilendirir. @tr

is preferred name of agent of
status: Published
type: Property
lexical alias: preferredNameOfAgentOf.en
domain: C10012
toolkit label: preferred name of agent of
definition: Relates a nomen to an agent who has a name of agent that is selected for preference in a specific application or context.
sub property of: is name of agent of
toolkit definition: An agent who has a name of agent that is selected for preference in a specific application or context.
has element type: 2
sub property of: is preferred name of RDA entity of
label: ensisijainen nimi toimijalle @fi
definition: Liittää nomenin toimijaan, jonka nimi on valittu ensisijaiseksi tietyssä sovelluksessa tai kontekstissa. @fi
toolkit label: ensisijainen nimi toimijalle @fi
toolkit definition: Toimija, jonka nimi on valittu ensisijaiseksi tietyssä sovelluksessa tai kontekstissa. @fi
label: er foretrukket navn på agent for @no
definition: Relaterer et nomen til en agent som har et navn for agent som er valgt som preferanse i en bestemt applikasjon eller kontekst. @no
toolkit label: foretrukket navn på agent for @no
toolkit definition: En agent som har et navn for agent som er valgt som preferanse i en bestemt applikasjon eller kontekst. @no
label: est un nom privilégié d’un agent de @fr
definition: Met un nomen en relation avec un agent qui possède un nom d’agent faisant l’objet d’un choix privilégié dans une application ou un contexte spécifiques. @fr
toolkit label: nom privilégié d’un agent de @fr
toolkit definition: Agent qui possède un nom d’agent faisant l’objet d’un choix privilégié dans une application ou un contexte spécifiques. @fr
label: is geprefereerde naam van actor van @nl
definition: Relateert een nomen aan een actor die een naam van actor heeft die als voorkeursterm geselecteerd is in een specifieke toepassing of context. @nl
toolkit label: geprefereerde naam van actor van @nl
toolkit definition: Een actor die een naam van actor heeft die als voorkeursterm geselecteerd is in een specifieke toepassing of context. @nl
label: هو اسم مفضل لوكيل لـ @ar
definition: يربط تسمية بوكيل له اسم وكيل اختير للتفضيل في تطبيق أو في سياق معين. @ar
toolkit label: اسم مفضل لوكيل لـ @ar
toolkit definition: وكيل له اسم وكيل اختير للتفضيل في تطبيق أو في سياق معين. @ar
label: és nom preferit d’agent de @ca
definition: Relaciona un nomen amb un agent que té un nom d’agent que se selecciona com a preferent en una aplicació o un context específic. @ca
toolkit label: nom preferit d’agent de @ca
toolkit definition: Agent que té un nom d’agent que se selecciona com a preferent en una aplicació o un context específic. @ca
label: er foretrukket navn på agent af @da
definition: Relaterer et nomen til en agent, som har et navn på agent, som er valgt som præference i en specifik anvendelse eller kontekst. @da
toolkit label: foretrukket navn på agent af @da
toolkit definition: Agent, som har et navn på agent, som er valgt som præference i en specifik anvendelse eller kontekst. @da
label: eelisnimi tegijale @et
definition: Seostab nomen'i tegijaga, kellel on kindlas rakenduses või kontekstis eelistatuks valitud nimi. @et
toolkit label: eelisnimi tegijale @et
toolkit definition: Tegija, kellel on kindlas rakenduses või kontekstis eelistatuks valitud nimi. @et
label: ist bevorzugter Name eines Akteurs von @de
definition: Setzt ein Nomen in Beziehung zu einem Akteur, der über einen Namen für einen Akteur verfügt, der in einer bestimmten Anwendung oder in einem bestimmten Kontext als Vorzugsform bestimmt wird. @de
toolkit label: Bevorzugter Name eines Akteurs von @de
toolkit definition: Ein Akteur, der über einen Namen für einen Akteur verfügt, der in einer bestimmten Anwendung oder in einem bestimmten Kontext als Vorzugsform bestimmt wird. @de
label: előnyben részesített neve a következő ágensnek: @hu
definition: Hozzákapcsol egy noment egy ágenshez, amelynek van egy olyan ágensneve, amelyet egy adott alkalmazásban vagy kontextusban előnyben részesítenek. @hu
toolkit label: előnyben részesített neve a következő ágensnek: @hu
toolkit definition: Egy ágens, amelynek van egy olyan ágensneve, amelyet egy adott alkalmazásban vagy kontextusban előnyben részesítenek. @hu
label: è nome preferito dell'agente di @it
definition: Correla un nomen a un agente che ha un nome di agente che è stato selezionato come preferito in una specifica applicazione o contesto. @it
toolkit label: nome preferito dell'agente di @it
toolkit definition: Un agente che ha un nome di agente che è stato selezionato come preferito in una specifica applicazione o contesto. @it
label: ir aģenta prioritārais vārds/nosaukums @lv
toolkit label: ir aģenta prioritārais vārds/nosaukums @lv
definition: Sasaista nomenu ar aģentu, kam ir aģenta vārds/nosaukums, kurš ir izvēlēts noteiktam lietojumam vai noteiktā kontekstā. @lv
toolkit definition: Aģents, kam ir aģenta vārds/nosaukums, kurš ir izvēlēts noteiktam lietojumam vai noteiktā kontekstā. @lv
label: 是……的行为者的首选名称 @zh-hans
toolkit label: ……的行为者的首选名称 @zh-hans
definition: 将一个命名与有在一个特定的应用或语境下被首选的一个行为者名称的一个行为者关联起来。 @zh-hans
toolkit definition: 有在一个特定的应用或语境下被首选的一个行为者名称的一个行为者 @zh-hans
has subproperty: is preferred name of collective agent of
has subproperty: is preferred name of person of
has subproperty: P80140
label: temsilcisinin tercih edilen adıdır @tr
toolkit label: temsilcisinin tercih edilen ismi @tr
definition: Bir ismi, belirli bir uygulama veya bağlamda tercih edilmek üzere seçilen bir temsilci adına sahip bir temsilciyle ilişkilendirir. @tr
toolkit definition: Belirli bir uygulama veya bağlamda tercih edilmek için seçilen bir temsilci adına sahip bir temsilci. @tr

is preferred name of collective agent of
status: Published
type: Property
lexical alias: preferredNameOfCollectiveAgentOf.en
domain: C10012
toolkit label: preferred name of collective agent of
sub property of: is name of collective agent of
definition: Relates a nomen to a collective agent who has a name of collective agent that is selected for preference in a specific application or context.
sub property of: is preferred name of agent of
toolkit definition: A collective agent who has a name of collective agent that is selected for preference in a specific application or context.
has element type: 2
label: ensisijainen nimi yhteistoimijalle @fi
definition: Liittää nomenin yhteistoimijaan, jonka nimi on valittu ensisijaiseksi tietyssä sovelluksessa tai kontekstissa. @fi
toolkit label: ensisijainen nimi yhteistoimijalle @fi
toolkit definition: Yhteistoimija, jonka nimi on valittu ensisijaiseksi tietyssä sovelluksessa tai kontekstissa. @fi
label: er foretrukket navn på kollektiv agent for @no
definition: Relaterer et nomen til en kollektiv agent som har et navn for kollektiv agent som er valgt som preferanse i en bestemt applikasjon eller kontekst. @no
toolkit label: foretrukket navn på kollektiv agent for @no
toolkit definition: En kollektiv agent som har et navn for kollektiv agent som er valgt som preferanse i en bestemt applikasjon eller kontekst. @no
label: est un nom privilégié d’un agent collectif de @fr
definition: Met un nomen en relation avec un agent collectif qui possède un nom d’agent collectif faisant l’objet d’un choix privilégié dans une application ou un contexte spécifiques. @fr
toolkit label: nom privilégié d’un agent collectif de @fr
toolkit definition: Agent collectif qui possède un nom d’agent collectif faisant l’objet d’un choix privilégié dans une application ou un contexte spécifiques. @fr
label: is geprefereerde naam van collectieve actor van @nl
definition: Relateert een nomen aan een collectieve actor die een naam van collectieve actor heeft die als voorkeursterm geselecteerd is in een specifieke toepassing of context. @nl
toolkit label: geprefereerde naam van collectieve actor van @nl
toolkit definition: Een collectieve actor die een naam van collectieve actor heeft die als voorkeursterm geselecteerd is in een specifieke toepassing of context. @nl
label: هو اسم مفضل لوكيل جماعي لـ @ar
definition: يربط تسمية بوكيل جماعي له اسم وكيل جماعي اختير للتفضيل في تطبيق أو في سياق معين. @ar
toolkit label: اسم مفضل لوكيل جماعي لـ @ar
toolkit definition: وكيل جماعي له اسم وكيل جماعي اختير للتفضيل في تطبيق أو في سياق معين. @ar
label: és nom preferit d’agent col·lectiu de @ca
definition: Relaciona un nomen amb un agent col·lectiu que té un nom d’agent col·lectiu que se selecciona com a preferent en una aplicació o un context específic. @ca
toolkit label: nom preferit d’agent col·lectiu de @ca
toolkit definition: Agent col·lectiu que té un nom d’agent col·lectiu que se selecciona com a preferent en una aplicació o un context específic. @ca
label: er foretrukket navn på kollektiv agent af @da
definition: Relaterer et nomen til en kollektiv agent, som har et navn på kollektiv agent, som er valgt som præference i en specifik anvendelse eller kontekst. @da
toolkit label: foretrukket navn på kollektiv agent af @da
toolkit definition: Kollektiv agent, som har et navn på kollektiv agent, som er valgt som præference i en specifik anvendelse eller kontekst. @da
label: eelisnimi kollektiivile @et
definition: Seostab nomen'i kollektiiviga, kellel on kindlas rakenduses või kontekstis eelistatuks valitud nimi. @et
toolkit label: eelisnimi kollektiivile @et
toolkit definition: Kollektiiv, kellel on kindlas rakenduses või kontekstis eelistatuks valitud nimi. @et
label: ist bevorzugter Name eines gemeinschaftlichen Akteurs von @de
definition: Setzt ein Nomen in Beziehung zu einem gemeinschaftlichen Akteur, der über einen Namen für einen gemeinschaftlichen Akteur verfügt, der in einer bestimmten Anwendung oder in einem bestimmten Kontext als Vorzugsform bestimmt wird. @de
toolkit label: Bevorzugter Name eines gemeinschaftlichen Akteurs von @de
toolkit definition: Ein gemeinschaftlicher Akteur, der über einen Namen für einen gemeinschaftlichen Akteur verfügt, der in einer bestimmten Anwendung oder in einem bestimmten Kontext als Vorzugsform bestimmt wird. @de
label: előnyben részesített neve a következő kollektív ágensnek: @hu
definition: Egy noment hozzákapcsol egy kollektív ágenshez, amelynek van egy olyan kollektívágens-neve, amelyet egy bizonyos alkalmazásban vagy kontextusban előnyben részesítenek. @hu
toolkit label: előnyben részesített neve a következő kollektív ágensnek: @hu
toolkit definition: Egy kollektív ágens, amelynek van egy olyan kollektívágens-neve, amelyet egy bizonyos alkalmazásban vagy kontextusban előnyben részesítenek. @hu
label: è nome preferito dell'agente collettivo di @it
definition: Correla un nomen a un agente collettivo che ha un nome di agente collettico che è stato selezionato come preferito in una specifica applicazione o contesto. @it
toolkit label: nome preferito dell'agente collettivo di @it
toolkit definition: Un agente collettivo che ha un nome di agente collettico che è stato selezionato come preferito in una specifica applicazione o contesto. @it
label: ir grupas prioritārais nosaukums @lv
toolkit label: ir grupas prioritārais nosaukums @lv
definition: Sasaista nomenu ar grupu, kam ir grupas nosaukums, kurš ir izvēlēts noteiktam lietojumam vai noteiktā kontekstā. @lv
toolkit definition: Grupa, kam ir grupas nosaukums, kurš ir izvēlēts noteiktam lietojumam vai noteiktā kontekstā. @lv
label: 是……的集体行为者的首选名称 @zh-hans
toolkit label: ……的集体行为者的首选名称 @zh-hans
definition: 将一个命名与有在一个特定的应用或语境下被首选的一个集体行为者名称的一个集体行为者关联起来。 @zh-hans
toolkit definition: 有在一个特定的应用或语境下被首选的一个集体行为者名称的一个集体行为者 @zh-hans
has subproperty: is preferred name of corporate body of
has subproperty: is preferred name of family of
has subproperty: P80141
label: kolektif temsilcisinin tercih edilen adıdır @tr
toolkit label: kolektif temsilcisinin tercih edilen ismi @tr
definition: Bir ismi, belirli bir uygulamada veya bağlamda tercih edilmek üzere seçilen bir kolektif temsilci adına sahip olan bir kolektif temsilciyle ilişkilendirir. @tr
toolkit definition: Belirli bir uygulama veya bağlamda tercih edilmek üzere seçilen bir kolektif temsilci adına sahip kolektif temsilci. @tr

is preferred name of corporate body of
status: Published
type: Property
lexical alias: preferredNameOfCorporateBodyOf.en
domain: C10012
sub property of: is name of corporate body of
definition: Relates a nomen to a corporate body who has a name of corporate body that is selected for preference in a specific application or context.
sub property of: is preferred name of collective agent of
toolkit label: preferred name of corporate body of
toolkit definition: A corporate body who has a name of corporate body that is selected for preference in a specific application or context.
has element type: 2
label: ensisijainen nimi yhteisölle @fi
definition: Liittää nomenin yhteisöön, jonka nimi on valittu ensisijaiseksi tietyssä sovelluksessa tai kontekstissä. @fi
toolkit label: ensisijainen nimi yhteisölle @fi
toolkit definition: Yhteisö, jonka nimeä ei ole valittu ensisijaiseksi tietyssä sovelluksessa tai kontekstissä. @fi
label: er foretrukket navn på korporasjon for @no
definition: Relaterer et nomen til en korporasjon som har et navn for korporasjon som er valgt som preferanse i en bestemt applikasjon eller kontekst. @no
toolkit label: foretrukket navn på korporasjon for @no
toolkit definition: En korporasjon som har et navn for korporasjon som er valgt som preferanse i en bestemt applikasjon eller kontekst. @no
label: est un nom privilégié d’une collectivité de @fr
definition: Met un nomen en relation avec une collectivité qui possède un nom de collectivité faisant l’objet d’un choix privilégié dans une application ou un contexte spécifiques. @fr
toolkit label: nom privilégié d’une collectivité de @fr
toolkit definition: Collectivité qui possède un nom de collectivité faisant l’objet d’un choix privilégié dans une application ou un contexte spécifiques. @fr
label: is geprefereerde naam van corporatie van @nl
definition: Relateert een nomen aan een corporatie die een naam van corporatie heeft die als voorkeursterm geselecteerd is in een specifieke toepassing of context. @nl
toolkit label: geprefereerde naam van corporatie van @nl
toolkit definition: Een corporatie die een naam van corporatie heeft die als voorkeursterm geselecteerd is in een specifieke toepassing of context. @nl
label: هو اسم هيئة مفضل لـ @ar
definition: يربط تسمية بهيئة لها اسم هيئة اختير للتفضيل في تطبيق أو في سياق معين. @ar
toolkit label: اسم هيئة مفضل لـ @ar
toolkit definition: هيئة لها اسم هيئة اختير للتفضيل في تطبيق أو في سياق معين. @ar
label: és nom preferit d’entitat corporativa de @ca
definition: Relaciona un nomen amb una entitat corporativa que té un nom d’entitat corporativa que se selecciona com a preferent en una aplicació o un context específic. @ca
toolkit label: nom preferit d’entitat corporativa de @ca
toolkit definition: Entitat corporativa que té un nom d’entitat corporativa que se selecciona com a preferent en una aplicació o un context específic. @ca
label: er foretrukket navn på korporation af @da
definition: Relaterer et nomen til en korporation, som har et navn på korporation, som er valgt som præference i en specifik anvendelse eller kontekst. @da
toolkit label: foretrukket navn på korporation af @da
toolkit definition: Korporation, som har et navn på korporation, som er valgt som præference i en specifik anvendelse eller kontekst. @da
label: eelisnimi asutusele @et
definition: Seostab nomen'i asutusega, kellel on kindlas rakenduses või kontekstis eelistatuks valitud nimi. @et
toolkit label: eelisnimi asutusele @et
toolkit definition: Asutus, kellel on kindlas rakenduses või kontekstis eelistatuks valitud nimi. @et
label: ist bevorzugter Name einer Körperschaft von @de
definition: Setzt ein Nomen in Beziehung zu einer Körperschaft, die über einen Namen für eine Körperschaft verfügt, der in einer bestimmten Anwendung oder in einem bestimmten Kontext als Vorzugsform bestimmt wird. @de
toolkit label: Bevorzugter Name einer Körperschaft von @de
toolkit definition: Eine Körperschaft, die über einen Namen für eine Körperschaft verfügt, der in einer bestimmten Anwendung oder in einem bestimmten Kontext als Vorzugsform bestimmt wird. @de
label: testület előnyben részesített neve: @hu
definition: Egy noment hozzákapcsol egy testülethez, amelynek van egy olyan testületneve, amelyet egy bizonyos alkalmazásban vagy kontextusban előnyben részesítenek. @hu
toolkit label: testület előnyben részesített neve @hu
toolkit definition: Egy testület, amelynek van egy olyan testületneve, amelyet egy bizonyos alkalmazásban vagy kontextusban előnyben részesítenek. @hu
label: è nome preferito dell'ente di @it
definition: Correla un nomen a un ente che ha un nome di ente che è stato selezionato come preferito in una specifica applicazione o contesto. @it
toolkit label: nome preferito dell'ente di @it
toolkit definition: Un ente che ha un nome di ente che è stato selezionato come preferito in una specifica applicazione o contesto. @it
label: ir institūcijas prioritārais nosaukums @lv
definition: Sasaista nomenu ar institūciju, kam ir institūcijas nosaukums, kurš ir izvēlēts noteiktam lietojumam vai noteiktā kontekstā. @lv
toolkit label: ir institūcijas prioritārais nosaukums @lv
toolkit definition: Institūcija, kam ir institūcijas nosaukums, kurš ir izvēlēts noteiktam lietojumam vai noteiktā kontekstā. @lv
label: 是……的团体的首选名称 @zh-hans
definition: 将一个命名与有在一个特定的应用或语境下被首选的一个团体名称的一个团体关联起来。 @zh-hans
toolkit label: ……的团体的首选名称 @zh-hans
toolkit definition: 有在一个特定的应用或语境下被首选的一个团体名称的一个团体 @zh-hans
has subproperty: P80144
label: tüzel kişisinin tercih edilen adıdır @tr
definition: Bir ismi, tüzel kişilik adı belirli bir uygulamada veya içerikte tercih edilmek üzere seçilmiş olan bir tüzel kişililikle ilişkilendirir. @tr
toolkit label: tüzel kişiliğinin tercih edilen ismi @tr
toolkit definition: Tüzel kişilik adı belirli bir uygulamada veya içerikte tercih edilmek üzere seçilmiş olan bir tüzel kişililik. @tr

is preferred name of family of
status: Published
type: Property
lexical alias: preferredNameOfFamilyOf.en
domain: C10012
sub property of: is name of family of
definition: Relates a nomen to a family who has a name of family that is selected for preference in a specific application or context.
sub property of: is preferred name of collective agent of
toolkit label: preferred name of family of
toolkit definition: A family who has a name of family that is selected for preference in a specific application or context.
has element type: 2
label: ensisijainen nimi suvulle @fi
definition: Liittää nomenin sukuun, jonka nimi on valittu ensisijaiseksi tietyssä sovelluksessa tai kontekstissä. @fi
toolkit label: ensisijainen nimi suvulle @fi
toolkit definition: Suku, jonka nimeä ei ole valittu ensisijaiseksi tietyssä sovelluksessa tai kontekstissä. @fi
label: er foretrukket navn på familie for @no
definition: Relaterer et nomen til en familie som har et navn for familie som er valgt som preferanse i en bestemt applikasjon eller kontekst. @no
toolkit label: foretrukket navn på familie for @no
toolkit definition: En familie som har et navn for familie som er valgt som preferanse i en bestemt applikasjon eller kontekst. @no
label: est un nom privilégié d’une famille de @fr
definition: Met un nomen en relation avec une famille qui possède un nom d’une famille faisant l’objet d’un choix privilégié dans une application ou un contexte spécifiques. @fr
toolkit label: nom privilégié d’une famille de @fr
toolkit definition: Famille qui possède un nom d’une famille faisant l’objet d’un choix privilégié dans une application ou un contexte spécifiques. @fr
label: is geprefereerde naam van familie van @nl
definition: Relateert een nomen aan een familie die een naam van familie heeft die als voorkeursterm geselecteerd is in een specifieke toepassing of context. @nl
toolkit label: geprefereerde naam van familie van @nl
toolkit definition: Een familie die een naam van familie heeft die als voorkeursterm geselecteerd is in een specifieke toepassing of context. @nl
label: هو اسم عائلة مفضل لـ @ar
definition: يربط تسمية بعائلة لها اسم عائلة اختير للتفضيل في تطبيق أو في سياق معين. @ar
toolkit label: اسم عائلة مفضل لـ @ar
toolkit definition: عائلة لها اسم عائلة اختير للتفضيل في تطبيق أو في سياق معين. @ar
label: és nom preferit de família de @ca
definition: Relaciona un nomen amb una família que té un nom de família que se selecciona com a preferent en una aplicació o un context específic. @ca
toolkit label: nom preferit de família de @ca
toolkit definition: Família que té un nom de família que se selecciona com a preferent en una aplicació o un context específic. @ca
label: er foretrukket navn på familie af @da
definition: Relaterer et nomen til en familie, som har et navn på familie, som er valgt som præference i en specifik anvendelse eller kontekst. @da
toolkit label: foretrukket navn på familie af @da
toolkit definition: Familie, som har et navn på familie, som er valgt som præference i en specifik anvendelse eller kontekst. @da
label: eelisnimi perekonnale @et
definition: Seostab nomen'i perekonnaga, kellel on kindlas rakenduses või kontekstis eelistatuks valitud nimi. @et
toolkit label: eelisnimi perekonnale @et
toolkit definition: Perekond, kellel on kindlas rakenduses või kontekstis eelistatuks valitud nimi. @et
label: ist bevorzugter Name einer Familie von @de
definition: Setzt ein Nomen in Beziehung zu einer Familie, die über einen Namen für eine Familie verfügt, der in einer bestimmten Anwendung oder in einem bestimmten Kontext als Vorzugsform bestimmt wird. @de
toolkit label: Bevorzugter Name einer Familie von @de
toolkit definition: Eine Familie, die über einen Namen für eine Familie verfügt, der in einer bestimmten Anwendung oder in einem bestimmten Kontext als Vorzugsform bestimmt wird. @de
label: előnyben részesített entitásneve a következőnek: @hu
definition: Egy noment hozzákapcsol egy családhoz, amelynek van egy olyan családneve, amelyet egy bizonyos alkalmazásban vagy kontextusban előnyben részesítenek. @hu
toolkit label: család előnyben részesített neve: @hu
toolkit definition: Egy család, amelynek van egy olyan családneve, amelyet egy bizonyos alkalmazásban vagy kontextusban előnyben részesítenek. @hu
label: è nome preferito della famiglia di @it
definition: Correla un nomen a una famiglia che ha un nome di famiglia che è stato selezionato come preferito in una specifica applicazione o contesto. @it
toolkit label: nome preferito della famiglia di @it
toolkit definition: Una famiglia che ha un nome di famiglia che è stato selezionato come preferito in una specifica applicazione o contesto. @it
label: ir dzimtas/ģimenes prioritārais vārds @lv
definition: Sasaista nomenu ar dzimtu/ģimeni, kam ir dzimtas/ģimenes vārds, kurš ir izvēlēts noteiktam lietojumam vai noteiktā kontekstā. @lv
toolkit label: ir dzimtas/ģimenes prioritārais vārds @lv
toolkit definition: Dzimta/ģimene, kam ir dzimtas/ģimenes vārds, kurš ir izvēlēts noteiktam lietojumam vai noteiktā kontekstā. @lv
label: 是……的家族的首选名称 @zh-hans
definition: 将一个命名与有在一个特定的应用或语境下被首选的一个家族名称的一个家族关联起来。 @zh-hans
toolkit label: ……的家族的首选名称 @zh-hans
toolkit definition: 有在一个特定的应用或语境下被首选的一个家族名称的一个家族 @zh-hans
has subproperty: P80145
label: ailesinin tercih edilen adıdır @tr
definition: Bir ismi, aile adı belirli bir uygulamada veya içerikte tercih edilmek üzere seçilmiş olan bir aile ile ilişkilendirir. @tr
toolkit label: ailesinin tercih ettiği isim @tr
toolkit definition: Aile adı belirli bir uygulamada veya içerikte tercih edilmek üzere seçilmiş olan bir aile. @tr

is preferred name of person of
status: Published
type: Property
lexical alias: preferredNameOfPersonOf.en
domain: C10012
sub property of: is name of person of
definition: Relates a nomen to a person who has a name of person that is selected for preference in a specific application or context.
sub property of: is preferred name of agent of
toolkit label: preferred name of person of
toolkit definition: A person who has a name of person that is selected for preference in a specific application or context.
has element type: 2
label: ensisijainen nimi henkilölle @fi
definition: Liittää nomenin henkilöön, jonka nimi on valittu ensisijaiseksi tietyssä sovelluksessa tai kontekstissä. @fi
toolkit label: ensisijainen nimi henkilölle @fi
toolkit definition: Henkilö, jonka nimeä ei ole valittu ensisijaiseksi tietyssä sovelluksessa tai kontekstissä. @fi
label: er foretrukket navn på person for @no
definition: Relaterer et nomen til en person som har et navn for person som er valgt som preferanse i en bestemt applikasjon eller kontekst. @no
toolkit label: foretrukket navn på person for @no
toolkit definition: En person som har et navn for person som er valgt som preferanse i en bestemt applikasjon eller kontekst. @no
label: est un nom privilégié d’une personne de @fr
definition: Met un nomen en relation avec une personne qui possède un nom de personne faisant l’objet d’un choix privilégié dans une application ou un contexte spécifiques. @fr
toolkit label: nom privilégié d’une personne de @fr
toolkit definition: Personne qui possède un nom de personne faisant l’objet d’un choix privilégié dans une application ou un contexte spécifiques. @fr
label: is geprefereerde naam van persoon van @nl
definition: Relateert een nomen aan een persoon die een naam van persoon heeft die als voorkeursterm geselecteerd is in een specifieke toepassing of context. @nl
toolkit label: geprefereerde naam van persoon van @nl
toolkit definition: Een persoon die een naam van persoon heeft die als voorkeursterm geselecteerd is in een specifieke toepassing of context. @nl
label: هو اسم شخص مفضل لـ @ar
definition: يربط تسمية بشخص له اسم شخص اختير للتفضيل في تطبيق أو في سياق معين. @ar
toolkit label: اسم شخص مفضل لـ @ar
toolkit definition: شخص له اسم شخص اختير للتفضيل في تطبيق أو في سياق معين. @ar
label: és nom preferit de persona de @ca
definition: Relaciona un nomen amb una persona que té un nom de persona que se selecciona com a preferent en una aplicació o un context específic. @ca
toolkit label: nom preferit de persona de @ca
toolkit definition: Persona que té un nom de persona que se selecciona com a preferent en una aplicació o un context específic. @ca
label: er foretrukket navn på person af @da
definition: Relaterer et nomen til en person, som har et navn på person, som er valgt som præference i en specifik anvendelse eller kontekst. @da
toolkit label: foretrukket navn på person af @da
toolkit definition: Person, som har et navn på person, som er valgt som præference i en specifik anvendelse eller kontekst. @da
label: eelisnimi isikule @et
definition: Seostab nomen'i isikuga, kellel on kindlas rakenduses või kontekstis eelistatuks valitud nimi. @et
toolkit label: eelisnimi isikule @et
toolkit definition: Isik, kellel on kindlas rakenduses või kontekstis eelistatuks valitud nimi. @et
label: ist bevorzugter Name einer Person von @de
definition: Setzt ein Nomen in Beziehung zu einer Person, die über einen Namen für eine Person verfügt, der in einer bestimmten Anwendung oder in einem bestimmten Kontext als Vorzugsform bestimmt wird. @de
toolkit label: Bevorzugter Name einer Person von @de
toolkit definition: Eine Person, die über einen Namen für eine Person verfügt, der in einer bestimmten Anwendung oder in einem bestimmten Kontext als Vorzugsform bestimmt wird. @de
label: előnyben részesített neve a következő személynek: @hu
definition: Egy noment hozzákapcsol egy személyhez, amelynek van egy olyan személyneve, amelyet egy bizonyos alkalmazásban vagy kontextusban előnyben részesítenek. @hu
toolkit label: előnyben részesített neve a következő személynek: @hu
toolkit definition: Egy személy, amelynek van egy olyan személyneve, amelyet egy bizonyos alkalmazásban vagy kontextusban előnyben részesítenek. @hu
label: è nome preferito della persona di @it
definition: Correla un nomen a una persona che ha un nome di persona che è stato selezionato come preferito in una specifica applicazione o contesto. @it
toolkit label: nome preferito della persona di @it
toolkit definition: Una persona che ha un nome di persona che è stato selezionato come preferito in una specifica applicazione o contesto. @it
label: ir personas prioritārais vārds @lv
definition: Sasaista nomenu ar personu, kurai ir personas vārds, kurš ir izvēlēts noteiktam lietojumam vai noteiktā kontekstā. @lv
toolkit label: ir personas prioritārais vārds @lv
toolkit definition: Persona, kurai ir personas vārds, kurš ir izvēlēts noteiktam lietojumam vai noteiktā kontekstā. @lv
label: 是……的个人的首选名称 @zh-hans
definition: 将一个命名与有在一个特定的应用或语境下被首选的一个个人名称的一个个人关联起来。 @zh-hans
toolkit label: ……的个人的首选名称 @zh-hans
toolkit definition: 有在一个特定的应用或语境下被首选的一个个人名称的一个个人 @zh-hans
has subproperty: P80146
label: kişisinin tercih edilen adıdır @tr
definition: Bir ismi, kişinin adı belirli bir uygulamada veya içerikte tercih edilmek üzere seçilmiş olan bir kişi ile ilişkilendirir. @tr
toolkit label: kişinin tercih ettiği isim @tr
toolkit definition: Belirli bir uygulama veya bağlamda tercih için seçilen bir kişinin adına sahip olan kişi. @tr

is preferred name of place of
status: Published
type: Property
lexical alias: preferredNameOfPlaceOf.en
definition: Relates a nomen to a place that has a name of place that is selected for preference in a specific application or context.
domain: C10012
toolkit label: preferred name of place of
toolkit definition: A place that has a name of place that is selected for preference in a specific application or context.
sub property of: is name of place of
has element type: 2
sub property of: is preferred name of RDA entity of
label: ensisijainen nimi paikalle @fi
definition: Liittää nomenin paikkaan, jonka nimi on valittu ensisijaiseksi tietyssä sovelluksessa tai kontekstissa. @fi
toolkit label: ensisijainen nimi paikalle @fi
toolkit definition: Paikka, jonka nimi on valittu ensisijaiseksi tietyssä sovelluksessa tai kontekstissa. @fi
label: er foretrukket navn på sted for @no
definition: Relaterer et nomen til et sted som har et navn for sted som er valgt som preferanse i en bestemt applikasjon eller kontekst. @no
toolkit label: foretrukket navn på sted for @no
toolkit definition: Et sted som har et navn for sted som er valgt som preferanse i en bestemt applikasjon eller kontekst. @no
label: est un nom privilégié d’un lieu de @fr
definition: Met un nomen en relation avec un lieu qui possède un nom de lieu faisant l’objet d’un choix privilégié dans une application ou un contexte spécifiques. @fr
toolkit label: nom privilégié d’un lieu de @fr
toolkit definition: Lieu qui possède un nom de lieu faisant l’objet d’un choix privilégié dans une application ou un contexte spécifiques. @fr
label: is geprefereerde naam van plaats van @nl
definition: Relateert een nomen aan een plaats die een naam van plaats heeft die als voorkeursterm geselecteerd is in een specifieke toepassing of context. @nl
toolkit label: geprefereerde naam van plaats van @nl
toolkit definition: Een plaats die een naam van plaats heeft die als voorkeursterm geselecteerd is in een specifieke toepassing of context. @nl
label: هو اسم مكان مفضل لـ @ar
definition: يربط تسمية بمكان له اسم مكان اختير للتفضيل في تطبيق أو في سياق معين. @ar
toolkit label: اسم مكان مفضل لـ @ar
toolkit definition: مكان له اسم مكان اختير للتفضيل في تطبيق أو في سياق معين. @ar
label: és nom preferit de lloc de @ca
definition: Relaciona un nomen amb un lloc que té un nom de lloc que se selecciona com a preferent en una aplicació o un context específic. @ca
toolkit label: nom preferit de lloc de @ca
toolkit definition: Lloc que té un nom de lloc que se selecciona com a preferent en una aplicació o un context específic. @ca
label: er foretrukket navn på sted af @da
definition: Relaterer et nomen til et sted, som har et navn på sted, som er valgt som præference i en specifik anvendelse eller kontekst. @da
toolkit label: foretrukket navn på sted af @da
toolkit definition: Sted, som har et navn på sted, som er valgt som præference i en specifik anvendelse eller kontekst. @da
label: eelisnimi kohale @et
definition: Seostab nomen'i kohaga, millel on kindlas rakenduses või kontekstis eelistatuks valitud nimi. @et
toolkit label: eelisnimi kohale @et
toolkit definition: Koht, millel on kindlas rakenduses või kontekstis eelistatuks valitud nimi. @et
label: ist bevorzugter Name eines Geografikums von @de
definition: Setzt ein Nomen in Beziehung zu einem Geografikum, das über einen Namen für ein Geografikum verfügt, der in einer bestimmten Anwendung oder in einem bestimmten Kontext als Vorzugsform bestimmt wird. @de
toolkit label: Bevorzugter Name eines Geografikums von @de
toolkit definition: Ein Geografikum, das über einen Namen für ein Geografikum verfügt, der in einer bestimmten Anwendung oder in einem bestimmten Kontext als Vorzugsform bestimmt wird. @de
label: előnyben részesített helyneve a következőnek: @hu
definition: Hozzákapcsol egy noment egy helyhez, amelynek van egy olyan helyneve, amelyet egy adott alkalmazásban vagy kontextusban előnyben részesítenek. @hu
toolkit label: előnyben részesített helyneve: @hu
toolkit definition: Egy hely, amelynek van egy olyan helyneve, amelyet egy adott alkalmazásban vagy kontextusban előnyben részesítenek. @hu
label: è nome preferito del luogo di @it
definition: Correla un nomen a un luogo che ha un nome di luogo che è stato selezionato come preferito in una specifica applicazione o contesto. @it
toolkit label: nome preferito del luogo di @it
toolkit definition: Un luogo che ha un nome di luogo che è stato selezionato come preferito in una specifica applicazione o contesto. @it
label: ir vietas prioritārais nosaukums @lv
definition: Sasaista nomenu ar vietu, kurai ir vietas nosaukums, kas ir izvēlēts noteiktam lietojumam vai noteiktā kontekstā. @lv
toolkit label: ir vietas prioritārais nosaukums @lv
toolkit definition: Vieta, kurai ir vietas nosaukums, kas ir izvēlēts noteiktam lietojumam vai noteiktā kontekstā. @lv
label: 是……的地点的首选名称 @zh-hans
definition: 将一个命名与有在一个特定的应用或语境中被首选的一个地点名称的一个地点关联起来。 @zh-hans
toolkit label: ……的地点的首选名称 @zh-hans
toolkit definition: 有在一个特定的应用或语境中被首选的一个地点名称的一个地点 @zh-hans
has subproperty: P80087
label: yerinin tercih edilen adıdır @tr
definition: Bir ismi, belirli bir uygulama veya bağlamda tercih edilmek üzere seçilen bir yer adına sahip bir yerle ilişkilendirir. @tr
toolkit label: yerin tercih edilen ismi @tr
toolkit definition: Belirli bir uygulama veya bağlamda tercih edilmek üzere seçilen bir yer adına sahip olan bir yer. @tr

is preferred name of RDA entity of
status: Published
type: Property
lexical alias: preferredNameOfRDAEntityOf.en
definition: Relates a nomen to an RDA entity that has a name of RDA entity that is selected for preference in a specific application or context.
domain: C10012
toolkit label: preferred name of RDA entity of
toolkit definition: An RDA entity that has a name of RDA entity that is selected for preference in a specific application or context.
has element type: 2
sub property of: is name of RDA entity of
label: ensisijainen nimi RDA-entiteetille @fi
definition: Liittää nomenin RDA-entiteettiin, jonka nimi on valittu ensisijaiseksi tietyssä sovelluksessa tai kontekstissä. @fi
toolkit label: ensisijainen nimi RDA-entiteetille @fi
toolkit definition: RDA-entiteetti, jonka nimi on valittu ensisijaiseksi tietyssä sovelluksessa tai kontekstissä. @fi
label: er foretrukket navn for RDA-entitet for @no
definition: Relaterer et nomen til en RDA-entitet som har et navn for RDA-entitet som er valgt som preferanse i en bestemt applikasjon eller kontekst. @no
toolkit label: foretrukket navn for RDA-entitet for @no
toolkit definition: En RDA-entitet som har et navn for RDA-entitet som er valgt som preferanse i en bestemt applikasjon eller kontekst. @no
label: est un nom privilégié d’une entité RDA de @fr
definition: Met un nomen en relation avec une entité RDA qui possède un nom d’entité RDA faisant l’objet d’un choix privilégié dans une application ou un contexte spécifiques. @fr
toolkit label: nom privilégié d’une entité RDA de @fr
toolkit definition: Entité RDA qui possède un nom d’entité RDA faisant l’objet d’un choix privilégié dans une application ou un contexte spécifiques. @fr
label: is geprefereerde naam van RDA-entiteit @nl
definition: Relateert een nomen aan een RDA-entiteit die een naam van RDA-entiteit heeft die als voorkeursterm geselecteerd is in een specifieke toepassing of context. @nl
toolkit label: geprefereerde naam van RDA-entiteit @nl
toolkit definition: Een RDA-entiteit die een naam van RDA-entiteit heeft die als voorkeursterm geselecteerd is in een specifieke toepassing of context. @nl
label: هو اسم مفضل لكيان "وام" لـ @ar
definition: يربط تسمية بكيان "وام" له اسم كيان "وام" اختير للتفضيل في تطبيق أو في سياق معين. @ar
toolkit label: اسم مفضل لكيان "وام" لـ @ar
toolkit definition: كيان "وام" له اسم كيان "وام" اختير للتفضيل في تطبيق أو في سياق معين. @ar
label: és nom preferit d’entitat RDA de @ca
definition: Relaciona un nomen amb una entitat RDA que té un nom d’entitat RDA que se selecciona com a preferent en una aplicació o un context específic. @ca
toolkit label: nom preferit d’entitat RDA de @ca
toolkit definition: Entitat RDA que té un nom d’entitat RDA que se selecciona com a preferent en una aplicació o un context específic. @ca
label: er foretrukket navn på RDA-entitet af @da
definition: Relaterer et nomen til en RDA-entitet, som har et navn på RDA-entitet, som er valgt som præference i en specifik anvendelse eller kontekst. @da
toolkit label: foretrukket navn på RDA-entitet af @da
toolkit definition: RDA-entitet, som har et navn på RDA-entitet, som er valgt som præference i en specifik anvendelse eller kontekst. @da
label: eelisnimi RDA olemile @et
definition: Seostab nomen'i RDA olemiga, millel on kindlas rakenduses või kontekstis eelistatuks valitud nimi. @et
toolkit label: eelisnimi RDA olemile @et
toolkit definition: RDA olem, millel on kindlas rakenduses või kontekstis eelistatuks valitud nimi. @et
label: ist bevorzugter Name einer RDA-Entität von @de
definition: Setzt ein Nomen in Beziehung zu einer RDA-Entität, die über einen Namen für eine RDA-Entität verfügt, der in einer bestimmten Anwendung oder in einem bestimmten Kontext als Vorzugsform bestimmt wird. @de
toolkit label: Bevorzugter Name einer RDA-Entität von @de
toolkit definition: Eine RDA-Entität, die über einen Namen für eine RDA-Entität verfügt, der in einer bestimmten Anwendung oder in einem bestimmten Kontext als Vorzugsform bestimmt wird. @de
label: előnyben részesített RDA-entitás neve a következőnek: @hu
definition: Hozzákapcsol egy noment egy RDA-entitáshoz, amelynek van egy olyan RDA-entitásneve, amelyet egy bizonyos alkalmazásban vagy kontextusban előnyben részesítenek. @hu
toolkit label: előnyben részesített RDA-entitás neve: @hu
toolkit definition: Egy RDA-entitás, amelynek van egy olyan RDA-entitásneve, amelyet egy bizonyos alkalmazásban vagy kontextusban előnyben részesítenek. @hu
label: è nome preferito dell'entità RDA di @it
definition: Correla un nomen a un'entità RDA che ha un nome di entità RDA che è stato selezionato come preferito in una specifica applicazione o contesto. @it
toolkit label: nome preferito dell'entità RDA di @it
toolkit definition: Un'entità RDA che ha un nome di entità RDA che è stato selezionato come preferito in una specifica applicazione o contesto. @it
label: ir RDA entītes prioritārais nosaukums @lv
definition: Sasaista nomenu ar RDA entīti, kurai ir Sasaista nomenu ar RDA entītis nosaukums, kas ir izvēlēts noteiktam lietojumam vai noteiktā kontekstā. @lv
toolkit label: ir RDA entītes prioritārais nosaukums @lv
toolkit definition: RDA entīte, kurai ir RDA entītes nosaukums, kas ir izvēlēts noteiktam lietojumam vai noteiktā kontekstā. @lv
label: 是……的RDA实体的首选名称 @zh-hans
definition: 将一个命名与有在一个特定的应用或语境中被首选的一个RDA实体名称的一个RDA实体关联起来。 @zh-hans
toolkit label: ……的RDA实体的首选名称 @zh-hans
toolkit definition: 有在一个特定的应用或语境中被首选的一个RDA实体名称的一个RDA实体 @zh-hans
has subproperty: is preferred name of agent of
has subproperty: is preferred name of place of
has subproperty: is preferred name of timespan of
has subproperty: is preferred title of expression of
has subproperty: is preferred title of item of
has subproperty: is preferred title of work of
has subproperty: P80163
label: RDA varlığının tercih edilen adıdır @tr
definition: Bir ismi, belirli bir uygulama veya bağlamda tercih edilmek üzere seçilen bir RDA varlığı adına sahip bir RDA varlığıyla ilişkilendirir. @tr
toolkit label: RDA varlığının tercih edilen ismi @tr
toolkit definition: Belirli bir uygulama veya bağlamda tercih edilmek üzere seçilen bir RDA varlığı adına sahip bir RDA varlığı. @tr

is preferred name of timespan of
status: Published
type: Property
lexical alias: preferredNameOfTimespanOf.en
definition: Relates a nomen to a timespan that has a name of timespan that is selected for preference in a specific application or context.
domain: C10012
toolkit label: preferred name of timespan of
toolkit definition: A timespan that has a name of timespan that is selected for preference in a specific application or context.
sub property of: is name of timespan of
has element type: 2
sub property of: is preferred name of RDA entity of
label: ensisijainen nimi ajanjaksolle @fi
definition: Liittää nomenin ajanjaksoon, jonka nimi on valittu ensisijaiseksi tietyssä sovelluksessa tai kontekstissa. @fi
toolkit label: ensisijainen nimi ajanjaksolle @fi
toolkit definition: Ajanjakso, jonka nimi on valittu ensisijaiseksi tietyssä sovelluksessa tai kontekstissa. @fi
label: er foretrukket navn på tidsrom for @no
definition: Relaterer et nomen til et tidsrom som har et navn for tidsrom som er valgt som preferanse i en bestemt applikasjon eller kontekst. @no
toolkit label: foretrukket navn på tidsrom for @no
toolkit definition: Et tidsrom som har et navn for tidsrom som er valgt som preferanse i en bestemt applikasjon eller kontekst. @no
label: est un nom privilégié d’un laps de temps de @fr
definition: Met un nomen en relation avec un laps de temps qui possède un nom de laps de temps faisant l’objet d’un choix privilégié dans un schéma d’encodage de vocabulaire spécifique. @fr
toolkit label: nom privilégié d’un laps de temps de @fr
toolkit definition: Laps de temps qui possède un nom de laps de temps faisant l’objet d’un choix privilégié dans un schéma d’encodage de vocabulaire spécifique. @fr
label: is geprefereerde naam van tijdspanne van @nl
definition: Relateert een nomen aan een tijdspanne die een naam van tijdspanne heeft die als voorkeursterm geselecteerd is in een specifieke toepassing of context. @nl
toolkit label: geprefereerde naam van tijdspanne van @nl
toolkit definition: Een tijdspanne die een naam van tijdspanne heeft die als voorkeursterm geselecteerd is in een specifieke toepassing of context. @nl
label: هو اسم فترة زمنية مفضل لـ @ar
definition: يربط تسمية بفترة زمنية لها اسم لفترة زمنية، اختير للتفضيل في تطبيق أو في سياق معين. @ar
toolkit label: اسم فترة زمنية مفضل لـ @ar
toolkit definition: فترة زمنية لها اسم لفترة زمنية، اختير للتفضيل في تطبيق أو في سياق معين. @ar
label: és nom preferit d’interval de temps de @ca
definition: Relaciona un nomen amb un interval de temps que té un nom d’interval de temps que se selecciona com a preferent en una aplicació o un context específic. @ca
toolkit label: nom preferit d’interval de temps de @ca
toolkit definition: Interval de temps que té un nom d’interval de temps que se selecciona com a preferent en una aplicació o un context específic. @ca
label: er foretrukket navn på tidsperiode af @da
definition: Relaterer et nomen til en tidsperiode, som har et navn på tidsperiode, som er valgt som præference i en specifik anvendelse eller kontekst. @da
toolkit label: foretrukket navn på tidsperiode af @da
toolkit definition: Tidsperiode, som har et navn på tidsperiode, som er valgt som præference i en specifik anvendelse eller kontekst. @da
label: eelisnimi ajavahemikule @et
definition: Seostab nomen'i ajavahemikuga, millel on kindlas rakenduses või kontekstis eelistatuks valitud nimi. @et
toolkit label: eelisnimi ajavahemikule @et
toolkit definition: Ajavahemik, millel on kindlas rakenduses või kontekstis eelistatuks valitud nimi. @et
label: ist bevorzugter Name eines Zeitraums von @de
definition: Setzt ein Nomen in Beziehung zu einem Zeitraum, der über einen Namen für einen Zeitraum verfügt, der in einer bestimmten Anwendung oder in einem bestimmten Kontext als Vorzugsform bestimmt wird. @de
toolkit label: bevorzugter Name eines Zeitraums von @de
toolkit definition: Ein Zeitraum, der über einen Namen für einen Zeitraum verfügt, der in einer bestimmten Anwendung oder in einem bestimmten Kontext als Vorzugsform bestimmt wird. @de
label: előnyben részesített időtartamneve a következőnek: @hu
definition: Hozzákapcsol egy noment egy időtartamhoz, amelynek van egy olyan időtartamneve, amelyet egy adott alkalmazásban vagy kontextusban előnyben részesítenek. @hu
toolkit label: előnyben részesített időtartamneve: @hu
toolkit definition: Egy időtartam, amelynek van egy olyan időtartamneve, amelyet egy adott alkalmazásban vagy kontextusban előnyben részesítenek. @hu
label: è nome preferito del luogo di @it
definition: Correla un nomen a un arco di tempo che ha un nome di arco di tempo che è stato selezionato come preferito in una specifica applicazione o contesto. @it
toolkit label: nome preferito del luogo di @it
toolkit definition: Un arco di tempo che ha un nome di arco di tempo che è stato selezionato come preferito in una specifica applicazione o contesto. @it
label: ir laikposma prioritārais nosaukums @lv
definition: Sasaista nomenu ar laikposmu, kuram ir laikposma nosaukums, kas ir izvēlēts noteiktam lietojumam vai noteiktā kontekstā. @lv
toolkit label: ir laikposma prioritārais nosaukums @lv
toolkit definition: Laikposms, kuram ir laikposma nosaukums, kas ir izvēlēts noteiktam lietojumam vai noteiktā kontekstā. @lv
label: 是……的时间段的首选名称 @zh-hans
definition: 将一个命名与有在一个特定的应用或语境中被首选的一个时间段名称的一个时间段关联起来。 @zh-hans
toolkit label: ……的时间段的首选名称 @zh-hans
toolkit definition: 有在一个特定的应用或语境中被首选的一个时间段名称的一个时间段 @zh-hans
has subproperty: P80083
label: zaman aralığının tercih edilen adıdır @tr
definition: Bir ismi, belirli bir uygulama veya bağlamda tercih için seçilen bir zaman aralığı adına sahip bir zaman aralığıyla ilişkilendirir. @tr
toolkit label: zaman aralığının tercih edilen ismi @tr
toolkit definition: Belirli bir uygulama veya bağlamda tercih için seçilen bir zaman aralığı adına sahip bir zaman aralığı. @tr

is preferred title of expression of
status: Published
type: Property
lexical alias: preferredTitleOfExpressionOf.en
definition: Relates a nomen to an expression that has a title of expression that is selected for preference in a specific application or context.
domain: C10012
toolkit label: preferred title of expression of
toolkit definition: An expression that has a title of expression that is selected for preference in a specific application or context.
sub property of: is title of expression of
has element type: 2
sub property of: is preferred name of RDA entity of
label: ensisijainen nimeke ekspressiolle @fi
definition: Liittää nomenin ekspressioon, jonka nimeke on valittu ensisijaiseksi tietyssä sovelluksessa tai kontekstissa. @fi
toolkit label: ensisijainen nimeke ekspressiolle @fi
toolkit definition: Ekspressio, jonka nimeke on valittu ensisijaiseksi tietyssä sovelluksessa tai kontekstissa. @fi
label: er foretrukket tittel for uttrykk for @no
definition: Relaterer et nomen til et uttrykk som har en tittel for uttrykk som er valgt som preferanse i en bestemt applikasjon eller kontekst. @no
toolkit label: foretrukket tittel for uttrykk for @no
toolkit definition: Et uttrykk som har en tittel for uttrykk som er valgt som preferanse i en bestemt applikasjon eller kontekst. @no
label: est un titre privilégié d’une expression de @fr
definition: Met un nomen en relation avec une expression qui possède un titre d’expression faisant l’objet d’un choix privilégié dans une application ou un contexte spécifiques. @fr
toolkit label: titre privilégié d’une expression de @fr
toolkit definition: Expression qui possède un titre d’expression faisant l’objet d’un choix privilégié dans une application ou un contexte spécifiques. @fr
label: is geprefereerde titel van expressie van @nl
definition: Relateert een nomen aan een expressie diee een titel van expressie heeft die als voorkeursterm geselecteerd is in een specifieke toepassing of context. @nl
toolkit label: geprefereerde titel van expressie van @nl
toolkit definition: Een expressie diee een titel van expressie heeft die als voorkeursterm geselecteerd is in een specifieke toepassing of context. @nl
label: هو عنوان تعبيرة مفضل لـ @ar
definition: يربط تسمية بتعبيرة لها عنوان تعبيرة اختير للتفضيل في تطبيق أو في سياق معين. @ar
toolkit label: عنوان تعبيرة مفضل لـ @ar
toolkit definition: تعبيرة لها عنوان تعبيرة اختير للتفضيل في تطبيق أو في سياق معين. @ar
label: és títol preferit d’expressió de @ca
definition: Relaciona un nomen amb una expressió que té un títol d’expressió que se selecciona com a preferent en una aplicació o un context específic. @ca
toolkit label: títol preferit d’expressió de @ca
toolkit definition: Expressió que té un títol d’expressió que se selecciona com a preferent en una aplicació o un context específic. @ca
label: er foretrukken titel på udtryk af @da
definition: Relaterer et nomen til et udtryk, som har en titel på udtryk, som er valgt som præference i en specifik anvendelse eller kontekst. @da
toolkit label: foretrukken titel på udtryk af @da
toolkit definition: Udtryk, som har en titel på udtryk, som er valgt som præference i en specifik anvendelse eller kontekst. @da
label: eelispealkiri väljendusele @et
definition: Seostab nomen'i väljendusega, millel on kindlas rakenduses või kontekstis eelistatuks valitud pealkiri. @et
toolkit label: eelispealkiri väljendusele @et
toolkit definition: Väljendus, millel on kindlas rakenduses või kontekstis eelistatuks valitud pealkiri. @et
label: ist bevorzugter Titel einer Expression von @de
definition: Setzt ein Nomen in Beziehung zu einer Expression, die über einen Titel für eine Expression verfügt, der in einer bestimmten Anwendung oder in einem bestimmten Kontext als Vorzugsform bestimmt wird. @de
toolkit label: Bevorzugter Titel einer Expression von @de
toolkit definition: Eine Expression, die über einen Titel für eine Expression verfügt, der in einer bestimmten Anwendung oder in einem bestimmten Kontext als Vorzugsform bestimmt wird. @de
label: előnyben részesített címe a következő kifejezési formának: @hu
definition: Hozzákapcsol egy noment egy kifejezési formához, amely rendelkezik egy olyan kifejezési formához tartozó címmel, amelyet egy adott alkalmazásban vagy kontextusban előnyben részesítenek. @hu
toolkit label: előnyben részesített címe a következő kifejezési formának: @hu
toolkit definition: Egy kifejezési forma, amelynek van egy olyan hozzáférési pontja a kifejezési forma számára, amelyet egy adott szótárkódolási sémából kiválasztva nem részesítenek előnyben. @hu
label: è titolo preferito dell'espressione di @it
definition: Correla un nomen a un'espressione che ha un titolo di espressione che è stato selezionato come preferito in una specifica applicazione o contesto. @it
toolkit label: titolo preferito dell'espressione di @it
toolkit definition: Un'espressione che ha un titolo di espressione che è stato selezionato come preferito in una specifica applicazione o contesto. @it
label: ir prioritārais nosaukums izteiksmei @lv
definition: Sasaista nomenu ar izteiksmi, kam ir izteiksmes nosaukums, kas ir izvēlēts noteiktam lietojumam vai noteiktā kontekstā. @lv
toolkit label: ir prioritārais nosaukums izteiksmei @lv
toolkit definition: Izteiksme, kam ir izteiksmes nosaukums, kas ir izvēlēts noteiktam lietojumam vai noteiktā kontekstā. @lv
label: 是……的内容表达的首选题名 @zh-hans
definition: 将一个命名与有在一个特定的应用或语境中被首选的一个内容表达题名的一种内容表达关联起来。 @zh-hans
toolkit label: ……的内容表达的首选题名 @zh-hans
toolkit definition: 有在一个特定的应用或语境中被首选的一个内容表达题名的一种内容表达 @zh-hans
has subproperty: P80097
label: anlatımının tercih edilen başlığıdır @tr
definition: Bir ismi, belirli bir uygulama veya bağlamda tercih edilmek üzere seçilen bir anlatım başlığına sahip bir anlatımla ilişkilendirir. @tr
toolkit label: Anlatımın tercih edilen başlığı @tr
toolkit definition: Belirli bir uygulama veya bağlamda tercih için seçilen bir anlatım başlığına sahip anlatım. @tr

is preferred title of item of
status: Published
type: Property
lexical alias: preferredTitleOfItemOf.en
definition: Relates a nomen to an item that has a title of item that is selected for preference in a specific application or context.
domain: C10012
toolkit label: preferred title of item of
toolkit definition: An item that has a title of item that is selected for preference in a specific application or context.
sub property of: is title of item of
has element type: 2
sub property of: is preferred name of RDA entity of
label: ensisijainen nimeke kappaleelle @fi
definition: Liittää nomenin kappaleeseen, jonka nimeke on valittu ensisijaiseksi tietyssä sovelluksessa tai kontekstissa. @fi
toolkit label: ensisijainen nimeke kappaleelle @fi
toolkit definition: Kappale, jonka nimeke on valittu ensisijaiseksi tietyssä sovelluksessa tai kontekstissa. @fi
label: er foretrukket tittel for eksemplar for @no
definition: Relaterer et nomen til et eksemplar som har en tittel for eksemplar som er valgt som preferanse i en bestemt applikasjon eller kontekst. @no
toolkit label: foretrukket tittel for eksemplar for @no
toolkit definition: Et eksemplar som har en tittel for eksemplar som er valgt som preferanse i en bestemt applikasjon eller kontekst. @no
label: est un titre privilégié d’un item de @fr
definition: Met un nomen en relation avec un item qui possède un titre d’item faisant l’objet d’un choix privilégié dans une application ou un contexte spécifiques. @fr
toolkit label: titre privilégié d’un item de @fr
toolkit definition: Item qui possède un titre d’item faisant l’objet d’un choix privilégié dans une application ou un contexte spécifiques. @fr
label: is geprefereerde titel van item van @nl
definition: Relateert een nomen aan een item dat een titel van item heeft die als voorkeursterm geselecteerd is in een specifieke toepassing of context. @nl
toolkit label: geprefereerde titel van item van @nl
toolkit definition: Een item dat een titel van item heeft die als voorkeursterm geselecteerd is in een specifieke toepassing of context. @nl
label: هو عنوان مفردة مفضل لـ @ar
definition: يربط تسمية بمفردة لها عنوان مفردة اختير للتفضيل في تطبيق أو في سياق معين. @ar
toolkit label: عنوان مفردة مفضل لـ @ar
toolkit definition: مفردة لها عنوان مفردة اختير للتفضيل في تطبيق أو في سياق معين. @ar
label: és títol preferit d’ítem de @ca
definition: Relaciona un nomen amb un ítem que té un títol d’ítem que se selecciona com a preferent en una aplicació o un context específic. @ca
toolkit label: títol preferit d’ítem de @ca
toolkit definition: Ítem que té un títol d’ítem que se selecciona com a preferent en una aplicació o un context específic. @ca
label: er foretrukken titel på eksemplar af @da
definition: Relaterer et nomen til et eksemplar, som har en titel på eksemplar, som er valgt som præference i en specifik anvendelse eller kontekst. @da
toolkit label: foretrukken titel på eksemplar af @da
toolkit definition: Eksemplar, som har en titel på eksemplar, som er valgt som præference i en specifik anvendelse eller kontekst. @da
label: eelispealkiri eksemplarile @et
definition: Seostab nomen'i eksemplariga, millel on kindlas rakenduses või kontekstis eelistatuks valitud pealkiri. @et
toolkit label: eelispealkiri eksemplarile @et
toolkit definition: Eksemplar, millel on kindlas rakenduses või kontekstis eelistatuks valitud pealkiri. @et
label: ist bevorzugter Titel eines Exemplars von @de
definition: Setzt ein Nomen in Beziehung zu einem Exemplar, das über einen Titel für ein Exemplar verfügt, der in einer bestimmten Anwendung oder in einem bestimmten Kontext als Vorzugsform bestimmt wird. @de
toolkit label: Bevorzugter Titel eines Exemplars von @de
toolkit definition: Ein Exemplar, das über einen Titel für ein Exemplar verfügt, der in einer bestimmten Anwendung oder in einem bestimmten Kontext als Vorzugsform bestimmt wird. @de
label: előnyben részesített címe a következő példánynak: @hu
definition: Hozzákapcsol egy noment egy példányhoz, amely rendelkezik egy olyan példányhoz tartozó címmel, amelyet egy adott alkalmazásban vagy kontextusban előnyben részesítenek. @hu
toolkit label: előnyben részesített címe a következő példánynak: @hu
toolkit definition: Egy példány, amely rendelkezik egy olyan példányhoz tartozó címmel, amelyet egy adott alkalmazásban vagy kontextusban előnyben részesítenek. @hu
label: è titolo preferito dell'item di @it
definition: Correla un nomen a un item che ha un titolo di item che è stato selezionato come preferito in una specifica applicazione o contesto. @it
toolkit label: titolo preferito dell'item di @it
toolkit definition: Un item che ha un titolo di item che è stato selezionato come preferito in una specifica applicazione o contesto. @it
label: ir vienības prioritārais nosaukums @lv
definition: Sasaista nomenu ar vienību, kurai ir vienības nosaukums, kas ir izvēlēts noteiktam lietojumam vai noteiktā kontekstā. @lv
toolkit label: ir vienības prioritārais nosaukums @lv
toolkit definition: Vienība, kurai ir vienības nosaukums, kas ir izvēlēts noteiktam lietojumam vai noteiktā kontekstā. @lv
label: 是……的单件的首选题名 @zh-hans
definition: 将一个命名与有在一个特定的应用或语境中被首选的一个单件题名的一个单件关联起来。 @zh-hans
toolkit label: ……的单件的首选题名 @zh-hans
toolkit definition: 有在一个特定的应用或语境中被首选的一个单件题名的一个单件 @zh-hans
has subproperty: P80093
label: kopyasının tercih edilen başlığıdır @tr
definition: Bir ismi, belirli bir uygulama veya bağlamda tercih edilmek üzere seçilen kopyanın başlığına sahip bir kopyayla ilişkilendirir. @tr
toolkit label: öğesinin tercih edilen başlığı @tr
toolkit definition: Belirli bir uygulama veya bağlamda tercih için seçilen bir gösterim başlığına sahip bir kopya. @tr

is preferred title of work of
status: Published
type: Property
lexical alias: preferredTitleOfWorkOf.en
definition: Relates a nomen to a work that has a title of work that is selected for preference in a specific application or context.
domain: C10012
toolkit label: preferred title of work of
toolkit definition: A work that has a title of work that is selected for preference in a specific application or context.
sub property of: is title of work of
has element type: 2
sub property of: is preferred name of RDA entity of
label: ensisijainen nimeke teokselle @fi
definition: Liittää nomenin teokseen, jonka nimeke on valittu ensisijaiseksi tietyssä sovelluksessa tai kontekstissa. @fi
toolkit label: ensisijainen nimeke teokselle @fi
toolkit definition: Teos, jonka nimeke on valittu ensisijaiseksi tietyssä sovelluksessa tai kontekstissa. @fi
label: er foretrukket tittel for verk for @no
definition: Relaterer et nomen til et verk som har en tittel for verk som er valgt som preferanse i en bestemt applikasjon eller kontekst. @no
toolkit label: foretrukket tittel for verk for @no
toolkit definition: Et verk som har en tittel for verk som er valgt som preferanse i en bestemt applikasjon eller kontekst. @no
label: est un titre privilégié d’une œuvre de @fr
definition: Met un nomen en relation avec une œuvre qui possède un titre d'œuvre faisant l’objet d’un choix privilégié dans une application ou un contexte spécifiques. @fr
toolkit label: titre privilégié d’une œuvre de @fr
toolkit definition: Œuvre qui possède un titre d'œuvre faisant l’objet d’un choix privilégié dans une application ou un contexte spécifiques. @fr
label: is geprefereerde titel van werk van @nl
definition: Relateert een nomen aan een werk dat een titel van werk heeft has die als voorkeursterm geselecteerd is in een specifieke toepassing of context. @nl
toolkit label: geprefereerde titel van werk van @nl
toolkit definition: Een werk dat een titel van werk heeft has die als voorkeursterm geselecteerd is in een specifieke toepassing of context. @nl
label: هو عنوان عمل مفضل لـ @ar
definition: يربط تسمية بعمل له عنوان عمل اختير للتفضيل في تطبيق أو في سياق معين. @ar
toolkit label: عنوان عمل مفضل لـ @ar
toolkit definition: عمل له عنوان عمل اختير للتفضيل في تطبيق أو في سياق معين. @ar
label: és títol preferit d’obra de @ca
definition: Relaciona un nomen amb una obra que té un títol d’obra que se selecciona com a preferent en una aplicació o un context específic. @ca
toolkit label: títol preferit d’obra de @ca
toolkit definition: Obra que té un títol d’obra que se selecciona com a preferent en una aplicació o un context específic. @ca
label: er foretrukken titel på værk af @da
definition: Relaterer et nomen til et værk, som har en titel på værk, som er valgt som præference i en specifik anvendelse eller kontekst. @da
toolkit label: foretrukken titel på værk af @da
toolkit definition: Værk, som har en titel på værk, som er valgt som præference i en specifik anvendelse eller kontekst. @da
label: eelispealkiri teosele @et
definition: Seostab nomen'i teosega, millel on kindlas rakenduses või kontekstis eelistatuks valitud pealkiri. @et
toolkit label: eelispealkiri teosele @et
toolkit definition: Teos, millel on kindlas rakenduses või kontekstis eelistatuks valitud pealkiri. @et
label: ist bevorzugter Titel eines Werks von @de
definition: Setzt ein Nomen in Beziehung zu einem Werk, das über einen Titel eines Werks verfügt, der in einer bestimmten Anwendung oder in einem bestimmten Kontext als Vorzugsform bestimmt wird. @de
toolkit label: Bevorzugter Titel eines Werks von @de
toolkit definition: Ein Werk, das über einen Titel eines Werks verfügt, der in einer bestimmten Anwendung oder in einem bestimmten Kontext als Vorzugsform bestimmt wird. @de
label: előnyben részesített címe a következő műnek: @hu
definition: Hozzákapcsol egy noment egy műhöz, amely rendelkezik egy olyan műhöz tartozó címmel, amelyet egy adott alkalmazásban vagy kontextusban előnyben részesítenek. @hu
toolkit label: előnyben részesített címe a következő műnek: @hu
toolkit definition: Egy mű, amely rendelkezik egy olyan műhöz tartozó címmel, amelyet egy adott alkalmazásban vagy kontextusban előnyben részesítenek. @hu
label: è titolo preferito dell'opera di @it
definition: Correla un nomen a un'opera che ha un titolo di opera che è stato selezionato come preferito in una specifica applicazione o contesto. @it
toolkit label: titolo preferito dell'opera di @it
toolkit definition: Un'opera che ha un titolo di opera che è stato selezionato come preferito in una specifica applicazione o contesto. @it
label: ir prioritārais nosaukums darbam @lv
definition: Sasaista nomenu ar darbu, kam ir darba nosaukums, kas ir izvēlēts noteiktam lietojumam vai noteiktā kontekstā. @lv
toolkit label: ir prioritārais nosaukums darbam @lv
toolkit definition: Darbs, kam ir darba nosaukums, kas ir izvēlēts noteiktam lietojumam vai noteiktā kontekstā. @lv
label: 是……的作品的首选题名 @zh-hans
definition: 将一个命名与有在一个特定的应用或语境中被首选的一个作品题名的一种作品关联起来。 @zh-hans
toolkit label: ……的作品的首选题名 @zh-hans
toolkit definition: 有在一个特定的应用或语境中被首选的一个作品题名的一种作品 @zh-hans
has subproperty: P80109
label: eserin tercih edilen başlığıdır @tr
definition: Bir ismi, belirli bir uygulama veya bağlamda tercih edilmek üzere seçilen bir eser başlığına sahip bir eserle ilişkilendirir. @tr
toolkit label: Eserin tercih edilen başlığı @tr
toolkit definition: Belirli bir uygulama veya bağlamda tercihen seçilen bir eser başlığına sahip bir eser. @tr

is publisher number for notated music of
status: Published
type: Property
lexical alias: publisherNumberForNotatedMusicOf.en
domain: C10012
sub property of: is identifier for manifestation of
toolkit label: publisher number for notated music of
has element type: 2
definition: Relates a nomen to a manifestation of a notated music expression that has an identifier for manifestation other than a plate number for notated music, assigned by a publisher.
toolkit definition: A manifestation of a notated music expression that has an identifier for manifestation other than a plate number for notated music, assigned by a publisher.
label: kustantajan nuottiaineistolle antama numero manifestaatiolle @fi
definition: Liittää nomenin nuottiaineiston ekspression manifestaatioon, jonka tunniste on kustantajan antama tunniste, joka ei ole nuottiaineiston laatan numero. @fi
toolkit label: kustantajan nuottiaineistolle antama numero manifestaatiolle @fi
toolkit definition: Nuottiaineiston ekspression manifestaatio, jonka tunniste on kustantajan antama tunniste, joka ei ole nuottiaineiston laatan numero. @fi
scope note: The number normally appears only on the title page, the cover, or the first page of music, and sometimes includes initials, abbreviations, or words identifying the publisher.
label: er utgivelsesnummer for nedskrevet musikk for @no
definition: Relaterer et nomen til en manifestasjon av et uttrykk av nedskrevet musikk som har en identifikator for manifestasjon som ikke er et platenummer for nedskrevet musikk, tildelt av en utgiver. @no
toolkit label: utgivelsesnummer for nedskrevet musikk for @no
toolkit definition: En manifestasjon av et uttrykk av nedskrevet musikk som har en identifikator for manifestasjon som ikke er et platenummer for nedskrevet musikk, tildelt av en utgiver. @no
label: est un numéro d’éditeur pour la musique notée de @fr
definition: Met un nomen en relation avec une manifestation d’une expression de musique notée qui possède un identifiant de manifestation, autre qu’un cotage pour la musique notée, attribué par un éditeur. @fr
toolkit label: numéro d’éditeur pour la musique notée de @fr
toolkit definition: Manifestation d’une expression de musique notée qui possède un identifiant de manifestation, autre qu’un cotage pour la musique notée, attribué par un éditeur. @fr
label: is uitgeversnummer voor bladmuziek van @nl
definition: Relateert een nomen aan een manifestatie van een bladmuziek-expressie die een identificatie voor manifestatie heeft anders dan een plaatnummer voor bladmuziek, toegekend door een uitgever. @nl
toolkit label: uitgeversnummer voor bladmuziek van @nl
toolkit definition: Een manifestatie van een bladmuziek-expressie die een identificatie voor manifestatie heeft anders dan een plaatnummer voor bladmuziek, toegekend door een uitgever. @nl
label: هو رقم ناشر لموسيقى مدونة لـ @ar
definition: يربط تسمية بتجسيدة لتعبيرة عن موسيقى مدونة لها مُعرِّف لتجسيدة غير رقم لوحة الموسيقى المدونة الذي خصصه الناشر. @ar
toolkit label: رقم ناشر لموسيقى مدونة لـ @ar
toolkit definition: تجسيدة لتعبيرة موسيقى مدونة لها مُعرِّف لتجسيدة غير رقم لوحة الموسيقى المدونة الذي خصصه الناشر. @ar
label: és número d’editor de música notada de @ca
definition: Relaciona un nomen amb una manifestació d’una expressió de música notada que té un identificador de manifestació diferent d’un número de planxa de música notada, assignat per un editor. @ca
toolkit label: número d’editor de música notada de @ca
toolkit definition: Manifestació d’una expressió de música notada que té un identificador de manifestació diferent d’un número de planxa de música notada, assignat per un editor. @ca
label: er editionsnummer for noteret musik af @da
definition: Relaterer et nomen til en manifestation af et udtryk af noteret musik, som har en identifikator for manifestation, som ikke er et pladenummer for noteret musik, angivet af en udgiver. @da
toolkit label: editionsnummer for noteret musik af @da
toolkit definition: Manifestation af et udtryk af noteret musik, som har en identifikator for manifestation, som ikke er et pladenummer for noteret musik, angivet af en udgiver. @da
label: noodi kirjastajanumber kehastuses @et
definition: Seostab nomen'i noodi väljenduse kehastusega, mille identifikaator ei ole noodi trükiplaadinumber, vaid kirjastaja määratud number. @et
toolkit label: noodi kirjastajanumber kehastuses @et
toolkit definition: Noodi väljenduse kehastus, mille identifikaator ei ole noodi trükiplaadinumber, vaid kirjastaja määratud number. @et
label: ist Noten-Bestellnummer von @de
definition: Setzt ein Nomen in Beziehung zu einer Manifestation einer Noten-Expression, die über einen Identifikator für eine Manifestation verfügt, der von einem Verlag zugewiesen wird und bei dem es sich nicht um die Druckplattennummer handelt. @de
toolkit label: Noten-Bestellnummer von @de
toolkit definition: Eine Manifestation einer Noten-Expression, die über einen Identifikator für eine Manifestation verfügt, der von einem Verlag zugewiesen wird und bei dem es sich nicht um die Druckplattennummer handelt. @de
label: kiadói műjegyzékszáma a következőnek: @hu
definition: Egy zenei lejegyzés kifejezési formájának megjelenési formája, amelynek olyan megjelenésiforma-azonosítója van, amely eltér a zenei lejegyzésnek a kiadó által adott lemezszámától. @hu
scope note: A szám általában a címoldalon, a borítón vagy a zenei lejegyzés első oldalán jelenik meg, és néha magába foglal kezdőbetűket, rövidítéseket vagy a kiadót megnevező szavakat. @hu
toolkit label: kiadói műjegyzékszáma: @hu
toolkit definition: Hozzákapcsol egy noment egy zenei lejegyzés kifejezési formájának olyan megjelenési formájához, amelynek olyan megjelenésiforma-azonosítója van, amely eltér a zenei lejegyzésnek a kiadó által adott lemezszámától. @hu
label: è numero dell'editore per la musica notata di @it
definition: Correla un nomen a una manifestazione di un'espressione di musica notata che ha un identificatore per la manifestazione che non è un numero di lastra per la musica notata, assegnato da un editore @it
toolkit label: numero dell'editore per la musica notata di @it
toolkit definition: Una manifestazione di un'espressione di musica notata che ha un identificatore per la manifestazione che non è un numero di lastra per la musica notata, assegnato da un editore. @it
scope note: Het nummer verschijnt normaliter alleen op de titelpagina, het omslag of de eerste pagina met muziek, en soms omvat initialen, afkortingen of woorden die de uitgever identificeren. @nl
label: ir nošizdevuma izdevējnumurs @lv
toolkit label: ir nošizdevuma izdevējnumurs @lv
definition: Sasaista nomenu ar manifestāciju, kas ir notācijas izteiksmes manifestācija, kurai ir manifestācijas identifikators, kas nav notācijas plātnes numurs, ko piešķīris izdevējs. @lv
toolkit definition: Notācijas izteiksmes manifestācija, kurai ir manifestācijas identifikators, kas nav notācijas plātnes numurs, ko piešķīris izdevējs. @lv
scope note: Numurs parasti atrodas tikai titullapā, uz vāka vai nošizdevuma pirmajā lapā, un dažreiz ietver iniciāļus, saīsinājumus vai vārdus, kas identificē izdevēju. @lv
scope note: Numero esiintyy yleensä nimiösivulla, kannessa tai nuottiaineiston ensimmäisellä sivulla ja sisältää joskus kustantajaa identifioivia alkukirjaimia, lyhenteitä tai sanoja. @fi
scope note: عادة لا يظهر الرقم إلا على صفحة العنوان، أو على الغلاف، أو على الصفحة الأولى للموسيقى، وأحيانًا يتضمن أحرفا استهلالية، أو اختصارات، أو كلمات تدل على الناشر. @ar
scope note: Nummeret forkommer normalt kun på titelsiden, omslaget, eller den første musiksiden, og indeholder sommetider initialer, forkortelser eller ord, der identificerer udgiveren. @da
scope note: Die Nummer erscheint normalerweise nur auf der Titelseite, der Einbanddecke oder der ersten Seite von Musikalien und enthält manchmal Initialen, Abkürzungen oder Wörter, die den Verlag identifizieren. @de
scope note: El número normalment només figura a la portada, la coberta o a la primera pàgina de la música i, de vegades, inclou inicials, abreviacions o paraules identificadores de l’editor. @ca
scope note: Le numéro figure habituellement uniquement sur la page de titre, la couverture ou la première page de musique et comprend parfois des initiales, des abréviations ou des mots identifiant l’éditeur. @fr
label: 是……的乐谱的出版者编号 @zh-hans
toolkit label: ……的乐谱的出版者编号 @zh-hans
definition: 将一个命名与有出版者分配的除乐谱版号以外的一种载体表现的标识符的一种乐谱内容表达的一种载体表现关联起来。 @zh-hans
toolkit definition: 有出版者分配的除乐谱版号以外的一种载体表现的标识符的一种乐谱内容表达的一种载体表现 @zh-hans
scope note: 该编号通常只出现在题名页、封面或乐谱的第一页，有时候包括标识出版者的缩略词或单词。 @zh-hans
has subproperty: P80156
label: notaya alınmış müziğinin yayıncı numarasıdır @tr
toolkit label: müzik notası için yayımcı numarası @tr
definition: Bir ismi, bir yayıncı tarafından atanan notalı müzik için bir plaka numarasından farklı bir bir belirleyici tanımlayıcıya sahip olan notalı bir müzik ifadesinin gösterimle ilişkilendirir. @tr
toolkit definition: Bir yayıncı tarafından atanan notalı müzik için bir plaka numarasından farklı bir bir belirleyici tanımlayıcıya sahip olan notalı bir müzik anlatımının gösterimi. @tr
scope note: Sayı normalde yalnızca başlık sayfasında, kapakta veya müziğin ilk sayfasında görünür ve ara sıra baş harfler, kısaltmalar veya yayıncıyı tanımlayan sözcükler içerir. @tr

is real identity of person of
status: Published
type: Property
lexical alias: realIdentityOfPersonOf.en
domain: C10012
toolkit label: real identity of person of
has element type: 2
sub property of: is appellation of person of
definition: Relates a nomen to a person who has an appellation of person that is a real identity.
toolkit definition: A person who has an appellation of person that is a real identity.
label: todellinen identiteetti henkilölle @fi
definition: Liittää nomenin henkilöön, jonka nimitys on todellinen identiteetti. @fi
toolkit label: todellinen identiteetti henkilölle @fi
toolkit definition: Henkilö, jonka nimitys on todellinen identiteetti. @fi
label: er virkelig identitet for person for @no
definition: Relaterer et noment til en person som har en betegnelse for person som er en virkelig identitet. @no
toolkit label: virkelig identitet for person for @no
toolkit definition: En person som har en betegnelse for person som er en virkelig identitet. @no
label: est une identité réelle d’une personne de @fr
definition: Met un nomen en relation avec une personne qui possède une appellation de personne consistant en une identité réelle. @fr
toolkit label: identité réelle d’une personne de @fr
toolkit definition: Personne qui possède une appellation de personne consistant en une identité réelle. @fr
label: is echte identiteit van persoon van @nl
definition: Relateert een nomen aan een persoon die een benaming van persoon heeft die een echte identiteit is. @nl
toolkit label: echte identiteit van persoon van @nl
toolkit definition: Een persoon die een benaming van persoon heeft die een echte identiteit is. @nl
label: هي هوية حقيقية لشخص لـ @ar
definition: يربط تسمية بشخص له اسم شخص عبارة عن هوية حقيقية. @ar
toolkit label: هوية حقيقية لشخص لـ @ar
toolkit definition: شخص له اسم شخص عبارة عن هوية حقيقية. @ar
label: és identitat real de persona de @ca
definition: Relaciona un nomen amb una persona que té una apel·lació de persona que és una identitat real. @ca
toolkit label: identitat real de persona de @ca
toolkit definition: Persona que té una apel·lació de persona que és una identitat real. @ca
label: er sand identitet for person af @da
definition: Relaterer et nomen til en person, som har en benævnelse på person, som er en sand identitet. @da
toolkit label: sand identitet for person af @da
toolkit definition: Person, som har en benævnelse på person, som er en sand identitet. @da
label: tegelik identiteet isikule @et
definition: Seostab nomen'i isikuga, kellel on isiku nimetuseks tegelik identiteet. @et
toolkit label: tegelik identiteet isikule @et
toolkit definition: Isik, kellel on isiku nimetuseks tegelik identiteet. @et
label: ist wahre Identität einer Person von @de
definition: Setzt ein Nomen in Beziehung zu einer Person, die über eine Bezeichnung für eine Person verfügt, bei der es sich um eine wirkliche Identität handelt. @de
toolkit label: Wahre Identität einer Person von @de
toolkit definition: Eine Person, die über eine Bezeichnung für eine Person verfügt, bei der es sich um eine wirkliche Identität handelt. @de
label: személy valódi identitása a következőnek: @hu
definition: Hozzákapcsol egy noment egy személyhez, akinek olyan személymegnevezése van, amely a valódi identitása. @hu
toolkit label: személy valódi identitása: @hu
toolkit definition: Egy személy, akinek olyan személymegnevezése van, amely a valódi identitása. @hu
label: è identità reale della persona di @it
definition: Correla un nomen a una persona che ha una designazione di persona che è una identità reale. @it
toolkit label: identità reale della persona di @it
toolkit definition: Una persona che ha una designazione di persona che è una identità reale. @it
label: ir personas patiesā identitāte @lv
toolkit label: ir personas patiesā identitāte @lv
definition: Sasaista nomenu ar personu, kurai ir personas apzīmējums, kas ir tās patiesā identitāte. @lv
toolkit definition: Persona, kurai ir personas apzīmējums, kas ir tās patiesā identitāte. @lv
label: 是……的个人的真实身份 @zh-hans
toolkit label: ……的个人的真实身份 @zh-hans
definition: 将一个命名与有真实身份作为个人称谓的一个个人关联起来。 @zh-hans
toolkit definition: 有真实身份作为个人称谓的一个个人 @zh-hans
has subproperty: P80158
label: kişisinin gerçek kimliğidir @tr
toolkit label: kişisinin gerçek kimliği @tr
definition: Bir ismi, gerçek kimliğinde olan unvanına sahip bir kişiyle ilişkilendirir. @tr
toolkit definition: Gerçek kimliği olan bir kişi unvanına sahip olan kişi. @tr

has reference source
status: Published
type: Property
lexical alias: referenceSource.en
definition: Relates a nomen to a manifestation which provides evidence for the use of a nomen.
domain: C10012
toolkit label: reference source
toolkit definition: A manifestation which provides evidence for the use of a nomen.
label: tietolähde @fi
definition: Liittää nomenin manifestaatioon, joka antaa todisteen nomenin käytöstä. @fi
toolkit label: tietolähde @fi
toolkit definition: Manifestaatio, joka antaa todisteen nomenin käytöstä. @fi
label: har referansekilde @no
definition: Relaterer et nomen til en kilde som inneholder bevis for anvendelsen av et nomen. @no
toolkit label: referansekilde @no
toolkit definition: En kilde som inneholder bevis for anvendelsen av et nomen. @no
has element type: 2
sub property of: has related manifestation of nomen
label: a pour source de référence @fr
definition: Met un nomen en relation avec une manifestation qui atteste de l’utilisation d’un nomen. @fr
toolkit label: source de référence @fr
toolkit definition: Manifestation qui atteste de l’utilisation d’un nomen. @fr
label: heeft naslagwerk @nl
definition: Relateert een nomen aan een manifestatie die bewijs verschaft voor het gebruik van een nomen. @nl
toolkit label: naslagwerk @nl
toolkit definition: Een manifestatie die bewijs verschaft voor het gebruik van een nomen. @nl
label: له مصدر مرجعي @ar
definition: يربط تسمية بتجسيدة تقدم دليلا على استخدام تسمية. @ar
toolkit label: مصدر مرجعى @ar
toolkit definition: مصدر يقدم دليلا على استخدام تسمية. @ar
label: té com a font de referència @ca
definition: Relaciona un nomen amb una manifestació que proporciona evidència per a l’ús d’un nomen. @ca
toolkit label: font de referència @ca
toolkit definition: Manifestació que proporciona evidència per a l’ús d’un nomen. @ca
label: har referencekilde @da
definition: Relaterer et nomen til en kilde, hvori der er bevis for brugen af et nomen. @da
toolkit label: referencekilde @da
toolkit definition: Kilde, hvori der er bevis for brugen af et nomen. @da
label: teatmeallikas @et
definition: Seostab nomen'i allikaga, mis sisaldab tõendust nomen'i kasutamisest. @et
toolkit label: teatmeallikas @et
toolkit definition: Allikas, mis sisaldab tõendust nomen'i kasutamisest. @et
label: hat Nachschlagewerk @de
definition: Setzt ein Nomen in Beziehung zu einer Manifestation, die einen Beleg für die Verwendung eines Nomens liefert. @de
toolkit label: Nachschlagewerk @de
toolkit definition: Eine Manifestation, die einen Beleg für die Verwendung eines Nomens liefert. @de
label: hivatkozási forrása a következő: @hu
definition: Hozzákapcsol egy noment egy megjelenési formához, amelyben bizonyíték van egy nomen használatára. @hu
toolkit label: hivatkozási forrása: @hu
toolkit definition: Egy megjelenési forma, amelyben bizonyíték van egy nomen használatára. @hu
label: ha come fonte di reference @it
definition: Correla un nomen a una fonte in cui ci sono prove per l'uso di un nomen. @it
toolkit label: fonte di reference @it
toolkit definition: Una fonte in cui ci sono prove per l'uso di un nomen. @it
label: uzziņu avots @lv
definition: Sasaista nomenu ar manifestāciju, kura ir pierādījums nomena lietojumam. @lv
toolkit label: uzziņu avots @lv
toolkit definition: Manifestācija, kura ir pierādījums nomena lietojumam. @lv
label: 有参考信息源 @zh-hans
definition: 将一个命名与为一个命名的使用提供证据的一种载体表现关联起来。 @zh-hans
toolkit label: 参考信息源 @zh-hans
toolkit definition: 为一个命名的使用提供证据的一种载体表现 @zh-hans
has subproperty: P80139
label: referans kaynağı ile ilişkilidir @tr
definition: Bir ismi, bir ismin kullanımına ilişkin kanıt sağlayan bir gösterimle ilişkilendirir. @tr
toolkit label: referans kaynağı @tr
toolkit definition: Bir nomenin kullanımına dair kanıt sağlayan bir gösterim. @tr

has related agent of nomen
status: Published
type: Property
lexical alias: relatedAgentOfNomen.en
definition: Relates a nomen to an agent who is associated with a nomen.
domain: C10012
sub property of: has related RDA entity of nomen
toolkit label: related agent of nomen
toolkit definition: An agent who is associated with a nomen.
has element type: 1
sub property of: P00006
label: nomeniin liittyvä toimija @fi
definition: Liittää nomenin toimijaan, joka liittyy nomeniin. @fi
toolkit label: nomeniin liittyvä toimija @fi
toolkit definition: Toimija, joka liittyy nomeniin. @fi
label: har agent relatert til nomen @no
definition: Relaterer et nomen til en agent som forbindes med et nomen. @no
toolkit label: agent relatert til nomen @no
toolkit definition: En agent som forbindes med et nomen. @no
label: a pour agent en relation avec un nomen @fr
definition: Met un nomen en relation avec un agent qui est associé à un nomen. @fr
toolkit label: agent en relation avec un nomen @fr
toolkit definition: Agent qui est associé à un nomen. @fr
label: heeft gerelateerde actor van nomen @nl
definition: Relateert een nomen aan een actor die is geassocieerd met een nomen. @nl
toolkit label: gerelateerde actor van nomen @nl
toolkit definition: Een actor die is geassocieerd met een nomen. @nl
label: له وكيل مرتبط بتسمية @ar
definition: يربط تسمية بوكيل ذات صلة بتسمية. @ar
toolkit label: وكيل مرتبط بتسمية @ar
toolkit definition: وكيل ذو صلة بتسمية. @ar
label: té com a agent relacionat amb un nomen @ca
definition: Relaciona un nomen amb un agent que s’associa amb un nomen. @ca
toolkit label: agent relacionat amb un nomen @ca
toolkit definition: Agent que s’associa amb un nomen. @ca
label: har agent relateret til nomen @da
definition: Relaterer et nomen til en agent, som er knyttet til et nomen. @da
toolkit label: agent relateret til nomen @da
toolkit definition: Agent, som er knyttet til et nomen. @da
label: nomen'iga seotud tegija @et
definition: Seostab nomen'i nomen'iga seotud tegijaga. @et
toolkit label: nomen'iga seotud tegija @et
toolkit definition: Nomen'iga seotud tegija. @et
label: hat mit Nomen in Beziehung stehenden Akteur @de
definition: Setzt ein Nomen in Beziehung zu einem Akteur, der mit einem Nomen in Verbindung steht. @de
toolkit label: mit Nomen in Beziehung stehender Akteur @de
toolkit definition: Ein Akteur, der mit einem Nomen in Verbindung steht. @de
label: nomen kapcsolódó ágense a következő: @hu
definition: Hozzákapcsol egy noment egy ágenshez, amelyet egy nomenhez társítanak. @hu
toolkit label: nomen kapcsolódó ágense: @hu
toolkit definition: Egy ágens, amelyet egy nomenhez társítanak. @hu
label: ha come agente correlato di nomen @it
definition: Correla un nomen a un agente che è associato con un nomen. @it
toolkit label: agente correlato di nomen @it
toolkit definition: Un agente che è associato con un nomen. @it
label: ar nomenu saistītais aģents @lv
definition: Sasaista nomenu ar aģentu, kas saistīts ar nomenu. @lv
toolkit label: ar nomenu saistītais aģents @lv
toolkit definition: Aģents, kas saistīts ar nomenu. @lv
label: 有命名的关联行为者 @zh-hans
definition: 将一个命名与和一个命名有关的一个行为者关联起来。 @zh-hans
toolkit label: 命名的关联行为者 @zh-hans
toolkit definition: 和一个命名有关的一个行为者 @zh-hans
has subproperty: is appellation of agent of
has subproperty: is assigned by agent
has subproperty: has related collective agent of nomen
has subproperty: has related person of nomen
has subproperty: P80005
label: ismin ilgili temsilcisi ile ilişkilidir @tr
definition: Bir ismi, isimle bağlantılı olan temsilciyle ilişkilendirir. @tr
toolkit label: Nomen ilişkili temsilcisi @tr
toolkit definition: Bir isimle bağlantılı olan bir temsilci. @tr

has related collective agent of nomen
status: Published
type: Property
lexical alias: relatedCollectiveAgentOfNomen.en
definition: Relates a nomen to a collective agent who is associated with a nomen.
domain: C10012
sub property of: has related agent of nomen
toolkit label: related collective agent of nomen
toolkit definition: A collective agent who is associated with a nomen.
has element type: 1
sub property of: P00012
label: nomeniin liittyvä yhteistoimija @fi
definition: Liittää nomenin yhteistoimijaan, joka liittyy nomeniin. @fi
toolkit label: nomeniin liittyvä yhteistoimija @fi
toolkit definition: Yhteistoimija, joka liittyy nomeniin. @fi
label: har kollektiv agent relatert til nomen @no
definition: Relaterer et nomen til en kollektiv agent som forbindes med et nomen. @no
toolkit label: kollektiv agent relatert til nomen @no
toolkit definition: En kollektiv agent som forbindes med et nomen. @no
label: a pour agent collectif en relation avec un nomen @fr
definition: Met un nomen en relation avec un agent collectif qui est associé à un nomen. @fr
toolkit label: agent collectif en relation avec un nomen @fr
toolkit definition: Agent collectif qui est associé à un nomen. @fr
label: heeft gerelateerde collectieve actor van nomen @nl
definition: Relateert een nomen aan een collectieve actor die is geassocieerd met een nomen. @nl
toolkit label: gerelateerde collectieve actor van nomen @nl
toolkit definition: Een collectieve actor die is geassocieerd met een nomen. @nl
label: له وكيل جماعي مرتبط بتسمية @ar
definition: يربط تسمية بوكيل جماعي ذي صلة بتسمية. @ar
toolkit label: وكيل جماعي مرتبط بتسمية @ar
toolkit definition: وكيل جماعي ذو صلة بتسمية. @ar
label: té com a agent col·lectiu relacionat amb un nomen @ca
definition: Relaciona un nomen amb un agent col·lectiu que s’associa amb un nomen. @ca
toolkit label: agent col·lectiu relacionat amb un nomen @ca
toolkit definition: Agent col·lectiu que s’associa amb un nomen. @ca
label: har kollektiv agent relateret til nomen @da
definition: Relaterer et nomen til en kollektiv agent, som er knyttet til et nomen. @da
toolkit label: kollektiv agent relateret til nomen @da
toolkit definition: Kollektiv agent, som er knyttet til et nomen. @da
label: nomen'iga seotud kollektiiv @et
definition: Seostab nomen'i nomen'iga seotud kollektiiviga. @et
toolkit label: nomen'iga seotud kollektiiv @et
toolkit definition: Nomen'iga seotud kollektiiv. @et
label: hat mit Nomen in Beziehung stehenden gemeinschaftlichen Akteur @de
definition: Setzt ein Nomen in Beziehung zu einem gemeinschaftlichen Akteur, der mit einem Nomen in Verbindung steht. @de
toolkit label: mit Nomen in Beziehung stehender gemeinschaftlicher Akteur @de
toolkit definition: Ein gemeinschaftlicher Akteur, der mit einem Nomen in Verbindung steht. @de
label: nomen kapcsolódó kollektív ágense a következő: @hu
definition: Hozzákapcsol egy noment egy kollektív ágenshez, amelyet egy nomenhez társítanak. @hu
toolkit label: nomen kapcsolódó kollektív ágense: @hu
toolkit definition: Egy kollektív ágens, amelyet egy nomenhez társítanak. @hu
label: ha come agente collettivo correlato di nomen @it
definition: Correla un nomen a un agente collettivo che è associato con un nomen. @it
toolkit label: agente collettivo correlato di nomen @it
toolkit definition: Un agente collettivo che è associato con un nomen. @it
label: ar nomenu saistītā grupa @lv
definition: Sasaista nomenu ar grupu, kas saistīta ar nomenu. @lv
toolkit label: ar nomenu saistītā grupa @lv
toolkit definition: Grupa, kas saistīta ar nomenu. @lv
label: 有命名的关联集体行为者 @zh-hans
definition: 将一个命名与和一个命名有关的一个集体行为者关联起来。 @zh-hans
toolkit label: 命名的关联集体行为者 @zh-hans
toolkit definition: 和一个命名有关的一个集体行为者 @zh-hans
has subproperty: is appellation of collective agent of
has subproperty: is assigned by collective agent
has subproperty: has related corporate body of nomen
has subproperty: has related family of nomen
has subproperty: P80006
label: ismin ilgili kolektif temsilcisi ile ilişkilidir @tr
definition: Bir ismi, isimle ilişkilendirilen kolektif temsilciyle ilişkilendirir. @tr
toolkit label: Nomenin kolektif temsilciyle ilişkisi @tr
toolkit definition: Nomenle ilişkilendirilen kolektif temsilci. @tr

has related corporate body of nomen
status: Published
type: Property
lexical alias: relatedCorporateBodyOfNomen.en
definition: Relates a nomen to a corporate body who is associated with a nomen.
domain: C10012
sub property of: has related collective agent of nomen
toolkit label: related corporate body of nomen
toolkit definition: A corporate body who is associated with a nomen.
has element type: 1
sub property of: P00009
label: nomeniin liittyvä yhteisö @fi
definition: Liittää nomenin yhteisöön, joka liittyy nomeniin. @fi
toolkit label: nomeniin liittyvä yhteisö @fi
toolkit definition: Yhteisö, joka liittyy nomeniin. @fi
label: har korporasjon relatert til nomen @no
definition: Relaterer et nomen til en korporasjon som forbindes med et nomen. @no
toolkit label: korporasjon relatert til nomen @no
toolkit definition: En korporasjon som forbindes med et nomen. @no
label: a pour collectivité en relation avec un nomen @fr
definition: Met un nomen en relation avec une collectivité qui est associée à un nomen. @fr
toolkit label: collectivité en relation avec un nomen @fr
toolkit definition: Collectivité qui est associée à un nomen. @fr
label: heeft gerelateerde corporatie van nomen @nl
definition: Relateert een nomen aan een corporatie die is geassocieerd met een nomen. @nl
toolkit label: gerelateerde corporatie van nomen @nl
toolkit definition: Een corporatie die is geassocieerd met een nomen. @nl
label: له هيئة مرتبطة بتسمية @ar
definition: يربط تسمية بهيئة ذات صلة بتسمية. @ar
toolkit label: هيئة مرتبطة بتسمية @ar
toolkit definition: هيئة ذات صلة بتسمية. @ar
label: té com a entitat corporativa relacionada amb un nomen @ca
definition: Relaciona un nomen amb una entitat corporativa que s’associa amb un nomen. @ca
toolkit label: entitat corporativa relacionada amb un nomen @ca
toolkit definition: Entitat corporativa que s’associa amb un nomen. @ca
label: har korporation relateret til nomen @da
definition: Relaterer et nomen til en korporation, som er knyttet til et nomen. @da
toolkit label: korporation relateret til nomen @da
toolkit definition: Korporation, som er knyttet til et nomen. @da
label: nomen'iga seotud asutus @et
definition: Seostab nomen'i nomen'iga seotud asutusega. @et
toolkit label: nomen'iga seotud asutus @et
toolkit definition: Nomen'iga seotud asutus. @et
label: hat mit Nomen in Beziehung stehende Körperschaft @de
definition: Setzt ein Nomen in Beziehung zu einer Körperschaft, die mit einem Nomen in Verbindung steht. @de
toolkit label: mit Nomen in Beziehung stehende Körperschaft @de
toolkit definition: Eine Körperschaft, die mit einem Nomen in Verbindung steht. @de
label: nomenhez kapcsolódó testület a következő: @hu
definition: Hozzákapcsol egy noment egy testülethez, amelyet egy nomenhez társítanak. @hu
toolkit label: nomenhez kapcsolódó testület: @hu
toolkit definition: Egy testület, amelyet egy nomenhez társítanak. @hu
label: ha come ente correlato di nomen @it
definition: Correla un nomen a un ente che è associato con un nomen. @it
toolkit label: ente correlato di nomen @it
toolkit definition: Un ente che è associato con un nomen. @it
label: ar nomenu saistītā institūcija @lv
definition: Sasaista nomenu ar institūciju, kas saistīta ar nomenu. @lv
toolkit label: ar nomenu saistītā institūcija @lv
toolkit definition: Institūcija, kas saistīta ar nomenu. @lv
label: 有命名的关联团体 @zh-hans
definition: 将一个命名与和一个命名有关的一个团体关联起来。 @zh-hans
toolkit label: 命名的关联团体 @zh-hans
toolkit definition: 和一个命名有关的一个团体 @zh-hans
has subproperty: is appellation of corporate body of
has subproperty: is assigned by corporate body
has subproperty: P80013
label: ismin ilgili tüzel kişisi ile ilişkilidir @tr
definition: Bir ismi, isimle bağlantılı olan tüzel kişisiyle ilişkilendirir. @tr
toolkit label: Nomenin tüzel kişiyle ilişkisi @tr
toolkit definition: Nomenle ilişkilendirilen tüzel kişi. @tr

has related entity of nomen
status: Published
lexical alias: relatedEntityOfNomen.en
definition: Relates a nomen to an entity that is associated with a nomen.
toolkit label: related entity of nomen
toolkit definition: An entity that is associated with a nomen.
type: Property
domain: C10012
has element type: 1
sub property of: P00028
label: nomeniin liittyvä entiteetti @fi
definition: Liittää nomenin entiteettiin, joka liittyy nomeniin. @fi
toolkit label: nomeniin liittyvä entiteetti @fi
toolkit definition: Entiteetti, joka liittyy nomeniin. @fi
label: har relatert entitet for nomen @no
definition: Relaterer et nomen til en entitet som forbindes med et nomen. @no
toolkit label: relatert entitet for nomen @no
toolkit definition: En entitet som forbindes med et nomen. @no
label: a pour entité en relation avec un nomen @fr
definition: Met un nomen en relation avec une entité qui est associée à un nomen. @fr
toolkit label: entité en relation avec un nomen @fr
toolkit definition: Entité qui est associée à un nomen. @fr
label: heeft gerelateerde entiteit van nomen @nl
definition: Relateert een nomen aan een entiteit die is geassocieerd met een nomen. @nl
toolkit label: gerelateerde entiteit van nomen @nl
toolkit definition: Een entiteit die is geassocieerd met een nomen. @nl
label: له كيان مرتبط بتسمية @ar
definition: يربط تسمية بكيان ذي صلة بتسمية. @ar
toolkit label: كيان مرتبط بتسمية @ar
toolkit definition: كيان ذو صلة بتسمية. @ar
label: té com a entitat relacionada amb un nomen @ca
definition: Relaciona un nomen amb una entitat que s’associa amb un nomen. @ca
toolkit label: entitat relacionada amb un nomen @ca
toolkit definition: Entitat que s’associa amb un nomen. @ca
label: har entitet relateret til nomen @da
definition: Relaterer et nomen til en entitet, som er knyttet til et nomen. @da
toolkit label: entitet relateret til nomen @da
toolkit definition: Entitet, som er knyttet til et nomen. @da
label: nomen'iga seotud olem @et
definition: Seostab nomen'i nomen'iga seotud olemiga. @et
toolkit label: nomen'iga seotud olem @et
toolkit definition: Nomen'iga seotud olem. @et
label: hat mit Nomen in Beziehung stehende Entität @de
definition: Setzt ein Nomen in Beziehung zu einer Entität, die mit einem Nomen in Verbindung steht. @de
toolkit label: mit Nomen in Beziehung stehende Entität @de
toolkit definition: Eine Entität, die mit einem Nomen in Verbindung steht. @de
label: nomen kapcsolódó entitása a következő: @hu
definition: Hozzákapcsol egy noment egy entitáshoz, amelyet egy nomenhez társítanak. @hu
toolkit label: nomen kapcsolódó entitása: @hu
toolkit definition: Egy entitás, amelyet egy nomenhez társítanak. @hu
label: ha come entità correlata di nomen @it
definition: Correla un nomen a un'entità che è associata con un nomen. @it
toolkit label: entità correlata di nomen @it
toolkit definition: Un'entità che è associata con un nomen. @it
label: ar nomenu saistītā entīte @lv
definition: Sasaista nomenu ar entīti, kas saistīta ar nomenu. @lv
toolkit label: ar nomenu saistītā entīte @lv
toolkit definition: Entīte, kas saistīta ar nomenu. @lv
label: 有命名的关联实体 @zh-hans
definition: 将一个命名与和一个命名有关的一个实体关联起来。 @zh-hans
toolkit label: 命名的关联实体 @zh-hans
toolkit definition: 和一个命名有关的一个实体 @zh-hans
has subproperty: has related RDA entity of nomen
has subproperty: P80174
label: ismin ilgili varlığı ile ilişkilidir @tr
definition: Bir ismi, isimle bağlantılı olan bir varlıkla ilişkilendirir. @tr
toolkit label: Nomenin ilişkili olduğu varlık @tr
toolkit definition: Bir isimle bağlantılı olan bir varlık. @tr

has related expression of nomen
status: Published
type: Property
lexical alias: relatedExpressionOfNomen.en
definition: Relates a nomen to an expression that is associated with a nomen.
domain: C10012
sub property of: has related RDA entity of nomen
toolkit label: related expression of nomen
toolkit definition: An expression that is associated with a nomen.
has element type: 1
sub property of: P00003
label: nomeniin liittyvä ekspressio @fi
definition: Liittää nomenin ekspressioon, joka liittyy nomeniin. @fi
toolkit label: nomeniin liittyvä ekspressio @fi
toolkit definition: Ekspressio, joka liittyy nomeniin. @fi
label: har uttrykk relatert til nomen @no
definition: Relaterer et nomen til et uttrykk som forbindes med et nomen. @no
toolkit label: uttrykk relatert til nomen @no
toolkit definition: Et uttrykk som forbindes med et nomen. @no
label: a pour expression en relation avec un nomen @fr
definition: Met un nomen en relation avec une expression qui est associée à un nomen. @fr
toolkit label: expression en relation avec un nomen @fr
toolkit definition: Expression qui est associée à un nomen. @fr
label: heeft gerelateerde expressie van nomen @nl
definition: Relateert een nomen aan een expressie die is geassocieerd met een nomen. @nl
toolkit label: gerelateerde expressie van nomen @nl
toolkit definition: Een expressie die is geassocieerd met een nomen. @nl
label: له تعبيرة مرتبطة بتسمية @ar
definition: يربط تسميه بتعبيرة ذات صلة بتسمية. @ar
toolkit label: تعبيرة مرتبطة بتسمية @ar
toolkit definition: تعبيرة ذات صلة بتسمية. @ar
label: té com a expressió relacionada amb un nomen @ca
definition: Relaciona un nomen amb una expressió que s’associa amb un nomen. @ca
toolkit label: expressió relacionada amb un nomen @ca
toolkit definition: Expressió que s’associa amb un nomen. @ca
label: har udtryk relateret til nomen @da
definition: Relaterer et nomen til et udtryk, som er knyttet til et nomen. @da
toolkit label: værk relateret til nomen @da
toolkit definition: Udtryk, som er knyttet til et nomen. @da
label: nomen'iga seotud väljendus @et
definition: Seostab nomen'i nomen'iga seotud väljendusega. @et
toolkit label: nomen'iga seotud väljendus @et
toolkit definition: Nomen'iga seotud väljendus. @et
label: hat mit Nomen in Beziehung stehende Expression @de
definition: Setzt ein Nomen in Beziehung zu einer Expression, die mit einem Nomen in Verbindung steht. @de
toolkit label: mit Nomen in Beziehung stehende Expression @de
toolkit definition: Eine Expression, die mit einem Nomen in Verbindung steht. @de
label: nomen kapcsolódó kifejezési formája a következő: @hu
definition: Hozzákapcsol egy noment egy kifejezési formához, amelyet egy nomenhez társítanak. @hu
toolkit label: nomen kapcsolódó kifejezési formája: @hu
toolkit definition: Egy kifejezési forma, amelyet egy nomenhez társítanak. @hu
label: ha come espressione correlata di nomen @it
definition: Correla un nomen a un'espressione che è associata con un nomen. @it
toolkit label: espressione correlata di nomen @it
toolkit definition: Un'espressione che è associata con un nomen. @it
label: ar nomenu saistītā izteiksme @lv
definition: Sasaista nomenu ar izteiksmi, kas ir saistīta ar nomenu. @lv
toolkit label: ar nomenu saistītā izteiksme @lv
toolkit definition: Izteiksme, kas ir saistīta ar nomenu. @lv
label: 有命名的关联内容表达 @zh-hans
definition: 将一种命名与和一个命名有关的一种内容表达关联起来。 @zh-hans
toolkit label: 命名的关联内容表达 @zh-hans
toolkit definition: 和一个命名有关的一种内容表达 @zh-hans
has subproperty: is appellation of expression of
has subproperty: P80002
label: ismin ilgili anlatımı ile ilişkilidir @tr
definition: Bir ismi, bir isimle bağlantılı olan anlatımla ilişkilendirir. @tr
toolkit label: Nomenin ilişkili anlatımı @tr
toolkit definition: Bir isimle bağlantılı olan bir anlatım. @tr

has related family of nomen
status: Published
type: Property
lexical alias: relatedFamilyOfNomen.en
definition: Relates a nomen to a family who is associated with a nomen.
domain: C10012
sub property of: has related collective agent of nomen
toolkit label: related family of nomen
toolkit definition: A family who is associated with a nomen.
has element type: 1
sub property of: P00008
label: nomeniin liittyvä suku @fi
definition: Liittää nomenin sukuun, joka liittyy nomeniin. @fi
toolkit label: nomeniin liittyvä suku @fi
toolkit definition: Suku, joka liittyy nomeniin. @fi
label: har familie relatert til nomen @no
definition: Relaterer et nomen til en familie som forbindes med et nomen. @no
toolkit label: familie relatert til nomen @no
toolkit definition: En familie som forbindes med et nomen. @no
label: a pour famille en relation avec un nomen @fr
definition: Met un nomen en relation avec une famille qui est associée à un nomen. @fr
toolkit label: famille en relation avec un nomen @fr
toolkit definition: Famille qui est associée à un nomen. @fr
label: heeft gerelateerde familie van nomen @nl
definition: Relateert een nomen aan een familie die is geassocieerd met een nomen. @nl
toolkit label: gerelateerde familie van nomen @nl
toolkit definition: Een familie die is geassocieerd met een nomen. @nl
label: له عائلة مرتبطة بتسمية @ar
definition: يربط تسمية بعائلة ذات صلة بتسمية. @ar
toolkit label: عائلة مرتبطة بتسمية @ar
toolkit definition: عائلة ذات صلة بتسمية. @ar
label: té com a família relacionada amb un nomen @ca
definition: Relaciona un nomen amb una família que s’associa amb un nomen. @ca
toolkit label: família relacionada amb un nomen @ca
toolkit definition: Família que s’associa amb un nomen. @ca
label: har familie relateret til nomen @da
definition: Relaterer et nomen til en familie, som er knyttet til et nomen. @da
toolkit label: familie relateret til nomen @da
toolkit definition: Familie, som er knyttet til et nomen. @da
label: nomen'iga seotud perekond @et
definition: Seostab nomen'i nomen'iga seotud perekonnaga. @et
toolkit label: nomen'iga seotud perekond @et
toolkit definition: Nomen'iga seotud perekond. @et
label: hat mit Nomen in Beziehung stehende Familie @de
definition: Setzt ein Nomen in Beziehung zu einer Familie, die mit einem Nomen in Verbindung steht. @de
toolkit label: mit Nomen in Beziehung stehende Familie @de
toolkit definition: Eine Familie, die mit einem Nomen in Verbindung steht. @de
label: nomenhez kapcsolódó család a következő: @hu
definition: Hozzákapcsol egy noment egy családhoz, amelyet egy nomenhez társítanak. @hu
toolkit label: nomenhez kapcsolódó család: @hu
toolkit definition: Egy család, amelyet egy nomenhez társítanak. @hu
label: ha come famiglia correlata di nomen @it
definition: Correla un nomen a una famiglia che è associata con un nomen. @it
toolkit label: famiglia correlata di nomen @it
toolkit definition: Una famiglia che è associata con un nomen @it
label: ar nomenu saistītā dzimta/ģimene @lv
definition: Sasaista nomenu ar dzimtu/ģimeni, kas saistīta ar nomenu. @lv
toolkit label: ar nomenu saistītā dzimta/ģimene @lv
toolkit definition: Dzimta/ģimene, kas saistīta ar nomenu. @lv
label: 有命名的关联家族 @zh-hans
definition: 将一个命名与和一个命名有关的一个家族关联起来。 @zh-hans
toolkit label: 命名的关联家族 @zh-hans
toolkit definition: 和一个命名有关的一个家族 @zh-hans
has subproperty: is appellation of family of
has subproperty: is assigned by family
has subproperty: P80012
label: ismin ilgili ailesi ile ilişkilidir @tr
definition: Bir ismi, isimle bağlantılı olan aileyle ilişkilendirir. @tr
toolkit label: İsimle ilişkili aile @tr
toolkit definition: Nomenle bağlantılı olan bir aile. @tr

has related item of nomen
status: Published
type: Property
lexical alias: relatedItemOfNomen.en
definition: Relates a nomen to an item that is associated with a nomen.
domain: C10012
sub property of: has related RDA entity of nomen
toolkit label: related item of nomen
toolkit definition: An item that is associated with a nomen.
has element type: 1
sub property of: P00005
label: nomeniin liittyvä kappale @fi
definition: Liittää nomenin kappaleeseen, joka liittyy nomeniin. @fi
toolkit label: nomeniin liittyvä kappale @fi
toolkit definition: Kappale, joka liittyy nomeniin. @fi
label: har eksemplar relatert til nomen @no
definition: Relaterer et nomen til et eksemplar som forbindes med et nomen. @no
toolkit label: eksemplar relatert til nomen @no
toolkit definition: Et eksemplar som forbindes med et nomen. @no
label: a pour item en relation avec un nomen @fr
definition: Met un nomen en relation avec un item qui est associé à un nomen. @fr
toolkit label: item en relation avec un nomen @fr
toolkit definition: Item qui est associé à un nomen. @fr
label: heeft gerelateerd item van nomen @nl
definition: Relateert een nomen aan een item dat is geassocieerd met een nomen. @nl
toolkit label: gerelateerd item van nomen @nl
toolkit definition: Een item dat is geassocieerd met een nomen. @nl
label: له مفردة مرتبطة بتسمية @ar
definition: يربط تسمية بمفردة ذات صلة بتسمية. @ar
toolkit label: مفردة مرتبطة بتسمية @ar
toolkit definition: مفردة ذات صلة بتسمية. @ar
label: té com a ítem relacionat amb un nomen @ca
definition: Relaciona un nomen amb un ítem que s’associa amb un nomen. @ca
toolkit label: ítem relacionat amb un nomen @ca
toolkit definition: Ítem que s’associa amb un nomen. @ca
label: har eksemplar relateret til nomen @da
definition: Relaterer et nomen til et eksemplar, som er knyttet til et nomen. @da
toolkit label: eksemplar relateret til nomen @da
toolkit definition: Eksemplar, som er knyttet til et nomen. @da
label: nomen'iga seotud eksemplar @et
definition: Seostab nomen'i nomen'iga seotud eksemplariga. @et
toolkit label: nomen'iga seotud eksemplar @et
toolkit definition: Nomen'iga seotud eksemplar. @et
label: hat mit Nomen in Beziehung stehendes Exemplar @de
definition: Setzt ein Nomen in Beziehung zu einem Exemplar, das mit einem Nomen in Verbindung steht. @de
toolkit label: mit Nomen in Beziehung stehendes Exemplar @de
toolkit definition: Ein Exemplar, das mit einem Nomen in Verbindung steht. @de
label: nomen kapcsolódó példánya a következő: @hu
definition: Hozzákapcsol egy noment egy példányhoz, amelyet egy nomenhez társítanak. @hu
toolkit label: nomen kapcsolódó műve: @hu
toolkit definition: Egy példány, amelyet egy nomenhez társítanak. @hu
label: ha come item correlato di nomen @it
definition: Correla un nomen a un item che è associato con un nomen. @it
toolkit label: item correlato di nomen @it
toolkit definition: Un item che è associato con un nomen. @it
label: ar nomenu saistītā vienība @lv
definition: Sasaista nomenu ar vienību, kas ir saistīta ar nomenu. @lv
toolkit label: ar nomenu saistītā vienība @lv
toolkit definition: Vienība, kas ir saistīta ar nomenu. @lv
label: 有命名的关联单件 @zh-hans
definition: 将一个命名与和一个命名有关的一个单件关联起来。 @zh-hans
toolkit label: 命名的关联单件 @zh-hans
toolkit definition: 和一个命名有关的一个单件 @zh-hans
has subproperty: is appellation of item of
has subproperty: P80004
label: ismin ilgili kopyası ile ilişkilidir @tr
definition: Bir ismi, isimle bağlantılı olan bir kopyayla ilişkilendirir. @tr
toolkit label: Nomenle ilişkili kopya @tr
toolkit definition: Bir isimle bağlantılı olan bir kopya. @tr

has related manifestation of nomen
status: Published
type: Property
lexical alias: relatedManifestationOfNomen.en
definition: Relates a nomen to a manifestation that is associated with a nomen.
domain: C10012
sub property of: has related RDA entity of nomen
toolkit label: related manifestation of nomen
toolkit definition: A manifestation that is associated with a nomen.
has element type: 1
sub property of: P00004
label: nomeniin liittyvä manifestaatio @fi
definition: Liittää nomenin manifestaatioon, joka liittyy nomeniin. @fi
toolkit label: nomeniin liittyvä manifestaatio @fi
toolkit definition: Manifestaatio, joka liittyy nomeniin. @fi
label: har manifestasjon relatert til nomen @no
definition: Relaterer et nomen til en manifestasjon som forbindes med et nomen. @no
toolkit label: manifestasjon relatert til nomen @no
toolkit definition: En manifestasjon som forbindes med et nomen. @no
label: a pour manifestation en relation avec un nomen @fr
definition: Met un nomen en relation avec une manifestation qui est associée à un nomen. @fr
toolkit label: manifestation en relation avec un nomen @fr
toolkit definition: Manifestation qui est associée à un nomen. @fr
label: heeft gerelateerde manifestatie van nomen @nl
definition: Relateert een nomen aan een manifestatie die is geassocieerd met een nomen. @nl
toolkit label: gerelateerde manifestatie van nomen @nl
toolkit definition: Een manifestatie die is geassocieerd met een nomen. @nl
label: له تجسيدة مرتبطة بتسمية @ar
definition: يربط تسمية بتجسيدة ذات صلة بتسمية. @ar
toolkit label: تجسيدة مرتبطة بتسمية @ar
toolkit definition: تجسيدة ذات صلة بتسمية. @ar
label: té com a manifestació relacionada amb un nomen @ca
definition: Relaciona un nomen amb una manifestació que s’associa amb un nomen. @ca
toolkit label: manifestació relacionada amb un nomen @ca
toolkit definition: Manifestació que s’associa amb un nomen. @ca
label: har manifestation relateret til nomen @da
definition: Relaterer et nomen til en manifestation, som er knyttet til et nomen. @da
toolkit label: manifestation relateret til nomen @da
toolkit definition: Manifestation, som er knyttet til et nomen. @da
label: nomen'iga seotud kehastus @et
definition: Seostab nomen'i nomen'iga seotud kehastusega. @et
toolkit label: nomen'iga seotud kehastus @et
toolkit definition: Nomen'iga seotud kehastus. @et
label: hat mit Nomen in Beziehung stehende Manifestation @de
definition: Setzt ein Nomen in Beziehung zu einer Manifestation, die mit einem Nomen in Verbindung steht. @de
toolkit label: mit Nomen in Beziehung stehende Manifestation @de
toolkit definition: Eine Manifestation, die mit einem Nomen in Verbindung steht. @de
label: nomen kapcsolódó megjelenési formája a következő: @hu
definition: Hozzákapcsol egy noment egy megjelenési formához, amelyet egy nomenhez társítanak. @hu
toolkit label: nomen kapcsolódó megjelenési formája: @hu
toolkit definition: Egy megjelenési forma, amelyet egy nomenhez társítanak. @hu
label: ha come manifestaizone correlata di nomen @it
definition: Correla un nomen a una manifestazione che è associata con un nomen. @it
toolkit label: manifestazione correlata di nomen @it
toolkit definition: Una manifestazione che è associata con un nomen. @it
label: ar nomenu saistītā manifestācija @lv
definition: Sasaista nomenu ar manifestāciju, kas ir saistīta ar nomenu. @lv
toolkit label: ar nomenu saistītā manifestācija @lv
toolkit definition: Manifestācija, kas ir saistīta ar nomenu. @lv
label: 有命名的关联载体表现 @zh-hans
definition: 将一个命名与和一个命名有关的一种载体表现关联起来。 @zh-hans
toolkit label: 命名的关联载体表现 @zh-hans
toolkit definition: 和一个命名有关的一种载体表现 @zh-hans
has subproperty: is appellation of manifestation of
has subproperty: is name of agent of manifestation of
has subproperty: has reference source
has subproperty: is numbering within sequence of
has subproperty: is first alphanumeric designation of sequence of
has subproperty: is first chronological designation of sequence of
has subproperty: is last alphanumeric designation of sequence of
has subproperty: is last chronological designation of sequence of
has subproperty: P80003
label: ismin ilgili gösterimi ile ilişkilidir @tr
definition: Bir ismi, bir isimle ilişkilendirilen gösterimle ilişkilendirir. @tr
toolkit label: İsmin ilişkili gösterimi @tr
toolkit definition: Bir nomenle bağlantılı olan bir gösterim. @tr

has related nomen of nomen
status: Published
type: Property
lexical alias: relatedNomenOfNomen.en
definition: Relates a nomen to a nomen that is associated with a nomen.
domain: C10012
sub property of: has related RDA entity of nomen
toolkit label: related nomen of nomen
toolkit definition: A nomen that is associated with a nomen.
has element type: 1
sub property of: P00013
label: nomeniin liittyvä nomen @fi
definition: Liittää nomenin nomeniin, joka liittyy nomeniin. @fi
toolkit label: nomeniin liittyvä nomen @fi
toolkit definition: Nomen, joka liittyy nomeniin. @fi
label: har nomen relatert til nomen @no
definition: Relaterer et nomen til et nomen som forbindes med et nomen. @no
toolkit label: nomen relatert til nomen @no
toolkit definition: Et nomen som forbindes med et nomen. @no
label: a pour nomen en relation avec un nomen @fr
definition: Met un nomen en relation avec un nomen qui est associé à un nomen. @fr
toolkit label: nomen en relation avec un nomen @fr
toolkit definition: Nomen qui est associé à un nomen. @fr
label: heeft gerelateerde nomen van nomen @nl
definition: Relateert een nomen aan een nomen dat is geassocieerd met een nomen. @nl
toolkit label: gerelateerde nomen van nomen @nl
toolkit definition: Een nomen dat is geassocieerd met een nomen. @nl
label: له تسمية مرتبطة بتسمية @ar
definition: يربط تسمية بتسمية ذات صلة بتسمية. @ar
toolkit label: تسمية مرتبطة بتسمية @ar
toolkit definition: تسمية ذات صلة بتسمية. @ar
label: té com a nomen relacionat amb un nomen @ca
definition: Relaciona un nomen amb un nomen que s’associa amb un nomen. @ca
toolkit label: nomen relacionat amb un nomen @ca
toolkit definition: Nomen que s’associa amb un nomen. @ca
label: har nomen relateret til nomen @da
definition: Relaterer et nomen til et nomen, som er knyttet til et nomen. @da
toolkit label: nomen relateret til nomen @da
toolkit definition: Nomen, som er knyttet til et nomen. @da
label: nomen'iga seotud nomen @et
definition: Seostab nomen'i nomen'iga seotud nomen'iga. @et
toolkit label: nomen'iga seotud nomen @et
toolkit definition: Nomen'iga seotud nomen. @et
label: hat mit Nomen in Beziehung stehendes Nomen @de
definition: Setzt ein Nomen in Beziehung zu einem Nomen, das mit einem Nomen in Verbindung steht. @de
toolkit label: mit Nomen in Beziehung stehendes Nomen @de
toolkit definition: Ein Nomen, das mit einem Nomen in Verbindung steht. @de
label: nomen kapcsolódó nomenje a következő: @hu
definition: Hozzákapcsol egy noment egy nomenhez, amelyet egy nomenhez társítanak. @hu
toolkit label: nomen kapcsolódó nomenje: @hu
toolkit definition: Egy nomen, amelyet egy nomenhez társítanak. @hu
label: ha come nomen correlato di nomen @it
definition: Correla un nomen a un nomen che è associato con un nomen. @it
toolkit label: nomen correlato di nomen @it
toolkit definition: Un nomen che è associato con un nomen. @it
label: ar nomenu saistītais nomens @lv
definition: Sasaista nomenu ar nomenu, kas saistīts ar nomenu. @lv
toolkit label: ar nomenu saistītais nomens @lv
toolkit definition: Nomens, kas saistīts ar nomenu. @lv
label: 有命名的关联命名 @zh-hans
definition: 将一个命名与和一个命名有关的一个命名关联起来。 @zh-hans
toolkit label: 命名的关联命名 @zh-hans
toolkit definition: 和一个命名有关的一个命名 @zh-hans
has subproperty: has derivation
has subproperty: is derivation of
has subproperty: is equivalent to
has subproperty: has part nomen
has subproperty: is part of nomen
has subproperty: P80009
label: ismin ilgili ismi ile ilişkilidir @tr
definition: Bir ismi, isimle bağlantılı olan isimle ilişkilendirir. @tr
toolkit label: ismin ilişkili ismi @tr
toolkit definition: Bir isimle bağlantılı olan bir isim. @tr

has related person of nomen
status: Published
type: Property
lexical alias: relatedPersonOfNomen.en
definition: Relates a nomen to a person who is associated with a nomen.
domain: C10012
sub property of: has related agent of nomen
toolkit label: related person of nomen
toolkit definition: A person who is associated with a nomen.
has element type: 1
sub property of: P00007
label: nomeniin liittyvä henkilö @fi
definition: Liittää nomenin henkilöön, joka liittyy nomeniin. @fi
toolkit label: nomeniin liittyvä henkilö @fi
toolkit definition: Henkilö, joka liittyy nomeniin. @fi
label: har person relatert til nomen @no
definition: Relaterer et nomen til en person som forbindes med et nomen. @no
toolkit label: person relatert til nomen @no
toolkit definition: En person som forbindes med et nomen. @no
label: a pour personne en relation avec un nomen @fr
definition: Met un nomen en relation avec une personne qui est associée à un nomen. @fr
toolkit label: personne en relation avec un nomen @fr
toolkit definition: Personne qui est associée à un nomen. @fr
label: heeft gerelateerde persoon van nomen @nl
definition: Relateert een nomen aan een persoon die is geassocieerd met een nomen. @nl
toolkit label: gerelateerde persoon van nomen @nl
toolkit definition: Een persoon die is geassocieerd met een nomen. @nl
label: له شخص مرتبط بتسمية @ar
definition: يربط تسمية بشخص ذي صلة بتسمية. @ar
toolkit label: شخص مرتبط بتسمية @ar
toolkit definition: شخص ذو صلة بتسمية. @ar
label: té com a persona relacionada amb un nomen @ca
definition: Relaciona un nomen amb una persona que s’associa amb un nomen. @ca
toolkit label: persona relacionada amb un nomen @ca
toolkit definition: Persona que s’associa amb un nomen. @ca
label: har person relateret til nomen @da
definition: Relaterer et nomen til en person, som er knyttet til et nomen. @da
toolkit label: person relateret til nomen @da
toolkit definition: Person, som er knyttet til et nomen. @da
label: nomen'iga seotud isik @et
definition: Seostab nomen'i nomen'iga seotud isikuga. @et
toolkit label: nomen'iga seotud isik @et
toolkit definition: Nomen'iga seotud isik. @et
label: hat mit Nomen in Beziehung stehende Person @de
definition: Setzt ein Nomen in Beziehung zu einer Person, die mit einem Nomen in Verbindung steht. @de
toolkit label: mit Nomen in Beziehung stehende Person @de
toolkit definition: Eine Person, die mit einem Nomen in Verbindung steht. @de
label: nomenhez kapcsolódó személy a következő: @hu
definition: Hozzákapcsol egy noment egy személyhez, akit egy nomenhez társítanak. @hu
toolkit label: nomenhez kapcsolódó személy: @hu
toolkit definition: Egy személy, akit egy nomenhez társítanak. @hu
label: ha come persona correlata di nomen @it
definition: Correla un nomen a una persona che è associata con un nomen. @it
toolkit label: persona correlata di nomen @it
toolkit definition: Una persona che è associata con un nomen. @it
label: ar nomenu saistītā persona @lv
definition: Sasaista nomenu ar personu, kura saistīta ar nomenu. @lv
toolkit label: ar nomenu saistītā persona @lv
toolkit definition: Persona, kura saistīta ar nomenu. @lv
label: 有命名的关联个人 @zh-hans
definition: 将一个命名与和一个命名有关的一个个人关联起来。 @zh-hans
toolkit label: 命名的关联个人 @zh-hans
toolkit definition: 和一个命名有关的一个个人 @zh-hans
has subproperty: is appellation of person of
has subproperty: is assigned by person
has subproperty: P80011
label: ismin ilgili kişisi ile ilişkilidir @tr
definition: Bir ismi, isimle bağlantılı olan kişiyle ilişkilendirir. @tr
toolkit label: isimle ilişkili kişi @tr
toolkit definition: Bir isimle bağlantılı olan bir kişi. @tr

has related place of nomen
status: Published
type: Property
lexical alias: relatedPlaceOfNomen.en
definition: Relates a nomen to a place associated with a nomen.
domain: C10012
sub property of: has related RDA entity of nomen
toolkit label: related place of nomen
toolkit definition: A place that is associated with a nomen.
has element type: 1
sub property of: P00010
label: nomeniin liittyvä paikka @fi
definition: Liittää nomenin paikkaan, joka liittyy nomeniin. @fi
toolkit label: nomeniin liittyvä paikka @fi
toolkit definition: Paikka, joka liittyy nomeniin. @fi
label: har sted relatert til nomen @no
definition: Relaterer et nomen til et sted som forbindes med et nomen. @no
toolkit label: sted relatert til nomen @no
toolkit definition: Et sted som forbindes med et nomen. @no
label: a pour lieu en relation avec un nomen @fr
definition: Met un nomen en relation avec un lieu qui est associé à un nomen. @fr
toolkit label: lieu en relation avec un nomen @fr
toolkit definition: Lieu qui est associé à un nomen. @fr
label: heeft gerelateerde plaats van nomen @nl
definition: Relateert een nomen aan een plaats die is geassocieerd met een nomen. @nl
toolkit label: gerelateerde plaats van nomen @nl
toolkit definition: Een plaats die is geassocieerd met een nomen. @nl
label: له مكان مرتبط بتسمية @ar
definition: يربط تسمية بمكان ذي صلة بتسمية. @ar
toolkit label: مكان مرتبط بتسمية @ar
toolkit definition: مكان ذي صلة بتسمية. @ar
label: té com a lloc relacionat amb un nomen @ca
definition: Relaciona un nomen amb un lloc que s’associa amb un nomen. @ca
toolkit label: lloc relacionat amb un nomen @ca
toolkit definition: Lloc que s’associa amb un nomen. @ca
label: har sted relateret til nomen @da
definition: Relaterer et nomen til et sted, som er knyttet til et nomen. @da
toolkit label: sted relateret til nomen @da
toolkit definition: Sted, som er knyttet til et nomen. @da
label: nomen'iga seotud koht @et
definition: Seostab nomen'i nomen'iga seotud kohaga. @et
toolkit label: nomen'iga seotud koht @et
toolkit definition: Nomen'iga seotud koht. @et
label: hat mit Nomen in Beziehung stehendes Geografikum @de
definition: Setzt ein Nomen in Beziehung zu einem Geografikum, das mit einem Nomen in Verbindung steht. @de
toolkit label: mit Nomen in Beziehung stehendes Geografikum @de
toolkit definition: Ein Geografikum, das mit einem Nomen in Verbindung steht. @de
label: nomen kapcsolódó helye a következő: @hu
definition: Hozzákapcsol egy noment egy helyhez, amelyet egy nomenhez társítanak. @hu
toolkit label: nomen kapcsolódó helye: @hu
toolkit definition: Egy hely, amelyet egy nomenhez társítanak. @hu
label: ha come luogo correlato di nomen @it
definition: Correla un nomen a un luogo che è associato con un nomen. @it
toolkit label: luogo correlato di nomen @it
toolkit definition: Un luogo che è associato con un nomen. @it
label: ar nomenu saistītā vieta @lv
definition: Sasaista nomenu ar vietu, kas saistīta ar nomenu. @lv
toolkit label: ar nomenu saistītā vieta @lv
toolkit definition: Vieta, kas saistīta ar nomenu. @lv
label: 有命名的关联地点 @zh-hans
definition: 将一个命名与和一个命名有关的一个地点关联起来。 @zh-hans
toolkit label: 命名的关联地点 @zh-hans
toolkit definition: 和一个命名有关的一个地点 @zh-hans
has subproperty: is appellation of place of
has subproperty: P80007
label: ismin ilgili yeri ile ilişkilidir @tr
definition: Bir ismi, isimle bağlantılı olan bir yerle ilişkilendirir. @tr
toolkit label: İsimle ilişkili yer @tr
toolkit definition: Bir isimle bağlantılı olan bir yer. @tr

has related RDA entity of nomen
status: Published
type: Property
lexical alias: relatedRDAEntityOfNomen.en
definition: Relates a nomen to an RDA entity that is associated with a nomen.
domain: C10012
toolkit label: related RDA entity of nomen
toolkit definition: An RDA entity that is associated with a nomen.
has element type: 1
sub property of: has related entity of nomen
sub property of: P00001
label: nomeniin liittyvä RDA-entiteetti @fi
definition: Liittää nomenin RDA-entiteettiin, joka liittyy nomeniin. @fi
toolkit label: nomeniin liittyvä RDA-entiteetti @fi
toolkit definition: RDA-entiteetti, joka liittyy nomeniin. @fi
label: har RDA-entitet relatert til nomen @no
definition: Relaterer et nomen til en RDA-entitet som forbindes med et nomen. @no
toolkit label: RDA-entitet relatert til nomen @no
toolkit definition: En RDA-entitet som forbindes med et nomen. @no
label: a pour entité RDA en relation avec un nomen @fr
definition: Met un nomen en relation avec une entité RDA qui est associée à un nomen. @fr
toolkit label: entité RDA en relation avec un nomen @fr
toolkit definition: Entité RDA qui est associée à un nomen. @fr
label: heeft gerelateerde RDA-entiteit van nomen @nl
definition: Relateert een nomen aan een RDA-entiteit die is geassocieerd met een nomen. @nl
toolkit label: gerelateerde RDA-entiteit van nomen @nl
toolkit definition: Een RDA-entiteit die is geassocieerd met een nomen. @nl
label: له كيان "وام" مرتبط بتسمية @ar
definition: يربط تسمية بكيان "وام" ذي صلة بتسمية. @ar
toolkit label: كيان "وام" مرتبط بتسمية @ar
toolkit definition: كيان "وام" ذو صلة بتسمية. @ar
label: té com a entitat RDA relacionada amb un nomen @ca
definition: Relaciona un nomen amb una entitat RDA que s’associa amb un nomen. @ca
toolkit label: entitat RDA relacionada amb un nomen @ca
toolkit definition: Entitat RDA que s’associa amb un nomen. @ca
label: har RDA-entitet relateret til nomen @da
definition: Relaterer et nomen til en RDA-entitet, som er knyttet til et nomen. @da
toolkit label: RDA-entitet relateret til nomen @da
toolkit definition: RDA-entitet, som er knyttet til et nomen. @da
label: nomen'iga seotud RDA olem @et
definition: Seostab nomen'i nomen'iga seotud RDA olemiga. @et
toolkit label: nomen'iga seotud RDA olem @et
toolkit definition: Nomen'iga seotud RDA olem. @et
label: hat mit Nomen in Beziehung stehende RDA-Entität @de
definition: Setzt ein Nomen in Beziehung zu einer RDA-Entität, die mit einem Nomen in Verbindung steht. @de
toolkit label: mit Nomen in Beziehung stehende RDA-Entität @de
toolkit definition: Eine RDA-Entität, die mit einem Nomen in Verbindung steht. @de
label: nomen kapcsolódó RDA-entitása a következő: @hu
definition: Hozzákapcsol egy noment egy RDA-entitáshoz, amelyet egy nomenhez társítanak. @hu
toolkit label: nomen kapcsolódó RDA-entitása: @hu
toolkit definition: Egy RDA-entitás, amelyet egy nomenhez társítanak. @hu
label: ha come entità RDA correlata di nomen @it
definition: Correla un nomen a un'entità RDA che è associata con un nomen. @it
toolkit label: entità RDA correlata di nomen @it
toolkit definition: Un'entità RDA che è associata con un nomen. @it
label: ar nomenu saistītā RDA entīte @lv
definition: Sasaista nomenu ar RDA entīti, kas saistīta ar nomenu. @lv
toolkit label: ar nomenu saistītā RDA entīte @lv
toolkit definition: RDA entīte, kas saistīta ar nomenu. @lv
label: 有命名的关联RDA实体 @zh-hans
definition: 将一个命名与和一个命名有关的一个RDA实体关联起来。 @zh-hans
toolkit label: 命名的关联RDA实体 @zh-hans
toolkit definition: 和一个命名有关的一个RDA实体 @zh-hans
has subproperty: is appellation of RDA entity of
has subproperty: has related agent of nomen
has subproperty: has related expression of nomen
has subproperty: has related item of nomen
has subproperty: has related manifestation of nomen
has subproperty: has related nomen of nomen
has subproperty: has related place of nomen
has subproperty: has related timespan of nomen
has subproperty: has related work of nomen
has subproperty: P80010
label: ismin ilgili RDA varlığı ile ilişkilidir @tr
definition: Bir ismi, isimle baplantılı olan RDA varlığıyla ilişkilendirir. @tr
toolkit label: ismin RDA varlığıyla ilişkisi @tr
toolkit definition: Bir isimle bağlantılı olan bir RDA varlığı. @tr

has related timespan of nomen
status: Published
type: Property
lexical alias: relatedTimespanOfNomen.en
definition: Relates a nomen to a timespan that is associated with a nomen.
domain: C10012
sub property of: has related RDA entity of nomen
toolkit label: related timespan of nomen
toolkit definition: A timespan that is associated with a nomen.
has element type: 1
sub property of: P00011
label: nomeniin liittyvä ajanjakso @fi
definition: Liittää nomenin ajanjaksoon, joka liittyy nomeniin. @fi
toolkit label: nomeniin liittyvä ajanjakso @fi
toolkit definition: Ajanjakso, joka liittyy nomeniin. @fi
label: har tidsrom relatert til nomen @no
definition: Relaterer et nomen til et tidsrom som forbindes med et nomen. @no
toolkit label: tidsrom relatert til nomen @no
toolkit definition: Et tidsrom som forbindes med et nomen. @no
label: a pour laps de temps en relation avec un nomen @fr
definition: Met un nomen en relation avec un laps de temps qui est associé à un nomen. @fr
toolkit label: laps de temps en relation avec un nomen @fr
toolkit definition: Laps de temps qui est associé à un nomen. @fr
label: heeft gerelateerde tijdspanne van nomen @nl
definition: Relateert een nomen aan een tijdspanne die is geassocieerd met een nomen. @nl
toolkit label: gerelateerde tijdspanne van nomen @nl
toolkit definition: Een tijdspanne die is geassocieerd met een nomen. @nl
label: له فترة زمنية مرتبطة بتسمية @ar
definition: يربط تسمية بفترة زمنية ذات صلة بتسمية. @ar
toolkit label: فترة زمنية مرتبطة بتسمية @ar
toolkit definition: فترة زمنية ذات صلة بتسمية. @ar
label: té com a interval de temps relacionat amb un nomen @ca
definition: Relaciona un nomen amb un interval de temps que s’associa amb un nomen. @ca
toolkit label: interval de temps relacionat amb un nomen @ca
toolkit definition: Interval de temps que s’associa amb un nomen. @ca
label: har tidsperiode relateret til nomen @da
definition: Relaterer et nomen til en tidsperiode, som er knyttet til et nomen. @da
toolkit label: tidsperiode relateret til nomen @da
toolkit definition: Tidsperiode, som er knyttet til et nomen. @da
label: nomen'iga seotud ajavahemik @et
definition: Seostab nomen'i nomen'iga seotud ajavahemikuga. @et
toolkit label: nomen'iga seotud ajavahemik @et
toolkit definition: Nomen'iga seotud ajavahemik. @et
label: hat mit Nomen in Beziehung stehenden Zeitraum @de
definition: Setzt ein Nomen in Beziehung zu einem Zeitraum, der mit einem Nomen in Verbindung steht. @de
toolkit label: mit Nomen in Beziehung stehender Zeitraum @de
toolkit definition: Ein Zeitraum, der mit einem Nomen in Verbindung steht. @de
label: nomen kapcsolódó időtartama a következő: @hu
definition: Hozzákapcsol egy noment egy időtartamhoz, amelyet egy nomenhez társítanak. @hu
toolkit label: nomen kapcsolódó időtartama: @hu
toolkit definition: Egy időtartam, amelyet egy nomenhez társítanak. @hu
label: ha come arco di tempo correlato di nomen @it
definition: Correla un nomen a un arco di tempo che è associato con un nomen. @it
toolkit label: arco di tempo correlato di nomen @it
toolkit definition: Un arco di tempo che è associato con un nomen. @it
label: ar nomenu saistītais laikposms @lv
definition: Sasaista nomenu ar laikposmu, kas saistīts ar nomenu. @lv
toolkit label: ar nomenu saistītais laikposms @lv
toolkit definition: Laikposms, kas saistīts ar nomenu. @lv
label: 有命名的关联时间段 @zh-hans
definition: 将一个命名与和一个命名有关的一个时间段关联起来。 @zh-hans
toolkit label: 命名的关联时间段 @zh-hans
toolkit definition: 和一个命名有关的一个时间段 @zh-hans
has subproperty: is appellation of timespan of
has subproperty: has date of usage
has subproperty: P80008
label: ismin ilgili zaman aralığı ile ilişkilidir @tr
definition: Bir ismi, isimle bağlantılı olan zaman süreciyle ilişkilendirir. @tr
toolkit label: İsmin zaman aralığıyla ilişkisi @tr
toolkit definition: Bir isimle bağlantılı olan bir zaman aralığı. @tr

has related work of nomen
status: Published
type: Property
lexical alias: relatedWorkOfNomen.en
definition: Relates a nomen to a work that is associated with a nomen.
domain: C10012
sub property of: has related RDA entity of nomen
toolkit label: related work of nomen
toolkit definition: A work that is associated with a nomen.
has element type: 1
sub property of: P00002
label: nomeniin liittyvä teos @fi
definition: Liittää nomenin teokseen, joka liittyy nomeniin. @fi
toolkit label: nomeniin liittyvä teos @fi
toolkit definition: Teos, joka liittyy nomeniin. @fi
label: har verk relatert til nomen @no
definition: Relaterer et nomen til et verk som forbindes med et nomen. @no
toolkit label: verk relatert til nomen @no
toolkit definition: Et verk som forbindes med et nomen. @no
label: a pour œuvre en relation avec un nomen @fr
definition: Met un nomen en relation avec une œuvre qui est associée à un nomen. @fr
toolkit label: œuvre en relation avec un nomen @fr
toolkit definition: Œuvre qui est associée à un nomen. @fr
label: heeft gerelateerd werk van nomen @nl
definition: Relateert een nomen aan een werk dat is geassocieerd met een nomen. @nl
toolkit label: gerelateerd werk van nomen @nl
toolkit definition: Een werk dat is geassocieerd met een nomen. @nl
label: له عمل مرتبط بتسمية @ar
definition: يربط تسميه بعمل مرتبط بتسمية. @ar
toolkit label: عمل مرتبط بتسمية @ar
toolkit definition: عمل ذو صلة بتسمية. @ar
label: té com a obra relacionada amb un nomen @ca
definition: Relaciona un nomen amb una obra que s’associa amb un nomen. @ca
toolkit label: obra relacionada amb un nomen @ca
toolkit definition: Obra que s’associa amb un nomen. @ca
label: har værk relateret til nomen @da
definition: Relaterer et nomen til et værk, som er knyttet til et nomen. @da
toolkit label: værk relateret til nomen @da
toolkit definition: Værk, som er knyttet til et nomen. @da
label: nomen'iga seotud teos @et
definition: Seostab nomen'i nomen'iga seotud teosega. @et
toolkit label: nomen'iga seotud teos @et
toolkit definition: Nomen'iga seotud teos. @et
label: hat mit Nomen in Beziehung stehendes Werk @de
definition: Setzt ein Nomen in Beziehung zu einem Werk, das mit einem Nomen in Verbindung steht. @de
toolkit label: mit Nomen in Beziehung stehendes Werk @de
toolkit definition: Ein Werk, das mit einem Nomen in Verbindung steht. @de
label: nomen kapcsolódó műve a következő: @hu
definition: Hozzákapcsol egy noment egy műhöz, amelyet egy nomenhez társítanak. @hu
toolkit label: nomen kapcsolódó műve: @hu
toolkit definition: Egy mű, amelyet egy nomenhez társítanak. @hu
label: ha come opera correlata di nomen @it
definition: Correla un nomen a un'opera che è associata con un nomen. @it
toolkit label: opera correlata di nomen @it
toolkit definition: Un'opera che è associata con un nomen. @it
label: ar nomenu saistītais darbs @lv
definition: Sasaista nomenu ar darbu, kas saistīts ar nomenu. @lv
toolkit label: ar nomenu saistītais darbs @lv
toolkit definition: Darbs, kas saistīts ar nomenu. @lv
label: 有命名的关联作品 @zh-hans
definition: 将一个命名与和一个命名有关的一种作品关联起来。 @zh-hans
toolkit label: 命名的关联作品 @zh-hans
toolkit definition: 和一个命名有关的一种作品 @zh-hans
has subproperty: is appellation of work of
has subproperty: is subject nomen of
has subproperty: P80001
label: ismin ilgili eseri ile ilişkilidir @tr
definition: Bir ismi, bir isimle bağlantılı olan eserle ilişkilendirir. @tr
toolkit label: İsimle ilişkili eser @tr
toolkit definition: Bir isimle bağlantılı olan bir eser. @tr

has scheme of nomen
status: Published
type: Property
lexical alias: schemeOfNomen.en
definition: Relates a nomen to a scheme in which a nomen is established.
scope note: The scheme can be a value or vocabulary encoding scheme or a string encoding scheme.
domain: C10012
toolkit label: scheme of nomen
toolkit definition: A scheme in which a nomen is established.
has element type: 5
label: nomenin järjestelmä @fi
definition: Liittää nomenin järjestelmään, jossa sovellus on luotu. @fi
scope note: Järjestelmä voi olla arvojen, sanaston tai syntaksin merkintäjärjestelmä. @fi
toolkit label: nomenin järjestelmä @fi
toolkit definition: Järjestelmä, jossa sovellus on luotu. @fi
label: har skjema for nomen @no
definition: Relaterer et nomen til et skjema hvor en betegnelse er innarbeidet. @no
scope note: Skjemaet kan være et kodeskjema for verdi eller vokabular eller et kodeskjema for syntaks. @no
toolkit label: skjema for nomen @no
toolkit definition: Et skjema hvor en betegnelse er innarbeidet. @no
label: a pour schéma d’un nomen @fr
definition: Met un nomen en relation avec un schéma dans lequel un nomen est établi. @fr
scope note: Le schéma peut être un schéma d’encodage de valeurs ou de vocabulaire ou un schéma d’encodage de chaînes. @fr
toolkit label: schéma d’un nomen @fr
toolkit definition: Schéma dans lequel un nomen est établi. @fr
label: heeft schema van nomen @nl
definition: Relateert een nomen aan een schema waarin een benaming is vastgesteld. @nl
scope note: Het schema kan een waardelijst zijn of vocabulair coderingsschema of een string coderingsschema. @nl
toolkit label: schema van nomen @nl
toolkit definition: Een schema waarin een benaming is vastgesteld. @nl
label: له خطة تسمية @ar
definition: يربط تسمية بخطة ينشأ عنها اسم. @ar
scope note: خطة قد تكون قيمة أو خطة ترميز مفردات أو خطة ترميز سلسلة تمثيلات. @ar
toolkit label: خطة تسمية @ar
toolkit definition: خطة ينشأ عنها اسم. @ar
label: té com a esquema de nomen @ca
definition: Relaciona un nomen amb un esquema en el qual s’estableix un nomen. @ca
scope note: L’esquema pot ser un valor o un esquema de codificació de vocabulari o un esquema de codificació de cadenes. @ca
toolkit label: esquema de nomen @ca
toolkit definition: Esquema en el qual s’estableix un nomen. @ca
label: har skema for nomen @da
definition: Relaterer et nomen til et skema, hvori en benævnelse etableres. @da
scope note: Skemaet kan være et værdi- eller vokabularkodningsskema eller et syntakskodningsskema. @da
toolkit label: skema for nomen @da
toolkit definition: Skema, hvori en benævnelse etableres. @da
label: nomen'i süsteem @et
definition: Seostab nomen'i süsteemiga, mille raames nimetus on kehtestatud. @et
scope note: Süsteem võib olla väärtuste või leksikaalne märkimissüsteem või süntaktiline märkimissüsteem. @et
toolkit label: nomen'i süsteem @et
toolkit definition: Süsteem, mille raames nimetus on kehtestatud. @et
label: hat Schema eines Nomens @de
definition: Setzt ein Nomen in Beziehung zu einem Schema, in dem eine Bezeichnung festgelegt ist. @de
scope note: Das Schema kann entweder ein Value oder Vocabulary Encoding Scheme oder ein String Encoding Scheme sein. @de
toolkit label: Schema eines Nomens @de
toolkit definition: Ein Schema, in dem eine Bezeichnung festgelegt ist. @de
label: nomen sémája a következő: @hu
definition: Hozzákapcsol egy noment egy sémához, amelyben egy megnevezés testet ölt. @hu
scope note: A séma lehet egy érték, vagy szótárkódolási séma, vagy egy karakterlánc kódolási sémája. @hu
toolkit label: nomen sémája: @hu
toolkit definition: Egy séma, amelyben egy megnevezés testet ölt. @hu
label: ha come schema del nomen @it
definition: Correla un nomen a uno schema in cui una designazione è stabilita. @it
scope note: Lo schema può essere un valore o uno schema di codifica di vocabolario o uno schema di codifica della sintassi. @it
toolkit label: schema del nomen @it
toolkit definition: Uno schema in cui una designazione è stabilita. @it
label: nomena shēma @lv
definition: Sasaista nomenu ar shēmu, kurā tiek izveidots apzīmējums. @lv
scope note: Shēma var būt vērtība, kontrolētas vārdnīcas shēma, vai virknes shēma. @lv
toolkit label: nomena shēma @lv
toolkit definition: Shēma, kurā tiek izveidots apzīmējums. @lv
label: 有命名的体系 @zh-hans
definition: 将一个命名与命名在其中建立的一个体系关联起来。 @zh-hans
scope note: 该体系可以是值或词表编码体系或者串编码体系 @zh-hans
toolkit label: 命名的体系 @zh-hans
toolkit definition: 命名在其中建立的一个体系 @zh-hans
has subproperty: P80069
label: isim şeması ile ilişkilidir @tr
definition: Bir ismi, bir ismin oluşturulduğu bir şemayla ilişkilendirir. @tr
scope note: Şema, bir değer veya kelime kodlama şeması veya bir dizi kodlama şeması olabilir. @tr
toolkit label: isim şeması @tr

has scope of usage (Deprecated)
status: Deprecated
lexical alias: scopeOfUsage.en
definition: Relates a nomen to a type or form of work associated with the usage of a name of agent.
toolkit label: scope of usage
toolkit definition: A type or form of work associated with the usage of a name of agent.
type: Property
domain: C10012
has element type: 3
has subproperty: P80167

has script of nomen
status: Published
type: Property
lexical alias: scriptOfNomen.en
definition: Relates a nomen to a set of characters or symbols with which a nomen is formed.
domain: C10012
toolkit label: script of nomen
toolkit definition: A set of characters or symbols with which a nomen is formed.
has element type: 5
label: nomenin kirjoitusjärjestelmä @fi
definition: Liittää nomenin merkkien ja symbolien joukkoon, josta nimitys muodostetaan. @fi
toolkit label: nomenin kirjoitusjärjestelmä @fi
toolkit definition: Merkkien ja symbolien joukko, josta nimitys muodostetaan. @fi
label: har tegnsett for nomen @no
definition: Relaterer et nomen til et sett med tegn eller symboler som en betegnelse er formet med. @no
toolkit label: tegnsett for nomen @no
toolkit definition: Et sett med tegn eller symboler som en betegnelse er formet med. @no
label: a pour écriture d’un nomen @fr
definition: Met un nomen en relation avec un ensemble de caractères ou de symboles à partir duquel un nomen est formé. @fr
toolkit label: écriture d’un nomen @fr
toolkit definition: Ensemble de caractères ou de symboles à partir duquel un nomen est formé. @fr
label: heeft schrift van nomen @nl
definition: Relateert een nomen aan een verzameling karakters of symbolen waarmee een benaming gevormd is. @nl
toolkit label: schrift van nomen @nl
toolkit definition: Een verzameling karakters of symbolen waarmee een benaming gevormd is. @nl
label: له نص لتسمية @ar
definition: يربط تسمية بمجموعة تمثيلات أو رموز تتكون من خلالها التسمية. @ar
toolkit label: نص لتسمية @ar
toolkit definition: مجموعة تمثيلات أو رموز يتكون منها اسم. @ar
label: té com a escriptura d’un nomen @ca
definition: Relaciona un nomen amb un conjunt de caràcters o símbols amb els quals es forma un nomen. @ca
toolkit label: escriptura d’un nomen @ca
toolkit definition: Conjunt de caràcters o símbols amb els quals es forma un nomen. @ca
label: har skriftsystem for nomen @da
definition: Relaterer et nomen til et sæt af tegn eller symboler, som en benævnelse er dannet med. @da
toolkit label: skriftsystem for nomen @da
toolkit definition: Sæt af tegn eller symboler, som en benævnelse er dannet med. @da
label: nomen'i kirjasüsteem @et
definition: Seostab nomen'i kirjamärkide või sümbolite kogumiga, millest nimetus on moodustatud. @et
toolkit label: nomen'i kirjasüsteem @et
toolkit definition: Kirjamärkide või sümbolite kogum, millest nimetus on moodustatud. @et
label: hat Schrift eines Nomens @de
definition: Setzt ein Nomen in Beziehung zu einem Satz von Zeichen oder Symbolen, mit denen eine Bezeichnung gebildet wird. @de
toolkit label: Schrift eines Nomens @de
toolkit definition: Ein Satz von Zeichen oder Symbolen, mit denen eine Bezeichnung gebildet wird. @de
label: nomen írásrendszere a következő: @hu
definition: Hozzákapcsol egy noment egy karakter- vagy szimbólumkészlethez, amellyel egy megnevezést megformáznak. @hu
toolkit label: nomen írásrendszere: @hu
toolkit definition: Egy karakter- vagy szimbólumkészlet, amellyel egy megnevezést megformáznak. @hu
label: ha come scrittura del nomen @it
definition: Correla un nomen a un insieme di caratteri o simboli con cui si forma una designazione. @it
toolkit label: scrittura del nomen @it
toolkit definition: Un insieme di caratteri o simboli con cui si forma una designazione. @it
label: nomena pieraksts @lv
definition: Sasaista nomenu ar rakstzīmju vai simbolu kopumu, ar kuriem tiek veidots apzīmējums. @lv
toolkit label: nomena pieraksts @lv
toolkit definition: Rakstzīmju vai simbolu kopums, ar kuriem tiek veidots apzīmējums. @lv
label: 有命名的文字 @zh-hans
definition: 将一个命名与用以形成一个命名的一个字符或符号的集合关联起来。 @zh-hans
toolkit label: 命名的文字 @zh-hans
toolkit definition: 用以形成一个命名的一个字符或符号的集合 @zh-hans
has subproperty: P80070
label: ismin yazı sistemi ile ilişkilidir @tr
definition: Bir ismi, bir ismin oluşturulduğu bir dizi karakter veya sembolle ilişkilendirir. @tr
toolkit label: isim metni @tr
toolkit definition: Bir ismin oluşturulduğu bir dizi karakterler veya semboller kümesi. @tr

is serial number of musical work of
status: Published
type: Property
lexical alias: serialNumberOfMusicalWorkOf.en
domain: C10012
toolkit label: serial number of musical work of
sub property of: is numeric designation of musical work of
has element type: 2
definition: Relates a nomen to a work that has a numeric designation of musical work that is assigned by a composer or a reference source that indicates a sequence of musical works that share the same title or that share the same title and the same representative medium of performance.
toolkit definition: A work that has a numeric designation of musical work that is assigned by a composer or a reference source that indicates a sequence of musical works that share the same title or that share the same title and the same representative medium of performance.
label: järjestysnumero musiikkiteokselle @fi
definition: Liittää nomenin teokseen, jolla on musiikkiteoksen numeerinen määrite, joka on säveltäjän antama tai tietolähteestä otettu. Määrite ilmaisee saman nimekkeen tai saman nimekkeen ja saman edustavan esityskokoonpanon jakavien musiikkiteosten järjestystä. @fi
toolkit label: järjestysnumero musiikkiteokselle @fi
toolkit definition: Teos, jolla on musiikkiteoksen numeerinen määrite, joka on säveltäjän antama tai tietolähteestä otettu. Määrite ilmaisee saman nimekkeen tai saman nimekkeen ja saman edustavan esityskokoonpanon jakavien musiikkiteosten järjestystä. @fi
label: er serienummer for musikalsk verk for @no
definition: Relaterer et nomen til et musikalsk verk som har en numerisk betegnelse for musikalsk verk som er angitt av en komponist eller en referansekilde som indikerer en sekvens av musikalske verk som har samme tittel eller har samme tittel og den samme representative besetningen. @no
toolkit label: serienummer for musikalsk verk for @no
toolkit definition: Et musikalsk verk som har en numerisk betegnelse for musikalsk verk som er angitt av en komponist eller en referansekilde som indikerer en sekvens av musikalske verk som har samme tittel eller har samme tittel og den samme representative besetningen. @no
label: est un numéro d’ordre d’une œuvre musicale de @fr
definition: Met un nomen en relation avec une œuvre qui possède une désignation numérique d’une œuvre musicale attribuée par un compositeur ou une source de référence et indiquant une séquence des œuvres musicales ayant le même titre ou ayant le même titre et la même distribution d’exécution représentative. @fr
toolkit label: numéro d’ordre d’une œuvre musicale de @fr
toolkit definition: Œuvre qui possède une désignation numérique d’une œuvre musicale attribuée par un compositeur ou une source de référence et indiquant une séquence des œuvres musicales ayant le même titre ou ayant le même titre et la même distribution d’exécution représentative. @fr
label: is serienummer van muziekwerk van @nl
definition: Relateert een nomen aan een werk dat een numerieke aanduiding voor muziekwerk heeft, die is toegekend door een componist of een naslagwerk die een volgorde van muziekwerken aangeeft die dezelfde titel delen en hetzelfde representatieve medium van uitvoering. @nl
toolkit label: serienummer van muziekwerk van @nl
toolkit definition: Een werk dat een numerieke aanduiding voor muziekwerk heeft, die is toegekend door een componist of een naslagwerk die een volgorde van muziekwerken aangeeft die dezelfde titel delen en hetzelfde representatieve medium van uitvoering. @nl
label: هو رقم مسلسل لعمل موسيقى لـ @ar
definition: يربط تسمية بعمل موسيقى له رمز رقمي لعمل موسيقي خصصه له ملحن أو مصدر مرجعي، يوضح تسلسل أعمال موسيقية لها العنوان نفسه أو لها العنوان ووسيط الأداء نفسه. @ar
toolkit label: رقم مسلسل لعمل موسيقى لـ @ar
toolkit definition: عمل له رمز رقمي لعمل موسيقى خصصه له ملحن أو مصدر مرجعي، يوضح تسلسل أعمال موسيقية لها العنوان نفسه أو لها العنوان ووسيط الأداء نفسه. @ar
label: és número d’ordre d’una obra musical de @ca
definition: Relaciona un nomen amb una obra que té una designació numèrica d’obra musical que és assignada per un compositor o una font de referència que indica una seqüència d’obres musicals que comparteixen el mateix títol o que comparteixen el mateix títol i el mateix repartiment d’execució representatiu. @ca
toolkit label: número d’ordre d’una obra musical de @ca
toolkit definition: Obra que té una designació numèrica d’obra musical que és assignada per un compositor o una font de referència que indica una seqüència d’obres musicals que comparteixen el mateix títol o que comparteixen el mateix títol i el mateix repartiment d’execució representatiu. @ca
label: er serienummer for musikværk af @da
definition: Relaterer et nomen til et musikværk, som har en numerisk betegnelse for musikværk, angivet af en komponist eller en referencekilde, som angiver en sekvens af musikværk, som deler samme titel, eller som deler samme titel og samme repræsentative besætning. @da
toolkit label: serienummer for musikværk af @da
toolkit definition: Musikværk, som har en numerisk betegnelse for musikværk, angivet af en komponist eller en referencekilde, som angiver en sekvens af musikværk, som deler samme titel, eller som deler samme titel og samme repræsentative besætning. @da
label: muusikateose järjenumber teoses @et
definition: Seostab nomen'i muusikateosega, millel on numbriline tähistus, mille on andnud helilooja või mis on antud teatmeallikas. Järjenumber näitab selliste muusikateoste järjestust, mis kannavad ühesugust pealkirja või ühesugust pealkirja koos iseloomuliku esituskoosseisuga. @et
toolkit label: muusikateose järjenumber teoses @et
toolkit definition: Muusikateos, millel on numbriline tähistus, mille on andnud helilooja või mis on antud teatmeallikas. Järjenumber näitab selliste muusikateoste järjestust, mis kannavad ühesugust pealkirja või ühesugust pealkirja koos iseloomuliku esituskoosseisuga. @et
label: ist laufende Nummer eines Musikwerks von @de
definition: Setzt ein Nomen in Beziehung zu einem Werk, das über eine numerische Bezeichnung eines Musikwerks verfügt, die von einer Komponistin/einem Komponisten vergeben oder aus einem Nachschlagewerk entnommen wird und auf eine Folge von Musikwerken hinweist, die den gleichen Titel oder den gleichen Titel und die gleiche repräsentative Besetzung haben. @de
toolkit label: Laufende Nummer eines Musikwerks von @de
toolkit definition: Ein Werk, das über eine numerische Bezeichnung eines Musikwerks verfügt, die von einer Komponistin/einem Komponisten vergeben oder aus einem Nachschlagewerk entnommen wird und auf eine Folge von Musikwerken hinweist, die den gleichen Titel oder den gleichen Titel und die gleiche repräsentative Besetzung haben. @de
label: sorozatszáma a következő zeneműnek: @hu
definition: Hozzákapcsol egy noment egy műhöz, amely rendelkezik egy zeneszerző vagy egy irodalomjegyzékben szereplő forrás által hozzárendelt zenemű-számjelzéssel, amely az olyan zeneművek sorrendjét jelöli, amelyek azonos címűek, vagy azonos mind a címük mind a jellegzetes előadásmédiumuk. @hu
toolkit label: sorozatszáma a következő zeneműnek: @hu
toolkit definition: Egy mű, amely rendelkezik egy zeneszerző vagy egy irodalomjegyzékben szereplő forrás által hozzárendelt zenemű-számjelzéssel, amely az olyan zeneművek sorrendjét jelöli, amelyek azonos címűek, vagy azonos mind a címük mind a jellegzetes előadásmédiumuk. @hu
label: è numero seriale di opera musicale di @it
definition: Correla un nomen a un'opera musicale che ha un identificatore per l'opera che è una designazione numerica assegnata da un compositore o da una fonte di reference che indica una sequernza di opere musicali che condividono lo stesso titolo o che condividono lo stesso titolo e lo stesso mezzo d'interpretazione rappresentativo. @it
toolkit label: numero seriale di opera musicale di @it
toolkit definition: Un'opera musicale che ha un identificatore per l'opera che è una designazione numerica assegnata da un compositore o da una fonte di reference che indica una sequernza di opere musicali che condividono lo stesso titolo o che condividono lo stesso titolo e lo stesso mezzo d'interpretazione rappresentativo. @it
label: ir mūzikas darba kārtas numurs @lv
toolkit label: ir mūzikas darba kārtas numurs @lv
definition: Sasaista nomenu ar darbu, kas ir mūzikas darbs, kam ir komponista vai uzziņu avota piešķirts muzikas darba numerācijas apzīmējums un kurš norāda uz vienāda nosaukuma vai vienāda oriģinālā izpildījuma veida mūzikas darbu secību. @lv
toolkit definition: Mūzikas darbs, kam ir komponista vai uzziņu avota piešķirts muzikas darba numerācijas apzīmējums un kurš norāda uz vienāda nosaukuma vai vienāda oriģinālā izpildījuma veida mūzikas darbu secību. @lv
label: 是……的音乐作品序列号 @zh-hans
toolkit label: ……的音乐作品序列号 @zh-hans
definition: 将一个命名与由作曲者或参考信息源分配、表示有同样题名或者同样题名和同样表演表现媒介的音乐作品序列的音乐作品的数字标识的一种作品关联起来。 @zh-hans
toolkit definition: 由作曲者或参考信息源分配、表示有同样题名或者同样题名和同样表演表现媒介的音乐作品序列的音乐作品的数字标识的一种作品 @zh-hans
has subproperty: P80121
label: müzik eserinin seri numarası @tr
toolkit label: müzik eserinin seri numarası @tr
definition: Bir ismi, bir besteci veya aynı başlığı paylaşan veya aynı başlığı ve aynı temsili icra aracını paylaşan bir dizi müzik eserini belirten bir referans kaynağı tarafından atanan bir müzik eserinin sayısal gösterimine sahip bir eserle ilişkilendirir. @tr
toolkit definition: Bir besteci veya bir referans kaynağı tarafından aynı adı paylaşan veya aynı adı ve aynı temsili icra ortamını paylaşan bir dizi müzik eserini belirten sayısal bir tanımlamaya sahip müzik eseri. @tr

has status of identification
status: Published
lexical alias: statusOfIdentification.en
definition: Relates a nomen to an indication of a level of authentication of the nomen.
toolkit label: status of identification
toolkit definition: An indication of a level of authentication of the nomen.
type: Property
domain: C10012
has element type: 4
label: tunnistamistaso @fi
definition: Liittää nomenin ilmaukseen entiteetin nomenin oikeaksi todistamisen tasosta. @fi
toolkit label: tunnistamistaso @fi
toolkit definition: Ilmaus entiteetin nomenin oikeaksi todistamisen tasosta. @fi
label: har status for identifikasjon @no
definition: Relaterer et nomen til en angivelse av identifiseringsnivå for nomenet for en entitet. @no
toolkit label: status for identifikasjon @no
toolkit definition: En angivelse av identifiseringsnivå for nomenet for en entitet. @no
label: a pour statut d’identification @fr
definition: Met un nomen en relation avec une indication d’un niveau d’authentification du nomen. @fr
toolkit label: statut d’identification @fr
toolkit definition: Indication d’un niveau d’authentification du nomen. @fr
label: heeft status van identificatie @nl
definition: Relateert een nomen aan een indicatie van het niveau van authenticatie van de nomen van een entiteit. @nl
toolkit label: status van identificatie @nl
toolkit definition: Een indicatie van het niveau van authenticatie van de nomen van een entiteit. @nl
label: لها حالة تعريف @ar
definition: يربط تسمية بمؤشر لمستوى مصداقية تسمية كيان. @ar
toolkit label: حالة تعريف @ar
toolkit definition: مؤشر لمستوى مصداقية تسمية كيان. @ar
label: té com a estat d’identificació @ca
definition: Relaciona un nomen amb una indicació d’un nivell d’autenticació del nomen. @ca
toolkit label: estat d’identificació @ca
toolkit definition: Indicació d’un nivell d’autenticació del nomen. @ca
label: har status for identifikation @da
definition: Relaterer et nomen til en angivelse af identificeringsniveau for et nomen for en entitet. @da
toolkit label: status for identifikation @da
toolkit definition: Angivelse af identificeringsniveau for et nomen for en entitet. @da
label: identifitseerimistase @et
definition: Seostab nomen'i tähisega, mis näitab olemi nomen'i õigeks tunnistamise astet. @et
toolkit label: identifitseerimistase @et
toolkit definition: Tähis, mis näitab olemi nomen'i õigeks tunnistamise astet. @et
label: hat Status der Identifikation @de
definition: Setzt ein Nomen in Beziehung zu einer Angabe über einen Grad der Authentifizierung des Nomens einer Entität. @de
toolkit label: Status der Identifikation @de
toolkit definition: Eine Angabe über einen Grad der Authentifizierung des Nomens einer Entität. @de
label: azonosítás státusza a következő: @hu
definition: Hozzákapcsol egy noment egy entitás nomenjének hitelesítési szintjére vonatkozó jelzéshez. @hu
toolkit label: azonosítás státusza: @hu
toolkit definition: Egy entitás nomenjének hitelesítési szintjére vonatkozó jelzéshez. @hu
label: ha come status d'identificazione @it
definition: Correla un nomen con una indicazione del livello di autenticazione del nomen di un'entità. @it
toolkit label: status d'identificazione @it
toolkit definition: Una indicazione del livello di autenticazione del nomen di un'entità. @it
label: identificēšanas statuss @lv
definition: Sasaista nomenu ar entīti identificējošo datu uzticamības līmeni. @lv
toolkit label: identificēšanas statuss @lv
toolkit definition: Entīti identificējošo datu uzticamības līmenis. @lv
label: 有标识状态 @zh-hans
definition: 将一个命名与命名认证级别的指示关联起来。 @zh-hans
toolkit label: 标识状态 @zh-hans
toolkit definition: 命名认证级别的指示 @zh-hans
has subproperty: P80168
label: tanımlama durumu ile ilişkilidir @tr
definition: Bir ismi, ismin kimlik doğrulama düzeyinin göstergesiyle ilişkilendirir. @tr
toolkit label: tanımlama durumu @tr
toolkit definition: Bir ismin doğrulama düzeyinin bir göstergesi. @tr

is subject nomen of
status: Published
type: Property
lexical alias: subjectNomenOf.en
definition: Relates a nomen to a work that is about a nomen.
domain: C10012
toolkit label: subject nomen of
toolkit definition: A work that is about a nomen.
sub property of: has related work of nomen
has element type: 2
alternative label: subject of (nomen)
sub property of: P00014
label: nomen aiheena teoksessa @fi
definition: Liittää nomenin teokseen, jonka aiheena on nomen. @fi
toolkit label: nomen aiheena teoksessa @fi
toolkit definition: Teos, jonka aiheena on nomen. @fi
label: er emne nomen for @no
definition: Relaterer et nomen til et verk som handler om et nomen. @no
alternative label: emne for (nomen) @no
toolkit label: emne nomen for @no
toolkit definition: Et verk som handler om et nomen. @no
label: est un nomen sujet de @fr
definition: Met un nomen en relation avec une œuvre qui traite d’un nomen. @fr
alternative label: sujet de (nomen) @fr
toolkit label: nomen sujet de @fr
toolkit definition: Œuvre qui traite d’un nomen. @fr
label: is onderwerp-nomen van @nl
definition: Relateert een nomen aan een werk dat over een nomen gaat. @nl
toolkit label: onderwerp-nomen van @nl
toolkit definition: Een werk dat over een nomen gaat. @nl
label: هو موضوع تسمية لـ @ar
definition: يربط تسمية بعمل عن تسمية. @ar
alternative label: موضوع عن (تسمية) @ar
toolkit label: موضوع تسمية لـ @ar
toolkit definition: عمل عن تسمية. @ar
label: és nomen de matèria de @ca
definition: Relaciona un nomen amb una obra que tracta sobre un nomen. @ca
alternative label: matèria de (nomen) @ca
toolkit label: nomen de matèria de @ca
toolkit definition: Obra que tracta sobre un nomen. @ca
label: er nomen, som er subjekt af @da
definition: Relaterer et nomen til et værk, som handler om et nomen. @da
alternative label: subjekt af (nomen) @da
toolkit label: nomen, som er subjekt af @da
toolkit definition: Værk, som handler om et nomen. @da
label: teema (nomen) teoses @et
definition: Seostab nomen'i teosega, mis on nomen'i kohta. @et
toolkit label: teema (nomen) teoses @et
toolkit definition: Teos, mis on nomen'i kohta. @et
label: ist Nomen als Thema von @de
definition: Setzt ein Nomen in Beziehung zu einem Werk, das von einem Nomen handelt. @de
toolkit label: Nomen als Thema von @de
toolkit definition: Ein Werk, das von einem Nomen handelt. @de
label: tárgya a következő nomennek: @hu
definition: Egy noment hozzákapcsol egy műhöz, ami egy nomenről szól. @hu
toolkit label: a következő nomen tárgya: @hu
toolkit definition: Egy mű, amely egy nomenről szól. @hu
label: ha come nomen soggetto di @it
definition: Correla un nomen a un'opera che è su un nomen. @it
alternative label: soggetto di (nomen) @it
toolkit label: nomen soggetto di @it
toolkit definition: Un'opera che è su un nomen. @it
label: ir temats (nomens) @lv
definition: Sasaista nomenu ar darbu, kura temats ir nomens. @lv
toolkit label: ir temats (nomens) @lv
toolkit definition: Darbs, kura temats ir nomens. @lv
alternative label: Thema von (Nomen) @de
alternative label: ……的主题（命名） @zh-hans
label: 有……的主题命名 @zh-hans
definition: 将一个命名与关于一个命名的一种作品关联起来。 @zh-hans
toolkit label: ……的主题命名 @zh-hans
toolkit definition: 关于一个命名的一种作品 @zh-hans
alternative label: tárgya a következőnek (nomen): @hu
has subproperty: is nomen described by
has subproperty: P80014
alternative label: (adın) konusu @tr
label: bir konu adı @tr
definition: Bir ismi, bir isim hakkında olan bir eserle ilişkilendirir. @tr
toolkit label: konu alınan isim @tr
toolkit definition: Bir isim hakkındaki bir eser. @tr

is surname of
status: Published
lexical alias: surnameOf.en
definition: Relates a nomen to a person who uses a family name.
toolkit label: surname of
toolkit definition: A person who uses a family name.
type: Property
domain: C10012
sub property of: is name of person of
has element type: 2
label: sukunimi henkilölle @fi
definition: Liittää nomenin henkilöön, joka käyttää suvun nimeä. @fi
toolkit label: sukunimi henkilölle @fi
toolkit definition: Henkilö, joka käyttää suvun nimeä. @fi
label: er etternavn for @no
definition: Relaterer et nomen til en person som bruker et familienavn. @no
toolkit label: etternavn for @no
toolkit definition: En person som bruker et familienavn. @no
label: est un nom de famille de @fr
definition: Met un nomen en relation avec une personne qui utilise un nom de famille. @fr
toolkit label: nom de famille de @fr
toolkit definition: Personne qui utilise un nom de famille. @fr
label: is achternaam van @nl
definition: Relateert een nomen aan een persoon die een familienaam gebruikt. @nl
toolkit label: achternaam van @nl
toolkit definition: Een persoon die een familienaam gebruikt. @nl
label: هو اسم عائلة لـ @ar
definition: يربط تسمية بشخص يستخدم اسم عائلة. @ar
toolkit label: اسم عائلة لـ @ar
toolkit definition: شخص يستخدم اسم عائلة. @ar
label: és cognom de @ca
definition: Relaciona un nomen amb una persona que usa un nom de família. @ca
toolkit label: cognom de @ca
toolkit definition: Persona que usa un nom de família. @ca
label: er efternavn for @da
definition: Relaterer et nomen til en person, som anvender et familienavn. @da
toolkit label: efternavn for @da
toolkit definition: Person, som anvender et familienavn. @da
label: perekonnanimi isikule @et
definition: Seostab nomen'i isikuga, kes kasutab perekonnanime. @et
toolkit label: perekonnanimi isikule @et
toolkit definition: Isik, kes kasutab perekonnanime. @et
label: ist Nachname von @de
definition: Setzt ein Nomen in Beziehung zu einer Person, die einen Familiennamen verwendet. @de
toolkit label: Nachname von @de
toolkit definition: Eine Person, die einen Familiennamen verwendet. @de
label: vezetékneve a következőnek: @hu
definition: Hozzákapcsol egy noment egy személyhez, aki családnevet használ. @hu
toolkit label: vezetékneve: @hu
toolkit definition: Egy személy, aki családnevet használ. @hu
label: è cognome di @it
definition: Correla un nomen a una persona che usa un nome di famiglia. @it
toolkit label: cognome di @it
toolkit definition: Una persona che usa un nome di famiglia. @it
label: ir uzvārds @lv
definition: Sasaista nomenu ar personu, kura lieto uzvārdu. @lv
toolkit label: ir uzvārds @lv
toolkit definition: Persona, kura lieto uzvārdu. @lv
label: 是……的姓 @zh-hans
definition: 将一个命名与使用家族名的一个个人关联起来。 @zh-hans
toolkit label: ……的姓 @zh-hans
toolkit definition: 使用家族名的一个个人 @zh-hans
has subproperty: P80176
label: soyadıdır @tr
definition: Bir ismi kullanan bir kişiyle bir niteleyici aile isimle ilişkilendirir. @tr
toolkit label: Soyadı @tr
toolkit definition: Bir aile ismini kullanan bir kişi @tr

is thematic index number of
status: Published
type: Property
lexical alias: thematicIndexNumberOf.en
domain: C10012
toolkit label: thematic index number of
sub property of: is numeric designation of musical work of
has element type: 2
definition: Relates a nomen to a work that has a numeric designation of musical work that is assigned from a list of works of a composer, usually arranged in chronological order or by categories, with the theme given for each composition or for each section of large compositions.
toolkit definition: A work that has a numeric designation of musical work that is assigned from a list of works of a composer, usually arranged in chronological order or by categories, with the theme given for each composition or for each section of large compositions.
label: temaattisen teosluettelon numero teokselle @fi
definition: Liittää nomenin teokseen, jolla on musiikkiteoksen numeerinen määrite, joka on otettu säveltäjän teosluettelosta. Teosluettelo on tavallisesti järjestetty aikajärjestykseen tai kategorioittain sisältäen teeman jokaisesta sävellyksestä tai laajan sävellyksen jokaisesta osasta. @fi
toolkit label: temaattisen teosluettelon numero teokselle @fi
toolkit definition: Teos, jolla on musiikkiteoksen numeerinen määrite, joka on otettu säveltäjän teosluettelosta. Teosluettelo on tavallisesti järjestetty aikajärjestykseen tai kategorioittain sisältäen teeman jokaisesta sävellyksestä tai laajan sävellyksen jokaisesta osasta. @fi
label: er tematisk indeksnummer for @no
definition: Relaterer et nomen til et musikalsk verk som har en identifikator for verk som er en numerisk betegnelse som er angitt fra en liste over verk av en komponist, vanligvis arrangert i kronologisk rekkefølge eller i kategorier, med gitte tema for hver komposisjon eller for hver del av store komposisjoner. @no
toolkit label: tematisk indeksnummer for @no
toolkit definition: Et musikalsk verk som har en identifikator for verk som er en numerisk betegnelse som er angitt fra en liste over verk av en komponist, vanligvis arrangert i kronologisk rekkefølge eller i kategorier, med gitte tema for hver komposisjon eller for hver del av store komposisjoner. @no
label: est un numéro de catalogue thématique de @fr
definition: Met un nomen en relation avec une œuvre qui possède une désignation numérique d’une œuvre musicale attribuée à partir d’une liste des œuvres d’un compositeur dans laquelle celles-ci sont ordinairement classées par ordre chronologique ou par catégories, avec le thème de chaque composition ou de chaque section d’une composition dans le cas des compositions d’envergure. @fr
toolkit label: numéro de catalogue thématique de @fr
toolkit definition: Œuvre qui possède une désignation numérique d’une œuvre musicale attribuée à partir d’une liste des œuvres d’un compositeur dans laquelle celles-ci sont ordinairement classées par ordre chronologique ou par catégories, avec le thème de chaque composition ou de chaque section d’une composition dans le cas des compositions d’envergure. @fr
label: is thematisch indexnummer van @nl
definition: Relateert een nomen aan een werk dat een numerieke aanduiding voor muziekwerk heeft die is toegekend uit een lijst van werken van een componist, meestal chronologisch gerangschikt of in categorieën, met het thema gegeven voor elke compositie of voor elke sectie van een grote compositie. @nl
toolkit label: thematisch indexnummer van @nl
toolkit definition: Een werk dat een numerieke aanduiding voor muziekwerk heeft die is toegekend uit een lijst van werken van een componist, meestal chronologisch gerangschikt of in categorieën, met het thema gegeven voor elke compositie of voor elke sectie van een grote compositie. @nl
label: هو رقم كشاف موضوعي لـ @ar
definition: يربط تسمية بعمل موسيقى له رمز رقمي، خُصص له من قائمة أعمال ملحن، تُرتب عادة ترتيبًا زمنيًا أو حسب الفئة مع موضوع كل لحن أو موضوع كل قطعة من القطع الموسيقية الكبيرة. @ar
toolkit label: رقم كشاف موضوعي لـ @ar
toolkit definition: عمل له رمز رقمي خُصص له من قائمة أعمال مؤلف موسيقى، تُرتب عادة ترتيبًا زمنيًا أو حسب الفئة، مع موضوع كل لحن أو موضوع كل قطعة من القطع الموسيقية الكبيرة. @ar
label: és número d’índex temàtic de @ca
definition: Relaciona un nomen amb una obra que té una designació numèrica d’obra que s’assigna a partir d’una llista d’obres d’un compositor, ordenades normalment per ordre cronològic o per categories, amb el tema de cada composició o, en el cas de composicions àmplies, de cada secció. @ca
toolkit label: número d’índex temàtic de @ca
toolkit definition: Obra que té una designació numèrica d’obra que s’assigna a partir d’una llista d’obres d’un compositor, ordenades normalment per ordre cronològic o per categories, amb el tema de cada composició o, en el cas de composicions àmplies, de cada secció. @ca
definition: Relaterer et nomen til et musikværk, som har en identifikator for værk, som er en numerisk betegnelse, tildelt fra en liste over værker af en komponist, sædvanligvis arrangeret i kronologisk rækkefølge eller efter kategorier, med givet tema for hver komposition eller for hver del af store kompositioner. @da
toolkit definition: Musikværk, som har en identifikator for værk, som er en numerisk betegnelse, tildelt fra en liste over værker af en komponist, sædvanligvis arrangeret i kronologisk rækkefølge eller efter kategorier, med givet tema for hver komposition eller for hver del af store kompositioner. @da
label: temaatilise kataloogi number teoses @et
definition: Seostab nomen'i muusikateosega, millel on teose identifikaatoriks muusikateose numbriline tähistus, mis on võetud helilooja teoste nimestikust. Nimestik on tavaliselt korrastatud kronoloogiliselt või žanrite kaupa ja sisaldab iga heliteose või suuremate teoste puhul iga osa teemat. @et
toolkit label: temaatilise kataloogi number teoses @et
toolkit definition: Muusikateos, millel on teose identifikaatoriks muusikateose numbriline tähistus, mis on võetud helilooja teoste nimestikust. Nimestik on tavaliselt korrastatud kronoloogiliselt või žanrite kaupa ja sisaldab iga heliteose või suuremate teoste puhul iga osa teemat. @et
label: ist Werkverzeichnisnummer von @de
definition: Setzt ein Nomen in Beziehung zu einem Werk, das über eine numerische Bezeichnung eines Musikwerks aus einem Werkverzeichnis einer Komponistin/eines Komponisten verfügt, das in einer chronologischen Reihenfolge oder nach Kategorien angeordnet ist. Zusätzlich können darin Notenzitate in Form von Incipits oder thematischem Material für jede Komposition oder für jede Passage längerer Kompositionen aufgeführt sein. @de
toolkit label: Werkverzeichnisnummer von @de
toolkit definition: Ein Werk, das über eine numerische Bezeichnung eines Musikwerks aus einem Werkverzeichnis einer Komponistin/eines Komponisten verfügt, das in einer chronologischen Reihenfolge oder nach Kategorien angeordnet ist. Zusätzlich können darin Notenzitate in Form von Incipits oder thematischem Material für jede Komposition oder für jede Passage längerer Kompositionen aufgeführt sein. @de
label: tematikus indexszáma a következőnek: @hu
definition: Hozzákapcsol egy noment egy műhöz, amely rendelkezik egy zeneszerző műveinek a komponálás kronológiai sorrendje vagy kategóriák szerint rendezett jegyzékéből hozzárendelt zenemű-számjelzéssel, amely minden zeneművet vagy a nagyobb zeneművek egyes szakaszait témával látja el. @hu
toolkit label: tematikus indexszáma: @hu
toolkit definition: Egy mű, amely rendelkezik egy zeneszerző műveinek a komponálás kronológiai sorrendje vagy kategóriák szerint rendezett jegyzékéből hozzárendelt zenemű-számjelzéssel, amely minden zeneművet vagy a nagyobb zeneművek egyes szakaszait témával látja el. @hu
label: è numero di catalogo tematico di @it
definition: Correla un nomen a un'opera musiclae che ha un identificatore per l'opera che è una designazione numerica assegnata da una lista di opere di un compostiore, di solito organizzata in ordine cronologico o per categorie, con il tema dato per ciascuna composizione o per ciascuna sezione di composizioni ampie. @it
toolkit label: numero di catalogo tematico di @it
toolkit definition: Un'opera musiclae che ha un identificatore per l'opera che è una designazione numerica assegnata da una lista di opere di un compostiore, di solito organizzata in ordine cronologico o per categorie, con il tema dato per ciascuna composizione o per ciascuna sezione di composizioni ampie. @it
label: ir skaņdarbu rādītāja numurs @lv
toolkit label: ir skaņdarbu rādītāja numurs @lv
definition: Sasaista nomenu ar darbu, kas ir mūzikas darbs, kam ir darba numerācijas apzīmējums, kuru piešķirsaskaņā ar komponista darbu sarakstu, kas parasti ir sakārtots kategorijās vai hronoloģiskā secībā, katrai kompozīcijai vai lielas kompozīcijas katrai daļai piešķirot tematisko apzīmējumu. @lv
toolkit definition: Mūzikas darbs, kam ir darba numerācijas apzīmējums, kuru piešķirsaskaņā ar komponista darbu sarakstu, kas parasti ir sakārtots kategorijās vai hronoloģiskā secībā, katrai kompozīcijai vai lielas kompozīcijas katrai daļai piešķirot tematisko apzīmējumu. @lv
label: 是……的主题索引号 @zh-hans
toolkit label: ……的主题索引号 @zh-hans
definition: 将一个命名与有根据作曲者作品列表分配、通常按年代顺序或类别顺序排列、并有每个谱曲或更大谱曲每个部分的主题的音乐作品的数字标识的一种作品关联起来。 @zh-hans
toolkit definition: 有根据作曲者作品列表分配、通常按年代顺序或类别顺序排列、并有每个谱曲或更大谱曲每个部分的主题的音乐作品的数字标识的一种作品 @zh-hans
has subproperty: P80122
label: konu ile ilgili dizin numarası @tr
toolkit label: tematik dizin numarası @tr
definition: Bir ismi, bir bestecinin eserleri listesinden atanan, genellikle kronolojik sırayla veya kategorilere göre düzenlenmiş, her beste veya büyük bestelerin her bölümü için verilen tema ile sayısal bir müzik eseri tanımına sahip bir eserle ilişkilendirir. @tr
toolkit definition: Bir bestecinin genellikle kronolojik sıraya veya kategorilere göre düzenlenmiş eserlerinin listesinden atanan, her beste veya büyük bestelerin her bölümü için tema verilen müzik eserinin sayısal tanımına sahip olan bir eser. @tr

is title of expression of
status: Published
type: Property
lexical alias: titleOfExpressionOf.en
definition: Relates a nomen to an expression that has an appellation of expression in natural language and phrasing used in common discourse.
domain: C10012
toolkit label: title of expression of
toolkit definition: An expression that has an appellation of expression in natural language and phrasing used in common discourse.
sub property of: is appellation of expression of
has element type: 2
sub property of: is name of RDA entity of
label: nimeke ekspressiolle @fi
definition: Liittää nomenin ekspressioon, jolla on luonnollisen kielen ja yleisen diskurssin sanamuodon mukainen nimitys. @fi
toolkit label: nimeke ekspressiolle @fi
toolkit definition: Ekspressio, jolla on luonnollisen kielen ja yleisen diskurssin sanamuodon mukainen nimitys. @fi
label: er tittel for uttrykk for @no
definition: Relaterer et nomen til et uttrykk som har en betegnelse for uttrykk på et naturlig språk og med frasering brukt i alminnelig diskurs. @no
toolkit label: tittel for uttrykk for @no
toolkit definition: Et uttrykk som har en betegnelse for uttrykk på et naturlig språk og med frasering brukt i alminnelig diskurs. @no
label: est un titre d’expression de @fr
definition: Met un nomen en relation avec une expression qui possède une appellation d’expression exprimée dans un langage et une formulation naturels et utilisée dans le langage courant. @fr
toolkit label: titre d’expression de @fr
toolkit definition: Expression qui possède une appellation d’expression exprimée dans un langage et une formulation naturels et utilisée dans le langage courant. @fr
label: is titel van expressie van @nl
definition: Relateert een nomen aan een expressie die een benaming van expressie heeft in natuurlijke taal en terminologie in gebruikelijke bewoording. @nl
toolkit label: titel van expressie van @nl
toolkit definition: Een expressie die een benaming van expressie heeft in natuurlijke taal en terminologie in gebruikelijke bewoording. @nl
label: هو عنوان تعبيرة لـ @ar
definition: يربط تسمية بتعبيرة لها اسم تعبيرة في لغة طبيعية مستخدمة في الخطاب العام. @ar
toolkit label: عنوان تعبيرة لـ @ar
toolkit definition: تعبيرة لها اسم تعبيرة في لغة طبيعية مستخدمة في الخطاب العام. @ar
label: és títol d’expressió de @ca
definition: Relaciona un nomen amb una expressió que té una apel·lació d’expressió en llenguatge i frases naturals usada en el discurs comú. @ca
toolkit label: títol d’expressió de @ca
toolkit definition: Expressió que té una apel·lació d’expressió en llenguatge i frases naturals usada en el discurs comú. @ca
label: er titel på udtryk af @da
definition: Relaterer et nomen til et udtryk, som har en benævnelse på udtryk på normalsprog og med formuleringer, som bruges alment. @da
toolkit label: titel på udtryk af @da
toolkit definition: Udtryk, som har en benævnelse på udtryk på normalsprog og med formuleringer, som bruges alment. @da
label: pealkiri väljenduses @et
definition: Seostab nomen'i väljendusega, millel on nimetus loomulikus keeles ja sõnastuses, mida kasutatakse ühises diskursuses. @et
toolkit label: pealkiri väljenduses @et
toolkit definition: Väljendus, millel on nimetus loomulikus keeles ja sõnastuses, mida kasutatakse ühises diskursuses. @et
label: ist Titel einer Expression von @de
definition: Setzt ein Nomen in Beziehung zu einer Expression, die über eine Bezeichnung für eine Expression in natürlicher Sprache und Ausdrucksweise verfügt, die beim normalen Sprechen und Schreiben verwendet wird. @de
toolkit label: Titel einer Expression von @de
toolkit definition: Eine Expression, die über eine Bezeichnung für eine Expression in natürlicher Sprache und Ausdrucksweise verfügt, die beim normalen Sprechen und Schreiben verwendet wird. @de
label: kifejezésiforma-címe a következőnek: @hu
definition: Hozzákapcsol egy noment egy kifejezési formához, amelynek van egy kifejezésiforma-megnevezése természetes nyelven és közbeszédben használt kifejezéssel. @hu
toolkit label: kifejezésiforma-címe: @hu
toolkit definition: Egy kifejezési forma, amelynek van egy kifejezésiforma-megnevezése természetes nyelven és közbeszédben használt kifejezéssel. @hu
label: è titolo dell'espressione di @it
definition: Correla un nomen a un'espressione che ha una designazione di espressione in linguaggio e frasi naturali usati nel discorso comune. @it
toolkit label: titolo dell'espressione di @it
toolkit definition: Un'espressione che ha una designazione di espressione in linguaggio e frasi naturali usati nel discorso comune. @it
label: ir nosaukums izteiksmei @lv
definition: Sasaista nomenu ar izteiksmi, kam ir izteiksmes apzīmējums dabiskā valodā un frāzēs, kas tiek lietots savstarpējā saziņā. @lv
toolkit label: ir nosaukums izteiksmei @lv
toolkit definition: Izteiksme, kam ir izteiksmes apzīmējums dabiskā valodā un frāzēs, kas tiek lietots savstarpējā saziņā. @lv
label: 是……的内容表达的题名 @zh-hans
definition: 将一个命名与有用自然语言和普通话语措词表达的内容表达的称谓的一种内容表达关联起来。 @zh-hans
toolkit label: ……的内容表达的题名 @zh-hans
toolkit definition: 有用自然语言和普通话语措词表达的内容表达的称谓的一种内容表达 @zh-hans
has subproperty: is preferred title of expression of
has subproperty: is variant title of expression of
has subproperty: P80039
label: ifadesinin başlığıdır @tr
definition: Bir ismi, doğal dilde ve ortak söylemde kullanılan bir anlatım biçimine sahip bir anlatımla ilişkilendirir. @tr
toolkit label: anlatımın başlığı @tr
toolkit definition: Yaygın söylemde kullanılan doğal dilde ve ifadede bir anlatım unvanına sahip bir anlatım. @tr

is title of item of
status: Published
type: Property
lexical alias: titleOfItemOf.en
definition: Relates a nomen to an item that has an appellation of item in natural language and phrasing used in common discourse.
domain: C10012
toolkit label: title of item of
toolkit definition: An item that has an appellation of item in natural language and phrasing used in common discourse.
sub property of: is appellation of item of
has element type: 2
sub property of: is name of RDA entity of
label: nimeke kappaleelle @fi
definition: Liittää nomenin kappaleeseen, jolla on luonnollisen kielen ja yleisen diskurssin sanamuodon mukainen nimitys. @fi
toolkit label: nimeke kappaleelle @fi
toolkit definition: Kappale, jolla on luonnollisen kielen ja yleisen diskurssin sanamuodon mukainen nimitys. @fi
label: er tittel for eksemplar for @no
definition: Relaterer et nomen til et eksemplar som har en betegnelse for eksemplar på et naturlig språk og med frasering brukt i alminnelig diskurs. @no
toolkit label: tittel for eksemplar for @no
toolkit definition: Et eksemplar som har en betegnelse for eksemplar på et naturlig språk og med frasering brukt i alminnelig diskurs. @no
label: est un titre d’item de @fr
definition: Met un nomen en relation avec un item qui possède une appellation d’item exprimée dans un langage et une formulation naturels et utilisée dans le langage courant. @fr
toolkit label: titre d’item de @fr
toolkit definition: Item qui possède une appellation d’item exprimée dans un langage et une formulation naturels et utilisée dans le langage courant. @fr
label: is titel van item van @nl
definition: Relateert een nomen aan een item dat een benaming van item heeft in natuurlijke taal en terminologie in gebruikelijke bewoording. @nl
toolkit label: titel van item van @nl
toolkit definition: Een item dat een benaming van item heeft in natuurlijke taal en terminologie in gebruikelijke bewoording. @nl
label: هو عنوان مفردة لـ @ar
definition: يربط تسمية بمفردة لها اسم في لغة طبيعية مستخدمة في الخطاب العام. @ar
toolkit label: عنوان مفردة لـ @ar
toolkit definition: مفردة لها اسم في لغة طبيعية مستخدمة في الخطاب العام. @ar
label: és títol d’ítem de @ca
definition: Relaciona un nomen amb un ítem que té una apel·lació d’ítem en llenguatge i frases naturals usada en el discurs comú. @ca
toolkit label: títol d’ítem de @ca
toolkit definition: Ítem que té una apel·lació d’ítem en llenguatge i frases naturals usada en el discurs comú. @ca
label: er titel på eksemplar af @da
definition: Relaterer et nomen til et eksemplar, som har en benævnelse på eksemplar på normalsprog og med formuleringer, som bruges alment. @da
toolkit label: titel på eksemplar af @da
toolkit definition: Eksemplar, som har en benævnelse på eksemplar på normalsprog og med formuleringer, som bruges alment. @da
label: pealkiri eksemplaris @et
definition: Seostab nomen'i eksemplariga, millel on nimetus loomulikus keeles ja sõnastuses, mida kasutatakse ühises diskursuses. @et
toolkit label: pealkiri eksemplaris @et
toolkit definition: Eksemplar, millel on nimetus loomulikus keeles ja sõnastuses, mida kasutatakse ühises diskursuses. @et
label: ist Titel eines Exemplars von @de
definition: Setzt ein Nomen in Beziehung zu einem Exemplar, das über eine Bezeichnung für ein Exemplar in natürlicher Sprache und Ausdrucksweise verfügt, die beim normalen Sprechen und Schreiben verwendet wird. @de
toolkit label: Titel eines Exemplars von @de
toolkit definition: Ein Exemplar, das über eine Bezeichnung für ein Exemplar in natürlicher Sprache und Ausdrucksweise verfügt, die beim normalen Sprechen und Schreiben verwendet wird. @de
label: címe a következő példánynak: @hu
definition: Hozzákapcsol egy noment egy példányhoz, amelynek van egy természetes nyelvű megnevezése és közbeszédben használt megfogalmazása. @hu
toolkit label: címe a következő példánynak @hu
toolkit definition: Egy példány, amelynek van egy természetes nyelvű megnevezése és közbeszédben használt megfogalmazása. @hu
label: è titolo dell'item di @it
definition: Correla un nomen a un item che ha una designazione di item in linguaggio e frasi naturali usati nel discorso comune. @it
toolkit label: titolo dell'item di @it
toolkit definition: Un item che ha una designazione di item in linguaggio e frasi naturali usati nel discorso comune. @it
label: ir nosaukums vienībai @lv
definition: Sasaista nomenu ar vienību, kurai ir izteiksmes apzīmējums dabiskā valodā un frāzēs, kas tiek lietots savstarpējā saziņā. @lv
toolkit label: nosaukums vienībai @lv
toolkit definition: Vienība, kurai ir izteiksmes apzīmējums dabiskā valodā un frāzēs, kas tiek lietots savstarpējā saziņā. @lv
label: 是……的单件的题名 @zh-hans
definition: 将一个命名与有用自然语言和普通话语措词表达的单件的称谓的一个单件关联起来。 @zh-hans
toolkit label: ……的单件的题名 @zh-hans
toolkit definition: 有用自然语言和普通话语措词表达的单件的称谓的一个单件 @zh-hans
has subproperty: is preferred title of item of
has subproperty: is variant title of item of
has subproperty: P80017
label: kopyanın başlığıdır @tr
definition: Bir ismi, doğal dilde ve ortak söylemde kullanılan ifadelerde bir kopya yakıştırması olan bir kopyayla ilişkilendirir. @tr
toolkit label: kopyanın başlığı @tr
toolkit definition: Doğal dilde ve yaygın söylemde kullanılan bir kopya unvanına sahip bir kopya. @tr

is title of manifestation of
status: Published
type: Property
lexical alias: titleOfManifestationOf.en
definition: Relates a nomen to a manifestation that has an appellation of manifestation in natural language and phrasing used in common discourse.
domain: C10012
toolkit label: title of manifestation of
toolkit definition: A manifestation that has an appellation of manifestation in natural language and phrasing used in common discourse.
sub property of: is appellation of manifestation of
has element type: 2
sub property of: is name of RDA entity of
label: nimeke manifestaatiolle @fi
definition: Liittää nomenin manifestaatioon, jolla on luonnollisen kielen ja yleisen diskurssin sanamuodon mukainen nimitys. @fi
toolkit label: nimeke manifestaatiolle @fi
toolkit definition: Manifestaatio, jolla on luonnollisen kielen ja yleisen diskurssin sanamuodon mukainen nimitys. @fi
label: er tittel for manifestasjon for @no
definition: Relaterer et nomen til en manifestasjon som har en betegnelse for manifestasjon på et naturlig språk og med frasering brukt i alminnelig diskurs. @no
toolkit label: tittel for manifestasjon for @no
toolkit definition: En manifestasjon som har en betegnelse for manifestasjon på et naturlig språk og med frasering brukt i alminnelig diskurs. @no
label: est un titre de manifestation de @fr
definition: Met un nomen en relation avec une manifestation qui possède une appellation de manifestation exprimée dans un langage et une formulation naturels et utilisée dans le langage courant. @fr
toolkit label: titre de manifestation de @fr
toolkit definition: Manifestation qui possède une appellation de manifestation exprimée dans un langage et une formulation naturels et utilisée dans le langage courant. @fr
label: is titel van manifestatie van @nl
definition: Relateert een nomen aan een manifestatie die een benaming van manifestatie heeft in natuurlijke taal en terminologie in gebruikelijke bewoording. @nl
toolkit label: titel van manifestatie van @nl
toolkit definition: Een manifestatie die een benaming van manifestatie heeft in natuurlijke taal en terminologie in gebruikelijke bewoording. @nl
label: هو عنوان تجسيدة لـ @ar
definition: يربط تسمية بتجسيدة لها اسم تجسيدة في لغة طبيعية مستخدمة في الخطاب العام. @ar
toolkit label: عنوان تجسيدة لـ @ar
toolkit definition: تجسيدة لها اسم تجسيدة في لغة طبيعية مستخدمة في الخطاب العام. @ar
label: és títol de manifestació de @ca
definition: Relaciona un nomen amb una manifestació que té una apel·lació de manifestació en llenguatge i frases naturals usada en el discurs comú. @ca
toolkit label: títol de manifestació de @ca
toolkit definition: Manifestació que té una apel·lació de manifestació en llenguatge i frases naturals usada en el discurs comú. @ca
label: er titel på manifestation af @da
definition: Relaterer et nomen til en manifestation, som har en benævnelse på manifestation på normalsprog og med formuleringer, som bruges alment. @da
toolkit label: titel på manifestation af @da
toolkit definition: Manifestation, som har en benævnelse på manifestation på normalsprog og med formuleringer, som bruges alment. @da
label: pealkiri kehastuses @et
definition: Seostab nomen'i kehastusega, millel on nimetus loomulikus keeles ja sõnastuses, mida kasutatakse ühises diskursuses. @et
toolkit label: pealkiri kehastuses @et
toolkit definition: Kehastus, millel on nimetus loomulikus keeles ja sõnastuses, mida kasutatakse ühises diskursuses. @et
label: ist Titel einer Manifestation von @de
definition: Setzt ein Nomen in Beziehung zu einer Manifestation, die über eine Bezeichnung für eine Manifestation in natürlicher Sprache und Ausdrucksweise verfügt, die beim normalen Sprechen und Schreiben verwendet wird. @de
toolkit label: Titel einer Manifestation von @de
toolkit definition: Eine Manifestation, die über eine Bezeichnung für eine Manifestation in natürlicher Sprache und Ausdrucksweise verfügt, die beim normalen Sprechen und Schreiben verwendet wird. @de
label: megjelenésiforma-címe a következőnek: @hu
definition: Hozzákapcsol egy noment egy megjelenési formához, amelynek van egy megjelenési formához tartozó megnevezése természetes nyelven és közbeszédben használt kifejezéssel. @hu
toolkit label: megjelenésiforma-címe: @hu
toolkit definition: Egy megjelenési forma, amelynek van egy megjelenési formához tartozó megnevezése természetes nyelven és közbeszédben használt kifejezéssel. @hu
label: è titolo della manifestazione di @it
definition: Correla un nomen a una manifestazione che ha una designazione di manifestazione in linguaggio e frasi naturali usati nel discorso comune. @it
toolkit label: titolo della manifestazione di @it
toolkit definition: Una manifestazione che ha una designazione di manifestazione in linguaggio e frasi naturali usati nel discorso comune. @it
label: ir nosaukums manifestācijai @lv
definition: Sasaista nomenu ar manifestāciju, kam ir izteiksmes apzīmējums dabiskā valodā un frāzēs, kas tiek lietots savstarpējā saziņā. @lv
toolkit label: ir nosaukums manifestācijai @lv
toolkit definition: Manifestācija, kam ir izteiksmes apzīmējums dabiskā valodā un frāzēs, kas tiek lietots savstarpējā saziņā. @lv
label: 是……的载体表现的题名 @zh-hans
definition: 将一个命名与有用自然语言和普通话语措词表达的载体表现的称谓的一种载体表现关联起来。 @zh-hans
toolkit label: ……的载体表现的题名 @zh-hans
toolkit definition: 有用自然语言和普通话语措词表达的载体表现的称谓的一种载体表现 @zh-hans
has subproperty: is title of series of
has subproperty: is title proper of
has subproperty: is variant title of manifestation of
has subproperty: P80062
label: gösterimin başlığı @tr
definition: Bir ismi, doğal dilde gösterimi ve ortak söylemde kullanılan ifadeyi içeren bir gösterimi olan bir gösterimle ilişkilendirir. @tr
toolkit label: gösterimin başlığı @tr
toolkit definition: Doğal dilde ve günlük söylemde kullanılan bir gösterim unvanına sahip bir gösterim. @tr

is title of series of
status: Published
type: Property
lexical alias: titleOfSeriesOf.en
domain: C10012
toolkit label: title of series of
sub property of: is title of manifestation of
has element type: 2
definition: Relates a nomen to a manifestation that has a title that identifies a series to which a manifestation belongs.
toolkit definition: A manifestation that has a title that identifies a series to which a manifestation belongs.
label: sarjan nimeke manifestaatiolle @fi
definition: Liittää nomenin manifestaatioon, jonka nimeke ilmaisee sarjan, johon manifestaatio kuuluu. @fi
toolkit label: sarjan nimeke manifestaatiolle @fi
toolkit definition: Manifestaatio, jonka nimeke ilmaisee sarjan, johon manifestaatio kuuluu. @fi
label: er serietittel for @no
definition: Relaterer et nomen til en manifestasjon som har en tittel som identifiserer en serie som en manifestasjon tilhører. @no
toolkit label: serietittel for @no
toolkit definition: En manifestasjon som har en tittel som identifiserer en serie som en manifestasjon tilhører. @no
label: est un titre de collection de @fr
definition: Met un nomen en relation avec une manifestation qui possède un titre identifiant une collection à laquelle appartient une manifestation. @fr
toolkit label: titre de collection de @fr
toolkit definition: Manifestation qui possède un titre identifiant une collection à laquelle appartient une manifestation. @fr
label: is reekstitel van @nl
definition: Relateert een nomen aan een manifestatie die een titel heeft die een reeks identificeert waartoe een manifestatie behoort. @nl
toolkit label: reekstitel van @nl
toolkit definition: Een manifestatie die een titel heeft die een reeks identificeert waartoe een manifestatie behoort. @nl
label: هو عنوان سلسلة لـ @ar
definition: يربط تسمية بتجسيدة لها عنوان يُميز سلسلة تنتمى إليها تجسيدة. @ar
toolkit label: عنوان سلسلة لـ @ar
toolkit definition: تجسيدة لها عنوان يميز سلسلة تنتمى إليها تجسيدة. @ar
label: és títol de col·lecció de @ca
definition: Relaciona un nomen amb una manifestació que té un títol que identifica una col·lecció a la qual pertany una manifestació. @ca
toolkit label: títol de col·lecció de @ca
toolkit definition: Manifestació que té un títol que identifica una col·lecció a la qual pertany una manifestació. @ca
label: er titel på serie af @da
definition: Relaterer et nomen til en manifestation, som har en titel, som identificerer en serie, hvortil en manifestation tilhører. @da
toolkit label: titel på serie af @da
toolkit definition: Manifestation, som har en titel, som identificerer en serie, hvortil en manifestation tilhører. @da
label: seeriapealkiri kehastuses @et
definition: Seostab nomen'i kehastusega, millel on pealkiri, mis identifitseerib seeria, millesse kehastus kuulub. @et
toolkit label: seeriapealkiri kehastuses @et
toolkit definition: Kehastus, millel on pealkiri, mis identifitseerib seeria, millesse kehastus kuulub. @et
label: ist Titel einer Reihe von @de
definition: Setzt ein Nomen in Beziehung zu einer Manifestation, die über einen Titel verfügt, der die Reihe identifiziert, zu der eine Manifestation gehört. @de
toolkit label: Titel einer Reihe von @de
toolkit definition: Eine Manifestation, die über einen Titel verfügt, der die Reihe identifiziert, zu der eine Manifestation gehört. @de
label: sorozati címe a következőnek: @hu
definition: Hozzákapcsol egy noment egy megjelenési formához, amelynek van egy olyan címe, amely azonosítja azt a sorozatot, amelyhez a megjelenési forma tartozik. @hu
toolkit label: sorozati címe: @hu
toolkit definition: Egy megjelenési forma, amelynek van egy olyan címe, amely azonosítja azt a sorozatot, amelyhez a megjelenési forma tartozik. @hu
label: è titolo di serie di @it
definition: Correla un nomen a una manifestazione che ha un titolo che identifica una serie a cui la manifestazione appartiene. @it
toolkit label: titolo di serie di @it
toolkit definition: Una manifestazione che ha un titolo che identifica una serie a cui la manifestazione appartiene. @it
label: ir sērijas nosaukums @lv
toolkit label: ir sērijas nosaukums @lv
definition: Sasaista nomenu ar manifestāciju, kam ir nosaukums, kas identificē sēriju, kurai pieder manifestācija. @lv
toolkit definition: Manifestācija, kam ir nosaukums, kas identificē sēriju, kurai pieder manifestācija. @lv
label: 是……的丛编的题名 @zh-hans
toolkit label: ……的丛编的题名 @zh-hans
definition: 将一个命名与有识别一种载体表现所属于的一种丛编的题名的一种载体表现关联起来。 @zh-hans
toolkit definition: 有识别一种载体表现所属于的一种丛编的题名的一种载体表现 @zh-hans
has subproperty: is parallel title of series of
has subproperty: is title proper of subseries of (Deprecated)
has subproperty: P80125
label: serisinin başlığı @tr
toolkit label: dizinin başlığı @tr
definition: Bir ismi, bir gösterimin ait olduğu bir diziyi tanımlayan bir başlığa sahip bir gösterimle ilişkilendirir. @tr
toolkit definition: Bir gösterimin ait olduğu bir diziyi tanımlayan bir başlığa sahip bir gösterim. @tr

is title of work of
status: Published
type: Property
lexical alias: titleOfWorkOf.en
definition: Relates a nomen to a work that has an appellation of work in natural language and phrasing used in common discourse.
domain: C10012
toolkit label: title of work of
toolkit definition: A work that has an appellation of work in natural language and phrasing used in common discourse.
sub property of: is appellation of work of
has element type: 2
sub property of: is name of RDA entity of
label: nimeke teokselle @fi
definition: Liittää nomenin teokseen, jolla on luonnollisen kielen ja yleisen diskurssin sanamuodon mukainen nimitys. @fi
toolkit label: nimeke teokselle @fi
toolkit definition: Teos, jolla on luonnollisen kielen ja yleisen diskurssin sanamuodon mukainen nimitys. @fi
label: er tittel for verk for @no
definition: Relaterer et nomen til et verk som har en betegnelse for verk på et naturlig språk og med frasering brukt i alminnelig diskurs. @no
toolkit label: tittel for verk for @no
toolkit definition: Et verk som har en betegnelse for verk på et naturlig språk og med frasering brukt i alminnelig diskurs. @no
label: est un titre d’œuvre de @fr
definition: Met un nomen en relation avec une œuvre qui possède une appellation d'œuvre exprimée dans un langage et une formulation naturels et utilisée dans le langage courant. @fr
toolkit label: titre d’œuvre de @fr
toolkit definition: Œuvre qui possède une appellation d'œuvre exprimée dans un langage et une formulation naturels et utilisée dans le langage courant. @fr
label: is titel van werk van @nl
definition: Relateert een nomen aan een werk dat een benaming van werk heeft in natuurlijke taal en terminologie in gebruikelijke bewoording. @nl
toolkit label: titel van werk van @nl
toolkit definition: Een werk dat een benaming van werk heeft in natuurlijke taal en terminologie in gebruikelijke bewoording. @nl
label: هو عنوان عمل لـ @ar
definition: يربط تسمية بعمل له اسم عمل في لغة طبيعية مستخدمة في الخطاب العام. @ar
toolkit label: عنوان عمل لـ @ar
toolkit definition: عمل له اسم عمل في لغة طبيعية مستخدمة في الخطاب العام. @ar
label: és títol d’obra de @ca
definition: Relaciona un nomen amb una obra que té una apel·lació d’obra en llenguatge i frases naturals usada en el discurs comú. @ca
toolkit label: títol d’obra de @ca
toolkit definition: Obra que té una apel·lació d’obra en llenguatge i frases naturals usada en el discurs comú. @ca
label: er titel på værk af @da
definition: Relaterer et nomen til et værk, som har en benævnelse på værk på normalsprog og med formuleringer, som bruges alment. @da
toolkit label: titel på værk af @da
toolkit definition: Værk, som har en benævnelse på værk på normalsprog og med formuleringer, som bruges alment. @da
label: pealkiri teoses @et
definition: Seostab nomen'i teosega, millel on nimetus loomulikus keeles ja sõnastuses, mida kasutatakse ühises diskursuses. @et
toolkit label: pealkiri teoses @et
toolkit definition: Teos, millel on nimetus loomulikus keeles ja sõnastuses, mida kasutatakse ühises diskursuses. @et
label: ist Titel eines Werks von @de
definition: Setzt ein Nomen in Beziehung zu einem Werk, das über eine Bezeichnung für ein Werk in natürlicher Sprache und Ausdrucksweise verfügt, die beim normalen Sprechen und Schreiben verwendet wird. @de
toolkit label: Titel eines Werks von @de
toolkit definition: Ein Werk, das über eine Bezeichnung für ein Werk in natürlicher Sprache und Ausdrucksweise verfügt, die beim normalen Sprechen und Schreiben verwendet wird. @de
label: műhöz tartozó címe a következőnek: @hu
definition: Hozzákapcsol egy noment egy műhöz, amelynek van egy műhöz tartozó megnevezése természetes nyelven és közbeszédben használt kifejezéssel. @hu
toolkit label: műhöz tartozó címe: @hu
toolkit definition: Egy mű, amelynek van egy műhöz tartozó megnevezése természetes nyelven és közbeszédben használt kifejezéssel. @hu
label: è titolo dell'opera di @it
definition: Correla un nomen a un'opera che ha una designazione di opera in linguaggio e frasi naturali usati nel discorso comune. @it
toolkit label: titolo dell'opera di @it
toolkit definition: Un'opera che ha una designazione di opera in linguaggio e frasi naturali usati nel discorso comune. @it
label: ir nosaukums darbam @lv
definition: Sasaista nomenu ar darbu, kam ir darba apzīmējums dabiskajā valodā un frāze, ko lieto kopējā diskursā. @lv
toolkit label: ir nosaukums darbam @lv
toolkit definition: Darbs, kam ir darba apzīmējums dabiskajā valodā un frāze, ko lieto kopējā diskursā. @lv
label: 是……的作品的题名 @zh-hans
definition: 将一个命名与有用自然语言和普通话语措词表达的作品的称谓的一种作品关联起来。 @zh-hans
toolkit label: ……的作品的题名 @zh-hans
toolkit definition: 有用自然语言和普通话语措词表达的作品的称谓的一种作品 @zh-hans
has subproperty: is key title of
has subproperty: is preferred title of work of
has subproperty: is variant title of work of
has subproperty: P80064
label: eserin başlığı @tr
definition: Bir ismi, doğal dilde ve ortak söylemde kullanılan ifadelerde çalışma unvanına sahip bir eserle ilişkilendirir. @tr
toolkit label: eserin başlığı @tr
toolkit definition: Doğal dilde eser unvanına ve ortak söylemde kullanılan ifadelere sahip bir eser. @tr

is title proper of
status: Published
type: Property
lexical alias: titleProperOf.en
domain: C10012
toolkit label: title proper of
sub property of: is title of manifestation of
has element type: 2
definition: Relates a nomen to a manifestation that has a title of manifestation that is selected for preference in a specific application or context.
toolkit definition: A manifestation that has a title of manifestation that is selected for preference in a specific application or context.
label: päänimeke manifestaatiolle @fi
definition: Liittää nomenin manifestaatioon, jonka nimeke on valittu ensisijaiseksi tietyssä sovelluksessa ja kontekstissa. @fi
toolkit label: päänimeke manifestaatiolle @fi
toolkit definition: Manifestaatio, jonka nimeke on valittu ensisijaiseksi tietyssä sovelluksessa ja kontekstissa. @fi
label: er hovedtittel for @no
definition: Relaterer et nomen til en manifestasjon som har en tittel for manifestasjon som er valgt som preferanse i en bestemt applikasjon eller kontekst. @no
toolkit label: hovedtittel for @no
toolkit definition: En manifestasjon som har en tittel for manifestasjon som er valgt som preferanse i en bestemt applikasjon eller kontekst. @no
label: est un titre propre de @fr
definition: Met un nomen en relation avec une manifestation qui possède un titre de manifestation faisant l’objet d’un choix privilégié dans un schéma d’encodage de vocabulaire spécifique. @fr
toolkit label: titre propre de @fr
toolkit definition: Manifestation qui possède un titre de manifestation faisant l’objet d’un choix privilégié dans un schéma d’encodage de vocabulaire spécifique. @fr
label: is hoofdtitel van @nl
definition: Relateert een nomen aan een manifestatie die een titel van manifestatie heeft die als voorkeursterm geselecteerd is in een specifieke toepassing of context. @nl
toolkit label: hoofdtitel van @nl
toolkit definition: Een manifestatie die een titel van manifestatie heeft die als voorkeursterm geselecteerd is in een specifieke toepassing of context. @nl
label: هو العنوان الفعلي لـ @ar
definition: يربط تسمية بتجسيدة لها عنوان تجسيدة اختير للتفضيل في تطبيق أو في سياق معين. @ar
toolkit label: عنوان فعلي لـ @ar
toolkit definition: تجسيدة لها عنوان تجسيدة اختير للتفضيل في تطبيق أو في سياق معين. @ar
label: és títol propi de @ca
definition: Relaciona un nomen amb una manifestació que té un títol de manifestació que se selecciona com a preferent en una aplicació o un context específic. @ca
toolkit label: títol propi de @ca
toolkit definition: Manifestació que té un títol de manifestació que se selecciona com a preferent en una aplicació o un context específic. @ca
label: er hovedtitel af @da
definition: Relaterer et nomen til en manifestation, som har en titel på manifestation, som er valgt som præference i en specifik anvendelse eller kontekst. @da
toolkit label: hovedtitel af @da
toolkit definition: Manifestation, som har en titel på manifestation, som er valgt som præference i en specifik anvendelse eller kontekst. @da
label: põhipealkiri kehastuses @et
definition: Seostab nomen'i kehastusega, millel on kindlas rakenduses või kontekstis eelistatuks valitud pealkiri. @et
toolkit label: põhipealkiri kehastuses @et
toolkit definition: Kehastus, millel on kindlas rakenduses või kontekstis eelistatuks valitud pealkiri. @et
label: ist Haupttitel von @de
definition: Setzt ein Nomen in Beziehung zu einer Manifestation, die über einen Titel für eine Manifestation verfügt, der in einer bestimmten Anwendung oder in einem bestimmten Kontext als Vorzugsform bestimmt wird. @de
toolkit label: Haupttitel von @de
toolkit definition: Eine Manifestation, die über einen Titel für eine Manifestation verfügt, der in einer bestimmten Anwendung oder in einem bestimmten Kontext als Vorzugsform bestimmt wird. @de
label: főcíme a következőnek: @hu
definition: főcíme: @hu
toolkit label: Hozzákapcsol egy noment egy megjelenési formához, amelynek van egy megjelenésiforma-címe, amelyet egy bizonyos alkalmazásban vagy kontextusban előnyben részesítenek. @hu
toolkit definition: Egy megjelenési forma, amelynek van egy megjelenésiforma-címe, amelyet egy bizonyos alkalmazásban vagy kontextusban előnyben részesítenek. @hu
label: è titolo proprio di @it
definition: Correla un nomen a una manifestazione che ha un titolo di manifestazione che è stato selezionato come preferito in una specifica applicazione o contesto. @it
toolkit label: titolo proprio di @it
toolkit definition: Una manifestazione che ha un titolo di manifestazione che è stato selezionato come preferito in una specifica applicazione o contesto. @it
label: ir pamatnosaukums @lv
toolkit label: ir pamatnosaukums @lv
definition: Sasaista nomenu ar manifestāciju, kam ir manifestācijas nosaukums, kas izvēlēts kā prioritārs noteiktā lietojumprogrammā vai kontekstā. @lv
toolkit definition: Manifestācija, kam ir manifestācijas nosaukums, kas izvēlēts kā prioritārs noteiktā lietojumprogrammā vai kontekstā. @lv
label: 是……的正题名 @zh-hans
toolkit label: ……的正题名 @zh-hans
definition: 将一个命名与有在一个给定的体系或语境中被首选的一个载体表现题名的一种载体表现关联起来。 @zh-hans
toolkit definition: 有在一个给定的体系或语境中被首选的一个载体表现题名的一种载体表现 @zh-hans
has subproperty: is parallel title proper of
has subproperty: P80063
label: uygun başlık @tr
toolkit label: esas başlık @tr
definition: Bir ismi, belirli bir uygulama veya bağlamda tercih için seçilen bir gösterim başlığına sahip bir gösterimle ilişkilendirir. @tr
toolkit definition: Belirli bir uygulama veya bağlamda tercih edilmek üzere seçilmeyen bir gösterim başlığına sahip bir gösterim @tr

is title proper of subseries of (Deprecated)
status: Deprecated
type: Property
lexical alias: titleProperOfSubseriesOf.en
domain: C10012
toolkit label: title proper of subseries of (Deprecated)
sub property of: is title of series of
definition: Relates a nomen to a manifestation of an issue of a subseries that has a name of series appearing on it. (Deprecated)
toolkit definition: A manifestation of an issue of a subseries that has a name of series appearing on it. (Deprecated)
has subproperty: is parallel title proper of subseries of (Deprecated)
has subproperty: P80126

has undifferentiated name indicator
status: Published
lexical alias: undifferentiatedNameIndicator.en
definition: Relates a nomen to a categorization indicating that a nomen is insufficient to differentiate between two or more entities.
toolkit label: undifferentiated name indicator
toolkit definition: A categorization indicating that a nomen is insufficient to differentiate between two or more entities.
type: Property
domain: C10012
has element type: 3
label: yksilöimättömän nimen ilmaus @fi
definition: Liittää nomenin kategorisointiin, jolla ilmaistaan nomenin riittämättömyys erottaa kahta tai useampaa entiteettiä toisistaan. @fi
toolkit label: yksilöimättömän nimen ilmaus @fi
toolkit definition: Kategorisointi, jolla ilmaistaan nomenin riittämättömyys erottaa kahta tai useampaa entiteettiä toisistaan. @fi
label: har udifferensiert navneangivelse @no
definition: Relaterer et nomen til en kategorisering som angir at et nomen er utilstrekkelig for å skille mellom to eller flere entiteter. @no
toolkit label: udifferensiert navneangivelse @no
toolkit definition: En kategorisering som angir at et nomen er utilstrekkelig for å skille mellom to eller flere entiteter. @no
label: a pour indicateur de nom indifférencié @fr
definition: Met un nomen en relation avec une catégorisation qui indique qu’un nomen est insuffisant pour différencier deux ou plusieurs entités. @fr
toolkit label: indicateur de nom indifférencié @fr
toolkit definition: Catégorisation qui indique qu’un nomen est insuffisant pour différencier deux ou plusieurs entités. @fr
label: heeft niet-onderscheiden naam indicatie @nl
definition: Relateert een nomen aan een categorisatie die aangeeft dat een nomen onvoldoende is om onderscheid te maken tussen twee of meer entiteiten. @nl
toolkit label: niet-onderscheiden naam indicatie @nl
toolkit definition: Een categorisatie die aangeeft dat een nomen onvoldoende is om onderscheid te maken tussen twee of meer entiteiten. @nl
label: لها مؤشر لاسم غير ملائم @ar
definition: يربط تسمية بفئة تشير إلى تسمية غير ملائمة للتمييز بين كيانين أو أكثر. @ar
toolkit label: مؤشر لاسم غير ملائم @ar
toolkit definition: تصنيف يشير إلى تسمية غير ملائمة للتمييز بين كيانين أو أكثر. @ar
label: té com a indicador de nom no diferenciat @ca
definition: Relaciona un nomen amb una categorització que indica que un nomen és insuficient per diferenciar entre dues o més entitats. @ca
toolkit label: indicador de nom no diferenciat @ca
toolkit definition: Categorització que indica que un nomen és insuficient per diferenciar entre dues o més entitats. @ca
label: har udifferentieret navneangivelse @da
definition: Relaterer et nomen til en kategorisering, som angiver, at et nomen er utilstrækkelig til at skelne mellem to eller flere entiteter. @da
toolkit label: udifferentieret navneangivelse @da
toolkit definition: Kategorisering, som angiver, at et nomen er utilstrækkelig til at skelne mellem to eller flere entiteter. @da
label: individualiseerimata nime tähis @et
definition: Seostab nomen'i liigitusega, mis näitab, et nomen'ist ei piisa kahe või enama olemi eristamiseks. @et
toolkit label: individualiseerimata nime tähis @et
toolkit definition: Liigitus, mis näitab, et nomen'ist ei piisa kahe või enama olemi eristamiseks. @et
label: hat Indikator für nicht individualisierte Namen @de
definition: Setzt ein Nomen in Beziehung zu einer Kategorisierung die angibt, dass ein Nomen nicht ausreicht, um zwischen zwei oder mehreren Entitäten zu unterscheiden. @de
toolkit label: Indikator für nicht individualisierte Namen @de
toolkit definition: Eine Kategorisierung die angibt, dass ein Nomen nicht ausreicht, um zwischen zwei oder mehreren Entitäten zu unterscheiden. @de
label: nem differenciált névjelzője a következő: @hu
definition: Hozzákapcsol egy noment egy kategorizáláshoz, amely jelzi, hogy a nomen nem alkalmas két vagy több entitás megkülönböztetésére. @hu
toolkit label: nem differenciált névjelzője: @hu
toolkit definition: Egy kategorizálás, amely jelzi, hogy a nomen nem alkalmas két vagy több entitás megkülönböztetésére. @hu
label: ha come indicatore di nome indifferenziato @it
definition: Correla un nomen a una categorizzazione che indica che un nomen non è sufficiente per differenziare tra due o più entità. @it
toolkit label: indicatore di nome indifferenziato @it
toolkit definition: Una categorizzazione che indica che un nomen non è sufficiente per differenziare tra due o più entità. @it
label: vārda/nosaukuma atšķiramības pazīme @lv
definition: Sasaista nomenu ar apzīmējumu, kas norāda, ka nomens nav pietiekams, lai atšķirtu divas vai vairākas entītes. @lv
toolkit label: vārda/nosaukuma atšķiramības pazīme @lv
toolkit definition: Apzīmējums, kas norāda, ka nomens nav pietiekams, lai atšķirtu divas vai vairākas entītes. @lv
label: 有未区分名称指示符 @zh-hans
definition: 将一个命名与表明一个命名不足以区分两个或更多实体的一个类别关联起来。 @zh-hans
toolkit label: 未区分名称指示符 @zh-hans
toolkit definition: 表明一个命名不足以区分两个或更多实体的一个类别 @zh-hans
has subproperty: P80169
label: ayırt edilemeyen ad göstergesi ile ilişkilidir @tr
definition: Bir ismi, iki veya daha fazla varlık arasında ayrım yapmak için bir ismin yetersiz olduğunu belirten bir sınıflandırmayla ilişkilendirir. @tr
toolkit label: ayırt edilemeyen ad göstergesi @tr
toolkit definition: İki veya daha fazla varlık arasında ayırt etme için bir nomenin yetersiz olduğunu belirten bir kategorizasyon. @tr

is variant access point for agent of
status: Published
type: Property
lexical alias: variantAccessPointForAgentOf.en
definition: Relates a nomen to an agent who has an access point for agent that is not selected for preference in a specific vocabulary encoding scheme.
domain: C10012
toolkit label: variant access point for agent of
toolkit definition: An agent who has an access point for agent that is not selected for preference in a specific vocabulary encoding scheme.
sub property of: is access point for agent of
has element type: 2
sub property of: is variant access point for RDA entity of
label: varianttihakutieto toimijalle @fi
definition: Liittää nomenin toimijaan, jonka hakutietoa ei ole valittu ensisijaiseksi tietyssä sanaston merkintäjärjestelmässä. @fi
toolkit label: varianttihakutieto toimijalle @fi
toolkit definition: Toimija, jonka hakutietoa ei ole valittu ensisijaiseksi tietyssä sanaston merkintäjärjestelmässä. @fi
label: er alternativ søkeinngang for agent for @no
definition: Relaterer et nomen til en agent som har en søkeinngang for agent som ikke er valgt som preferanse i et bestemt kodeskjema for vokabular. @no
toolkit label: alternativ søkeinngang for agent for @no
toolkit definition: En agent som har en søkeinngang for agent som ikke er valgt som preferanse i et bestemt kodeskjema for vokabular. @no
label: est une variante de point d’accès d’un agent de @fr
definition: Met un nomen en relation avec un agent qui possède un point d’accès d’un agent ne faisant pas l’objet d’un choix privilégié dans un schéma d’encodage de vocabulaire spécifique. @fr
toolkit label: variante de point d’accès d’un agent de @fr
toolkit definition: Agent qui possède un point d’accès d’un agent ne faisant pas l’objet d’un choix privilégié dans un schéma d’encodage de vocabulaire spécifique. @fr
label: is variant ingang voor actor van @nl
definition: Relateert een nomen aan een actor die een ingang voor actor heeft die niet als voorkeursterm geselecteerd is in een specifiek vocabulair coderingssysteem. @nl
toolkit label: variant ingang voor actor van @nl
toolkit definition: Een actor die een ingang voor actor heeft die niet als voorkeursterm geselecteerd is in een specifiek vocabulair coderingssysteem. @nl
label: هي نقطة وصول مختلفة لوكيل لـ @ar
definition: يربط تسمية بوكيل له نقطة وصول لوكيل لم تُختر للتفضيل في خطة ترميز مفردات محددة. @ar
toolkit label: نقطة وصول مختلفة لوكيل لـ @ar
toolkit definition: وكيل له نقطة وصول لوكيل لم تُختر للتفضيل في خطة ترميز مفردات محددة. @ar
label: és variant de punt d’accés d’agent de @ca
definition: Relaciona un nomen amb un agent que té un punt d’accés d’agent que no se selecciona com a preferent en un esquema de codificació de vocabulari específic. @ca
toolkit label: variant de punt d’accés d’agent de @ca
toolkit definition: Agent que té un punt d’accés d’agent que no se selecciona com a preferent en un esquema de codificació de vocabulari específic. @ca
label: er variant af søgeindgang for agent af @da
definition: Relaterer et nomen til en agent, som har en søgeindgang for agent, som ikke er valgt som præference i et specifikt vokabularkodningsskema. @da
toolkit label: variant af søgeindgang for agent af @da
toolkit definition: Agent, som har en søgeindgang for agent, som ikke er valgt som præference i et specifikt vokabularkodningsskema. @da
label: otsielemendi variant tegijale @et
definition: Seostab nomen'i tegijaga, kellel on otsielement, mis ei ole valitud eelistatuks vastavas leksikaalses märkimissüsteemis. @et
toolkit label: otsielemendi variant tegijale @et
toolkit definition: Tegija, kellel on otsielement, mis ei ole valitud eelistatuks vastavas leksikaalses märkimissüsteemis. @et
label: ist zusätzlicher Sucheinstieg für einen Akteur von @de
definition: Setzt ein Nomen in Beziehung zu einem Akteur, der über einen Sucheinstieg für einen Akteur verfügt, der in einem bestimmten Vocabulary Encoding Scheme nicht als Vorzugsform bestimmt wird. @de
toolkit label: Zusätzlicher Sucheinstieg für einen Akteur von @de
toolkit definition: Ein Akteur, der über einen Sucheinstieg für einen Akteur verfügt, der in einem bestimmten Vocabulary Encoding Scheme nicht als Vorzugsform bestimmt wird. @de
label: hozzáférésipont-variánsa a következő ágensnek: @hu
definition: Hozzákapcsol egy noment egy ágenshez, amelynek van egy olyan hozzáférési pontja ágens számára, amelyet egy adott szótárkódolási sémában nem részesítenek előnyben. @hu
toolkit label: hozzáférésipont-variánsa a következő ágensnek: @hu
toolkit definition: Egy ágens, amelynek van egy olyan hozzáférési pontja ágens számára, amelyet egy adott szótárkódolási sémában nem részesítenek előnyben. @hu
label: è punto d'accesso variante per agente di @it
definition: Correla un nomen a un agente che ha un punto d'accesso per l'agente che non è stato selezionato come preferito in uno specifico schema di codifica di vocabolario. @it
toolkit label: punto d'accesso variante per agente di @it
toolkit definition: Un agente che ha un punto d'accesso per l'agente che non è stato selezionato come preferito in uno specifico schema di codifica di vocabolario. @it
label: ir papildforma aģentam @lv
definition: Sasaista nomenu ar aģentu, kam ir piekļuves punkts aģentam, kas nav izvēlēts kā prioritārs noteiktai kontrolētas vārdnīcas shēmai. @lv
toolkit label: ir papildforma aģentam @lv
toolkit definition: Aģents, kam ir piekļuves punkts aģentam, kas nav izvēlēts kā prioritārs noteiktai kontrolētas vārdnīcas shēmai. @lv
label: 是……的行为者的变异检索点 @zh-hans
definition: 将一个命名与有在一个特定的词表编码体系中未被首选的行为者检索点的一个行为者关联起来。 @zh-hans
toolkit label: ……的行为者的变异检索点 @zh-hans
toolkit definition: 有在一个特定的词表编码体系中未被首选的行为者检索点的一个行为者 @zh-hans
has subproperty: is variant access point for collective agent of
has subproperty: is variant access point for person of
has subproperty: P80100
label: temsilcisi için farklı erişim noktası @tr
definition: Bir ismi, belirli bir kelime kodlama şemasında tercih için seçilmeyen bir temsilci için erişim noktası olan bir temsilciyle ilişkilendirir. @tr
toolkit label: temsilci için alternatif erişim noktası @tr
toolkit definition: Belirli bir kelime kodlama şemasında tercih edilmek için seçilmeyen bir temsilci için erişim noktası olan bir temsilci. @tr

is variant access point for collective agent of
status: Published
type: Property
lexical alias: variantAccessPointForCollectiveAgentOf.en
definition: Relates a nomen to a collective agent who has an access point for collective agent that is not selected for preference in a specific vocabulary encoding scheme.
domain: C10012
toolkit label: variant access point for collective agent of
toolkit definition: A collective agent who has an access point for collective agent that is not selected for preference in a specific vocabulary encoding scheme.
sub property of: is access point for collective agent of
sub property of: is variant access point for agent of
has element type: 2
label: varianttihakutieto yhteistoimijalle @fi
definition: Liittää nomenin yhteistoimijaan, jonka hakutietoa ei ole valittu ensisijaiseksi tietyssä sanaston merkintäjärjestelmässä. @fi
toolkit label: varianttihakutieto yhteistoimijalle @fi
toolkit definition: Yhteistoimija, jonka hakutietoa ei ole valittu ensisijaiseksi tietyssä sanaston merkintäjärjestelmässä. @fi
label: er alternativ søkeinngang for kollektiv agent for @no
definition: Relaterer et nomen til en kollektiv agent som har en søkeinngang for kollektiv agent som ikke er valgt som preferanse i et bestemt kodeskjema for vokabular. @no
toolkit label: alternativ søkeinngang for kollektiv agent for @no
toolkit definition: En kollektiv agent som har en søkeinngang for kollektiv agent som ikke er valgt som preferanse i et bestemt kodeskjema for vokabular. @no
label: est une variante de point d’accès d’un agent collectif de @fr
definition: Met un nomen en relation avec un agent collectif qui possède un point d’accès d’un agent collectif ne faisant pas l’objet d’un choix privilégié dans un schéma d’encodage de vocabulaire spécifique. @fr
toolkit label: variante de point d’accès d’un agent collectif de @fr
toolkit definition: Agent collectif qui possède un point d’accès d’un agent collectif ne faisant pas l’objet d’un choix privilégié dans un schéma d’encodage de vocabulaire spécifique. @fr
label: is variant ingang voor collectieve actor van @nl
definition: Relateert een nomen aan een collectieve actor die een ingang voor collectieve actor heeft die niet als voorkeursterm geselecteerd is in een specifiek vocabulair coderingssysteem. @nl
toolkit label: variant ingang voor collectieve actor van @nl
toolkit definition: Een collectieve actor die een ingang voor collectieve actor heeft die niet als voorkeursterm geselecteerd is in een specifiek vocabulair coderingssysteem. @nl
label: هي نقطة وصول مختلفة لوكيل جماعي لـ @ar
definition: يربط تسمية بوكيل جماعي له نقطة وصول لوكيل جماعي لم تُختر للتفضيل في خطة ترميز مفردات محددة. @ar
toolkit label: نقطة وصول مختلفة لوكيل جماعي لـ @ar
toolkit definition: وكيل جماعي له نقطة وصول لوكيل جماعي، لم تُختر للتفضيل في خطة ترميز مفردات محددة. @ar
label: és variant de punt d’accés d’agent col·lectiu de @ca
definition: Relaciona un nomen amb un agent col·lectiu que té un punt d’accés d’agent col·lectiu que no se selecciona com a preferent en un esquema de codificació de vocabulari específic. @ca
toolkit label: variant de punt d’accés d’agent col·lectiu de @ca
toolkit definition: Agent col·lectiu que té un punt d’accés d’agent col·lectiu que no se selecciona com a preferent en un esquema de codificació de vocabulari específic. @ca
label: er variant af søgeindgang for kollektiv agent af @da
definition: Relaterer et nomen til en kollektiv agent, som har en søgeindgang for kollektiv agent, som ikke er valgt som præference i et specifikt vokabularkodningsskema. @da
toolkit label: variant af søgeindgang for kollektiv agent af @da
toolkit definition: Kollektiv agent, som har en søgeindgang for kollektiv agent, som ikke er valgt som præference i et specifikt vokabularkodningsskema. @da
label: otsielemendi variant kollektiivile @et
definition: Seostab nomen'i kollektiiviga, kellel on otsielement, mis ei ole valitud eelistatuks vastavas leksikaalses märkimissüsteemis. @et
toolkit label: otsielemendi variant kollektiivile @et
toolkit definition: Kollektiiv, kellel on otsielement, mis ei ole valitud eelistatuks vastavas leksikaalses märkimissüsteemis. @et
label: ist zusätzlicher Sucheinstieg für einen gemeinschaftlichen Akteur von @de
definition: Setzt ein Nomen in Beziehung zu einem gemeinschaftlichen Akteur, der über einen Sucheinstieg für einen gemeinschaftlicher Akteur verfügt, der in einem bestimmten Vocabulary Encoding Scheme nicht als Vorzugsform bestimmt wird. @de
toolkit label: Zusätzlicher Sucheinstieg für einen gemeinschaftlichen Akteur von @de
toolkit definition: Ein gemeinschaftlicher Akteur, der über einen Sucheinstieg für einen gemeinschaftlicher Akteur verfügt, der in einem bestimmten Vocabulary Encoding Scheme nicht als Vorzugsform bestimmt wird. @de
label: hozzáférésipont-változata a következő kollektív ágensnek: @hu
definition: Hozzákapcsol egy noment egy kollektív ágenshez, amelynek van egy olyan hozzáférési pontja a kollektív ágens számára, amelyet egy adott szótárkódolási sémában nem részesítenek előnyben. @hu
toolkit label: hozzáférésipont-változata a következő kollektív ágensnek: @hu
toolkit definition: Egy kollektív ágens, amelynek van egy olyan hozzáférési pontja a kollektív ágens számára, amelyet egy adott szótárkódolási sémában nem részesítenek előnyben. @hu
label: è punto d'accesso variante per agente collettivo di @it
definition: Correla un nomen a un agente collettivo che ha un punto d'accesso per l'agente collettivo che non è stato selezionato come preferito in uno specifico schema di codifica di vocabolario. @it
toolkit label: punto d'accesso variante per agente collettivo di @it
toolkit definition: Un agente collettivo che ha un punto d'accesso per l'agente collettivo che non è stato selezionato come preferito in uno specifico schema di codifica di vocabolario. @it
label: ir papildforma grupai @lv
definition: Sasaista nomenu ar grupu, kam ir piekļuves punkts grupai, kas nav izvēlēta kā prioritāra noteiktai kontrolētas vārdnīcas shēmai. @lv
toolkit label: ir papildforma grupai @lv
toolkit definition: Grupa, kam ir piekļuves punkts grupai, kas nav izvēlēta kā prioritāra noteiktai kontrolētas vārdnīcas shēmai. @lv
label: 是……的集体行为者的变异检索点 @zh-hans
definition: 将一个命名与有在一个特定的词表编码体系中未被首选的集体行为者检索点的一个集体行为者关联起来。 @zh-hans
toolkit label: ……的集体行为者的变异检索点 @zh-hans
toolkit definition: 有在一个特定的词表编码体系中未被首选的集体行为者检索点的一个集体行为者 @zh-hans
has subproperty: is variant access point for corporate body of
has subproperty: is variant access point for family of
has subproperty: P80102
label: kollektif temsilcisi için farklı erişim noktası @tr
definition: Bir ismi, belirli bir kelime kodlama şemasında tercih için seçilmeyen bir kolektif temsilci için erişim noktası olan bir kolektif temsilciyle ilişkilendirir. @tr
toolkit label: kollektif temsilci için alternatif erişim noktası @tr
toolkit definition: Belirli bir kelime kodlama şemasında tercih için seçilmeyen bir kolektif temsilci için erişim noktası olan bir kolektif temsilci. @tr

is variant access point for corporate body of
status: Published
type: Property
lexical alias: variantAccessPointForCorporateBodyOf.en
definition: Relates a nomen to a corporate body who has an access point for corporate body that is not selected for preference in a specific vocabulary encoding scheme.
domain: C10012
toolkit label: variant access point for corporate body of
toolkit definition: A corporate body who has an access point for corporate body that is not selected for preference in a specific vocabulary encoding scheme.
sub property of: is access point for corporate body of
sub property of: is variant access point for collective agent of
has element type: 2
label: varianttihakutieto yhteisölle @fi
definition: Liittää nomenin yhteisöön, jonka hakutietoa ei ole valittu ensisijaiseksi tietyssä sanaston merkintäjärjestelmässä. @fi
toolkit label: varianttihakutieto yhteisölle @fi
toolkit definition: Yhteisö, jonka hakutietoa ei ole valittu ensisijaiseksi tietyssä sanaston merkintäjärjestelmässä. @fi
label: er alternativ søkeinngang for korporasjon for @no
definition: Relaterer et nomen til en korporasjon som har en søkeinngang for korporasjon som ikke er valgt som preferanse i et bestemt kodeskjema for vokabular. @no
toolkit label: alternativ søkeinngang for korporasjon for @no
toolkit definition: En korporasjon som har en søkeinngang for korporasjon som ikke er valgt som preferanse i et bestemt kodeskjema for vokabular. @no
label: est une variante de point d’accès d’une collectivité de @fr
definition: Met un nomen en relation avec une collectivité qui possède un point d’accès d’une collectivité ne faisant pas l’objet d’un choix privilégié dans un schéma d’encodage de vocabulaire spécifique. @fr
toolkit label: variante de point d’accès d’une collectivité de @fr
toolkit definition: Collectivité qui possède un point d’accès d’une collectivité ne faisant pas l’objet d’un choix privilégié dans un schéma d’encodage de vocabulaire spécifique. @fr
label: is variant ingang voor corporatie van @nl
definition: Relateert een nomen aan een corporatie die een ingang voor corporatie heeft die niet als voorkeursterm geselecteerd is in een specifiek vocabulair coderingssysteem. @nl
toolkit label: variant ingang voor corporatie van @nl
toolkit definition: Een corporatie die een ingang voor corporatie heeft die niet als voorkeursterm geselecteerd is in een specifiek vocabulair coderingssysteem. @nl
label: هي نقطة وصول مختلفة لهيئة لـ @ar
definition: يربط تسمية بهيئة لها نقطة وصول لهيئة، لم تُختر للتفضيل في خطة ترميز مفردات محددة. @ar
toolkit label: نقطة وصول مختلفة لهيئة لـ @ar
toolkit definition: هيئة لها نقطة وصول لهيئة لم تُختر للتفضيل في خطة ترميز مفردات محددة. @ar
label: és variant de punt d’accés d’entitat corporativa de @ca
definition: Relaciona un nomen amb una entitat corporativa que té un punt d’accés d’entitat corporativa que no se selecciona com a preferent en un esquema de codificació de vocabulari específic. @ca
toolkit label: variant de punt d’accés d’entitat corporativa de @ca
toolkit definition: Entitat corporativa que té un punt d’accés d’entitat corporativa que no se selecciona com a preferent en un esquema de codificació de vocabulari específic. @ca
label: er variant af søgeindgang for korporation af @da
definition: Relaterer et nomen til en korporation, som har en søgeindgang for korporation, som ikke er valgt som præference i et specifikt vokabularkodningsskema. @da
toolkit label: variant af søgeindgang for korporation af @da
toolkit definition: Korporation, som har en søgeindgang for korporation, som ikke er valgt som præference i et specifikt vokabularkodningsskema. @da
label: otsielemendi variant asutusele @et
definition: Seostab nomen'i asutusega, kellel on otsielement, mis ei ole valitud eelistatuks vastavas leksikaalses märkimissüsteemis. @et
toolkit label: otsielemendi variant asutusele @et
toolkit definition: Asutus, kellel on otsielement, mis ei ole valitud eelistatuks vastavas leksikaalses märkimissüsteemis. @et
label: ist zusätzlicher Sucheinstieg für eine Körperschaft von @de
definition: Setzt ein Nomen in Beziehung zu einer Körperschaft, die über einen Sucheinstieg für eine Körperschaft verfügt, der in einem bestimmten Vocabulary Encoding Scheme nicht als Vorzugsform bestimmt wird. @de
toolkit label: Zusätzlicher Sucheinstieg für eine Körperschaft von @de
toolkit definition: Eine Körperschaft, die über einen Sucheinstieg für eine Körperschaft verfügt, der in einem bestimmten Vocabulary Encoding Scheme nicht als Vorzugsform bestimmt wird. @de
label: hozzáférésipont-variánsa a következő testületnek: @hu
definition: Hozzákapcsol egy noment egy testülethez, amelynek van egy olyan hozzáférési pontja a testület számára, amelyet egy adott szótárkódolási sémában nem részesítenek előnyben. @hu
toolkit label: hozzáférésipont-variánsa a következő testületnek: @hu
toolkit definition: Egy testület, amelynek van egy olyan hozzáférési pontja a testület számára, amelyet egy adott szótárkódolási sémában nem részesítenek előnyben. @hu
label: è punto d'accesso variante per ente di @it
definition: Correla un nomen a un ente che ha un punto d'accesso per l'ente che non è stato selezionato come preferito in uno specifico schema di codifica di vocabolario @it
toolkit label: punto d'accesso variante per ente di @it
toolkit definition: Un ente che ha un punto d'accesso per l'ente che non è stato selezionato come preferito in uno specifico schema di codifica di vocabolario. @it
label: ir papildforma institūcijai @lv
definition: Sasaista nomenu ar institūciju, kam ir piekļuves punkts institūcijai, kas nav izvēlēta kā prioritāra noteiktai kontrolētas vārdnīcas shēmai. @lv
toolkit label: ir papildforma institūcijai @lv
toolkit definition: Institūcija, kam ir piekļuves punkts institūcijai, kas nav izvēlēta kā prioritāra noteiktai kontrolētas vārdnīcas shēmai. @lv
label: 是……的团体的变异检索点 @zh-hans
definition: 将一个命名与有在一个特定的词表编码体系中未被首选的团体检索点的一个团体关联起来。 @zh-hans
toolkit label: ……的团体的变异检索点 @zh-hans
toolkit definition: 有在一个特定的词表编码体系中未被首选的团体检索点的一个团体 @zh-hans
has subproperty: P80104
label: tüzel kişiliği için farklı erişim noktası @tr
definition: Bir ismi, belirli bir kelime kodlama şemasında tercih için seçilmeyen bir tüzel kişi için erişim noktası olan bir tüzel kişiyle ilişkilendirir. @tr
toolkit label: tüzel kişi için alternatif erişim noktası @tr
toolkit definition: Belirli bir kelime kodlama şemasında tercih edilmek üzere seçilmeyen bir tüzel kişi için erişim noktası olan bir tüzel kişi. @tr

is variant access point for expression of
status: Published
type: Property
lexical alias: variantAccessPointForExpressionOf.en
definition: Relates a nomen to an expression that has an access point for expression that is not selected for preference in a specific vocabulary encoding scheme.
domain: C10012
toolkit label: variant access point for expression of
toolkit definition: An expression that has an access point for expression that is not selected for preference in a specific vocabulary encoding scheme.
sub property of: is access point for expression of
has element type: 2
sub property of: is variant access point for RDA entity of
label: varianttihakutieto ekspressiolle @fi
definition: Liittää nomenin ekspressioon, jonka hakutietoa ei ole valittu ensisijaiseksi tietyssä sanaston merkintäjärjestelmässä. @fi
toolkit label: varianttihakutieto ekspressiolle @fi
toolkit definition: Ekspressio, jonka hakutietoa ei ole valittu ensisijaiseksi tietyssä sanaston merkintäjärjestelmässä. @fi
label: er alternativ søkeinngang for uttrykk for @no
definition: Relaterer et nomen til et uttrykk som har en søkeinngang for uttrykk som ikke er valgt som preferanse i et bestemt kodeskjema for vokabular. @no
toolkit label: alternativ søkeinngang for uttrykk for @no
toolkit definition: Et uttrykk som har en søkeinngang for uttrykk som ikke er valgt som preferanse i et bestemt kodeskjema for vokabular. @no
label: est une variante de point d’accès d’une expression de @fr
definition: Met un nomen en relation avec une expression qui possède un point d’accès d’une expression ne faisant pas l’objet d’un choix privilégié dans un schéma d’encodage de vocabulaire spécifique. @fr
toolkit label: variante de point d’accès d’une expression de @fr
toolkit definition: Expression qui possède un point d’accès d’une expression ne faisant pas l’objet d’un choix privilégié dans un schéma d’encodage de vocabulaire spécifique. @fr
label: is variant ingang voor expressie van @nl
definition: Relateert een nomen aan een expressie die een ingang voor expressie heeft die niet als voorkeursterm geselecteerd is in een specifiek vocabulair coderingssysteem. @nl
toolkit label: variant ingang voor expressie van @nl
toolkit definition: Een expressie die een ingang voor expressie heeft die niet als voorkeursterm geselecteerd is in een specifiek vocabulair coderingssysteem. @nl
label: هي نقطة وصول مختلفة لتعبيرة لـ @ar
definition: يربط تسمية بتعبيرة لها نقطة وصول لتعبيرة لم تُختر للتفضيل في خطة ترميز مفردات محددة. @ar
toolkit label: نقطة وصول مختلفة لتعبيرة لـ @ar
toolkit definition: تعبيرة لها نقطة وصول لتعبيرة لم تُختر للتفضيل في خطة ترميز مفردات محددة. @ar
label: és variant de punt d’accés d’expressió de @ca
definition: Relaciona un nomen amb una expressió que té un punt d’accés d’expressió que no se selecciona com a preferent en un esquema de codificació de vocabulari específic. @ca
toolkit label: variant de punt d’accés d’expressió de @ca
toolkit definition: Expressió que té un punt d’accés d’expressió que no se selecciona com a preferent en un esquema de codificació de vocabulari específic. @ca
label: er variant af søgeindgang for udtryk af @da
definition: Relaterer et nomen til et udtryk, som har en søgeindgang for udtryk, som ikke er valgt som præference i et specifikt vokabularkodningsskema. @da
toolkit label: variant af søgeindgang for udtryk af @da
toolkit definition: Udtryk, som har en søgeindgang for udtryk, som ikke er valgt som præference i et specifikt vokabularkodningsskema. @da
label: otsielemendi variant väljendusele @et
definition: Seostab nomen'i väljendusega, millel on otsielement, mis ei ole valitud eelistatuks vastavas leksikaalses märkimissüsteemis. @et
toolkit label: otsielemendi variant väljendusele @et
toolkit definition: Väljendus, millel on otsielement, mis ei ole valitud eelistatuks vastavas leksikaalses märkimissüsteemis. @et
label: ist zusätzlicher Sucheinstieg für eine Expression von @de
definition: Setzt ein Nomen in Beziehung zu einer Expression, die über einen Sucheinstieg für eine Expression verfügt, der in einem bestimmten Vocabulary Encoding Scheme nicht als Vorzugsform bestimmt wird. @de
toolkit label: Zusätzlicher Sucheinstieg für eine Expression von @de
toolkit definition: Eine Expression, die über einen Sucheinstieg für eine Expression verfügt, der in einem bestimmten Vocabulary Encoding Scheme nicht als Vorzugsform bestimmt wird. @de
label: hozzáférésipont-változat a következő kifejezési formához: @hu
definition: Hozzákapcsol egy noment egy olyan kifejezési formához, amelynek van egy olyan hozzáférési pontja a kifejezési forma számára, amelyet egy adott szótárkódolási sémából kiválasztva nem részesítenek előnyben. @hu
toolkit label: hozzáférésipont-változat a következő kifejezési formához: @hu
toolkit definition: Egy kifejezési forma, amelynek van egy olyan hozzáférési pontja a kifejezési forma számára, amelyet egy adott szótárkódolási sémából kiválasztva nem részesítenek előnyben. @hu
label: è punto d'accesso variante per espressione di @it
definition: Correla un nomen a un'espressione che ha un punto d'accesso per l'espressione che non è stato selezionato come preferito in uno specifico schema di codifica di vocabolario. @it
toolkit label: punto d'accesso variante per espressione di @it
toolkit definition: Un'espressione che ha un punto d'accesso per l'espressione che non è stato selezionato come preferito in uno specifico schema di codifica di vocabolario. @it
label: ir cita vārdforma izteiksmei @lv
definition: Sasaista nomenu ar izteiksmi, kam ir piekļuves punkts izteiksmei, kas nav izvēlēta kā prioritāra noteiktai kontrolētas vārdnīcas shēmai. @lv
toolkit label: ir cita vārdforma izteiksmei @lv
toolkit definition: Izteiksme, kam ir piekļuves punkts izteiksmei, kas nav izvēlēta kā prioritāra noteiktai kontrolētas vārdnīcas shēmai. @lv
label: 是……的内容表达的变异检索点 @zh-hans
definition: 将一个命名与有在一个特定的词表编码体系中未被首选的内容表达检索点的一种内容表达关联起来。 @zh-hans
toolkit label: ……的内容表达的变异检索点 @zh-hans
toolkit definition: 有在一个特定的词表编码体系中未被首选的内容表达检索点的一种内容表达 @zh-hans
has subproperty: P80096
label: ifadesi için farklı erişim noktası @tr
definition: Bir ismi, belirli bir kelime kodlama şemasında tercih için seçilmeyen anlatım için erişim noktası olan bir anlatımla ilişkilendirir. @tr
toolkit label: anlatım için alternatif erişim noktası @tr
toolkit definition: Belirli bir kelime kodlama şemasında tercih için seçilmeyen bir erişim noktasına sahip bir anlatım. @tr

is variant access point for family of
status: Published
type: Property
lexical alias: variantAccessPointForFamilyOf.en
definition: Relates a nomen to a family who has an access point for family that is not selected for preference in a specific vocabulary encoding scheme.
domain: C10012
toolkit label: variant access point for family of
toolkit definition: A family who has an access point for family that is not selected for preference in a specific vocabulary encoding scheme.
sub property of: is access point for family of
sub property of: is variant access point for collective agent of
has element type: 2
label: varianttihakutieto suvulle @fi
definition: Liittää nomenin sukuun, jonka hakutietoa ei ole valittu ensisijaiseksi tietyssä sanaston merkintäjärjestelmässä. @fi
toolkit label: varianttihakutieto suvulle @fi
toolkit definition: Suku, jonka hakutietoa ei ole valittu ensisijaiseksi tietyssä sanaston merkintäjärjestelmässä. @fi
label: er alternativ søkeinngang for familie for @no
definition: Relaterer et nomen til en familie som har en søkeinngang for familie som ikke er valgt som preferanse i et bestemt kodeskjema for vokabular. @no
toolkit label: alternativ søkeinngang for familie for @no
toolkit definition: En familie som har en søkeinngang for familie som ikke er valgt som preferanse i et bestemt kodeskjema for vokabular. @no
label: est une variante de point d’accès d’une famille de @fr
definition: Met un nomen en relation avec une famille qui possède un point d’accès d’une famille ne faisant pas l’objet d’un choix privilégié dans un schéma d’encodage de vocabulaire spécifique. @fr
toolkit label: variante de point d’accès d’une famille de @fr
toolkit definition: Famille qui possède un point d’accès d’une famille ne faisant pas l’objet d’un choix privilégié dans un schéma d’encodage de vocabulaire spécifique. @fr
label: is variant ingang voor familie van @nl
definition: Relateert een nomen aan een familie die een ingang voor familie heeft die niet als voorkeursterm geselecteerd is in een specifiek vocabulair coderingssysteem. @nl
toolkit label: variant ingang voor familie van @nl
toolkit definition: Een familie die een ingang voor familie heeft die niet als voorkeursterm geselecteerd is in een specifiek vocabulair coderingssysteem. @nl
label: هي نقطة وصول مختلفة لعائلة لـ @ar
definition: يربط تسمية بعائلة لها نقطة وصول لعائلة لم تُختر للتفضيل في خطة ترميز مفردات محددة. @ar
toolkit label: نقطة وصول مختلفة لعائلة لـ @ar
toolkit definition: عائلة لها نقطة وصول لعائلة لم تُختر للتفضيل في خطة ترميز مفردات محددة. @ar
label: és variant de punt d’accés de família de @ca
definition: Relaciona un nomen amb una família que té un punt d’accés de família que no se selecciona com a preferent en un esquema de codificació de vocabulari específic. @ca
toolkit label: variant de punt d’accés de família de @ca
toolkit definition: Família que té un punt d’accés de família que no se selecciona com a preferent en un esquema de codificació de vocabulari específic. @ca
label: er variant af søgeindgang for familie af @da
definition: Relaterer et nomen til en familie, som har en søgeindgang for familie, som ikke er valgt som præference i et specifikt vokabularkodningsskema. @da
toolkit label: variant af søgeindgang for familie af @da
toolkit definition: Familie, som har en søgeindgang for familie, som ikke er valgt som præference i et specifikt vokabularkodningsskema. @da
label: otsielemendi variant perekonnale @et
definition: Seostab nomen'i perekonnaga, kellel on otsielement, mis ei ole valitud eelistatuks vastavas leksikaalses märkimissüsteemis. @et
toolkit label: otsielemendi variant perekonnale @et
toolkit definition: Perekond, kellel on otsielement, mis ei ole valitud eelistatuks vastavas leksikaalses märkimissüsteemis. @et
label: ist zusätzlicher Sucheinstieg für eine Familie von @de
definition: Setzt ein Nomen in Beziehung zu einer Familie, die über einen Sucheinstieg für eine Familie verfügt, der in einem bestimmten Vocabulary Encoding Scheme nicht als Vorzugsform bestimmt wird. @de
toolkit label: Zusätzlicher Sucheinstieg für eine Familie von @de
toolkit definition: Eine Familie, die über einen Sucheinstieg für eine Familie verfügt, der in einem bestimmten Vocabulary Encoding Scheme nicht als Vorzugsform bestimmt wird. @de
label: hozzáférésipont-variánsa a következő családnak: @hu
definition: Hozzákapcsol egy noment egy családhoz, amelynek van egy olyan hozzáférési pontja a család számára, amelyet egy adott szótárkódolási sémában nem részesítenek előnyben. @hu
toolkit label: hozzáférésipont-variánsa a következő családnak: @hu
toolkit definition: Egy család, amelynek van egy olyan hozzáférési pontja a család számára, amelyet egy adott szótárkódolási sémában nem részesítenek előnyben. @hu
label: è punto d'accesso variante per famiglia di @it
definition: Correla un nomen a una famiglia che ha un punto d'accesso per la famiglia che non è stato selezionato come preferito in uno specifico schema di codifica di vocabolario @it
toolkit label: punto d'accesso variante per famiglia di @it
toolkit definition: Una famiglia che ha un punto d'accesso per la famiglia che non è stato selezionato come preferito in uno specifico schema di codifica di vocabolario. @it
label: ir papildforma dzimtai/ģimenei @lv
definition: Sasaista nomenu ar dzimtu/ģimeni, kam ir piekļuves punkts dzimtai/ģimenei, kas nav izvēlēta kā prioritāra noteiktai kontrolētas vārdnīcas shēmai. @lv
toolkit label: ir papildforma dzimtai/ģimenei @lv
toolkit definition: Dzimta/ģimene, kam ir piekļuves punkts dzimtai/ģimenei, kas nav izvēlēta kā prioritāra noteiktai kontrolētas vārdnīcas shēmai. @lv
label: 是……的家族的变异检索点 @zh-hans
definition: 将一个命名与有在一个特定的词表编码体系中未被首选的家族检索点的一个家族关联起来。 @zh-hans
toolkit label: ……的家族的变异检索点 @zh-hans
toolkit definition: 有在一个特定的词表编码体系中未被首选的家族检索点的一个家族 @zh-hans
has subproperty: P80106
label: ailesi için farklı erişim noktası @tr
definition: Bir ismi, belirli bir kelime kodlama şemasında tercih için seçilmeyen bir aile için erişim noktası olan bir niteleyici ismi bir aileyle ilişkilendirir. @tr
toolkit label: aile için alternatif erişim noktası @tr
toolkit definition: Belirli bir kelime kodlama şemasında tercih için seçilmeyen bir aile için erişim noktası olan bir aile. @tr

is variant access point for item of
status: Published
type: Property
lexical alias: variantAccessPointForItemOf.en
definition: Relates a nomen to an item that has an access point for item that is not selected for preference in a specific vocabulary encoding scheme.
domain: C10012
toolkit label: variant access point for item of
toolkit definition: An item that has an access point for item that is not selected for preference in a specific vocabulary encoding scheme.
sub property of: is access point for item of
has element type: 2
sub property of: is variant access point for RDA entity of
label: varianttihakutieto kappaleelle @fi
definition: Liittää nomenin kappaleeseen, jonka hakutietoa ei ole valittu ensisijaiseksi tietyssä sanaston merkintäjärjestelmässä. @fi
toolkit label: varianttihakutieto kappaleelle @fi
toolkit definition: Kappale, jonka hakutietoa ei ole valittu ensisijaiseksi tietyssä sanaston merkintäjärjestelmässä. @fi
label: er alternativ søkeinngang for eksemplar for @no
definition: Relaterer et nomen til et eksemplar som har en søkeinngang for eksemplar som ikke er valgt som preferanse i et bestemt kodeskjema for vokabular. @no
toolkit label: alternativ søkeinngang for eksemplar for @no
toolkit definition: Et eksemplar som har en søkeinngang for eksemplar som ikke er valgt som preferanse i et bestemt kodeskjema for vokabular. @no
label: est une variante de point d’accès d’un item de @fr
definition: Met un nomen en relation avec un item qui possède un point d’accès d’un item ne faisant pas l’objet d’un choix privilégié dans un schéma d’encodage de vocabulaire spécifique. @fr
toolkit label: variante de point d’accès d’un item de @fr
toolkit definition: Item qui possède un point d’accès d’un item ne faisant pas l’objet d’un choix privilégié dans un schéma d’encodage de vocabulaire spécifique. @fr
label: is variant ingang voor item van @nl
definition: Relateert een nomen aan een item dat een ingang voor item heeft die niet als voorkeursterm geselecteerd is in een specifiek vocabulair coderingssysteem. @nl
toolkit label: variant ingang voor item van @nl
toolkit definition: Een item dat een ingang voor item heeft die niet als voorkeursterm geselecteerd is in een specifiek vocabulair coderingssysteem. @nl
label: هي نقطة وصول مختلفة لمفردة لـ @ar
definition: يربط تسمية بمفردة لها نقطة وصول لمفردة لم تُختر للتفضيل في خطة ترميز مفردات محددة. @ar
toolkit label: نقطة وصول مختلفة لمفردة لـ @ar
toolkit definition: مفردة لها نقطة وصول لمفردة لم تُختر للتفضيل في خطة ترميز مفردات محددة. @ar
label: és variant de punt d’accés d’ítem de @ca
definition: Relaciona un nomen amb un ítem que té un punt d’accés d’ítem que no se selecciona com a preferent en un esquema de codificació de vocabulari específic. @ca
toolkit label: variant de punt d’accés d’ítem de @ca
toolkit definition: Ítem que té un punt d’accés d’ítem que no se selecciona com a preferent en un esquema de codificació de vocabulari específic. @ca
label: er variant af søgeindgang for eksemplar af @da
definition: Relaterer et nomen til et eksemplar, som har en søgeindgang for eksemplar, som ikke er valgt som præference i et specifikt vokabularkodningsskema. @da
toolkit label: variant af søgeindgang for eksemplar af @da
toolkit definition: Eksemplar, som har en søgeindgang for eksemplar, som ikke er valgt som præference i et specifikt vokabularkodningsskema. @da
label: otsielemendi variant eksemplarile @et
definition: Seostab nomen'i eksemplariga, millel on otsielement, mis ei ole valitud eelistatuks vastavas leksikaalses märkimissüsteemis. @et
toolkit label: otsielemendi variant eksemplarile @et
toolkit definition: Eksemplar, millel on otsielement, mis ei ole valitud eelistatuks vastavas leksikaalses märkimissüsteemis. @et
label: ist zusätzlicher Sucheinstieg für ein Exemplar von @de
definition: Setzt ein Nomen in Beziehung zu einem Exemplar, das über einen Sucheinstieg für ein Exemplar verfügt, der in einem bestimmten Vocabulary Encoding Scheme nicht als Vorzugsform bestimmt wird. @de
toolkit label: zusätzlicher Sucheinstieg für ein Exemplar von @de
toolkit definition: Ein Exemplar, das über einen Sucheinstieg für ein Exemplar verfügt, der in einem bestimmten Vocabulary Encoding Scheme nicht als Vorzugsform bestimmt wird. @de
label: hozzáférésipont-változat a következő példányhoz: @hu
definition: Hozzákapcsol egy noment egy olyan példányhoz, amelynek van egy olyan hozzáférési pontja példányhoz, amelyet egy adott szótárkódolási sémából kiválasztva nem részesítenek előnyben. @hu
toolkit label: hozzáférésipont-változat a következő példányhoz: @hu
toolkit definition: Egy példány, amelynek van egy olyan hozzáférési pontja példányhoz, amelyet egy adott szótárkódolási sémából kiválasztva nem részesítenek előnyben. @hu
label: è punto d'accesso variante per item di @it
definition: Correla un nomen a un item che ha un punto d'accesso per l'item che non è stato selezionato come preferito in uno specifico schema di codifica di vocabolario. @it
toolkit label: punto d'accesso variante per item di @it
toolkit definition: Un item che ha un punto d'accesso per l'item che non è stato selezionato come preferito in uno specifico schema di codifica di vocabolario. @it
label: ir papildforma vienībai @lv
definition: Sasaista nomenu ar vienību, kurai ir piekļuves punkts vienībai, kas nav izvēlēta kā prioritāra noteiktai kontrolētas vārdnīcas shēmai. @lv
toolkit label: ir papildforma vienībai @lv
toolkit definition: Vienība, kurai ir piekļuves punkts vienībai, kas nav izvēlēta kā prioritāra noteiktai kontrolētas vārdnīcas shēmai. @lv
label: 是……的单件的变异检索点 @zh-hans
definition: 将一个命名与有在一个特定的词表编码体系中未被首选的单件检索点的一个单件关联起来。 @zh-hans
toolkit label: ……的单件的变异检索点 @zh-hans
toolkit definition: 有在一个特定的词表编码体系中未被首选的单件检索点的一个单件 @zh-hans
has subproperty: P80092
label: öğesi için farklı erişim noktası @tr
definition: Bir ismi, belirli bir kelime kodlama şemasında tercih için seçilmeyen bir kopya için erişim noktası olan bir kopyayla ilişkilendirir. @tr
toolkit label: kopya için alternatif erişim noktası @tr
toolkit definition: Belirli bir kelime kodlama şemasında tercih için seçilmeyen bir kopya için erişim noktası olan bir kopya. @tr

is variant access point for manifestation of
status: Published
type: Property
lexical alias: variantAccessPointForManifestationOf.en
definition: Relates a nomen to a manifestation that has an access point for manifestation that is not selected for preference in a specific vocabulary encoding scheme.
domain: C10012
toolkit label: variant access point for manifestation of
toolkit definition: A manifestation that has an access point for manifestation that is not selected for preference in a specific vocabulary encoding scheme.
sub property of: is access point for manifestation of
has element type: 2
sub property of: is variant access point for RDA entity of
label: varianttihakutieto manifestaatiolle @fi
definition: Liittää nomenin manifestaatioon, jonka hakutietoa ei ole valittu ensisijaiseksi tietyssä sanaston merkintäjärjestelmässä. @fi
toolkit label: varianttihakutieto manifestaatiolle @fi
toolkit definition: Manifestaatio, jonka hakutietoa ei ole valittu ensisijaiseksi tietyssä sanaston merkintäjärjestelmässä. @fi
label: er alternativ søkeinngang for manifestasjon for @no
definition: Relaterer et nomen til en manifestasjon som har en søkeinngang for manifestasjon som ikke er valgt som preferanse i et bestemt kodeskjema for vokabular. @no
toolkit label: alternativ søkeinngang for manifestasjon for @no
toolkit definition: En manifestasjon som har en søkeinngang for manifestasjon som ikke er valgt som preferanse i et bestemt kodeskjema for vokabular. @no
label: est une variante de point d’accès d’une manifestation de @fr
definition: Met un nomen en relation avec une manifestation qui possède un point d’accès d’une manifestation ne faisant pas l’objet d’un choix privilégié dans un schéma d’encodage de vocabulaire spécifique. @fr
toolkit label: variante de point d’accès d’une manifestation de @fr
toolkit definition: Manifestation qui possède un point d’accès d’une manifestation ne faisant pas l’objet d’un choix privilégié dans un schéma d’encodage de vocabulaire spécifique. @fr
label: is variant ingang voor manifestatie van @nl
definition: Relateert een nomen aan een manifestatie die een ingang voor manifestatie heeft die niet als voorkeursterm geselecteerd is in een specifiek vocabulair coderingssysteem. @nl
toolkit label: variant ingang voor manifestatie van @nl
toolkit definition: Een manifestatie die een ingang voor manifestatie heeft die niet als voorkeursterm geselecteerd is in een specifiek vocabulair coderingssysteem. @nl
label: هي نقطة وصول مختلفة لتجسيدة لـ @ar
definition: يربط تسمية بتجسيدة لها نقطة وصول لتجسيدة لم تُختر للتفضيل في خطة ترميز مفردات محددة. @ar
toolkit label: نقطة وصول مختلفة لتجسيدة لـ @ar
toolkit definition: تجسيدة لها نقطة وصول لتجسيدة لم تُختر للتفضيل في خطة ترميز مفردات محددة. @ar
label: és variant de punt d’accés de manifestació de @ca
definition: Relaciona un nomen amb una manifestació que té un punt d’accés de manifestació que no se selecciona com a preferent en un esquema de codificació de vocabulari específic. @ca
toolkit label: variant de punt d’accés de manifestació de @ca
toolkit definition: Manifestació que té un punt d’accés de manifestació que no se selecciona com a preferent en un esquema de codificació de vocabulari específic. @ca
label: er variant af søgeindgang for manifestation af @da
definition: Relaterer et nomen til en manifestation, som har en søgeindgang for manifestation, som ikke er valgt som præference i et specifikt vokabularkodningsskema. @da
toolkit label: variant af søgeindgang for manifestation af @da
toolkit definition: Manifestation, som har en søgeindgang for manifestation, som ikke er valgt som præference i et specifikt vokabularkodningsskema. @da
label: otsielemendi variant kehastusele @et
definition: Seostab nomen'i kehastusega, millel on otsielement, mis ei ole valitud eelistatuks vastavas leksikaalses märkimissüsteemis. @et
toolkit label: otsielemendi variant kehastusele @et
toolkit definition: Kehastus, millel on otsielement, mis ei ole valitud eelistatuks vastavas leksikaalses märkimissüsteemis. @et
label: ist zusätzlicher Sucheinstieg für eine Manifestation von @de
definition: Setzt ein Nomen in Beziehung zu einer Manifestation, die über einen Sucheinstieg für eine Manifestation verfügt, der in einem bestimmten Vocabulary Encoding Scheme nicht als Vorzugsform bestimmt wird. @de
toolkit label: Zusätzlicher Sucheinstieg für eine Manifestation von @de
toolkit definition: Eine Manifestation, die über einen Sucheinstieg für eine Manifestation verfügt, der in einem bestimmten Vocabulary Encoding Scheme nicht als Vorzugsform bestimmt wird. @de
label: hozzáférésipont-variánsa a következő megjelenési formának: @hu
definition: Hozzákapcsol egy noment egy megjelenési formához, amelynek van egy olyan hozzáférési pontja a megjelenési formához, amely egy bizonyos szótárkódolási sémában nem részesül előnyben. @hu
toolkit label: hozzáférésipont-változat a következő megjelenési formához: @hu
toolkit definition: Egy megjelenési forma, amelynek van egy olyan hozzáférési pontja a megjelenési formához, amely egy bizonyos szótárkódolási sémában nem részesül előnyben. @hu
label: è punto d'accesso variante per manifestazione di @it
definition: Correla un nomen a una manifestazione che ha un punto d'accesso per la manifestazione che non è stato selezionato come preferito in uno specifico schema di codifica di vocabolario. @it
toolkit label: punto d'accesso variante per manifestazione di @it
toolkit definition: Una manifestazione che ha un punto d'accesso per la manifestazione che non è stato selezionato come preferito in uno specifico schema di codifica di vocabolario. @it
label: ir cita vārdforma manifestācijai @lv
definition: Sasaista nomenu ar manifestāciju, kam ir piekļuves punkts manifestācijai, kas nav izvēlēta kā prioritāra noteiktai kontrolētas vārdnīcas shēmai. @lv
toolkit label: ir cita vārdforma manifestācijai @lv
toolkit definition: Manifestācija, kam ir piekļuves punkts manifestācijai, kas nav izvēlēta kā prioritāra noteiktai kontrolētas vārdnīcas shēmai. @lv
label: 是……的载体表现的变异检索点 @zh-hans
definition: 将一个命名与有在一个特定的词表编码体系中未被首选的载体表现检索点的一种载体表现关联起来。 @zh-hans
toolkit label: ……的载体表现的变异检索点 @zh-hans
toolkit definition: 有在一个特定的词表编码体系中未被首选的载体表现检索点的一种载体表现 @zh-hans
has subproperty: P80090
label: gösterim için farklı erişim noktası @tr
definition: Bir ismi, belirli bir kelime kodlama şemasında tercih için seçilmeyen bir gösterim için erişim noktası olan bir gösterimle ilişkilendirir. @tr
toolkit label: gösterim için alternatif erişim noktası @tr
toolkit definition: Belirli bir kelime kodlama şemasında tercih edilmek üzere seçilen bir gösterim için bir erişim noktasına sahip olan bir gösterim. @tr

is variant access point for person of
status: Published
type: Property
lexical alias: variantAccessPointForPersonOf.en
definition: Relates a nomen to a person who has an access point for person that is not selected for preference in a specific vocabulary encoding scheme.
domain: C10012
toolkit label: variant access point for person of
toolkit definition: A person who has an access point for person that is not selected for preference in a specific vocabulary encoding scheme.
sub property of: is access point for person of
sub property of: is variant access point for agent of
has element type: 2
label: varianttihakutieto henkilölle @fi
definition: Liittää nomenin henkilöön, jonka hakutietoa ei ole valittu ensisijaiseksi tietyssä sanaston merkintäjärjestelmässä. @fi
toolkit label: varianttihakutieto henkilölle @fi
toolkit definition: Henkilö, jonka hakutietoa ei ole valittu ensisijaiseksi tietyssä sanaston merkintäjärjestelmässä. @fi
label: er alternativ søkeinngang for person for @no
definition: Relaterer et nomen til en person som har en søkeinngang for person som ikke er valgt som preferanse i et bestemt kodeskjema for vokabular. @no
toolkit label: alternativ søkeinngang for person for @no
toolkit definition: En person som har en søkeinngang for person som ikke er valgt som preferanse i et bestemt kodeskjema for vokabular. @no
label: est une variante de point d’accès d’une personne de @fr
definition: Met un nomen en relation avec une personne qui possède un point d’accès d’une personne ne faisant pas l’objet d’un choix privilégié dans un schéma d’encodage de vocabulaire spécifique. @fr
toolkit label: variante de point d’accès d’une personne de @fr
toolkit definition: Personne qui possède un point d’accès d’une personne ne faisant pas l’objet d’un choix privilégié dans un schéma d’encodage de vocabulaire spécifique. @fr
label: is variant ingang voor persoon van @nl
definition: Relateert een nomen aan een persoon die een ingang voor persoon heeft die niet als voorkeursterm geselecteerd is in een specifiek vocabulair coderingssysteem. @nl
toolkit label: variant ingang voor persoon van @nl
toolkit definition: Een persoon die een ingang voor persoon heeft die niet als voorkeursterm geselecteerd is in een specifiek vocabulair coderingssysteem. @nl
label: هي نقطة وصول مختلفة لشخص لـ @ar
definition: يربط تسمية بشخص له نقطة وصول لشخص لم تُختر للتفضيل في خطة ترميز مفردات محددة. @ar
toolkit label: نقطة وصول مختلفة لشخص لـ @ar
toolkit definition: شخص له نقطة وصول لشخص لم تُختر للتفضيل في خطة ترميز مفردات محددة. @ar
label: és variant de punt d’accés de persona de @ca
definition: Relaciona un nomen amb una persona que té un punt d’accés de persona que no se selecciona com a preferent en un esquema de codificació de vocabulari específic. @ca
toolkit label: variant de punt d’accés de persona de @ca
toolkit definition: Persona que té un punt d’accés de persona que no se selecciona com a preferent en un esquema de codificació de vocabulari específic. @ca
label: er variant af søgeindgang for person af @da
definition: Relaterer et nomen til en person, som har en søgeindgang for person, som ikke er valgt som præference i et specifikt vokabularkodningsskema. @da
toolkit label: variant af søgeindgang for person af @da
toolkit definition: Person, som har en søgeindgang for person, som ikke er valgt som præference i et specifikt vokabularkodningsskema. @da
label: otsielemendi variant isikule @et
definition: Seostab nomen'i isikuga, kellel on otsielement, mis ei ole valitud eelistatuks vastavas leksikaalses märkimissüsteemis. @et
toolkit label: otsielemendi variant isikule @et
toolkit definition: Isik, kellel on otsielement, mis ei ole valitud eelistatuks vastavas leksikaalses märkimissüsteemis. @et
label: ist zusätzlicher Sucheinstieg für eine Person von @de
definition: Setzt ein Nomen in Beziehung zu einer Person, die über einen Sucheinstieg für eine Person verfügt, der in einem bestimmten Vocabulary Encoding Scheme nicht als Vorzugsform bestimmt wird. @de
toolkit label: Zusätzlicher Sucheinstieg für eine Person von @de
toolkit definition: Eine Person, die über einen Sucheinstieg für eine Person verfügt, der in einem bestimmten Vocabulary Encoding Scheme nicht als Vorzugsform bestimmt wird. @de
label: hozzáférésipont-variánsa a következő személynek: @hu
definition: Hozzákapcsol egy noment egy személyhez, amelynek van egy olyan hozzáférési pontja a személyhez, amelyet egy adott szótárkódolási sémában nem részesítenek előnyben. @hu
toolkit label: hozzáférésipont-variánsa a következő személynek: @hu
toolkit definition: Egy személy, amelynek van egy olyan hozzáférési pontja a személyhez, amelyet egy adott szótárkódolási sémában nem részesítenek előnyben. @hu
label: è punto d'accesso variante per persona di @it
definition: Correla un nomen a una persona che ha un punto d'accesso per la persona che non è stato selezionato come preferito in uno specifico schema di codifica di vocabolario. @it
toolkit label: punto d'accesso variante per persona di @it
toolkit definition: Una persona che ha un punto d'accesso per la persona che non è stato selezionato come preferito in uno specifico schema di codifica di vocabolario. @it
label: ir papildforma personai @lv
definition: Sasaista nomenu ar personu, kurai ir piekļuves punkts personai, kas nav izvēlēta kā prioritāra noteiktai kontrolētas vārdnīcas shēmai. @lv
toolkit label: ir papildforma personai @lv
toolkit definition: Persona, kurai ir piekļuves punkts personai, kas nav izvēlēta kā prioritāra noteiktai kontrolētas vārdnīcas shēmai. @lv
label: 是……的个人的变异检索点 @zh-hans
definition: 将一个命名与有在一个特定的词表编码体系中未被首选的个人检索点的一个个人关联起来。 @zh-hans
toolkit label: ……的个人的变异检索点 @zh-hans
toolkit definition: 有在一个特定的词表编码体系中未被首选的个人检索点的一个个人 @zh-hans
has subproperty: P80108
label: kişi için farklı erişim noktası @tr
definition: Bir ismi, belirli bir kelime kodlama şemasında tercih için seçilmeyen kişi için erişim noktası olan bir kişiyle ilişkilendirir. @tr
toolkit label: kişi için alternatif erişim noktası @tr
toolkit definition: Belirli bir kelime kodlama şemasında tercih için seçilmemiş bir kişi için erişim noktası olan bir kişi. @tr

is variant access point for place of
status: Published
type: Property
lexical alias: variantAccessPointForPlaceOf.en
definition: Relates a nomen to a place that has an access point for place that is not selected for preference in a specific vocabulary encoding scheme.
domain: C10012
toolkit label: variant access point for place of
toolkit definition: A place that has an access point for place that is not selected for preference in a specific vocabulary encoding scheme.
sub property of: is access point for place of
has element type: 2
sub property of: is variant access point for RDA entity of
label: varianttihakutieto paikalle @fi
definition: Liittää nomenin paikkaan, jonka hakutietoa ei ole valittu ensisijaiseksi tietyssä sanaston merkintäjärjestelmässä. @fi
toolkit label: varianttihakutieto paikalle @fi
toolkit definition: Paikka, jonka hakutietoa ei ole valittu ensisijaiseksi tietyssä sanaston merkintäjärjestelmässä. @fi
label: er alternativ søkeinngang for sted for @no
definition: Relaterer et nomen til et sted som har en søkeinngang for sted som ikke er valgt som preferanse i et bestemt kodeskjema for vokabular. @no
toolkit label: alternativ søkeinngang for sted for @no
toolkit definition: Et sted som har en søkeinngang for sted som ikke er valgt som preferanse i et bestemt kodeskjema for vokabular. @no
label: est une variante de point d’accès d’un lieu de @fr
definition: Met un nomen en relation avec un lieu qui possède un point d’accès d’un lieu ne faisant pas l’objet d’un choix privilégié dans un schéma d’encodage de vocabulaire spécifique. @fr
toolkit label: variante de point d’accès d’un lieu de @fr
toolkit definition: Lieu qui possède un point d’accès d’un lieu ne faisant pas l’objet d’un choix privilégié dans un schéma d’encodage de vocabulaire spécifique. @fr
label: is variant ingang voor plaats van @nl
definition: Relateert een nomen aan een plaats die een ingang voor plaats heeft die niet als voorkeursterm geselecteerd is in een specifiek vocabulair coderingssysteem. @nl
toolkit label: variant ingang voor plaats van @nl
toolkit definition: Een plaats die een ingang voor plaats heeft die niet als voorkeursterm geselecteerd is in een specifiek vocabulair coderingssysteem. @nl
label: هي نقطة وصول مختلفة لمكان لـ @ar
definition: يربط تسمية بمكان له نقطة وصول لمكان اختيرت للتفضيل في خطة ترميز مفردات محددة. @ar
toolkit label: نقطة وصول مختلفة لمكان لـ @ar
toolkit definition: مكان له نقطة وصول لمكان لم تُختر للتفضيل في خطة ترميز مفردات محددة. @ar
label: és variant de punt d’accés de lloc de @ca
definition: Relaciona un nomen amb un lloc que té un punt d’accés de lloc que no se selecciona com a preferent en un esquema de codificació de vocabulari específic. @ca
toolkit label: variant de punt d’accés de lloc de @ca
toolkit definition: Lloc que té un punt d’accés de lloc que no se selecciona com a preferent en un esquema de codificació de vocabulari específic. @ca
label: er variant af søgeindgang for sted af @da
definition: Relaterer et nomen til et sted, som har en søgeindgang for sted, som ikke er valgt som præference i et specifikt vokabularkodningsskema. @da
toolkit label: variant af søgeindgang for sted af @da
toolkit definition: Sted, som har en søgeindgang for sted, som ikke er valgt som præference i et specifikt vokabularkodningsskema. @da
label: otsielemendi variant kohale @et
definition: Seostab nomen'i kohaga, millel on otsielement, mis ei ole valitud eelistatuks vastavas leksikaalses märkimissüsteemis. @et
toolkit label: otsielemendi variant kohale @et
toolkit definition: Koht, millel on otsielement, mis ei ole valitud eelistatuks vastavas leksikaalses märkimissüsteemis. @et
label: ist zusätzlicher Sucheinstieg für ein Geografikum von @de
definition: Setzt ein Nomen in Beziehung zu einem Geografikum, das über einen Sucheinstieg für ein Geografikum verfügt, der in einem bestimmten Vocabulary Encoding Scheme nicht als Vorzugsform bestimmt wird. @de
toolkit label: Zusätzlicher Sucheinstieg für ein Geografikum von @de
toolkit definition: Ein Geografikum, das über einen Sucheinstieg für ein Geografikum verfügt, der in einem bestimmten Vocabulary Encoding Scheme nicht als Vorzugsform bestimmt wird. @de
label: hozzáférésipont-variánsa a következő helynek: @hu
definition: Hozzákapcsol egy noment egy helyhez, amelynek van egy olyan hozzáférési pontja entitás a helyhez, amely egy bizonyos szótárkódolási sémában nem részesül előnyben. @hu
toolkit label: hozzáférésipont-variánsa a következő helynek: @hu
toolkit definition: Egy hely, amelynek van egy olyan hozzáférési pontja entitás a helyhez, amely egy bizonyos szótárkódolási sémában nem részesül előnyben. @hu
label: è punto d'accesso variante per luogo di @it
definition: Correla un nomen a un luogo che ha un punto d'accesso per il luogo che non è stato selezionato come preferito in uno specifico schema di codifica di vocabolario. @it
toolkit label: punto d'accesso variante per luogo di @it
toolkit definition: Un luogo che ha un punto d'accesso per il luogo che non è stato selezionato come preferito in uno specifico schema di codifica di vocabolario. @it
label: ir papildforma vietai @lv
definition: Sasaista nomenu ar vietu, kurai ir piekļuves punkts vietai, kas nav izvēlēta kā prioritāra noteiktai kontrolētas vārdnīcas shēmai. @lv
toolkit label: ir papildforma vietai @lv
toolkit definition: Vieta, kurai ir piekļuves punkts vietai, kas nav izvēlēta kā prioritāra noteiktai kontrolētas vārdnīcas shēmai. @lv
label: 是……的地点的变异检索点 @zh-hans
definition: 将一个命名与有在一个特定的词表编码体系中未被首选的地点检索点的一个地点关联起来。 @zh-hans
toolkit label: ……的地点的变异检索点 @zh-hans
toolkit definition: 有在一个特定的词表编码体系中未被首选的地点检索点 @zh-hans
has subproperty: P80086
label: yer için farklı erişim noktası @tr
definition: Bir ismi, belirli bir kelime kodlama şemasında tercih için seçilmeyen bir yer için erişim noktası olan bir yerle ilişkilendirir. @tr
toolkit label: yer için alternatif erişim noktası @tr
toolkit definition: Belirli bir kelime kodlama şemasında tercih için seçilmeyen bir yer için erişim noktası olan bir yer. @tr

is variant access point for RDA entity of
status: Published
type: Property
lexical alias: variantAccessPointForRDAEntityOf.en
definition: Relates a nomen to an RDA entity that has an access point for entity that is not selected for preference in a specific vocabulary encoding scheme.
domain: C10012
toolkit label: variant access point for RDA entity of
toolkit definition: An RDA entity that has an access point for RDA entity that is not selected for preference in a specific vocabulary encoding scheme.
has element type: 2
sub property of: is access point for RDA entity of
label: varianttihakutieto RDA-entiteetille @fi
definition: Liittää nomenin RDA-entiteettiin, jonka hakutietoa ei ole valittu ensisijaiseksi tietyssä sanaston merkintäjärjestelmässä. @fi
toolkit label: varianttihakutieto RDA-entiteetille @fi
toolkit definition: RDA-entiteetti, jonka hakutietoa ei ole valittu ensisijaiseksi tietyssä sanaston merkintäjärjestelmässä. @fi
label: er alternativ søkeinngang for RDA-entitet for @no
definition: Relaterer et nomen til en RDA-entitet som har en søkeinngang for RDA-entitet som ikke er valgt som preferanse i et bestemt kodeskjema for vokabular. @no
toolkit label: alternativ søkeinngang for RDA-entitet for @no
toolkit definition: En RDA-entitet som har en søkeinngang for RDA-entitet som ikke er valgt som preferanse i et bestemt kodeskjema for vokabular. @no
label: est une variante de point d’accès d’une entité RDA de @fr
definition: Met un nomen en relation avec une entité RDA qui possède un point d’accès d’une entité RDA ne faisant pas l’objet d’un choix privilégié dans un schéma d’encodage de vocabulaire spécifique. @fr
toolkit label: variante de point d’accès d’une entité RDA de @fr
toolkit definition: Entité RDA qui possède un point d’accès d’une entité RDA ne faisant pas l’objet d’un choix privilégié dans un schéma d’encodage de vocabulaire spécifique. @fr
label: is variant ingang voor RDA-entiteit van @nl
definition: Relateert een nomen aan een RDA-entiteit die een ingang voor RDA-entiteit heeft die niet als voorkeursterm geselecteerd is in een specifieke toepassing of context. @nl
toolkit label: variant ingang voor RDA-entiteit van @nl
toolkit definition: Een RDA-entiteit die een ingang voor RDA-entiteit heeft die niet als voorkeursterm geselecteerd is in een specifieke toepassing of context. @nl
label: هي نقطة وصول مختلفة لكيان "وام" لـ @ar
definition: يربط تسمية بكيان "وام" له نقطة وصول لكيان لم تُختر للتفضيل في خطة ترميز مفردات محددة. @ar
toolkit label: نقطة وصول مختلفة لكيان "وام" لـ @ar
toolkit definition: كيان "وام" له نقطة وصول لكيان "وام" لم تُختر للتفضيل في خطة ترميز مفردات محددة. @ar
label: és variant de punt d’accés d’entitat RDA de @ca
definition: Relaciona un nomen amb una entitat RDA que té un punt d’accés d’entitat RDA que no se selecciona com a preferent en un esquema de codificació de vocabulari específic. @ca
toolkit label: variant de punt d’accés d’entitat RDA de @ca
toolkit definition: Entitat RDA que té un punt d’accés d’entitat RDA que no se selecciona com a preferent en un esquema de codificació de vocabulari específic. @ca
label: er variant af søgeindgang for RDA-entitet af @da
definition: Relaterer et nomen til en RDA-entitet, som har en søgeindgang for entitet, som ikke er valgt som præference i et specifikt vokabularkodningsskema. @da
toolkit label: variant af søgeindgang for RDA-entitet af @da
toolkit definition: RDA-entitet, som har en søgeindgang for entitet, som ikke er valgt som præference i et specifikt vokabularkodningsskema. @da
label: otsielemendi variant RDA olemile @et
definition: Seostab nomen'i RDA olemiga, millel on otsielement, mis ei ole valitud eelistatuks vastavas leksikaalses märkimissüsteemis. @et
toolkit label: otsielemendi variant RDA olemile @et
toolkit definition: RDA olem, millel on otsielement, mis ei ole valitud eelistatuks vastavas leksikaalses märkimissüsteemis. @et
label: ist zusätzlicher Sucheinstieg für eine RDA-Entität von @de
definition: Setzt ein Nomen in Beziehung zu einer RDA-Entität, die über einen Sucheinstieg für eine RDA-Entität verfügt, der in einem bestimmten Vocabulary Encoding Scheme nicht als Vorzugsform bestimmt wird. @de
toolkit label: Zusätzlicher Sucheinstieg für eine RDA-Entität von @de
toolkit definition: Eine RDA-Entität, die über einen Sucheinstieg für eine RDA-Entität verfügt, der in einem bestimmten Vocabulary Encoding Scheme nicht als Vorzugsform bestimmt wird. @de
label: hozzáférési pont változata a következő RDA-entitás számára: @hu
definition: Hozzákapcsol egy noment egy olyan RDA-entitáshoz, amelynek van egy olyan hozzáférési pontja az RDA-entitás számára, amely egy speciális szótárkódolási sémából kiválasztva nem részesül előnyben. @hu
toolkit label: hozzáférési pont változata a következő RDA-entitás számára: @hu
toolkit definition: Egy RDA-entitás, amelynek van egy olyan hozzáférési pontja az RDA-entitás számára, amely egy speciális szótárkódolási sémából kiválasztva nem részesül előnyben. @hu
label: è punto d'accesso variante per l'entità RDA di @it
definition: Correla un nomen a un'entità RDA che ha un punto d'accesso per l'entità RDA che non è stato selezionato come preferito in uno specifico schema di codifica di vocabolario. @it
toolkit label: punto d'accesso variante per l'entità RDA di @it
toolkit definition: Un'entità RDA che ha un punto d'accesso per l'entità RDA che non è stato selezionato come preferito in uno specifico schema di codifica di vocabolario. @it
label: ir papildforma RDA entītei @lv
definition: Sasaista nomenu ar RDA entīti, kurai ir piekļuves punkts Sasaista nomenu ar RDA entītii, kas nav izvēlēta kā prioritāra noteiktai kontrolētas vārdnīcas shēmai. @lv
toolkit label: ir papildforma RDA entītei @lv
toolkit definition: RDA entīte, kurai ir piekļuves punkts RDA entītei, kas nav izvēlēta kā prioritāra noteiktai kontrolētas vārdnīcas shēmai. @lv
label: 是……的RDA实体的变异检索点 @zh-hans
definition: 将一个命名与有在一个特定的词表编码体系中未被首选的RDA实体检索点的一个RDA实体关联起来。 @zh-hans
toolkit label: ……的RDA实体的变异检索点 @zh-hans
toolkit definition: 有在一个特定的词表编码体系中未被首选的RDA实体检索点的一个RDA实体 @zh-hans
has subproperty: is variant access point for agent of
has subproperty: is variant access point for expression of
has subproperty: is variant access point for item of
has subproperty: is variant access point for manifestation of
has subproperty: is variant access point for place of
has subproperty: is variant access point for timespan of
has subproperty: is variant access point for work of
has subproperty: P80165
label: RDA öğesinin farklı erişim noktasıdır @tr
definition: Bir ismi, belirli bir kelime kodlama şemasında tercih edilmek üzere seçilmeyen RDA varlığıyla ilişkilendirir. @tr
toolkit label: RDA varlığı için alternatif erişim noktası @tr
toolkit definition: Belirli bir kelime kodlama şemasında tercih edilmek üzere seçilmeyen bir RDA varlığına erişim noktası olan bir RDA varlığı. @tr

is variant access point for timespan of
status: Published
type: Property
lexical alias: variantAccessPointForTimespanOf.en
definition: Relates a nomen to a timespan that has an access point for timespan that is not selected for preference in a specific vocabulary encoding scheme.
domain: C10012
toolkit label: variant access point for timespan of
toolkit definition: A timespan that has an access point for timespan that is not selected for preference in a specific vocabulary encoding scheme.
sub property of: is access point for timespan of
has element type: 2
sub property of: is variant access point for RDA entity of
label: varianttihakutieto ajanjaksolle @fi
definition: Liittää nomenin ajanjaksoon, jonka hakutietoa ei ole valittu ensisijaiseksi tietyssä sanaston merkintäjärjestelmässä. @fi
toolkit label: varianttihakutieto ajanjaksolle @fi
toolkit definition: Ajanjakso, jonka hakutietoa ei ole valittu ensisijaiseksi tietyssä sanaston merkintäjärjestelmässä. @fi
label: er alternativ søkeinngang for tidsrom for @no
definition: Relaterer et nomen til et tidsrom som har en søkeinngang for tidsrom som ikke er valgt som preferanse i et bestemt kodeskjema for vokabular. @no
toolkit label: alternativ søkeinngang for tidsrom for @no
toolkit definition: Et tidsrom som har en søkeinngang for tidsrom som ikke er valgt som preferanse i et bestemt kodeskjema for vokabular. @no
label: est une variante de point d’accès d’un laps de temps de @fr
definition: Met un nomen en relation avec un laps de temps qui possède un point d’accès d’un laps de temps ne faisant pas l’objet d’un choix privilégié dans un schéma d’encodage de vocabulaire spécifique. @fr
toolkit label: variante de point d’accès d’un laps de temps de @fr
toolkit definition: Laps de temps qui possède un point d’accès d’un laps de temps ne faisant pas l’objet d’un choix privilégié dans un schéma d’encodage de vocabulaire spécifique. @fr
label: is variant ingang voor tijdspanne van @nl
definition: Relateert een nomen aan een tijdspanne die een ingang voor tijdspanne heeft die niet als voorkeursterm geselecteerd is in een specifiek vocabulair coderingssysteem. @nl
toolkit label: variant ingang voor tijdspanne van @nl
toolkit definition: Een tijdspanne die een ingang voor tijdspanne heeft die niet als voorkeursterm geselecteerd is in een specifiek vocabulair coderingssysteem. @nl
label: هي نقطة وصول مختلفة لفترة زمنية لـ @ar
definition: يربط تسمية بفترة زمنية لها نقطة وصول لفترة زمنية، لم تُختر للتفضيل في خطة ترميز مفردات محددة. @ar
toolkit label: نقطة وصول مختلفة لفترة زمنية لـ @ar
toolkit definition: فترة زمنية لها نقطة وصول لفترة زمنية، لم تُختر للتفضيل في خطة ترميز مفردات محددة. @ar
label: és variant de punt d’accés d’interval de temps de @ca
definition: Relaciona un nomen amb un interval de temps que té un punt d’accés d’interval de temps que no se selecciona com a preferent en un esquema de codificació de vocabulari específic. @ca
toolkit label: variant de punt d’accés d’interval de temps de @ca
toolkit definition: Interval de temps que té un punt d’accés d’interval de temps que no se selecciona com a preferent en un esquema de codificació de vocabulari específic. @ca
label: er variant af søgeindgang for tidsperiode af @da
definition: Relaterer et nomen til en tidsperiode, som har en søgeindgang for tidsperiode, som ikke er valgt som præference i et specifikt vokabularkodningsskema. @da
toolkit label: variant af søgeindgang for tidsperiode af @da
toolkit definition: Tidsperiode, som har en søgeindgang for tidsperiode, som ikke er valgt som præference i et specifikt vokabularkodningsskema. @da
label: otsielemendi variant ajavahemikule @et
definition: Seostab nomen'i ajavahemikuga, millel on otsielement, mis ei ole valitud eelistatuks vastavas leksikaalses märkimissüsteemis. @et
toolkit label: otsielemendi variant ajavahemikule @et
toolkit definition: Ajavahemik, millel on otsielement, mis ei ole valitud eelistatuks vastavas leksikaalses märkimissüsteemis. @et
label: ist zusätzlicher Sucheinstieg für einen Zeitraum von @de
definition: Setzt ein Nomen in Beziehung zu einem Zeitraum, der über einen Sucheinstieg für einen Zeitraum verfügt, der in einem bestimmten Vocabulary Encoding Scheme nicht als Vorzugsform bestimmt wird. @de
toolkit label: Zusätzlicher Sucheinstieg für einen Zeitraum von @de
toolkit definition: Ein Zeitraum, der über einen Sucheinstieg für einen Zeitraum verfügt, der in einem bestimmten Vocabulary Encoding Scheme nicht als Vorzugsform bestimmt wird. @de
label: hozzáférésipont-változata a következő időtartamnak: @hu
definition: Hozzákapcsol egy noment egy időtartamhoz, amelynek van egy olyan hozzáférési pontja időtartam számára, amelyet egy adott szótárkódolási sémában nem részesítenek előnyben. @hu
toolkit label: hozzáférésipont-változata a következő időtartamnak: @hu
toolkit definition: Egy időtartam, amelynek van egy olyan hozzáférési pontja időtartam számára, amelyet egy adott szótárkódolási sémában nem részesítenek előnyben. @hu
label: è punto d'accesso variante per arco di tempo di @it
definition: Correla un nomen a un arco di tempo che ha un punto d'accesso per l'arco di tempo che non è stato selezionato come preferito in uno specifico schema di codifica di vocabolario. @it
toolkit label: punto d'accesso variante per arco di tempo di @it
toolkit definition: Un arco di tempo che ha un punto d'accesso per l'arco di tempo che non è stato selezionato come preferito in uno specifico schema di codifica di vocabolario. @it
label: ir papildforma laikposmam @lv
definition: Sasaista nomenu ar laikposmu, kuram ir piekļuves punkts laikposmam, kas nav izvēlēts kā prioritārs noteiktai kontrolētas vārdnīcas shēmai. @lv
toolkit label: ir papildforma laikposmam @lv
toolkit definition: Laikposms, kuram ir piekļuves punkts laikposmam, kas nav izvēlēts kā prioritārs noteiktai kontrolētas vārdnīcas shēmai. @lv
label: 是……的时间段的变异检索点 @zh-hans
definition: 将一个命名与有在一个特定的词表编码体系中未被首选的时间段检索点的一个时间段关联起来。 @zh-hans
toolkit label: ……的时间段的变异检索点 @zh-hans
toolkit definition: 有在一个特定的词表编码体系中未被首选的时间段检索点的一个时间段 @zh-hans
has subproperty: P80082
label: zaman aralığı için farklı erişim noktası @tr
definition: Bir ismi, belirli bir kelime kodlama şemasında tercih için seçilmeyen zaman aralığı için erişim noktası olan bir zaman aralığıyla ilişkilendirir. @tr
toolkit label: zaman aralığı için alternatif erişim noktası @tr
toolkit definition: Belirli bir kelime kodlama şemasında tercih için seçilmeyen zaman aralığı için bir erişim noktası olan bir zaman aralığı. @tr

is variant access point for work of
status: Published
type: Property
lexical alias: variantAccessPointForWorkOf.en
definition: Relates a nomen to a work that has an access point for work that is not selected for preference in a specific vocabulary encoding scheme.
domain: C10012
toolkit label: variant access point for work of
toolkit definition: A work that has an access point for work that is not selected for preference in a specific vocabulary encoding scheme.
sub property of: is access point for work of
has element type: 2
sub property of: is variant access point for RDA entity of
label: varianttihakutieto teokselle @fi
definition: Liittää nomenin teokseen, jonka hakutietoa ei ole valittu ensisijaiseksi tietyssä sanaston merkintäjärjestelmässä. @fi
toolkit label: varianttihakutieto teokselle @fi
toolkit definition: Teos, jonka hakutietoa ei ole valittu ensisijaiseksi tietyssä sanaston merkintäjärjestelmässä. @fi
label: er alternativ søkeinngang for verk for @no
definition: Relaterer et nomen til et verk som har en søkeinngang for verk som ikke er valgt som preferanse i et bestemt kodeskjema for vokabular. @no
toolkit label: alternativ søkeinngang for verk for @no
toolkit definition: Et verk som har en søkeinngang for verk som ikke er valgt som preferanse i et bestemt kodeskjema for vokabular. @no
label: est une variante de point d’accès d’une œuvre de @fr
definition: Met un nomen en relation avec une œuvre qui possède un point d’accès d’une œuvre ne faisant pas l’objet d’un choix privilégié dans un schéma d’encodage de vocabulaire spécifique. @fr
toolkit label: variante de point d’accès d’une œuvre de @fr
toolkit definition: Œuvre qui possède un point d’accès d’une œuvre ne faisant pas l’objet d’un choix privilégié dans un schéma d’encodage de vocabulaire spécifique. @fr
label: is variant ingang voor werk van @nl
definition: Relateert een nomen aan een werk dat een ingang voor werk heeft die niet als voorkeursterm geselecteerd is in een specifiek vocabulair coderingssysteem. @nl
toolkit label: variant ingang voor werk van @nl
toolkit definition: Een werk dat een ingang voor werk heeft die niet als voorkeursterm geselecteerd is in een specifiek vocabulair coderingssysteem. @nl
label: هي نقطة وصول مختلفة لعمل لـ @ar
definition: يربط تسمية بعمل له نقطة وصول لعمل، لم تُختر للتفضيل في خطة ترميز مفردات محددة. @ar
toolkit label: نقطة وصول مختلفة لعمل لـ @ar
toolkit definition: عمل له نقطة وصول لعمل، لم تُختر للتفضيل في خطة ترميز مفردات محددة. @ar
label: és variant de punt d’accés d’obra de @ca
definition: Relaciona un nomen amb una obra que té un punt d’accés d’obra que no se selecciona com a preferent en un esquema de codificació de vocabulari específic. @ca
toolkit label: variant de punt d’accés d’obra de @ca
toolkit definition: Obra que té un punt d’accés d’obra que no se selecciona com a preferent en un esquema de codificació de vocabulari específic. @ca
label: er variant af søgeindgang for værk af @da
definition: Relaterer et nomen til et værk, som har en søgeindgang for værk, som ikke er valgt som præference i et specifikt vokabularkodningsskema. @da
toolkit label: variant af søgeindgang for værk af @da
toolkit definition: Værk, som har en søgeindgang for værk, som ikke er valgt som præference i et specifikt vokabularkodningsskema. @da
label: otsielemendi variant teosele @et
definition: Seostab nomen'i teosega, millel on otsielement, mis ei ole valitud eelistatuks vastavas leksikaalses märkimissüsteemis. @et
toolkit label: otsielemendi variant teosele @et
toolkit definition: Teos, millel on otsielement, mis ei ole valitud eelistatuks vastavas leksikaalses märkimissüsteemis. @et
label: ist zusätzlicher Sucheinstieg für ein Werk von @de
definition: Setzt ein Nomen in Beziehung zu einem Werk, das über einen Sucheinstieg für ein Werk verfügt, der in einem bestimmten Vocabulary Encoding Scheme nicht als Vorzugsform bestimmt wird. @de
toolkit label: Zusätzlicher Sucheinstieg für ein Werk von @de
toolkit definition: Ein Werk, das über einen Sucheinstieg für ein Werk verfügt, der in einem bestimmten Vocabulary Encoding Scheme nicht als Vorzugsform bestimmt wird. @de
label: hozzáférésipont-variánsa a következő műnek: @hu
definition: Hozzákapcsol egy noment egy műhoz, amelynek van egy olyan hozzáférési pontja a műhöz, amely egy bizonyos szótárkódolási sémában nem részesül előnyben. @hu
toolkit label: hozzáférésipont-variánsa a következő műnek: @hu
toolkit definition: Egy mű, amelynek van egy olyan hozzáférési pontja a műhöz, amely egy bizonyos szótárkódolási sémában nem részesül előnyben. @hu
label: è punto d'accesso variante per opera di @it
definition: Correla un nomen a un'opera che ha un punto d'accesso per l'opera che non è stato selezionato come preferito in uno specifico schema di codifica di vocabolario. @it
toolkit label: punto d'accesso variante per opera di @it
toolkit definition: Un'opera che ha un punto d'accesso per l'opera che non è stato selezionato come preferito in uno specifico schema di codifica di vocabolario. @it
label: ir cita vārdforma darbam @lv
definition: Sasaista nomenu ar darbu, kam ir vārdforma, kas nav izvēlēta kā prioritāra noteiktai kontrolētas vārdnīcas shēmai. @lv
toolkit label: ir cita vārdforma darbam @lv
toolkit definition: Darbs, kam ir vārdforma, kas nav izvēlēta kā prioritāra noteiktai kontrolētas vārdnīcas shēmai. @lv
label: 是……的作品的变异检索点 @zh-hans
definition: 将一个命名与有在一个特定的词表编码体系中未被首选的作品检索点的一种作品关联起来。 @zh-hans
toolkit label: ……的作品的变异检索点 @zh-hans
toolkit definition: 有在一个特定的词表编码体系中未被首选的作品检索点的一种作品 @zh-hans
has subproperty: P80080
label: eser için farklı erişim noktası @tr
definition: Bir ismi, belirli bir kelime kodlama şemasında tercih edilmeyen bir eser için erişim noktası olan bir eserle ilişkilendirir. @tr
toolkit label: eser için alternatif erişim noktası @tr
toolkit definition: Belirli bir kelime kodlama şemasında tercihen seçilmemiş eser için bir erişim noktası olan bir eser. @tr

is variant name of agent of
status: Published
type: Property
lexical alias: variantNameOfAgentOf.en
domain: C10012
toolkit label: variant name of agent of
definition: Relates a nomen to an agent who has a name of agent that is not selected for preference in a specific application or context.
toolkit definition: An agent who has a name of agent that is not selected for preference in a specific application or context.
sub property of: is name of agent of
has element type: 2
sub property of: is variant name of RDA entity of
label: varianttinimi toimijalle @fi
definition: Liittää nomenin toimijaan, jonka nimeä ei ole valittu ensisijaiseksi tietyssä sovelluksessa tai kontekstissa. @fi
toolkit label: varianttinimi toimijalle @fi
toolkit definition: Toimija, jonka nimeä ei ole valittu ensisijaiseksi tietyssä sovelluksessa tai kontekstissä. @fi
label: er alternativt navn på agent for @no
definition: Relaterer et nomen til en agent som har et navn for agent som ikke er valgt som preferanse i en bestemt applikasjon eller kontekst. @no
toolkit label: alternativt navn på agent for @no
toolkit definition: En agent som har et navn for agent som ikke er valgt som preferanse i en bestemt applikasjon eller kontekst. @no
label: est une variante de nom d’agent de @fr
definition: Met un nomen en relation avec un agent qui possède un nom d’agent ne faisant pas l’objet d’un choix privilégié dans un schéma d’encodage de vocabulaire spécifiques. @fr
toolkit label: variante de nom d’agent de @fr
toolkit definition: Agent qui possède un nom d’agent ne faisant pas l’objet d’un choix privilégié dans un schéma d’encodage de vocabulaire spécifiques. @fr
label: is variant naam van actor van @nl
definition: Relateert een nomen aan een actor die een naam van actor heeft die niet als voorkeursterm geselecteerd is in een specifieke toepassing of context. @nl
toolkit label: variant naam van actor van @nl
toolkit definition: Een actor die een naam van actor heeft die niet als voorkeursterm geselecteerd is in een specifieke toepassing of context. @nl
label: هو اسم مختلف لوكيل لـ @ar
definition: يربط تسمية بوكيل له اسم وكيل لم يُختر للتفضيل في تطبيق أو في سياق معين. @ar
toolkit label: اسم مختلف لوكيل لـ @ar
toolkit definition: وكيل له اسم وكيل لم يُختر للتفضيل في تطبيق أو في سياق معين. @ar
label: és variant de nom d’agent de @ca
definition: Relaciona un nomen amb un agent que té un nom d’agent que no se selecciona com a preferent en una aplicació o un context específic. @ca
toolkit label: variant de nom d’agent de @ca
toolkit definition: Agent que té un nom d’agent que no se selecciona com a preferent en una aplicació o un context específic. @ca
label: er variant af navn på agent af @da
definition: Relaterer et nomen til en agent, som har et navn på agent, som ikke er valgt som præference i en specifik anvendelse eller kontekst. @da
toolkit label: variant af navn på agent af @da
toolkit definition: Agent, som har et navn på agent, som ikke er valgt som præference i en specifik anvendelse eller kontekst. @da
label: variantnimi tegijale @et
definition: Seostab nomen'i tegijaga, kellel on nimi, mis kindlas rakenduses või kontekstis ei ole valitud eelistatuks. @et
toolkit label: variantnimi tegijale @et
toolkit definition: Tegija, kellel on nimi, mis kindlas rakenduses või kontekstis ei ole valitud eelistatuks. @et
label: ist abweichender Name eines Akteurs von @de
definition: Setzt ein Nomen in Beziehung zu einem Akteur, der über einen Namen für einen Akteur verfügt, der in einer bestimmten Anwendung oder in einem bestimmten Kontext nicht als Vorzugsform bestimmt wird. @de
toolkit label: Abweichender Name eines Akteurs von @de
toolkit definition: Ein Akteur, der über einen Namen für einen Akteur verfügt, der in einer bestimmten Anwendung oder in einem bestimmten Kontext nicht als Vorzugsform bestimmt wird. @de
label: névváltozata a következő ágensnek: @hu
definition: Hozzákapcsol egy noment egy ágenshez, amelynek van egy olyan ágensneve, amelyet egy adott alkalmazásban vagy kontextusban nem részesítenek előnyben. @hu
toolkit label: névváltozata a következő ágensnek: @hu
toolkit definition: Egy ágens, amelynek van egy olyan ágensneve, amelyet egy adott alkalmazásban vagy kontextusban nem részesítenek előnyben. @hu
label: è nome variante dell'agente di @it
definition: Correla un nomen a un agente che ha un nome di agente che non è stato selezionato come preferito in una specifica applicazione o contesto. @it
toolkit label: nome variante dell'agente di @it
toolkit definition: Un agente che ha un nome di agente che non è stato selezionato come preferito in una specifica applicazione o contesto. @it
label: ir cits vārds/nosaukums aģentam @lv
toolkit label: ir cits vārds/nosaukums aģentam @lv
definition: Sasaista nomenu ar aģentu, kam ir aģenta vārds/nosaukums, kurš nav izvēlēts kā prioritārs noteiktā lietojumprogrammā vai kontekstā. @lv
toolkit definition: Aģents, kam ir aģenta vārds/nosaukums, kurš nav izvēlēts kā prioritārs noteiktā lietojumprogrammā vai kontekstā. @lv
label: 是……的行为者的变异名称 @zh-hans
toolkit label: ……的行为者的变异名称 @zh-hans
definition: 将一个命名与有在一个特定的应用或语境下未被首选的一个行为者名称的一个行为者关联起来。 @zh-hans
toolkit definition: 有在一个特定的应用或语境下未被首选的一个行为者名称的一个行为者 @zh-hans
has subproperty: is variant name of collective agent of
has subproperty: is variant name of person of
has subproperty: P80142
label: temsilcisinin farklı ismi @tr
toolkit label: temsilcinin için alternatif ismi @tr
definition: Bir ismi, belirli bir uygulama veya bağlamda tercih için seçilmeyen bir temsilci adına sahip olan bir temsilciyle ilişkilendirir. @tr
toolkit definition: Belirli bir uygulama veya bağlamda tercih edilmek için seçilmeyen bir temsilci adına sahip bir temsilci. @tr

is variant name of collective agent of
status: Published
type: Property
lexical alias: variantNameOfCollectiveAgentOf.en
domain: C10012
toolkit label: variant name of collective agent of
sub property of: is name of collective agent of
definition: Relates a nomen to a collective agent who has a name of collective agent that is not selected for preference in a specific application or context.
sub property of: is variant name of agent of
toolkit definition: A collective agent who has a name of collective agent that is not selected for preference in a specific application or context.
has element type: 2
label: varianttinimi yhteistoimijalle @fi
definition: Liittää nomenin yhteistoimijaan, jonka nimeä ei ole valittu ensisijaiseksi tietyssä sovelluksessa tai kontekstissä. @fi
toolkit label: varianttinimi yhteistoimijalle @fi
toolkit definition: Yhteistoimija, jonka nimeä ei ole valittu ensisijaiseksi tietyssä sovelluksessa tai kontekstissä. @fi
label: er alternativt navn på kollektiv agent for @no
definition: Relaterer et nomen til en kollektiv agent som har et navn for kollektiv agent som ikke er valgt som preferanse i en bestemt applikasjon eller kontekst. @no
toolkit label: alternativt navn på kollektiv agent for @no
toolkit definition: En kollektiv agent som har et navn for kollektiv agent som ikke er valgt som preferanse i en bestemt applikasjon eller kontekst. @no
label: est une variante de nom d’agent collectif de @fr
definition: Met un nomen en relation avec un agent collectif qui possède un nom d’agent collectif ne faisant pas l’objet d’un choix privilégié dans un schéma d’encodage de vocabulaire spécifiques. @fr
toolkit label: variante de nom d’agent collectif de @fr
toolkit definition: Agent collectif qui possède un nom d’agent collectif ne faisant pas l’objet d’un choix privilégié dans un schéma d’encodage de vocabulaire spécifiques. @fr
label: is variant naam van collectieve actor van @nl
definition: Relateert een nomen aan een collectieve actor die een naam van collectieve actor heeft die niet als voorkeursterm geselecteerd is in een specifieke toepassing of context. @nl
toolkit label: variant naam van collectieve actor van @nl
toolkit definition: Een collectieve actor die een naam van collectieve actor heeft die niet als voorkeursterm geselecteerd is in een specifieke toepassing of context. @nl
label: هو اسم وكيل جماعي مختلف لـ @ar
definition: يربط تسمية بوكيل جماعي له اسم وكيل جماعي لم يُختر للتفضيل في تطبيق أو في سياق معين. @ar
toolkit label: اسم وكيل جماعي مختلف لـ @ar
toolkit definition: وكيل جماعي له اسم وكيل جماعي لم يُختر للتفضيل في تطبيق أو في سياق معين. @ar
label: és variant de nom d’agent col·lectiu de @ca
definition: Relaciona un nomen amb un agent col·lectiu que té un nom d’agent col·lectiu que no se selecciona com a preferent en una aplicació o un context específic. @ca
toolkit label: variant de nom d’agent col·lectiu de @ca
toolkit definition: Agent col·lectiu que té un nom d’agent col·lectiu que no se selecciona com a preferent en una aplicació o un context específic. @ca
label: er variant af navn på kollektiv agent af @da
definition: Relaterer et nomen til en kollektiv agent, som har et navn på kollektiv agent, som ikke er valgt som præference i en specifik anvendelse eller kontekst. @da
toolkit label: variant af navn på kollektiv agent af @da
toolkit definition: Kollektiv agent, som har et navn på kollektiv agent, som ikke er valgt som præference i en specifik anvendelse eller kontekst. @da
label: variantnimi kollektiivile @et
definition: Seostab nomen'i kollektiiviga, kellel on nimi, mis kindlas rakenduses või kontekstis ei ole valitud eelistatuks. @et
toolkit label: variantnimi kollektiivile @et
toolkit definition: Kollektiiv, kellel on nimi, mis kindlas rakenduses või kontekstis ei ole valitud eelistatuks. @et
label: ist abweichender Name eines gemeinschaftlichen Akteurs von @de
definition: Setzt ein Nomen in Beziehung zu einem gemeinschaftlichen Akteur, der über einen Namen für einen gemeinschaftlichen Akteur verfügt, der in einer bestimmten Anwendung oder in einem bestimmten Kontext nicht als Vorzugsform bestimmt wird. @de
toolkit label: Abweichender Name eines gemeinschaftlichen Akteurs von @de
toolkit definition: Ein gemeinschaftlicher Akteur, der über einen Namen für einen gemeinschaftlichen Akteur verfügt, der in einer bestimmten Anwendung oder in einem bestimmten Kontext nicht als Vorzugsform bestimmt wird. @de
label: névváltozata a következő kollektív ágensnek: @hu
definition: Hozzákapcsol egy noment egy kollektív ágenshez, amelynek van egy olyan kollektívágens-neve, amelyet egy bizonyos alkalmazásban vagy kontextusban nem részesítenek előnyben. @hu
toolkit label: névvariánsa a következő kollektív ágensnek: @hu
toolkit definition: Egy kollektív ágens, amelynek van egy olyan kollektívágens-neve, amelyet egy bizonyos alkalmazásban vagy kontextusban nem részesítenek előnyben. @hu
label: è nome variante dell'agente collettivo di @it
definition: Correla un nomen a un agente collettivo che ha un nome di agente collettico che non è stato selezionato come preferito in una specifica applicazione o contesto. @it
toolkit label: nome variante dell'agente collettivo di @it
toolkit definition: Un agente collettivo che ha un nome di agente collettico che non è stato selezionato come preferito in una specifica applicazione o contesto. @it
label: ir cits vārds/nosaukums grupai @lv
toolkit label: ir cits vārds/nosaukums grupai @lv
definition: Sasaista nomenu ar grupu, kam ir grupas vārds/nosaukums, kurš nav izvēlēts kā prioritārs noteiktā lietojumprogrammā vai kontekstā. @lv
toolkit definition: Grupa, kam ir grupas vārds/nosaukums, kurš nav izvēlēts kā prioritārs noteiktā lietojumprogrammā vai kontekstā. @lv
label: 是……的集体行为者的变异名称 @zh-hans
toolkit label: ……的集体行为者的变异名称 @zh-hans
definition: 将一个命名与有在一个特定的应用或语境下未被首选的一个集体行为者名称的一个集体行为者关联起来。 @zh-hans
toolkit definition: 有在一个特定的应用或语境下未被首选的一个集体行为者名称的一个集体行为者 @zh-hans
has subproperty: is variant name of corporate body of
has subproperty: is variant name of family of
has subproperty: P80143
label: kolektif temsilcisinin farklı ismi @tr
toolkit label: kolektif temsilcinin alternatif ismi @tr
definition: Bir ismi, belirli bir uygulama veya bağlamda tercih için seçilmeyen bir kolektif temsilci adına sahip bir kolektif temsilciyle ilişkilendirir. @tr
toolkit definition: Belirli bir uygulama veya bağlamda tercih için seçilmeyen bir kolektif temsilci adına sahip bir kolektif temsilci. @tr

is variant name of corporate body of
status: Published
type: Property
lexical alias: variantNameOfCorporateBodyOf.en
domain: C10012
sub property of: is name of corporate body of
definition: Relates a nomen to a corporate body who has a name of corporate body that is not selected for preference in a specific application or context.
sub property of: is variant name of collective agent of
toolkit label: variant name of corporate body of
toolkit definition: A corporate body who has a name of corporate body that is not selected for preference in a specific application or context.
has element type: 2
label: varianttinimi yhteisölle @fi
definition: Liittää nomenin yhteisöön, jonka nimeä ei ole valittu ensisijaiseksi tietyssä sovelluksessa tai kontekstissä. @fi
toolkit label: varianttinimi yhteisölle @fi
toolkit definition: Yhteisö, jonka nimeä ei ole valittu ensisijaiseksi tietyssä sovelluksessa tai kontekstissä. @fi
label: er alternativt navn på korporasjon for @no
definition: Relaterer et nomen til en korporasjon som har et navn for korporasjon som ikke er valgt som preferanse i en bestemt applikasjon eller kontekst. @no
toolkit label: alternativt navn på korporasjon for @no
toolkit definition: En korporasjon som har et navn for korporasjon som ikke er valgt som preferanse i en bestemt applikasjon eller kontekst. @no
label: est une variante de nom de collectivité de @fr
definition: Met un nomen en relation avec une collectivité qui possède un nom de collectivité ne faisant pas l’objet d’un choix privilégié dans une application ou un contexte spécifiques. @fr
toolkit label: variante de nom de collectivité de @fr
toolkit definition: Collectivité qui possède un nom de collectivité ne faisant pas l’objet d’un choix privilégié dans une application ou un contexte spécifiques. @fr
label: is variant naam van corporatie van @nl
definition: Relateert een nomen aan een corporatie die een naam van corporatie heeft die niet als voorkeursterm geselecteerd is in een specifieke toepassing of context. @nl
toolkit label: variant naam van corporatie van @nl
toolkit definition: Een corporatie die een naam van corporatie heeft die niet als voorkeursterm geselecteerd is in een specifieke toepassing of context. @nl
label: هو اسم هيئة مختلف لـ @ar
definition: يربط تسمية بهيئة لها اسم هيئة لم يُختر للتفضيل في تطبيق أو في سياق معين. @ar
toolkit label: اسم هيئة مختلف لـ @ar
toolkit definition: هيئة لها اسم هيئة لم يُختر للتفضيل في تطبيق أو في سياق معين. @ar
label: és variant de nom d’entitat corporativa de @ca
definition: Relaciona un nomen amb una entitat corporativa que té un nom d’entitat corporativa que no se selecciona com a preferent en una aplicació o un context específic. @ca
toolkit label: variant de nom d’entitat corporativa de @ca
toolkit definition: Entitat corporativa que té un nom d’entitat corporativa que no se selecciona com a preferent en una aplicació o un context específic. @ca
label: er variant af navn på korporation af @da
definition: Relaterer et nomen til en korporation, som har et navn på korporation, som ikke er valgt som præference i en specifik anvendelse eller kontekst. @da
toolkit label: variant af navn på korporation af @da
toolkit definition: Korporation, som har et navn på korporation, som ikke er valgt som præference i en specifik anvendelse eller kontekst. @da
label: variantnimi asutusele @et
definition: Seostab nomen'i asutusega, kellel on nimi, mis kindlas rakenduses või kontekstis ei ole valitud eelistatuks. @et
toolkit label: variantnimi asutusele @et
toolkit definition: Asutus, kellel on nimi, mis kindlas rakenduses või kontekstis ei ole valitud eelistatuks. @et
label: ist abweichender Name einer Körperschaft von @de
definition: Setzt ein Nomen in Beziehung zu einer Körperschaft, die über einen Namen für eine Körperschaft verfügt, der in einer bestimmten Anwendung oder in einem bestimmten Kontext nicht als Vorzugsform bestimmt wird. @de
toolkit label: Abweichender Name einer Körperschaft von @de
toolkit definition: Eine Körperschaft, die über einen Namen für eine Körperschaft verfügt, der in einer bestimmten Anwendung oder in einem bestimmten Kontext nicht als Vorzugsform bestimmt wird. @de
label: névváltozata a következő testületnek: @hu
definition: Hozzákapcsol egy noment egy testülethez, amelynek van egy olyan testületneve, amelyet egy bizonyos alkalmazásban vagy kontextusban nem részesítenek előnyben. @hu
toolkit label: névváltozata a következő testületnek: @hu
toolkit definition: Egy testület, amelynek van egy olyan testületneve, amelyet egy bizonyos alkalmazásban vagy kontextusban nem részesítenek előnyben. @hu
label: è nome variante dell'ente di @it
definition: Correla un nomen a un ente che ha un nome di ente che non è stato selezionato come preferito in una specifica applicazione o contesto. @it
toolkit label: nome variante dell'ente di @it
toolkit definition: Un ente che ha un nome di ente che non è stato selezionato come preferito in una specifica applicazione o contesto. @it
label: ir cits vārds/nosaukums institūcijai @lv
definition: Sasaista nomenu ar institūciju, kam ir institūcijas vārds/nosaukums, kurš nav izvēlēts kā prioritārs noteiktā lietojumprogrammā vai kontekstā. @lv
toolkit label: ir cits vārds/nosaukums institūcijai @lv
toolkit definition: Institūcija, kam ir institūcijas vārds/nosaukums, kurš nav izvēlēts kā prioritārs noteiktā lietojumprogrammā vai kontekstā. @lv
label: 是……的团体的变异名称 @zh-hans
definition: 将一个命名与有在一个特定的应用或语境下未被首选的一个团体名称的一个团体关联起来。 @zh-hans
toolkit label: ……的团体的变异名称 @zh-hans
toolkit definition: 有在一个特定的应用或语境下未被首选的一个团体名称的一个团体 @zh-hans
has subproperty: P80147
label: tüzel kişiliğinin farklı ismi @tr
definition: Bir ismi, tüzel kişilik adı belirli bir uygulamada veya içerikte tercih edilmek üzere seçilmemiş olan bir tüzel kişililikle ilişkilendirir. @tr
toolkit label: tüzel kişinin alternatif ismi @tr
toolkit definition: Tüzel kişilik adı belirli bir uygulamada veya içerikte tercih edilmek üzere seçilmemiş olan bir tüzel kişililik. @tr

is variant name of family of
status: Published
type: Property
lexical alias: variantNameOfFamilyOf.en
domain: C10012
sub property of: is name of family of
definition: Relates a nomen to a family who has a name of family that is not selected for preference in a specific application or context.
sub property of: is variant name of collective agent of
toolkit label: variant name of family of
toolkit definition: A family who has a name of family that is not selected for preference in a specific application or context.
has element type: 2
label: varianttinimi suvulle @fi
definition: Liittää nomenin sukuun, jonka nimeä ei ole valittu ensisijaiseksi tietyssä sovelluksessa tai kontekstissä. @fi
toolkit label: varianttinimi suvulle @fi
toolkit definition: Suku, jonka nimeä ei ole valittu ensisijaiseksi tietyssä sovelluksessa tai kontekstissä. @fi
label: er alternativt navn på familie for @no
definition: Relaterer et nomen til en familie som har et navn for familie som ikke er valgt som preferanse i en bestemt applikasjon eller kontekst. @no
toolkit label: alternativt navn på familie for @no
toolkit definition: En familie som har et navn for familie som ikke er valgt som preferanse i en bestemt applikasjon eller kontekst. @no
label: est une variante de nom d’une famille de @fr
definition: Met un nomen en relation avec une famille qui possède un nom d’une famille ne faisant pas l’objet d’un choix privilégié dans une application ou un contexte spécifiques. @fr
toolkit label: variante de nom d’une famille de @fr
toolkit definition: Famille qui possède un nom d’une famille ne faisant pas l’objet d’un choix privilégié dans une application ou un contexte spécifiques. @fr
label: is variant naam van familie van @nl
definition: Relateert een nomen aan een familie die een naam van familie heeft die niet als voorkeursterm geselecteerd is in een specifieke toepassing of context. @nl
toolkit label: variant naam van familie van @nl
toolkit definition: Een familie die een naam van familie heeft die niet als voorkeursterm geselecteerd is in een specifieke toepassing of context. @nl
label: هو اسم عائلة مختلف لـ @ar
definition: يربط تسمية بعائلة لها اسم عائلة لم يُختر للتفضيل في تطبيق أو في سياق معين. @ar
toolkit label: اسم عائلة مختلف لـ @ar
toolkit definition: عائلة لها اسم عائلة لم يُختر للتفضيل في تطبيق أو في سياق معين. @ar
label: és variant de nom de família de @ca
definition: Relaciona un nomen amb una família que té un nom de família que no se selecciona com a preferent en una aplicació o un context específic. @ca
toolkit label: variant de nom de família de @ca
toolkit definition: Família que té un nom de família que no se selecciona com a preferent en una aplicació o un context específic. @ca
label: er variant af navn på familie af @da
definition: Relaterer et nomen til en familie, som har et navn på familie, som ikke er valgt som præference i en specifik anvendelse eller kontekst. @da
toolkit label: variant af navn på familie af @da
toolkit definition: Familie, som har et navn på familie, som ikke er valgt som præference i en specifik anvendelse eller kontekst. @da
label: variantnimi perekonnale @et
definition: Seostab nomen'i perekonnaga, kellel on nimi, mis kindlas rakenduses või kontekstis ei ole valitud eelistatuks. @et
toolkit label: variantnimi perekonnale @et
toolkit definition: Perekond, kellel on nimi, mis kindlas rakenduses või kontekstis ei ole valitud eelistatuks. @et
label: ist abweichender Name einer Familie von @de
definition: Setzt ein Nomen in Beziehung zu einer Familie, die über einen Namen für eine Familie verfügt, der in einer bestimmten Anwendung oder in einem bestimmten Kontext nicht als Vorzugsform bestimmt wird. @de
toolkit label: Abweichender Name einer Familie von @de
toolkit definition: Eine Familie, die über einen Namen für eine Familie verfügt, der in einer bestimmten Anwendung oder in einem bestimmten Kontext nicht als Vorzugsform bestimmt wird. @de
label: névváltozata a következő családnak: @hu
definition: Hozzákapcsol egy noment egy családhoz, amelynek van egy olyan családneve, amelyet egy bizonyos alkalmazásban vagy kontextusban nem részesítenek előnyben. @hu
toolkit label: névvariánsa a következő családnak: @hu
toolkit definition: Egy család, amelynek van egy olyan családneve, amelyet egy bizonyos alkalmazásban vagy kontextusban nem részesítenek előnyben. @hu
label: è nome variante della famiglia di @it
definition: Correla un nomen a una famiglia che ha un nome di famiglia che non è stato selezionato come preferito in una specifica applicazione o contesto. @it
toolkit label: nome variante della famiglia di @it
toolkit definition: Una famiglia che ha un nome di famiglia che non è stato selezionato come preferito in una specifica applicazione o contesto. @it
label: ir cits vārds dzimtai/ģimenei @lv
definition: Sasaista nomenu ar dzimtu/ģimeni, kam ir dzimtas/ģimenes vārds, kurš nav izvēlēts kā prioritārs noteiktā lietojumprogrammā vai kontekstā. @lv
toolkit label: ir cits vārds dzimtai/ģimenei @lv
toolkit definition: Dzimtai/ģimene, kurai ir dzimtas/ģimenes vārds, kurš nav izvēlēts kā prioritārs noteiktā lietojumprogrammā vai kontekstā. @lv
label: 是……的家族的变异名称 @zh-hans
definition: 将一个命名与有在一个特定的应用或语境下未被首选的一个家族名称的一个家族关联起来。 @zh-hans
toolkit label: ……的家族的变异名称 @zh-hans
toolkit definition: 有在一个特定的应用或语境下未被首选的一个家族名称的一个家族 @zh-hans
has subproperty: P80148
label: ailesinin farklı ismi @tr
definition: Bir ismi, aile adı belirli bir uygulamada veya içerikte tercih edilmek üzere seçilmemiş olan bir aile ile ilişkilendirir. @tr
toolkit label: ailenin alternatif ismi @tr
toolkit definition: Ailenin adı belirli bir uygulamada veya içerikte tercih edilmek üzere seçilmemiş olan bir aile. @tr

is variant name of person of
status: Published
type: Property
lexical alias: variantNameOfPersonOf.en
domain: C10012
sub property of: is name of person of
definition: Relates a nomen to a person who has a name of person that is not selected for preference in a specific application or context.
sub property of: is variant name of agent of
toolkit label: variant name of person of
toolkit definition: A person who has a name of person that is not selected for preference in a specific application or context.
has element type: 2
label: varianttinimi henkilölle @fi
definition: Liittää nomenin henkilöön, jonka nimeä ei ole valittu ensisijaiseksi tietyssä sovelluksessa tai kontekstissä. @fi
toolkit label: varianttinimi henkilölle @fi
toolkit definition: Henkilö, jonka nimeä ei ole valittu ensisijaiseksi tietyssä sovelluksessa tai kontekstissä. @fi
label: er alternativt navn på person for @no
definition: Relaterer et nomen til en person som har et navn for person som ikke er valgt som preferanse i en bestemt applikasjon eller kontekst. @no
toolkit label: alternativt navn på person for @no
toolkit definition: En person som har et navn for person som ikke er valgt som preferanse i en bestemt applikasjon eller kontekst. @no
label: est une variante de nom de personne de @fr
definition: Met un nomen en relation avec une personne qui possède un nom de personne ne faisant pas l’objet d’un choix privilégié dans une application ou un contexte spécifiques. @fr
toolkit label: variante de nom de personne de @fr
toolkit definition: Personne qui possède un nom de personne ne faisant pas l’objet d’un choix privilégié dans une application ou un contexte spécifiques. @fr
label: is variant naam van persoon van @nl
definition: Relateert een nomen aan een persoon die een naam van persoon heeft die niet als voorkeursterm geselecteerd is in een specifieke toepassing of context. @nl
toolkit label: variant naam van persoon van @nl
toolkit definition: Een persoon die een naam van persoon heeft die niet als voorkeursterm geselecteerd is in een specifieke toepassing of context. @nl
label: هو اسم شخص مختلف لـ @ar
definition: يربط تسمية بشخص له اسم شخص لم يُختر للتفضيل في تطبيق أو في سياق معين. @ar
toolkit label: اسم شخص مختلف لـ @ar
toolkit definition: شخص له اسم شخص لم يُختر للتفضيل في تطبيق أو في سياق معين. @ar
label: és variant de nom de persona de @ca
definition: Relaciona un nomen amb una persona que té un nom de persona que no se selecciona com a preferent en una aplicació o un context específic. @ca
toolkit label: variant de nom de persona de @ca
toolkit definition: Persona que té un nom de persona que no se selecciona com a preferent en una aplicació o un context específic. @ca
label: er variant af navn på person af @da
definition: Relaterer et nomen til en person, som har et navn på person, som ikke er valgt som præference i en specifik anvendelse eller kontekst. @da
toolkit label: variant af navn på person af @da
toolkit definition: Person, som har et navn på person, som ikke er valgt som præference i en specifik anvendelse eller kontekst. @da
label: variantnimi isikule @et
definition: Seostab nomen'i isikuga, kellel on nimi, mis kindlas rakenduses või kontekstis ei ole valitud eelistatuks. @et
toolkit label: variantnimi isikule @et
toolkit definition: Isik, kellel on nimi, mis kindlas rakenduses või kontekstis ei ole valitud eelistatuks. @et
label: ist abweichender Name einer Person von @de
definition: Setzt ein Nomen in Beziehung zu einer Person, die über einen Namen für eine Person verfügt, der in einer bestimmten Anwendung oder in einem bestimmten Kontext nicht als Vorzugsform bestimmt wird. @de
toolkit label: Abweichender Name einer Person von @de
toolkit definition: Eine Person, die über einen Namen für eine Person verfügt, der in einer bestimmten Anwendung oder in einem bestimmten Kontext nicht als Vorzugsform bestimmt wird. @de
label: névváltozata a következő személynek: @hu
definition: Hozzákapcsol egy noment egy személyhez, amelynek van egy olyan személyneve, amelyet egy bizonyos alkalmazásban vagy kontextusban nem részesítenek előnyben. @hu
toolkit label: személy névváltozata: @hu
toolkit definition: Egy személy, amelynek van egy olyan személyneve, amelyet egy bizonyos alkalmazásban vagy kontextusban nem részesítenek előnyben. @hu
label: è nome variante della persona di @it
definition: Correla un nomen a una persona che ha un nome di persona che non è stato selezionato come preferito in una specifica applicazione o contesto. @it
toolkit label: nome variante della persona di @it
toolkit definition: Una persona che ha un nome di persona che non è stato selezionato come preferito in una specifica applicazione o contesto. @it
label: ir cits vārds personai @lv
definition: Sasaista nomenu ar personu, kurai ir personas vārds, kurš nav izvēlēts kā prioritārs noteiktā lietojumprogrammā vai kontekstā. @lv
toolkit label: ir cits vārds personai @lv
toolkit definition: Persona, kurai ir personas vārds, kurš nav izvēlēts kā prioritārs noteiktā lietojumprogrammā vai kontekstā. @lv
label: 是……的个人的变异名称 @zh-hans
definition: 将一个命名与有在一个特定的应用或语境下未被首选的一个个人名称的一个个人关联起来。 @zh-hans
toolkit label: ……的个人的变异名称 @zh-hans
toolkit definition: 有在一个特定的应用或语境下未被首选的一个个人名称的一个个人 @zh-hans
has subproperty: P80149
label: kişisinin farklı ismi @tr
definition: Bir ismi,kişinin adı belirli bir uygulamada veya içerikte tercih edilmek üzere seçilmemiş olan bir kişiyle ilişkilendirir. @tr
toolkit label: kişinin alternatif ismi @tr
toolkit definition: Belirli bir uygulama veya bağlamda tercih için seçilmemiş bir kişinin adına sahip olan kişi. @tr

is variant name of place of
status: Published
type: Property
lexical alias: variantNameOfPlaceOf.en
definition: Relates a nomen to a place that has a name of place that is not selected for preference in a specific application or context.
domain: C10012
toolkit label: variant name of place of
toolkit definition: A place that has a name of place that is not selected for preference in a specific application or context.
sub property of: is name of place of
has element type: 2
sub property of: is variant name of RDA entity of
label: varianttinimi paikalle @fi
definition: Liittää nomenin paikkaan, jonka nimeä ei ole valittu ensisijaiseksi tietyssä sovelluksessa tai kontekstissa. @fi
toolkit label: varianttinimi paikalle @fi
toolkit definition: Paikka, jonka nimeä ei ole valittu ensisijaiseksi tietyssä sovelluksessa tai kontekstissa. @fi
label: er variantform av navn på sted for @no
definition: Relaterer et nomen til et sted som har et navn for sted som ikke er valgt som preferanse i en bestemt applikasjon eller kontekst. @no
toolkit label: variantform av navn på sted for @no
toolkit definition: Et sted som har et navn for sted som ikke er valgt som preferanse i en bestemt applikasjon eller kontekst. @no
label: est une variante de nom de lieu de @fr
definition: Met un nomen en relation avec un lieu qui possède un nom de lieu ne faisant pas l’objet d’un choix privilégié dans un schéma d’encodage de vocabulaire spécifiques. @fr
toolkit label: variante de nom de lieu de @fr
toolkit definition: Lieu qui possède un nom de lieu ne faisant pas l’objet d’un choix privilégié dans un schéma d’encodage de vocabulaire spécifiques. @fr
label: is variant naam van plaats van @nl
definition: Relateert een nomen aan een plaats die een naam van plaats heeft die niet als voorkeursterm geselecteerd is in een specifieke toepassing of context. @nl
toolkit label: variant naam van plaats van @nl
toolkit definition: Een plaats die een naam van plaats heeft die niet als voorkeursterm geselecteerd is in een specifieke toepassing of context. @nl
label: هو اسم مكان مختلف لـ @ar
definition: يربط تسمية بمكان له اسم مكان لم يُختر للتفضيل في تطبيق أو في سياق معين. @ar
toolkit label: اسم مكان مختلف لـ @ar
toolkit definition: مكان له اسم مكان لم يُختر للتفضيل في تطبيق أو في سياق معين. @ar
label: és variant de nom de lloc de @ca
definition: Relaciona un nomen amb un lloc que té un nom de lloc que no se selecciona com a preferent en una aplicació o un context específic. @ca
toolkit label: variant de nom de lloc de @ca
toolkit definition: Lloc que té un nom de lloc que no se selecciona com a preferent en una aplicació o un context específic. @ca
label: er variant af navn på sted af @da
definition: Relaterer et nomen til et sted, som har et navn på sted, som ikke er valgt som præference i en specifik anvendelse eller kontekst. @da
toolkit label: variant af navn på sted af @da
toolkit definition: Sted, som har et navn på sted, som ikke er valgt som præference i en specifik anvendelse eller kontekst. @da
label: variantnimi kohale @et
definition: Seostab nomen'i kohaga, millel on nimi, mis kindlas rakenduses või kontekstis ei ole valitud eelistatuks. @et
toolkit label: variantnimi kohale @et
toolkit definition: Koht, millel on nimi, mis kindlas rakenduses või kontekstis ei ole valitud eelistatuks. @et
label: ist abweichender Name eines Geografikums von @de
definition: Setzt ein Nomen in Beziehung zu einem Geografikum, das über einen Namen für ein Geografikum verfügt, der in einer bestimmten Anwendung oder in einem bestimmten Kontext nicht als Vorzugsform bestimmt wird. @de
toolkit label: Abweichender Name eines Geografikums von @de
toolkit definition: Ein Geografikum, das über einen Namen für ein Geografikum verfügt, der in einer bestimmten Anwendung oder in einem bestimmten Kontext nicht als Vorzugsform bestimmt wird. @de
label: névváltozata a következő helynek: @hu
definition: Hozzákapcsol egy noment egy helyhez, amelynek van egy helyneve, amelyet egy adott alkalmazásban vagy kontextusban nem részesítenek előnyben. @hu
toolkit label: névváltozata a következő helynek: @hu
toolkit definition: Egy hely, amelynek van egy helyneve, amelyet egy adott alkalmazásban vagy kontextusban nem részesítenek előnyben. @hu
label: è nome variante di luogo di @it
definition: Correla un nomen a un luogo che ha un nome di luogo che non è stato selezionato come preferito in uno specifico schema di codifica di vocabolario. @it
toolkit label: nome variante di luogo di @it
toolkit definition: Un luogo che ha un nome di luogo che non è stato selezionato come preferito in uno specifico schema di codifica di vocabolario. @it
label: ir cits nosaukums vietai @lv
definition: Sasaista nomenu ar vietu, kurai ir vietas nosaukums, kas nav izvēlēts kā prioritārs noteiktā lietojumprogrammā vai kontekstā. @lv
toolkit label: ir cits nosaukums vietai @lv
toolkit definition: Vieta, kurai ir vietas nosaukums, kas nav izvēlēts kā prioritārs noteiktā lietojumprogrammā vai kontekstā. @lv
label: 是……的地点的变异名称 @zh-hans
definition: 将一个命名与有在一个特定的应用或语境中未被首选的一个地点名称的一个地点关联起来。 @zh-hans
toolkit label: ……的地点的变异名称 @zh-hans
toolkit definition: 有在一个特定的应用或语境中未被首选的一个地点名称的一个地点 @zh-hans
has subproperty: P80088
label: yerin farklı ismi @tr
definition: Bir ismi, belirli bir uygulama veya bağlamda tercih için seçilmeyen bir yer adına sahip bir yerle ilişkilendirir. @tr
toolkit label: yerin alternatif ismi @tr
toolkit definition: Belirli bir uygulama veya bağlamda tercih için seçilmeyen bir yer adına sahip bir yer. @tr

is variant name of RDA entity of
status: Published
type: Property
lexical alias: variantNameOfRDAEntityOf.en
definition: Relates a nomen to an RDA entity that has a name of RDA entity that is not selected for preference in a specific application or context.
domain: C10012
toolkit label: variant name of RDA entity of
toolkit definition: An RDA entity that has a name of RDA entity that is not selected for preference in a specific application or context.
has element type: 2
sub property of: is name of RDA entity of
label: varianttinimi RDA-entiteetille @fi
definition: Liittää nomenin RDA-entiteettiin, jonka nimeä ei ole valittu ensisijaiseksi tietyssä sovelluksessa tai kontekstissä. @fi
toolkit label: varianttinimi RDA-entiteetille @fi
toolkit definition: RDA-entiteetti, jonka nimeä ei ole valittu ensisijaiseksi tietyssä sovelluksessa tai kontekstissä. @fi
label: er alternativt navn for RDA-entitet for @no
definition: Relaterer et nomen til en RDA-entitet som har et navn for RDA-entitet som ikke er valgt som preferanse i en bestemt applikasjon eller kontekst. @no
toolkit label: alternativt navn for RDA-entitet for @no
toolkit definition: En RDA-entitet som har et navn for RDA-entitet som ikke er valgt som preferanse i en bestemt applikasjon eller kontekst. @no
label: est une variante de nom d’entité RDA de @fr
definition: Met un nomen en relation avec une entité RDA qui possède un nom d’entité RDA ne faisant pas l’objet d’un choix privilégié dans une application ou un contexte spécifiques. @fr
toolkit label: variante de nom d’entité RDA de @fr
toolkit definition: Entité RDA qui possède un nom d’entité RDA ne faisant pas l’objet d’un choix privilégié dans une application ou un contexte spécifiques. @fr
label: is variant naam van RDA-entiteit @nl
definition: Relateert een nomen aan een RDA-entiteit die een naam van RDA-entiteit heeft die niet als voorkeursterm geselecteerd is in een specifieke toepassing of context. @nl
toolkit label: variant naam van RDA-entiteit @nl
toolkit definition: Een RDA-entiteit die een naam van RDA-entiteit heeft die niet als voorkeursterm geselecteerd is in een specifieke toepassing of context. @nl
label: هو اسم مختلف لكيان "وام" لـ @ar
definition: يربط تسمية بكيان "وام" له اسم كيان "وام" لم يُختر للتفضيل في تطبيق أو في سياق معين. @ar
toolkit label: اسم مختلف لكيان "وام" لـ @ar
toolkit definition: كيان "وام" له اسم كيان "وام" لم يُختر للتفضيل في تطبيق أو في سياق معين. @ar
label: és variant de nom d’entitat RDA de @ca
definition: Relaciona un nomen amb una entitat RDA que té un nom d’entitat RDA que no se selecciona com a preferent en una aplicació o un context específic. @ca
toolkit label: variant de nom d’entitat RDA de @ca
toolkit definition: Entitat RDA que té un nom d’entitat RDA que no se selecciona com a preferent en una aplicació o un context específic. @ca
label: er variant af navn på RDA-entitet af @da
definition: Relaterer et nomen til en RDA-entitet, som har et navn på RDA-entitet, som ikke er valgt som præference i en specifik anvendelse eller kontekst. @da
toolkit label: variant af navn på RDA-entitet af @da
toolkit definition: RDA-entitet, som har et navn på RDA-entitet, som ikke er valgt som præference i en specifik anvendelse eller kontekst. @da
label: variantnimi RDA olemile @et
definition: Seostab nomen'i RDA olemiga, millel on nimi, mis kindlas rakenduses või kontekstis ei ole valitud eelistatuks. @et
toolkit label: variantnimi RDA olemile @et
toolkit definition: RDA olem, millel on nimi, mis kindlas rakenduses või kontekstis ei ole valitud eelistatuks. @et
label: ist abweichender Name einer RDA-Entität von @de
definition: Setzt ein Nomen in Beziehung zu einer RDA-Entität, die über einen Namen für eine RDA-Entität verfügt, der in einer bestimmten Anwendung oder in einem bestimmten Kontext nicht als Vorzugsform bestimmt wird. @de
toolkit label: Abweichender Name einer RDA-Entität von @de
toolkit definition: Eine RDA-Entität, die über einen Namen für eine RDA-Entität verfügt, der in einer bestimmten Anwendung oder in einem bestimmten Kontext nicht als Vorzugsform bestimmt wird. @de
label: RDA-entitás névvariánsa a következőnek: @hu
definition: Hozzákapcsol egy noment egy RDA-entitáshoz, amelynek van egy olyan RDA-entitásneve, amelyet egy bizonyos alkalmazásban vagy kontextusban nem részesítenek előnyben. @hu
toolkit label: RDA-entitás névvariánsa: @hu
toolkit definition: Egy RDA-entitás, amelynek van egy olyan RDA-entitásneve, amelyet egy bizonyos alkalmazásban vagy kontextusban nem részesítenek előnyben. @hu
label: è nome variante dell'entità RDA di @it
definition: Correla un nomen a un'entità RDA che ha un nome di entità RDA che non è stato selezionato come preferito in una specifica applicazione o contesto. @it
toolkit label: nome variante dell'entità RDA di @it
toolkit definition: Un'entità RDA che ha un nome di entità RDA che non è stato selezionato come preferito in una specifica applicazione o contesto. @it
label: ir cits nosaukums RDA entītei @lv
definition: Sasaista nomenu ar RDA entīti, kam ir Sasaista nomenu ar RDA entītis nosaukums, kas nav izvēlēts kā prioritārs noteiktā lietojumprogrammā vai kontekstā. @lv
toolkit label: ir cits nosaukums RDA entītei @lv
toolkit definition: RDA entīte, kam ir RDA entītes nosaukums, kas nav izvēlēts kā prioritārs noteiktā lietojumprogrammā vai kontekstā. @lv
label: 是……的RDA实体的变异名称 @zh-hans
definition: 将一个命名与有有在一个特定的应用或语境中未被首选的一个RDA实体名称的一个RDA实体关联起来。 @zh-hans
toolkit label: ……的RDA实体的变异名称 @zh-hans
toolkit definition: 有在一个特定的应用或语境中未被首选的一个RDA实体名称的一个RDA实体 @zh-hans
has subproperty: is variant name of agent of
has subproperty: is variant name of place of
has subproperty: is variant name of timespan of
has subproperty: is variant title of expression of
has subproperty: is variant title of item of
has subproperty: is variant title of manifestation of
has subproperty: is variant title of work of
has subproperty: P80164
label: RDA öğesinin farklı ismi @tr
definition: Bir ismi belirli bir uygulama veya bağlamda tercih edilmek üzere seçilmeyen bir RDA varlığı adına sahip bir RDA varlığıyla ilişkilendirir. @tr
toolkit label: RDA varlığının alternatif ismi @tr
toolkit definition: Belirli bir uygulama veya bağlamda tercih edilmek üzere seçilmeyen bir RDA varlığı adına sahip bir RDA varlığı. @tr

is variant name of timespan of
status: Published
type: Property
lexical alias: variantNameOfTimespanOf.en
definition: Relates a nomen to a timespan that has a name of timespan that is not selected for preference in a specific application or context.
domain: C10012
toolkit label: variant name of timespan of
toolkit definition: A timespan that has a name of timespan that is not selected for preference in a specific application or context.
sub property of: is name of timespan of
has element type: 2
sub property of: is variant name of RDA entity of
label: varianttinimi ajanjaksolle @fi
definition: Liittää nomenin ajanjaksoon, jonka nimeä ei ole valittu ensisijaiseksi tietyssä sovelluksessa tai kontekstissa. @fi
toolkit label: varianttinimi ajanjaksolle @fi
toolkit definition: Ajanjakso, jonka nimeä ei ole valittu ensisijaiseksi tietyssä sovelluksessa tai kontekstissa. @fi
label: er variantform av navn på tidsrom for @no
definition: Relaterer et nomen til et tidsrom som har et navn for tidsrom som ikke er valgt som preferanse i en bestemt applikasjon eller kontekst. @no
toolkit label: variantform av navn på tidsrom for @no
toolkit definition: Et tidsrom som har et navn for tidsrom som ikke er valgt som preferanse i en bestemt applikasjon eller kontekst. @no
label: est une variante de nom de laps de temps de @fr
definition: Met un nomen en relation avec un laps de temps qui possède un nom de laps de temps ne faisant pas l’objet d’un choix privilégié dans un schéma d’encodage de vocabulaire spécifiques. @fr
toolkit label: variante de nom de laps de temps de @fr
toolkit definition: Laps de temps qui possède un nom de laps de temps ne faisant pas l’objet d’un choix privilégié dans un schéma d’encodage de vocabulaire spécifiques. @fr
label: is variant naam van tijdspanne van @nl
definition: Relateert een nomen aan een tijdspanne die een naam van tijdspanne heeft die niet als voorkeursterm geselecteerd is in een specifieke toepassing of context. @nl
toolkit label: variant naam van tijdspanne van @nl
toolkit definition: Een tijdspanne die een naam van tijdspanne heeft die niet als voorkeursterm geselecteerd is in een specifieke toepassing of context. @nl
label: هو اسم فترة زمنية مختلف لـ @ar
definition: يربط تسمية بفترة زمنية لها اسم لفترة زمنية، لم يُختر للتفضيل في تطبيق أو في سياق معين. @ar
toolkit label: اسم فترة زمنية مختلف لـ @ar
toolkit definition: فترة زمنية لها اسم لفترة زمنية لم يُختر للتفضيل في تطبيق أو في سياق معين. @ar
label: és variant de nom d’interval de temps de @ca
definition: Relaciona un nomen amb un interval de temps que té un nom d’interval de temps que no se selecciona com a preferent en una aplicació o un context específic. @ca
toolkit label: variant de nom d’interval de temps de @ca
toolkit definition: Interval de temps que té un nom d’interval de temps que no se selecciona com a preferent en una aplicació o un context específic. @ca
label: er variant af navn på tidsperiode af @da
definition: Relaterer et nomen til en tidsperiode, som har et navn på tidsperiode, som ikke er valgt som præference i en specifik anvendelse eller kontekst. @da
toolkit label: variant af navn på tidsperiode af @da
toolkit definition: Tidsperiode, som har et navn på tidsperiode, som ikke er valgt som præference i en specifik anvendelse eller kontekst. @da
label: variantnimi ajavahemikule @et
definition: Seostab nomen'i ajavahemikuga, millel on nimi, mis kindlas rakenduses või kontekstis ei ole valitud eelistatuks. @et
toolkit label: variantnimi ajavahemikule @et
toolkit definition: Ajavahemik, millel on nimi, mis kindlas rakenduses või kontekstis ei ole valitud eelistatuks. @et
label: ist abweichender Name eines Zeitraums von @de
definition: Setzt ein Nomen in Beziehung zu einem Zeitraum, der über einen Namen für einen Zeitraum verfügt, der in einer bestimmten Anwendung oder in einem bestimmten Kontext nicht als Vorzugsform bestimmt wird. @de
toolkit label: Abweichender Name eines Zeitraums von @de
toolkit definition: Ein Zeitraum, der über einen Namen für einen Zeitraum verfügt, der in einer bestimmten Anwendung oder in einem bestimmten Kontext nicht als Vorzugsform bestimmt wird. @de
label: névváltozata a következő időtartamnak: @hu
definition: Hozzákapcsol egy noment egy időtartamhoz, amelynek van egy időtartamneve, amelyet egy adott alkalmazásban vagy kontextusban nem részesítenek előnyben. @hu
toolkit label: névváltozata a következő időtartamnak: @hu
toolkit definition: Egy időtartam, amelynek van egy időtartamneve, amelyet egy adott alkalmazásban vagy kontextusban nem részesítenek előnyben. @hu
label: è nome variante di arco di tempo di @it
definition: Correla un nomen a un arco di tempo che ha un nome di arco di tempo che non è stato selezionato come preferito in uno specifico schema di codifica di vocabolario. @it
toolkit label: nome variante di arco di tempo di @it
toolkit definition: Un arco di tempo che ha un nome di arco di tempo che non è stato selezionato come preferito in uno specifico schema di codifica di vocabolario. @it
label: ir cits nosaukums laikposmam @lv
definition: Sasaista nomenu ar laikposmu, kam ir laikposma nosaukums, kas nav izvēlēts kā prioritārs noteiktā lietojumprogrammā vai kontekstā. @lv
toolkit label: cits nosaukums laikposmam @lv
toolkit definition: Laikposms, kam ir laikposma nosaukums, kas nav izvēlēts kā prioritārs noteiktā lietojumprogrammā vai kontekstā. @lv
label: 是……的时间段的变异名称 @zh-hans
definition: 将一个命名与有在一个特定的应用或语境中未被首选的一个时间段名称的一个时间段关联起来。 @zh-hans
toolkit label: ……的时间段的变异名称 @zh-hans
toolkit definition: 有在一个特定的应用或语境中未被首选的一个时间段名称的一个时间段 @zh-hans
has subproperty: P80084
label: zaman aralığının farklı ismi @tr
definition: Bir ismi, belirli bir uygulama veya bağlamda tercih için seçilmemiş bir zaman aralığı adına sahip bir zaman aralığıyla ilişkilendirir. @tr
toolkit label: zaman aralığının alternatif ismi @tr
toolkit definition: Belirli bir uygulama veya bağlamda tercih için seçilmeyen bir zaman aralığı adına sahip bir zaman aralığı. @tr

is variant title of expression of
status: Published
type: Property
lexical alias: variantTitleOfExpressionOf.en
definition: Relates a nomen to an expression that has a title of expression that is not selected for preference in a specific application or context.
domain: C10012
toolkit label: variant title of expression of
toolkit definition: An expression that has a title of expression that is not selected for preference in a specific application or context.
sub property of: is title of expression of
has element type: 2
sub property of: is variant name of RDA entity of
label: varianttinimeke ekspressiolle @fi
definition: Liittää nomenin ekspressioon, jonka nimekettä ei ole valittu ensisijaiseksi tietyssä sovelluksessa tai kontekstissa. @fi
toolkit label: varianttinimeke ekspressiolle @fi
toolkit definition: Ekspressio, jonka nimekettä ei ole valittu ensisijaiseksi tietyssä sovelluksessa tai kontekstissa. @fi
label: er tittelvariant for uttrykk for @no
definition: Relaterer et nomen til et uttrykk som har en tittel for uttrykk som ikke er valgt som preferanse i en bestemt applikasjon eller kontekst. @no
toolkit label: tittelvariant for uttrykk for @no
toolkit definition: Et uttrykk som har en tittel for uttrykk som ikke er valgt som preferanse i en bestemt applikasjon eller kontekst. @no
label: est une variante de titre d’expression de @fr
definition: Met un nomen en relation avec une expression qui possède un titre d’expression ne faisant pas l’objet d’un choix privilégié dans une application ou un contexte spécifiques. @fr
toolkit label: variante de titre d’expression de @fr
toolkit definition: Expression qui possède un titre d’expression ne faisant pas l’objet d’un choix privilégié dans une application ou un contexte spécifiques. @fr
label: is variant titel van expressie van @nl
definition: Relateert een nomen aan een expressie die een titel van expression heeft die niet als voorkeursterm geselecteerd is in een specifieke toepassing of context. @nl
toolkit label: variant titel van expressie van @nl
toolkit definition: Een expressie die een titel van expression heeft die niet als voorkeursterm geselecteerd is in een specifieke toepassing of context. @nl
label: هو عنوان تعبيرة مختلف لـ @ar
definition: يربط تسمية بتعبيرة لها عنوان تعبيرة لم يُختر للتفضيل في تطبيق أو في سياق معين. @ar
toolkit label: عنوان تعبيرة مختلف لـ @ar
toolkit definition: تعبيرة لها عنوان تعبيرة لم يُختر للتفضيل في تطبيق أو في سياق معين. @ar
label: és variant de títol d’expressió de @ca
definition: Relaciona un nomen amb una expressió que té un títol d’expressió que no se selecciona com a preferent en una aplicació o un context específic. @ca
toolkit label: variant de títol d’expressió de @ca
toolkit definition: Expressió que té un títol d’expressió que no se selecciona com a preferent en una aplicació o un context específic. @ca
label: er variant af titel på udtryk af @da
definition: Relaterer et nomen til et udtryk, som har en titel på udtryk, som ikke er valgt som præference i en specifik anvendelse eller kontekst. @da
toolkit label: variant af titel på udtryk af @da
toolkit definition: Udtryk, som har en titel på udtryk, som ikke er valgt som præference i en specifik anvendelse eller kontekst. @da
label: variantpealkiri väljenduses @et
definition: Seostab nomen'i väljendusega, millel on pealkiri, mis kindlas rakenduses või kontekstis ei ole valitud eelistatuks. @et
toolkit label: variantpealkiri väljenduses @et
toolkit definition: Väljendus, millel on pealkiri, mis kindlas rakenduses või kontekstis ei ole valitud eelistatuks. @et
label: ist abweichender Titel einer Expression von @de
definition: Setzt ein Nomen in Beziehung zu einer Expression, die über einen Titel für eine Expression verfügt, der in einer bestimmten Anwendung oder in einem bestimmten Kontext nicht als Vorzugsform bestimmt wird. @de
toolkit label: Abweichender Titel einer Expression von @de
toolkit definition: Eine Expression, die über einen Titel für eine Expression verfügt, der in einer bestimmten Anwendung oder in einem bestimmten Kontext nicht als Vorzugsform bestimmt wird. @de
label: címvariánsa a következő kifejezési formának: @hu
definition: Hozzákapcsol egy noment egy kifejezési formához, amely rendelkezik egy olyan kifejezési formához tartozó címmel, amelyet egy adott alkalmazásban vagy kontextusban nem részesítenek előnyben. @hu
toolkit label: címváltozata a következő kifejezési formának: @hu
toolkit definition: Egy kifejezési forma, amely rendelkezik egy olyan kifejezési formához tartozó címmel, amelyet egy adott alkalmazásban vagy kontextusban nem részesítenek előnyben. @hu
label: è titolo variante dell'espressione di @it
definition: Correla un nomen a un'espressione che ha un titolo di espressione che non è stato selezionato come preferito in uno specifico schema di codifica di vocabolario. @it
toolkit label: titolo variante dell'espressione di @it
toolkit definition: Un'espressione che ha un titolo di espressione che non è stato selezionato come preferito in uno specifico schema di codifica di vocabolario. @it
label: ir cits nosaukums izteiksmei @lv
definition: Sasaista nomenu ar izteiksmi, kam ir izteiksmes nosaukums, kas nav izvēlēts kā prioritārs noteiktā lietojumprogrammā vai kontekstā. @lv
toolkit label: ir cits nosaukums izteiksmei @lv
toolkit definition: Izteiksme, kam ir izteiksmes nosaukums, kas nav izvēlēts kā prioritārs noteiktā lietojumprogrammā vai kontekstā. @lv
label: 是……的内容表达的变异题名 @zh-hans
definition: 将一个命名与有在一个特定的应用或语境中被未首选的一个内容表达题名的一种内容表达关联起来。 @zh-hans
toolkit label: ……的内容表达的变异题名 @zh-hans
toolkit definition: 有在一个特定的应用或语境中未被首选的一个内容表达题名的一种内容表达 @zh-hans
has subproperty: P80098
label: ifadesinin farklı başlığı @tr
definition: Bir ismi, belirli bir uygulama veya bağlamda tercih için seçilmeyen bir anlatım başlığına sahip bir anlatımla ilişkilendirir. @tr
toolkit label: anlatımın alternatif başlığı @tr
toolkit definition: Belirli bir uygulama veya bağlamda tercih için seçilmeyen bir anlatım başlığına sahip anlatım. @tr

is variant title of item of
status: Published
type: Property
lexical alias: variantTitleOfItemOf.en
definition: Relates a nomen to an item that has a title of item that is not selected for preference in a specific application or context.
domain: C10012
toolkit label: variant title of item of
toolkit definition: An item that has a title of item that is not selected for preference in a specific application or context.
sub property of: is title of item of
has element type: 2
sub property of: is variant name of RDA entity of
label: varianttinimeke kappaleelle @fi
definition: Liittää nomenin kappaleeseen, jonka nimekettä ei ole valittu ensisijaiseksi tietyssä sovelluksessa tai kontekstissa. @fi
toolkit label: varianttinimeke kappaleelle @fi
toolkit definition: Kappale, jonka nimekettä ei ole valittu ensisijaiseksi tietyssä sovelluksessa tai kontekstissa. @fi
label: er tittelvariant for eksemplar for @no
definition: Relaterer et nomen til et eksemplar som har en tittel for eksemplar som ikke er valgt som preferanse i en bestemt applikasjon eller kontekst. @no
toolkit label: tittelvariant for eksemplar for @no
toolkit definition: Et eksemplar som har en tittel for eksemplar som ikke er valgt som preferanse i en bestemt applikasjon eller kontekst. @no
label: est une variante de titre d’item de @fr
definition: Met un nomen en relation avec un item qui possède un titre d’item ne faisant pas l’objet d’un choix privilégié dans une application ou un contexte spécifiques. @fr
toolkit label: variante de titre d’item de @fr
toolkit definition: Item qui possède un titre d’item ne faisant pas l’objet d’un choix privilégié dans une application ou un contexte spécifiques. @fr
label: is variant titel van item van @nl
definition: Relateert een nomen aan een item dat een titel van item heeft die niet als voorkeursterm geselecteerd is in een specifieke toepassing of context. @nl
toolkit label: variant titel van item van @nl
toolkit definition: Een item dat een titel van item heeft die niet als voorkeursterm geselecteerd is in een specifieke toepassing of context. @nl
label: هو عنوان مفردة مختلف لـ @ar
definition: يربط تسمية بمفردة لها عنوان مفردة لم يُختر للتفضيل في تطبيق أو في سياق معين. @ar
toolkit label: عنوان مفردة مختلف لـ @ar
toolkit definition: مفردة لها عنوان مفردة لم يُختر للتفضيل في تطبيق أو في سياق معين. @ar
label: és variant de títol d’ítem de @ca
definition: Relaciona un nomen amb un ítem que té un títol d’ítem que no se selecciona com a preferent en una aplicació o un context específic. @ca
toolkit label: variant de títol d’ítem de @ca
toolkit definition: Ítem que té un títol d’ítem que no se selecciona com a preferent en una aplicació o un context específic. @ca
label: er variant af titel på eksemplar af @da
definition: Relaterer et nomen til et eksemplar, som har en titel på eksemplar, som ikke er valgt som præference i en specifik anvendelse eller kontekst. @da
toolkit label: variant af titel på eksemplar af @da
toolkit definition: Eksemplar, som har en titel på eksemplar, som ikke er valgt som præference i en specifik anvendelse eller kontekst. @da
label: variantpealkiri eksemplaris @et
definition: Seostab nomen'i eksemplariga, millel on pealkiri, mis kindlas rakenduses või kontekstis ei ole valitud eelistatuks. @et
toolkit label: variantpealkiri eksemplaris @et
toolkit definition: Eksemplar, millel on pealkiri, mis kindlas rakenduses või kontekstis ei ole valitud eelistatuks. @et
label: ist abweichender Titel eines Exemplars von @de
definition: Setzt ein Nomen in Beziehung zu einem Exemplar, das über einen Titel für ein Exemplar verfügt, der in einer bestimmten Anwendung oder in einem bestimmten Kontext nicht als Vorzugsform bestimmt wird. @de
toolkit label: Abweichender Titel eines Exemplars von @de
toolkit definition: Ein Exemplar, das über einen Titel für ein Exemplar verfügt, der in einer bestimmten Anwendung oder in einem bestimmten Kontext nicht als Vorzugsform bestimmt wird. @de
label: címváltozata a következő példánynak: @hu
definition: Hozzákapcsol egy noment egy példányhoz, amely rendelkezik egy olyan példányhoz tartozó címmel, amelyet egy adott alkalmazásban vagy kontextusban nem részesítenek előnyben. @hu
toolkit label: címváltozata a következő példánynak: @hu
toolkit definition: Egy példány, amely rendelkezik egy olyan példányhoz tartozó címmel, amelyet egy adott alkalmazásban vagy kontextusban nem részesítenek előnyben. @hu
label: è titolo variante dell'item di @it
definition: Correla un nomen a un item che ha un titolo di item che non è stato selezionato come preferito in uno specifico schema di codifica di vocabolario. @it
toolkit label: titolo variante dell'item di @it
toolkit definition: Un item che ha un titolo di item che non è stato selezionato come preferito in uno specifico schema di codifica di vocabolario. @it
label: ir cits nosaukums vienībai @lv
definition: Sasaista nomenu ar vienību, kurai ir vienības nosaukums, kas nav izvēlēts kā prioritārs noteiktā lietojumprogrammā vai kontekstā. @lv
toolkit label: cits nosaukums vienībai @lv
toolkit definition: Vienība, kurai ir vienības nosaukums, kas nav izvēlēts kā prioritārs noteiktā lietojumprogrammā vai kontekstā. @lv
label: 是……的单件的变异题名 @zh-hans
definition: 将一个命名与有在一个特定的应用或语境中未被首选的一个单件题名的一个单件关联起来。 @zh-hans
toolkit label: ……的单件的变异题名 @zh-hans
toolkit definition: 有在一个特定的应用或语境中未被首选的一个单件题名的一个单件 @zh-hans
has subproperty: P80094
label: öğesinin farklı başlığı @tr
definition: Bir ismi, belirli bir uygulama veya bağlamda tercih edilmeyen bir öğe başlığına sahip bir kopyayla ilişkilendirir. @tr
toolkit label: kopyanın alternatif başlığı @tr
toolkit definition: Belirli bir uygulama veya bağlamda tercih için seçilmeyen bir gösterim başlığına sahip bir kopya. @tr

is variant title of manifestation of
status: Published
type: Property
lexical alias: variantTitleOfManifestationOf.en
definition: Relates a nomen to a manifestation that has a title of manifestation that is not selected for preference in a specific application or context.
domain: C10012
toolkit label: variant title of manifestation of
toolkit definition: A manifestation that has a title of manifestation that is not selected for preference in a specific application or context.
sub property of: is title of manifestation of
has element type: 2
sub property of: is variant name of RDA entity of
label: varianttinimeke manifestaatiolle @fi
definition: Liittää nomenin manifestaatioon, jonka nimekettä ei ole valittu ensisijaiseksi tietyssä sovelluksessa tai kontekstissa. @fi
toolkit label: varianttinimeke manifestaatiolle @fi
toolkit definition: Manifestaatio, jonka nimekettä ei ole valittu ensisijaiseksi tietyssä sovelluksessa tai kontekstissa. @fi
label: er tittelvariant for manifestasjon for @no
definition: Relaterer et nomen til en manifestasjon som har en tittel for manifestasjon som ikke er valgt som preferanse i en bestemt applikasjon eller kontekst. @no
toolkit label: tittelvariant for manifestasjon for @no
toolkit definition: En manifestasjon som har en tittel for manifestasjon som ikke er valgt som preferanse i en bestemt applikasjon eller kontekst. @no
label: est une variante de titre de manifestation de @fr
definition: Met un nomen en relation avec une manifestation qui possède un titre de manifestation ne faisant pas l’objet d’un choix privilégié dans une application ou un contexte spécifiques. @fr
toolkit label: variante de titre de manifestation de @fr
toolkit definition: Manifestation qui possède un titre de manifestation ne faisant pas l’objet d’un choix privilégié dans une application ou un contexte spécifiques. @fr
label: is variant titel van manifestatie van @nl
definition: Relateert een nomen aan een manifestatie die een titel van manifestatie heeft die niet als voorkeursterm geselecteerd is in een specifieke toepassing of context. @nl
toolkit label: variant titel van manifestatie van @nl
toolkit definition: Een manifestatie die een titel van manifestatie heeft die niet als voorkeursterm geselecteerd is in een specifieke toepassing of context. @nl
label: هو عنوان تجسيدة مختلف لـ @ar
definition: يربط تسمية بتجسيدة لها عنوان تجسيدة لم يُختر للتفضيل في تطبيق أو في سياق معين. @ar
toolkit label: عنوان تجسيدة مختلف لـ @ar
toolkit definition: تجسيدة لها عنوان تجسيدة لم يُختر للتفضيل في تطبيق أو في سياق معين. @ar
label: és variant de títol de manifestació de @ca
definition: Relaciona un nomen amb una manifestació que té un títol de manifestació que no se selecciona com a preferent en una aplicació o un context específic. @ca
toolkit label: variant de títol de manifestació de @ca
toolkit definition: Manifestació que té un títol de manifestació que no se selecciona com a preferent en una aplicació o un context específic. @ca
label: er variant af titel på manifestation af @da
definition: Relaterer et nomen til en manifestation, som har en titel på manifestation, som ikke er valgt som præference i en specifik anvendelse eller kontekst. @da
toolkit label: variant af titel på manifestation af @da
toolkit definition: Manifestation, som har en titel på manifestation, som ikke er valgt som præference i en specifik anvendelse eller kontekst. @da
label: variantpealkiri kehastuses @et
definition: Seostab nomen'i kehastusega, millel on pealkiri, mis kindlas rakenduses või kontekstis ei ole valitud eelistatuks. @et
toolkit label: variantpealkiri kehastuses @et
toolkit definition: Kehastus, millel on pealkiri, mis kindlas rakenduses või kontekstis ei ole valitud eelistatuks. @et
label: ist abweichender Titel einer Manifestation von @de
definition: Setzt ein Nomen in Beziehung zu einer Manifestation, das über einen Titel für eine Manifestation verfügt, der in einer bestimmten Anwendung oder in einem bestimmten Kontext nicht als Vorzugsform bestimmt wird. @de
toolkit label: Abweichender Titel einer Manifestation von @de
toolkit definition: Ein Manifestation, das über einen Titel für eine Manifestation verfügt, der in einer bestimmten Anwendung oder in einem bestimmten Kontext nicht als Vorzugsform bestimmt wird. @de
label: címvariánsa a következő megjelenési formának: @hu
definition: Hozzákapcsol egy noment egy megjelenési formához, amelynek van egy megjelenésiforma-címe, amelyet egy bizonyos alkalmazásban vagy kontextusban nem részesítenek előnyben. @hu
toolkit label: címvariánsa a következő megjelenési formának: @hu
toolkit definition: Egy megjelenési forma, amelynek van egy megjelenésiforma-címe, amelyet egy bizonyos alkalmazásban vagy kontextusban nem részesítenek előnyben. @hu
label: è titolo variante della manifestazione di @it
definition: Correla un nomen a una manifestazione che ha un titolo di manifestazione che non è stato selezionato come preferito in uno specifico schema di codifica di vocabolario. @it
toolkit label: titolo variante della manifestazione di @it
toolkit definition: Una manifestazione che ha un titolo di manifestazione che non è stato selezionato come preferito in uno specifico schema di codifica di vocabolario. @it
label: ir cits nosaukums manifestācijai @lv
definition: Sasaista nomenu ar manifestāciju, kam ir manifestācijas nosaukums, kas nav izvēlēts kā prioritārs noteiktā lietojumprogrammā vai kontekstā. @lv
toolkit label: ir cits nosaukums manifestācijai @lv
toolkit definition: Manifestācija, kam ir manifestācijas nosaukums, kas nav izvēlēts kā prioritārs noteiktā lietojumprogrammā vai kontekstā. @lv
label: 是……的载体表现的变异题名 @zh-hans
definition: 将一个命名与有在一个特定的应用或语境中未被首选的一个载体表现题名的一种载体表现关联起来。 @zh-hans
toolkit label: ……的载体表现的变异题名 @zh-hans
toolkit definition: 有在一个特定的应用或语境中未被首选的一个载体表现题名的一种载体表现 @zh-hans
has subproperty: is abbreviated title of
has subproperty: P80111
label: gösterimin farklı başlığı @tr
definition: Bir ismi, belirli bir uygulama veya bağlamda tercih edilmeyen bir gösterim başlığına sahip bir gösterimle ilişkilendirir. @tr
toolkit label: gösterimin alternatif başlığı @tr
toolkit definition: Belirli bir uygulama veya bağlamda tercih edilmek üzere seçilen bir gösterim başlığına sahip bir gösterim @tr

is variant title of work of
status: Published
type: Property
lexical alias: variantTitleOfWorkOf.en
definition: Relates a nomen to a work that has a title of work that is not selected for preference in a specific application or context.
domain: C10012
toolkit label: variant title of work of
toolkit definition: A work that has a title of work that is not selected for preference in a specific application or context.
sub property of: is title of work of
has element type: 2
scope note: A variant title of work includes a title or form of title appearing on a manifestation of the work or found in reference sources, a title resulting from a different transliteration of a title, etc.
sub property of: is variant name of RDA entity of
label: varianttinimeke teokselle @fi
definition: Liittää nomenin teokseen, jonka nimekettä ei ole valittu ensisijaiseksi tietyssä sovelluksessa tai kontekstissa. @fi
scope note: Teoksen varianttinimekkeeseen kuuluu nimeke tai nimekkeen muoto, joka esiintyy teoksen manifestaatiossa tai tietolähteissä sekä nimekkeen eri translitteroinnit tms. @fi
toolkit label: varianttinimeke teokselle @fi
toolkit definition: Teos, jonka nimekettä ei ole valittu ensisijaiseksi tietyssä sovelluksessa tai kontekstissa. @fi
label: er tittelvariant for verk for @no
definition: Relaterer et nomen til et verk som har en tittel for verk som ikke er valgt som preferanse i en bestemt applikasjon eller kontekst. @no
scope note: En tittelvariant for verk inkluderer en tittel eller form for tittel som forekommer på en manifestasjon for verk eller i referanseverk, en tittel som er et resultat av en annen transkripsjon av en tittel etc. @no
toolkit label: tittelvariant for verk for @no
toolkit definition: Et verk som har en tittel for verk som ikke er valgt som preferanse i en bestemt applikasjon eller kontekst. @no
label: est une variante de titre d’œuvre de @fr
definition: Met un nomen en relation avec une œuvre qui possède un titre d'œuvre ne faisant pas l’objet d’un choix privilégié dans une application ou un contexte spécifiques. @fr
scope note: Une variante de titre d’œuvre comprend un titre ou une forme de titre figurant sur une manifestation de l’œuvre ou trouvée dans les sources de référence, un titre qui résulte d’une translittération différente d’un titre, etc. @fr
toolkit label: variante de titre d’œuvre de @fr
toolkit definition: Œuvre qui possède un titre d'œuvre ne faisant pas l’objet d’un choix privilégié dans une application ou un contexte spécifiques. @fr
label: is variant titel van werk van @nl
definition: Relateert een nomen aan een werk dat een titel van werk heeft die niet als voorkeursterm geselecteerd is in een specifieke toepassing of context. @nl
scope note: Een variant titel van werk omvat een titel of vorm van titel getoond op een manifestatie van het werk of gevonden in naslagwerken, een titel die het resultaat is van een andere translitteratie van een titel etc. @nl
toolkit label: variant titel van werk van @nl
toolkit definition: Een werk dat een titel van werk heeft die niet als voorkeursterm geselecteerd is in een specifieke toepassing of context. @nl
label: هو عنوان عمل مختلف لـ @ar
definition: يربط تسمية بعمل له عنوان عمل لم يُختر للتفضيل في تطبيق أو في سياق معين. @ar
scope note: عنوان مختلف لعمل يتضمن عنوانا أو شكل عنوان يظهر في تجسيدة للعمل، أو موجود في مصادر مرجعية، أو نتج من نقحرة مختلفة لعنوان، الخ. @ar
toolkit label: عنوان عمل مختلف لـ @ar
toolkit definition: عمل له عنوان عمل لم يُختر للتفضيل في تطبيق أو في سياق معين. @ar
label: és variant de títol d’obra de @ca
definition: Relaciona un nomen amb una obra que té un títol d’obra que no se selecciona com a preferent en una aplicació o un context específic. @ca
scope note: Una variant de títol d’obra inclou un títol o una forma de títol que figura en una manifestació de l’obra o que es troba a les fonts de referència, un títol que és el resultat d’una transliteració diferent d’un títol, etc. @ca
toolkit label: variant de títol d’obra de @ca
toolkit definition: Obra que té un títol d’obra que no se selecciona com a preferent en una aplicació o un context específic. @ca
label: er variant af titel på værk af @da
definition: Relaterer et nomen til et værk, som har en titel på værk, som ikke er valgt som præference i en specifik anvendelse eller kontekst. @da
scope note: Variant af titel på værk omfatter en titel eller form for titel, som forekommer på en manifestation for værket eller findes i referenceværker, en titel, som er et resultat af en anden translitteration af en titel, etc. @da
toolkit label: variant af titel på værk af @da
toolkit definition: Værk, som har en titel på værk, som ikke er valgt som præference i en specifik anvendelse eller kontekst. @da
label: variantpealkiri teoses @et
definition: Seostab nomen'i teosega, millel on pealkiri, mis kindlas rakenduses või kontekstis ei ole valitud eelistatuks. @et
scope note: Teose variantpealkirjaks võib olla teose kehastuses või teatmeallikates leiduv pealkiri või pealkirjavorm, pealkirja erinevast translitereerimisest tulenev pealkiri vms. @et
toolkit label: variantpealkiri teoses @et
toolkit definition: Teos, millel on pealkiri, mis kindlas rakenduses või kontekstis ei ole valitud eelistatuks. @et
label: ist abweichender Titel eines Werks von @de
definition: Setzt ein Nomen in Beziehung zu einem Werk, das über einen Titel eines Werks verfügt, der in einer bestimmten Anwendung oder in einem bestimmten Kontext nicht als Vorzugsform bestimmt wird. @de
scope note: Darunter fallen Titel oder Titelformen, die in einer Manifestation des Werks erscheinen oder in Nachschlagewerken zu finden sind, Titel, die sich aus einer abweichenden Transliteration ergeben, und so weiter. @de
toolkit label: Abweichender Titel eines Werks von @de
toolkit definition: Ein Werk, das über einen Titel eines Werks verfügt, der in einer bestimmten Anwendung oder in einem bestimmten Kontext nicht als Vorzugsform bestimmt wird. @de
label: címvariánsa a következő műnek: @hu
definition: Hozzákapcsol egy noment egy műhöz, amely rendelkezik egy olyan műhöz tartozó címmel, amelyet egy adott alkalmazásban vagy kontextusban nem részesítenek előnyben. @hu
scope note: Egy mű címvariánsa magában foglal egy olyan címet vagy címalakot, amely a mű megjelenési formáján jelenik meg, vagy referensz-forrásokban található, de címet eredményez egy cím másféle átírása stb. is. @hu
toolkit label: címváltozata a következő műnek: @hu
toolkit definition: Egy mű, amely rendelkezik egy olyan műhöz tartozó címmel, amelyet egy adott alkalmazásban vagy kontextusban nem részesítenek előnyben. @hu
label: è titolo variante dell'opera di @it
definition: Correla un nomen a un'opera che ha un titolo di opera che non è stato selezionato come preferito in uno specifico schema di codifica di vocabolario. @it
toolkit label: titolo variante dell'opera di @it
toolkit definition: Un'opera che ha un titolo di opera che non è stato selezionato come preferito in uno specifico schema di codifica di vocabolario. @it
label: ir cits nosaukums darbam @lv
definition: Sasaista nomenu ar darbu, kam ir darba nosaukums, kas nav izvēlēts kā prioritārs noteiktā lietojumprogrammā vai kontekstā. @lv
toolkit label: ir cits nosaukums darbam @lv
toolkit definition: Darbs, kam ir darba nosaukums, kas nav izvēlēts kā prioritārs noteiktā lietojumprogrammā vai kontekstā. @lv
scope note: Darba cits nosaukums ietver nosaukumu vai nosaukuma veidu, kas parādās darba manifestācijā vai atrodama atsauces avotos, nosaukumā, kas iegūts no nosaukuma atšķirīgas transliterācijas u.tml. @lv
label: 是……的作品的变异题名 @zh-hans
definition: 将一个命名与有在一个特定的应用或语境中未被首选的一个作品题名的一种作品关联起来。 @zh-hans
toolkit label: ……的作品的变异题名 @zh-hans
toolkit definition: 有在一个特定的应用或语境中未被首选的一个作品题名的一种作品 @zh-hans
scope note: 变异题名包括出现在该作品的载体表现上或在参考信息源中被发现的题名或题名形式、由题名的不同音译所导致的题名等。 @zh-hans
has subproperty: P80110
label: eserin farklı başlığı @tr
definition: Bir ismi, belirli bir uygulama veya bağlamda tercih edilmek üzere seçilmeyen bir eser başlığına sahip bir eserle ilişkilendirir. @tr
toolkit label: eserin alternatif başlığı @tr

Published
type: Concept

Deprecated
type: Concept

is numbering within sequence of
status: Published
definition: Relates a nomen to a manifestation that has a designation that identifies its position in a sequence of individual parts of a larger manifestation or parts or issues of a larger work.
type: Property
domain: C10012
lexical alias: numberingWithinSequenceOf.en
has element type: 2
toolkit label: numbering within sequence of
toolkit definition: A manifestation that has a designation that identifies its position in a sequence of individual parts of a larger manifestation or parts or issues of a larger work.
sub property of: has related manifestation of nomen
label: numerointijakson sisäinen numerointi manifestaatiossa @fi
definition: Liittää nomenin manifestaatioon, jonka määrite identifioi sen sijainnin laajemman manifestaation yksittäisten osien tai laajemman teoksen osien tai numeroiden jaksossa. @fi
toolkit label: numerointijakson sisäinen numerointi manifestaatiossa @fi
toolkit definition: Manifestaation, jonka määrite identifioi sen sijainnin laajemman manifestaation yksittäisten osien tai laajemman teoksen osien tai numeroiden jaksossa. @fi
toolkit definition: Een manifestatie die een aanduiding heeft die haar positie identificeert in een volgorde van individuele delen van een grotere manifestatie of delen of afleveringen van een groter werk. @nl
toolkit label: nummering binnen volgorde van @nl
label: is nummering binnen volgorde van @nl
definition: Relateert een nomen aan een manifestatie die een aanduiding heeft die haar positie identificeert in een volgorde van individuele delen van een grotere manifestatie of delen of afleveringen van een groter werk. @nl
label: ir numerācija virknes ietvaros @lv
definition: Sasaista nomenu ar manifestāciju, kurai ir apzīmējums, kas identificē tās pozīciju lielākas manifestācijas atsevišķu daļu vai lielāka darba daļu vai laidienu virknē. @lv
toolkit label: numerācija virknes ietvaros @lv
toolkit definition: Manifestācija, kurai ir apzīmējums, kas identificē tās pozīciju lielākas manifestācijas atsevišķu daļu vai lielāka darba daļu vai laidienu virknē. @lv
label: est une numérotation au sein d’une séquence de @fr
definition: Met un nomen en relation avec une manifestation qui possède une désignation identifiant sa position dans une séquence de parties individuelles d’une manifestation plus vaste ou de parties ou livraisons d’une œuvre plus vaste. @fr
toolkit label: numérotation au sein d’une séquence de @fr
toolkit definition: Manifestation qui possède une désignation identifiant sa position dans une séquence de parties individuelles d’une manifestation plus vaste ou de parties ou livraisons d’une œuvre plus vaste. @fr
label: هو ترقيم ضمن تسلسل لـ @ar
definition: يربط تسمية بتجسيدة لها تسمية تحدد ترتيبها في تسلسل أجزاء فردية لتجسيدة أكبر، أو في أجزاء، أو في اصدارات لعمل أكبر. @ar
toolkit label: هو ترقيم ضمن تسلسل لـ @ar
toolkit definition: تجسيدة لها تسمية تحدد ترتيبها في تسلسل أجزاء فردية لتجسيدة أكبر، أو في أجزاء، أو في إصدارات لعمل أكبر. @ar
label: er nummerering indenfor en rækkefølge af @da
definition: Relaterer et nomen til en manifestation der har en betegnelse der identificerer dets position i en rækkefølge af individuelle dele af en større manifestation eller dele eller udgaver af et større værk. @da
toolkit label: nummerering indenfor en rækkefølge af @da
toolkit definition: Manifestation der har en betegnelse der identificerer dets position i en rækkefølge af individuelle dele af en større manifestation eller dele eller udgaver af et større værk. @da
label: ist Zählung innerhalb einer Reihe von @de
definition: Setzt ein Nomen in Beziehung zu einer Manifestation, die über eine Bezeichnung verfügt, die ihre Position in einer Reihe einzelner Teile einer größeren Manifestation oder Teilen oder Ausgaben eines größeren Werks identifiziert. @de
toolkit label: Zählung innerhalb einer Reihe von @de
toolkit definition: Eine Manifestation, die über eine Bezeichnung verfügt, die ihre Position in einer Reihe einzelner Teile einer größeren Manifestation oder Teilen oder Ausgaben eines größeren Werks identifiziert. @de
label: és numeració dins una seqüència de @ca
definition: Relaciona un nomen amb una manifestació que té una designació que identifica la seva posició en una seqüència de parts individuals d’una manifestació més gran o parts o números d’una obra més gran. @ca
toolkit label: numeració dins una seqüència de @ca
toolkit definition: Manifestació que té una designació que identifica la seva posició en una seqüència de parts individuals d’una manifestació més gran o parts o números d’una obra més gran. @ca
label: 是在……的序列中的编号 @zh-hans
definition: 将一个命名与有标识其在一种较大载体表现中的个别部分或者一种较大作品中的部分或期的序列中的位置的一个标识的一种载体表现关联起来。 @zh-hans
toolkit label: 在……的序列中的编号 @zh-hans
toolkit definition: 有标识其在一种较大载体表现中的个别部分或者一种较大作品中的部分或期的序列中的位置的一个标识的一种载体表现 @zh-hans
label: sorrendiséget jelző számozása a következőnek: @hu
definition: Hozzákapcsol egy noment egy megjelenési formához, amelynek megjelölése azonosítja annak elhelyezkedését az egyedi részek sorrendiségében egy nagyobb mű részeként vagy számaként. @hu
toolkit label: sorrendiséget jelző számozása: @hu
toolkit definition: Egy megjelenési forma, amelynek megjelölése azonosítja annak elhelyezkedését az egyedi részek sorrendiségében egy nagyobb mű részeként vagy számaként. @hu
has subproperty: P80179
label: sırası içinde numaralandırılmıştır @tr
definition: Bir ismi, daha büyük bir gösterimin tek tek bölümlerinin bir dizisindeki konumunu veya daha büyük bir çalışmanın bölümleri veya konuları içindeki konumunu tanımlayan bir adlandırmaya sahip bir gösterimle ilişkilendirir. @tr
toolkit label: Sırası içinde numaralandırma @tr
toolkit definition: Daha büyük bir gösterimin veya daha büyük bir eserin bölümleri ya da sayıları dizisindeki konumunu belirten bir tanımlamaya sahip bir gösterim. @tr

is first alphanumeric designation of alternative sequence of
status: Published
definition: Relates a nomen to a manifestation that has a designation in the form of numbers or alphabetic characters that is used to indicate the first in a concurrent sequence of numbering of parts or iterations.
type: Property
domain: C10012
lexical alias: firstAlphanumericDesignationOfAlternativeSequenceOf.en
has element type: 2
toolkit label: first alphanumeric designation of alternative sequence of
toolkit definition: A manifestation that has a designation in the form of numbers or alphabetic characters that is used to indicate the first in a concurrent sequence of numbering of parts or iterations.
sub property of: is first alphanumeric designation of sequence of
label: vaihtoehtoisen numerointijakson ensimmäinen numero- ja/tai kirjainmäärite manifestaatiossa @fi
definition: Liittää nomenin manifestaation numeroista ja/tai kirjaimista muodostuvaan määritteeseen, joka osoittaa osien tai iteraatioiden rinnakkaisten numerointijaksojen ensimmäisen määritteen. @fi
toolkit label: vaihtoehtoisen numerointijakson ensimmäinen numero- ja/tai kirjainmäärite manifestaatiossa @fi
toolkit definition: Manifestaation numeroista ja/tai kirjaimista muodostuvaan määrite, joka osoittaa osien tai iteraatioiden rinnakkaisen numerointijakson ensimmäisen määritteen. @fi
toolkit definition: Een manifestatie die een aanduiding heeft in de vorm van nummers of alfabetische karakters, die gebruikt is om aan te geven wat de eerste is in een gelijktijdige volgorde van nummering van delen of iteraties. @nl
toolkit label: eerste alfanumerieke aanduiding van alternatieve volgorde van @nl
label: is eerste alfanumerieke aanduiding van alternatieve volgorde van @nl
definition: Relateert een nomen aan een manifestatie die een aanduiding heeft in de vorm van nummers of alfabetische karakters, die gebruikt is om aan te geven wat de eerste is in een gelijktijdige volgorde van nummering van delen of iteraties. @nl
label: ir pirmais alternatīvās virknes burtciparu apzīmējums @lv
definition: Sasaista nomenu ar manifestāciju, kurai ir apzīmējums skaitļu vai alfabēta rakstzīmju veidā, ko izmanto, lai paralēlā daļu vai iterāciju numerācijas virknē norādītu pirmo. @lv
toolkit label: pirmais alternatīvās virknes burtciparu apzīmējums @lv
toolkit definition: Manifestācija, kurai ir apzīmējums skaitļu vai alfabēta rakstzīmju veidā, ko izmanto, lai paralēlā daļu vai iterāciju numerācijas virknē norādītu pirmo. @lv
label: est la première désignation alphanumérique d’une autre séquence de @fr
definition: Met un nomen en relation avec une manifestation qui possède une désignation sous forme de nombres ou de caractères alphabétiques servant à indiquer la première partie ou itération dans une séquence concomitante de numérotation de parties ou itérations. @fr
toolkit label: première désignation alphanumérique d’une autre séquence de @fr
toolkit definition: Manifestation qui possède une désignation sous forme de nombres ou de caractères alphabétiques servant à indiquer la première partie ou itération dans une séquence concomitante de numérotation de parties ou itérations. @fr
label: هي أول تسمية هجائية رقمية لتسلسل بديل لـ @ar
definition: يربط تسمية بتجسيدة لها تسمية في شكل أرقام أو حروف هجائية تستخدم للإشارة إلى الأول في تسلسل الترقيم لأجزاء أو تكرارات. @ar
toolkit label: أول تسمية رقمية في تسلسل بديل لـ @ar
toolkit definition: تجسيدة لها تسمية في شكل أرقام أو حروف هجائية تستخدم للإشارة إلى الأول في تسلسل مرتب زمنيا لترقيم أجزاء أو تكرارات. @ar
label: er første alfanumeriske betegnelse af alternativ rækkefølge af @da
definition: Relaterer et nomen til en manifestation der har en betegnelse i form af cifre eller alfabetiske karakterer der anvendes for at angive det første nummer i en samtidig rækkefølge af nummerering af dele eller iterationer. @da
toolkit label: første alfanumeriske betegnelse af alternativ rækkefølge af @da
toolkit definition: Manifestation der har en betegnelse i form af cifre eller alfabetiske karakterer der anvendes for at angive det første nummer i en samtidig rækkefølge af nummerering af dele eller iterationer. @da
label: ist alternative alphanumerische Bezeichnung der ersten Ausgabe einer fortlaufenden Ressource von @de
definition: Setzt ein Nomen in Beziehung zu einer Manifestation, die über eine Bezeichnung in Form von Nummern oder Buchstaben verfügt, die verwendet wird, um in einer alternativen Zählfolge der Ausgaben oder Iterationen auf die erste hinzuweisen. @de
toolkit label: Alternative alphanumerische Bezeichnung der ersten Ausgabe einer fortlaufenden Ressource von @de
toolkit definition: Eine Manifestation, die über eine Bezeichnung in Form von Nummern oder Buchstaben verfügt, die verwendet wird, um in einer alternativen Zählfolge der Ausgaben oder Iterationen auf die erste hinzuweisen. @de
label: és primera designació alfanumèrica d’una seqüència alternativa de @ca
definition: Relaciona un nomen amb una manifestació que té una designació en la forma de números o caràcters alfabètics que s’usen per indicar la primera en una seqüència concurrent de numeració de parts o iteracions. @ca
toolkit label: primera designació alfanumèrica d’una seqüència alternativa de @ca
toolkit definition: Manifestació que té una designació en la forma de números o caràcters alfabètics que s’usen per indicar la primera en una seqüència concurrent de numeració de parts o iteracions. @ca
label: 是……的交替序列的第一个字母数字标识 @zh-hans
definition: 将一个命名与有以数字或字母字符形式标识用于标识部分或更新后整体的并存编号序列中第一个的一种载体表现关联起来。 @zh-hans
toolkit label: ……的交替序列的第一个字母数字标识 @zh-hans
toolkit definition: 有以数字或字母字符形式标识用于标识部分或更新后整体的并存编号序列中第一个的一种载体表现 @zh-hans
label: alfanumerikus kezdőjelölése a következő alternatív sorrendiségének: @hu
definition: Hozzákapcsol egy noment egy megjelenési formához, amelynek megjelölése számok vagy alfabetikus karakterek formájában jelzi az elsőt a részek vagy iterációk konkurens számozási sorrendjében. @hu
toolkit label: alfanumerikus kezdőjelölése a következő alternatív sorrendiségének: @hu
toolkit definition: Egy megjelenési forma, amelynek megjelölése számok vagy alfabetikus karakterek formájában jelzi az elsőt a részek vagy iterációk konkurens számozási sorrendjében. @hu
has subproperty: P80180
label: alternatif sırasının ilk alfanümerik tanımlanmasıdır @tr
definition: Bir ismi, parçaların veya yinelemelerin eşzamanlı numaralandırma dizisindeki ilki belirtmek için kullanılan, sayılar veya alfabetik karakterler biçiminde bir adlandırmaya sahip bir gösterimle ilişkilendirir. @tr
toolkit label: alternatif sıralamanın ilk alfanümerik tanımlaması @tr
toolkit definition: Parçaların veya yinelemelerin eşzamanlı numaralandırma dizisindeki ilki belirtmek için kullanılan, sayılar veya alfabetik karakterler biçiminde bir belirtece sahip bir gösterim. @tr

is first alphanumeric designation of sequence of
status: Published
definition: Relates a nomen to a manifestation that has a designation in the form of numbers or alphabetic characters that is used to indicate the first in a sequence of numbering of parts or iterations.
type: Property
domain: C10012
lexical alias: firstAlphanumericDesignationOfSequenceOf.en
has element type: 2
toolkit label: first alphanumeric designation of sequence of
toolkit definition: A manifestation that has a designation in the form of numbers or alphabetic characters that is used to indicate the first in a sequence of numbering of parts or iterations.
sub property of: has related manifestation of nomen
label: numerointijakson ensimmäinen numero- ja/tai kirjainmäärite manifestaatiossa @fi
definition: Liittää nomenin manifestaation numeroista ja/tai kirjaimista muodostuvaan määritteeseen, joka osoittaa osien tai iteraatioiden numerointijakson ensimmäisen määritteen. @fi
toolkit label: numerointijakson ensimmäinen numero- ja/tai kirjainmäärite manifestaatiossa @fi
toolkit definition: Manifestaation numeroista ja/tai kirjaimista muodostuvaan määrite, joka osoittaa osien tai iteraatioiden numerointijakson ensimmäisen määritteen. @fi
toolkit definition: Een manifestatie die een aanduiding heeft in de vorm van nummers of alfabetische karakters, die gebruikt is om aan te geven wat de eerste is in een volgorde van nummering van delen of iteraties. @nl
toolkit label: eerste alfanumerieke aanduiding van volgorde van @nl
label: is eerste alfanumerieke aanduiding van volgorde van @nl
definition: Relateert een nomen aan een manifestatie die een aanduiding heeft in de vorm van nummers of alfabetische karakters, die gebruikt is om aan te geven wat de eerste is in een volgorde van nummering van delen of iteraties. @nl
label: ir pirmais virknes burtciparu apzīmējums @lv
definition: Sasaista nomenu ar manifestāciju, kurai ir apzīmējums skaitļu vai alfabēta rakstzīmju veidā, ko izmanto, lai daļu vai iterāciju numerācijas virknē norādītu pirmo. @lv
toolkit label: pirmais virknes burtciparu apzīmējums @lv
toolkit definition: Manifestācija, kurai ir apzīmējums skaitļu vai alfabēta rakstzīmju veidā, ko izmanto, lai daļu vai iterāciju numerācijas virknē norādītu pirmo. @lv
label: est la première designation alphanumérique d’une séquence de @fr
definition: Met un nomen en relation avec une manifestation qui possède une désignation sous forme de nombres ou de caractères alphabétiques servant à indiquer la première partie ou itération dans une séquence de numérotation de parties ou itérations. @fr
toolkit label: première designation alphanumérique d’une séquence de @fr
toolkit definition: Manifestation qui possède une désignation sous forme de nombres ou de caractères alphabétiques servant à indiquer la première partie ou itération dans une séquence de numérotation de parties ou itérations. @fr
label: هي أول تسمية هجائية رقمية في تسلسل لـ @ar
definition: يربط تسمية بتجسيدة لها تسمية في شكل أرقام أو حروف هجائية تُستخدم للإشارة إلى الأول في تسلسل متزامن لترقيم أجزاء أو تكرارات. @ar
toolkit label: أول تسمية رقمية هجائية في تسلسل لـ @ar
toolkit definition: تجسيدة لها تسمية في شكل أرقام أو حروف هجائية تُستخدم للإشارة إلى الأول في تسلسل أرقام أو في أجزاء أو في تكرارات. @ar
label: er første alfanumeriske betegnelse af rækkefølge af @da
definition: Relaterer et nomen til en manifestation der har en betegnelse i form af cifre eller alfabetiske karakterer der anvendes for at angive det første nummer i en rækkefølge af nummerering af dele eller iterationer. @da
toolkit label: første alfanumeriske betegnelse af rækkefølge af @da
toolkit definition: Manifestation der har en betegnelse i form af cifre eller alfabetiske karakterer der anvendes for at angive det første nummer i en rækkefølge af nummerering af dele eller iterationer. @da
label: ist alphanumerische Bezeichnung der ersten Ausgabe einer fortlaufenden Ressource von @de
definition: Setzt ein Nomen in Beziehung zu einer Manifestation, die über eine Bezeichnung in Form von Nummern oder Buchstaben verfügt, die verwendet wird, um in einer Zählfolge der Ausgaben auf die erste hinzuweisen. @de
toolkit label: Alphanumerische Bezeichnung der ersten Ausgabe einer fortlaufenden Ressource von @de
toolkit definition: Eine Manifestation, die über eine Bezeichnung in Form von Nummern oder Buchstaben verfügt, die verwendet wird, um in einer Zählfolge der Ausgaben auf die erste hinzuweisen. @de
label: és primera designació alfanumèrica d’una seqüència de @ca
definition: Relaciona un nomen amb una manifestació que té una designació en la forma de números o caràcters alfabètics que s’usen per indicar la primera en una seqüència de numeració de parts o iteracions. @ca
toolkit label: primera designació alfanumèrica d’una seqüència de @ca
toolkit definition: Manifestació que té una designació en la forma de números o caràcters alfabètics que s’usen per indicar la primera en una seqüència de numeració de parts o iteracions. @ca
label: 是……的序列的第一个字母数字标识 @zh-hans
definition: 将一个命名与有以数字或字母字符形式标识用于标识部分或更新后整体的编号序列中第一个的一种载体表现关联起来。 @zh-hans
toolkit label: ……的序列的第一个字母数字标识 @zh-hans
toolkit definition: 有以数字或字母字符形式标识用于标识部分或更新后整体的编号序列中第一个的一种载体表现 @zh-hans
label: alfanumerikus kezdőjelölése a következő sorrendiségének: @hu
definition: Hozzákapcsol egy noment egy megjelenési formához, amelynek megjelölése számok vagy alfabetikus karakterek formájában jelzi az elsőt a részek vagy iterációk számozási sorrendjében. @hu
toolkit label: alfanumerikus kezdőjelölése a következő sorrendiségének: @hu
toolkit definition: Egy megjelenési forma, amelynek megjelölése számok vagy alfabetikus karakterek formájában jelzi az elsőt a részek vagy iterációk számozási sorrendjében. @hu
has subproperty: is first alphanumeric designation of alternative sequence of
has subproperty: P80181
label: sırasının ilk alfanümerik tanımlanmasıdır @tr
definition: Bir ismi, parçaların veya yinelemelerin numaralandırma dizisindeki ilki belirtmek için kullanılan, sayılar veya alfabetik karakterler biçiminde bir adlandırmaya sahip bir gösterimle ilişkilendirir. @tr
toolkit label: sıralamanın ilk alfanümerik tanımlaması @tr
toolkit definition: Parçaların veya yinelemelerin numaralandırma dizisindeki ilki belirtmek için kullanılan, sayılar veya alfabetik karakterler biçiminde bir belirtece sahip bir gösterim. @tr

is first chronological designation of alternative sequence of
status: Published
definition: Relates a nomen to a manifestation that has a designation in the form of a date or other timespan that is used to indicate the first in a concurrent sequence of numbering of parts or iterations.
type: Property
domain: C10012
lexical alias: firstChronologicalDesignationOfAlternativeSequenceOf.en
has element type: 2
toolkit label: first chronological designation of alternative sequence of
toolkit definition: A manifestation that has a designation in the form of a date or other timespan that is used to indicate the first in a concurrent sequence of numbering of parts or iterations.
sub property of: is first chronological designation of sequence of
label: vaihtoehtoisen numerointijakson ensimmäinen aikamäärite manifestaatiossa @fi
definition: Liittää nomenin manifestaation päivämäärästä tai muusta ajanjaksosta muodostuvaan määritteeseen, joka on manifestaation osien tai iteraatioiden rinnakkaisen numerointijakson ensimmäinen määrite. @fi
toolkit label: vaihtoehtoisen numerointijakson ensimmäinen aikamäärite manifestaatiossa @fi
toolkit definition: Manifestaation päivämäärästä tai muusta ajanjaksosta muodostuva määrite, joka on manifestaation osien tai iteraatioiden rinnakkaisen numerointijakson ensimmäinen määrite. @fi
toolkit definition: Een manifestatie die een aanduiding heeft in de vorm van een datum of andere tijdspanne, die gebruikt is om aan te geven wat de eerste is in een gelijktijdige volgorde van nummering van delen of iteraties. @nl
toolkit label: eerste chronologische aanduiding van alternatieve volgorde van @nl
label: is eerste chronologische aanduiding van alternatieve volgorde van @nl
definition: Relateert een nomen aan een manifestatie die een aanduiding heeft in de vorm van een datum of andere tijdspanne, die gebruikt is om aan te geven wat de eerste is in een gelijktijdige volgorde van nummering van delen of iteraties. @nl
label: ir pirmais alternatīvās virknes hronoloģiskais apzīmējums @lv
definition: Sasaista nomenu ar manifestāciju, kurai ir apzīmējums datuma vai citāda laikposma veidā, ko izmanto, lai paralēlā daļu vai iterāciju numerācijas virknē norādītu pirmo. @lv
toolkit label: pirmais alternatīvās virknes hronoloģiskais apzīmējums @lv
toolkit definition: Manifestācija, kurai ir apzīmējums datuma vai citāda laikposma veidā, ko izmanto, lai paralēlā daļu vai iterāciju numerācijas virknē norādītu pirmo. @lv
label: est la première désignation chronologique d’une autre séquence de @fr
definition: Met un nomen en relation avec une manifestation qui possède une désignation sous forme de date ou d’un autre laps de temps servant à indiquer la première partie ou itération dans une séquence de numérotation concomitante de parties ou itérations. @fr
toolkit label: première désignation chronologique d’une autre séquence de @fr
toolkit definition: Manifestation qui possède une désignation sous forme de date ou d’un autre laps de temps servant à indiquer la première partie ou itération dans une séquence de numérotation concomitante de parties ou itérations. @fr
label: هي أول تسمية هجائية رقمية لتسلسل بديل لـ @ar
definition: يربط تسمية بتجسيدة لها اسم في شكل تاريخ أو فترة زمنية أخرى تُستخدم للإشارة إلى الأول في تسلسل متزامن لأرقام أو أجزاء أو تكرارات. @ar
toolkit label: أول اسم زمني لتسلسل بديل @ar
toolkit definition: تجسيدة لها تسمية في شكل تاريخ أو فترة زمنية أخرى تُستخدم للإشارة إلى الأول في تسلسل متزامن لأرقام أو أجزاء أو تكرارات. @ar
label: er første kronologiske betegnelse af alternativ rækkefølge af @da
definition: Relaterer et nomen til en manifestation der har en betegnelse i form af et dato eller andet tidsforløb der bruges for at betegne den første i en samtidig rækkefølge af nummerereing af dele eller iterationer. @da
toolkit label: første kronologiske betegnelse af alternativ rækkefølge af @da
toolkit definition: Manifestation der har en betegnelse i form af et dato eller andet tidsforløb der bruges for at betegne den første i en samtidig rækkefølge af nummerereing af dele eller iterationer. @da
label: ist alternative chronologische Bezeichnung einer ersten Ausgabe einer fortlaufenden Ressource von @de
definition: Setzt ein Nomen in Beziehung zu einer Manifestation, die über eine Bezeichnung in Form eines Datums oder eines anderen Zeitraums verfügt, die verwendet wird, um in einer alternativen Zählfolge der Ausgaben auf die erste hinzuweisen. @de
toolkit label: Alternative chronologische Bezeichnung der ersten Ausgabe einer fortlaufenden Ressource von @de
toolkit definition: Eine Manifestation, die über eine Bezeichnung in Form eines Datums oder eines anderen Zeitraums verfügt, die verwendet wird, um in einer alternativen Zählfolge der Ausgaben auf die erste hinzuweisen. @de
label: és primera designació cronològica d’una seqüència alternativa de @ca
definition: Relaciona un nomen amb una manifestació que té una designació en la forma d’una data o un altre interval de temps que s’usa per indicar la primera en una seqüència concurrent de numeració de parts o iteracions. @ca
toolkit label: primera designació cronològica d’una seqüència alternativa de @ca
toolkit definition: Manifestació que té una designació en la forma d’una data o un altre interval de temps que s’usa per indicar la primera en una seqüència concurrent de numeració de parts o iteracions. @ca
label: 是……的交替序列的第一个年代标识 @zh-hans
definition: 将一个命名与有以日期或其他时间段形式标识用于标识部分或更新后整体的并存编号序列中第一个的一种载体表现关联起来。 @zh-hans
toolkit label: ……的交替序列的第一个年代标识 @zh-hans
toolkit definition: 有以日期或其他时间段形式标识用于标识部分或更新后整体的并存编号序列中第一个的一种载体表现 @zh-hans
label: kronológiai kezdőjelölése a következő alternatív sorrendiségének: @hu
definition: Hozzákapcsol egy noment egy megjelenési formához, amelynek megjelölése dátum vagy más időtartam formájában jelzi az elsőséget a részek vagy iterációk konkurens számozási sorrendjében. @hu
toolkit label: kronológiai kezdőjelölése a következő alternatív sorrendiségének: @hu
toolkit definition: Hozzákapcsol egy noment egy megjelenési formához, amelynek megjelölése számok vagy alfabetikus karakterek formájában jelzi az elsőt a részek vagy iterációk számozási sorrendjében. @hu
has subproperty: P80182
label: alternatif sırasının ilk kronolojik tanımlanmasıdır @tr
definition: Bir ismi, parçaların veya yinelemelerin eşzamanlı numaralandırma dizisindeki ilki belirtmek için kullanılan bir tarih veya başka bir zaman aralığı biçiminde bir adlandırmaya sahip bir gösterim ilişkilendirir. @tr
toolkit label: alternatif sıralamanın ilk kronolojik tanımlaması @tr
toolkit definition: Parçaların veya yinelemelerin eşzamanlı numaralandırma dizisindeki ilki belirtmek için kullanılan bir tarih veya başka bir zaman aralığı biçiminde bir belirtece sahip bir gösterim. @tr

is first chronological designation of sequence of
status: Published
definition: Relates a nomen to a manifestation that has a designation in the form of a date or other timespan that is used to indicate the first in a sequence of numbering of parts or iterations.
type: Property
domain: C10012
lexical alias: firstChronologicalDesignationOfSequenceOf.en
has element type: 2
toolkit label: first chronological designation of sequence of
toolkit definition: A manifestation that has a designation in the form of a date or other timespan that is used to indicate the first in a sequence of numbering of parts or iterations.
sub property of: has related manifestation of nomen
label: numerointijakson ensimmäinen aikamäärite manifestaatiossa @fi
definition: Liittää manifestaation päivämäärästä tai muusta ajanjaksosta muodostuvaan määritteeseen, joka ilmaisee manifestaation osien tai iteraatioiden numerointijakson ensimmäisen määritteen. @fi
toolkit label: numerointijakson ensimmäinen aikamäärite manifestaatiossa @fi
toolkit definition: Manifestaation päivämäärästä tai muusta ajanjaksosta muodostuva määrite, joka ilmaisee manifestaation osien tai iteraatioiden numerointijakson ensimmäisen määritteen. @fi
toolkit definition: Een manifestatie die een aanduiding heeft in de vorm van een datum of andere tijdspanne, die gebruikt is om aan te geven wat de eerste is in een volgorde van nummering van delen of iteraties. @nl
toolkit label: eerste chronologische aanduiding van volgorde van @nl
label: is eerste chronologische aanduiding van volgorde van @nl
definition: Relateert een nomen aan een manifestatie die een aanduiding heeft in de vorm van een datum of andere tijdspanne, die gebruikt is om aan te geven wat de eerste is in een volgorde van nummering van delen of iteraties. @nl
label: ir pirmais virknes hronoloģiskais apzīmējums @lv
definition: Sasaista nomenu ar manifestāciju, kurai ir apzīmējums datuma vai citāda laikposma veidā, ko izmanto, lai daļu vai iterāciju numerācijas virknē norādītu pirmo. @lv
toolkit label: pirmais virknes hronoloģiskais apzīmējums @lv
toolkit definition: Manifestācija, kurai ir apzīmējums datuma vai citāda laikposma veidā, ko izmanto, lai daļu vai iterāciju numerācijas virknē norādītu pirmo. @lv
label: est la première désignation chronologique d’une séquence de @fr
definition: Met un nomen en relation avec une manifestation qui possède une désignation sous forme de date ou d’un autre laps de temps servant à indiquer la première partie ou itération dans une séquence de numérotation de parties ou itérations. @fr
toolkit label: première désignation chronologique d’une séquence de @fr
toolkit definition: Manifestation qui possède une désignation sous forme de date ou d’un autre laps de temps servant à indiquer la première partie ou itération dans une séquence de numérotation de parties ou itérations. @fr
label: هو أول اسم زمني في تسلسل لـ @ar
definition: يربط تسمية بتجسيدة لها تسمية في شكل تاريخ أو فترة زمنية أخرى تُستخدم للإشارة إلى الأول في تسلسل أرقام أو في أجزاء أو في تكرارات. @ar
toolkit label: هو أول اسم زمني في تسلسل لـ @ar
toolkit definition: تجسيدة لها تسمية في شكل تاريخ أو فترة زمنية أخرى تُستخدم للإشارة إلى الأول في تسلسل أرقام أو في أجزاء أو في تكرارات. @ar
label: er første kronologiske betegnelse af rækkefølge af @da
definition: Relaterer et nomen til en manifestation der har en betegnelse i form af et dato eller andet tidsforløb der bruges for at betegne den første i en rækkefølge af nummerereing af dele eller iterationer. @da
toolkit label: første kronologiske betegnelse af rækkefølge af @da
toolkit definition: Manifestation der har en betegnelse i form af et dato eller andet tidsforløb der bruges for at betegne den første i en rækkefølge af nummerereing af dele eller iterationer. @da
label: ist chronologische Bezeichnung der ersten Ausgabe einer fortlaufenden Ressource von @de
definition: Setzt ein Nomen in Beziehung zu einer Manifestation, die über eine Bezeichnung in Form eines Datums oder eines anderen Zeitraums verfügt, die verwendet wird, um in einer Zählfolge der Ausgaben auf die erste hinzuweisen. @de
toolkit label: Chronologische Bezeichnung der ersten Ausgabe einer fortlaufenden Ressource von @de
toolkit definition: Eine Manifestation, die über eine Bezeichnung in Form eines Datums oder eines anderen Zeitraums verfügt, die verwendet wird, um in einer Zählfolge der Ausgaben auf die erste hinzuweisen. @de
label: és primera designació cronològica d’una seqüència de @ca
definition: Relaciona un nomen amb una manifestació que té una designació en la forma d’una data o un altre interval de temps que s’usa per indicar la primera en una seqüència de numeració de parts o iteracions. @ca
toolkit label: primera designació cronològica d’una seqüència de @ca
toolkit definition: Manifestació que té una designació en la forma d’una data o un altre interval de temps que s’usa per indicar la primera en una seqüència de numeració de parts o iteracions. @ca
label: 是……的序列的第一个年代标识 @zh-hans
definition: 将一个命名与有以日期或其他时间段形式标识用于标识部分或更新后整体的编号序列中第一个的一种载体表现关联起来。 @zh-hans
toolkit label: ……的序列的第一个年代标识 @zh-hans
toolkit definition: 有以日期或其他时间段形式标识用于标识部分或更新后整体的编号序列中第一个的一种载体表现 @zh-hans
label: kronológiai kezdőjelölése a következő sorrendiségének: @hu
definition: Hozzákapcsol egy noment egy megjelenési formához, amelynek megjelölése dátum vagy más időtartam formájában jelzi az elsőt a részek vagy iterációk számozási sorrendjében. @hu
toolkit label: kronológiai kezdőjelölése a következő sorrendiségének: @hu
toolkit definition: Egy megjelenési forma, amelynek megjelölése dátum vagy más időtartam formájában jelzi az elsőt a részek vagy iterációk számozási sorrendjében. @hu
has subproperty: is first chronological designation of alternative sequence of
has subproperty: P80183
label: sırasının ilk kronolojik tanımlanmasıdır @tr
definition: Bir ismi, parçaların veya yinelemelerin numaralandırma dizisindeki ilki belirtmek için kullanılan bir tarih veya başka bir zaman aralığı biçiminde bir adlandırmaya sahip bir gösterimle ilişkilendirir. @tr
toolkit label: sıralamanın ilk kronolojik tanımlaması @tr
toolkit definition: Parçaların veya yinelemelerin numaralandırılma dizisindeki ilki belirtmek için kullanılan bir tarih veya başka bir zaman aralığı biçiminde bir berlitece sahip bir gösterim. @tr

is last alphanumeric designation of alternative sequence of
status: Published
definition: Relates a nomen to a manifestation that has a designation in the form of numbers or alphabetic characters that is used to indicate the last in a concurrent sequence of numbering of parts or iterations.
type: Property
domain: C10012
lexical alias: lastAlphanumericDesignationOfAlternativeSequenceOf.en
has element type: 2
toolkit label: last alphanumeric designation of alternative sequence of
toolkit definition: A manifestation that has a designation in the form of numbers or alphabetic characters that is used to indicate the last in a concurrent sequence of numbering of parts or iterations.
sub property of: is last alphanumeric designation of sequence of
label: vaihtoehtoisen numerointijakson viimeinen numero- ja/tai kirjainmäärite manifestaatiossa @fi
definition: Liittää nomenin manifestaation numeroista ja/tai kirjaimista muodostuvaan määritteeseen, joka on manifestaation osien tai iteraatioiden rinnakkaisen numerointijakson viimeinen määrite. @fi
toolkit label: vaihtoehtoisen numerointijakson viimeinen numero- ja/tai kirjainmäärite manifestaatiossa @fi
toolkit definition: Manifestaation numeroista ja/tai kirjaimista muodostuva määrite, joka on manifestaation osien tai iteraatioiden rinnakkaisen numerointijakson viimeinen määrite. @fi
toolkit definition: Een manifestatie die een aanduiding heeft in de vorm van nummers of alfabetische karakters, die gebruikt is om aan te geven wat de laatste is in een volgorde van nummering van delen of iteraties. @nl
toolkit label: laatste alfanumerieke aanduiding van alternatieve volgorde van @nl
label: is laatste alfanumerieke aanduiding van alternatieve volgorde van @nl
definition: Relateert een nomen aan een manifestatie die een aanduiding heeft in de vorm van nummers of alfabetische karakters, die gebruikt is om aan te geven wat de laatste is in een gelijktijdige volgorde van nummering van delen of iteraties. @nl
label: ir pēdējais alternatīvās virknes burtciparu apzīmējums @lv
definition: Sasaista nomenu ar manifestāciju, kurai ir apzīmējums skaitļu vai alfabēta rakstzīmju veidā, ko izmanto, lai paralēlā daļu vai iterāciju numerācijas virknē norādītu pēdējo. @lv
toolkit label: pēdējais alternatīvās virknes burtciparu apzīmējums @lv
toolkit definition: Manifestācija, kurai ir apzīmējums skaitļu vai alfabēta rakstzīmju veidā, ko izmanto, lai paralēlā daļu vai iterāciju numerācijas virknē norādītu pēdējo. @lv
label: est la dernière désignation alphanumérique d’une autre séquence de @fr
definition: Met un nomen en relation avec une manifestation qui possède une désignation sous forme de nombres ou de caractères alphabétiques servant à indiquer la dernière partie ou itération dans une séquence concomitante de numérotation de parties ou itérations. @fr
toolkit label: dernière désignation alphanumérique d’une autre séquence de @fr
toolkit definition: Manifestation qui possède une désignation sous forme de nombres ou de caractères alphabétiques servant à indiquer la dernière partie ou itération dans une séquence concomitante de numérotation de parties ou itérations. @fr
label: هي آخر تسمية هجائية رقمية في تسلسل بديل لـ @ar
definition: يربط تسمية بتجسيدة لها تسمية في شكل تاريخ أو فترة زمنية أخرى تُستخدم للإشارة إلى الآخر في تسلسل متزامن لأرقام أو أجزاء أو تكرارات. @ar
toolkit label: اسم هجائي رقمي في تسلسل بديل لـ @ar
toolkit definition: تجسيدة لها تسمية في شكل أرقام أو حروف هجائية تُستخدم للإشارة إلى أول عدد في تسلسل متزامن لترقيم أجزاء أو تكرارات. @ar
label: er sidste alfanumeriske betegnelse af alternativ rækkefølge af @da
definition: Relaterer et nomen til en manifestation der har en betegnelse i form af cifre eller alfabetiske karakterer der bruges for at betegne den sidste i en samtidig rækkefølge af nummerering af dele eller iterationer. @da
toolkit label: sidste alfanumeriske betegnelse af alternativ rækkefølge af @da
toolkit definition: Manifestation der har en betegnelse i form af cifre eller alfabetiske karakterer der bruges for at betegne den sidste i en samtidig rækkefølge af nummerering af dele eller iterationer. @da
label: ist alternative alphanumerische Bezeichnung der letzten Ausgabe oder des letzten Teils einer Folge von @de
definition: Setzt ein Nomen in Beziehung zu einer Manifestation, die über eine Bezeichnung in Form von Nummern oder Buchstaben verfügt, die verwendet wird, um in einer alternativen Zählfolge der Ausgaben oder Iterationen auf die letzte hinzuweisen. @de
toolkit label: Alternative alphanumerische Bezeichnung der letzten Ausgabe oder des letzten Teils einer Folge von @de
toolkit definition: Eine Manifestation, die über eine Bezeichnung in Form von Nummern oder Buchstaben verfügt, die verwendet wird, um in einer alternativen Zählfolge der Ausgaben oder Iterationen auf die letzte hinzuweisen. @de
label: és darrera designació alfanumèrica d’una seqüència alternativa de @ca
definition: Relaciona un nomen amb una manifestació que té una designació en la forma de números o caràcters alfabètics que s’usen per indicar la darrera en una seqüència concurrent de numeració de parts o iteracions. @ca
toolkit label: darrera designació alfanumèrica d’una seqüència alternativa de @ca
toolkit definition: Manifestació que té una designació en la forma de números o caràcters alfabètics que s’usen per indicar la darrera en una seqüència concurrent de numeració de parts o iteracions. @ca
label: 是……的交替序列的最后一个字母数字标识 @zh-hans
definition: 将一个命名与有以数字或字母字符形式标识用于标识部分或更新后整体的并存编号序列中最后一个的一种载体表现关联起来。 @zh-hans
toolkit label: ……的交替序列的最后一个字母数字标识 @zh-hans
toolkit definition: 有以数字或字母字符形式标识用于标识部分或更新后整体的并存编号序列中最后一个的一种载体表现 @zh-hans
label: alfanumerikus zárójelölése a következő alternatív sorrendiségének: @hu
definition: Hozzákapcsol egy noment egy megjelenési formához, amelynek megjelölése számok vagy alfabetikus karakterek formájában jelzi az utolsót a részek vagy iterációk konkurens számozási sorrendjében. @hu
toolkit label: alfanumerikus zárójelölése a következő alternatív sorrendiségének: @hu
toolkit definition: Egy megjelenési forma, amelynek megjelölése számok vagy alfabetikus karakterek formájában jelzi az utolsót a részek vagy iterációk konkurens számozási sorrendjében. @hu
has subproperty: P80184
label: alternatif sırasının son alfanümerik tanımlanmasıdır @tr
definition: Bir ismi, parçaların veya yinelemelerin eşzamanlı numaralandırma dizisindeki sonuncuyu belirtmek için kullanılan, sayılar veya alfabetik karakterler biçiminde bir adlandırmaya sahip bir gösterimle ilişkilendirir. @tr
toolkit label: Alternatif dizisinin son alfanümerik adlandırması @tr
toolkit definition: Parçaların veya yinelemelerin eşzamanlı numaralandırma dizisindeki sonuncuyu belirtmek için kullanılan, sayılar veya alfabetik karakterler biçiminde bir belirtece sahip bir gösterim. @tr

is last alphanumeric designation of sequence of
status: Published
definition: Relates a nomen to a manifestation that has a designation in the form of numbers or alphabetic characters that is used to indicate the last in a sequence of numbering of parts or iterations.
type: Property
domain: C10012
lexical alias: lastAlphanumericDesignationOfSequenceOf.en
has element type: 2
toolkit label: last alphanumeric designation of sequence of
toolkit definition: A manifestation that has a designation in the form of numbers or alphabetic characters that is used to indicate the last in a sequence of numbering of parts or iterations.
sub property of: has related manifestation of nomen
label: numerointijakson viimeinen numero- ja/tai kirjainmäärite manifestaatiossa @fi
definition: Liittää nomenin manifestaation numeroista ja/tai kirjaimista muodostuvaan määritteeseen, joka ilmaisee manifestaation osien tai iteraatioiden numerointijakson viimeisen määritteen. @fi
toolkit label: numerointijakson viimeinen numero- ja/tai kirjainmäärite manifestaatiossa @fi
toolkit definition: Manifestaation numeroista ja/tai kirjaimista muodostuva määrite, joka ilmaisee manifestaation osien tai iteraatioiden numerointijakson viimeisen määritteen. @fi
toolkit definition: Een manifestatie die een aanduiding heeft in de vorm van nummers of alfabetische karakters, die gebruikt is om aan te geven wat de laatste is in een volgorde van nummering van delen of iteraties. @nl
toolkit label: laatste alfanumerieke aanduiding van volgorde van @nl
label: is laatste alfanumerieke aanduiding van volgorde van @nl
definition: Relateert een nomen aan een manifestatie die een aanduiding heeft in de vorm van nummers of alfabetische karakters, die gebruikt is om aan te geven wat de laatste is in een volgorde van nummering van delen of iteraties. @nl
label: ir pēdējais virknes burtciparu apzīmējums @lv
definition: Sasaista nomenu ar manifestāciju, kurai ir apzīmējums skaitļu vai alfabēta rakstzīmju veidā, ko izmanto, lai norādītu daļu vai iterāciju numerācijas secībā pēdējo. @lv
toolkit label: pēdējais virknes burtciparu apzīmējums @lv
toolkit definition: Manifestācija, kurai ir apzīmējums skaitļu vai alfabēta rakstzīmju veidā, ko izmanto, lai norādītu daļu vai iterāciju numerācijas secībā pēdējo. @lv
label: est la dernière désignation alphanumérique d’une séquence de @fr
definition: Met un nomen en relation avec une manifestation qui possède une désignation sous forme de nombres ou de caractères alphabétiques servant à indiquer la dernière partie ou itération dans une séquence de numérotation de parties ou itérations. @fr
toolkit label: dernière désignation alphanumérique d’une séquence de @fr
toolkit definition: Manifestation qui possède une désignation sous forme de nombres ou de caractères alphabétiques servant à indiquer la dernière partie ou itération dans une séquence de numérotation de parties ou itérations. @fr
label: هو آخر تسمية هجائية رقمية في تسلسل لـ @ar
definition: يربط تسمية بتجسيدة لها تسمية في شكل تاريخ أو فترة زمنية أخرى تُستخدم للإشارة إلى الآخر في تسلسل متزامن لأرقام أو أجزاء أو تكرارات. @ar
toolkit label: آخر تسمية رقمية في تسلسل @ar
toolkit definition: تجسيدة لها تسمية في شكل تاريخ أو فترة زمنية أخرى تُستخدم للإشارة إلى الآخر في تسلسل متزامن لأرقام أو أجزاء أو تكرارات. @ar
label: er sidste alfanumeriske betegnelse af rækkefølge af @da
definition: Relaterer et nomen til en manifestation der har en betegnelse i form af cifre eller alfabetiske karakterer der bruges for at betegne den sidste i en rækkefølge af nummerering af dele eller iterationer. @da
toolkit label: sidste alfanumeriske betegnelse af rækkefølge af @da
toolkit definition: Manifestation der har en betegnelse i form af cifre eller alfabetiske karakterer der bruges for at betegne den sidste i en rækkefølge af nummerering af dele eller iterationer. @da
label: ist alphanumerische Bezeichnung der letzten Ausgabe einer fortlaufenden Ressource von @de
definition: Setzt ein Nomen in Beziehung zu einer Manifestation, die über eine Bezeichnung in Form von Nummern oder Buchstaben verfügt, die verwendet wird, um in einer Zählfolge der Ausgaben auf die letzte hinzuweisen. @de
toolkit label: Alphanumerische Bezeichnung der letzten Ausgabe einer fortlaufenden Ressource von @de
toolkit definition: Eine Manifestation, die über eine Bezeichnung in Form von Nummern oder Buchstaben verfügt, die verwendet wird, um in einer Zählfolge der Ausgaben auf die letzte hinzuweisen. @de
label: és darrera designació alfanumèrica d’una seqüència de @ca
definition: Relaciona un nomen amb una manifestació que té una designació en la forma de números o caràcters alfabètics que s’usen per indicar la darrera en una seqüència de numeració de parts o iteracions. @ca
toolkit label: darrera designació alfanumèrica d’una seqüència de @ca
toolkit definition: Manifestació que té una designació en la forma de números o caràcters alfabètics que s’usen per indicar la darrera en una seqüència de numeració de parts o iteracions. @ca
label: 是……的序列的最后一个字母数字标识 @zh-hans
definition: 将一个命名与有以数字或字母字符形式标识用于标识部分或更新后整体的编号序列中最后一个的一种载体表现关联起来。 @zh-hans
toolkit label: ……的序列的最后一个字母数字标识 @zh-hans
toolkit definition: 有以数字或字母字符形式标识用于标识部分或更新后整体的编号序列中最后一个的一种载体表现 @zh-hans
label: záró alfanumerikus megjelölése a következő sorrendiségének: @hu
definition: Hozzákapcsol egy noment egy megjelenési formához, amelynek megjelölése számok vagy alfabetikus karakterek formájában jelzi az utolsót a részek vagy iterációk számozási sorrendjében. @hu
toolkit label: alfanumerikus zárójelölése a következő sorrendiségének: @hu
toolkit definition: Egy megjelenési forma, amelynek megjelölése számok vagy alfabetikus karakterek formájában jelzi az utolsót a részek vagy iterációk számozási sorrendjében. @hu
has subproperty: is last alphanumeric designation of alternative sequence of
has subproperty: P80185
label: sırasının son alfanümerik tanımlanmasıdır @tr
definition: Bir ismi, parçaların veya yinelemelerin numaralandırma dizisindeki sonuncuyu belirtmek için kullanılan, sayılar veya alfabetik karakterler biçiminde bir adlandırmaya sahip bir gösterimle ilişkilendirir. @tr
toolkit label: Dizisinin son alfanümerik adlandırması @tr
toolkit definition: Parçaların veya yinelemelerin numaralandırma dizisindeki sonuncuyu belirtmek için kullanılan, sayılar veya alfabetik karakterler biçiminde bir belirtece olan bir gösterim. @tr

is last chronological designation of alternative sequence of
status: Published
definition: Relates a nomen to a manifestation that has a designation in the form of a date or other timespan that is used to indicate the last in a concurrent sequence of numbering of parts or iterations.
type: Property
domain: C10012
lexical alias: lastChronologicalDesignationOfAlternativeSequenceOf.en
has element type: 2
toolkit label: last chronological designation of alternative sequence of
toolkit definition: A manifestation that has a designation in the form of a date or other timespan that is used to indicate the last in a concurrent sequence of numbering of parts or iterations.
sub property of: is last chronological designation of sequence of
label: vaihtoehtoisen numerointijakson viimeinen aikamäärite manifestaatiossa @fi
definition: Liittää nomenin manifestaation päivämäärästä tai muusta ajanjaksosta muodostuvaan määritteeseen, joka on manifestaation osien tai iteraatioiden rinnakkaisen numerointijakson viimeinen määrite. @fi
toolkit label: vaihtoehtoisen numerointijakson viimeinen aikamäärite manifestaatiossa @fi
toolkit definition: Manifestaation päivämäärästä tai muusta ajanjaksosta muodostuva määrite, joka on manifestaation osien tai iteraatioiden rinnakkaisen numerointijakson viimeinen määrite. @fi
toolkit definition: Een manifestatie die een aanduiding heeft in de vorm van een datum of andere tijdspanne, die gebruikt is om aan te geven wat de laatste is in een gelijktijdige volgorde van nummering van delen of iteraties. @nl
toolkit label: laatste chronologische aanduiding van alternatieve volgorde van @nl
label: is laatste chronologische aanduiding van alternatieve volgorde van @nl
definition: Relateert een nomen aan een manifestatie die een aanduiding heeft in de vorm van een datum of andere tijdspanne, die gebruikt is om aan te geven wat de laatste is in een gelijktijdige volgorde van nummering van delen of iteraties. @nl
label: ir pēdējais alternatīvās virknes hronoloģiskais apzīmējums @lv
definition: Sasaista nomenu ar manifestāciju, kurai ir apzīmējums datuma vai citāda laikposma veidā, ko izmanto, lai paralēlā daļu vai iterāciju numerācijas virknē norādītu pēdējo. @lv
toolkit label: pēdējais alternatīvās virknes hronoloģiskais apzīmējums @lv
toolkit definition: Manifestācija, kurai ir apzīmējums datuma vai citāda laikposma veidā, ko izmanto, lai paralēlā daļu vai iterāciju numerācijas virknē norādītu pēdējo. @lv
label: est la dernière désignation chronologique d’une autre séquence de @fr
definition: Met un nomen en relation avec une manifestation qui possède une désignation sous forme de date ou d’un autre laps de temps servant à indiquer la dernière partie ou itération dans une séquence de numérotation concomitante de parties ou itérations. @fr
toolkit label: dernière désignation chronologique d’une autre séquence de @fr
toolkit definition: Manifestation qui possède une désignation sous forme de date ou d’un autre laps de temps servant à indiquer la dernière partie ou itération dans une séquence de numérotation concomitante de parties ou itérations. @fr
label: هي أول تسمية زمنية في تسلسل بديل لـ @ar
definition: يربط تسمية بتجسيدة لها تسمية في شكل تاريخ أو فترة زمنية أخرى تُستخدم للإشارة إلى الآخر في تسلسل تزامن لأرقام أو أجزاء أو تكرارات. @ar
toolkit label: آخر تسمية زمنية في تسلسل بديل لـ @ar
toolkit definition: تجسيدة لها تسمية في شكل تاريخ أو فترة زمنية أخرى تُستخدم للإشارة إلى الآخر في تسلسل متزامن لأرقام أو أجزاء أو تكرارات. @ar
label: er sidste kronologiske betegnelse af alternativ rækkefølge af @da
definition: Relaterer et nomen til en manifestation der har en betegnelse i form af et dato eller andet tidsforløb der bruges for at betegne den sidste i en samtidig rækkefølge af nummerering af dele eller iterationer. @da
toolkit label: sidste kronoligiske betegnelse af alternativ rækkefølge af @da
toolkit definition: Manifestation der har en betegnelse i form af et dato eller andet tidsforløb der bruges for at betegne den sidste i en samtidig rækkefølge af nummerering af dele eller iterationer. @da
label: ist alternative chronologische Bezeichnung einer letzten Ausgabe oder eines letzten Teils einer Folge von @de
definition: Setzt ein Nomen in Beziehung zu einer Manifestation, die über eine Bezeichnung in Form eines Datums oder eines anderen Zeitraums verfügt, die verwendet wird, um in einer alternativen Zählfolge der Ausgaben oder Iterationen auf die letzte hinzuweisen. @de
toolkit label: Alternative chronologische Bezeichnung einer letzten Ausgabe oder eines letzten Teils einer Folge von @de
toolkit definition: Eine Manifestation, die über eine Bezeichnung in Form eines Datums oder eines anderen Zeitraums verfügt, die verwendet wird, um in einer alternativen Zählfolge der Ausgaben oder Iterationen auf die letzte hinzuweisen. @de
label: és darrera designació cronològica d’una seqüència alternativa de @ca
definition: Relaciona un nomen amb una manifestació que té una designació en la forma d’una data o un altre interval de temps que s’usa per indicar la darrera en una seqüència concurrent de numeració de parts o iteracions. @ca
toolkit label: darrera designació cronològica d’una seqüència alternativa de @ca
toolkit definition: Manifestació que té una designació en la forma d’una data o un altre interval de temps que s’usa per indicar la darrera en una seqüència concurrent de numeració de parts o iteracions. @ca
label: 是……的交替序列的最后一个年代标识 @zh-hans
definition: 将一个命名与有以日期或其他时间段形式标识用于标识部分或更新后整体的并存编号序列中最后一个的一种载体表现关联起来。 @zh-hans
toolkit label: ……的交替序列的最后一个年代标识 @zh-hans
toolkit definition: 有以日期或其他时间段形式标识用于标识部分或更新后整体的并存编号序列中最后一个的一种载体表现 @zh-hans
label: kronológiai zárójelölése a következő alternatív sorrendiségének: @hu
definition: Hozzákapcsol egy noment egy megjelenési formához, amelynek megjelölése dátum vagy más időtartam formájában jelzi az utolsót a részek vagy iterációk konkurens számozási sorrendjében. @hu
toolkit label: kronológiai zárójelölése a következő alternatív sorrendiségének: @hu
toolkit definition: Egy megjelenési forma, amelynek megjelölése dátum vagy más időtartam formájában jelzi az utolsót a részek vagy iterációk konkurens számozási sorrendjében. @hu
has subproperty: P80186
label: alternatif sırasının son kronolojik tanımlanmasıdır @tr
definition: Bir ismi, parçaların veya yinelemelerin eşzamanlı numaralandırma dizisindeki sonuncuyu belirtmek için kullanılan bir tarih veya başka bir zaman aralığı biçiminde bir adlandırmaya sahip bir gösterimle ilişkilendirir. @tr
toolkit label: Alternatif dizisinin son kronolojik tanımlanması @tr
toolkit definition: Parçaların veya yinelemelerin eşzamanlı numaralandırma dizisindeki sonuncuyu belirtmek için kullanılan bir tarih veya başka bir zaman aralığı biçiminde bir belirtece sahip bir gösterim. @tr

is last chronological designation of sequence of
status: Published
definition: Relates a nomen to a manifestation that has a designation in the form of a date or other timespan that is used to indicate the last in a sequence of numbering of parts or iterations.
type: Property
domain: C10012
lexical alias: lastChronologicalDesignationOfSequenceOf.en
has element type: 2
toolkit label: last chronological designation of sequence of
toolkit definition: A manifestation that has a designation in the form of a date or other timespan that is used to indicate the last in a sequence of numbering of parts or iterations.
sub property of: has related manifestation of nomen
label: numerointijakson viimeinen aikamäärite manifestaatiossa @fi
definition: Liittää nomenin manifestaation päivämäärästä tai muusta ajanjaksosta muodostuvaan määritteeseen, joka ilmaisee manifestaation osien tai iteraatioiden numerointijakson viimeiseen määritteen. @fi
toolkit label: numerointijakson viimeinen aikamäärite manifestaatiossa @fi
toolkit definition: Manifestaatio päivämäärästä tai muusta ajanjaksosta muodostuva määrite, joka ilmaisee manifestaation osien tai iteraatioiden numerointijakson viimeisen määritteen. @fi
toolkit definition: Een manifestatie die een aanduiding heeft in de vorm van een datum of andere tijdspanne, die gebruikt is om aan te geven wat de laatste is in een volgorde van nummering van delen of iteraties. @nl
toolkit label: laatste chronologische aanduiding van volgorde van @nl
label: is laatste chronologische aanduiding van volgorde van @nl
definition: Relateert een nomen aan een manifestatie die een aanduiding heeft in de vorm van een datum of andere tijdspanne, die gebruikt is om aan te geven wat de laatste is in een volgorde van nummering van delen of iteraties. @nl
label: ir pēdējais virknes hronoloģiskais apzīmējums @lv
definition: Sasaista nomenu ar manifestāciju, kurai ir apzīmējums datuma vai citāda laikposma veidā, ko izmanto, lai daļu vai iterāciju numerācijas virknē norādītu pēdējo. @lv
toolkit label: pēdējais virknes hronoloģiskais apzīmējums @lv
toolkit definition: Manifestācija, kurai ir apzīmējums datuma vai citāda laikposma veidā, ko izmanto, lai daļu vai iterāciju numerācijas virknē norādītu pēdējo. @lv
label: est la dernière désignation chronologique d’une séquence de @fr
definition: Met un nomen en relation avec une manifestation qui possède une désignation sous forme de date ou d’un autre laps de temps servant à indiquer la dernière partie ou itération dans une séquence de numérotation de parties ou itérations. @fr
toolkit label: dernière désignation chronologique d’une séquence de @fr
toolkit definition: Manifestation qui possède une désignation sous forme de date ou d’un autre laps de temps servant à indiquer la dernière partie ou itération dans une séquence de numérotation de parties ou itérations. @fr
label: هي آخر تسمية زمنية في تسلسل لـ @ar
definition: يربط تسمية بتجسيدة لها تسمية في شكل تاريخ أو فترة زمنية أخرى تُستخدم للإشارة إلى الآخر في تسلسل متزامن لأرقام أو أجزاء أو تكرارات. @ar
toolkit label: آخر تسمية زمنية في تسلسل لـ @ar
toolkit definition: تجسيدة لها تسمية في شكل تاريخ أو فترة زمنية أخرى تُستخدم للإشارة إلى الآخر في تسلسل أرقام أو أجزاء أو تكرارات. @ar
label: er sidste kronologiske betegnelse af rækkefølge af @da
definition: Relaterer et nomen til en manifestation der har en betegnelse i form af et dato eller andet tidsforløb der bruges for at betegne den sidste i en rækkefølge af nummerering af dele eller iterationer. @da
toolkit label: sidste kronologiske betegnelse af rækkefølge af @da
toolkit definition: Manifestation der har en betegnelse i form af et dato eller andet tidsforløb der bruges for at betegne den sidste i en rækkefølge af nummerering af dele eller iterationer. @da
label: ist chronologische Bezeichnung der letzten Ausgabe einer fortlaufenden Ressource von @de
definition: Setzt ein Nomen in Beziehung zu einer Manifestation, die über eine Bezeichnung in Form eines Datums oder eines anderen Zeitraums verfügt, die verwendet wird, um in einer Zählfolge der Ausgaben auf die letzte hinzuweisen. @de
toolkit label: Chronologische Bezeichnung der letzten Ausgabe einer fortlaufenden Ressource von @de
toolkit definition: Eine Manifestation, die über eine Bezeichnung in Form eines Datums oder eines anderen Zeitraums verfügt, die verwendet wird, um in einer Zählfolge der Ausgaben auf die letzte hinzuweisen. @de
label: és darrera designació cronològica d’una seqüència de @ca
definition: Relaciona un nomen amb una manifestació que té una designació en la forma d’una data o un altre interval de temps que s’usa per indicar la darrera en una seqüència de numeració de parts o iteracions. @ca
toolkit label: darrera designació cronològica d’una seqüència de @ca
toolkit definition: Manifestació que té una designació en la forma d’una data o un altre interval de temps que s’usa per indicar la darrera en una seqüència de numeració de parts o iteracions. @ca
label: 是……的序列的最后一个年代标识 @zh-hans
definition: 将一个命名与有以日期或其他时间段形式标识用于标识部分或更新后整体的编号序列中最后一个的一种载体表现关联起来。 @zh-hans
toolkit label: ……的序列的最后一个年代标识 @zh-hans
toolkit definition: 有以日期或其他时间段形式标识用于标识部分或更新后整体的编号序列中最后一个的一种载体表现 @zh-hans
label: kronológiai zárójelölése a következő sorrendiségének: @hu
definition: Hozzákapcsol egy noment egy megjelenési formához, amelynek megjelölése dátum vagy más időtartam formájában jelzi az utolsót a részek vagy iterációk számozási sorrendjében. @hu
toolkit label: kronológiai zárójelölése a következő sorrendiségének: @hu
toolkit definition: Egy megjelenési forma, amlelynek megjelölése dátum vagy más időtartam formájában jelzi az utolsót a részek vagy iterációk számozási sorrendjében. @hu
has subproperty: is last chronological designation of alternative sequence of
has subproperty: P80187
label: sırasının son kronolojik tanımlanmasıdır @tr
definition: Bir ismi, parçaların veya yinelemelerin numaralandırma dizisindeki sonuncuyu belirtmek için kullanılan bir tarih veya başka bir zaman aralığı biçiminde bir adlandırmaya sahip bir gösterimle ilişkilendirir. @tr
toolkit label: Dizisinin son kronolojik tanımlandırılması @tr
toolkit definition: Parçaların veya yinelemelerin numaralandırma dizisindeki sonuncuyu belirtmek için kullanılan bir tarih veya başka bir zaman aralığı biçiminde bir belirtece sahip bir gösterim. @tr

is nomen described with metadata by
status: Published
definition: Relates a nomen to a work that is a metadata work for a nomen.
type: Property
domain: C10012
lexical alias: nomenDescribedWithMetadataBy.en
has element type: 2
toolkit label: nomen described with metadata by
toolkit definition: A work that is a metadata work for a nomen.
sub property of: is nomen described by
toolkit definition: Teos, joka on nomenin metatietoteos. @fi
toolkit label: nomenia metatiedoilla kuvaileva teos @fi
definition: Liittää nomenin teokseen, joka on nomenin metatietoteos. @fi
label: nomenia metatiedoilla kuvaileva teos @fi
label: 是被……用元数据描述的命名 @zh-hans
definition: 将一个命名与作为一个命名之元数据作品的一种作品关联起来。 @zh-hans
toolkit label: 被……用元数据描述的命名 @zh-hans
toolkit definition: 作为一个命名之元数据作品的一种作品 @zh-hans
label: és nomen descrit amb metadades per @ca
definition: Relaciona un nomen amb una obra que és una obra de metadades per a un nomen. @ca
toolkit label: nomen descrit amb metadades per @ca
toolkit definition: Obra que és una obra de metadades per a un nomen. @ca
label: est un nomen décrit avec des métadonnées par @fr
definition: Met un nomen en relation avec une œuvre qui consiste en une œuvre de métadonnées pour un nomen. @fr
toolkit label: nomen décrit avec des métadonnées par @fr
toolkit definition: Œuvre qui consiste en une œuvre de métadonnées pour un nomen. @fr
has subproperty: P80188
label: tarafından üstveri ile tanımlanmış isimdir @tr
definition: Bir ismi, bir an için üst veri eseri olan bir eserle ilişkilendirir. @tr
toolkit label: Tarafından üstveriyle tanımlanan isim @tr
toolkit definition: Bir isim için üstveri çalışması olan bir eser. @tr