Published
type: Concept

Deprecated
type: Concept

Nomen properties
licence: deed.en US
contributor: RSC Technical Working Group
creator: RDA Steering Committee
description: Properties that represent the attribute and relationship elements of the RDA Nomen entity.
description: RDA-elementeistä johdetut ominaisuudet RDA:n nomenin määrittelyjoukossa. @fi
issued: 2016-12-18
modified: 2025-06-18
publisher: ALA Digital Reference
rights: Copyright © 2020 American Library Association, Canadian Federation of Library Associations, and CILIP: Chartered Institute of Library and Information Professionals
title: RDA:n nomenin ominaisuudet @fi
type: http://rdaregistry.info/termList/RDALinkedDataWork/1003
preferred namespace prefix: rdan
type: Ontology
version info: v5.4.4

has related work of nomen
has element type: 1
toolkit definition: A work that is associated with a nomen.
toolkit definition: Bir isimle bağlantılı olan bir eser. @tr
toolkit definition: Darbs, kas saistīts ar nomenu. @lv
toolkit definition: Een werk dat is geassocieerd met een nomen. @nl
toolkit definition: Egy mű, amelyet egy nomenhez társítanak. @hu
toolkit definition: Ein Werk, das mit einem Nomen in Verbindung steht. @de
toolkit definition: Et verk som forbindes med et nomen. @no
toolkit definition: Nomen'iga seotud teos. @et
toolkit definition: Obra que s’associa amb un nomen. @ca
toolkit definition: Teos, joka liittyy nomeniin. @fi
toolkit definition: Un'opera che è associata con un nomen. @it
toolkit definition: Værk, som er knyttet til et nomen. @da
toolkit definition: Œuvre qui est associée à un nomen. @fr
toolkit definition: عمل ذو صلة بتسمية. @ar
toolkit definition: 和一个命名有关的一种作品 @zh-hans
toolkit label: ar nomenu saistītais darbs @lv
toolkit label: gerelateerd werk van nomen @nl
toolkit label: mit Nomen in Beziehung stehendes Werk @de
toolkit label: nomen kapcsolódó műve: @hu
toolkit label: nomen'iga seotud teos @et
toolkit label: nomeniin liittyvä teos @fi
toolkit label: obra relacionada amb un nomen @ca
toolkit label: opera correlata di nomen @it
toolkit label: related work of nomen
toolkit label: verk relatert til nomen @no
toolkit label: værk relateret til nomen @da
toolkit label: İsimle ilişkili eser @tr
toolkit label: œuvre en relation avec un nomen @fr
toolkit label: عمل مرتبط بتسمية @ar
toolkit label: 命名的关联作品 @zh-hans
has subproperty: is subject nomen of
has subproperty: is appellation of work of
has subproperty: P80001
lexical alias: relatedWorkOfNomen.en
status: Published
type: Property
domain: C10012
label: a pour œuvre en relation avec un nomen @fr
label: ar nomenu saistītais darbs @lv
label: ha come opera correlata di nomen @it
label: har verk relatert til nomen @no
label: har værk relateret til nomen @da
label: hat mit Nomen in Beziehung stehendes Werk @de
label: heeft gerelateerd werk van nomen @nl
label: ismin ilgili eseri ile ilişkilidir @tr
label: nomen kapcsolódó műve a következő: @hu
label: nomen'iga seotud teos @et
label: nomeniin liittyvä teos @fi
label: té com a obra relacionada amb un nomen @ca
label: له عمل مرتبط بتسمية @ar
label: 有命名的关联作品 @zh-hans
sub property of: has related RDA entity of nomen
sub property of: P00002
definition: Bir ismi, bir isimle bağlantılı olan eserle ilişkilendirir. @tr
definition: Correla un nomen a un'opera che è associata con un nomen. @it
definition: Hozzákapcsol egy noment egy műhöz, amelyet egy nomenhez társítanak. @hu
definition: Liittää nomenin teokseen, joka liittyy nomeniin. @fi
definition: Met un nomen en relation avec une œuvre qui est associée à un nomen. @fr
definition: Relaciona un nomen amb una obra que s’associa amb un nomen. @ca
definition: Relateert een nomen aan een werk dat is geassocieerd met een nomen. @nl
definition: Relaterer et nomen til et verk som forbindes med et nomen. @no
definition: Relaterer et nomen til et værk, som er knyttet til et nomen. @da
definition: Relates a nomen to a work that is associated with a nomen.
definition: Sasaista nomenu ar darbu, kas saistīts ar nomenu. @lv
definition: Seostab nomen'i nomen'iga seotud teosega. @et
definition: Setzt ein Nomen in Beziehung zu einem Werk, das mit einem Nomen in Verbindung steht. @de
definition: يربط تسميه بعمل مرتبط بتسمية. @ar
definition: 将一个命名与和一个命名有关的一种作品关联起来。 @zh-hans

has related expression of nomen
has element type: 1
toolkit definition: An expression that is associated with a nomen.
toolkit definition: Bir isimle bağlantılı olan bir anlatım. @tr
toolkit definition: Een expressie die is geassocieerd met een nomen. @nl
toolkit definition: Egy kifejezési forma, amelyet egy nomenhez társítanak. @hu
toolkit definition: Eine Expression, die mit einem Nomen in Verbindung steht. @de
toolkit definition: Ekspressio, joka liittyy nomeniin. @fi
toolkit definition: Et uttrykk som forbindes med et nomen. @no
toolkit definition: Expression qui est associée à un nomen. @fr
toolkit definition: Expressió que s’associa amb un nomen. @ca
toolkit definition: Izteiksme, kas ir saistīta ar nomenu. @lv
toolkit definition: Nomen'iga seotud väljendus. @et
toolkit definition: Udtryk, som er knyttet til et nomen. @da
toolkit definition: Un'espressione che è associata con un nomen. @it
toolkit definition: تعبيرة ذات صلة بتسمية. @ar
toolkit definition: 和一个命名有关的一种内容表达 @zh-hans
toolkit label: Nomenin ilişkili anlatımı @tr
toolkit label: ar nomenu saistītā izteiksme @lv
toolkit label: espressione correlata di nomen @it
toolkit label: expression en relation avec un nomen @fr
toolkit label: expressió relacionada amb un nomen @ca
toolkit label: gerelateerde expressie van nomen @nl
toolkit label: mit Nomen in Beziehung stehende Expression @de
toolkit label: nomen kapcsolódó kifejezési formája: @hu
toolkit label: nomen'iga seotud väljendus @et
toolkit label: nomeniin liittyvä ekspressio @fi
toolkit label: related expression of nomen
toolkit label: uttrykk relatert til nomen @no
toolkit label: værk relateret til nomen @da
toolkit label: تعبيرة مرتبطة بتسمية @ar
toolkit label: 命名的关联内容表达 @zh-hans
has subproperty: is appellation of expression of
has subproperty: P80002
lexical alias: relatedExpressionOfNomen.en
status: Published
type: Property
domain: C10012
label: a pour expression en relation avec un nomen @fr
label: ar nomenu saistītā izteiksme @lv
label: ha come espressione correlata di nomen @it
label: har udtryk relateret til nomen @da
label: har uttrykk relatert til nomen @no
label: hat mit Nomen in Beziehung stehende Expression @de
label: heeft gerelateerde expressie van nomen @nl
label: ismin ilgili anlatımı ile ilişkilidir @tr
label: nomen kapcsolódó kifejezési formája a következő: @hu
label: nomen'iga seotud väljendus @et
label: nomeniin liittyvä ekspressio @fi
label: té com a expressió relacionada amb un nomen @ca
label: له تعبيرة مرتبطة بتسمية @ar
label: 有命名的关联内容表达 @zh-hans
sub property of: has related RDA entity of nomen
sub property of: P00003
definition: Bir ismi, bir isimle bağlantılı olan anlatımla ilişkilendirir. @tr
definition: Correla un nomen a un'espressione che è associata con un nomen. @it
definition: Hozzákapcsol egy noment egy kifejezési formához, amelyet egy nomenhez társítanak. @hu
definition: Liittää nomenin ekspressioon, joka liittyy nomeniin. @fi
definition: Met un nomen en relation avec une expression qui est associée à un nomen. @fr
definition: Relaciona un nomen amb una expressió que s’associa amb un nomen. @ca
definition: Relateert een nomen aan een expressie die is geassocieerd met een nomen. @nl
definition: Relaterer et nomen til et udtryk, som er knyttet til et nomen. @da
definition: Relaterer et nomen til et uttrykk som forbindes med et nomen. @no
definition: Relates a nomen to an expression that is associated with a nomen.
definition: Sasaista nomenu ar izteiksmi, kas ir saistīta ar nomenu. @lv
definition: Seostab nomen'i nomen'iga seotud väljendusega. @et
definition: Setzt ein Nomen in Beziehung zu einer Expression, die mit einem Nomen in Verbindung steht. @de
definition: يربط تسميه بتعبيرة ذات صلة بتسمية. @ar
definition: 将一种命名与和一个命名有关的一种内容表达关联起来。 @zh-hans

has related manifestation of nomen
has element type: 1
toolkit definition: A manifestation that is associated with a nomen.
toolkit definition: Bir nomenle bağlantılı olan bir gösterim. @tr
toolkit definition: Een manifestatie die is geassocieerd met een nomen. @nl
toolkit definition: Egy megjelenési forma, amelyet egy nomenhez társítanak. @hu
toolkit definition: Eine Manifestation, die mit einem Nomen in Verbindung steht. @de
toolkit definition: En manifestasjon som forbindes med et nomen. @no
toolkit definition: Manifestaatio, joka liittyy nomeniin. @fi
toolkit definition: Manifestació que s’associa amb un nomen. @ca
toolkit definition: Manifestation qui est associée à un nomen. @fr
toolkit definition: Manifestation, som er knyttet til et nomen. @da
toolkit definition: Manifestācija, kas ir saistīta ar nomenu. @lv
toolkit definition: Nomen'iga seotud kehastus. @et
toolkit definition: Una manifestazione che è associata con un nomen. @it
toolkit definition: تجسيدة ذات صلة بتسمية. @ar
toolkit definition: 和一个命名有关的一种载体表现 @zh-hans
toolkit label: ar nomenu saistītā manifestācija @lv
toolkit label: gerelateerde manifestatie van nomen @nl
toolkit label: manifestació relacionada amb un nomen @ca
toolkit label: manifestasjon relatert til nomen @no
toolkit label: manifestation en relation avec un nomen @fr
toolkit label: manifestation relateret til nomen @da
toolkit label: manifestazione correlata di nomen @it
toolkit label: mit Nomen in Beziehung stehende Manifestation @de
toolkit label: nomen kapcsolódó megjelenési formája: @hu
toolkit label: nomen'iga seotud kehastus @et
toolkit label: nomeniin liittyvä manifestaatio @fi
toolkit label: related manifestation of nomen
toolkit label: İsmin ilişkili gösterimi @tr
toolkit label: تجسيدة مرتبطة بتسمية @ar
toolkit label: 命名的关联载体表现 @zh-hans
has subproperty: is appellation of manifestation of
has subproperty: is name of agent of manifestation of
has subproperty: has reference source
has subproperty: is numbering within sequence of
has subproperty: is first alphanumeric designation of sequence of
has subproperty: is first chronological designation of sequence of
has subproperty: is last alphanumeric designation of sequence of
has subproperty: is last chronological designation of sequence of
has subproperty: P80003
lexical alias: relatedManifestationOfNomen.en
status: Published
type: Property
domain: C10012
label: a pour manifestation en relation avec un nomen @fr
label: ar nomenu saistītā manifestācija @lv
label: ha come manifestaizone correlata di nomen @it
label: har manifestasjon relatert til nomen @no
label: har manifestation relateret til nomen @da
label: hat mit Nomen in Beziehung stehende Manifestation @de
label: heeft gerelateerde manifestatie van nomen @nl
label: ismin ilgili gösterimi ile ilişkilidir @tr
label: nomen kapcsolódó megjelenési formája a következő: @hu
label: nomen'iga seotud kehastus @et
label: nomeniin liittyvä manifestaatio @fi
label: té com a manifestació relacionada amb un nomen @ca
label: له تجسيدة مرتبطة بتسمية @ar
label: 有命名的关联载体表现 @zh-hans
sub property of: has related RDA entity of nomen
sub property of: P00004
definition: Bir ismi, bir isimle ilişkilendirilen gösterimle ilişkilendirir. @tr
definition: Correla un nomen a una manifestazione che è associata con un nomen. @it
definition: Hozzákapcsol egy noment egy megjelenési formához, amelyet egy nomenhez társítanak. @hu
definition: Liittää nomenin manifestaatioon, joka liittyy nomeniin. @fi
definition: Met un nomen en relation avec une manifestation qui est associée à un nomen. @fr
definition: Relaciona un nomen amb una manifestació que s’associa amb un nomen. @ca
definition: Relateert een nomen aan een manifestatie die is geassocieerd met een nomen. @nl
definition: Relaterer et nomen til en manifestasjon som forbindes med et nomen. @no
definition: Relaterer et nomen til en manifestation, som er knyttet til et nomen. @da
definition: Relates a nomen to a manifestation that is associated with a nomen.
definition: Sasaista nomenu ar manifestāciju, kas ir saistīta ar nomenu. @lv
definition: Seostab nomen'i nomen'iga seotud kehastusega. @et
definition: Setzt ein Nomen in Beziehung zu einer Manifestation, die mit einem Nomen in Verbindung steht. @de
definition: يربط تسمية بتجسيدة ذات صلة بتسمية. @ar
definition: 将一个命名与和一个命名有关的一种载体表现关联起来。 @zh-hans

has related item of nomen
has element type: 1
toolkit definition: An item that is associated with a nomen.
toolkit definition: Bir isimle bağlantılı olan bir kopya. @tr
toolkit definition: Een item dat is geassocieerd met een nomen. @nl
toolkit definition: Egy példány, amelyet egy nomenhez társítanak. @hu
toolkit definition: Ein Exemplar, das mit einem Nomen in Verbindung steht. @de
toolkit definition: Eksemplar, som er knyttet til et nomen. @da
toolkit definition: Et eksemplar som forbindes med et nomen. @no
toolkit definition: Item qui est associé à un nomen. @fr
toolkit definition: Kappale, joka liittyy nomeniin. @fi
toolkit definition: Nomen'iga seotud eksemplar. @et
toolkit definition: Un item che è associato con un nomen. @it
toolkit definition: Vienība, kas ir saistīta ar nomenu. @lv
toolkit definition: Ítem que s’associa amb un nomen. @ca
toolkit definition: مفردة ذات صلة بتسمية. @ar
toolkit definition: 和一个命名有关的一个单件 @zh-hans
toolkit label: Nomenle ilişkili kopya @tr
toolkit label: ar nomenu saistītā vienība @lv
toolkit label: eksemplar relateret til nomen @da
toolkit label: eksemplar relatert til nomen @no
toolkit label: gerelateerd item van nomen @nl
toolkit label: item correlato di nomen @it
toolkit label: item en relation avec un nomen @fr
toolkit label: mit Nomen in Beziehung stehendes Exemplar @de
toolkit label: nomen kapcsolódó műve: @hu
toolkit label: nomen'iga seotud eksemplar @et
toolkit label: nomeniin liittyvä kappale @fi
toolkit label: related item of nomen
toolkit label: ítem relacionat amb un nomen @ca
toolkit label: مفردة مرتبطة بتسمية @ar
toolkit label: 命名的关联单件 @zh-hans
has subproperty: is appellation of item of
has subproperty: P80004
lexical alias: relatedItemOfNomen.en
status: Published
type: Property
domain: C10012
label: a pour item en relation avec un nomen @fr
label: ar nomenu saistītā vienība @lv
label: ha come item correlato di nomen @it
label: har eksemplar relateret til nomen @da
label: har eksemplar relatert til nomen @no
label: hat mit Nomen in Beziehung stehendes Exemplar @de
label: heeft gerelateerd item van nomen @nl
label: ismin ilgili kopyası ile ilişkilidir @tr
label: nomen kapcsolódó példánya a következő: @hu
label: nomen'iga seotud eksemplar @et
label: nomeniin liittyvä kappale @fi
label: té com a ítem relacionat amb un nomen @ca
label: له مفردة مرتبطة بتسمية @ar
label: 有命名的关联单件 @zh-hans
sub property of: has related RDA entity of nomen
sub property of: P00005
definition: Bir ismi, isimle bağlantılı olan bir kopyayla ilişkilendirir. @tr
definition: Correla un nomen a un item che è associato con un nomen. @it
definition: Hozzákapcsol egy noment egy példányhoz, amelyet egy nomenhez társítanak. @hu
definition: Liittää nomenin kappaleeseen, joka liittyy nomeniin. @fi
definition: Met un nomen en relation avec un item qui est associé à un nomen. @fr
definition: Relaciona un nomen amb un ítem que s’associa amb un nomen. @ca
definition: Relateert een nomen aan een item dat is geassocieerd met een nomen. @nl
definition: Relaterer et nomen til et eksemplar som forbindes med et nomen. @no
definition: Relaterer et nomen til et eksemplar, som er knyttet til et nomen. @da
definition: Relates a nomen to an item that is associated with a nomen.
definition: Sasaista nomenu ar vienību, kas ir saistīta ar nomenu. @lv
definition: Seostab nomen'i nomen'iga seotud eksemplariga. @et
definition: Setzt ein Nomen in Beziehung zu einem Exemplar, das mit einem Nomen in Verbindung steht. @de
definition: يربط تسمية بمفردة ذات صلة بتسمية. @ar
definition: 将一个命名与和一个命名有关的一个单件关联起来。 @zh-hans

has related agent of nomen
has element type: 1
toolkit definition: Agent que s’associa amb un nomen. @ca
toolkit definition: Agent qui est associé à un nomen. @fr
toolkit definition: Agent, som er knyttet til et nomen. @da
toolkit definition: An agent who is associated with a nomen.
toolkit definition: Aģents, kas saistīts ar nomenu. @lv
toolkit definition: Bir isimle bağlantılı olan bir temsilci. @tr
toolkit definition: Een actor die is geassocieerd met een nomen. @nl
toolkit definition: Egy ágens, amelyet egy nomenhez társítanak. @hu
toolkit definition: Ein Akteur, der mit einem Nomen in Verbindung steht. @de
toolkit definition: En agent som forbindes med et nomen. @no
toolkit definition: Nomen'iga seotud tegija. @et
toolkit definition: Toimija, joka liittyy nomeniin. @fi
toolkit definition: Un agente che è associato con un nomen. @it
toolkit definition: وكيل ذو صلة بتسمية. @ar
toolkit definition: 和一个命名有关的一个行为者 @zh-hans
toolkit label: Nomen ilişkili temsilcisi @tr
toolkit label: agent en relation avec un nomen @fr
toolkit label: agent relacionat amb un nomen @ca
toolkit label: agent relateret til nomen @da
toolkit label: agent relatert til nomen @no
toolkit label: agente correlato di nomen @it
toolkit label: ar nomenu saistītais aģents @lv
toolkit label: gerelateerde actor van nomen @nl
toolkit label: mit Nomen in Beziehung stehender Akteur @de
toolkit label: nomen kapcsolódó ágense: @hu
toolkit label: nomen'iga seotud tegija @et
toolkit label: nomeniin liittyvä toimija @fi
toolkit label: related agent of nomen
toolkit label: وكيل مرتبط بتسمية @ar
toolkit label: 命名的关联行为者 @zh-hans
has subproperty: has related collective agent of nomen
has subproperty: has related person of nomen
has subproperty: is appellation of agent of
has subproperty: is assigned by agent
has subproperty: P80005
lexical alias: relatedAgentOfNomen.en
status: Published
type: Property
domain: C10012
label: a pour agent en relation avec un nomen @fr
label: ar nomenu saistītais aģents @lv
label: ha come agente correlato di nomen @it
label: har agent relateret til nomen @da
label: har agent relatert til nomen @no
label: hat mit Nomen in Beziehung stehenden Akteur @de
label: heeft gerelateerde actor van nomen @nl
label: ismin ilgili temsilcisi ile ilişkilidir @tr
label: nomen kapcsolódó ágense a következő: @hu
label: nomen'iga seotud tegija @et
label: nomeniin liittyvä toimija @fi
label: té com a agent relacionat amb un nomen @ca
label: له وكيل مرتبط بتسمية @ar
label: 有命名的关联行为者 @zh-hans
sub property of: has related RDA entity of nomen
sub property of: P00006
definition: Bir ismi, isimle bağlantılı olan temsilciyle ilişkilendirir. @tr
definition: Correla un nomen a un agente che è associato con un nomen. @it
definition: Hozzákapcsol egy noment egy ágenshez, amelyet egy nomenhez társítanak. @hu
definition: Liittää nomenin toimijaan, joka liittyy nomeniin. @fi
definition: Met un nomen en relation avec un agent qui est associé à un nomen. @fr
definition: Relaciona un nomen amb un agent que s’associa amb un nomen. @ca
definition: Relateert een nomen aan een actor die is geassocieerd met een nomen. @nl
definition: Relaterer et nomen til en agent som forbindes med et nomen. @no
definition: Relaterer et nomen til en agent, som er knyttet til et nomen. @da
definition: Relates a nomen to an agent who is associated with a nomen.
definition: Sasaista nomenu ar aģentu, kas saistīts ar nomenu. @lv
definition: Seostab nomen'i nomen'iga seotud tegijaga. @et
definition: Setzt ein Nomen in Beziehung zu einem Akteur, der mit einem Nomen in Verbindung steht. @de
definition: يربط تسمية بوكيل ذات صلة بتسمية. @ar
definition: 将一个命名与和一个命名有关的一个行为者关联起来。 @zh-hans

has related collective agent of nomen
has element type: 1
toolkit definition: A collective agent who is associated with a nomen.
toolkit definition: Agent collectif qui est associé à un nomen. @fr
toolkit definition: Agent col·lectiu que s’associa amb un nomen. @ca
toolkit definition: Een collectieve actor die is geassocieerd met een nomen. @nl
toolkit definition: Egy kollektív ágens, amelyet egy nomenhez társítanak. @hu
toolkit definition: Ein gemeinschaftlicher Akteur, der mit einem Nomen in Verbindung steht. @de
toolkit definition: En kollektiv agent som forbindes med et nomen. @no
toolkit definition: Grupa, kas saistīta ar nomenu. @lv
toolkit definition: Kollektiv agent, som er knyttet til et nomen. @da
toolkit definition: Nomen'iga seotud kollektiiv. @et
toolkit definition: Nomenle ilişkilendirilen kolektif temsilci. @tr
toolkit definition: Un agente collettivo che è associato con un nomen. @it
toolkit definition: Yhteistoimija, joka liittyy nomeniin. @fi
toolkit definition: وكيل جماعي ذو صلة بتسمية. @ar
toolkit definition: 和一个命名有关的一个集体行为者 @zh-hans
toolkit label: Nomenin kolektif temsilciyle ilişkisi @tr
toolkit label: agent collectif en relation avec un nomen @fr
toolkit label: agent col·lectiu relacionat amb un nomen @ca
toolkit label: agente collettivo correlato di nomen @it
toolkit label: ar nomenu saistītā grupa @lv
toolkit label: gerelateerde collectieve actor van nomen @nl
toolkit label: kollektiv agent relateret til nomen @da
toolkit label: kollektiv agent relatert til nomen @no
toolkit label: mit Nomen in Beziehung stehender gemeinschaftlicher Akteur @de
toolkit label: nomen kapcsolódó kollektív ágense: @hu
toolkit label: nomen'iga seotud kollektiiv @et
toolkit label: nomeniin liittyvä yhteistoimija @fi
toolkit label: related collective agent of nomen
toolkit label: وكيل جماعي مرتبط بتسمية @ar
toolkit label: 命名的关联集体行为者 @zh-hans
has subproperty: has related family of nomen
has subproperty: has related corporate body of nomen
has subproperty: is appellation of collective agent of
has subproperty: is assigned by collective agent
has subproperty: P80006
lexical alias: relatedCollectiveAgentOfNomen.en
status: Published
type: Property
domain: C10012
label: a pour agent collectif en relation avec un nomen @fr
label: ar nomenu saistītā grupa @lv
label: ha come agente collettivo correlato di nomen @it
label: har kollektiv agent relateret til nomen @da
label: har kollektiv agent relatert til nomen @no
label: hat mit Nomen in Beziehung stehenden gemeinschaftlichen Akteur @de
label: heeft gerelateerde collectieve actor van nomen @nl
label: ismin ilgili kolektif temsilcisi ile ilişkilidir @tr
label: nomen kapcsolódó kollektív ágense a következő: @hu
label: nomen'iga seotud kollektiiv @et
label: nomeniin liittyvä yhteistoimija @fi
label: té com a agent col·lectiu relacionat amb un nomen @ca
label: له وكيل جماعي مرتبط بتسمية @ar
label: 有命名的关联集体行为者 @zh-hans
sub property of: has related agent of nomen
sub property of: P00012
definition: Bir ismi, isimle ilişkilendirilen kolektif temsilciyle ilişkilendirir. @tr
definition: Correla un nomen a un agente collettivo che è associato con un nomen. @it
definition: Hozzákapcsol egy noment egy kollektív ágenshez, amelyet egy nomenhez társítanak. @hu
definition: Liittää nomenin yhteistoimijaan, joka liittyy nomeniin. @fi
definition: Met un nomen en relation avec un agent collectif qui est associé à un nomen. @fr
definition: Relaciona un nomen amb un agent col·lectiu que s’associa amb un nomen. @ca
definition: Relateert een nomen aan een collectieve actor die is geassocieerd met een nomen. @nl
definition: Relaterer et nomen til en kollektiv agent som forbindes med et nomen. @no
definition: Relaterer et nomen til en kollektiv agent, som er knyttet til et nomen. @da
definition: Relates a nomen to a collective agent who is associated with a nomen.
definition: Sasaista nomenu ar grupu, kas saistīta ar nomenu. @lv
definition: Seostab nomen'i nomen'iga seotud kollektiiviga. @et
definition: Setzt ein Nomen in Beziehung zu einem gemeinschaftlichen Akteur, der mit einem Nomen in Verbindung steht. @de
definition: يربط تسمية بوكيل جماعي ذي صلة بتسمية. @ar
definition: 将一个命名与和一个命名有关的一个集体行为者关联起来。 @zh-hans

has related place of nomen
has element type: 1
toolkit definition: A place that is associated with a nomen.
toolkit definition: Bir isimle bağlantılı olan bir yer. @tr
toolkit definition: Een plaats die is geassocieerd met een nomen. @nl
toolkit definition: Egy hely, amelyet egy nomenhez társítanak. @hu
toolkit definition: Ein Geografikum, das mit einem Nomen in Verbindung steht. @de
toolkit definition: Et sted som forbindes med et nomen. @no
toolkit definition: Lieu qui est associé à un nomen. @fr
toolkit definition: Lloc que s’associa amb un nomen. @ca
toolkit definition: Nomen'iga seotud koht. @et
toolkit definition: Paikka, joka liittyy nomeniin. @fi
toolkit definition: Sted, som er knyttet til et nomen. @da
toolkit definition: Un luogo che è associato con un nomen. @it
toolkit definition: Vieta, kas saistīta ar nomenu. @lv
toolkit definition: مكان ذي صلة بتسمية. @ar
toolkit definition: 和一个命名有关的一个地点 @zh-hans
toolkit label: ar nomenu saistītā vieta @lv
toolkit label: gerelateerde plaats van nomen @nl
toolkit label: lieu en relation avec un nomen @fr
toolkit label: lloc relacionat amb un nomen @ca
toolkit label: luogo correlato di nomen @it
toolkit label: mit Nomen in Beziehung stehendes Geografikum @de
toolkit label: nomen kapcsolódó helye: @hu
toolkit label: nomen'iga seotud koht @et
toolkit label: nomeniin liittyvä paikka @fi
toolkit label: related place of nomen
toolkit label: sted relateret til nomen @da
toolkit label: sted relatert til nomen @no
toolkit label: İsimle ilişkili yer @tr
toolkit label: مكان مرتبط بتسمية @ar
toolkit label: 命名的关联地点 @zh-hans
has subproperty: is appellation of place of
has subproperty: P80007
lexical alias: relatedPlaceOfNomen.en
status: Published
type: Property
domain: C10012
label: a pour lieu en relation avec un nomen @fr
label: ar nomenu saistītā vieta @lv
label: ha come luogo correlato di nomen @it
label: har sted relateret til nomen @da
label: har sted relatert til nomen @no
label: hat mit Nomen in Beziehung stehendes Geografikum @de
label: heeft gerelateerde plaats van nomen @nl
label: ismin ilgili yeri ile ilişkilidir @tr
label: nomen kapcsolódó helye a következő: @hu
label: nomen'iga seotud koht @et
label: nomeniin liittyvä paikka @fi
label: té com a lloc relacionat amb un nomen @ca
label: له مكان مرتبط بتسمية @ar
label: 有命名的关联地点 @zh-hans
sub property of: has related RDA entity of nomen
sub property of: P00010
definition: Bir ismi, isimle bağlantılı olan bir yerle ilişkilendirir. @tr
definition: Correla un nomen a un luogo che è associato con un nomen. @it
definition: Hozzákapcsol egy noment egy helyhez, amelyet egy nomenhez társítanak. @hu
definition: Liittää nomenin paikkaan, joka liittyy nomeniin. @fi
definition: Met un nomen en relation avec un lieu qui est associé à un nomen. @fr
definition: Relaciona un nomen amb un lloc que s’associa amb un nomen. @ca
definition: Relateert een nomen aan een plaats die is geassocieerd met een nomen. @nl
definition: Relaterer et nomen til et sted som forbindes med et nomen. @no
definition: Relaterer et nomen til et sted, som er knyttet til et nomen. @da
definition: Relates a nomen to a place associated with a nomen.
definition: Sasaista nomenu ar vietu, kas saistīta ar nomenu. @lv
definition: Seostab nomen'i nomen'iga seotud kohaga. @et
definition: Setzt ein Nomen in Beziehung zu einem Geografikum, das mit einem Nomen in Verbindung steht. @de
definition: يربط تسمية بمكان ذي صلة بتسمية. @ar
definition: 将一个命名与和一个命名有关的一个地点关联起来。 @zh-hans

has related timespan of nomen
has element type: 1
toolkit definition: A timespan that is associated with a nomen.
toolkit definition: Ajanjakso, joka liittyy nomeniin. @fi
toolkit definition: Bir isimle bağlantılı olan bir zaman aralığı. @tr
toolkit definition: Een tijdspanne die is geassocieerd met een nomen. @nl
toolkit definition: Egy időtartam, amelyet egy nomenhez társítanak. @hu
toolkit definition: Ein Zeitraum, der mit einem Nomen in Verbindung steht. @de
toolkit definition: Et tidsrom som forbindes med et nomen. @no
toolkit definition: Interval de temps que s’associa amb un nomen. @ca
toolkit definition: Laikposms, kas saistīts ar nomenu. @lv
toolkit definition: Laps de temps qui est associé à un nomen. @fr
toolkit definition: Nomen'iga seotud ajavahemik. @et
toolkit definition: Tidsperiode, som er knyttet til et nomen. @da
toolkit definition: Un arco di tempo che è associato con un nomen. @it
toolkit definition: فترة زمنية ذات صلة بتسمية. @ar
toolkit definition: 和一个命名有关的一个时间段 @zh-hans
toolkit label: ar nomenu saistītais laikposms @lv
toolkit label: arco di tempo correlato di nomen @it
toolkit label: gerelateerde tijdspanne van nomen @nl
toolkit label: interval de temps relacionat amb un nomen @ca
toolkit label: laps de temps en relation avec un nomen @fr
toolkit label: mit Nomen in Beziehung stehender Zeitraum @de
toolkit label: nomen kapcsolódó időtartama: @hu
toolkit label: nomen'iga seotud ajavahemik @et
toolkit label: nomeniin liittyvä ajanjakso @fi
toolkit label: related timespan of nomen
toolkit label: tidsperiode relateret til nomen @da
toolkit label: tidsrom relatert til nomen @no
toolkit label: İsmin zaman aralığıyla ilişkisi @tr
toolkit label: فترة زمنية مرتبطة بتسمية @ar
toolkit label: 命名的关联时间段 @zh-hans
has subproperty: is appellation of timespan of
has subproperty: has date of usage
has subproperty: P80008
lexical alias: relatedTimespanOfNomen.en
status: Published
type: Property
domain: C10012
label: a pour laps de temps en relation avec un nomen @fr
label: ar nomenu saistītais laikposms @lv
label: ha come arco di tempo correlato di nomen @it
label: har tidsperiode relateret til nomen @da
label: har tidsrom relatert til nomen @no
label: hat mit Nomen in Beziehung stehenden Zeitraum @de
label: heeft gerelateerde tijdspanne van nomen @nl
label: ismin ilgili zaman aralığı ile ilişkilidir @tr
label: nomen kapcsolódó időtartama a következő: @hu
label: nomen'iga seotud ajavahemik @et
label: nomeniin liittyvä ajanjakso @fi
label: té com a interval de temps relacionat amb un nomen @ca
label: له فترة زمنية مرتبطة بتسمية @ar
label: 有命名的关联时间段 @zh-hans
sub property of: has related RDA entity of nomen
sub property of: P00011
definition: Bir ismi, isimle bağlantılı olan zaman süreciyle ilişkilendirir. @tr
definition: Correla un nomen a un arco di tempo che è associato con un nomen. @it
definition: Hozzákapcsol egy noment egy időtartamhoz, amelyet egy nomenhez társítanak. @hu
definition: Liittää nomenin ajanjaksoon, joka liittyy nomeniin. @fi
definition: Met un nomen en relation avec un laps de temps qui est associé à un nomen. @fr
definition: Relaciona un nomen amb un interval de temps que s’associa amb un nomen. @ca
definition: Relateert een nomen aan een tijdspanne die is geassocieerd met een nomen. @nl
definition: Relaterer et nomen til en tidsperiode, som er knyttet til et nomen. @da
definition: Relaterer et nomen til et tidsrom som forbindes med et nomen. @no
definition: Relates a nomen to a timespan that is associated with a nomen.
definition: Sasaista nomenu ar laikposmu, kas saistīts ar nomenu. @lv
definition: Seostab nomen'i nomen'iga seotud ajavahemikuga. @et
definition: Setzt ein Nomen in Beziehung zu einem Zeitraum, der mit einem Nomen in Verbindung steht. @de
definition: يربط تسمية بفترة زمنية ذات صلة بتسمية. @ar
definition: 将一个命名与和一个命名有关的一个时间段关联起来。 @zh-hans

has related nomen of nomen
has element type: 1
toolkit definition: A nomen that is associated with a nomen.
toolkit definition: Bir isimle bağlantılı olan bir isim. @tr
toolkit definition: Een nomen dat is geassocieerd met een nomen. @nl
toolkit definition: Egy nomen, amelyet egy nomenhez társítanak. @hu
toolkit definition: Ein Nomen, das mit einem Nomen in Verbindung steht. @de
toolkit definition: Et nomen som forbindes med et nomen. @no
toolkit definition: Nomen que s’associa amb un nomen. @ca
toolkit definition: Nomen qui est associé à un nomen. @fr
toolkit definition: Nomen'iga seotud nomen. @et
toolkit definition: Nomen, joka liittyy nomeniin. @fi
toolkit definition: Nomen, som er knyttet til et nomen. @da
toolkit definition: Nomens, kas saistīts ar nomenu. @lv
toolkit definition: Un nomen che è associato con un nomen. @it
toolkit definition: تسمية ذات صلة بتسمية. @ar
toolkit definition: 和一个命名有关的一个命名 @zh-hans
toolkit label: ar nomenu saistītais nomens @lv
toolkit label: gerelateerde nomen van nomen @nl
toolkit label: ismin ilişkili ismi @tr
toolkit label: mit Nomen in Beziehung stehendes Nomen @de
toolkit label: nomen correlato di nomen @it
toolkit label: nomen en relation avec un nomen @fr
toolkit label: nomen kapcsolódó nomenje: @hu
toolkit label: nomen relacionat amb un nomen @ca
toolkit label: nomen relateret til nomen @da
toolkit label: nomen relatert til nomen @no
toolkit label: nomen'iga seotud nomen @et
toolkit label: nomeniin liittyvä nomen @fi
toolkit label: related nomen of nomen
toolkit label: تسمية مرتبطة بتسمية @ar
toolkit label: 命名的关联命名 @zh-hans
has subproperty: has part nomen
has subproperty: is part of nomen
has subproperty: has derivation
has subproperty: is derivation of
has subproperty: is equivalent to
has subproperty: P80009
lexical alias: relatedNomenOfNomen.en
status: Published
type: Property
domain: C10012
label: a pour nomen en relation avec un nomen @fr
label: ar nomenu saistītais nomens @lv
label: ha come nomen correlato di nomen @it
label: har nomen relateret til nomen @da
label: har nomen relatert til nomen @no
label: hat mit Nomen in Beziehung stehendes Nomen @de
label: heeft gerelateerde nomen van nomen @nl
label: ismin ilgili ismi ile ilişkilidir @tr
label: nomen kapcsolódó nomenje a következő: @hu
label: nomen'iga seotud nomen @et
label: nomeniin liittyvä nomen @fi
label: té com a nomen relacionat amb un nomen @ca
label: له تسمية مرتبطة بتسمية @ar
label: 有命名的关联命名 @zh-hans
sub property of: has related RDA entity of nomen
sub property of: P00013
definition: Bir ismi, isimle bağlantılı olan isimle ilişkilendirir. @tr
definition: Correla un nomen a un nomen che è associato con un nomen. @it
definition: Hozzákapcsol egy noment egy nomenhez, amelyet egy nomenhez társítanak. @hu
definition: Liittää nomenin nomeniin, joka liittyy nomeniin. @fi
definition: Met un nomen en relation avec un nomen qui est associé à un nomen. @fr
definition: Relaciona un nomen amb un nomen que s’associa amb un nomen. @ca
definition: Relateert een nomen aan een nomen dat is geassocieerd met een nomen. @nl
definition: Relaterer et nomen til et nomen som forbindes med et nomen. @no
definition: Relaterer et nomen til et nomen, som er knyttet til et nomen. @da
definition: Relates a nomen to a nomen that is associated with a nomen.
definition: Sasaista nomenu ar nomenu, kas saistīts ar nomenu. @lv
definition: Seostab nomen'i nomen'iga seotud nomen'iga. @et
definition: Setzt ein Nomen in Beziehung zu einem Nomen, das mit einem Nomen in Verbindung steht. @de
definition: يربط تسمية بتسمية ذات صلة بتسمية. @ar
definition: 将一个命名与和一个命名有关的一个命名关联起来。 @zh-hans

has related RDA entity of nomen
has element type: 1
toolkit definition: An RDA entity that is associated with a nomen.
toolkit definition: Bir isimle bağlantılı olan bir RDA varlığı. @tr
toolkit definition: Een RDA-entiteit die is geassocieerd met een nomen. @nl
toolkit definition: Egy RDA-entitás, amelyet egy nomenhez társítanak. @hu
toolkit definition: Eine RDA-Entität, die mit einem Nomen in Verbindung steht. @de
toolkit definition: En RDA-entitet som forbindes med et nomen. @no
toolkit definition: Entitat RDA que s’associa amb un nomen. @ca
toolkit definition: Entité RDA qui est associée à un nomen. @fr
toolkit definition: Nomen'iga seotud RDA olem. @et
toolkit definition: RDA entīte, kas saistīta ar nomenu. @lv
toolkit definition: RDA-entiteetti, joka liittyy nomeniin. @fi
toolkit definition: RDA-entitet, som er knyttet til et nomen. @da
toolkit definition: Un'entità RDA che è associata con un nomen. @it
toolkit definition: كيان "وام" ذو صلة بتسمية. @ar
toolkit definition: 和一个命名有关的一个RDA实体 @zh-hans
toolkit label: RDA-entitet relateret til nomen @da
toolkit label: RDA-entitet relatert til nomen @no
toolkit label: ar nomenu saistītā RDA entīte @lv
toolkit label: entitat RDA relacionada amb un nomen @ca
toolkit label: entità RDA correlata di nomen @it
toolkit label: entité RDA en relation avec un nomen @fr
toolkit label: gerelateerde RDA-entiteit van nomen @nl
toolkit label: ismin RDA varlığıyla ilişkisi @tr
toolkit label: mit Nomen in Beziehung stehende RDA-Entität @de
toolkit label: nomen kapcsolódó RDA-entitása: @hu
toolkit label: nomen'iga seotud RDA olem @et
toolkit label: nomeniin liittyvä RDA-entiteetti @fi
toolkit label: related RDA entity of nomen
toolkit label: كيان "وام" مرتبط بتسمية @ar
toolkit label: 命名的关联RDA实体 @zh-hans
has subproperty: has related work of nomen
has subproperty: has related expression of nomen
has subproperty: has related manifestation of nomen
has subproperty: has related item of nomen
has subproperty: has related agent of nomen
has subproperty: has related place of nomen
has subproperty: has related timespan of nomen
has subproperty: has related nomen of nomen
has subproperty: is appellation of RDA entity of
has subproperty: P80010
lexical alias: relatedRDAEntityOfNomen.en
status: Published
type: Property
domain: C10012
label: a pour entité RDA en relation avec un nomen @fr
label: ar nomenu saistītā RDA entīte @lv
label: ha come entità RDA correlata di nomen @it
label: har RDA-entitet relateret til nomen @da
label: har RDA-entitet relatert til nomen @no
label: hat mit Nomen in Beziehung stehende RDA-Entität @de
label: heeft gerelateerde RDA-entiteit van nomen @nl
label: ismin ilgili RDA varlığı ile ilişkilidir @tr
label: nomen kapcsolódó RDA-entitása a következő: @hu
label: nomen'iga seotud RDA olem @et
label: nomeniin liittyvä RDA-entiteetti @fi
label: té com a entitat RDA relacionada amb un nomen @ca
label: له كيان "وام" مرتبط بتسمية @ar
label: 有命名的关联RDA实体 @zh-hans
sub property of: has related entity of nomen
sub property of: P00001
definition: Bir ismi, isimle baplantılı olan RDA varlığıyla ilişkilendirir. @tr
definition: Correla un nomen a un'entità RDA che è associata con un nomen. @it
definition: Hozzákapcsol egy noment egy RDA-entitáshoz, amelyet egy nomenhez társítanak. @hu
definition: Liittää nomenin RDA-entiteettiin, joka liittyy nomeniin. @fi
definition: Met un nomen en relation avec une entité RDA qui est associée à un nomen. @fr
definition: Relaciona un nomen amb una entitat RDA que s’associa amb un nomen. @ca
definition: Relateert een nomen aan een RDA-entiteit die is geassocieerd met een nomen. @nl
definition: Relaterer et nomen til en RDA-entitet som forbindes med et nomen. @no
definition: Relaterer et nomen til en RDA-entitet, som er knyttet til et nomen. @da
definition: Relates a nomen to an RDA entity that is associated with a nomen.
definition: Sasaista nomenu ar RDA entīti, kas saistīta ar nomenu. @lv
definition: Seostab nomen'i nomen'iga seotud RDA olemiga. @et
definition: Setzt ein Nomen in Beziehung zu einer RDA-Entität, die mit einem Nomen in Verbindung steht. @de
definition: يربط تسمية بكيان "وام" ذي صلة بتسمية. @ar
definition: 将一个命名与和一个命名有关的一个RDA实体关联起来。 @zh-hans

has related person of nomen
has element type: 1
toolkit definition: A person who is associated with a nomen.
toolkit definition: Bir isimle bağlantılı olan bir kişi. @tr
toolkit definition: Een persoon die is geassocieerd met een nomen. @nl
toolkit definition: Egy személy, akit egy nomenhez társítanak. @hu
toolkit definition: Eine Person, die mit einem Nomen in Verbindung steht. @de
toolkit definition: En person som forbindes med et nomen. @no
toolkit definition: Henkilö, joka liittyy nomeniin. @fi
toolkit definition: Nomen'iga seotud isik. @et
toolkit definition: Person, som er knyttet til et nomen. @da
toolkit definition: Persona que s’associa amb un nomen. @ca
toolkit definition: Persona, kura saistīta ar nomenu. @lv
toolkit definition: Personne qui est associée à un nomen. @fr
toolkit definition: Una persona che è associata con un nomen. @it
toolkit definition: شخص ذو صلة بتسمية. @ar
toolkit definition: 和一个命名有关的一个个人 @zh-hans
toolkit label: ar nomenu saistītā persona @lv
toolkit label: gerelateerde persoon van nomen @nl
toolkit label: isimle ilişkili kişi @tr
toolkit label: mit Nomen in Beziehung stehende Person @de
toolkit label: nomen'iga seotud isik @et
toolkit label: nomenhez kapcsolódó személy: @hu
toolkit label: nomeniin liittyvä henkilö @fi
toolkit label: person relateret til nomen @da
toolkit label: person relatert til nomen @no
toolkit label: persona correlata di nomen @it
toolkit label: persona relacionada amb un nomen @ca
toolkit label: personne en relation avec un nomen @fr
toolkit label: related person of nomen
toolkit label: شخص مرتبط بتسمية @ar
toolkit label: 命名的关联个人 @zh-hans
has subproperty: is appellation of person of
has subproperty: is assigned by person
has subproperty: P80011
lexical alias: relatedPersonOfNomen.en
status: Published
type: Property
domain: C10012
label: a pour personne en relation avec un nomen @fr
label: ar nomenu saistītā persona @lv
label: ha come persona correlata di nomen @it
label: har person relateret til nomen @da
label: har person relatert til nomen @no
label: hat mit Nomen in Beziehung stehende Person @de
label: heeft gerelateerde persoon van nomen @nl
label: ismin ilgili kişisi ile ilişkilidir @tr
label: nomen'iga seotud isik @et
label: nomenhez kapcsolódó személy a következő: @hu
label: nomeniin liittyvä henkilö @fi
label: té com a persona relacionada amb un nomen @ca
label: له شخص مرتبط بتسمية @ar
label: 有命名的关联个人 @zh-hans
sub property of: has related agent of nomen
sub property of: P00007
definition: Bir ismi, isimle bağlantılı olan kişiyle ilişkilendirir. @tr
definition: Correla un nomen a una persona che è associata con un nomen. @it
definition: Hozzákapcsol egy noment egy személyhez, akit egy nomenhez társítanak. @hu
definition: Liittää nomenin henkilöön, joka liittyy nomeniin. @fi
definition: Met un nomen en relation avec une personne qui est associée à un nomen. @fr
definition: Relaciona un nomen amb una persona que s’associa amb un nomen. @ca
definition: Relateert een nomen aan een persoon die is geassocieerd met een nomen. @nl
definition: Relaterer et nomen til en person som forbindes med et nomen. @no
definition: Relaterer et nomen til en person, som er knyttet til et nomen. @da
definition: Relates a nomen to a person who is associated with a nomen.
definition: Sasaista nomenu ar personu, kura saistīta ar nomenu. @lv
definition: Seostab nomen'i nomen'iga seotud isikuga. @et
definition: Setzt ein Nomen in Beziehung zu einer Person, die mit einem Nomen in Verbindung steht. @de
definition: يربط تسمية بشخص ذي صلة بتسمية. @ar
definition: 将一个命名与和一个命名有关的一个个人关联起来。 @zh-hans

has related family of nomen
has element type: 1
toolkit definition: A family who is associated with a nomen.
toolkit definition: Dzimta/ģimene, kas saistīta ar nomenu. @lv
toolkit definition: Een familie die is geassocieerd met een nomen. @nl
toolkit definition: Egy család, amelyet egy nomenhez társítanak. @hu
toolkit definition: Eine Familie, die mit einem Nomen in Verbindung steht. @de
toolkit definition: En familie som forbindes med et nomen. @no
toolkit definition: Familie, som er knyttet til et nomen. @da
toolkit definition: Famille qui est associée à un nomen. @fr
toolkit definition: Família que s’associa amb un nomen. @ca
toolkit definition: Nomen'iga seotud perekond. @et
toolkit definition: Nomenle bağlantılı olan bir aile. @tr
toolkit definition: Suku, joka liittyy nomeniin. @fi
toolkit definition: Una famiglia che è associata con un nomen @it
toolkit definition: عائلة ذات صلة بتسمية. @ar
toolkit definition: 和一个命名有关的一个家族 @zh-hans
toolkit label: ar nomenu saistītā dzimta/ģimene @lv
toolkit label: famiglia correlata di nomen @it
toolkit label: familie relateret til nomen @da
toolkit label: familie relatert til nomen @no
toolkit label: famille en relation avec un nomen @fr
toolkit label: família relacionada amb un nomen @ca
toolkit label: gerelateerde familie van nomen @nl
toolkit label: mit Nomen in Beziehung stehende Familie @de
toolkit label: nomen'iga seotud perekond @et
toolkit label: nomenhez kapcsolódó család: @hu
toolkit label: nomeniin liittyvä suku @fi
toolkit label: related family of nomen
toolkit label: İsimle ilişkili aile @tr
toolkit label: عائلة مرتبطة بتسمية @ar
toolkit label: 命名的关联家族 @zh-hans
has subproperty: is appellation of family of
has subproperty: is assigned by family
has subproperty: P80012
lexical alias: relatedFamilyOfNomen.en
status: Published
type: Property
domain: C10012
label: a pour famille en relation avec un nomen @fr
label: ar nomenu saistītā dzimta/ģimene @lv
label: ha come famiglia correlata di nomen @it
label: har familie relateret til nomen @da
label: har familie relatert til nomen @no
label: hat mit Nomen in Beziehung stehende Familie @de
label: heeft gerelateerde familie van nomen @nl
label: ismin ilgili ailesi ile ilişkilidir @tr
label: nomen'iga seotud perekond @et
label: nomenhez kapcsolódó család a következő: @hu
label: nomeniin liittyvä suku @fi
label: té com a família relacionada amb un nomen @ca
label: له عائلة مرتبطة بتسمية @ar
label: 有命名的关联家族 @zh-hans
sub property of: has related collective agent of nomen
sub property of: P00008
definition: Bir ismi, isimle bağlantılı olan aileyle ilişkilendirir. @tr
definition: Correla un nomen a una famiglia che è associata con un nomen. @it
definition: Hozzákapcsol egy noment egy családhoz, amelyet egy nomenhez társítanak. @hu
definition: Liittää nomenin sukuun, joka liittyy nomeniin. @fi
definition: Met un nomen en relation avec une famille qui est associée à un nomen. @fr
definition: Relaciona un nomen amb una família que s’associa amb un nomen. @ca
definition: Relateert een nomen aan een familie die is geassocieerd met een nomen. @nl
definition: Relaterer et nomen til en familie som forbindes med et nomen. @no
definition: Relaterer et nomen til en familie, som er knyttet til et nomen. @da
definition: Relates a nomen to a family who is associated with a nomen.
definition: Sasaista nomenu ar dzimtu/ģimeni, kas saistīta ar nomenu. @lv
definition: Seostab nomen'i nomen'iga seotud perekonnaga. @et
definition: Setzt ein Nomen in Beziehung zu einer Familie, die mit einem Nomen in Verbindung steht. @de
definition: يربط تسمية بعائلة ذات صلة بتسمية. @ar
definition: 将一个命名与和一个命名有关的一个家族关联起来。 @zh-hans

has related corporate body of nomen
has element type: 1
toolkit definition: A corporate body who is associated with a nomen.
toolkit definition: Collectivité qui est associée à un nomen. @fr
toolkit definition: Een corporatie die is geassocieerd met een nomen. @nl
toolkit definition: Egy testület, amelyet egy nomenhez társítanak. @hu
toolkit definition: Eine Körperschaft, die mit einem Nomen in Verbindung steht. @de
toolkit definition: En korporasjon som forbindes med et nomen. @no
toolkit definition: Entitat corporativa que s’associa amb un nomen. @ca
toolkit definition: Institūcija, kas saistīta ar nomenu. @lv
toolkit definition: Korporation, som er knyttet til et nomen. @da
toolkit definition: Nomen'iga seotud asutus. @et
toolkit definition: Nomenle ilişkilendirilen tüzel kişi. @tr
toolkit definition: Un ente che è associato con un nomen. @it
toolkit definition: Yhteisö, joka liittyy nomeniin. @fi
toolkit definition: هيئة ذات صلة بتسمية. @ar
toolkit definition: 和一个命名有关的一个团体 @zh-hans
toolkit label: Nomenin tüzel kişiyle ilişkisi @tr
toolkit label: ar nomenu saistītā institūcija @lv
toolkit label: collectivité en relation avec un nomen @fr
toolkit label: ente correlato di nomen @it
toolkit label: entitat corporativa relacionada amb un nomen @ca
toolkit label: gerelateerde corporatie van nomen @nl
toolkit label: korporasjon relatert til nomen @no
toolkit label: korporation relateret til nomen @da
toolkit label: mit Nomen in Beziehung stehende Körperschaft @de
toolkit label: nomen'iga seotud asutus @et
toolkit label: nomenhez kapcsolódó testület: @hu
toolkit label: nomeniin liittyvä yhteisö @fi
toolkit label: related corporate body of nomen
toolkit label: هيئة مرتبطة بتسمية @ar
toolkit label: 命名的关联团体 @zh-hans
has subproperty: is appellation of corporate body of
has subproperty: is assigned by corporate body
has subproperty: P80013
lexical alias: relatedCorporateBodyOfNomen.en
status: Published
type: Property
domain: C10012
label: a pour collectivité en relation avec un nomen @fr
label: ar nomenu saistītā institūcija @lv
label: ha come ente correlato di nomen @it
label: har korporasjon relatert til nomen @no
label: har korporation relateret til nomen @da
label: hat mit Nomen in Beziehung stehende Körperschaft @de
label: heeft gerelateerde corporatie van nomen @nl
label: ismin ilgili tüzel kişisi ile ilişkilidir @tr
label: nomen'iga seotud asutus @et
label: nomenhez kapcsolódó testület a következő: @hu
label: nomeniin liittyvä yhteisö @fi
label: té com a entitat corporativa relacionada amb un nomen @ca
label: له هيئة مرتبطة بتسمية @ar
label: 有命名的关联团体 @zh-hans
sub property of: has related collective agent of nomen
sub property of: P00009
definition: Bir ismi, isimle bağlantılı olan tüzel kişisiyle ilişkilendirir. @tr
definition: Correla un nomen a un ente che è associato con un nomen. @it
definition: Hozzákapcsol egy noment egy testülethez, amelyet egy nomenhez társítanak. @hu
definition: Liittää nomenin yhteisöön, joka liittyy nomeniin. @fi
definition: Met un nomen en relation avec une collectivité qui est associée à un nomen. @fr
definition: Relaciona un nomen amb una entitat corporativa que s’associa amb un nomen. @ca
definition: Relateert een nomen aan een corporatie die is geassocieerd met een nomen. @nl
definition: Relaterer et nomen til en korporasjon som forbindes med et nomen. @no
definition: Relaterer et nomen til en korporation, som er knyttet til et nomen. @da
definition: Relates a nomen to a corporate body who is associated with a nomen.
definition: Sasaista nomenu ar institūciju, kas saistīta ar nomenu. @lv
definition: Seostab nomen'i nomen'iga seotud asutusega. @et
definition: Setzt ein Nomen in Beziehung zu einer Körperschaft, die mit einem Nomen in Verbindung steht. @de
definition: يربط تسمية بهيئة ذات صلة بتسمية. @ar
definition: 将一个命名与和一个命名有关的一个团体关联起来。 @zh-hans

is subject nomen of
has element type: 2
toolkit definition: A work that is about a nomen.
toolkit definition: Bir isim hakkındaki bir eser. @tr
toolkit definition: Darbs, kura temats ir nomens. @lv
toolkit definition: Een werk dat over een nomen gaat. @nl
toolkit definition: Egy mű, amely egy nomenről szól. @hu
toolkit definition: Ein Werk, das von einem Nomen handelt. @de
toolkit definition: Et verk som handler om et nomen. @no
toolkit definition: Obra que tracta sobre un nomen. @ca
toolkit definition: Teos, jonka aiheena on nomen. @fi
toolkit definition: Teos, mis on nomen'i kohta. @et
toolkit definition: Un'opera che è su un nomen. @it
toolkit definition: Værk, som handler om et nomen. @da
toolkit definition: Œuvre qui traite d’un nomen. @fr
toolkit definition: عمل عن تسمية. @ar
toolkit definition: 关于一个命名的一种作品 @zh-hans
toolkit label: Nomen als Thema von @de
toolkit label: a következő nomen tárgya: @hu
toolkit label: emne nomen for @no
toolkit label: ir temats (nomens) @lv
toolkit label: konu alınan isim @tr
toolkit label: nomen aiheena teoksessa @fi
toolkit label: nomen de matèria de @ca
toolkit label: nomen soggetto di @it
toolkit label: nomen sujet de @fr
toolkit label: nomen, som er subjekt af @da
toolkit label: onderwerp-nomen van @nl
toolkit label: subject nomen of
toolkit label: teema (nomen) teoses @et
toolkit label: موضوع تسمية لـ @ar
toolkit label: ……的主题命名 @zh-hans
has subproperty: is nomen described by
has subproperty: P80014
lexical alias: subjectNomenOf.en
status: Published
type: Property
domain: C10012
label: bir konu adı @tr
label: er emne nomen for @no
label: er nomen, som er subjekt af @da
label: est un nomen sujet de @fr
label: ha come nomen soggetto di @it
label: ir temats (nomens) @lv
label: is onderwerp-nomen van @nl
label: ist Nomen als Thema von @de
label: nomen aiheena teoksessa @fi
label: teema (nomen) teoses @et
label: tárgya a következő nomennek: @hu
label: és nomen de matèria de @ca
label: هو موضوع تسمية لـ @ar
label: 有……的主题命名 @zh-hans
sub property of: has related work of nomen
sub property of: P00014
alternative label: (adın) konusu @tr
alternative label: Thema von (Nomen) @de
alternative label: emne for (nomen) @no
alternative label: matèria de (nomen) @ca
alternative label: soggetto di (nomen) @it
alternative label: subject of (nomen)
alternative label: subjekt af (nomen) @da
alternative label: sujet de (nomen) @fr
alternative label: tárgya a következőnek (nomen): @hu
alternative label: موضوع عن (تسمية) @ar
alternative label: ……的主题（命名） @zh-hans
definition: Bir ismi, bir isim hakkında olan bir eserle ilişkilendirir. @tr
definition: Correla un nomen a un'opera che è su un nomen. @it
definition: Egy noment hozzákapcsol egy műhöz, ami egy nomenről szól. @hu
definition: Liittää nomenin teokseen, jonka aiheena on nomen. @fi
definition: Met un nomen en relation avec une œuvre qui traite d’un nomen. @fr
definition: Relaciona un nomen amb una obra que tracta sobre un nomen. @ca
definition: Relateert een nomen aan een werk dat over een nomen gaat. @nl
definition: Relaterer et nomen til et verk som handler om et nomen. @no
definition: Relaterer et nomen til et værk, som handler om et nomen. @da
definition: Relates a nomen to a work that is about a nomen.
definition: Sasaista nomenu ar darbu, kura temats ir nomens. @lv
definition: Seostab nomen'i teosega, mis on nomen'i kohta. @et
definition: Setzt ein Nomen in Beziehung zu einem Werk, das von einem Nomen handelt. @de
definition: يربط تسمية بعمل عن تسمية. @ar
definition: 将一个命名与关于一个命名的一种作品关联起来。 @zh-hans

is access point for item of
has element type: 2
toolkit definition: An item that has an appellation in natural language that is taken from a vocabulary encoding scheme or is constructed using a string encoding scheme.
toolkit definition: Bir kelime kodlama şemasından alınan veya bir dize kodlama şeması kullanılarak oluşturulan doğal dilde bir unvana sahip bir kopya. @tr
toolkit definition: Een item dat een benaming heeft in natuurlijke taal die ontleend is aan een vocabulair coderingsschema of gevormd is volgens een string coderingsschema. @nl
toolkit definition: Egy példány, amelynek van egy olyan természetes nyelvű megnevezése, amely egy szótárkódolási sémából származik, vagy egy karakterlánc-kódolási séma használatával szerkesztett. @hu
toolkit definition: Ein Exemplar, das eine Bezeichnung in natürlicher Sprache hat, die einem Vocabulary Encoding Scheme entnommen oder mit einem String Encoding Scheme konstruiert wird. @de
toolkit definition: Eksemplar, millel on loomulikus keeles nimetus, mis on võetud leksikaalsest märkimissüsteemist või moodustatud stringilise märkimissüsteemi alusel. @et
toolkit definition: Eksemplar, som har en benævnelse på normalsprog, som er taget fra et vokabularkodningsskema eller er konstrueret ved hjælp af et strengkodningsskema. @da
toolkit definition: Et eksemplar som har en betegnelse på et naturlig språk som er hentet fra et kodeskjema for vokabular eller som er konstruert ved hjelp av et kodeskjema for syntaks. @no
toolkit definition: Item qui possède une appellation en langage naturel provenant d’un schéma d’encodage de vocabulaire ou construite à l’aide d’un schéma d’encodage de chaînes. @fr
toolkit definition: Kappale, jonka luonnollisen kielen mukainen nimitys on otettu jostakin sanaston merkintäjärjestelmästä tai joka on muodostettu jotakin merkkijonon merkintäjärjestelmää käyttäen. @fi
toolkit definition: Un item che ha una denominazione nel linguaggio naturale che è tratta da uno schema di codifica di vocabolario o è costruita usando uno schema di codifica di stringa. @it
toolkit definition: Vienība, kurai ir apzīmējums/nosaukums saprotamā valodā, kas ņemts no kodēšanas vārdnīcas vai tiek veidots, izmantojot kodēšanas shēmu @lv
toolkit definition: Ítem que té una apel·lació en llenguatge natural que s’obté d’un esquema de codificació de vocabulari o s’elabora usant un esquema de codificació de cadenes. @ca
toolkit definition: مفردة لها اسم في لغة طبيعية مأخوذة من خطة ترميز مفردات أو مبنية باستخدام خطة ترميز سلسلة تمثيلات. @ar
toolkit definition: 有取自一个词表编码体系或者用一个串编码体系构建、用自然语言的一个称谓的一个单件 @zh-hans
toolkit label: Kopya için erişim noktası @tr
toolkit label: Sucheinstieg für ein Exemplar von @de
toolkit label: access point for item of
toolkit label: hakutieto kappaleelle @fi
toolkit label: hozzáférési pont a következő példányhoz: @hu
toolkit label: ingang voor item van @nl
toolkit label: ir pamatforma vienībai @lv
toolkit label: otsielement eksemplarile @et
toolkit label: point d’accès d’un item de @fr
toolkit label: punt d’accés d’ítem de @ca
toolkit label: punto d'accesso per item di @it
toolkit label: søgeindgang for eksemplar af @da
toolkit label: søkeinngang for eksemplar for @no
toolkit label: نقطة وصول لمفردة لـ @ar
toolkit label: ……的单件的检索点 @zh-hans
has subproperty: is authorized access point for item of
has subproperty: is variant access point for item of
has subproperty: P80015
lexical alias: accessPointForItemOf.en
status: Published
type: Property
domain: C10012
label: er søgeindgang for eksemplar af @da
label: er søkeinngang for eksemplar for @no
label: est un point d’accès d’un item de @fr
label: hakutieto kappaleelle @fi
label: hozzáférési pont a következő példányhoz: @hu
label: ir pamatforma vienībai @lv
label: is ingang voor item van @nl
label: ist Sucheinstieg für ein Exemplar von @de
label: kopyası için erişim noktasıdır @tr
label: otsielement eksemplarile @et
label: è punto d'accesso per item di @it
label: és punt d’accés d’ítem de @ca
label: هي نقطة وصول لمفردة لـ @ar
label: 是……的单件的检索点 @zh-hans
sub property of: is appellation of item of
sub property of: is access point for RDA entity of
definition: Bir ismi, bir kelime kodlama şemasından alınan veya bir dize kodlama şeması kullanılarak oluşturulan doğal dilde bir adı olan bir kopyayla ilişkilendirir. @tr
definition: Correla un nomen a un item che ha una denominazione nel linguaggio naturale che è tratta da uno schema di codifica di vocabolario o è costruita usando uno schema di codifica di stringa. @it
definition: Hozzákapcsol egy noment egy példányhoz, amelynek van egy olyan természetes nyelvű megnevezése, amely egy szótárkódolási sémából származik, vagy egy karakterlánc-kódolási séma használatával szerkesztett. @hu
definition: Liittää nomenin kappaleeseen, jonka luonnollisen kielen mukainen nimitykseen on otettu jostakin sanaston merkintäjärjestelmästä tai muodostettu jotakin merkkijonon merkintäjärjestelmää käyttäen. @fi
definition: Met un nomen en relation avec un item qui possède une appellation en langage naturel provenant d’un schéma d’encodage de vocabulaire ou construite à l’aide d’un schéma d’encodage de chaînes. @fr
definition: Relaciona un nomen amb un ítem que té una apel·lació en llenguatge natural que s’obté d’un esquema de codificació de vocabulari o s’elabora usant un esquema de codificació de cadenes. @ca
definition: Relateert een nomen aan een item dat een benaming heeft in natuurlijke taal die ontleend is aan een vocabulair coderingsschema of gevormd is volgens een string coderingsschema. @nl
definition: Relaterer et nomen til et eksemplar som har en betegnelse på et naturlig språk som er hentet fra et kodeskjema for vokabular eller som er konstruert ved hjelp av et kodeskjema for syntaks. @no
definition: Relaterer et nomen til et eksemplar, som har en benævnelse på normalsprog, som er taget fra et vokabularkodningsskema eller er konstrueret ved hjælp af et strengkodningsskema. @da
definition: Relates a nomen to an item that has an appellation in natural language that is taken from a vocabulary encoding scheme or is constructed using a string encoding scheme.
definition: Sasaista nomenu ar vienību, kurai ir apzīmējums/nosaukums saprotamā valodā, kas ņemts no kodēšanas vārdnīcas vai tiek veidots, izmantojot kodēšanas shēmu. @lv
definition: Seostab nomen'i eksemplariga, millel on loomulikus keeles nimetus, mis on võetud leksikaalsest märkimissüsteemist või moodustatud stringilise märkimissüsteemi alusel. @et
definition: Setzt ein Nomen in Beziehung zu einem Exemplar, das eine Bezeichnung in natürlicher Sprache hat, die einem Vocabulary Encoding Scheme entnommen oder mit einem String Encoding Scheme konstruiert wird. @de
definition: يربط تسمية بمفردة لها اسم في لغة طبيعية مأخوذة من خطة ترميز مفردات أو مبنية باستخدام خطة ترميز سلسلة تمثيلات. @ar
definition: 将一个命名与有取自一个词表编码体系或者用一个串编码体系构建、用自然语言的一个称谓的一个单件关联起来。 @zh-hans

is appellation of item of
has element type: 2
toolkit definition: An item that is referred to by a nomen used within a given scheme or context.
toolkit definition: Belirli bir şema veya bağlam içinde kullanılan bir isimle anılan bir kopya. @tr
toolkit definition: Een item dat aangeduid wordt door een nomen gebruikt binnen een bepaald schema of context @nl
toolkit definition: Egy példány, amelyre egy adott sémában vagy kontextusban használt nomen hivatkozik. @hu
toolkit definition: Ein Exemplar, auf das mit einem Nomen referenziert wird, das in einem bestimmten Schema oder Kontext verwendet wird. @de
toolkit definition: Eksemplar, millele antud süsteemis või kontekstis nomen'iga viidatakse. @et
toolkit definition: Eksemplar, som henvises til af et nomen, som anvendes inden for et givet skema eller kontekst. @da
toolkit definition: Et eksemplar som refereres til med et nomen brukt innenfor et bestemt skjema eller kontekst. @no
toolkit definition: Item qui est désigné par un nomen utilisé à l’intérieur d’un schéma ou d’un contexte donnés. @fr
toolkit definition: Kappale, johon viitataan tietyssä järjestelmässä tai kontekstissa käytetyllä nomenilla. @fi
toolkit definition: Un item a cui si fa riferimento con un nomen usato in un dato schema o contesto. @it
toolkit definition: Vienība, uz ko attiecas nomens, ko lieto konkrētāja sistēmā vai kontekstā. @lv
toolkit definition: Ítem que fa referència a un nomen usat en un esquema o un context determinat. @ca
toolkit definition: مفردة يشار إليها بتسمية مستخدمة في خطة أو في سياق معين. @ar
toolkit definition: 在一个给定的体系或语境中用一个命名指称的一个单件 @zh-hans
toolkit label: Bezeichnung für ein Exemplar von @de
toolkit label: apel·lació d’ítem de @ca
toolkit label: appellation d’item de @fr
toolkit label: appellation of item of
toolkit label: benaming van item van @nl
toolkit label: benævnelse på eksemplar af @da
toolkit label: betegnelse for eksemplar for @no
toolkit label: denominazione di item di @it
toolkit label: ir apzīmējums vienībai @lv
toolkit label: kopyanın unvanı @tr
toolkit label: megnevezése a következő példánynak: @hu
toolkit label: nimetus eksemplarile @et
toolkit label: nimitys kappaleelle @fi
toolkit label: اسم مفردة لـ @ar
toolkit label: ……的单件的称谓 @zh-hans
has subproperty: is access point for item of
has subproperty: is title of item of
has subproperty: is identifier for item of
has subproperty: P80016
lexical alias: appellationOfItemOf.en
status: Published
type: Property
domain: C10012
label: er benævnelse på eksemplar af @da
label: er betegnelse for eksemplar for @no
label: est une appellation d’item de @fr
label: ir apzīmējums vienībai @lv
label: is benaming van item van @nl
label: ist Bezeichnung für ein Exemplar von @de
label: kopyasının unvanıdır @tr
label: megnevezése a következő példánynak: @hu
label: nimetus eksemplarile @et
label: nimitys kappaleelle @fi
label: è denominazione di item di @it
label: és apel·lació d’ítem de @ca
label: هي اسم مفردة لـ @ar
label: 是……的单件的称谓 @zh-hans
sub property of: has related item of nomen
sub property of: is appellation of RDA entity of
definition: Bir ismi, belirli bir şema veya bağlam içinde kullanılan bir isim tarafından atıfta bulunulan bir kopyayla ilişkilendirir. @tr
definition: Correla un nomen a un item a cui si fa riferimento con un nomen usato in un dato schema o contesto @it
definition: Hozzákapcsol egy noment egy példányhoz, amelyre egy adott sémában vagy kontextusban használt nomen hivatkozik. @hu
definition: Liittää nomenin kappaleeseen, johon viitataan tietyssä järjestelmässä tai kontekstissa käytetyllä nomenilla. @fi
definition: Met un nomen en relation avec un item qui est désigné par un nomen utilisé à l’intérieur d’un schéma ou d’un contexte donnés. @fr
definition: Relaciona un nomen amb un ítem que fa referència a un nomen usat en un esquema o un context determinat. @ca
definition: Relateert een nomen aan een item dat aangeduid wordt door een nomen gebruikt binnen een bepaald schema of context @nl
definition: Relaterer et nomen til et eksemplar som refereres til med et nomen brukt innenfor et bestemt skjema eller kontekst. @no
definition: Relaterer et nomen til et eksemplar, som henvises til af et nomen, som anvendes inden for et givet skema eller kontekst. @da
definition: Relates a nomen to an item that is referred to by a nomen used within a given scheme or context.
definition: Sasaista nomenu ar vienību, uz ko attiecas nomens, ko lieto konkrētāja sistēmā vai kontekstā. @lv
definition: Seostab nomen'i eksemplariga, millele antud süsteemis või kontekstis nomen'iga viidatakse. @et
definition: Setzt ein Nomen in Beziehung zu einem Exemplar, auf das mit einem Nomen referenziert wird, das in einem bestimmten Schema oder Kontext verwendet wird. @de
definition: يربط تسمية بمفردة يُشار إليها بتسمية مستخدمة في خطة أو في سياق معين. @ar
definition: 将一个命名与在一个给定的体系或语境中用一个命名指称的一个单件关联起来。 @zh-hans

is title of item of
has element type: 2
toolkit definition: An item that has an appellation of item in natural language and phrasing used in common discourse.
toolkit definition: Doğal dilde ve yaygın söylemde kullanılan bir kopya unvanına sahip bir kopya. @tr
toolkit definition: Een item dat een benaming van item heeft in natuurlijke taal en terminologie in gebruikelijke bewoording. @nl
toolkit definition: Egy példány, amelynek van egy természetes nyelvű megnevezése és közbeszédben használt megfogalmazása. @hu
toolkit definition: Ein Exemplar, das über eine Bezeichnung für ein Exemplar in natürlicher Sprache und Ausdrucksweise verfügt, die beim normalen Sprechen und Schreiben verwendet wird. @de
toolkit definition: Eksemplar, millel on nimetus loomulikus keeles ja sõnastuses, mida kasutatakse ühises diskursuses. @et
toolkit definition: Eksemplar, som har en benævnelse på eksemplar på normalsprog og med formuleringer, som bruges alment. @da
toolkit definition: Et eksemplar som har en betegnelse for eksemplar på et naturlig språk og med frasering brukt i alminnelig diskurs. @no
toolkit definition: Item qui possède une appellation d’item exprimée dans un langage et une formulation naturels et utilisée dans le langage courant. @fr
toolkit definition: Kappale, jolla on luonnollisen kielen ja yleisen diskurssin sanamuodon mukainen nimitys. @fi
toolkit definition: Un item che ha una designazione di item in linguaggio e frasi naturali usati nel discorso comune. @it
toolkit definition: Vienība, kurai ir izteiksmes apzīmējums dabiskā valodā un frāzēs, kas tiek lietots savstarpējā saziņā. @lv
toolkit definition: Ítem que té una apel·lació d’ítem en llenguatge i frases naturals usada en el discurs comú. @ca
toolkit definition: مفردة لها اسم في لغة طبيعية مستخدمة في الخطاب العام. @ar
toolkit definition: 有用自然语言和普通话语措词表达的单件的称谓的一个单件 @zh-hans
toolkit label: Titel eines Exemplars von @de
toolkit label: címe a következő példánynak @hu
toolkit label: kopyanın başlığı @tr
toolkit label: nimeke kappaleelle @fi
toolkit label: nosaukums vienībai @lv
toolkit label: pealkiri eksemplaris @et
toolkit label: titel på eksemplar af @da
toolkit label: titel van item van @nl
toolkit label: title of item of
toolkit label: titolo dell'item di @it
toolkit label: titre d’item de @fr
toolkit label: tittel for eksemplar for @no
toolkit label: títol d’ítem de @ca
toolkit label: عنوان مفردة لـ @ar
toolkit label: ……的单件的题名 @zh-hans
has subproperty: is preferred title of item of
has subproperty: is variant title of item of
has subproperty: P80017
lexical alias: titleOfItemOf.en
status: Published
type: Property
domain: C10012
label: címe a következő példánynak: @hu
label: er titel på eksemplar af @da
label: er tittel for eksemplar for @no
label: est un titre d’item de @fr
label: ir nosaukums vienībai @lv
label: is titel van item van @nl
label: ist Titel eines Exemplars von @de
label: kopyanın başlığıdır @tr
label: nimeke kappaleelle @fi
label: pealkiri eksemplaris @et
label: è titolo dell'item di @it
label: és títol d’ítem de @ca
label: هو عنوان مفردة لـ @ar
label: 是……的单件的题名 @zh-hans
sub property of: is appellation of item of
sub property of: is name of RDA entity of
definition: Bir ismi, doğal dilde ve ortak söylemde kullanılan ifadelerde bir kopya yakıştırması olan bir kopyayla ilişkilendirir. @tr
definition: Correla un nomen a un item che ha una designazione di item in linguaggio e frasi naturali usati nel discorso comune. @it
definition: Hozzákapcsol egy noment egy példányhoz, amelynek van egy természetes nyelvű megnevezése és közbeszédben használt megfogalmazása. @hu
definition: Liittää nomenin kappaleeseen, jolla on luonnollisen kielen ja yleisen diskurssin sanamuodon mukainen nimitys. @fi
definition: Met un nomen en relation avec un item qui possède une appellation d’item exprimée dans un langage et une formulation naturels et utilisée dans le langage courant. @fr
definition: Relaciona un nomen amb un ítem que té una apel·lació d’ítem en llenguatge i frases naturals usada en el discurs comú. @ca
definition: Relateert een nomen aan een item dat een benaming van item heeft in natuurlijke taal en terminologie in gebruikelijke bewoording. @nl
definition: Relaterer et nomen til et eksemplar som har en betegnelse for eksemplar på et naturlig språk og med frasering brukt i alminnelig diskurs. @no
definition: Relaterer et nomen til et eksemplar, som har en benævnelse på eksemplar på normalsprog og med formuleringer, som bruges alment. @da
definition: Relates a nomen to an item that has an appellation of item in natural language and phrasing used in common discourse.
definition: Sasaista nomenu ar vienību, kurai ir izteiksmes apzīmējums dabiskā valodā un frāzēs, kas tiek lietots savstarpējā saziņā. @lv
definition: Seostab nomen'i eksemplariga, millel on nimetus loomulikus keeles ja sõnastuses, mida kasutatakse ühises diskursuses. @et
definition: Setzt ein Nomen in Beziehung zu einem Exemplar, das über eine Bezeichnung für ein Exemplar in natürlicher Sprache und Ausdrucksweise verfügt, die beim normalen Sprechen und Schreiben verwendet wird. @de
definition: يربط تسمية بمفردة لها اسم في لغة طبيعية مستخدمة في الخطاب العام. @ar
definition: 将一个命名与有用自然语言和普通话语措词表达的单件的称谓的一个单件关联起来。 @zh-hans

is access point for agent of
has element type: 2
toolkit definition: Agent que té una apel·lació en llenguatge natural que s’obté d’un esquema de codificació de vocabulari o s’elabora usant un esquema de codificació de cadenes. @ca
toolkit definition: Agent qui possède une appellation en langage naturel provenant d’un schéma d’encodage de vocabulaire ou construite à l’aide d’un schéma d’encodage de chaînes. @fr
toolkit definition: Agent, som har en benævnelse på normalsprog, som er taget fra et vokabularkodningsskema eller er konstrueret ved hjælp af et strengkodningsskema. @da
toolkit definition: An agent who has an appellation in natural language that is taken from a vocabulary encoding scheme or is constructed using a string encoding scheme.
toolkit definition: Aģents, kam ir vārds/nosaukums dabiskā valodā, kas ņemts no shēmas kontrolētu vārdnīcu kodēšanai vai tiek konstruēts, izmantojot virknes kodēšanas shēmu. @lv
toolkit definition: Bir kelime kodlama şemasından alınan veya bir dize kodlama şeması kullanılarak oluşturulan doğal dilde bir ünvanı olan bir temsilci. @tr
toolkit definition: Een actor die een benaming heeft in natuurlijke taal die ontleend is aan een vocabulair coderingsschema of gevormd is volgens een string coderingsschema. @nl
toolkit definition: Egy ágens, amelynek természetes nyelvű megnevezése egy szótárkódolási sémából származik, vagy egy karakterlánc-kódolási séma használatával szerkesztett. @hu
toolkit definition: Ein Akteur, der eine Bezeichnung in natürlicher Sprache hat, die einem Vocabulary Encoding Scheme entnommen oder mit einem String Encoding Scheme konstruiert wird. @de
toolkit definition: En agent som har en betegnelse på et naturlig språk som er hentet fra et kodeskjema for vokabular eller som er konstruert ved hjelp av et kodeskjema for syntaks. @no
toolkit definition: Tegija, kellel on loomulikus keeles nimetus, mis on võetud leksikaalsest märkimissüsteemist või moodustatud stringilise märkimissüsteemi alusel. @et
toolkit definition: Toimija, jonka luonnollisen kielen mukainen nimitys on otettu jostakin sanaston merkintäjärjestelmästä tai muodostettu jotakin merkkijonon merkintäjärjestelmää käyttäen. @fi
toolkit definition: Un agente che ha una denominazione nel linguaggio naturale che è tratta da uno schema di codifica di vocabolario o è costruita usando uno schema di codifica di stringa. @it
toolkit definition: وكيل له اسم في لغة طبيعية مأخوذة من خطة ترميز مفردات أو مبنية باستخدام خطة ترميز سلسلة تمثيلات. @ar
toolkit definition: 有取自一个词表编码体系或者用一个串编码体系构建、用自然语言的一个称谓的一个行为者 @zh-hans
toolkit label: Sucheinstieg für einen Akteur von @de
toolkit label: access point for agent of
toolkit label: hakutieto toimijalle @fi
toolkit label: hozzáférési pont a következő ágenshez: @hu
toolkit label: ingang voor actor van @nl
toolkit label: ir pamatforma aģentam @lv
toolkit label: otsielement tegijale @et
toolkit label: point d’accès d’un agent de @fr
toolkit label: punt d’accés d’agent de @ca
toolkit label: punto d'accesso per agente di @it
toolkit label: søgeindgang for agent af @da
toolkit label: søkeinngang for agent for @no
toolkit label: temsilci için erişim noktası @tr
toolkit label: نقطة وصول لوكيل لـ @ar
toolkit label: 行为者的检索点 @zh-hans
has subproperty: is access point for collective agent of
has subproperty: is access point for person of
has subproperty: is authorized access point for agent of
has subproperty: is variant access point for agent of
has subproperty: P80018
lexical alias: accessPointForAgentOf.en
status: Published
type: Property
domain: C10012
label: er søgeindgang for agent af @da
label: er søkeinngang for agent for @no
label: est un point d’accès d’un agent de @fr
label: hakutieto toimijalle @fi
label: hozzáférési pont a következő ágenshez: @hu
label: ir pamatforma aģentam @lv
label: is ingang voor actor van @nl
label: ist Sucheinstieg für einen Akteur von @de
label: otsielement tegijale @et
label: temsilcisi için erişim noktasıdır @tr
label: è punto d'accesso per agente di @it
label: és punt d’accés d’agent de @ca
label: هي نقطة وصول لوكيل لـ @ar
label: 是……的行为者的检索点 @zh-hans
sub property of: is appellation of agent of
sub property of: is access point for RDA entity of
definition: Bir ismi, bir kelime kodlama şemasından alınan veya bir dize kodlama şeması kullanılarak oluşturulan doğal dilde bir yakıştırması olan bir temsilciyle ilişkilendirir. @tr
definition: Correla un nomen a un agente che ha una denominazione nel linguaggio naturale che è tratta da uno schema di codifica di vocabolario o è costruita usando uno schema di codifica di stringa. @it
definition: Hozzákapcsol egy noment egy ágenshez, amelynek természetes nyelvű megnevezése egy szótárkódolási sémából származik, vagy egy karakterlánc-kódolási séma használatával szerkesztett. @hu
definition: Liittää nomenin toimijaan, jonka luonnollisen kielen mukainen nimitys on otettu jostakin sanaston merkintäjärjestelmästä tai muodostettu jotakin merkkijonon merkintäjärjestelmää käyttäen. @fi
definition: Met un nomen en relation avec un agent qui possède une appellation en langage naturel provenant d’un schéma d’encodage de vocabulaire ou construite à l’aide d’un schéma d’encodage de chaînes. @fr
definition: Relaciona un nomen amb un agent que té una apel·lació en llenguatge natural que s’obté d’un esquema de codificació de vocabulari o s’elabora usant un esquema de codificació de cadenes. @ca
definition: Relateert een nomen aan een actor die een benaming heeft in natuurlijke taal die ontleend is aan een vocabulair coderingsschema of gevormd is volgens een string coderingsschema. @nl
definition: Relaterer et nomen til en agent som har en betegnelse på et naturlig språk som er hentet fra et kodeskjema for vokabular eller som er konstruert ved hjelp av et kodeskjema for syntaks. @no
definition: Relaterer et nomen til en agent, som har en benævnelse på normalsprog, som er taget fra et vokabularkodningsskema eller er konstrueret ved hjælp af et strengkodningsskema. @da
definition: Relates a nomen to an agent who has an appellation in natural language that is taken from a vocabulary encoding scheme or is constructed using a string encoding scheme.
definition: Sasaista nomenu ar aģentu, kam ir vārds/nosaukums dabiskā valodā, kas ņemts no shēmas kontrolētu vārdnīcu kodēšanai vai tiek konstruēts, izmantojot virknes kodēšanas shēmu. @lv
definition: Seostab nomen'i tegijaga, kellel on loomulikus keeles nimetus, mis on võetud leksikaalsest märkimissüsteemist või moodustatud stringilise märkimissüsteemi alusel. @et
definition: Setzt ein Nomen in Beziehung zu einem Akteur, der eine Bezeichnung in natürlicher Sprache hat, die einem Vocabulary Encoding Scheme entnommen oder mit einem String Encoding Scheme konstruiert wird. @de
definition: يربط تسمية بوكيل له اسم في لغة طبيعية مأخوذة من خطة ترميز مفردات، أو مبنية باستخدام خطة ترميز سلسلة تمثيلات. @ar
definition: 将一个命名与有取自一个词表编码体系或者用一个串编码体系构建、用自然语言的一个称谓的一个行为者关联起来。 @zh-hans

is access point for collective agent of
has element type: 2
toolkit definition: A collective agent who has an appellation in natural language that is taken from a vocabulary encoding scheme or is constructed using a string encoding scheme.
toolkit definition: Agent collectif qui possède une appellation en langage naturel provenant d’un schéma d’encodage de vocabulaire ou construite à l’aide d’un schéma d’encodage de chaînes. @fr
toolkit definition: Agent col·lectiu que té una apel·lació en llenguatge natural que s’obté d’un esquema de codificació de vocabulari o s’elabora usant un esquema de codificació de cadenes. @ca
toolkit definition: Bir kelime kodlama şemasından alınan veya bir dize kodlama şeması kullanılarak oluşturulan doğal dilde bir unvana sahip kolektif bir temsilci. @tr
toolkit definition: Een collectieve actor die een benaming heeft in natuurlijke taal die ontleend is aan een vocabulair coderingsschema of gevormd is volgens een string coderingsschema. @nl
toolkit definition: Egy kollektív ágens, amelynek természetes nyelvű megnevezése egy szótárkódolási sémából származik, vagy egy karakterlánc-kódolási séma használatával szerkesztett. @hu
toolkit definition: Ein gemeinschaftlicher Akteur, der eine Bezeichnung in natürlicher Sprache hat, die einem Vocabulary Encoding Scheme entnommen oder mit einem String Encoding Scheme konstruiert wird. @de
toolkit definition: En kollektiv agent som har en betegnelse på et naturlig språk som er hentet fra et kodeskjema for vokabular eller som er konstruert ved hjelp av et kodeskjema for syntaks. @no
toolkit definition: Grupa, kam ir vārds/nosaukums dabiskā valodā, kas ņemts no shēmas kontrolētu vārdnīcu kodēšanai vai tiek konstruēts, izmantojot virknes kodēšanas shēmu. @lv
toolkit definition: Kollektiiv, kellel on loomulikus keeles nimetus, mis on võetud leksikaalsest märkimissüsteemist või moodustatud stringilise märkimissüsteemi alusel. @et
toolkit definition: Kollektiv agent, som har en benævnelse på normalsprog, som er taget fra et vokabularkodningsskema eller er konstrueret ved hjælp af et strengkodningsskema. @da
toolkit definition: Un agente collettivo che ha una denominazione nel linguaggio naturale che è tratta da uno schema di codifica di vocabolario o è costruita usando uno schema di codifica di stringa. @it
toolkit definition: Yhteistoimija, jonka luonnollisen kielen mukainen nimitys on otettu jostakin sanaston merkintäjärjestelmästä tai muodostettu jotakin merkkijonon merkintäjärjestelmää käyttäen. @fi
toolkit definition: وكيل جماعي له اسم في لغة طبيعية مأخوذة من خطة ترميز مفردات أو مبنية باستخدام خطة ترميز سلسلة تمثيلات. @ar
toolkit definition: 有取自一个词表编码体系或者用一个串编码体系构建、用自然语言的一个称谓的一个集体行为者 @zh-hans
toolkit label: Kolektif temsilci için erişim noktası @tr
toolkit label: Sucheinstieg für einen gemeinschaftlichen Akteur von @de
toolkit label: access point for collective agent of
toolkit label: hakutieto yhteistoimijalle @fi
toolkit label: hozzáférési pont a következő kollektív ágenshez: @hu
toolkit label: ingang voor collectieve actor van @nl
toolkit label: ir pamatforma grupai @lv
toolkit label: otsielement kollektiivile @et
toolkit label: point d’accès d’un agent collectif de @fr
toolkit label: punt d’accés d’agent col·lectiu de @ca
toolkit label: punto d'accesso per agente collettivo di @it
toolkit label: søgeindgang for kollektiv agent af @da
toolkit label: søkeinngang for kollektiv agent for @no
toolkit label: نقطة وصول لوكيل جماعي لـ @ar
toolkit label: 集体行为者的检索点 @zh-hans
has subproperty: is access point for corporate body of
has subproperty: is access point for family of
has subproperty: is authorized access point for collective agent of
has subproperty: is variant access point for collective agent of
has subproperty: P80019
lexical alias: accessPointForCollectiveAgentOf.en
status: Published
type: Property
domain: C10012
label: er søgeindgang for kollektiv agent af @da
label: er søkeinngang for kollektiv agent for @no
label: est un point d’accès d’un agent collectif de @fr
label: hakutieto yhteistoimijalle @fi
label: hozzáférési pont a következő kollektív ágenshez: @hu
label: ir pamatforma grupai @lv
label: is ingang voor collectieve actor van @nl
label: ist Sucheinstieg für einen gemeinschaftlichen Akteur von @de
label: kolektif temsilcisi için erişim noktasıdır @tr
label: otsielement kollektiivile @et
label: è punto d'accesso per agente collettivo di @it
label: és punt d’accés d’agent col·lectiu de @ca
label: هي نقطة وصول لوكيل جماعي لـ @ar
label: 是集体行为者的检索点 @zh-hans
sub property of: is access point for agent of
sub property of: is appellation of collective agent of
definition: Bir ismi, bir kelime kodlama şemasından alınan veya bir dize kodlama şeması kullanılarak oluşturulan doğal dilde bir ünvanı olan kolektif bir temsilciyle ilişkilendirir. @tr
definition: Correla un nomen a un agente collettivo che ha una denominazione nel linguaggio naturale che è tratta da uno schema di codifica di vocabolario o è costruita usando uno schema di codifica di stringa. @it
definition: Hozzákapcsol egy noment egy kollektív ágenshez, amelynek természetes nyelvű megnevezése egy szótárkódolási sémából származik, vagy egy karakterlánc-kódolási séma használatával szerkesztett. @hu
definition: Liittää nomenin yhteistoimijaan, jonka luonnollisen kielen mukainen nimitys on otettu jostakin sanaston merkintäjärjestelmästä tai muodostettu jotakin merkkijonon merkintäjärjestelmää käyttäen. @fi
definition: Met un nomen en relation avec un agent collectif qui possède une appellation en langage naturel provenant d’un schéma d’encodage de vocabulaire ou construite à l’aide d’un schéma d’encodage de chaînes. @fr
definition: Relaciona un nomen amb un agent col·lectiu que té una apel·lació en llenguatge natural que s’obté d’un esquema de codificació de vocabulari o s’elabora usant un esquema de codificació de cadenes. @ca
definition: Relateert een nomen aan een collectieve actor die een benaming heeft in natuurlijke taal die ontleend is aan een vocabulair coderingsschema of gevormd is volgens een string coderingsschema. @nl
definition: Relaterer et nomen til en kollektiv agent som har en betegnelse på et naturlig språk som er hentet fra et kodeskjema for vokabular eller som er konstruert ved hjelp av et kodeskjema for syntaks. @no
definition: Relaterer et nomen til en kollektiv agent, som har en benævnelse på normalsprog, som er taget fra et vokabularkodningsskema eller er konstrueret ved hjælp af et strengkodningsskema. @da
definition: Relates a nomen to a collective agent who has an appellation in natural language that is taken from a vocabulary encoding scheme or is constructed using a string encoding scheme.
definition: Sasaista nomenu ar grupu, kam ir vārds/nosaukums dabiskā valodā, kas ņemts no shēmas kontrolētu vārdnīcu kodēšanai vai tiek konstruēts, izmantojot virknes kodēšanas shēmu. @lv
definition: Seostab nomen'i kollektiiviga, kellel on loomulikus keeles nimetus, mis on võetud leksikaalsest märkimissüsteemist või moodustatud stringilise märkimissüsteemi alusel. @et
definition: Setzt ein Nomen in Beziehung zu einem gemeinschaftlichen Akteur, der eine Bezeichnung in natürlicher Sprache hat, die einem Vocabulary Encoding Scheme entnommen oder mit einem String Encoding Scheme konstruiert wird. @de
definition: يربط تسمية بوكيل جماعي له اسم في لغة طبيعية مأخوذة من خطة ترميز مفردات أو مبنية باستخدام خطة ترميز سلسلة تمثيلات. @ar
definition: 将一个命名与有取自一个词表编码体系或者用一个串编码体系构建、用自然语言的一个称谓的一个集体行为者关联起来。 @zh-hans

is access point for corporate body of
has element type: 2
toolkit definition: A corporate body who has an appellation in natural language that is taken from a vocabulary encoding scheme or is constructed using a string encoding scheme.
toolkit definition: Asutus, kellel on loomulikus keeles nimetus, mis on võetud leksikaalsest märkimissüsteemist või moodustatud stringilise märkimissüsteemi alusel. @et
toolkit definition: Bir kelime kodlama şemasından alınan veya bir dize kodlama şeması kullanılarak oluşturulan doğal dilde bir ünvanı olan bir tüzel kişilik. @tr
toolkit definition: Collectivité qui possède une appellation en langage naturel provenant d’un schéma d’encodage de vocabulaire ou construite à l’aide d’un schéma d’encodage de chaînes. @fr
toolkit definition: Een corporatie die een benaming heeft in natuurlijke taal die ontleend is aan een vocabulair coderingsschema of gevormd is volgens een string coderingsschema. @nl
toolkit definition: Egy testület, amelynek természetes nyelvű megnevezése egy szótárkódolási sémából származik, vagy egy karakterlánc-kódolási séma használatával szerkesztett. @hu
toolkit definition: Eine Körperschaft, die eine Bezeichnung in natürlicher Sprache hat, die einem Vocabulary Encoding Scheme entnommen oder mit einem String Encoding Scheme konstruiert wird. @de
toolkit definition: En korporasjon som har en betegnelse på et naturlig språk som er hentet fra et kodeskjema for vokabular eller som er konstruert ved hjelp av et kodeskjema for syntaks. @no
toolkit definition: Entitat corporativa que té una apel·lació en llenguatge natural que s’obté d’un esquema de codificació de vocabulari o s’elabora usant un esquema de codificació de cadenes. @ca
toolkit definition: Institūcija, kam ir vārds/nosaukums dabiskā valodā, kas ņemts no shēmas kontrolētu vārdnīcu kodēšanai vai tiek konstruēts, izmantojot virknes kodēšanas shēmu. @lv
toolkit definition: Korporation, som har en benævnelse på normalsprog, som er taget fra et vokabularkodningsskema eller er konstrueret ved hjælp af et strengkodningsskema. @da
toolkit definition: Un ente che ha una denominazione nel linguaggio naturale che è tratta da uno schema di codifica di vocabolario o è costruita usando uno schema di codifica di stringa. @it
toolkit definition: Yhteisö, jonka luonnollisen kielen mukainen nimitys on otettu jostakin sanaston merkintäjärjestelmästä tai muodostettu jotakin merkkijonon merkintäjärjestelmää käyttäen. @fi
toolkit definition: هيئة لها اسم في لغة طبيعية مأخوذة من خطة ترميز مفردات أو مبنية باستخدام خطة ترميز سلسلة تمثيلات. @ar
toolkit definition: 有取自一个词表编码体系或者用一个串编码体系构建、用自然语言的一个称谓的一个团体 @zh-hans
toolkit label: Sucheinstieg für eine Körperschaft von @de
toolkit label: Tüzel kişi için erişim noktası @tr
toolkit label: access point for corporate body of
toolkit label: hakutieto yhteisölle @fi
toolkit label: hozzáférési pont a következő testülethez: @hu
toolkit label: ingang voor corporatie van @nl
toolkit label: ir pamatforma institūcijai @lv
toolkit label: otsielement asutusele @et
toolkit label: point d’accès d’une collectivité de @fr
toolkit label: punt d’accés d’entitat corporativa de @ca
toolkit label: punto d'accesso per ente di @it
toolkit label: søgeindgang for korporation af @da
toolkit label: søkeinngang for korporasjon for @no
toolkit label: نقطة وصول لهيئة لـ @ar
toolkit label: 团体的检索点 @zh-hans
has subproperty: is authorized access point for corporate body of
has subproperty: is variant access point for corporate body of
has subproperty: P80020
lexical alias: accessPointForCorporateBodyOf.en
status: Published
type: Property
domain: C10012
label: er søgeindgang for korporation af @da
label: er søkeinngang for korporasjon for @no
label: est un point d’accès d’une collectivité de @fr
label: hakutieto yhteisölle @fi
label: hozzáférési pont a következő testülethez: @hu
label: ir pamatforma institūcijai @lv
label: is ingang voor corporatie van @nl
label: ist Sucheinstieg für eine Körperschaft von @de
label: otsielement asutusele @et
label: tüzel kişisi için erişim noktasıdır @tr
label: è punto d'accesso per ente di @it
label: és punt d’accés d’entitat corporativa de @ca
label: هي نقطة وصول لهيئة لـ @ar
label: 有团体的检索点 @zh-hans
sub property of: is access point for collective agent of
sub property of: is appellation of corporate body of
definition: Bir ismi, bir kelime kodlama şemasından alınan veya bir dize kodlama şeması kullanılarak oluşturulan doğal dilde bir ünvanı olan bir tüzel kişiyle ilişkilendirir. @tr
definition: Correla un nomen a un ente che ha una denominazione nel linguaggio naturale che è tratta da uno schema di codifica di vocabolario o è costruita usando uno schema di codifica di stringa. @it
definition: Hozzákapcsol egy noment egy testülethez, amelynek természetes nyelvű megnevezése egy szótárkódolási sémából származik, vagy egy karakterlánc-kódolási séma használatával szerkesztett. @hu
definition: Liittää nomenin yhteisöön, jonka luonnollisen kielen mukainen nimitys on otettu jostakin sanaston merkintäjärjestelmästä tai muodostettu jotakin merkkijonon merkintäjärjestelmää käyttäen. @fi
definition: Met un nomen en relation avec une collectivité qui possède une appellation en langage naturel provenant d’un schéma d’encodage de vocabulaire ou construite à l’aide d’un schéma d’encodage de chaînes. @fr
definition: Relaciona un nomen amb una entitat corporativa que té una apel·lació en llenguatge natural que s’obté d’un esquema de codificació de vocabulari o s’elabora usant un esquema de codificació de cadenes. @ca
definition: Relateert een nomen aan een corporatie die een benaming heeft in natuurlijke taal die ontleend is aan een vocabulair coderingsschema of gevormd is volgens een string coderingsschema. @nl
definition: Relaterer et nomen til en korporasjon som har en betegnelse på et naturlig språk som er hentet fra et kodeskjema for vokabular eller som er konstruert ved hjelp av et kodeskjema for syntaks. @no
definition: Relaterer et nomen til en korporation, som har en benævnelse på normalsprog, som er taget fra et vokabularkodningsskema eller er konstrueret ved hjælp af et strengkodningsskema. @da
definition: Relates a nomen to a corporate body who has an appellation in natural language that is taken from a vocabulary encoding scheme or is constructed using a string encoding scheme.
definition: Sasaista nomenu ar institūciju, kam ir vārds/nosaukums dabiskā valodā, kas ņemts no shēmas kontrolētu vārdnīcu kodēšanai vai tiek konstruēts, izmantojot virknes kodēšanas shēmu. @lv
definition: Seostab nomen'i asutusega, kellel on loomulikus keeles nimetus, mis on võetud leksikaalsest märkimissüsteemist või moodustatud stringilise märkimissüsteemi alusel. @et
definition: Setzt ein Nomen in Beziehung zu einer Körperschaft, die eine Bezeichnung in natürlicher Sprache hat, die einem Vocabulary Encoding Scheme entnommen oder mit einem String Encoding Scheme konstruiert wird. @de
definition: يربط تسمية بهيئة لها اسم في لغة طبيعية مأخوذة من خطة ترميز مفردات أو مبنية باستخدام خطة ترميز سلسلة تمثيلات. @ar
definition: 将一个命名与有取自一个词表编码体系或者用一个串编码体系构建、用自然语言的一个称谓的一个团体关联起来。 @zh-hans

is access point for family of
has element type: 2
toolkit definition: A family who has an appellation in natural language that is taken from a vocabulary encoding scheme or is constructed using a string encoding scheme.
toolkit definition: Bir kelime kodlama şemasından alınan veya bir dize kodlama şeması kullanılarak inşa edilen doğal dilde bir unvanı olan bir aile. @tr
toolkit definition: Dzimta/ģimene, kam ir vārds/nosaukums dabiskā valodā, kas ņemts no shēmas kontrolētu vārdnīcu kodēšanai vai tiek konstruēts, izmantojot virknes kodēšanas shēmu @lv
toolkit definition: Een familie die een benaming heeft in natuurlijke taal die ontleend is aan een vocabulair coderingsschema of gevormd is volgens een string coderingsschema. @nl
toolkit definition: Egy család, amelynek természetes nyelvű megnevezése egy szótárkódolási sémából származik, vagy egy karakterlánc-kódolási séma használatával szerkesztett. @hu
toolkit definition: Eine Familie, die eine Bezeichnung in natürlicher Sprache hat, die einem Vocabulary Encoding Scheme entnommen oder mit einem String Encoding Scheme konstruiert wird. @de
toolkit definition: En familie som har en betegnelse på et naturlig språk som er hentet fra et kodeskjema for vokabular eller som er konstruert ved hjelp av et kodeskjema for syntaks. @no
toolkit definition: Familie, som har en benævnelse på normalsprog, som er taget fra et vokabularkodningsskema eller er konstrueret ved hjælp af et strengkodningsskema. @da
toolkit definition: Famille qui possède une appellation en langage naturel provenant d’un schéma d’encodage de vocabulaire ou construite à l’aide d’un schéma d’encodage de chaînes. @fr
toolkit definition: Família que té una apel·lació en llenguatge natural que s’obté d’un esquema de codificació de vocabulari o s’elabora usant un esquema de codificació de cadenes. @ca
toolkit definition: Perekond, kellel on loomulikus keeles nimetus, mis on võetud leksikaalsest märkimissüsteemist või moodustatud stringilise märkimissüsteemi alusel. @et
toolkit definition: Suku, jonka luonnollisen kielen mukainen nimitys on otettu jostakin sanaston merkintäjärjestelmästä tai muodostettu jotakin merkkijonon merkintäjärjestelmää käyttäen. @fi
toolkit definition: Una famiglia che ha una denominazione nel linguaggio naturale che è tratta da uno schema di codifica di vocabolario o è costruita usando uno schema di codifica di stringa. @it
toolkit definition: عائلة لها اسم في لغة طبيعية مأخوذة من خطة ترميز مفردات أو مبنية باستخدام خطة ترميز سلسلة تمثيلات. @ar
toolkit definition: 有取自一个词表编码体系或者用一个串编码体系构建、用自然语言的一个称谓的一个家族 @zh-hans
toolkit label: Aile için erişim noktası @tr
toolkit label: Sucheinstieg für eine Familie von @de
toolkit label: access point for family of
toolkit label: hakutieto suvulle @fi
toolkit label: hozzáférési pont a következő családhoz: @hu
toolkit label: ingang voor familie van @nl
toolkit label: ir pamatforma dzimtai/ģimenei @lv
toolkit label: otsielement perekonnale @et
toolkit label: point d’accès d’une famille de @fr
toolkit label: punt d’accés de família de @ca
toolkit label: punto d'accesso per famiglia di @it
toolkit label: søgeindgang for familie af @da
toolkit label: søkeinngang for familie for @no
toolkit label: نقطة وصول لعائلة لـ @ar
toolkit label: 家族的检索点 @zh-hans
has subproperty: is authorized access point for family of
has subproperty: is variant access point for family of
has subproperty: P80021
lexical alias: accessPointForFamilyOf.en
status: Published
type: Property
domain: C10012
label: ailesi için erişim noktasıdır @tr
label: er søgeindgang for familie af @da
label: er søkeinngang for familie for @no
label: est un point d’accès d’une famille de @fr
label: hakutieto suvulle @fi
label: hozzáférési pont a következő családhoz: @hu
label: ir pamatforma dzimtai/ģimenei @lv
label: is ingang voor familie van @nl
label: ist Sucheinstieg für eine Familie von @de
label: otsielement perekonnale @et
label: è punto d'accesso per famiglia di @it
label: és punt d’accés de família de @ca
label: نقطة وصول لعائلة لـ @ar
label: 是家族的检索点 @zh-hans
sub property of: is access point for collective agent of
sub property of: is appellation of family of
definition: Bir ismi, bir kelime kodlama şemasından alınan veya bir dize kodlama şeması kullanılarak oluşturulan doğal dilde bir adlandırması olan bir aile ile ilişkilendirir. @tr
definition: Correla un nomen a una famiglia che ha una denominazione nel linguaggio naturale che è tratta da uno schema di codifica di vocabolario o è costruita usando uno schema di codifica di stringa. @it
definition: Hozzákapcsol egy noment egy családhoz, amelynek természetes nyelvű megnevezése egy szótárkódolási sémából származik, vagy egy karakterlánc-kódolási séma használatával szerkesztett. @hu
definition: Liittää nomenin sukuun, jonka luonnollisen kielen mukainen nimitykseen on otettu jostakin sanaston merkintäjärjestelmästä tai muodostettu jotakin merkkijonon merkintäjärjestelmää käyttäen. @fi
definition: Met un nomen en relation avec une famille qui possède une appellation en langage naturel provenant d’un schéma d’encodage de vocabulaire ou construite à l’aide d’un schéma d’encodage de chaînes. @fr
definition: Relaciona un nomen amb una família que té una apel·lació en llenguatge natural que s’obté d’un esquema de codificació de vocabulari o s’elabora usant un esquema de codificació de cadenes. @ca
definition: Relateert een nomen aan een familie die een benaming heeft in natuurlijke taal die ontleend is aan een vocabulair coderingsschema of gevormd is volgens een string coderingsschema. @nl
definition: Relaterer et nomen til en familie som har en betegnelse på et naturlig språk som er hentet fra et kodeskjema for vokabular eller som er konstruert ved hjelp av et kodeskjema for syntaks. @no
definition: Relaterer et nomen til en familie, som har en benævnelse på normalsprog, som er taget fra et vokabularkodningsskema eller er konstrueret ved hjælp af et strengkodningsskema. @da
definition: Relates a nomen to a family who has an appellation in natural language that is taken from a vocabulary encoding scheme or is constructed using a string encoding scheme.
definition: Sasaista nomenu ar dzimtu/ģimeni, kam ir vārds/nosaukums dabiskā valodā, kas ņemts no shēmas kontrolētu vārdnīcu kodēšanai vai tiek konstruēts, izmantojot virknes kodēšanas shēmu. @lv
definition: Seostab nomen'i perekonnaga, kellel on loomulikus keeles nimetus, mis on võetud leksikaalsest märkimissüsteemist või moodustatud stringilise märkimissüsteemi alusel. @et
definition: Setzt ein Nomen in Beziehung zu einer Familie, die eine Bezeichnung in natürlicher Sprache hat, die einem Vocabulary Encoding Scheme entnommen oder mit einem String Encoding Scheme konstruiert wird. @de
definition: يربط تسمية بعائلة لها اسم في لغة طبيعية مأخوذة من خطة ترميز مفردات أو مبنية باستخدام خطة ترميز سلسلة تمثيلات. @ar
definition: 将一个命名与有取自一个词表编码体系或者用一个串编码体系构建、用自然语言的一个称谓的一个家族关联起来。 @zh-hans

is access point for person of
has element type: 2
toolkit definition: A person who has an appellation in natural language that is taken from a vocabulary encoding scheme or is constructed using a string encoding scheme.
toolkit definition: Bir kelime kodlama şemasından alınan veya bir dize kodlama şeması kullanılarak oluşturulan doğal dilde bir unvanı olan kişi. @tr
toolkit definition: Een persoon die een benaming heeft in natuurlijke taal die ontleend is aan een vocabulair coderingsschema of gevormd is volgens een string coderingsschema. @nl
toolkit definition: Egy személy, akinek természetes nyelvű megnevezése egy szótárkódolási sémából származik, vagy egy karakterlánc-kódolási séma használatával szerkesztett. @hu
toolkit definition: Eine Person, die eine Bezeichnung in natürlicher Sprache hat, die einem Vocabulary Encoding Scheme entnommen oder mit einem String Encoding Scheme konstruiert wird. @de
toolkit definition: En person som har en betegnelse på et naturlig språk som er hentet fra et kodeskjema for vokabular eller som er konstruert ved hjelp av et kodeskjema for syntaks. @no
toolkit definition: Henkilö, jonka luonnollisen kielen mukainen nimitys on otettu jostakin sanaston merkintäjärjestelmästä tai muodostettu jotakin merkkijonon merkintäjärjestelmää käyttäen. @fi
toolkit definition: Isik, kellel on loomulikus keeles nimetus, mis on võetud leksikaalsest märkimissüsteemist või moodustatud stringilise märkimissüsteemi alusel. @et
toolkit definition: Person, som har en benævnelse på normalsprog, som er taget fra et vokabularkodningsskema eller er konstrueret ved hjælp af et strengkodningsskema. @da
toolkit definition: Persona que té una apel·lació en llenguatge natural que s’obté d’un esquema de codificació de vocabulari o s’elabora usant un esquema de codificació de cadenes. @ca
toolkit definition: Persona, kurai ir vārds/nosaukums dabiskā valodā, kas ņemts no shēmas kontrolētu vārdnīcu kodēšanai vai tiek konstruēts, izmantojot virknes kodēšanas shēmu @lv
toolkit definition: Personne qui possède une appellation en langage naturel provenant d’un schéma d’encodage de vocabulaire ou construite à l’aide d’un schéma d’encodage de chaînes. @fr
toolkit definition: Una persona che ha una denominazione nel linguaggio naturale che è tratta da uno schema di codifica di vocabolario o è costruita usando uno schema di codifica di stringa. @it
toolkit definition: شخص له اسم في لغة طبيعية مأخوذة من خطة ترميز مفردات أو مبنية باستخدام خطة ترميز سلسلة تمثيلات. @ar
toolkit definition: 有取自一个词表编码体系或者用一个串编码体系构建、用自然语言的一个称谓的一个个人 @zh-hans
toolkit label: Kişi için erişim noktası @tr
toolkit label: Sucheinstieg für eine Person von @de
toolkit label: access point for person of
toolkit label: hakutieto henkilölle @fi
toolkit label: hozzáférési pont a következő személyhez: @hu
toolkit label: ingang voor persoon van @nl
toolkit label: ir pamatforma personai @lv
toolkit label: otsielement isikule @et
toolkit label: point d’accès d’une personne de @fr
toolkit label: punt d’accés de persona de @ca
toolkit label: punto d'accesso per presona di @it
toolkit label: søgeindgang for person af @da
toolkit label: søkeinngang for person for @no
toolkit label: نقطة وصول لشخص لـ @ar
toolkit label: 个人的检索点 @zh-hans
has subproperty: is authorized access point for person of
has subproperty: is variant access point for person of
has subproperty: P80022
lexical alias: accessPointForPersonOf.en
status: Published
type: Property
domain: C10012
label: er søgeindgang for person af @da
label: er søkeinngang for person for @no
label: est un point d’accès d’une personne de @fr
label: hakutieto henkilölle @fi
label: hozzáférési pont a következő személyhez: @hu
label: ir pamatforma personai @lv
label: is ingang voor persoon van @nl
label: ist Sucheinstieg für eine Person von @de
label: kişisi için erişim noktasıdır @tr
label: otsielement isikule @et
label: è punto d'accesso per presona di @it
label: és punt d’accés de persona de @ca
label: هي نقطة وصول لشخص لـ @ar
label: 是个人的检索点 @zh-hans
sub property of: is access point for agent of
sub property of: is appellation of person of
definition: Bir ismi, bir kelime kodlama şemasından alınan veya bir dize kodlama şeması kullanılarak oluşturulan doğal dilde bir ünvanı olan bir kişiyle ilişkilendirir. @tr
definition: Correla un nomen a una persona che ha una denominazione nel linguaggio naturale che è tratta da uno schema di codifica di vocabolario o è costruita usando uno schema di codifica di stringa. @it
definition: Hozzákapcsol egy noment egy személyhez, akinek természetes nyelvű megnevezése egy szótárkódolási sémából származik, vagy egy karakterlánc-kódolási séma használatával szerkesztett. @hu
definition: Liittää nomenin henkilöön, jonka luonnollisen kielen mukainen nimitykseen on otettu jostakin sanaston merkintäjärjestelmästä tai muodostettu jotakin merkkijonon merkintäjärjestelmää käyttäen. @fi
definition: Met un nomen en relation avec une personne qui possède une appellation en langage naturel provenant d’un schéma d’encodage de vocabulaire ou construite à l’aide d’un schéma d’encodage de chaînes. @fr
definition: Relaciona un nomen amb una persona que té una apel·lació en llenguatge natural que s’obté d’un esquema de codificació de vocabulari o s’elabora usant un esquema de codificació de cadenes. @ca
definition: Relateert een nomen aan een persoon die een benaming heeft in natuurlijke taal die ontleend is aan een vocabulair coderingsschema of gevormd is volgens een string coderingsschema. @nl
definition: Relaterer et nomen til en person som har en betegnelse på et naturlig språk som er hentet fra et kodeskjema for vokabular eller som er konstruert ved hjelp av et kodeskjema for syntaks. @no
definition: Relaterer et nomen til en person, som har en benævnelse på normalsprog, som er taget fra et vokabularkodningsskema eller er konstrueret ved hjælp af et strengkodningsskema. @da
definition: Relates a nomen to a person who has an appellation in natural language that is taken from a vocabulary encoding scheme or is constructed using a string encoding scheme.
definition: Sasaista nomenu ar personu, kurai ir vārds/nosaukums dabiskā valodā, kas ņemts no shēmas kontrolētu vārdnīcu kodēšanai vai tiek konstruēts, izmantojot virknes kodēšanas shēmu. @lv
definition: Seostab nomen'i isikuga, kellel on loomulikus keeles nimetus, mis on võetud leksikaalsest märkimissüsteemist või moodustatud stringilise märkimissüsteemi alusel. @et
definition: Setzt ein Nomen in Beziehung zu einer Person, die eine Bezeichnung in natürlicher Sprache hat, die einem Vocabulary Encoding Scheme entnommen oder mit einem String Encoding Scheme konstruiert wird. @de
definition: يربط تسمية بشخص له اسم في لغة طبيعية مأخوذة من خطة ترميز مفردات أو مبنية باستخدام خطة ترميز سلسلة تمثيلات. @ar
definition: 将一个命名与有取自一个词表编码体系或者用一个串编码体系构建、用自然语言的一个称谓的一个个人关联起来。 @zh-hans

is access point for expression of
has element type: 2
toolkit definition: An expression that has an appellation in natural language that is taken from a vocabulary encoding scheme or is constructed using a string encoding scheme.
toolkit definition: Bir sözcük kodlama şemasından alınan veya bir dize kodlama şeması kullanılarak oluşturulan, doğal dilde bir unvana sahip bir anlatım. @tr
toolkit definition: Een expressie die een benaming heeft in natuurlijke taal die ontleend is aan een vocabulair coderingsschema of gevormd is volgens een string coderingsschema. @nl
toolkit definition: Egy kifejezési forma, amelynek van egy olyan természetes nyelvű megnevezése, amely egy szótárkódolási sémából származik, vagy egy karakterlánc-kódolási séma használatával szerkesztett. @hu
toolkit definition: Eine Expression, die eine Bezeichnung in natürlicher Sprache hat, die einem Vocabulary Encoding Scheme entnommen oder mit einem String Encoding Scheme konstruiert wird. @de
toolkit definition: Ekspressio, jonka luonnollisen kielen mukainen nimitys, joka on otettu jostakin sanaston merkintäjärjestelmästä tai muodostettu jotakin merkkijonon merkintäjärjestelmää käyttäen. @fi
toolkit definition: Et uttrykk som har en betegnelse på et naturlig språk som er hentet fra et kodeskjema for vokabular eller som er konstruert ved hjelp av et kodeskjema for syntaks. @no
toolkit definition: Expression qui possède une appellation en langage naturel provenant d’un schéma d’encodage de vocabulaire ou construite à l’aide d’un schéma d’encodage de chaînes. @fr
toolkit definition: Expressió que té una apel·lació en llenguatge natural que s’obté d’un esquema de codificació de vocabulari o s’elabora usant un esquema de codificació de cadenes. @ca
toolkit definition: Izteiksme, kam ir vārds/nosaukums dabiskā valodā, kas ņemts no shēmas kontrolētu vārdnīcu kodēšanai vai tiek konstruēts, izmantojot virknes kodēšanas shēmu. @lv
toolkit definition: Udtryk, som har en benævnelse på normalsprog, som er taget fra et vokabularkodningsskema eller er konstrueret ved hjælp af et strengkodningsskema. @da
toolkit definition: Un'espressione che ha una denominazione nel linguaggio naturale che è tratta da uno schema di codifica di vocabolario o è costruita usando uno schema di codifica di stringa. @it
toolkit definition: Väljendus, millel on loomulikus keeles nimetus, mis on võetud leksikaalsest märkimissüsteemist või moodustatud stringilise märkimissüsteemi alusel. @et
toolkit definition: تعبيرة لها اسم في لغة طبيعية مأخوذة من خطة ترميز مفردات أو مبنية باستخدام خطة ترميز سلسلة تمثيلات. @ar
toolkit definition: 有取自一个词表编码体系或者用一个串编码体系构建、用自然语言的一个称谓的一个内容表达 @zh-hans
toolkit label: Sucheinstieg für eine Expression von @de
toolkit label: access point for expression of
toolkit label: anlatım için erişim noktası @tr
toolkit label: hakutieto ekspressiolle @fi
toolkit label: hozzáférési pont a következő kifejezési formához: @hu
toolkit label: ingang voor expressie van @nl
toolkit label: ir vārdforma izteiksmei @lv
toolkit label: otsielement väljendusele @et
toolkit label: point d’accès d’une expression de @fr
toolkit label: punt d’accés d’expressió de @ca
toolkit label: punto d'accesso per espressione di @it
toolkit label: søgeindgang for udtryk af @da
toolkit label: søkeinngang for uttrykk for @no
toolkit label: نقطة وصول لتعبيرة لـ @ar
toolkit label: ……的内容表达的检索点 @zh-hans
has subproperty: is authorized access point for expression of
has subproperty: is variant access point for expression of
has subproperty: P80023
lexical alias: accessPointForExpressionOf.en
status: Published
type: Property
domain: C10012
label: anlatımı için erişim noktasıdır @tr
label: er søgeindgang for udtryk af @da
label: er søkeinngang for uttrykk for @no
label: est un point d’accès d’une expression de @fr
label: hakutieto ekspressiolle @fi
label: hozzáférési pont a következő kifejezési formához: @hu
label: ir vārdforma izteiksmei @lv
label: is ingang voor expressie van @nl
label: ist Sucheinstieg für eine Expression von @de
label: otsielement väljendusele @et
label: è punto d'accesso per espressione di @it
label: és punt d’accés d’expressió de @ca
label: هي نقطة وصول لتعبيرة لـ @ar
label: 是……的内容表达的检索点 @zh-hans
sub property of: is appellation of expression of
sub property of: is access point for RDA entity of
definition: Bir ismi, bir kelime kodlama şemasından alınan veya bir dize kodlama şeması kullanılarak oluşturulan doğal dilde bir adlandırmaya sahip bir anlatımla ilişkilendirir. @tr
definition: Correla un nomen a un'espressione che ha una denominazione nel linguaggio naturale che è tratta da uno schema di codifica di vocabolario o è costruita usando uno schema di codifica di stringa. @it
definition: Hozzákapcsol egy noment egy kifejezési formához, amelynek van egy olyan természetes nyelvű megnevezése, amely egy szótárkódolási sémából származik, vagy egy karakterlánc-kódolási séma használatával szerkesztett. @hu
definition: Liittää nomenin ekspressioon, jonka luonnollisen kielen mukainen nimitys on otettu jostakin sanaston merkintäjärjestelmästä tai muodostettu jotakin merkkijonon merkintäjärjestelmää käyttäen. @fi
definition: Met un nomen en relation avec une expression qui possède une appellation en langage naturel provenant d’un schéma d’encodage de vocabulaire ou construite à l’aide d’un schéma d’encodage de chaînes. @fr
definition: Relaciona un nomen amb una expressió que té una apel·lació en llenguatge natural que s’obté d’un esquema de codificació de vocabulari o s’elabora usant un esquema de codificació de cadenes. @ca
definition: Relateert een nomen aan een expressie die een benaming heeft in natuurlijke taal die ontleend is aan een vocabulair coderingsschema of gevormd is volgens een string coderingsschema. @nl
definition: Relaterer et nomen til et udtryk, som har en benævnelse på normalsprog, som er taget fra et vokabularkodningsskema eller er konstrueret ved hjælp af et strengkodningsskema. @da
definition: Relaterer et nomen til et uttrykk som har en betegnelse på et naturlig språk som er hentet fra et kodeskjema for vokabular eller som er konstruert ved hjelp av et kodeskjema for syntaks. @no
definition: Relates a nomen to an expression that has an appellation in natural language that is taken from a vocabulary encoding scheme or is constructed using a string encoding scheme.
definition: Sasaista nomenu ar izteiksmi, kam ir vārds/nosaukums dabiskā valodā, kas ņemts no shēmas kontrolētu vārdnīcu kodēšanai vai tiek konstruēts, izmantojot virknes kodēšanas shēmu. @lv
definition: Seostab nomen'i väljendusega, millel on loomulikus keeles nimetus, mis on võetud leksikaalsest märkimissüsteemist või moodustatud stringilise märkimissüsteemi alusel. @et
definition: Setzt ein Nomen in Beziehung zu einer Expression, die eine Bezeichnung in natürlicher Sprache hat, die einem Vocabulary Encoding Scheme entnommen oder mit einem String Encoding Scheme konstruiert wird. @de
definition: يربط تسمية بتعبيرة لها اسم في لغة طبيعية مأخوذة من خطة ترميز مفردات أو مبنية باستخدام خطة ترميز سلسلة تمثيلات. @ar
definition: 将一个命名与有取自一个词表编码体系或者用一个串编码体系构建、用自然语言的一个称谓的一个内容表达关联起来。 @zh-hans

is access point for manifestation of
has element type: 2
toolkit definition: A manifestation that has an appellation in natural language that is taken from a vocabulary encoding scheme or is constructed using a string encoding scheme.
toolkit definition: Bir sözlük kodlama şemasından alınan ya da bir dizi kodlama şeması kullanılarak oluşturulan, doğal dilde bir unvana sahip bir gösterim @tr
toolkit definition: Een manifestatie die een benaming heeft in natuurlijke taal die ontleend is aan een vocabulair coderingsschema of gevormd is volgens een string coderingsschema. @nl
toolkit definition: Egy megjelenési forma, amelynek természetes nyelvű megnevezése egy szótárkódolási sémából származik, vagy egy karakterlánc-kódolási séma használatával szerkesztett. @hu
toolkit definition: Eine Manifestation, die eine Bezeichnung in natürlicher Sprache hat, die einem Vocabulary Encoding Scheme entnommen oder mit einem String Encoding Scheme konstruiert wird. @de
toolkit definition: En manifestasjon som har en betegnelse på et naturlig språk som er hentet fra et kodeskjema for vokabular eller som er konstruert ved hjelp av et kodeskjema for syntaks. @no
toolkit definition: Kehastus, millel on loomulikus keeles nimetus, mis on võetud leksikaalsest märkimissüsteemist või moodustatud stringilise märkimissüsteemi alusel. @et
toolkit definition: Manifestaatio, jonka luonnollisen kielen mukainen nimitys on otettu jostakin sanaston merkintäjärjestelmästä tai muodostettu jotakin merkkijonon merkintäjärjestelmää käyttäen. @fi
toolkit definition: Manifestació que té una apel·lació en llenguatge natural que s’obté d’un esquema de codificació de vocabulari o s’elabora usant un esquema de codificació de cadenes. @ca
toolkit definition: Manifestation qui possède une appellation en langage naturel provenant d’un schéma d’encodage de vocabulaire ou construite à l’aide d’un schéma d’encodage de chaînes. @fr
toolkit definition: Manifestation, som har en benævnelse på normalsprog, som er taget fra et vokabularkodningsskema eller er konstrueret ved hjælp af et strengkodningsskema. @da
toolkit definition: Manifestācija, kam ir apzīmējums dabiskā valodā, kas ņemts no shēmas kontrolētu vārdnīcu kodēšanai vai tiek konstruēts, izmantojot virknes kodēšanas shēmu @lv
toolkit definition: Una manifestazione che ha una denominazione nel linguaggio naturale che è tratta da uno schema di codifica di vocabolario o è costruita usando uno schema di codifica di stringa. @it
toolkit definition: تجسيدة لها اسم في لغة طبيعية مأخوذة من خطة ترميز مفردات أو مبنية باستخدام خطة ترميز سلسلة تمثيلات. @ar
toolkit definition: 有取自一个词表编码体系或者用一个串编码体系构建、用自然语言的一个称谓的一种载体表现 @zh-hans
toolkit label: Gösterim için erişim noktası @tr
toolkit label: Sucheinstieg für eine Manifestation von @de
toolkit label: access point for manifestation of
toolkit label: hakutieto manifestaatiolle @fi
toolkit label: hozzáférési pont a következő megjelenési formához: @hu
toolkit label: ingang voor manifestatie van @nl
toolkit label: ir vārdforma manifestācijai @lv
toolkit label: otsielement kehastusele @et
toolkit label: point d’accès d’une manifestation de @fr
toolkit label: punt d’accés de manifestació de @ca
toolkit label: punto d'accesso per manifestazione di @it
toolkit label: søgeindgang for manifestation af @da
toolkit label: søkeinngang for manifestasjon for @no
toolkit label: نقطة وصول لتجسيدة لـ @ar
toolkit label: ……的载体表现的检索点 @zh-hans
has subproperty: is authorized access point for manifestation of
has subproperty: is variant access point for manifestation of
has subproperty: P80024
lexical alias: accessPointForManifestationOf.en
status: Published
type: Property
domain: C10012
label: er søgeindgang for manifestation af @da
label: er søkeinngang for manifestasjon for @no
label: est un point d’accès d’une manifestation de @fr
label: gösterimi için erişim noktasıdır @tr
label: hakutieto manifestaatiolle @fi
label: hozzáférési pont a következő megjelenési formához: @hu
label: ir vārdforma manifestācijai @lv
label: is ingang voor manifestatie van @nl
label: ist Sucheinstieg für eine Manifestation von @de
label: otsielement kehastusele @et
label: è punto d'accesso per manifestazione di @it
label: és punt d’accés de manifestació de @ca
label: هي نقطة وصول لتجسيدة لـ @ar
label: 是……的载体表现的检索点 @zh-hans
sub property of: is appellation of manifestation of
sub property of: is access point for RDA entity of
definition: Bir ismi, bir kelime kodlama şemasından alınan veya bir dize kodlama şeması kullanılarak oluşturulan doğal dilde bir adlandırmaya sahip bir gösterimle ilişkilendirir. @tr
definition: Correla un nomen a una manifestazione che ha una denominazione nel linguaggio naturale che è tratta da uno schema di codifica di vocabolario o è costruita usando uno schema di codifica di stringa. @it
definition: Hozzákapcsol egy noment egy megjelenési formához, amelynek természetes nyelvű megnevezése egy szótárkódolási sémából származik, vagy egy karakterlánc-kódolási séma használatával szerkesztett. @hu
definition: Liittää nomenin manifestaatioon, jonka luonnollisen kielen mukainen nimitys on otettu jostakin sanaston merkintäjärjestelmästä tai muodostettu jotakin merkkijonon merkintäjärjestelmää käyttäen. @fi
definition: Met un nomen en relation avec une manifestation qui possède une appellation en langage naturel provenant d’un schéma d’encodage de vocabulaire ou construite à l’aide d’un schéma d’encodage de chaînes. @fr
definition: Relaciona un nomen amb una manifestació que té una apel·lació en llenguatge natural que s’obté d’un esquema de codificació de vocabulari o s’elabora usant un esquema de codificació de cadenes. @ca
definition: Relateert een nomen aan een manifestatie die een benaming heeft in natuurlijke taal die ontleend is aan een vocabulair coderingsschema of gevormd is volgens een string coderingsschema. @nl
definition: Relaterer et nomen til en manifestasjon som har en betegnelse på et naturlig språk som er hentet fra et kodeskjema for vokabular eller som er konstruert ved hjelp av et kodeskjema for syntaks. @no
definition: Relaterer et nomen til en manifestation, som har en benævnelse på normalsprog, som er taget fra et vokabularkodningsskema eller er konstrueret ved hjælp af et strengkodningsskema. @da
definition: Relates a nomen to a manifestation that has an appellation in natural language that is taken from a vocabulary encoding scheme or is constructed using a string encoding scheme.
definition: Sasaista nomenu ar manifestāciju, kam ir apzīmējums dabiskā valodā, kas ņemts no shēmas kontrolētu vārdnīcu kodēšanai vai tiek konstruēts, izmantojot virknes kodēšanas shēmu. @lv
definition: Seostab nomen'i kehastusega, millel on loomulikus keeles nimetus, mis on võetud leksikaalsest märkimissüsteemist või moodustatud stringilise märkimissüsteemi alusel. @et
definition: Setzt ein Nomen in Beziehung zu einer Manifestation, die eine Bezeichnung in natürlicher Sprache hat, die einem Vocabulary Encoding Scheme entnommen oder mit einem String Encoding Scheme konstruiert wird. @de
definition: يربط تسمية بتجسيدة لها اسم في لغة طبيعية مأخوذة من خطة ترميز مفردات أو مبنية باستخدام خطة ترميز سلسلة تمثيلات. @ar
definition: 将一个命名与有取自一个词表编码体系或者用一个串编码体系构建、用自然语言的一个称谓的一种载体表现关联起来。 @zh-hans

is access point for place of
has element type: 2
toolkit definition: A place that has an appellation in natural language that is taken from a vocabulary encoding scheme or is constructed using a string encoding scheme.
toolkit definition: Bir kelime kodlama şemasından alınan veya bir dize kodlama şeması kullanılarak yapılandırılan doğal dilde bir unvanı olan bir yer. @tr
toolkit definition: Een plaats die een benaming heeft in natuurlijke taal die ontleend is aan een vocabulair coderingsschema of gevormd is volgens een string coderingsschema. @nl
toolkit definition: Egy hely, amelynek természetes nyelvű megnevezése egy szótárkódolási sémából származik, vagy egy karakterlánc-kódolási séma használatával szerkesztett. @hu
toolkit definition: Ein Geografikum, das eine Bezeichnung in natürlicher Sprache hat, die einem Vocabulary Encoding Scheme entnommen oder mit einem String Encoding Scheme konstruiert wird. @de
toolkit definition: Et sted som har en betegnelse på et naturlig språk som er hentet fra et kodeskjema for vokabular eller som er konstruert ved hjelp av et kodeskjema for syntaks. @no
toolkit definition: Koht, millel on loomulikus keeles nimetus, mis on võetud leksikaalsest märkimissüsteemist või moodustatud stringilise märkimissüsteemi alusel. @et
toolkit definition: Lieu qui possède une appellation en langage naturel provenant d’un schéma d’encodage de vocabulaire ou construite à l’aide d’un schéma d’encodage de chaînes. @fr
toolkit definition: Lloc que té una apel·lació en llenguatge natural que s’obté d’un esquema de codificació de vocabulari o s’elabora usant un esquema de codificació de cadenes. @ca
toolkit definition: Paikka, jonka luonnollisen kielen mukainen nimitys on otettu jostakin sanaston merkintäjärjestelmästä tai muodostettu jotakin merkkijonon merkintäjärjestelmää käyttäen. @fi
toolkit definition: Sted, som har en benævnelse på normalsprog, som er taget fra et vokabularkodningsskema eller er konstrueret ved hjælp af et strengkodningsskema. @da
toolkit definition: Un luogo che ha una denominazione nel linguaggio naturale che è tratta da uno schema di codifica di vocabolario o è costruita usando uno schema di codifica di stringa. @it
toolkit definition: Vieta, kurai ir vārds/nosaukums dabiskā valodā, kas ņemts no shēmas kontrolētu vārdnīcu kodēšanai vai tiek konstruēts, izmantojot virknes kodēšanas shēmu @lv
toolkit definition: مكان له اسم في لغة طبيعية مأخوذة من خطة ترميز مفردات أو مبنية باستخدام خطة ترميز سلسلة تمثيلات. @ar
toolkit definition: 有取自一个词表编码体系或者用一个串编码体系构建、用自然语言的一个称谓的一个地点 @zh-hans
toolkit label: punto d'accesso per luogo di @it
toolkit label: Sucheinstieg für ein Geografikum von @de
toolkit label: Yer için erişim noktası @tr
toolkit label: access point for place of
toolkit label: hakutieto paikalle @fi
toolkit label: hozzáférési pont a következő helyhez: @hu
toolkit label: ingang voor plaats van @nl
toolkit label: ir pamatforma vietai @lv
toolkit label: otsielement kohale @et
toolkit label: point d’accès d’un lieu de @fr
toolkit label: punt d’accés de lloc de @ca
toolkit label: søgeindgang for sted af @da
toolkit label: søkeinngang for sted for @no
toolkit label: نقطة وصول لمكان لـ @ar
toolkit label: ……的地点的检索点 @zh-hans
has subproperty: is authorized access point for place of
has subproperty: is variant access point for place of
has subproperty: P80025
lexical alias: accessPointForPlaceOf.en
status: Published
type: Property
domain: C10012
label: è punto d'accesso per luogo di @it
label: er søgeindgang for sted af @da
label: er søkeinngang for sted for @no
label: est un point d’accès d’un lieu de @fr
label: hakutieto paikalle @fi
label: hozzáférési pont a következő helyhez: @hu
label: ir pamatforma vietai @lv
label: is ingang voor plaats van @nl
label: ist Sucheinstieg für ein Geografikum von @de
label: otsielement kohale @et
label: yeri için erişim noktasıdır @tr
label: és punt d’accés de lloc de @ca
label: هي نقطة وصول لمكان لـ @ar
label: 有……的地点的检索点 @zh-hans
sub property of: is appellation of place of
sub property of: is access point for RDA entity of
definition: Bir ismi, bir kelime kodlama şemasından alınan veya bir dize kodlama şeması kullanılarak oluşturulan doğal dilde bir adı olan bir yerle ilişkilendirir. @tr
definition: Correla un nomen a un luogo che ha una denominazione nel linguaggio naturale che è tratta da uno schema di codifica di vocabolario o è costruita usando uno schema di codifica di stringa @it
definition: Hozzákapcsol egy noment egy helyhez, amelynek természetes nyelvű megnevezése egy szótárkódolási sémából származik, vagy egy karakterlánc-kódolási séma használatával szerkesztett. @hu
definition: Liittää nomenin paikkaan, jonka luonnollisen kielen mukainen nimitys on otettu jostakin sanaston merkintäjärjestelmästä tai muodostettu jotakin merkkijonon merkintäjärjestelmää käyttäen. @fi
definition: Met un nomen en relation avec un lieu qui possède une appellation en langage naturel provenant d’un schéma d’encodage de vocabulaire ou construite à l’aide d’un schéma d’encodage de chaînes. @fr
definition: Relaciona un nomen amb un lloc que té una apel·lació en llenguatge natural que s’obté d’un esquema de codificació de vocabulari o s’elabora usant un esquema de codificació de cadenes. @ca
definition: Relateert een nomen aan een plaats die een benaming heeft in natuurlijke taal die ontleend is aan een vocabulair coderingsschema of gevormd is volgens een string coderingsschema. @nl
definition: Relaterer et nomen til et sted som har en betegnelse på et naturlig språk som er hentet fra et kodeskjema for vokabular eller som er konstruert ved hjelp av et kodeskjema for syntaks. @no
definition: Relaterer et nomen til et sted, som har en benævnelse på normalsprog, som er taget fra et vokabularkodningsskema eller er konstrueret ved hjælp af et strengkodningsskema. @da
definition: Relates a nomen to a place that has an appellation in natural language that is taken from a vocabulary encoding scheme or is constructed using a string encoding scheme.
definition: Sasaista nomenu ar vietu, kurai ir vārds/nosaukums dabiskā valodā, kas ņemts no shēmas kontrolētu vārdnīcu kodēšanai vai tiek konstruēts, izmantojot virknes kodēšanas shēmu. @lv
definition: Seostab nomen'i kohaga, millel on loomulikus keeles nimetus, mis on võetud leksikaalsest märkimissüsteemist või moodustatud stringilise märkimissüsteemi alusel. @et
definition: Setzt ein Nomen in Beziehung zu einem Geografikum, das eine Bezeichnung in natürlicher Sprache hat, die einem Vocabulary Encoding Scheme entnommen oder mit einem String Encoding Scheme konstruiert wird. @de
definition: يربط تسمية بمكان له اسم في لغة طبيعية مأخوذة من خطة ترميز مفردات أو مبنية باستخدام خطة ترميز سلسلة تمثيلات. @ar
definition: 将一个命名与有取自一个词表编码体系或者用一个串编码体系构建、用自然语言的一个称谓的一个地点关联起来。 @zh-hans

is access point for timespan of
has element type: 2
toolkit definition: A timespan that has an appellation in natural language that is taken from a vocabulary encoding scheme or is constructed using a string encoding scheme.
toolkit definition: Ajanjakso, jonka luonnollisen kielen mukainen nimitys on otettu jostakin sanaston merkintäjärjestelmästä tai muodostettu jotakin merkkijonon merkintäjärjestelmää käyttäen. @fi
toolkit definition: Ajavahemik, millel on loomulikus keeles nimetus, mis on võetud leksikaalsest märkimissüsteemist või moodustatud stringilise märkimissüsteemi alusel. @et
toolkit definition: Bir kelime kodlama şemasından alınan veya bir dize kodlama şeması kullanılarak oluşturulan doğal dilde bir unvana sahip bir zaman aralığı. @tr
toolkit definition: Een tijdspanne die een benaming heeft in natuurlijke taal die ontleend is aan een vocabulair coderingsschema of gevormd is volgens een string coderingsschema. @nl
toolkit definition: Egy időtartam, amelynek természetes nyelvű megnevezése egy szótárkódolási sémából származik, vagy egy karakterlánc-kódolási séma használatával szerkesztett. @hu
toolkit definition: Ein Zeitraum, der eine Bezeichnung in natürlicher Sprache hat, die einem Vocabulary Encoding Scheme entnommen oder mit einem String Encoding Scheme konstruiert wird. @de
toolkit definition: Et tidsrom som har en betegnelse på et naturlig språk som er hentet fra et kodeskjema for vokabular eller som er konstruert ved hjelp av et kodeskjema for syntaks. @no
toolkit definition: Interval de temps que té una apel·lació en llenguatge natural que s’obté d’un esquema de codificació de vocabulari o s’elabora usant un esquema de codificació de cadenes. @ca
toolkit definition: Laikposms, kuram ir vārds/nosaukums dabiskā valodā, kas ņemts no shēmas kontrolētu vārdnīcu kodēšanai vai tiek konstruēts, izmantojot virknes kodēšanas shēmu @lv
toolkit definition: Laps de temps qui possède une appellation en langage naturel provenant d’un schéma d’encodage de vocabulaire ou construite à l’aide d’un schéma d’encodage de chaînes. @fr
toolkit definition: Tidsperiode, som har en benævnelse på normalsprog, som er taget fra et vokabularkodningsskema eller er konstrueret ved hjælp af et strengkodningsskema. @da
toolkit definition: Un arco di tempo che ha una denominazione nel linguaggio naturale che è tratta da uno schema di codifica di vocabolario o è costruita usando uno schema di codifica di stringa. @it
toolkit definition: فترة زمنية لها اسم في لغة طبيعية مأخوذة من خطة ترميز مفردات أو مبنية باستخدام خطة ترميز سلسلة تمثيلات. @ar
toolkit definition: 有取自一个词表编码体系或者用一个串编码体系构建、用自然语言的一个称谓的一个时间段 @zh-hans
toolkit label: Sucheinstieg für einen Zeitraum von @de
toolkit label: Zaman aralığı erişim noktası @tr
toolkit label: access point for timespan of
toolkit label: hakutieto ajanjaksolle @fi
toolkit label: hozzáférési pont a következő időtartamhoz: @hu
toolkit label: ingang voor tijdspanne van @nl
toolkit label: ir pamatforma laikposmam @lv
toolkit label: otsielement ajavahemikule @et
toolkit label: piunto d'accesso per arco di tempo di @it
toolkit label: point d’accès d’un laps de temps de @fr
toolkit label: punt d’accés d’interval de temps de @ca
toolkit label: søgeindgang for tidsperiode af @da
toolkit label: søkeinngang for tidsrom for @no
toolkit label: نقطة وصول لفترة زمنية لـ @ar
toolkit label: ……的时间段的检索点 @zh-hans
has subproperty: is authorized access point for timespan of
has subproperty: is variant access point for timespan of
has subproperty: P80026
lexical alias: accessPointForTimespanOf.en
status: Published
type: Property
domain: C10012
label: er søgeindgang for tidsperiode af @da
label: er søkeinngang for tidsrom for @no
label: est un point d’accès d’un laps de temps de @fr
label: hakutieto ajanjaksolle @fi
label: hozzáférési pont a következő időtartamhoz: @hu
label: ir pamatforma laikposmam @lv
label: is ingang voor tijdspanne van @nl
label: ist Sucheinstieg für einen Zeitraum von @de
label: otsielement ajavahemikule @et
label: zaman aralığı için erişim noktasıdır. @tr
label: è punto d'accesso per arco di tempo di @it
label: és punt d’accés d’interval de temps de @ca
label: هي نقطة وصول لفترة زمنية لـ @ar
label: 是……的时间段的检索点 @zh-hans
sub property of: is appellation of timespan of
sub property of: is access point for RDA entity of
definition: Bir ismi, bir kelime kodlama şemasından alınan veya bir dize kodlama şeması kullanılarak oluşturulan doğal dilde bir adlandırmaya sahip bir zaman aralığı ile ilişkilendirir. @tr
definition: Correla un nomen a un arco di tempo che ha una denominazione nel linguaggio naturale che è tratta da uno schema di codifica di vocabolario o è costruita usando uno schema di codifica di stringa. @it
definition: Hozzákapcsol egy noment egy időtartamhoz, amelynek természetes nyelvű megnevezése egy szótárkódolási sémából származik, vagy egy karakterlánc-kódolási séma használatával szerkesztett. @hu
definition: Liittää nomenin ajanjaksoon, jonka luonnollisen kielen mukainen nimitys on otettu jostakin sanaston merkintäjärjestelmästä tai muodostettu jotakin merkkijonon merkintäjärjestelmää käyttäen. @fi
definition: Met un nomen en relation avec un laps de temps qui possède une appellation en langage naturel provenant d’un schéma d’encodage de vocabulaire ou construite à l’aide d’un schéma d’encodage de chaînes. @fr
definition: Relaciona un nomen amb un interval de temps que té una apel·lació en llenguatge natural que s’obté d’un esquema de codificació de vocabulari o s’elabora usant un esquema de codificació de cadenes. @ca
definition: Relateert een nomen aan een tijdspanne die een benaming heeft in natuurlijke taal die ontleend is aan een vocabulair coderingsschema of gevormd is volgens een string coderingsschema. @nl
definition: Relaterer et nomen til en tidsperiode, som har en benævnelse på normalsprog, som er taget fra et vokabularkodningsskema eller er konstrueret ved hjælp af et strengkodningsskema. @da
definition: Relaterer et nomen til et tidsrom som har en betegnelse på et naturlig språk som er hentet fra et kodeskjema for vokabular eller som er konstruert ved hjelp av et kodeskjema for syntaks. @no
definition: Relates a nomen to a timespan that has an appellation in natural language that is taken from a vocabulary encoding scheme or is constructed using a string encoding scheme.
definition: Sasaista nomenu ar laikposmu, kuram ir vārds/nosaukums dabiskā valodā, kas ņemts no shēmas kontrolētu vārdnīcu kodēšanai vai tiek konstruēts, izmantojot virknes kodēšanas shēmu. @lv
definition: Seostab nomen'i ajavahemikuga, millel on loomulikus keeles nimetus, mis on võetud leksikaalsest märkimissüsteemist või moodustatud stringilise märkimissüsteemi alusel. @et
definition: Setzt ein Nomen in Beziehung zu einem Zeitraum, der eine Bezeichnung in natürlicher Sprache hat, die einem Vocabulary Encoding Scheme entnommen oder mit einem String Encoding Scheme konstruiert wird. @de
definition: يربط تسمية بفترة زمنية لها اسم في لغة طبيعية مأخوذة من خطة ترميز مفردات أو مبنية باستخدام خطة ترميز سلسلة تمثيلات. @ar
definition: 将一个命名与有取自一个词表编码体系或者用一个串编码体系构建、用自然语言的一个称谓的一个时间段关联起来。 @zh-hans

is access point for work of
has element type: 2
toolkit definition: A work that has an appellation in natural language that is taken from a vocabulary encoding scheme or is constructed using a string encoding scheme.
toolkit definition: Bir kelime kodlama şemasından alınan veya bir dize kodlama şeması kullanılarak oluşturulan doğal dilde bir unvanı olan bir eser. @tr
toolkit definition: Darbs, kam ir nosaukums dabiskā valodā, kas ņemts no kontrolētas vārdnīcas shēmas vai tiek konstruēts, izmantojot virknes kodēšanas shēmu @lv
toolkit definition: Een werk dat een benaming heeft in natuurlijke taal die ontleend is aan een vocabulair coderingsschema of gevormd is volgens een string coderingsschema. @nl
toolkit definition: Egy mű, amelynek természetes nyelvű megnevezése egy szótárkódolási sémából származik, vagy egy karakterlánc-kódolási séma használatával szerkesztett. @hu
toolkit definition: Ein Werk, das eine Bezeichnung in natürlicher Sprache hat, die einem Vocabulary Encoding Scheme entnommen oder mit einem String Encoding Scheme konstruiert wird. @de
toolkit definition: Et verk som har en betegnelse på et naturlig språk som er hentet fra et kodeskjema for vokabular eller som er konstruert ved hjelp av et kodeskjema for syntaks. @no
toolkit definition: Obra que té una apel·lació en llenguatge natural que s’obté d’un esquema de codificació de vocabulari o s’elabora usant un esquema de codificació de cadenes. @ca
toolkit definition: Teos, jonka luonnollisen kielen mukainen nimitys on otettu jostakin sanaston merkintäjärjestelmästä tai muodostettu jotakin merkkijonon merkintäjärjestelmää käyttäen. @fi
toolkit definition: Teos, millel on loomulikus keeles nimetus, mis on võetud leksikaalsest märkimissüsteemist või moodustatud stringilise märkimissüsteemi alusel. @et
toolkit definition: Un'opera che ha una denominazione nel linguaggio naturale che è tratta da uno schema di codifica di vocabolario o è costruita usando uno schema di codifica di stringa. @it
toolkit definition: Værk, som har en benævnelse på normalsprog, som er taget fra et vokabularkodningsskema eller er konstrueret ved hjælp af et strengkodningsskema. @da
toolkit definition: Œuvre qui possède une appellation en langage naturel provenant d’un schéma d’encodage de vocabulaire ou construite à l’aide d’un schéma d’encodage de chaînes. @fr
toolkit definition: عمل له اسم في لغة طبيعية مأخوذة من خطة ترميز مفردات أو مبنية باستخدام خطة ترميز سلسلة تمثيلات. @ar
toolkit definition: 有取自一个词表编码体系或者用一个串编码体系构建、用自然语言的一个称谓的一种作品 @zh-hans
toolkit label: Eser için erişim noktası @tr
toolkit label: Sucheinstieg für ein Werk von @de
toolkit label: access point for work of
toolkit label: hakutieto teokselle @fi
toolkit label: hozzáférési pont a következő műhöz: @hu
toolkit label: ingang voor werk van @nl
toolkit label: ir vārdforma darbam @lv
toolkit label: otsielement teosele @et
toolkit label: point d’accès d’une œuvre de @fr
toolkit label: punt d’accés d’obra de @ca
toolkit label: punto d'accesso per opera di @it
toolkit label: søgeindgang for værk af @da
toolkit label: søkeinngang for verk for @no
toolkit label: نقطة وصول لعمل لـ @ar
toolkit label: ……的作品的检索点 @zh-hans
has subproperty: is authorized access point for work of
has subproperty: is variant access point for work of
has subproperty: P80027
lexical alias: accessPointForWorkOf.en
status: Published
type: Property
domain: C10012
label: er søgeindgang for værk af @da
label: er søkeinngang for verk for @no
label: eseri için erişim noktasıdır @tr
label: est un point d’accès d’une œuvre de @fr
label: hakutieto teokselle @fi
label: hozzáférési pont a következő műhöz: @hu
label: ir vārdforma darbam @lv
label: is ingang voor werk van @nl
label: ist Sucheinstieg für ein Werk von @de
label: otsielement teosele @et
label: è punto d'accesso per opera di @it
label: és punt d’accés d’obra de @ca
label: هي نقطة وصول لعمل لـ @ar
label: 有……的作品的检索点 @zh-hans
sub property of: is appellation of work of
sub property of: is access point for RDA entity of
definition: Bir ismi, bir kelime kodlama şemasından alınan veya bir dize kodlama şeması kullanılarak oluşturulan doğal dilde bir adı olan bir eserle ilişkilendirir. @tr
definition: Correla un nomen a un'opera che ha una denominazione nel linguaggio naturale che è tratta da uno schema di codifica di vocabolario o è costruita usando uno schema di codifica di stringa. @it
definition: Hozzákapcsol egy noment egy műhöz, amelynek természetes nyelvű megnevezése egy szótárkódolási sémából származik, vagy egy karakterlánc-kódolási séma használatával szerkesztett. @hu
definition: Liittää nomenin teokseen, jonka luonnollisen kielen mukainen nimitys on otettu jostakin sanaston merkintäjärjestelmästä tai muodostettu jotakin merkkijonon merkintäjärjestelmää käyttäen. @fi
definition: Met un nomen en relation avec une œuvre qui possède une appellation en langage naturel provenant d’un schéma d’encodage de vocabulaire ou construite à l’aide d’un schéma d’encodage de chaînes. @fr
definition: Relaciona un nomen amb una obra que té una apel·lació en llenguatge natural que s’obté d’un esquema de codificació de vocabulari o s’elabora usant un esquema de codificació de cadenes. @ca
definition: Relateert een nomen aan een werk dat een benaming heeft in natuurlijke taal die ontleend is aan een vocabulair coderingsschema of gevormd is volgens een string coderingsschema. @nl
definition: Relaterer et nomen til et verk som har en betegnelse på et naturlig språk som er hentet fra et kodeskjema for vokabular eller som er konstruert ved hjelp av et kodeskjema for syntaks. @no
definition: Relaterer et nomen til et værk, som har en benævnelse på normalsprog, som er taget fra et vokabularkodningsskema eller er konstrueret ved hjælp af et strengkodningsskema. @da
definition: Relates a nomen to a work that has an appellation in natural language that is taken from a vocabulary encoding scheme or is constructed using a string encoding scheme.
definition: Sasaista nomenu ar darbu, kam ir nosaukums dabiskā valodā, kas ņemts no kontrolētas vārdnīcas shēmas vai tiek konstruēts, izmantojot virknes kodēšanas shēmu. @lv
definition: Seostab nomen'i teosega, millel on loomulikus keeles nimetus, mis on võetud leksikaalsest märkimissüsteemist või moodustatud stringilise märkimissüsteemi alusel. @et
definition: Setzt ein Nomen in Beziehung zu einem Werk, das eine Bezeichnung in natürlicher Sprache hat, die einem Vocabulary Encoding Scheme entnommen oder mit einem String Encoding Scheme konstruiert wird. @de
definition: يربط تسمية بعمل له اسم في لغة طبيعية مأخوذة من خطة ترميز مفردات، أو مبنية باستخدام خطة ترميز سلسلة تمثيلات. @ar
definition: 将一个命名与有取自一个词表编码体系或者用一个串编码体系构建、用自然语言的一个称谓的一种作品关联起来。 @zh-hans

is appellation of agent of
has element type: 2
toolkit definition: Agent que fa referència a un nomen usat en un esquema o un context determinat. @ca
toolkit definition: Agent qui est désigné par un nomen utilisé à l’intérieur d’un schéma ou d’un contexte donnés. @fr
toolkit definition: Agent, som henvises til af et nomen, som anvendes inden for et givet skema eller kontekst. @da
toolkit definition: An agent who is referred to by a nomen used within a given scheme or context.
toolkit definition: Aģents, uz kuru attiecas nomens, ko lieto konkretājā sistēmā vai kontekstā. @lv
toolkit definition: Belirli bir şema veya bağlam içinde kullanılan bir isimle anılan bir temsilci. @tr
toolkit definition: Een actor die aangeduid wordt door een nomen gebruikt binnen een bepaald schema of context @nl
toolkit definition: Egy ágens, amelyre egy adott sémában vagy kontextusban használt nomen hivatkozik. @hu
toolkit definition: Ein Akteur, auf den mit einem Nomen referenziert wird, das in einem bestimmten Schema oder Kontext verwendet wird. @de
toolkit definition: En agent som refereres til med et nomen brukt innenfor et bestemt skjema eller kontekst. @no
toolkit definition: Tegija, kellele antud süsteemis või kontekstis nomen'iga viidatakse. @et
toolkit definition: Toimija, johon viitataan tietyssä järjestelmässä tai kontekstissa käytetyllä nomenilla. @fi
toolkit definition: Un agente a cui si fa riferimento con un nomen usato in un dato schema o contesto. @it
toolkit definition: وكيل يشار إليه بتسمية مستخدمة في خطة أو في سياق معين. @ar
toolkit definition: 在一个给定的体系或语境中用一个命名指称的一个行为者 @zh-hans
toolkit label: Bezeichnung für einen Akteur von @de
toolkit label: apel·lació d’agent de @ca
toolkit label: appellation d’agent de @fr
toolkit label: appellation of agent of
toolkit label: benaming van actor van @nl
toolkit label: benævnelse på agent af @da
toolkit label: betegnelse for agent for @no
toolkit label: denominazione di agente di @it
toolkit label: ir apzīmējums aģentam @lv
toolkit label: megnevezése a következő ágensnek: @hu
toolkit label: nimetus tegijale @et
toolkit label: nimitys toimijalle @fi
toolkit label: temsilcinin unvanı @tr
toolkit label: اسم وكيل لـ @ar
toolkit label: ……的行为者的称谓 @zh-hans
has subproperty: is access point for agent of
has subproperty: is appellation of collective agent of
has subproperty: is appellation of person of
has subproperty: is identifier for agent of
has subproperty: is name of agent of
has subproperty: P80028
lexical alias: appellationOfAgentOf.en
status: Published
type: Property
domain: C10012
label: er benævnelse på agent af @da
label: er betegnelse for agent for @no
label: est une appellation d’agent de @fr
label: ir apzīmējums aģentam @lv
label: is benaming van actor van @nl
label: ist Bezeichnung für einen Akteur von @de
label: megnevezése a következő ágensnek: @hu
label: nimetus tegijale @et
label: nimitys toimijalle @fi
label: temsilcisinin unvanıdır @tr
label: è denominazione di agente di @it
label: és apel·lació d’agent de @ca
label: هو اسم وكيل لـ @ar
label: 是……的行为者的称谓 @zh-hans
sub property of: has related agent of nomen
sub property of: is appellation of RDA entity of
definition: Bir ismi, belirli bir şema veya bağlam içinde kullanılan bir isim tarafından atıfta bulunulan temsilciyle ilişkilendirir. @tr
definition: Correla un nomen a un agente a cui si fa riferimento con un nomen usato in un dato schema o contesto. @it
definition: Hozzákapcsol egy noment egy ágenshez, amelyre egy adott sémában vagy kontextusban használt nomen hivatkozik. @hu
definition: Liittää nomenin toimijaan, johon viitataan tietyssä järjestelmässä tai kontekstissa käytetyllä nomenilla. @fi
definition: Met un nomen en relation avec un agent qui est désigné par un nomen utilisé à l’intérieur d’un schéma ou d’un contexte donnés. @fr
definition: Relaciona un nomen amb un agent que fa referència a un nomen usat en un esquema o un context determinat. @ca
definition: Relateert een nomen aan een actor die aangeduid wordt door een nomen gebruikt binnen een bepaald schema of context @nl
definition: Relaterer et nomen til en agent som refereres til med et nomen brukt innenfor et bestemt skjema eller kontekst. @no
definition: Relaterer et nomen til en agent, som henvises til af et nomen, som anvendes inden for et givet skema eller kontekst. @da
definition: Relates a nomen to an agent who is referred to by a nomen used within a given scheme or context.
definition: Sasaista nomenu ar aģentu, uz kuru attiecas nomens, ko lieto konkretājā sistēmā vai kontekstā. @lv
definition: Seostab nomen'i tegijaga, kellele antud süsteemis või kontekstis nomen'iga viidatakse. @et
definition: Setzt ein Nomen in Beziehung zu einem Akteur, auf den mit einem Nomen referenziert wird, das in einem bestimmten Schema oder Kontext verwendet wird. @de
definition: يربط تسمية بوكيل يشار إليه بتسمية مستخدمة في خطة أو في سياق معين. @ar
definition: 将一个命名与在一个给定的体系或语境中用一个命名指称的一个行为者关联起来。 @zh-hans

is appellation of collective agent of
has element type: 2
toolkit definition: A collective agent who is referred to by a nomen used within a given scheme or context.
toolkit definition: Agent collectif qui est désigné par un nomen utilisé à l’intérieur d’un schéma ou d’un contexte donnés. @fr
toolkit definition: Agent col·lectiu que fa referència a un nomen usat en un esquema o un context determinat. @ca
toolkit definition: Belirli bir şema veya bağlam içinde kullanılan bir nomenle anılan kolektif bir temsilci. @tr
toolkit definition: Een collectieve actor die aangeduid wordt door een nomen gebruikt binnen een bepaald schema of context @nl
toolkit definition: Egy kollektív ágens, amelyre egy adott sémában vagy kontextusban használt nomen hivatkozik. @hu
toolkit definition: Ein gemeinschaftlichen Akteur, auf den mit einem Nomen referenziert wird, das in einem bestimmten Schema oder Kontext verwendet wird. @de
toolkit definition: En kollektiv agent som refereres til med et nomen brukt innenfor et bestemt skjema eller kontekst. @no
toolkit definition: Grupa, uz kuru attiecas nomens, ko lieto konkrētājā sistēmā vai kontekstā. @lv
toolkit definition: Kollektiiv, kellele antud süsteemis või kontekstis nomen'iga viidatakse. @et
toolkit definition: Kollektiv agent, som henvises til af et nomen, som anvendes inden for et givet skema eller kontekst. @da
toolkit definition: Un agente collettivo a cui si fa riferimento con un nomen usato in un dato schema o contesto. @it
toolkit definition: Yhteistoimija, johon viitataan tietyssä järjestelmässä tai kontekstissa käytetyllä nomenilla. @fi
toolkit definition: وكيل جماعي يُشار إليه بتسمية مستخدمة في خطة أو في سياق معين. @ar
toolkit definition: 在一个给定的体系或语境中用一个命名指称的一个集体行为者 @zh-hans
toolkit label: Bezeichnung für einen gemeinschaftlichen Akteur von @de
toolkit label: apel·lació d’agent col·lectiu de @ca
toolkit label: appellation d’agent collectif de @fr
toolkit label: appellation of collective agent of
toolkit label: benaming van collectieve actor van @nl
toolkit label: benævnelse på kollektiv agent af @da
toolkit label: betegnelse for kollektiv agent for @no
toolkit label: denominazione di agente collettivo di @it
toolkit label: ir apzīmējums grupai @lv
toolkit label: kolektif temsilcinin unvanı @tr
toolkit label: megnevezése a következő kollektív ágensnek: @hu
toolkit label: nimetus kollektiivile @et
toolkit label: nimitys yhteistoimijalle @fi
toolkit label: اسم وكيل جماعي لـ @ar
toolkit label: ……的集体行为者的称谓 @zh-hans
has subproperty: is access point for collective agent of
has subproperty: is appellation of corporate body of
has subproperty: is appellation of family of
has subproperty: is identifier for collective agent of
has subproperty: is name of collective agent of
has subproperty: P80029
lexical alias: appellationOfCollectiveAgentOf.en
status: Published
type: Property
domain: C10012
label: er benævnelse på kollektiv agent af @da
label: er betegnelse for kollektiv agent for @no
label: est une appellation d’agent collectif de @fr
label: ir apzīmējums grupai @lv
label: is benaming van collectieve actor van @nl
label: ist Bezeichnung für einen gemeinschaftlichen Akteur von @de
label: kolektif temsilcisinin unvanıdır @tr
label: megnevezése a következő kollektív ágensnek: @hu
label: nimetus kollektiivile @et
label: nimitys yhteistoimijalle @fi
label: è denominazione di agente collettivo di @it
label: és apel·lació d’agent col·lectiu de @ca
label: هو اسم وكيل جماعي لـ @ar
label: 是……的集体行为者的称谓 @zh-hans
sub property of: has related collective agent of nomen
sub property of: is appellation of agent of
definition: Bir ismi, belirli bir şema veya bağlam içinde kullanılan bir nomen tarafından atıfta bulunulan kolektif bir aracıyla ilişkilendirir. @tr
definition: Correla un nomen a un agente collettivo a cui si fa riferimento con un nomen usato in un dato schema o contesto. @it
definition: Hozzákapcsol egy noment egy kollektív ágenshez, amelyre egy adott sémában vagy kontextusban használt nomen hivatkozik. @hu
definition: Liittää nomenin yhteistoimijaan, johon viitataan tietyssä järjestelmässä tai kontekstissa käytetyllä nomenilla. @fi
definition: Met un nomen en relation avec un agent collectif qui est désigné par un nomen utilisé à l’intérieur d’un schéma ou d’un contexte donnés. @fr
definition: Relaciona un nomen amb un agent col·lectiu que fa referència a un nomen usat en un esquema o un context determinat. @ca
definition: Relateert een nomen aan een collectieve actor die aangeduid wordt door een nomen gebruikt binnen een bepaald schema of context @nl
definition: Relaterer et nomen til en kollektiv agent som refereres til med et nomen brukt innenfor et bestemt skjema eller kontekst. @no
definition: Relaterer et nomen til en kollektiv agent, som henvises til af et nomen, som anvendes inden for et givet skema eller kontekst. @da
definition: Relates a nomen to a collective agent who is referred to by a nomen used within a given scheme or context.
definition: Sasaista nomenu ar grupu, uz kuru attiecas nomens, ko lieto konkrētājā sistēmā vai kontekstā. @lv
definition: Seostab nomen'i kollektiiviga, kellele antud süsteemis või kontekstis nomen'iga viidatakse. @et
definition: Setzt ein Nomen in Beziehung zu einem gemeinschaftlichen Akteur, auf den mit einem Nomen referenziert wird, das in einem bestimmten Schema oder Kontext verwendet wird. @de
definition: يربط تسمية بوكيل جماعي يشار إليه بتسمية مستخدمة في خطة أو في سياق معين. @ar
definition: 将一个命名与在一个给定的体系或语境中用一个命名指称的一个集体行为者关联起来。 @zh-hans

is appellation of corporate body of
has element type: 2
toolkit definition: A corporate body who is referred to by a nomen used within a given scheme or context.
toolkit definition: Asutus, kellele antud süsteemis või kontekstis nomen'iga viidatakse. @et
toolkit definition: Belirli bir şema veya bağlam içinde kullanılan bir nomenle anılan tüzel kişi. @tr
toolkit definition: Collectivité qui est désignée par un nomen utilisé à l’intérieur d’un schéma ou d’un contexte donnés. @fr
toolkit definition: Een corporatie die aangeduid wordt door een nomen gebruikt binnen een bepaald schema of context @nl
toolkit definition: Egy testület, amelyre egy adott sémában vagy kontextusban használt nomen hivatkozik. @hu
toolkit definition: Eine Körperschaft, auf die mit einem Nomen referenziert wird, das in einem bestimmten Schema oder Kontext verwendet wird. @de
toolkit definition: En korporasjon som refereres til med et nomen brukt innenfor et bestemt skjema eller kontekst. @no
toolkit definition: Entitat corporativa que fa referència a un nomen usat en un esquema o un context determinat. @ca
toolkit definition: Institūcija, uz kuru attiecas nomens, ko lieto konkrētajā sistēmā vai kontekstā. @lv
toolkit definition: Korporation, som henvises til af et nomen, som anvendes inden for et givet skema eller kontekst. @da
toolkit definition: Un ente a cui si fa riferimento con un nomen usato in un dato schema o contesto. @it
toolkit definition: Yhteisö, johon viitataan tietyssä järjestelmässä tai kontekstissa käytetyllä nomenilla. @fi
toolkit definition: هيئة يشار إليها بتسمية مستخدمة في خطة أو في سياق معين. @ar
toolkit definition: 在一个给定的体系或语境中用一个命名指称的一个团体 @zh-hans
toolkit label: Bezeichnung für eine Körperschaft von @de
toolkit label: apel·lació d’entitat corporativa de @ca
toolkit label: appellation de collectivité de @fr
toolkit label: appellation of corporate body of
toolkit label: benaming van corporatie van @nl
toolkit label: benævnelse på korporation af @da
toolkit label: betegnelse for korporasjon for @no
toolkit label: denominazione di ente di @it
toolkit label: ir apzīmējums institūcijai @lv
toolkit label: megnevezése a következő testületnek: @hu
toolkit label: nimetus asutusele @et
toolkit label: nimitys yhteisölle @fi
toolkit label: tüzel kişinin unvanı @tr
toolkit label: اسم هيئة لـ @ar
toolkit label: ……的团体的称谓 @zh-hans
has subproperty: is access point for corporate body of
has subproperty: is identifier for corporate body of
has subproperty: is name of corporate body of
has subproperty: P80030
lexical alias: appellationOfCorporateBodyOf.en
status: Published
type: Property
domain: C10012
label: er benævnelse på korporation af @da
label: er betegnelse for korporasjon for @no
label: est une appellation de collectivité de @fr
label: ir apzīmējums institūcijai @lv
label: is benaming van corporatie van @nl
label: ist Bezeichnung für eine Körperschaft von @de
label: megnevezése a következő testületnek: @hu
label: nimetus asutusele @et
label: nimitys yhteisölle @fi
label: tüzel kişisinin unvanıdır @tr
label: è denominazione di ente di @it
label: és apel·lació d’entitat corporativa de @ca
label: هو اسم هيئة لـ @ar
label: 是……的团体的称谓 @zh-hans
sub property of: has related corporate body of nomen
sub property of: is appellation of collective agent of
definition: Bir ismi, belirli bir şema veya bağlam içinde kullanılan bir isimle atıfta bulunulan bir tüzel kişilikle ilişkilendirir. @tr
definition: Correla un nomen a un ente a cui si fa riferimento con un nomen usato in un dato schema o contesto. @it
definition: Hozzákapcsol egy noment egy testülethez, amelyre egy adott sémában vagy kontextusban használt nomen hivatkozik. @hu
definition: Liittää nomenin yhteisöön, johon viitataan tietyssä järjestelmässä tai kontekstissa käytetyllä nomenilla. @fi
definition: Met un nomen en relation avec une collectivité qui est désignée par un nomen utilisé à l’intérieur d’un schéma ou d’un contexte donnés. @fr
definition: Relaciona un nomen amb una entitat corporativa que fa referència a un nomen usat en un esquema o un context determinat. @ca
definition: Relateert een nomen aan een corporatie die aangeduid wordt door een nomen gebruikt binnen een bepaald schema of context @nl
definition: Relaterer et nomen til en korporasjon som refereres til med et nomen brukt innenfor et bestemt skjema eller kontekst. @no
definition: Relaterer et nomen til en korporation, som henvises til af et nomen, som anvendes inden for et givet skema eller kontekst. @da
definition: Relates a nomen to a corporate body who is referred to by a nomen used within a given scheme or context.
definition: Sasaista nomenu ar institūciju, uz kuru attiecas nomens, ko lieto konkrētajā sistēmā vai kontekstā. @lv
definition: Seostab nomen'i asutusega, kellele antud süsteemis või kontekstis nomen'iga viidatakse. @et
definition: Setzt ein Nomen in Beziehung zu einer Körperschaft, auf die mit einem Nomen referenziert wird, das in einem bestimmten Schema oder Kontext verwendet wird. @de
definition: يربط تسمية بهيئة يشار إليها بتسمية مستخدمة في خطة أو في سياق معين. @ar
definition: 将一个命名与在一个给定的体系或语境中用一个命名指称的一个团体关联起来。 @zh-hans

is appellation of family of
has element type: 2
toolkit definition: A family who is referred to by a nomen used within a given scheme or context.
toolkit definition: Belirli bir şema veya bağlam içinde kullanılan bir nomenle anılan bir aile. @tr
toolkit definition: Dzimta/ģimene, uz kuru attiecas nomens, ko lieto konkrētajā sistēmā vai kontekstā. @lv
toolkit definition: Een familie die aangeduid wordt door een nomen gebruikt binnen een bepaald schema of context @nl
toolkit definition: Egy család, amelyre egy adott sémában vagy kontextusban használt nomen hivatkozik. @hu
toolkit definition: Eine Familie, auf die mit einem Nomen referenziert wird, das in einem bestimmten Schema oder Kontext verwendet wird. @de
toolkit definition: En familie som refereres til med et nomen brukt innenfor et bestemt skjema eller kontekst. @no
toolkit definition: Familie, som henvises til af et nomen, som anvendes inden for et givet skema eller kontekst. @da
toolkit definition: Famille qui est désignée par un nomen utilisé à l’intérieur d’un schéma ou d’un contexte donnés. @fr
toolkit definition: Família que fa referència a un nomen usat en un esquema o un context determinat. @ca
toolkit definition: Perekond, kellele antud süsteemis või kontekstis nomen'iga viidatakse. @et
toolkit definition: Suku, johon viitataan tietyssä järjestelmässä tai kontekstissa käytetyllä nomenilla. @fi
toolkit definition: Una famiglia a cui si fa riferimento con un nomen usato in un dato schema o contesto. @it
toolkit definition: عائلة يشار إليها بتسمية مستخدمة في خطة أو في سياق معين. @ar
toolkit definition: 在一个给定的体系或语境中用一个命名指称的一个家族 @zh-hans
toolkit label: Bezeichnung für eine Familie von @de
toolkit label: ailenin unvanı @tr
toolkit label: apel·lació de família de @ca
toolkit label: appellation de famille de @fr
toolkit label: appellation of family of
toolkit label: benaming van familie van @nl
toolkit label: benævnelse på familie af @da
toolkit label: betegnelse for familie for @no
toolkit label: denominazione di famiglia di @it
toolkit label: ir apzīmējums dzimtai/ģimenei @lv
toolkit label: megnevezése a következő családnak: @hu
toolkit label: nimetus perekonnale @et
toolkit label: nimitys suvulle @fi
toolkit label: اسم عائلة لـ @ar
toolkit label: ……的家族的称谓 @zh-hans
has subproperty: is access point for family of
has subproperty: is identifier for family of
has subproperty: is name of family of
has subproperty: P80031
lexical alias: appellationOfFamilyOf.en
status: Published
type: Property
domain: C10012
label: ailesinin unvanıdır @tr
label: er benævnelse på familie af @da
label: er betegnelse for familie for @no
label: est une appellation de famille de @fr
label: ir apzīmējums dzimtai/ģimenei @lv
label: is benaming van familie van @nl
label: ist Bezeichnung für eine Familie von @de
label: megnevezése a következő családnak: @hu
label: nimetus perekonnale @et
label: nimitys suvulle @fi
label: è denominazione di famiglia di @it
label: és apel·lació de família de @ca
label: هو اسم عائلة لـ @ar
label: 是……的家族的称谓 @zh-hans
sub property of: has related family of nomen
sub property of: is appellation of collective agent of
definition: Bir ismi, belirli bir şema veya bağlam içinde kullanılan bir isim tarafından atıfta bulunulan bir aileyle ilişkilendirir. @tr
definition: Correla un nomen a una famiglia a cui si fa riferimento con un nomen usato in un dato schema o contesto @it
definition: Hozzákapcsol egy noment egy családhoz, amelyre egy adott sémában vagy kontextusban használt nomen hivatkozik. @hu
definition: Liittää nomenin sukuun, johon viitataan tietyssä järjestelmässä tai kontekstissa käytetyllä nomenilla. @fi
definition: Met un nomen en relation avec une famille qui est désignée par un nomen utilisé à l’intérieur d’un schéma ou d’un contexte donnés. @fr
definition: Relaciona un nomen amb una família que fa referència a un nomen usat en un esquema o un context determinat. @ca
definition: Relateert een nomen aan een familie die aangeduid wordt door een nomen gebruikt binnen een bepaald schema of context @nl
definition: Relaterer et nomen til en familie som refereres til med et nomen brukt innenfor et bestemt skjema eller kontekst. @no
definition: Relaterer et nomen til en familie, som henvises til af et nomen, som anvendes inden for et givet skema eller kontekst. @da
definition: Relates a nomen to a family who is referred to by a nomen used within a given scheme or context.
definition: Sasaista nomenu ar dzimtu/ģimeni, uz kuru attiecas nomens, ko lieto konkrētajā sistēmā vai kontekstā. @lv
definition: Seostab nomen'i perekonnaga, kellele antud süsteemis või kontekstis nomen'iga viidatakse. @et
definition: Setzt ein Nomen in Beziehung zu einer Familie, auf die mit einem Nomen referenziert wird, das in einem bestimmten Schema oder Kontext verwendet wird. @de
definition: يربط تسمية بعائلة يشار إليها بتسمية مستخدمة في خطة أو في سياق معين. @ar
definition: 将一个命名与在一个给定的体系或语境中用一个命名指称的一个家族关联起来。 @zh-hans

is appellation of person of
has element type: 2
toolkit definition: A person who is referred to by a nomen used within a given scheme or context.
toolkit definition: Belirli bir şema veya bağlam içinde kullanılan bir isimle anılan kişi. @tr
toolkit definition: Een persoon die aangeduid wordt door een nomen gebruikt binnen een bepaald schema of context @nl
toolkit definition: Egy személy, akire egy adott sémában vagy kontextusban használt nomen hivatkozik. @hu
toolkit definition: Eine Person, auf die mit einem Nomen referenziert wird, das in einem bestimmten Schema oder Kontext verwendet wird. @de
toolkit definition: En person som refereres til med et nomen brukt innenfor et bestemt skjema eller kontekst. @no
toolkit definition: Henkilö, johon viitataan tietyssä järjestelmässä tai kontekstissa käytetyllä nomenilla. @fi
toolkit definition: Isik, kellele antud süsteemis või kontekstis nomen'iga viidatakse. @et
toolkit definition: Person, som henvises til af et nomen, som anvendes inden for et givet skema eller kontekst. @da
toolkit definition: Persona que fa referència a un nomen usat en un esquema o un context determinat. @ca
toolkit definition: Persona, uz kuru attiecas nomens, ko lieto konkrētajā sistēmā vai kontekstā. @lv
toolkit definition: Personne qui est désignée par un nomen utilisé à l’intérieur d’un schéma ou d’un contexte donnés. @fr
toolkit definition: Una persona a cui si fa riferimento con un nomen usato in un dato schema o contesto. @it
toolkit definition: شخص يشار إليه بتسمية مستخدمة في خطة أو في سياق معين. @ar
toolkit definition: 在一个给定的体系或语境中用一个命名指称的一个个人 @zh-hans
toolkit label: Bezeichnung für eine Person von @de
toolkit label: apel·lació de persona de @ca
toolkit label: appellation de personne de @fr
toolkit label: appellation of person of
toolkit label: benaming van persoon van @nl
toolkit label: benævnelse på person af @da
toolkit label: betegnelse for person for @no
toolkit label: denominazione di persona di @it
toolkit label: ir apzīmējums personai @lv
toolkit label: kişinin unvanı @tr
toolkit label: megnevezése a következő személynek: @hu
toolkit label: nimetus isikule @et
toolkit label: nimitys henkilölle @fi
toolkit label: اسم شخص لـ @ar
toolkit label: ……的个人的称谓 @zh-hans
has subproperty: is access point for person of
has subproperty: is identifier for person of
has subproperty: is name of person of
has subproperty: is alternate identity of person of
has subproperty: is real identity of person of
has subproperty: P80032
lexical alias: appellationOfPersonOf.en
status: Published
type: Property
domain: C10012
label: er benævnelse på person af @da
label: er betegnelse for person for @no
label: est une appellation de personne de @fr
label: ir apzīmējums personai @lv
label: is benaming van persoon van @nl
label: ist Bezeichnung für eine Person von @de
label: kişisinin unvanıdır @tr
label: megnevezése a következő személynek: @hu
label: nimetus isikule @et
label: nimitys henkilölle @fi
label: è denominazione di persona di @it
label: és apel·lació de persona de @ca
label: هو اسم شخص لـ @ar
label: 是……的个人的称谓 @zh-hans
sub property of: has related person of nomen
sub property of: is appellation of agent of
definition: Bir ismi, belirli bir şema veya bağlam içinde kullanılan bir isim tarafından atıfta bulunulan bir kişiyle ilişkilendirir. @tr
definition: Correla un nomen a una persona a cui si fa riferimento con un nomen usato in un dato schema o contesto @it
definition: Hozzákapcsol egy noment egy személyhez, akire egy adott sémában vagy kontextusban használt nomen hivatkozik. @hu
definition: Liittää nomenin henkilöön, johon viitataan tietyssä järjestelmässä tai kontekstissa käytetyllä nomenilla. @fi
definition: Met un nomen en relation avec une personne qui est désignée par un nomen utilisé à l’intérieur d’un schéma ou d’un contexte donnés. @fr
definition: Relaciona un nomen amb una persona que fa referència a un nomen usat en un esquema o un context determinat. @ca
definition: Relateert een nomen aan een persoon die aangeduid wordt door een nomen gebruikt binnen een bepaald schema of context @nl
definition: Relaterer et nomen til en person som refereres til med et nomen brukt innenfor et bestemt skjema eller kontekst. @no
definition: Relaterer et nomen til en person, som henvises til af et nomen, som anvendes inden for et givet skema eller kontekst. @da
definition: Relates a nomen to a person who is referred to by a nomen used within a given scheme or context.
definition: Sasaista nomenu ar personu, uz kuru attiecas nomens, ko lieto konkrētajā sistēmā vai kontekstā. @lv
definition: Seostab nomen'i isikuga, kellele antud süsteemis või kontekstis nomen'iga viidatakse. @et
definition: Setzt ein Nomen in Beziehung zu einer Person, auf die mit einem Nomen referenziert wird, das in einem bestimmten Schema oder Kontext verwendet wird. @de
definition: يربط تسمية بشخص يشار إليه بتسمية مستخدمة في خطة أو في سياق معين. @ar
definition: 将一个命名与在一个给定的体系或语境中用一个命名指称的一个个人关联起来。 @zh-hans

is identifier for agent of
has element type: 2
toolkit definition: Agent que té una apel·lació d’agent que és un codi de referència obtingut d’un esquema de codificació de vocabulari. @ca
toolkit definition: Agent qui possède une appellation d’agent consistant en un code de référence provenant d’un schéma d’encodage de vocabulaire. @fr
toolkit definition: Agent, som har en benævnelse på agent, som er en referencekode hentet fra et vokabularkodningsskema. @da
toolkit definition: An agent who has an appellation of agent that is a reference code taken from a vocabulary encoding scheme.
toolkit definition: Aģents, kam ir aģenta apzīmējums kodētā vārdnīcā. @lv
toolkit definition: Bir kelime kodlama şemasından alınan bir referans kodu olan bir temsilci ünvanına sahip bir temsilci. @tr
toolkit definition: Een actor die een benaming van actor heeft die een referentiecode is ontleend aan een vocabulair coderingssysteem. @nl
toolkit definition: Egy ágens, amelynek van olyan ágensmegnevezése, amely egy szótárkódolási sémából származó hivatkozási kód. @hu
toolkit definition: Ein Akteur, der über eine Bezeichnung für einen Akteur verfügt, die einen Referenzcode darstellt, der aus einem Vocabulary Encoding Scheme entnommen wird. @de
toolkit definition: En agent som har en betegnelse for agent som er en referansekode hentet fra et kodeskjema for vokabular. @no
toolkit definition: Tegija, kellel on tegija nimetuseks leksikaalsest märkimissüsteemist võetud viitekood. @et
toolkit definition: Toimija, jolla on sanaston merkintäjärjestelmästä otettu viitekoodi nimityksenään. @fi
toolkit definition: Un agente che ha una denominazione di agente che è un codice di riferimento tratto da uno schema di codifica di vocabolario. @it
toolkit definition: وكيل له اسم عبارة عن رمز إحالة مأخوذ من خطة ترميز مفردات. @ar
toolkit definition: 有一个取自一个词表编码体系的指称代码作为行为者称谓的一个行为者 @zh-hans
toolkit label: Identifikator für einen Akteur von @de
toolkit label: identifiant d’agent de @fr
toolkit label: identificador d’agent de @ca
toolkit label: identificatie voor actor van @nl
toolkit label: identificatore per agente di @it
toolkit label: identifier for agent of
toolkit label: identifikaator tegijale @et
toolkit label: identifikator for agent af @da
toolkit label: identifikator for agent for @no
toolkit label: ir identifikators aģentam @lv
toolkit label: temsilcisinin tanımlayıcısıdır @tr
toolkit label: tunniste toimijalle @fi
toolkit label: ágensazonosítója: @hu
toolkit label: مُعرِّف لوكيل لـ @ar
toolkit label: ……的行为者的标识符 @zh-hans
has subproperty: is identifier for collective agent of
has subproperty: is identifier for person of
has subproperty: P80033
lexical alias: identifierForAgentOf.en
status: Published
type: Property
domain: C10012
label: er identifikator for agent af @da
label: er identifikator for agent for @no
label: est un identifiant d’agent de @fr
label: identifikaator tegijale @et
label: ir identifikators aģentam @lv
label: is identificatie voor actor van @nl
label: ist Identifikator für einen Akteur von @de
label: temsilcisinin tanımlayıcısıdır @tr
label: tunniste toimijalle @fi
label: ágensazonosítója a következőnek: @hu
label: è identificatore per agente di @it
label: és identificador d’agent de @ca
label: هو مُعرِّف لوكيل لـ @ar
label: 是……的行为者的标识符 @zh-hans
sub property of: is appellation of agent of
sub property of: is identifier for RDA entity of
definition: Bir ismi, bir kelime kodlama şemasından alınan bir referans kodu olan bir temsilci ünvanına sahip bir temsilciyle ilişkilendirir. @tr
definition: Correla un nomen a un agente che ha una denominazione di agente che è un codice di riferimento tratto da uno schema di codifica di vocabolario. @it
definition: Hozzákapcsol egy noment egy ágenshez, amelynek van olyan ágensmegnevezése, amely egy szótárkódolási sémából származó hivatkozási kód. @hu
definition: Liittää nomenin toimijaan, jolla on sanaston merkintäjärjestelmästä otettu viitekoodi nimityksenään. @fi
definition: Met un nomen en relation avec un agent qui possède une appellation d’agent consistant en un code de référence provenant d’un schéma d’encodage de vocabulaire. @fr
definition: Relaciona un nomen amb un agent que té una apel·lació d’agent que és un codi de referència obtingut d’un esquema de codificació de vocabulari. @ca
definition: Relateert een nomen aan een actor die een benaming van actor heeft die een referentiecode is ontleend aan een vocabulair coderingssysteem. @nl
definition: Relaterer et nomen til en agent som har en betegnelse for agent som er en referansekode hentet fra et kodeskjema for vokabular. @no
definition: Relaterer et nomen til en agent, som har en benævnelse på agent, som er en referencekode hentet fra et vokabularkodningsskema. @da
definition: Relates a nomen to an agent who has an appellation of agent that is a reference code taken from a vocabulary encoding scheme.
definition: Sasaista nomenu ar aģentu, kam ir aģenta apzīmējums kodētā vārdnīcā. @lv
definition: Seostab nomen'i tegijaga, kellel on tegija nimetuseks leksikaalsest märkimissüsteemist võetud viitekood. @et
definition: Setzt ein Nomen in Beziehung zu einem Akteur, der über eine Bezeichnung für einen Akteur verfügt, die einen Referenzcode darstellt, der aus einem Vocabulary Encoding Scheme entnommen wird. @de
definition: يربط تسمية بوكيل له اسم وكيل عبارة عن رمز إحالة مأخوذ من خطة ترميز مفردات. @ar
definition: 将一个命名与有一个取自一个词表编码体系的指称代码作为行为者称谓的一个行为者关联起来。 @zh-hans

is identifier for collective agent of
has element type: 2
toolkit definition: A collective agent who has an appellation of collective agent that is a reference code taken from a vocabulary encoding scheme.
toolkit definition: Agent collectif qui possède une appellation d’agent collectif consistant en un code de référence provenant d’un schéma d’encodage de vocabulaire. @fr
toolkit definition: Agent col·lectiu que té una apel·lació d’agent col·lectiu que és un codi de referència obtingut d’un esquema de codificació de vocabulari. @ca
toolkit definition: Bir kelime kodlama şemasından alınan bir referans kodu olan bir kolektif temsilci ünvanına sahip kolektif bir temsilci. @tr
toolkit definition: Een collectieve actor die een benaming van collectieve actor heeft die een referentiecode is ontleend aan een vocabulair coderingssysteem. @nl
toolkit definition: Egy kollektív ágens, amelynek van olyan kollektívágens-megnevezése, amely egy szótárkódolási sémából származó hivatkozási kód. @hu
toolkit definition: Ein gemeinschaftlichen Akteur, der über eine Bezeichnung für einen gemeinschaftlicher Akteur verfügt, die einen Referenzcode darstellt, der aus einem Vocabulary Encoding Scheme entnommen wird. @de
toolkit definition: En kollektiv agent som har en betegnelse for kollektiv agent som er en referansekode hentet fra et kodeskjema for vokabular. @no
toolkit definition: Grupa, kam ir grupas apzīmējums kodētā vārdnīcā. @lv
toolkit definition: Kollektiiv, kellel on kollektiivi nimetuseks leksikaalsest märkimissüsteemist võetud viitekood. @et
toolkit definition: Kollektiv agent, som har en benævnelse på kollektiv agent, som er en referencekode hentet fra et vokabularkodningsskema. @da
toolkit definition: Un agente collettivo che ha una denominazione di agente collettivo che è un codice di riferimento tratto da uno schema di codifica di vocabolario. @it
toolkit definition: Yhteistoimija, jolla on sanaston merkintäjärjestelmästä otettu viitekoodi nimityksenään. @fi
toolkit definition: وكيل جماعي له اسم وكيل جماعي عبارة عن رمز إحالة مأخوذ من خطة ترميز مفردات. @ar
toolkit definition: 有一个取自一个词表编码体系的指称代码作为集体行为者称谓的一个集体行为者 @zh-hans
toolkit label: Identifikator für einen gemeinschaftlichen Akteur von @de
toolkit label: identifiant d’agent collectif de @fr
toolkit label: identificador d’agent col·lectiu de @ca
toolkit label: identificatie voor collectieve actor van @nl
toolkit label: identificatore per agente collettivo di @it
toolkit label: identifier for collective agent of
toolkit label: identifikaator kollektiivile @et
toolkit label: identifikator for kollektiv agent af @da
toolkit label: identifikator for kollektiv agent for @no
toolkit label: ir identifikators grupai @lv
toolkit label: kolektif temsilcisinin tanımlayıcısıdır @tr
toolkit label: kollektívágens-azonosítója: @hu
toolkit label: tunniste yhteistoimijalle @fi
toolkit label: مُعرِّف لوكيل جماعي لـ @ar
toolkit label: ……的集体行为者的标识符 @zh-hans
has subproperty: is identifier for corporate body of
has subproperty: is identifier for family of
has subproperty: P80034
lexical alias: identifierForCollectiveAgentOf.en
status: Published
type: Property
domain: C10012
label: è identificatore per agente collettivo di @it
label: er identifikator for kollektiv agent af @da
label: er identifikator for kollektiv agent for @no
label: est un identifiant d’agent collectif de @fr
label: identifikaator kollektiivile @et
label: ir identifikators grupai @lv
label: is identificatie voor collectieve actor van @nl
label: ist Identifikator für einen gemeinschaftlichen Akteur von @de
label: kolektif temsilcisinin tanımlayıcısıdır @tr
label: kollektívágens-azonosítója a következőnek: @hu
label: tunniste yhteistoimijalle @fi
label: és identificador d’agent col·lectiu de @ca
label: هو مُعرِّف لوكيل جماعي لـ @ar
label: 是……的集体行为者的标识符 @zh-hans
sub property of: is appellation of collective agent of
sub property of: is identifier for agent of
definition: Bir ismi, bir kelime kodlama şemasından alınan bir referans kodu olan bir kolektif temsilci ünvanına sahip bir kolektif temsilciyle ilişkilendirir. @tr
definition: Correla un nomen a un agente collettivo che ha una denominazione di agente collettivo che è un codice di riferimento tratto da uno schema di codifica di vocabolario. @it
definition: Hozzákapcsol egy noment egy kollektív ágenshez, amelynek van olyan kollektívágens-megnevezése, amely egy szótárkódolási sémából származó hivatkozási kód. @hu
definition: Liittää nomenin yhteistoimijaan, jolla on sanaston merkintäjärjestelmästä otettu viitekoodi nimityksenään. @fi
definition: Met un nomen en relation avec un agent collectif qui possède une appellation d’agent collectif consistant en un code de référence provenant d’un schéma d’encodage de vocabulaire. @fr
definition: Relaciona un nomen amb un agent col·lectiu que té una apel·lació d’agent col·lectiu que és un codi de referència obtingut d’un esquema de codificació de vocabulari. @ca
definition: Relateert een nomen aan een collectieve actor die een benaming van collectieve actor heeft die een referentiecode is ontleend aan een vocabulair coderingssysteem. @nl
definition: Relaterer et nomen til en kollektiv agent som har en betegnelse for kollektiv agent som er en referansekode hentet fra et kodeskjema for vokabular. @no
definition: Relaterer et nomen til en kollektiv agent, som har en benævnelse på kollektiv agent, som er en referencekode hentet fra et vokabularkodningsskema. @da
definition: Relates a nomen to a collective agent who has an appellation of collective agent that is a reference code taken from a vocabulary encoding scheme.
definition: Sasaista nomenu ar grupu, kam ir grupas apzīmējums kodētā vārdnīcā. @lv
definition: Seostab nomen'i kollektiiviga, kellel on kollektiivi nimetuseks leksikaalsest märkimissüsteemist võetud viitekood. @et
definition: Setzt ein Nomen in Beziehung zu einem gemeinschaftlichen Akteur, der über eine Bezeichnung für einen gemeinschaftlicher Akteur verfügt, die einen Referenzcode darstellt, der aus einem Vocabulary Encoding Scheme entnommen wird. @de
definition: يربط تسمية بوكيل جماعي له اسم وكيل جماعي عبارة عن رمز إحالة مأخوذ من خطة ترميز مفردات. @ar
definition: 将一个命名与有一个取自一个词表编码体系的指称代码作为集体行为者称谓的一个集体行为者关联起来。 @zh-hans

is identifier for corporate body of
has element type: 2
toolkit definition: A corporate body who has an appellation of corporate body that is a reference code taken from a vocabulary encoding scheme.
toolkit definition: Asutus, kellel on asutuse nimetuseks leksikaalsest märkimissüsteemist võetud viitekood. @et
toolkit definition: Bir kelime kodlama şemasından alınan bir referans kodu olan bir tüzel kişilik ünvanına sahip bir tüzel kişilik. @tr
toolkit definition: Collectivité qui possède une appellation de collectivité consistant en un code de référence provenant d’un schéma d’encodage de vocabulaire. @fr
toolkit definition: Een corporatie die een benaming van corporatie heeft die een referentiecode is ontleend aan een vocabulair coderingssysteem. @nl
toolkit definition: Egy testület, amelynek van olyan testület-megnevezése, amely egy szótárkódolási sémából származó hivatkozási kód. @hu
toolkit definition: Eine Körperschaft, die über eine Bezeichnung für eine Körperschaft verfügt, die einen Referenzcode darstellt, der aus einem Vocabulary Encoding Scheme entnommen wird. @de
toolkit definition: En korporasjon som har en betegnelse for korporasjon som er en referansekode hentet fra et kodeskjema for vokabular. @no
toolkit definition: Entitat corporativa que té una apel·lació d’entitat corporativa que és un codi de referència obtingut d’un esquema de codificació de vocabulari. @ca
toolkit definition: Institūcija, kam ir institūcijas apzīmējums kodētā vārdnīcā. @lv
toolkit definition: Korporation, som har en benævnelse på korporation, som er en referencekode hentet fra et vokabularkodningsskema. @da
toolkit definition: Un ente che ha una denominazione di ente che è un codice di riferimento tratto da uno schema di codifica di vocabolario. @it
toolkit definition: Yhteisö, jolla on sanaston merkintäjärjestelmästä otettu viitekoodi nimityksenään. @fi
toolkit definition: هيئة لها تسمية لهيئة عبارة عن رمز إحالة مأخوذة من خطة ترميز مفردات. @ar
toolkit definition: 有一个取自一个词表编码体系的指称代码作为团体称谓的一个团体 @zh-hans
toolkit label: Identifikator für eine Körperschaft von @de
toolkit label: identifiant de collectivité de @fr
toolkit label: identificador d’entitat corporativa de @ca
toolkit label: identificatie voor corporatie van @nl
toolkit label: identificatore per ente di @it
toolkit label: identifier for corporate body of
toolkit label: identifikaator asutusele @et
toolkit label: identifikator for korporasjon for @no
toolkit label: identifikator for korporation af @da
toolkit label: ir identifikators institūcijai @lv
toolkit label: testület-azonosítója: @hu
toolkit label: tunniste yhteisölle @fi
toolkit label: tüzel kişisinin tanımlayıcısıdır @tr
toolkit label: مُعرِّف لهيئة لـ @ar
toolkit label: ……的团体的标识符 @zh-hans
has subproperty: P80035
lexical alias: identifierForCorporateBodyOf.en
status: Published
type: Property
domain: C10012
label: er identifikator for korporasjon for @no
label: er identifikator for korporation af @da
label: est un identifiant de collectivité de @fr
label: identifikaator asutusele @et
label: ir identifikators institūcijai @lv
label: is identificatie voor corporatie van @nl
label: ist Identifikator für eine Körperschaft von @de
label: testület-azonosítója a következőnek: @hu
label: tunniste yhteisölle @fi
label: tüzel kişisinin tanımlayıcısıdır @tr
label: è identificatore per ente di @it
label: és identificador d’entitat corporativa de @ca
label: هو مُعرِّف لهيئة لـ @ar
label: 是……的团体的标识符 @zh-hans
sub property of: is appellation of corporate body of
sub property of: is identifier for collective agent of
definition: Bir ismi, bir kelime kodlama şemasından alınan bir referans kodu olan bir tüzel kişilik ünvanına sahip bir tüzel kişilikle ilişkilendirir. @tr
definition: Correla un nomen a un ente che ha una denominazione di ente che è un codice di riferimento tratto da uno schema di codifica di vocabolario. @it
definition: Hozzákapcsol egy noment egy testülethez, amelynek van olyan testület-megnevezése, amely egy szótárkódolási sémából származó hivatkozási kód. @hu
definition: Liittää nomenin yhteisöön, jolla on sanaston merkintäjärjestelmästä otettu viitekoodi nimityksenään. @fi
definition: Met un nomen en relation avec une collectivité qui possède une appellation de collectivité consistant en un code de référence provenant d’un schéma d’encodage de vocabulaire. @fr
definition: Relaciona un nomen amb una entitat corporativa que té una apel·lació d’entitat corporativa que és un codi de referència obtingut d’un esquema de codificació de vocabulari. @ca
definition: Relateert een nomen aan een corporatie die een benaming van corporatie heeft die een referentiecode is ontleend aan een vocabulair coderingssysteem. @nl
definition: Relaterer et nomen til en korporasjon som har en betegnelse for korporasjon som er en referansekode hentet fra et kodeskjema for vokabular. @no
definition: Relaterer et nomen til en korporation, som har en benævnelse på korporation, som er en referencekode hentet fra et vokabularkodningsskema. @da
definition: Relates a nomen to a corporate body who has an appellation of corporate body that is a reference code taken from a vocabulary encoding scheme.
definition: Sasaista nomenu ar institūciju, kam ir institūcijas apzīmējums kodētā vārdnīcā. @lv
definition: Seostab nomen'i asutusega, kellel on asutuse nimetuseks leksikaalsest märkimissüsteemist võetud viitekood. @et
definition: Setzt ein Nomen in Beziehung zu einer Körperschaft, die über eine Bezeichnung für eine Körperschaft verfügt, die einen Referenzcode darstellt, der aus einem Vocabulary Encoding Scheme entnommen wird. @de
definition: يربط تسمية بهيئة لها اسم هيئة عبارة عن رمز إحالة مأخوذة من خطة ترميز مفردات. @ar
definition: 将一个命名与有一个取自一个词表编码体系的指称代码作为团体称谓的一个团体关联起来。 @zh-hans

is identifier for family of
has element type: 2
toolkit definition: A family who has an appellation of family that is a reference code taken from a vocabulary encoding scheme.
toolkit definition: Bir kelime kodlama şemasından alınan bir referans kodu olan bir aile unvanına sahip olan bir aile. @tr
toolkit definition: Dzimta/ģimene, kam ir izteiksmes apzīmējums kodētā vārdnīcā. @lv
toolkit definition: Een familie die een benaming van familie heeft die een referentiecode is ontleend aan een vocabulair coderingssysteem. @nl
toolkit definition: Egy család, amelynek van olyan családmegnevezése, amely egy szótárkódolási sémából származó hivatkozási kód. @hu
toolkit definition: Eine Familie, die über eine Bezeichnung für eine Familie verfügt, die einen Referenzcode darstellt, der aus einem Vocabulary Encoding Scheme entnommen wird. @de
toolkit definition: En familie som har en betegnelse for familie som er en referansekode hentet fra et kodeskjema for vokabular. @no
toolkit definition: Familie, som har en benævnelse på familie, som er en referencekode hentet fra et vokabularkodningsskema. @da
toolkit definition: Famille qui possède une appellation de famille consistant en un code de référence provenant d’un schéma d’encodage de vocabulaire. @fr
toolkit definition: Família que té una apel·lació de família que és un codi de referència obtingut d’un esquema de codificació de vocabulari. @ca
toolkit definition: Perekond, kellel on perekonna nimetuseks leksikaalsest märkimissüsteemist võetud viitekood. @et
toolkit definition: Suku, jolla on sanaston merkintäjärjestelmästä otettu viitekoodi nimityksenään. @fi
toolkit definition: Una famiglia che ha una denominazione di famiglia che è un codice di riferimento tratto da uno schema di codifica di vocabolario. @it
toolkit definition: عائلة لها اسم عائلة عبارة عن رمز إحالة مأخوذ من خطة ترميز مفردات. @ar
toolkit definition: 有一个取自一个词表编码体系的指称代码作为家族称谓的一个家族 @zh-hans
toolkit label: Identifikator für eine Familie von @de
toolkit label: ailesinin tanımlayıcısıdır @tr
toolkit label: család-azonosítója: @hu
toolkit label: identifiant de famille de @fr
toolkit label: identificador de família de @ca
toolkit label: identificatie voor familie van @nl
toolkit label: identificatore per famiglia di @it
toolkit label: identifier for family of
toolkit label: identifikaator perekonnale @et
toolkit label: identifikator for familie af @da
toolkit label: identifikator for familie for @no
toolkit label: ir identifikators dzimtai/ģimenei @lv
toolkit label: tunniste suvulle @fi
toolkit label: مُعرِّف لعائلة لـ @ar
toolkit label: ……的家族的标识符 @zh-hans
has subproperty: P80036
lexical alias: identifierForFamilyOf.en
status: Published
type: Property
domain: C10012
label: ailesinin tanımlayıcısıdır @tr
label: család-azonosítója a következőnek: @hu
label: er identifikator for familie af @da
label: er identifikator for familie for @no
label: est un identifiant de famille de @fr
label: identifikaator perekonnale @et
label: ir identifikators dzimtai/ģimenei @lv
label: is identificatie voor familie van @nl
label: ist Identifikator für eine Familie von @de
label: tunniste suvulle @fi
label: è identificatore per famiglia di @it
label: és identificador de família de @ca
label: هو مُعرِّف لعائلة لـ @ar
label: 是……的家族的标识符 @zh-hans
sub property of: is appellation of family of
sub property of: is identifier for collective agent of
definition: Bir ismi, bir kelime kodlama şemasından alınan bir referans kodu olan bir aile ünvanına sahip bir aile ile ilişkilendirir. @tr
definition: Correla un nomen a una famiglia che ha una denominazione di famiglia che è un codice di riferimento tratto da uno schema di codifica di vocabolario. @it
definition: Hozzákapcsol egy noment egy családhoz, amelynek van olyan családmegnevezése, amely egy szótárkódolási sémából származó hivatkozási kód. @hu
definition: Liittää nomenin sukuun, jolla on sanaston merkintäjärjestelmästä otettu viitekoodi nimityksenään. @fi
definition: Met un nomen en relation avec une famille qui possède une appellation de famille consistant en un code de référence provenant d’un schéma d’encodage de vocabulaire. @fr
definition: Relaciona un nomen amb una família que té una apel·lació de família que és un codi de referència obtingut d’un esquema de codificació de vocabulari. @ca
definition: Relateert een nomen aan een familie die een benaming van familie heeft die een referentiecode is ontleend aan een vocabulair coderingssysteem. @nl
definition: Relaterer et nomen til en familie som har en betegnelse for familie som er en referansekode hentet fra et kodeskjema for vokabular. @no
definition: Relaterer et nomen til en familie, som har en benævnelse på familie, som er en referencekode hentet fra et vokabularkodningsskema. @da
definition: Relates a nomen to a family who has an appellation of family that is a reference code taken from a vocabulary encoding scheme.
definition: Sasaista nomenu ar dzimtu/ģimeni, kam ir izteiksmes apzīmējums kodētā vārdnīcā. @lv
definition: Seostab nomen'i perekonnaga, kellel on perekonna nimetuseks leksikaalsest märkimissüsteemist võetud viitekood. @et
definition: Setzt ein Nomen in Beziehung zu einer Familie, die über eine Bezeichnung für eine Familie verfügt, die einen Referenzcode darstellt, der aus einem Vocabulary Encoding Scheme entnommen wird. @de
definition: يربط تسمية بعائلة لها اسم عائلة عبارة عن رمز إحالة مأخوذ من خطة ترميز مفردات. @ar
definition: 将一个命名与有一个取自一个词表编码体系的指称代码作为家族称谓的一个家族关联起来。 @zh-hans

is identifier for person of
has element type: 2
toolkit definition: A person who has an appellation of person that is a reference code taken from a vocabulary encoding scheme.
toolkit definition: Bir kelime kodlama şemasından alınan bir referans kodu olan bir kişi ünvanına sahip olan bir kişi. @tr
toolkit definition: Een persoon die een benaming van persoon heeft die een referentiecode is ontleend aan een vocabulair coderingssysteem. @nl
toolkit definition: Egy személy, amelynek van olyan személymegnevezése, amely egy szótárkódolási sémából származó hivatkozási kód. @hu
toolkit definition: Eine Person, die über eine Bezeichnung für eine Person verfügt, die einen Referenzcode darstellt, der aus einem Vocabulary Encoding Scheme entnommen wird. @de
toolkit definition: En person som har en betegnelse for person som er en referansekode hentet fra et kodeskjema for vokabular. @no
toolkit definition: Henkilö, jolla on sanaston merkintäjärjestelmästä otettu viitekoodi nimityksenään. @fi
toolkit definition: Isik, kellel on isiku nimetuseks leksikaalsest märkimissüsteemist võetud viitekood. @et
toolkit definition: Person, som har en benævnelse på person, som er en referencekode hentet fra et vokabularkodningsskema. @da
toolkit definition: Persona que té una apel·lació de persona que és un codi de referència obtingut d’un esquema de codificació de vocabulari. @ca
toolkit definition: Persona, kurai ir izteiksmes apzīmējums kodētā vārdnīcā. @lv
toolkit definition: Personne qui possède une appellation de personne consistant en un code de référence provenant d’un schéma d’encodage de vocabulaire. @fr
toolkit definition: Una persona che ha una denominazione di persona che è un codice di riferimento tratto da uno schema di codifica di vocabolario. @it
toolkit definition: شخص له اسم شخص عبارة عن رمز إحالة مأخوذ من خطة ترميز مفردات. @ar
toolkit definition: 有一个取自一个词表编码体系的指称代码作为个人称谓的一个个人 @zh-hans
toolkit label: Identifikator für eine Person von @de
toolkit label: identifiant de personne de @fr
toolkit label: identificador de persona de @ca
toolkit label: identificatie voor persoon van @nl
toolkit label: identificatore per persona di @it
toolkit label: identifier for person of
toolkit label: identifikaator isikule @et
toolkit label: identifikator for person af @da
toolkit label: identifikator for person for @no
toolkit label: ir identifikators personai @lv
toolkit label: kişisinin tanımlayıcısıdır @tr
toolkit label: személy-azonosítója: @hu
toolkit label: tunniste henkilölle @fi
toolkit label: مُعرِّف لشخص لـ @ar
toolkit label: ……的个人的标识符 @zh-hans
has subproperty: P80037
lexical alias: identifierForPersonOf.en
status: Published
type: Property
domain: C10012
label: er identifikator for person af @da
label: er identifikator for person for @no
label: est un identifiant de personne de @fr
label: identifikaator isikule @et
label: ir identifikators personai @lv
label: is identificatie voor persoon van @nl
label: ist Identifikator für eine Person von @de
label: kişisinin tanımlayıcısıdır @tr
label: személy-azonosítója a következőnek: @hu
label: tunniste henkilölle @fi
label: è identificatore per persona di @it
label: és identificador de persona de @ca
label: هو مُعرِّف لشخص لـ @ar
label: 是……的个人的标识符 @zh-hans
sub property of: is appellation of person of
sub property of: is identifier for agent of
definition: Bir ismi, bir kelime kodlama şemasından alınan bir referans kodu olan bir kişi ünvanına sahip bir kişiyle ilişkilendirir. @tr
definition: Correla un nomen a una persona che ha una denominazione di persona che è un codice di riferimento tratto da uno schema di codifica di vocabolario. @it
definition: Hozzákapcsol egy noment egy személyhez, amelynek van olyan személymegnevezése, amely egy szótárkódolási sémából származó hivatkozási kód. @hu
definition: Liittää nomenin henkilöön, jolla on sanaston merkintäjärjestelmästä otettu viitekoodi nimityksenään. @fi
definition: Met un nomen en relation avec une personne qui possède une appellation de personne consistant en un code de référence provenant d’un schéma d’encodage de vocabulaire. @fr
definition: Relaciona un nomen amb una persona que té una apel·lació de persona que és un codi de referència obtingut d’un esquema de codificació de vocabulari. @ca
definition: Relateert een nomen aan een persoon die een benaming van persoon heeft die een referentiecode is ontleend aan een vocabulair coderingssysteem. @nl
definition: Relaterer et nomen til en person som har en betegnelse for person som er en referansekode hentet fra et kodeskjema for vokabular. @no
definition: Relaterer et nomen til en person, som har en benævnelse på person, som er en referencekode hentet fra et vokabularkodningsskema. @da
definition: Relates a nomen to a person who has an appellation of person that is a reference code taken from a vocabulary encoding scheme.
definition: Sasaista nomenu ar personu, kurai ir izteiksmes apzīmējums kodētā vārdnīcā. @lv
definition: Seostab nomen'i isikuga, kellel on isiku nimetuseks leksikaalsest märkimissüsteemist võetud viitekood. @et
definition: Setzt ein Nomen in Beziehung zu einer Person, die über eine Bezeichnung für eine Person verfügt, die einen Referenzcode darstellt, der aus einem Vocabulary Encoding Scheme entnommen wird. @de
definition: يربط تسمية بشخص له اسم شخص عبارة عن رمز إحالة مأخوذ من خطة ترميز مفردات. @ar
definition: 将一个命名与有一个取自一个词表编码体系的指称代码作为个人称谓的一个个人关联起来。 @zh-hans

is appellation of expression of
has element type: 2
toolkit definition: An expression that is referred to by a nomen used within a given scheme or context.
toolkit definition: Belirli bir şema veya bağlam içinde kullanılan bir isimle anılan bir anlatım. @tr
toolkit definition: Een expressie die aangeduid wordt door een nomen gebruikt binnen een bepaald schema of context @nl
toolkit definition: Egy kifejezési forma, amelyre egy adott sémában vagy kontextusban használt nomen hivatkozik. @hu
toolkit definition: Eine Expression, auf die mit einem Nomen referenziert wird, das in einem bestimmten Schema oder Kontext verwendet wird. @de
toolkit definition: Ekspressio, johon viitataan tietyssä järjestelmässä tai kontekstissa käytetyllä nomenilla. @fi
toolkit definition: Et uttrykk som refereres til med et nomen brukt innenfor et bestemt skjema eller kontekst. @no
toolkit definition: Expression qui est désignée par un nomen utilisé à l’intérieur d’un schéma ou d’un contexte donnés. @fr
toolkit definition: Expressió que fa referència a un nomen usat en un esquema o un context determinat. @ca
toolkit definition: Izteiksme, uz kuru attiecas nomens, ko lieto konkrētajā sistēmā vai kontekstā. @lv
toolkit definition: Udtryk, som henvises til af et nomen, som anvendes inden for et givet skema eller kontekst. @da
toolkit definition: Un'espressione a cui si fa riferimento con un nomen usato in un dato schema o contesto. @it
toolkit definition: Väljendus, millele antud süsteemis või kontekstis nomen'iga viidatakse. @et
toolkit definition: تعبيرة يشار إليها بتسمية مستخدمة في خطة أو في سياق معين. @ar
toolkit definition: 在一个给定的体系或语境中用一个命名指称的一种内容表达 @zh-hans
toolkit label: Bezeichnung für eine Expression @de
toolkit label: anlatımın unvanı @tr
toolkit label: apel·lació d’expressió de @ca
toolkit label: appellation d’expression de @fr
toolkit label: appellation of expression of
toolkit label: apzīmējums izteiksmei @lv
toolkit label: benaming van expressie van @nl
toolkit label: benævnelse på udtryk af @da
toolkit label: betegnelse for uttrykk for @no
toolkit label: denominazione di espressione di @it
toolkit label: megnevezése a következő kifejezési formának: @hu
toolkit label: nimetus väljendusele @et
toolkit label: nimitys ekspressiolle @fi
toolkit label: اسم تعبيرة لـ @ar
toolkit label: ……的内容表达的称谓 @zh-hans
has subproperty: is access point for expression of
has subproperty: is title of expression of
has subproperty: is identifier for expression of
has subproperty: P80038
lexical alias: appellationOfExpressionOf.en
status: Published
type: Property
domain: C10012
label: anlatımının unvanıdır @tr
label: er benævnelse på udtryk af @da
label: er betegnelse for uttrykk for @no
label: est une appellation d’expression de @fr
label: ir apzīmējums izteiksmei @lv
label: is benaming van expressie van @nl
label: ist Bezeichnung für eine Expression von @de
label: megnevezése a következő kifejezési formának: @hu
label: nimetus väljendusele @et
label: nimitys ekspressiolle @fi
label: è denominazione di espressione di @it
label: és apel·lació d’expressió de @ca
label: هو اسم تعبيرة لـ @ar
label: 是……的内容表达的称谓 @zh-hans
sub property of: has related expression of nomen
sub property of: is appellation of RDA entity of
definition: Bir ismi, belirli bir şema veya bağlam içinde kullanılan bir isim tarafından atıfta bulunulan bir anlatımla ilişkilendirir. @tr
definition: Correla un nomen a un'espressione a cui si fa riferimento con un nomen usato in un dato schema o contesto. @it
definition: Hozzákapcsol egy noment egy kifejezési formához, amelyre egy adott sémában vagy kontextusban használt nomen hivatkozik. @hu
definition: Liittää nomenin ekspressioon, johon viitataan tietyssä järjestelmässä tai kontekstissa käytetyllä nomenilla. @fi
definition: Met un nomen en relation avec une expression qui est désignée par un nomen utilisé à l’intérieur d’un schéma ou d’un contexte donnés. @fr
definition: Relaciona un nomen amb una expressió que fa referència a un nomen usat en un esquema o un context determinat. @ca
definition: Relateert een nomen aan een expressie die aangeduid wordt door een nomen gebruikt binnen een bepaald schema of context @nl
definition: Relaterer et nomen til et udtryk, som henvises til af et nomen, som anvendes inden for et givet skema eller kontekst. @da
definition: Relaterer et nomen til et uttrykk som refereres til med et nomen brukt innenfor et bestemt skjema eller kontekst. @no
definition: Relates a nomen to an expression that is referred to by a nomen used within a given scheme or context.
definition: Sasaista nomenu ar izteiksmi, uz kuru attiecas nomens, ko lieto konkrētajā sistēmā vai kontekstā. @lv
definition: Seostab nomen'i väljendusega, millele antud süsteemis või kontekstis nomen'iga viidatakse. @et
definition: Setzt ein Nomen in Beziehung zu einer Expression, auf die mit einem Nomen referenziert wird, das in einem bestimmten Schema oder Kontext verwendet wird. @de
definition: يربط تسمية بتعبيرة يشار إليها بتسمية مستخدمة في خطة أو في سياق معين. @ar
definition: 将一个命名与在一个给定的体系或语境中用一个命名指称的一种内容表达关联起来。 @zh-hans

is title of expression of
has element type: 2
toolkit definition: An expression that has an appellation of expression in natural language and phrasing used in common discourse.
toolkit definition: Een expressie die een benaming van expressie heeft in natuurlijke taal en terminologie in gebruikelijke bewoording. @nl
toolkit definition: Egy kifejezési forma, amelynek van egy kifejezésiforma-megnevezése természetes nyelven és közbeszédben használt kifejezéssel. @hu
toolkit definition: Eine Expression, die über eine Bezeichnung für eine Expression in natürlicher Sprache und Ausdrucksweise verfügt, die beim normalen Sprechen und Schreiben verwendet wird. @de
toolkit definition: Ekspressio, jolla on luonnollisen kielen ja yleisen diskurssin sanamuodon mukainen nimitys. @fi
toolkit definition: Et uttrykk som har en betegnelse for uttrykk på et naturlig språk og med frasering brukt i alminnelig diskurs. @no
toolkit definition: Expression qui possède une appellation d’expression exprimée dans un langage et une formulation naturels et utilisée dans le langage courant. @fr
toolkit definition: Expressió que té una apel·lació d’expressió en llenguatge i frases naturals usada en el discurs comú. @ca
toolkit definition: Izteiksme, kam ir izteiksmes apzīmējums dabiskā valodā un frāzēs, kas tiek lietots savstarpējā saziņā. @lv
toolkit definition: Udtryk, som har en benævnelse på udtryk på normalsprog og med formuleringer, som bruges alment. @da
toolkit definition: Un'espressione che ha una designazione di espressione in linguaggio e frasi naturali usati nel discorso comune. @it
toolkit definition: Väljendus, millel on nimetus loomulikus keeles ja sõnastuses, mida kasutatakse ühises diskursuses. @et
toolkit definition: Yaygın söylemde kullanılan doğal dilde ve ifadede bir anlatım unvanına sahip bir anlatım. @tr
toolkit definition: تعبيرة لها اسم تعبيرة في لغة طبيعية مستخدمة في الخطاب العام. @ar
toolkit definition: 有用自然语言和普通话语措词表达的内容表达的称谓的一种内容表达 @zh-hans
toolkit label: Titel einer Expression von @de
toolkit label: anlatımın başlığı @tr
toolkit label: ir nosaukums izteiksmei @lv
toolkit label: kifejezésiforma-címe: @hu
toolkit label: nimeke ekspressiolle @fi
toolkit label: pealkiri väljenduses @et
toolkit label: titel på udtryk af @da
toolkit label: titel van expressie van @nl
toolkit label: title of expression of
toolkit label: titolo dell'espressione di @it
toolkit label: titre d’expression de @fr
toolkit label: tittel for uttrykk for @no
toolkit label: títol d’expressió de @ca
toolkit label: عنوان تعبيرة لـ @ar
toolkit label: ……的内容表达的题名 @zh-hans
has subproperty: is preferred title of expression of
has subproperty: is variant title of expression of
has subproperty: P80039
lexical alias: titleOfExpressionOf.en
status: Published
type: Property
domain: C10012
label: er titel på udtryk af @da
label: er tittel for uttrykk for @no
label: est un titre d’expression de @fr
label: ifadesinin başlığıdır @tr
label: ir nosaukums izteiksmei @lv
label: is titel van expressie van @nl
label: ist Titel einer Expression von @de
label: kifejezésiforma-címe a következőnek: @hu
label: nimeke ekspressiolle @fi
label: pealkiri väljenduses @et
label: è titolo dell'espressione di @it
label: és títol d’expressió de @ca
label: هو عنوان تعبيرة لـ @ar
label: 是……的内容表达的题名 @zh-hans
sub property of: is appellation of expression of
sub property of: is name of RDA entity of
definition: Bir ismi, doğal dilde ve ortak söylemde kullanılan bir anlatım biçimine sahip bir anlatımla ilişkilendirir. @tr
definition: Correla un nomen a un'espressione che ha una designazione di espressione in linguaggio e frasi naturali usati nel discorso comune. @it
definition: Hozzákapcsol egy noment egy kifejezési formához, amelynek van egy kifejezésiforma-megnevezése természetes nyelven és közbeszédben használt kifejezéssel. @hu
definition: Liittää nomenin ekspressioon, jolla on luonnollisen kielen ja yleisen diskurssin sanamuodon mukainen nimitys. @fi
definition: Met un nomen en relation avec une expression qui possède une appellation d’expression exprimée dans un langage et une formulation naturels et utilisée dans le langage courant. @fr
definition: Relaciona un nomen amb una expressió que té una apel·lació d’expressió en llenguatge i frases naturals usada en el discurs comú. @ca
definition: Relateert een nomen aan een expressie die een benaming van expressie heeft in natuurlijke taal en terminologie in gebruikelijke bewoording. @nl
definition: Relaterer et nomen til et udtryk, som har en benævnelse på udtryk på normalsprog og med formuleringer, som bruges alment. @da
definition: Relaterer et nomen til et uttrykk som har en betegnelse for uttrykk på et naturlig språk og med frasering brukt i alminnelig diskurs. @no
definition: Relates a nomen to an expression that has an appellation of expression in natural language and phrasing used in common discourse.
definition: Sasaista nomenu ar izteiksmi, kam ir izteiksmes apzīmējums dabiskā valodā un frāzēs, kas tiek lietots savstarpējā saziņā. @lv
definition: Seostab nomen'i väljendusega, millel on nimetus loomulikus keeles ja sõnastuses, mida kasutatakse ühises diskursuses. @et
definition: Setzt ein Nomen in Beziehung zu einer Expression, die über eine Bezeichnung für eine Expression in natürlicher Sprache und Ausdrucksweise verfügt, die beim normalen Sprechen und Schreiben verwendet wird. @de
definition: يربط تسمية بتعبيرة لها اسم تعبيرة في لغة طبيعية مستخدمة في الخطاب العام. @ar
definition: 将一个命名与有用自然语言和普通话语措词表达的内容表达的称谓的一种内容表达关联起来。 @zh-hans

is appellation of manifestation of
has element type: 2
toolkit definition: A manifestation that is referred to by a nomen used within a given scheme or context.
toolkit definition: Belirli bir şema veya bağlam içinde kullanılan bir nomenle anılan bir gösterim. @tr
toolkit definition: Een manifestatie die aangeduid wordt door een nomen gebruikt binnen een bepaald schema of context @nl
toolkit definition: Egy megjelenési forma, amelyre egy adott sémában vagy kontextusban használt nomen hivatkozik. @hu
toolkit definition: Eine Manifestation, auf die mit einem Nomen referenziert wird, das in einem bestimmten Schema oder Kontext verwendet wird. @de
toolkit definition: En manifestasjon som refereres til med et nomen brukt innenfor et bestemt skjema eller kontekst. @no
toolkit definition: Kehastus, millele antud süsteemis või kontekstis nomen'iga viidatakse. @et
toolkit definition: Manifestaatio, johon viitataan tietyssä järjestelmässä tai kontekstissa käytetyllä nomenilla. @fi
toolkit definition: Manifestació que fa referència a un nomen usat en un esquema o un context determinat. @ca
toolkit definition: Manifestation qui est désignée par un nomen utilisé à l’intérieur d’un schéma ou d’un contexte donnés. @fr
toolkit definition: Manifestation, som henvises til af et nomen, som anvendes inden for et givet skema eller kontekst. @da
toolkit definition: Manifestācija, uz ko attiecas nomens, ko lieto konkrētāja sistēmā vai kontekstā. @lv
toolkit definition: Una manifestazione a cui si fa riferimento con un nomen usato in un dato schema o contesto. @it
toolkit definition: تجسيدة يشار إليها بتسمية مستخدمة في خطة أو في سياق معين. @ar
toolkit definition: 在一个给定的体系或语境中用一个命名指称的一种载体表现 @zh-hans
toolkit label: Bezeichnung für eine Manifestation von @de
toolkit label: apel·lació de manifestació de @ca
toolkit label: appellation de manifestation de @fr
toolkit label: appellation of manifestation of
toolkit label: benaming van manifestatie van @nl
toolkit label: benævnelse på manifestation af @da
toolkit label: betegnelse for manifestasjon for @no
toolkit label: denominazione di manifestazione di @it
toolkit label: gösterimin unvanı @tr
toolkit label: ir apzīmējums manifestācijai @lv
toolkit label: megnevezése a következő megjelenésiformának: @hu
toolkit label: nimetus kehastusele @et
toolkit label: nimitys manifestaatiolle @fi
toolkit label: اسم تجسيدة لـ @ar
toolkit label: ……的载体表现的称谓 @zh-hans
has subproperty: is access point for manifestation of
has subproperty: is identifier for manifestation of
has subproperty: is title of manifestation of
has subproperty: P80040
lexical alias: appellationOfManifestationOf.en
status: Published
type: Property
domain: C10012
label: er benævnelse på manifestation af @da
label: er betegnelse for manifestasjon for @no
label: est une appellation de manifestation de @fr
label: gösteriminin unvanıdır @tr
label: ir apzīmējums manifestācijai @lv
label: is benaming van manifestatie van @nl
label: ist Bezeichnung für eine Manifestation von @de
label: megnevezése a következő megjelenési formának: @hu
label: nimetus kehastusele @et
label: nimitys manifestaatiolle @fi
label: è denominazione di manifestazione di @it
label: és apel·lació de manifestació de @ca
label: هي تسمية لتجسيدة لـ @ar
label: 是……的载体表现的称谓 @zh-hans
sub property of: has related manifestation of nomen
sub property of: is appellation of RDA entity of
definition: Bir ismi, belirli bir şema veya bağlam içinde kullanılan bir isim tarafından atıfta bulunulan bir gösterimle ilişkilendirir. @tr
definition: Correla un nomen a una manifestazione a cui si fa riferimento con un nomen usato in un dato schema o contesto @it
definition: Hozzákapcsol egy noment egy megjelenési formához, amelyre egy adott sémában vagy kontextusban használt nomen hivatkozik. @hu
definition: Liittää nomenin manifestaatioon, johon viitataan tietyssä järjestelmässä tai kontekstissa käytetyllä nomenilla. @fi
definition: Met un nomen en relation avec une manifestation qui est désignée par un nomen utilisé à l’intérieur d’un schéma ou d’un contexte donnés. @fr
definition: Relaciona un nomen amb una manifestació que fa referència a un nomen usat en un esquema o un context determinat. @ca
definition: Relateert een nomen aan een manifestatie die aangeduid wordt door een nomen gebruikt binnen een bepaald schema of context @nl
definition: Relaterer et nomen til en manifestasjon som refereres til med et nomen brukt innenfor et bestemt skjema eller kontekst. @no
definition: Relaterer et nomen til en manifestation, som henvises til af et nomen, som anvendes inden for et givet skema eller kontekst. @da
definition: Relates a nomen to a manifestation that is referred to by a nomen used within a given scheme or context.
definition: Sasaista nomenu ar manifestāciju, uz ko attiecas nomens, ko lieto konkrētāja sistēmā vai kontekstā. @lv
definition: Seostab nomen'i kehastusega, millele antud süsteemis või kontekstis nomen'iga viidatakse. @et
definition: Setzt ein Nomen in Beziehung zu einer Manifestation, auf die mit einem Nomen referenziert wird, das in einem bestimmten Schema oder Kontext verwendet wird. @de
definition: يربط تسمية بتجسيدة يشار إليها بتسمية مستخدمة في خطة أو في سياق معين. @ar
definition: 将一个命名与在一个给定的体系或语境中用一个命名指称的一种载体表现关联起来。 @zh-hans

is appellation of place of
has element type: 2
toolkit definition: A place that is referred to by a nomen used within a given scheme or context.
toolkit definition: Belirli bir şema veya bağlam içinde kullanılan bir isimle anılan bir yer. @tr
toolkit definition: Een plaats die aangeduid wordt door een nomen gebruikt binnen een bepaald schema of context @nl
toolkit definition: Egy hely, amelyre egy adott sémában vagy kontextusban használt nomen hivatkozik. @hu
toolkit definition: Ein Geografikum, auf das mit einem Nomen referenziert wird, das in einem bestimmten Schema oder Kontext verwendet wird. @de
toolkit definition: Et sted som refereres til med et nomen brukt innenfor et bestemt skjema eller kontekst. @no
toolkit definition: Koht, millele antud süsteemis või kontekstis nomen'iga viidatakse. @et
toolkit definition: Lieu qui est désigné par un nomen utilisé à l’intérieur d’un schéma ou d’un contexte donnés. @fr
toolkit definition: Lloc que fa referència a un nomen usat en un esquema o un context determinat. @ca
toolkit definition: Paikka, johon viitataan tietyssä järjestelmässä tai kontekstissa käytetyllä nomenilla. @fi
toolkit definition: Sted, som henvises til af et nomen, som anvendes inden for et givet skema eller kontekst. @da
toolkit definition: Un luogo a cui si fa riferimento con un nomen usato in un dato schema o contesto. @it
toolkit definition: Vieta, uz kuru attiecas nomens, ko lieto konkrētajā sistēmā vai kontekstā. @lv
toolkit definition: مكان يشار إليه بتسمية مستخدمة في خطة أو في سياق معين. @ar
toolkit definition: 在一个给定的体系或语境中用一个命名指称的一个地点 @zh-hans
toolkit label: Bezeichnung für ein Geografikum von @de
toolkit label: apel·lació de lloc de @ca
toolkit label: appellation de lieu de @fr
toolkit label: appellation of place of
toolkit label: apzīmējums vietai @lv
toolkit label: benaming van plaats van @nl
toolkit label: benævnelse på sted af @da
toolkit label: betegnelse for sted for @no
toolkit label: denominazione di luogo di @it
toolkit label: megnevezése a következő helynek: @hu
toolkit label: nimetus kohale @et
toolkit label: nimitys paikalle @fi
toolkit label: yerin unvanı @tr
toolkit label: اسم مكان لـ @ar
toolkit label: ……的地点的称谓 @zh-hans
has subproperty: is access point for place of
has subproperty: is identifier for place of
has subproperty: is name of place of
has subproperty: P80041
lexical alias: appellationOfPlaceOf.en
status: Published
type: Property
domain: C10012
label: er benævnelse på sted af @da
label: er betegnelse for sted for @no
label: est une appellation de lieu de @fr
label: ir apzīmējums vietai @lv
label: is benaming van plaats van @nl
label: ist Bezeichnung für ein Geografikum von @de
label: megnevezése a következő helynek: @hu
label: nimetus kohale @et
label: nimitys paikalle @fi
label: yerinin unvanıdır @tr
label: è denominazione di luogo di @it
label: és apel·lació de lloc de @ca
label: هي تسمية لمكان لـ @ar
label: 是……的地点的称谓 @zh-hans
sub property of: has related place of nomen
sub property of: is appellation of RDA entity of
definition: Bir ismi, belirli bir şema veya bağlam içinde kullanılan bir isim tarafından atıfta bulunulan bir yerle ilişkilendirir. @tr
definition: Correla un nomen a un luogo a cui si fa riferimento con un nomen usato in un dato schema o contesto @it
definition: Hozzákapcsol egy noment egy helyhez, amelyre egy adott sémában vagy kontextusban használt nomen hivatkozik. @hu
definition: Liittää nomenin paikkaan, johon viitataan tietyssä järjestelmässä tai kontekstissa käytetyllä nomenilla. @fi
definition: Met un nomen en relation avec un lieu qui est désigné par un nomen utilisé à l’intérieur d’un schéma ou d’un contexte donnés. @fr
definition: Relaciona un nomen amb un lloc que fa referència a un nomen usat en un esquema o un context determinat. @ca
definition: Relateert een nomen aan een plaats die aangeduid wordt door een nomen gebruikt binnen een bepaald schema of context @nl
definition: Relaterer et nomen til et sted som refereres til med et nomen brukt innenfor et bestemt skjema eller kontekst. @no
definition: Relaterer et nomen til et sted, som henvises til af et nomen, som anvendes inden for et givet skema eller kontekst. @da
definition: Relates a nomen to a place that is referred to by a nomen used within a given scheme or context.
definition: Sasaista nomenu ar vietu, uz kuru attiecas nomens, ko lieto konkrētajā sistēmā vai kontekstā. @lv
definition: Seostab nomen'i kohaga, millele antud süsteemis või kontekstis nomen'iga viidatakse. @et
definition: Setzt ein Nomen in Beziehung zu einem Geografikum, auf das mit einem Nomen referenziert wird, das in einem bestimmten Schema oder Kontext verwendet wird. @de
definition: يربط تسمية بمكان يشار إليه بتسمية مستخدمة في خطة أو في سياق معين. @ar
definition: 将一个命名与在一个给定的体系或语境中用一个命名指称的一个地点关联起来。 @zh-hans

is identifier for place of
has element type: 2
toolkit definition: A place that has an appellation of place that is a reference code taken from a vocabulary encoding scheme.
toolkit definition: Bir kelime kodlama şemasından alınan bir referans kodu olan bir yer unvanına sahip bir yer. @tr
toolkit definition: Een plaats die een benaming van plaats heeft die een referentiecode is ontleend aan een vocabulair coderingssysteem. @nl
toolkit definition: Egy hely, amelynek van olyan helymegnevezése, amely egy szótárkódolási sémából származó hivatkozási kód. @hu
toolkit definition: Ein Geografikum, das über eine Bezeichnung für ein Geografikum verfügt, die einen Referenzcode darstellt, der aus einem Vocabulary Encoding Scheme entnommen wird. @de
toolkit definition: Et sted som har en betegnelse for sted som er en referansekode hentet fra et kodeskjema for vokabular. @no
toolkit definition: Koht, millel on koha nimetuseks leksikaalsest märkimissüsteemist võetud viitekood. @et
toolkit definition: Lieu qui possède une appellation de lieu consistant en un code de référence provenant d’un schéma d’encodage de vocabulaire. @fr
toolkit definition: Lloc que té una apel·lació de lloc que és un codi de referència obtingut d’un esquema de codificació de vocabulari. @ca
toolkit definition: Paikka, jolla on sanaston merkintäjärjestelmästä otettu viitekoodi nimityksenään. @fi
toolkit definition: Sted, som har en benævnelse på sted, som er en referencekode hentet fra et vokabularkodningsskema. @da
toolkit definition: Un luogo che ha una denominazione di luogo che è un codice di riferimento tratto da uno schema di codifica di vocabolario. @it
toolkit definition: Vieta, kurai ir izteiksmes apzīmējums kodētā vārdnīcā. @lv
toolkit definition: مكان له اسم مكان عبارة عن رمز إحالة مأخوذ من خطة ترميز مفردات. @ar
toolkit definition: 有一个取自一个词表编码体系的指称代码作为地点称谓的一个地点 @zh-hans
toolkit label: Identifikator für ein Geografikum von @de
toolkit label: azonosítója a következő helynek: @hu
toolkit label: identifiant de lieu de @fr
toolkit label: identificador de lloc de @ca
toolkit label: identificatie voor plaats van @nl
toolkit label: identificatore per luogo di @it
toolkit label: identifier for place of
toolkit label: identifikaator kohale @et
toolkit label: identifikator for sted af @da
toolkit label: identifikator for sted for @no
toolkit label: ir identifikators vietai @lv
toolkit label: tunniste paikalle @fi
toolkit label: yerinin tanımlayıcısıdır @tr
toolkit label: مُعرِّف لمكان لـ @ar
toolkit label: ……的地点的标识符 @zh-hans
has subproperty: P80042
lexical alias: identifierForPlaceOf.en
status: Published
type: Property
domain: C10012
label: azonosítója a következő helynek: @hu
label: er identifikator for sted af @da
label: er identifikator for sted for @no
label: est un identifiant de lieu de @fr
label: identifikaator kohale @et
label: ir identifikators vietai @lv
label: is identificatie voor plaats van @nl
label: ist Identifikator für ein Geografikum von @de
label: tunniste paikalle @fi
label: yerinin tanımlayıcısıdır @tr
label: è identificatore per luogo di @it
label: és identificador de lloc de @ca
label: هو مُعرِّف لمكان لـ @ar
label: 是……的地点的标识符 @zh-hans
sub property of: is appellation of place of
sub property of: is identifier for RDA entity of
definition: Bir ismi, bir kelime kodlama şemasından alınan bir referans kodu olan bir yer ünvanına sahip bir yerle ilişkilendirir. @tr
definition: Correla un nomen a un luogo che ha una denominazione di luogo che è un codice di riferimento tratto da uno schema di codifica di vocabolario. @it
definition: Hozzákapcsol egy noment egy helyhez, amelynek van olyan helymegnevezése, amely egy szótárkódolási sémából származó hivatkozási kód. @hu
definition: Liittää nomenin paikkaan, jolla on sanaston merkintäjärjestelmästä otettu viitekoodi nimityksenään. @fi
definition: Met un nomen en relation avec un lieu qui possède une appellation de lieu consistant en un code de référence provenant d’un schéma d’encodage de vocabulaire. @fr
definition: Relaciona un nomen amb un lloc que té una apel·lació de lloc que és un codi de referència obtingut d’un esquema de codificació de vocabulari. @ca
definition: Relateert een nomen aan een plaats die een benaming van plaats heeft die een referentiecode is ontleend aan een vocabulair coderingssysteem. @nl
definition: Relaterer et nomen til et sted som har en betegnelse for sted som er en referansekode hentet fra et kodeskjema for vokabular. @no
definition: Relaterer et nomen til et sted, som har en benævnelse på sted, som er en referencekode hentet fra et vokabularkodningsskema. @da
definition: Relates a nomen to a place that has an appellation of place that is a reference code taken from a vocabulary encoding scheme.
definition: Sasaista nomenu ar vietu, kurai ir izteiksmes apzīmējums kodētā vārdnīcā. @lv
definition: Seostab nomen'i kohaga, millel on koha nimetuseks leksikaalsest märkimissüsteemist võetud viitekood. @et
definition: Setzt ein Nomen in Beziehung zu einem Geografikum, das über eine Bezeichnung für ein Geografikum verfügt, die einen Referenzcode darstellt, der aus einem Vocabulary Encoding Scheme entnommen wird. @de
definition: يربط تسمية بمكان له اسم مكان عبارة عن رمز إحالة مأخوذ من خطة ترميز مفردات. @ar
definition: 将一个命名与有一个取自一个词表编码体系的指称代码作为地点称谓的一个地点关联起来。 @zh-hans

is appellation of timespan of
has element type: 2
toolkit definition: A timespan that is referred to by a nomen used within a given scheme or context.
toolkit definition: Ajanjakso, johon viitataan tietyssä järjestelmässä tai kontekstissa käytetyllä nomenilla. @fi
toolkit definition: Ajavahemik, millele antud süsteemis või kontekstis nomen'iga viidatakse. @et
toolkit definition: Belirli bir şema veya bağlam içerisinde kullanılan bir ismin ifade ettiği zaman aralığı. @tr
toolkit definition: Een tijdspanne die aangeduid wordt door een nomen gebruikt binnen een bepaald schema of context @nl
toolkit definition: Egy időtartam, amelyre egy adott sémában vagy kontextusban használt nomen hivatkozik. @hu
toolkit definition: Ein Zeitraum, auf den mit einem Nomen referenziert wird, das in einem bestimmten Schema oder Kontext verwendet wird. @de
toolkit definition: Et tidsrom som refereres til med et nomen brukt innenfor et bestemt skjema eller kontekst. @no
toolkit definition: Interval de temps que fa referència a un nomen usat en un esquema o un context determinat. @ca
toolkit definition: Laikposms, uz kuru attiecas nomens, ko lieto konkrētajā sistēmā vai kontekstā. @lv
toolkit definition: Laps de temps qui est désigné par un nomen utilisé à l’intérieur d’un schéma ou d’un contexte donnés. @fr
toolkit definition: Tidsperiode, som henvises til af et nomen, som anvendes inden for et givet skema eller kontekst. @da
toolkit definition: Un arco di tempo a cui si fa riferimento con un nomen usato in un dato schema o contesto. @it
toolkit definition: فترة زمنية يشار إليها بتسمية مستخدمة في خطة أو في سياق معين. @ar
toolkit definition: 在一个给定的体系或语境中用一个命名指称的一个时间段 @zh-hans
toolkit label: Bezeichnung für einen Zeitraum von @de
toolkit label: apel·lació d’interval de temps de @ca
toolkit label: appellation de laps de temps de @fr
toolkit label: appellation of timespan of
toolkit label: apzīmējums laikposmam @lv
toolkit label: benaming van tijdspanne van @nl
toolkit label: benævnelse på tidsperiode af @da
toolkit label: betegnelse for tidrom for @no
toolkit label: denominazione di arco di tempo di @it
toolkit label: megnevezése a következő időtartamnak: @hu
toolkit label: nimetus ajavahemikule @et
toolkit label: nimitys ajanjaksolle @fi
toolkit label: zaman aralığının unvanı @tr
toolkit label: اسم فترة زمنية لـ @ar
toolkit label: ……的时间段的称谓 @zh-hans
has subproperty: is access point for timespan of
has subproperty: is name of timespan of
has subproperty: is identifier for timespan of
has subproperty: P80043
lexical alias: appellationOfTimespanOf.en
status: Published
type: Property
domain: C10012
label: er benævnelse på tidsperiode af @da
label: er betegnelse for tidrom for @no
label: est une appellation de laps de temps de @fr
label: ir apzīmējums laikposmam @lv
label: is benaming van tijdspanne van @nl
label: ist Bezeichnung für einen Zeitraum von @de
label: megnevezése a következő időtartamnak: @hu
label: nimetus ajavahemikule @et
label: nimitys ajanjaksolle @fi
label: zaman aralığının unvanıdır @tr
label: è denominazione di arco di tempo di @it
label: és apel·lació d’interval de temps de @ca
label: هو اسم فترة زمنية لـ @ar
label: 是……的时间段的称谓 @zh-hans
sub property of: has related timespan of nomen
sub property of: is appellation of RDA entity of
definition: Bir ismi, belirli bir şema veya bağlam içinde kullanılan bir isim tarafından atıfta bulunulan bir zaman aralığı ile ilişkilendirir. @tr
definition: Correla un nomen a un arco di tempo a cui si fa riferimento con un nomen usato in un dato schema o contesto. @it
definition: Hozzákapcsol egy noment egy időtartamhoz, amelyre egy adott sémában vagy kontextusban használt nomen hivatkozik. @hu
definition: Liittää nomenin ajanjaksoon, johon viitataan tietyssä järjestelmässä tai kontekstissa käytetyllä nomenilla. @fi
definition: Met un nomen en relation avec un laps de temps qui est désigné par un nomen utilisé à l’intérieur d’un schéma ou d’un contexte donnés. @fr
definition: Relaciona un nomen amb un interval de temps que fa referència a un nomen usat en un esquema o un context determinat. @ca
definition: Relateert een nomen aan een tijdspanne die aangeduid wordt door een nomen gebruikt binnen een bepaald schema of context @nl
definition: Relaterer et nomen til en tidsperiode, som henvises til af et nomen, som anvendes inden for et givet skema eller kontekst. @da
definition: Relaterer et nomen til et tidsrom som refereres til med et nomen brukt innenfor et bestemt skjema eller kontekst. @no
definition: Relates a nomen to a timespan that is referred to by a nomen used within a given scheme or context.
definition: Sasaista nomenu ar laikposmu, uz kuru attiecas nomens, ko lieto konkrētajā sistēmā vai kontekstā. @lv
definition: Seostab nomen'i ajavahemikuga, millele antud süsteemis või kontekstis nomen'iga viidatakse. @et
definition: Setzt ein Nomen in Beziehung zu einem Zeitraum, auf den mit einem Nomen referenziert wird, das in einem bestimmten Schema oder Kontext verwendet wird. @de
definition: يربط تسمية بفترة زمنية يشار إليها بتسمية مستخدمة في خطة أو في سياق معين. @ar
definition: 将一个命名与在一个给定的体系或语境中用一个命名指称的一个时间段关联起来。 @zh-hans

is name of timespan of
has element type: 2
toolkit definition: A timespan that has an appellation of timespan in natural language and phrasing used in common discourse.
toolkit definition: Ajanjakso, jolla on luonnollisen kielen ja yleisen diskurssin sanamuodon mukainen nimitys. @fi
toolkit definition: Ajavahemik, millel on nimetus loomulikus keeles ja sõnastuses, mida kasutatakse ühises diskursuses. @et
toolkit definition: Doğal dilde ve ortak söylemde kullanılan bir zaman aralığının unvanı sahip olan bir zaman aralığı. @tr
toolkit definition: Een tijdspanne die een benaming van tijdspanne heeft in natuurlijke taal en terminologie in gebruikelijke bewoording. @nl
toolkit definition: Egy időtartam, amelynek van egy időtartamhoz tartozó megnevezése természetes nyelven és közbeszédben használt kifejezéssel. @hu
toolkit definition: Ein Zeitraum, der über eine Bezeichnung für einen Zeitraum in natürlicher Sprache und Ausdrucksweise verfügt, die beim normalen Sprechen und Schreiben verwendet wird. @de
toolkit definition: Et tidsrom som har en betegnelse for tidsrom på et naturlig språk og med frasering brukt i alminnelig diskurs. @no
toolkit definition: Interval de temps que té una apel·lació d’interval de temps en llenguatge i frases naturals usada en el discurs comú. @ca
toolkit definition: Laikposms, kam ir apzīmējums dabiskā valodā un teicienos, ko izmanto sarunvalodā. @lv
toolkit definition: Laps de temps qui possède une appellation de laps de temps exprimée dans un langage et une formulation naturels et utilisée dans le langage courant. @fr
toolkit definition: Tidsperiode, som har en benævnelse på tidsperiode på normalsprog og med formuleringer, som bruges alment. @da
toolkit definition: Un arco di tempo che ha una designazione di arco di tempo in linguaggio e frasi naturali usati nel discorso comune. @it
toolkit definition: فترة زمنية لها اسم فترة زمنية في اللغة الطبيعية وفي العبارات المستخدمة في الخطاب العام. @ar
toolkit definition: 有用自然语言和普通话语措词表达的时间段的称谓的一个时间段 @zh-hans
toolkit label: Name eines Zeitraums von @de
toolkit label: időtartamneve: @hu
toolkit label: naam van tijdspanne van @nl
toolkit label: name of timespan of
toolkit label: navn på tidsperiode af @da
toolkit label: navn på tidsrom for @no
toolkit label: nimi ajanjaksolle @fi
toolkit label: nimi ajavahemikule @et
toolkit label: nom de laps de temps de @fr
toolkit label: nom d’interval de temps de @ca
toolkit label: nome di arco di tempo di @it
toolkit label: nosaukums laikposmam @lv
toolkit label: zaman aralığının adı @tr
toolkit label: اسم فترة زمنية لـ @ar
toolkit label: ……的时间段的名称 @zh-hans
has subproperty: is preferred name of timespan of
has subproperty: is variant name of timespan of
has subproperty: P80044
lexical alias: nameOfTimespanOf.en
status: Published
type: Property
domain: C10012
label: er navn på tidsperiode af @da
label: er navn på tidsrom for @no
label: est un nom de laps de temps de @fr
label: időtartamneve a következőnek: @hu
label: ir nosaukums laikposmam @lv
label: is naam van tijdspanne van @nl
label: ist Name eines Zeitraums von @de
label: nimi ajanjaksolle @fi
label: nimi ajavahemikule @et
label: zaman aralığının adıdır @tr
label: è nome di arco di tempo di @it
label: és nom d’interval de temps de @ca
label: هو اسم فترة زمنية لـ @ar
label: 是……的时间段的名称 @zh-hans
sub property of: is appellation of timespan of
sub property of: is name of RDA entity of
definition: Bir ismi, doğal dilde ve ortak söylemde kullanılan ifadelerde zaman aralığı yakıştırması olan bir zaman aralığı ile ilişkilendirir. @tr
definition: Correla un nomen a un arco di tempo che ha una designazione di arco di tempo in linguaggio e frasi naturali usati nel discorso comune. @it
definition: Hozzákapcsol egy noment egy időtartamhoz, amelynek van egy időtartamhoz tartozó megnevezése természetes nyelven és közbeszédben használt kifejezéssel. @hu
definition: Liittää nomenin ajanjaksoon, jolla on luonnollisen kielen ja yleisen diskurssin sanamuodon mukainen nimitys. @fi
definition: Met un nomen en relation avec un laps de temps qui possède une appellation de laps de temps exprimée dans un langage et une formulation naturels et utilisée dans le langage courant. @fr
definition: Relaciona un nomen amb un interval de temps que té una apel·lació d’interval de temps en llenguatge i frases naturals usada en el discurs comú. @ca
definition: Relateert een nomen aan een tijdspanne die een benaming van tijdspanne heeft in natuurlijke taal en terminologie in gebruikelijke bewoording. @nl
definition: Relaterer et nomen til en tidsperiode, som har en benævnelse på tidsperiode på normalsprog og med formuleringer, som bruges alment. @da
definition: Relaterer et nomen til et tidsrom som har en betegnelse for tidsrom på et naturlig språk og med frasering brukt i alminnelig diskurs. @no
definition: Relates a nomen to a timespan that has an appellation of timespan in natural language and phrasing used in common discourse.
definition: Sasaista nomenu ar laikposmu, kam ir apzīmējums dabiskā valodā un teicienos, ko izmanto sarunvalodā. @lv
definition: Seostab nomen'i ajavahemikuga, millel on nimetus loomulikus keeles ja sõnastuses, mida kasutatakse ühises diskursuses. @et
definition: Setzt ein Nomen in Beziehung zu einem Zeitraum, der über eine Bezeichnung für einen Zeitraum in natürlicher Sprache und Ausdrucksweise verfügt, die beim normalen Sprechen und Schreiben verwendet wird. @de
definition: يربط تسمية بفترة زمنية لها اسم فترة زمنية في اللغة الطبيعية وفي العبارات المستخدمة في الخطاب العام. @ar
definition: 将一个命名与有用自然语言和普通话语措词表达的时间段的称谓的一个时间段关联起来。 @zh-hans

is appellation of work of
has element type: 2
toolkit definition: A work that is referred to by a nomen used within a given scheme or context.
toolkit definition: Belirli bir şema veya bağlam içinde kullanılan bir isimle anılan bir eser. @tr
toolkit definition: Darbs, uz kuru attiecas nomens, ko lieto konkrētajā sistēmā vai kontekstā. @lv
toolkit definition: Een werk dat aangeduid wordt door een nomen gebruikt binnen een bepaald schema of context @nl
toolkit definition: Egy mű, amelyre egy adott sémában vagy kontextusban használt nomen hivatkozik. @hu
toolkit definition: Ein Werk, auf das mit einem Nomen referenziert wird, das in einem bestimmten Schema oder Kontext verwendet wird. @de
toolkit definition: Et verk som refereres til med et nomen brukt innenfor et bestemt skjema eller kontekst. @no
toolkit definition: Obra que fa referència a un nomen usat en un esquema o un context determinat. @ca
toolkit definition: Teos, johon viitataan tietyssä järjestelmässä tai kontekstissa käytetyllä nomenilla. @fi
toolkit definition: Teos, millele antud süsteemis või kontekstis nomen'iga viidatakse. @et
toolkit definition: Un'opera a cui si fa riferimento con un nomen usato in un dato schema o contesto. @it
toolkit definition: Værk, som henvises til af et nomen, som anvendes inden for et givet skema eller kontekst. @da
toolkit definition: Œuvre qui est désignée par un nomen utilisé à l’intérieur d’un schéma ou d’un contexte donnés. @fr
toolkit definition: عمل يشار إليه بتسمية مستخدمة في خطة أو في سياق معين. @ar
toolkit definition: 在一个给定的体系或语境中用一个命名指称的一种作品 @zh-hans
toolkit label: Bezeichnung für ein Werk von @de
toolkit label: apel·lació d’obra de @ca
toolkit label: appellation d’œuvre de @fr
toolkit label: appellation of work of
toolkit label: apzīmējums darbam @lv
toolkit label: benaming van werk van @nl
toolkit label: benævnelse på værk af @da
toolkit label: betegnelse for verk for @no
toolkit label: denominazione di opera di @it
toolkit label: eserin unvanı @tr
toolkit label: megnevezése a következő műnek: @hu
toolkit label: nimetus teosele @et
toolkit label: nimitys teokselle @fi
toolkit label: اسم عمل لـ @ar
toolkit label: ……的作品的称谓 @zh-hans
has subproperty: is access point for work of
has subproperty: is identifier for work of
has subproperty: is title of work of
has subproperty: is appellation of work group of
has subproperty: P80045
lexical alias: appellationOfWorkOf.en
status: Published
type: Property
domain: C10012
label: er benævnelse på værk af @da
label: er betegnelse for verk for @no
label: eserin unvanıdır @tr
label: est une appellation d’œuvre de @fr
label: ir apzīmējums darbam @lv
label: is benaming van werk van @nl
label: ist Bezeichnung für ein Werk von @de
label: megnevezése a következő műnek: @hu
label: nimetus teosele @et
label: nimitys teokselle @fi
label: è denominazione di opera di @it
label: és apel·lació d’obra de @ca
label: هو اسم عمل لـ @ar
label: 是……的作品的称谓 @zh-hans
sub property of: has related work of nomen
sub property of: is appellation of RDA entity of
definition: Bir ismi, belirli bir şema veya bağlam içinde kullanılan bir isim tarafından atıfta bulunulan bir eserle ilişkilendirir. @tr
definition: Correla un nomen a un'opera a cui si fa riferimento con un nomen usato in un dato schema o contesto. @it
definition: Hozzákapcsol egy noment egy műhöz, amelyre egy adott sémában vagy kontextusban használt nomen hivatkozik. @hu
definition: Liittää nomenin teokseen, johon viitataan tietyssä järjestelmässä tai kontekstissa käytetyllä nomenilla. @fi
definition: Met un nomen en relation avec une œuvre qui est désignée par un nomen utilisé à l’intérieur d’un schéma ou d’un contexte donnés. @fr
definition: Relaciona un nomen amb una obra que fa referència a un nomen usat en un esquema o un context determinat. @ca
definition: Relateert een nomen aan een werk dat aangeduid wordt door een nomen gebruikt binnen een bepaald schema of context @nl
definition: Relaterer et nomen til et verk som refereres til med et nomen brukt innenfor et bestemt skjema eller kontekst. @no
definition: Relaterer et nomen til et værk, som henvises til af et nomen, som anvendes inden for et givet skema eller kontekst. @da
definition: Relates a nomen to a work that is referred to by a nomen used within a given scheme or context.
definition: Sasaista nomenu ar darbu, uz kuru attiecas nomens, ko lieto konkrētajā sistēmā vai kontekstā. @lv
definition: Seostab nomen'i teosega, millele antud süsteemis või kontekstis nomen'iga viidatakse. @et
definition: Setzt ein Nomen in Beziehung zu einem Werk, auf das mit einem Nomen referenziert wird, das in einem bestimmten Schema oder Kontext verwendet wird. @de
definition: يربط تسمية بعمل يشار إليه بتسمية مستخدمة في خطة أو في سياق معين. @ar
definition: 将一个命名与在一个给定的体系或语境中用一个命名指称的一种作品关联起来。 @zh-hans

is identifier for expression of
has element type: 2
toolkit definition: An expression that has an appellation of expression that is a reference code taken from a vocabulary encoding scheme.
toolkit definition: Bir kelime kodlama şemasından alınan, referans kodu olan bir anlatımın unvanına sahip bir anlatım. @tr
toolkit definition: Een expressie die een benaming van expressie heeft die een referentiecode is ontleend aan een vocabulair coderingssysteem. @nl
toolkit definition: Egy kifejezési forma, amelynek van olyan kifejezésiforma-megnevezése, amely egy szótárkódolási sémából származó hivatkozási kód. @hu
toolkit definition: Eine Expression, die über eine Bezeichnung für eine Expression verfügt, die einen Referenzcode darstellt, der aus einem Vocabulary Encoding Scheme entnommen wird. @de
toolkit definition: Ekspressio, jolla on sanaston merkintäjärjestelmästä otettu viitekoodi nimityksenään. @fi
toolkit definition: Et uttrykk som har en betegnelse for uttrykk som er en referansekode hentet fra et kodeskjema for vokabular. @no
toolkit definition: Expression qui possède une appellation d’expression consistant en un code de référence provenant d’un schéma d’encodage de vocabulaire. @fr
toolkit definition: Expressió que té una apel·lació d’expressió que és un codi de referència obtingut d’un esquema de codificació de vocabulari. @ca
toolkit definition: Izteiksme, kam ir izteiksmes apzīmējums kodētā vārdnīcā. @lv
toolkit definition: Udtryk, som har en benævnelse på udtryk, som er en referencekode hentet fra et vokabularkodningsskema. @da
toolkit definition: Un'espressione che ha una denominazione di espressione che è un codice di riferimento tratto da uno schema di codifica di vocabolario. @it
toolkit definition: Väljendus, millel on väljenduse nimetuseks leksikaalsest märkimissüsteemist võetud viitekood. @et
toolkit definition: تعبيرة لها اسم تعبيرة عبارة عن رمز إحالة مأخوذ من خطة ترميز مفردات. @ar
toolkit definition: 有一个取自一个词表编码体系的指称代码作为内容表达称谓的一种内容表达 @zh-hans
toolkit label: Identifikator für eine Expression von @de
toolkit label: anlatımının tanımlayıcısıdır @tr
toolkit label: identifiant d’expression de @fr
toolkit label: identificador d’expressió de @ca
toolkit label: identificatie voor expressie van @nl
toolkit label: identificatore per espressione di @it
toolkit label: identifier for expression of
toolkit label: identifikaator väljendusele @et
toolkit label: identifikator for udtryk af @da
toolkit label: identifikator for uttrykk for @no
toolkit label: ir identifikators izteiksmei @lv
toolkit label: kifejezésiforma-azonosítója: @hu
toolkit label: tunniste ekspressiolle @fi
toolkit label: مُعرِّف لتعبيرة لـ @ar
toolkit label: ……的内容表达的标识符 @zh-hans
has subproperty: P80046
lexical alias: identifierForExpressionOf.en
status: Published
type: Property
domain: C10012
label: anlatımının tanımlayıcısıdır @tr
label: azonosítója a következő kifejezési formának: @hu
label: er identifikator for udtryk af @da
label: er identifikator for uttrykk for @no
label: est un identifiant d’expression de @fr
label: identifikaator väljendusele @et
label: ir identifikators izteiksmei @lv
label: is identificatie voor expressie van @nl
label: ist Identifikator für eine Expression von @de
label: tunniste ekspressiolle @fi
label: è identificatore per espressione di @it
label: és identificador d’expressió de @ca
label: هو مُعرِّف لتعبيرة لـ @ar
label: 是……的内容表达的标识符 @zh-hans
sub property of: is appellation of expression of
sub property of: is identifier for RDA entity of
definition: Bir ismi, bir kelime kodlama şemasından alınan bir referans kodu olan bir anlatım yakıştırmasına sahip bir anlatımla ilişkilendirir. @tr
definition: Correla un nomen a un'espressione che ha una denominazione di espressione che è un codice di riferimento tratto da uno schema di codifica di vocabolario. @it
definition: Hozzákapcsol egy noment egy kifejezési formához, amelynek van olyan kifejezésiforma-megnevezése, amely egy szótárkódolási sémából származó hivatkozási kód. @hu
definition: Liittää nomenin ekspressioon, jolla on sanaston merkintäjärjestelmästä otettu viitekoodi nimityksenään. @fi
definition: Met un nomen en relation avec une expression qui possède une appellation d’expression consistant en un code de référence provenant d’un schéma d’encodage de vocabulaire. @fr
definition: Relaciona un nomen amb una expressió que té una apel·lació d’expressió que és un codi de referència obtingut d’un esquema de codificació de vocabulari. @ca
definition: Relateert een nomen aan een expressie die een benaming van expressie heeft die een referentiecode is ontleend aan een vocabulair coderingssysteem. @nl
definition: Relaterer et nomen til et udtryk, som har en benævnelse på udtryk, som er en referencekode hentet fra et vokabularkodningsskema. @da
definition: Relaterer et nomen til et uttrykk som har en betegnelse for uttrykk som er en referansekode hentet fra et kodeskjema for vokabular. @no
definition: Relates a nomen to an expression that has an appellation of expression that is a reference code taken from a vocabulary encoding scheme.
definition: Sasaista nomenu ar izteiksmi, kam ir izteiksmes apzīmējums kodētā vārdnīcā. @lv
definition: Seostab nomen'i väljendusega, millel on väljenduse nimetuseks leksikaalsest märkimissüsteemist võetud viitekood. @et
definition: Setzt ein Nomen in Beziehung zu einer Expression, die über eine Bezeichnung für eine Expression verfügt, die einen Referenzcode darstellt, der aus einem Vocabulary Encoding Scheme entnommen wird. @de
definition: يربط تسمية بتعبيرة لها اسم تعبيرة عبارة عن رمز إحالة مأخوذ من خطة ترميز مفردات. @ar
definition: 将一个命名与有一个取自一个词表编码体系的指称代码作为内容表达称谓的一种内容表达关联起来。 @zh-hans

is identifier for item of
has element type: 2
toolkit definition: An item that has an appellation of item that is a reference code taken from a vocabulary encoding scheme.
toolkit definition: Bir kelime kodlama şemasından alınan bir referans kodu olan bir kopya unvanına sahip bir kopya. @tr
toolkit definition: Een item dat een benaming van item heeft die een referentiecode is ontleend aan een vocabulair coderingssysteem. @nl
toolkit definition: Egy példány, amelynek van olyan példánymegnevezése, amely egy szótárkódolási sémából származó hivatkozási kód. @hu
toolkit definition: Eine Exemplar, das über eine Bezeichnung für ein Exemplar verfügt, die einen Referenzcode darstellt, der aus einem Vocabulary Encoding Scheme entnommen wird. @de
toolkit definition: Eksemplar, millel on eksemplari nimetuseks leksikaalsest märkimissüsteemist võetud viitekood. @et
toolkit definition: Eksemplar, som har en benævnelse på eksemplar, som er en referencekode hentet fra et vokabularkodningsskema. @da
toolkit definition: Et eksemplar som har en betegnelse for eksemplar som er en referansekode hentet fra et kodeskjema for vokabular. @no
toolkit definition: Item qui possède une appellation d’item consistant en un code de référence provenant d’un schéma d’encodage de vocabulaire. @fr
toolkit definition: Kappale, jolla on sanaston merkintäjärjestelmästä otettu viitekoodi nimityksenään. @fi
toolkit definition: Un item che ha una denominazione di item che è un codice di riferimento tratto da uno schema di codifica di vocabolario. @it
toolkit definition: Vienība, kurai ir izteiksmes apzīmējums kodētā vārdnīcā. @lv
toolkit definition: Ítem que té una apel·lació d’ítem que és un codi de referència obtingut d’un esquema de codificació de vocabulari. @ca
toolkit definition: مفردة لها اسم مفردة عبارة عن رمز إحالة مأخوذة من خطة ترميز مفردات. @ar
toolkit definition: 有一个取自一个词表编码体系的指称代码作为单件称谓的一个单件 @zh-hans
toolkit label: Identifikator für ein Exemplar von @de
toolkit label: azonosítója a következő példánynak: @hu
toolkit label: identifiant d’item de @fr
toolkit label: identificador d’ítem de @ca
toolkit label: identificatie voor item van @nl
toolkit label: identificatore per item di @it
toolkit label: identifier for item of
toolkit label: identifikaator eksemplarile @et
toolkit label: identifikator for eksemplar af @da
toolkit label: identifikator for eksemplar for @no
toolkit label: ir identifikators vienībai @lv
toolkit label: kopyasının tanımlayıcısıdır @tr
toolkit label: tunniste kappaleelle @fi
toolkit label: مُعرِّف لمفردة لـ @ar
toolkit label: ……的单件的标识符 @zh-hans
has subproperty: P80047
lexical alias: identifierForItemOf.en
status: Published
type: Property
domain: C10012
label: azonosítója a következő példánynak: @hu
label: er identifikator for eksemplar af @da
label: er identifikator for eksemplar for @no
label: est un identifiant d’item de @fr
label: identifikaator eksemplarile @et
label: ir identifikators vienībai @lv
label: is identificatie voor item van @nl
label: ist Identifikator für ein Exemplar von @de
label: kopyasının tanımlayıcısıdır @tr
label: tunniste kappaleelle @fi
label: è identificatore per item di @it
label: és identificador d’ítem de @ca
label: هو مُعرِّف لمفردة لـ @ar
label: 是……的单件的标识符 @zh-hans
sub property of: is appellation of item of
sub property of: is identifier for RDA entity of
definition: Bir ismi, bir kelime kodlama şemasından alınan bir referans kodu olan bir kopya ünvanına sahip bir kopyayla ilişkilendirir. @tr
definition: Correla un nomen a un item che ha una denominazione di item che è un codice di riferimento tratto da uno schema di codifica di vocabolario. @it
definition: Hozzákapcsol egy noment egy példányhoz, amelynek van olyan példánymegnevezése, amely egy szótárkódolási sémából származó hivatkozási kód. @hu
definition: Liittää nomenin kappaleeseen, jolla on sanaston merkintäjärjestelmästä otettu viitekoodi nimityksenään. @fi
definition: Met un nomen en relation avec un item qui possède une appellation d’item consistant en un code de référence provenant d’un schéma d’encodage de vocabulaire. @fr
definition: Relaciona un nomen amb un ítem que té una apel·lació d’ítem que és un codi de referència obtingut d’un esquema de codificació de vocabulari. @ca
definition: Relateert een nomen aan een item dat een benaming van item heeft die een referentiecode is ontleend aan een vocabulair coderingssysteem. @nl
definition: Relaterer et nomen til et eksemplar som har en betegnelse for eksemplar som er en referansekode hentet fra et kodeskjema for vokabular. @no
definition: Relaterer et nomen til et eksemplar, som har en benævnelse på eksemplar, som er en referencekode hentet fra et vokabularkodningsskema. @da
definition: Relates a nomen to an item that has an appellation of item that is a reference code taken from a vocabulary encoding scheme.
definition: Sasaista nomenu ar vienību, kurai ir izteiksmes apzīmējums kodētā vārdnīcā. @lv
definition: Seostab nomen'i eksemplariga, millel on eksemplari nimetuseks leksikaalsest märkimissüsteemist võetud viitekood. @et
definition: Setzt ein Nomen in Beziehung zu einem Exemplar, das über eine Bezeichnung für ein Exemplar verfügt, die einen Referenzcode darstellt, der aus einem Vocabulary Encoding Scheme entnommen wird. @de
definition: يربط تسمية بمفردة لها اسم مفردة عبارة عن رمز إحالة مأخوذة من خطة ترميز مفردات. @ar
definition: 将一个命名与有一个取自一个词表编码体系的指称代码作为单件称谓的一个单件关联起来。 @zh-hans

is identifier for manifestation of
has element type: 2
toolkit definition: A manifestation that has an appellation of manifestation that is a reference code taken from a vocabulary encoding scheme.
toolkit definition: Bir kelime kodlama şemasından alınan bir referans kodu içeren bir gösterim unvanına sahip bir gösterim @tr
toolkit definition: Een manifestatie die een benaming van manifestatie heeft die een referentiecode is ontleend aan een vocabulair coderingssysteem. @nl
toolkit definition: Egy megjelenési forma, amelynek van olyan megjelenésiforma-megnevezése, amely egy szótárkódolási sémából származó hivatkozási kód. @hu
toolkit definition: Eine Manifestation, die über eine Bezeichnung für eine Manifestation verfügt, die einen Referenzcode darstellt, der aus einem Vocabulary Encoding Scheme entnommen wird. @de
toolkit definition: En manifestasjon som har en betegnelse for manifestasjon som er en referansekode hentet fra et kodeskjema for vokabular. @no
toolkit definition: Kehastus, millel on kehastuse nimetuseks leksikaalsest märkimissüsteemist võetud viitekood. @et
toolkit definition: Manifestaatio, jolla on sanaston merkintäjärjestelmästä otettu viitekoodi nimityksenään. @fi
toolkit definition: Manifestació que té una apel·lació de manifestació que és un codi de referència obtingut d’un esquema de codificació de vocabulari. @ca
toolkit definition: Manifestation qui possède une appellation de manifestation consistant en un code de référence provenant d’un schéma d’encodage de vocabulaire. @fr
toolkit definition: Manifestation, som har en benævnelse på manifestation, som er en referencekode hentet fra et vokabularkodningsskema. @da
toolkit definition: Manifestācija, kam ir izteiksmes apzīmējums kodētā vārdnīcā. @lv
toolkit definition: Una manifestazione che ha una denominazione di manifestazione che è un codice di riferimento tratto da uno schema di codifica di vocabolario. @it
toolkit definition: تجسيدة لها اسم تجسيدة عبارة عن رمز إحالة مأخوذة من خطة ترميز مفردات. @ar
toolkit definition: 有一个取自一个词表编码体系的指称代码作为载体表现称谓的一种载体表现 @zh-hans
toolkit label: Identifikator für eine Manifestation von @de
toolkit label: gösteriminin tanımlayıcısıdır @tr
toolkit label: identifiant de manifestation de @fr
toolkit label: identificador de manifestació de @ca
toolkit label: identificatie voor manifestatie van @nl
toolkit label: identificatore per manifestazione di @it
toolkit label: identifier for manifestation of
toolkit label: identifikaator kehastusele @et
toolkit label: identifikator for manifestasjon for @no
toolkit label: identifikator for manifestation af @da
toolkit label: ir identifikators manifestācijai @lv
toolkit label: megjelenésiforma-azonosítója: @hu
toolkit label: tunniste manifestaatiolle @fi
toolkit label: مُعرِّف لتجسيدة لـ @ar
toolkit label: ……的载体表现的标识符 @zh-hans
has subproperty: is fingerprint of
has subproperty: is plate number for notated music of
has subproperty: is publisher number for notated music of
has subproperty: P80048
lexical alias: identifierForManifestationOf.en
status: Published
type: Property
domain: C10012
label: er identifikator for manifestasjon for @no
label: er identifikator for manifestation af @da
label: est un identifiant de manifestation de @fr
label: gösteriminin tanımlayıcısıdır @tr
label: identifikaator kehastusele @et
label: ir identifikators manifestācijai @lv
label: is identificatie voor manifestatie van @nl
label: ist Identifikator für eine Manifestation von @de
label: megjelenésiforma-azonosítója a következőnek: @hu
label: tunniste manifestaatiolle @fi
label: è identificatore per manifestazione di @it
label: és identificador de manifestació de @ca
label: هو مُعرِّف لتجسيدة لـ @ar
label: 是……的载体表现的标识符 @zh-hans
sub property of: is appellation of manifestation of
sub property of: is identifier for RDA entity of
definition: Bir ismi, bir kelime kodlama şemasından alınan bir referans kodu olan bir gösterim yakıştırmasına sahip bir gösterimle ilişkilendirir. @tr
definition: Correla un nomen a una manifestazione che ha una denominazione di manifestazione che è un codice di riferimento tratto da uno schema di codifica di vocabolario. @it
definition: Hozzákapcsol egy noment egy megjelenési formához, amelynek van olyan megjelenésiforma-megnevezése, amely egy szótárkódolási sémából származó hivatkozási kód. @hu
definition: Liittää nomenin manifestaatioon, jolla on sanaston merkintäjärjestelmästä otettu viitekoodi nimityksenään. @fi
definition: Met un nomen en relation avec une manifestation qui possède une appellation de manifestation consistant en un code de référence provenant d’un schéma d’encodage de vocabulaire. @fr
definition: Relaciona un nomen amb una manifestació que té una apel·lació de manifestació que és un codi de referència obtingut d’un esquema de codificació de vocabulari. @ca
definition: Relateert een nomen aan een manifestatie die een benaming van manifestatie heeft die een referentiecode is ontleend aan een vocabulair coderingssysteem. @nl
definition: Relaterer et nomen til en manifestasjon som har en betegnelse for manifestasjon som er en referansekode hentet fra et kodeskjema for vokabular. @no
definition: Relaterer et nomen til en manifestation, som har en benævnelse på manifestation, som er en referencekode hentet fra et vokabularkodningsskema. @da
definition: Relates a nomen to a manifestation that has an appellation of manifestation that is a reference code taken from a vocabulary encoding scheme.
definition: Sasaista nomenu ar manifestāciju, kam ir izteiksmes apzīmējums kodētā vārdnīcā. @lv
definition: Seostab nomen'i kehastusega, millel on kehastuse nimetuseks leksikaalsest märkimissüsteemist võetud viitekood. @et
definition: Setzt ein Nomen in Beziehung zu einer Manifestation, die über eine Bezeichnung für eine Manifestation verfügt, die einen Referenzcode darstellt, der aus einem Vocabulary Encoding Scheme entnommen wird. @de
definition: يربط تسمية بتجسيدة لها اسم تجسيدة عبارة عن رمز إحالة مأخوذة من خطة ترميز مفردات. @ar
definition: 将一个命名与有一个取自一个词表编码体系的指称代码作为载体表现称谓的一种载体表现关联起来。 @zh-hans

is identifier for work of
has element type: 2
toolkit definition: A work that has an appellation of work that is a reference code taken from a vocabulary encoding scheme.
toolkit definition: Bir kelime kodlama şemasından alınan bir referans kodu olan bir eser unvanına sahip bir eser. @tr
toolkit definition: Darbs, kam ir darba apzīmējums kodētā vārdnīcā. @lv
toolkit definition: Een werk dat een benaming van werk heeft die een referentiecode is ontleend aan een vocabulair coderingssysteem. @nl
toolkit definition: Egy mű, amelynek van olyan műmegnevezése, amely egy szótárkódolási sémából származó hivatkozási kód. @hu
toolkit definition: Eine Werk, das über eine Bezeichnung für ein Werk verfügt, die einen Referenzcode darstellt, der aus einem Vocabulary Encoding Scheme entnommen wird. @de
toolkit definition: Et verk som har en betegnelse for verk som er en referansekode hentet fra et kodeskjema for vokabular. @no
toolkit definition: Obra que té una apel·lació d’obra que és un codi de referència obtingut d’un esquema de codificació de vocabulari. @ca
toolkit definition: Teos, jolla on sanaston merkintäjärjestelmästä otettu viitekoodi nimityksenään. @fi
toolkit definition: Teos, millel on teose nimetuseks leksikaalsest märkimissüsteemist võetud viitekood. @et
toolkit definition: Un'opera che ha una denominazione di opera che è un codice di riferimento tratto da uno schema di codifica di vocabolario. @it
toolkit definition: Værk, som har en benævnelse på værk, som er en referencekode hentet fra et vokabularkodningsskema. @da
toolkit definition: Œuvre qui possède une appellation d’œuvre consistant en un code de référence provenant d’un schéma d’encodage de vocabulaire. @fr
toolkit definition: عمل له اسم عمل عبارة عن رمز إحالة مأخوذ من خطة ترميز مفردات. @ar
toolkit definition: 有一个取自一个词表编码体系的指称代码作为作品称谓的一种作品 @zh-hans
toolkit label: Identifikator für ein Werk von @de
toolkit label: eserinin tanımlayıcısıdır @tr
toolkit label: identifiant d’œuvre de @fr
toolkit label: identificador d’obra de @ca
toolkit label: identificatore per opera di @it
toolkit label: identifier for work of
toolkit label: identifikaator teosele @et
toolkit label: identifikator for verk for @no
toolkit label: identifikator for værk af @da
toolkit label: ingang voor werk van @nl
toolkit label: ir identifikators darbam @lv
toolkit label: mű-azonosítója: @hu
toolkit label: tunniste teokselle @fi
toolkit label: مُعرِّف لعمل لـ @ar
toolkit label: ……的作品的标识符 @zh-hans
has subproperty: is numeric designation of musical work of
has subproperty: is ISSN of
has subproperty: is identifier for work group of
has subproperty: P80049
lexical alias: identifierForWorkOf.en
status: Published
type: Property
domain: C10012
label: azonosítója a következő műnek: @hu
label: er identifikator for verk for @no
label: er identifikator for værk af @da
label: eserinin tanımlayıcısıdır @tr
label: est un identifiant d’œuvre de @fr
label: identifikaator teosele @et
label: ir identifikators darbam @lv
label: is ingang voor werk van @nl
label: ist Identifikator für ein Werk von @de
label: tunniste teokselle @fi
label: è identificatore per opera di @it
label: és identificador d’obra de @ca
label: هو مُعرِّف لعمل لـ @ar
label: 是……的作品的标识符 @zh-hans
sub property of: is appellation of work of
sub property of: is identifier for RDA entity of
definition: Bir ismi, bir kelime kodlama şemasından alınan bir referans kodu olan bir iş ünvanına sahip bir eserle ilişkilendirir. @tr
definition: Correla un nomen a un'opera che ha una denominazione di opera che è un codice di riferimento tratto da uno schema di codifica di vocabolario. @it
definition: Hozzákapcsol egy noment egy műhöz, amelynek van olyan műmegnevezése, amely egy szótárkódolási sémából származó hivatkozási kód. @hu
definition: Liittää nomenin teokseen, jolla on sanaston merkintäjärjestelmästä otettu viitekoodi nimityksenään. @fi
definition: Met un nomen en relation avec une œuvre qui possède une appellation d’œuvre consistant en un code de référence provenant d’un schéma d’encodage de vocabulaire. @fr
definition: Relaciona un nomen amb una obra que té una apel·lació d’obra que és un codi de referència obtingut d’un esquema de codificació de vocabulari. @ca
definition: Relateert een nomen aan een werk dat een benaming van werk heeft die een referentiecode is ontleend aan een vocabulair coderingssysteem. @nl
definition: Relaterer et nomen til et verk som har en betegnelse for verk som er en referansekode hentet fra et kodeskjema for vokabular. @no
definition: Relaterer et nomen til et værk, som har en benævnelse på værk, som er en referencekode hentet fra et vokabularkodningsskema. @da
definition: Relates a nomen to a work that has an appellation of work that is a reference code taken from a vocabulary encoding scheme.
definition: Sasaista nomenu ar darbu, kam ir darba apzīmējums kodētā vārdnīcā. @lv
definition: Seostab nomen'i teosega, millel on teose nimetuseks leksikaalsest märkimissüsteemist võetud viitekood. @et
definition: Setzt ein Nomen in Beziehung zu einem Werk, das über eine Bezeichnung für ein Werk verfügt, die einen Referenzcode darstellt, der aus einem Vocabulary Encoding Scheme entnommen wird. @de
definition: يربط تسمية بعمل له اسم عمل عبارة عن رمز إحالة مأخوذ من خطة ترميز مفردات. @ar
definition: 将一个命名与有一个取自一个词表编码体系的指称代码作为作品称谓的一种作品关联起来。 @zh-hans

is identifier for timespan of
has element type: 2
toolkit definition: A timespan that has an appellation of timespan that is a reference code taken from a vocabulary encoding scheme.
toolkit definition: Ajanjakso, jolla on sanaston merkintäjärjestelmästä otettu viitekoodi nimityksenään. @fi
toolkit definition: Ajavahemik, millel on ajavahemiku nimetuseks leksikaalsest märkimissüsteemist võetud viitekood. @et
toolkit definition: Bir kelime kodlama şemasından alınan bir referans kodu olan bir zaman aralığı unvanına sahip olan bir zaman aralığı. @tr
toolkit definition: Een tijdspanne die een benaming van tijdspanne heeft die een referentiecode is ontleend aan een vocabulair coderingssysteem. @nl
toolkit definition: Egy időtartam, amelynek van olyan időtartam-megnevezése, amely egy szótárkódolási sémából származó hivatkozási kód. @hu
toolkit definition: Ein Zeitraum, der über eine Bezeichnung für einen Zeitraum verfügt, die einen Referenzcode darstellt, der aus einem Vocabulary Encoding Scheme entnommen wird. @de
toolkit definition: Et tidsrom som har en betegnelse for tidsrom som er en referansekode hentet fra et kodeskjema for vokabular. @no
toolkit definition: Interval de temps que té una apel·lació d’interval de temps que és un codi de referència obtingut d’un esquema de codificació de vocabulari. @ca
toolkit definition: Laikposms, kuram ir izteiksmes apzīmējums kodētā vārdnīcā. @lv
toolkit definition: Laps de temps qui possède une appellation de laps de temps consistant en un code de référence provenant d’un schéma d’encodage de vocabulaire. @fr
toolkit definition: Tidsperiode, som har en benævnelse på tidsperiode, som er en referencekode hentet fra et vokabularkodningsskema. @da
toolkit definition: Un arco di tempo che ha una denominazione di arco di tempo che è un codice di riferimento tratto da uno schema di codifica di vocabolario. @it
toolkit definition: فترة زمنية لها اسم فترة زمنية عبارة عن رمز إحالة مأخوذ من خطة ترميز مفردات. @ar
toolkit definition: 有一个取自一个词表编码体系的指称代码作为时间段称谓的一个时间段 @zh-hans
toolkit label: Identifikator für einen Zeitraum von @de
toolkit label: azonosítója a következő időtartamnak: @hu
toolkit label: identifiant de laps de temps de @fr
toolkit label: identificador d’interval de temps de @ca
toolkit label: identificatore per arco di tempo di @it
toolkit label: identifier for timespan of
toolkit label: identifikaator ajavahemikule @et
toolkit label: identifikator for tidsperiode af @da
toolkit label: identifikator for tidsrom for @no
toolkit label: ingang voor tijdspanne van @nl
toolkit label: ir identifikators laikposms @lv
toolkit label: tunniste ajanjaksolle @fi
toolkit label: zaman aralığının tanımlayıcısıdır @tr
toolkit label: مُعرِّف لفترة زمنية لـ @ar
toolkit label: ……的时间段的标识符 @zh-hans
has subproperty: P80050
lexical alias: identifierForTimespanOf.en
status: Published
type: Property
domain: C10012
label: azonosítója a következő időtartamnak: @hu
label: er identifikator for tidsperiode af @da
label: er identifikator for tidsrom for @no
label: est un identifiant de laps de temps de @fr
label: identifikaator ajavahemikule @et
label: ir identifikators laikposms @lv
label: is ingang voor tijdspanne van @nl
label: ist Identifikator für einen Zeitraum von @de
label: tunniste ajanjaksolle @fi
label: zaman aralığının tanımlayıcısıdır @tr
label: è identificatore per arco di tempo di @it
label: és identificador d’interval de temps de @ca
label: هو مُعرِّف لفترة زمنية لـ @ar
label: 是……的时间段的标识符 @zh-hans
sub property of: is appellation of timespan of
sub property of: is identifier for RDA entity of
definition: Bir ismi, bir kelime kodlama şemasından alınan bir referans kodu olan bir zaman aralığı yakıştırmasına sahip bir zaman aralığı ile ilişkilendirir. @tr
definition: Correla un nomen a un arco di tempo che ha una denominazione di arco di tempo che è un codice di riferimento tratto da uno schema di codifica di vocabolario. @it
definition: Hozzákapcsol egy noment egy időtartamhoz, amelynek van olyan időtartam-megnevezése, amely egy szótárkódolási sémából származó hivatkozási kód. @hu
definition: Liittää nomenin ajanjaksoon, jolla on sanaston merkintäjärjestelmästä otettu viitekoodi nimityksenään. @fi
definition: Met un nomen en relation avec un laps de temps qui possède une appellation de laps de temps consistant en un code de référence provenant d’un schéma d’encodage de vocabulaire. @fr
definition: Relaciona un nomen amb un interval de temps que té una apel·lació d’interval de temps que és un codi de referència obtingut d’un esquema de codificació de vocabulari. @ca
definition: Relateert een nomen aan een tijdspanne die een benaming van tijdspanne heeft die een referentiecode is ontleend aan een vocabulair coderingssysteem. @nl
definition: Relaterer et nomen til en tidsperiode, som har en benævnelse på tidsperiode, som er en referencekode hentet fra et vokabularkodningsskema. @da
definition: Relaterer et nomen til et tidsrom som har en betegnelse for tidsrom som er en referansekode hentet fra et kodeskjema for vokabular. @no
definition: Relates a nomen to a timespan that has an appellation of timespan that is a reference code taken from a vocabulary encoding scheme.
definition: Sasaista nomenu ar laikposmu, kuram ir izteiksmes apzīmējums kodētā vārdnīcā. @lv
definition: Seostab nomen'i ajavahemikuga, millel on ajavahemiku nimetuseks leksikaalsest märkimissüsteemist võetud viitekood. @et
definition: Setzt ein Nomen in Beziehung zu einem Zeitraum, der über eine Bezeichnung für einen Zeitraum verfügt, die einen Referenzcode darstellt, der aus einem Vocabulary Encoding Scheme entnommen wird. @de
definition: يربط تسمية بفترة زمنية لها اسم فترة زمنية عبارة عن رمز إحالة مأخوذ من خطة ترميز مفردات. @ar
definition: 将一个命名与有一个取自一个词表编码体系的指称代码作为时间段称谓的一个时间段关联起来。 @zh-hans

is name of place of
has element type: 2
toolkit definition: A place that has an appellation of place in natural language and phrasing used in common discourse.
toolkit definition: Doğal dilde bir yer unvanına ve ortak söylemde kullanılan ifadelere sahip bir yer. @tr
toolkit definition: Een plaats die een benaming van plaats heeft in natuurlijke taal en terminologie in gebruikelijke bewoording. @nl
toolkit definition: Egy hely, amelynek van egy helyhez tartozó megnevezése természetes nyelven és közbeszédben használt kifejezéssel. @hu
toolkit definition: Ein Geografikum, das über eine Bezeichnung für ein Geografikum in natürlicher Sprache und Ausdrucksweise verfügt, die beim normalen Sprechen und Schreiben verwendet wird. @de
toolkit definition: Et sted som har en betegnelse for sted på et naturlig språk og med frasering brukt i alminnelig diskurs. @no
toolkit definition: Koht, millel on nimetus loomulikus keeles ja sõnastuses, mida kasutatakse ühises diskursuses. @et
toolkit definition: Lieu qui possède une appellation de lieu exprimée dans un langage et une formulation naturels et utilisée dans le langage courant. @fr
toolkit definition: Lloc que té una apel·lació de lloc en llenguatge i frases naturals usada en el discurs comú. @ca
toolkit definition: Paikka, jolla on luonnollisen kielen ja yleisen diskurssin sanamuodon mukainen nimitys. @fi
toolkit definition: Sted, som har en benævnelse på sted på normalsprog og med formuleringer, som bruges alment. @da
toolkit definition: Un luogo che ha una designazione di luogo in linguaggio e frasi naturali usati nel discorso comune. @it
toolkit definition: Vieta, kurai ir apzīmējums dabiskajā valodā, ko izmanto savstarpējā saziņā. @lv
toolkit definition: مكان له اسم مكان في اللغة الطبيعية وفي العبارات المستخدمة في الخطاب العام. @ar
toolkit definition: 有用自然语言和普通话语措词表达的地点的称谓的一个地点 @zh-hans
toolkit label: Name eines Geografikums von @de
toolkit label: helyneve: @hu
toolkit label: naam van plaats van @nl
toolkit label: name of place of
toolkit label: navn på sted af @da
toolkit label: navn på sted for @no
toolkit label: nimi kohale @et
toolkit label: nimi paikalle @fi
toolkit label: nom de lieu de @fr
toolkit label: nom de lloc de @ca
toolkit label: nome di luogo di @it
toolkit label: nosaukums vietai @lv
toolkit label: yer adı @tr
toolkit label: اسم مكان لـ @ar
toolkit label: ……的地点的名称 @zh-hans
has subproperty: is preferred name of place of
has subproperty: is variant name of place of
has subproperty: P80051
lexical alias: nameOfPlaceOf.en
status: Published
type: Property
domain: C10012
label: er navn på sted af @da
label: er navn på sted for @no
label: est un nom de lieu de @fr
label: helyneve a következőnek: @hu
label: ir nosaukums vietai @lv
label: is naam van plaats van @nl
label: ist Name eines Geografikums von @de
label: nimi kohale @et
label: nimi paikalle @fi
label: yerinin adıdır @tr
label: è nome di luogo di @it
label: és nom de lloc de @ca
label: هو اسم مكان لـ @ar
label: 是……的地点的名称 @zh-hans
sub property of: is appellation of place of
sub property of: is name of RDA entity of
definition: Bir ismi, doğal dilde bir yer unvanına ve ortak söylemde kullanılan ifadelere sahip bir yerle ilişkilendirir. @tr
definition: Correla un nomen a un luogo che ha una designazione di luogo in linguaggio e frasi naturali usati nel discorso comune. @it
definition: Hozzákapcsol egy noment egy helyhez, amelynek van egy helyhez tartozó megnevezése természetes nyelven és közbeszédben használt kifejezéssel. @hu
definition: Liittää nomenin paikkaan, jolla on luonnollisen kielen ja yleisen diskurssin sanamuodon mukainen nimitys. @fi
definition: Met un nomen en relation avec un lieu qui possède une appellation de lieu exprimée dans un langage et une formulation naturels et utilisée dans le langage courant. @fr
definition: Relaciona un nomen amb un lloc que té una apel·lació de lloc en llenguatge i frases naturals usada en el discurs comú. @ca
definition: Relateert een nomen aan een plaats die een benaming van plaats heeft in natuurlijke taal en terminologie in gebruikelijke bewoording. @nl
definition: Relaterer et nomen til et sted som har en betegnelse for sted på et naturlig språk og med frasering brukt i alminnelig diskurs. @no
definition: Relaterer et nomen til et sted, som har en benævnelse på sted på normalsprog og med formuleringer, som bruges alment. @da
definition: Relates a nomen to a place that has an appellation of place in natural language and phrasing used in common discourse.
definition: Sasaista nomenu ar vietu, kurai ir apzīmējums dabiskajā valodā, ko izmanto savstarpējā saziņā. @lv
definition: Seostab nomen'i kohaga, millel on nimetus loomulikus keeles ja sõnastuses, mida kasutatakse ühises diskursuses. @et
definition: Setzt ein Nomen in Beziehung zu einem Geografikum, das über eine Bezeichnung für ein Geografikum in natürlicher Sprache und Ausdrucksweise verfügt, die beim normalen Sprechen und Schreiben verwendet wird. @de
definition: يربط تسمية بمكان له اسم مكان في اللغة الطبيعية وفي العبارات المستخدمة في الخطاب العام. @ar
definition: 将一个命名与有用自然语言和普通话语措词表达的地点的称谓的一个地点关联起来。 @zh-hans

is name of agent of
has element type: 2
toolkit definition: Agent que té una apel·lació d’agent en llenguatge i frases naturals usada en el discurs comú. @ca
toolkit definition: Agent qui possède une appellation d’agent exprimée dans un langage et une formulation naturels et utilisée dans le langage courant. @fr
toolkit definition: Agent, som har en benævnelse på agent på normalsprog og med formuleringer, som bruges alment. @da
toolkit definition: An agent who has an appellation of agent in natural language and phrasing used in common discourse.
toolkit definition: Aģents, kam ir apzīmējums dabiskajā valodā, ko izmanto savstarpējā saziņā. @lv
toolkit definition: Doğal dilde ve ortak söylemde kullanılan ifadelerde temsilci ünvanına sahip bir temsilci. @tr
toolkit definition: Een actor die een benaming van actor heeft in natuurlijke taal en terminologie in gebruikelijke bewoording. @nl
toolkit definition: Egy ágens, amelynek van egy ágensmegnevezése természetes nyelven és közbeszédben használt kifejezéssel. @hu
toolkit definition: Ein Akteur, der über eine Bezeichnung für einen Akteur in natürlicher Sprache und Ausdrucksweise verfügt, die beim normalen Sprechen und Schreiben verwendet wird. @de
toolkit definition: En agent som har en betegnelse for agent på et naturlig språk og med frasering brukt i alminnelig diskurs. @no
toolkit definition: Tegija, kellel on nimetus loomulikus keeles ja sõnastuses, mida kasutatakse ühises diskursuses. @et
toolkit definition: Toimija, jolla on luonnollisen kielen ja yleisen diskurssin sanamuodon mukainen nimitys. @fi
toolkit definition: Un agente che ha una designazione di agente in linguaggio e frasi naturali usati nel discorso comune. @it
toolkit definition: وكيل له اسم وكيل في اللغة الطبيعية المستخدمة في الخطاب العام. @ar
toolkit definition: 有用自然语言和普通话语措词表达的行为者的称谓的一个行为者 @zh-hans
toolkit label: Name eines Akteurs von @de
toolkit label: ir vārds/nosaukums aģentam @lv
toolkit label: naam van actor van @nl
toolkit label: name of agent of
toolkit label: navn på agent af @da
toolkit label: navn på agent for @no
toolkit label: nimi tegijale @et
toolkit label: nimi toimijalle @fi
toolkit label: nom d’agent de @ca
toolkit label: nome di agente di @it
toolkit label: temsilcinin adı @tr
toolkit label: ágensneve: @hu
toolkit label: اسم وكيل لـ @ar
toolkit label: ……的行为者的名称 @zh-hans
has subproperty: is name of collective agent of
has subproperty: is name of person of
has subproperty: is preferred name of agent of
has subproperty: is variant name of agent of
has subproperty: P80052
lexical alias: nameOfAgentOf.en
status: Published
type: Property
domain: C10012
label: er navn på agent af @da
label: er navn på agent for @no
label: est un nom d’agent de @fr
label: ir vārds/nosaukums aģentam @lv
label: is naam van actor van @nl
label: ist Name eines Akteurs von @de
label: nimi tegijale @et
label: nimi toimijalle @fi
label: temsilcisinin adıdır @tr
label: ágensneve a következőnek: @hu
label: è nome di agente di @it
label: és nom d’agent de @ca
label: هو اسم وكيل لـ @ar
label: 是……的行为者的名称 @zh-hans
sub property of: is appellation of agent of
sub property of: is name of RDA entity of
definition: Bir ismi, doğal dilde ve ortak söylemde kullanılan ifadelerde bir temsilci unvanına sahip bir temsilciyle ilişkilendirir. @tr
definition: Correla un nomen a un agente che ha una designazione di agente in linguaggio e frasi naturali usati nel discorso comune. @it
definition: Hozzákapcsol egy noment egy ágenshez, amelynek van egy ágensmegnevezése természetes nyelven és közbeszédben használt kifejezéssel. @hu
definition: Liittää nomenin toimijaan, jolla on luonnollisen kielen ja yleisen diskurssin sanamuodon mukainen nimitys. @fi
definition: Met un nomen en relation avec un agent qui possède une appellation d’agent exprimée dans un langage et une formulation naturels et utilisée dans le langage courant. @fr
definition: Relaciona un nomen amb un agent que té una apel·lació d’agent en llenguatge i frases naturals usada en el discurs comú. @ca
definition: Relateert een nomen aan een actor die een benaming van actor heeft in natuurlijke taal en terminologie in gebruikelijke bewoording. @nl
definition: Relaterer et nomen til en agent som har en betegnelse for agent på et naturlig språk og med frasering brukt i alminnelig diskurs. @no
definition: Relaterer et nomen til en agent, som har en benævnelse på agent på normalsprog og med formuleringer, som bruges alment. @da
definition: Relates a nomen to an agent who has an appellation of agent in natural language and phrasing used in common discourse.
definition: Sasaista nomenu ar aģentu, kam ir apzīmējums dabiskajā valodā, ko izmanto savstarpējā saziņā. @lv
definition: Seostab nomen'i tegijaga, kellel on nimetus loomulikus keeles ja sõnastuses, mida kasutatakse ühises diskursuses. @et
definition: Setzt ein Nomen in Beziehung zu einem Akteur, der über eine Bezeichnung für einen Akteur in natürlicher Sprache und Ausdrucksweise verfügt, die beim normalen Sprechen und Schreiben verwendet wird. @de
definition: يربط تسمية بوكيل له اسم وكيل في اللغة الطبيعية المستخدمة في الخطاب العام. @ar
definition: 将一个命名与有用自然语言和普通话语措词表达的行为者的称谓的一个行为者关联起来。 @zh-hans

is name of collective agent of
has element type: 2
toolkit definition: A collective agent who has an appellation of collective agent in natural language and phrasing used in common discourse.
toolkit definition: Agent collectif qui possède une appellation d’agent collectif exprimée dans un langage et une formulation naturels et utilisée dans le langage courant. @fr
toolkit definition: Agent col·lectiu que té una apel·lació d’agent col·lectiu en llenguatge i frases naturals usada en el discurs comú. @ca
toolkit definition: Doğal dilde ve ortak söylemde kullanılan ifadelerde kolektif temsilci unvanına sahip kolektif bir temsilci. @tr
toolkit definition: Een collectieve actor die een benaming van collectieve actor heeft in natuurlijke taal en terminologie in gebruikelijke bewoording. @nl
toolkit definition: Egy kollektív ágens, amelynek van egy kollektív ágenshez tartozó megnevezése természetes nyelven és közbeszédben használt kifejezéssel. @hu
toolkit definition: Ein gemeinschaftlicher Akteur, der über eine Bezeichnung für einen gemeinschaftlicher Akteur in natürlicher Sprache und Ausdrucksweise verfügt, die beim normalen Sprechen und Schreiben verwendet wird. @de
toolkit definition: En kollektiv agent som har en betegnelse for kollektiv agent på et naturlig språk og med frasering brukt i alminnelig diskurs. @no
toolkit definition: Grupa, kam ir apzīmējums dabiskajā valodā, ko izmanto savstarpējā saziņā. @lv
toolkit definition: Kollektiiv, kellel on nimetus loomulikus keeles ja sõnastuses, mida kasutatakse ühises diskursuses. @et
toolkit definition: Kollektiv agent, som har en benævnelse på kollektiv agent på normalsprog og med formuleringer, som bruges alment. @da
toolkit definition: Un agente collettivo che ha una designazione di agente collettivo in linguaggio e frasi naturali usati nel discorso comune. @it
toolkit definition: Yhteistoimija, jolla on luonnollisen kielen ja yleisen diskurssin sanamuodon mukainen nimitys. @fi
toolkit definition: وكيل جماعي له اسم وكيل جماعي في اللغة الطبيعية وفي العبارات المستخدمة في الخطاب العام. @ar
toolkit definition: 有用自然语言和普通话语措词表达的集体行为者的称谓的一个集体行为者 @zh-hans
toolkit label: Name eines gemeinschaftlichen Akteurs von @de
toolkit label: ir vārds/nosaukums grupai @lv
toolkit label: kolektif temsilcisinin adı @tr
toolkit label: kollektívágens-neve: @hu
toolkit label: naam van collectieve actor van @nl
toolkit label: name of collective agent of
toolkit label: navn på kollektiv agent af @da
toolkit label: navn på kollektiv agent for @no
toolkit label: nimi kollektiivile @et
toolkit label: nimi yhteistoimijalle @fi
toolkit label: nom d’agent collectif de @fr
toolkit label: nom d’agent col·lectiu de @ca
toolkit label: nome di agente collettivo di @it
toolkit label: اسم وكيل جماعي لـ @ar
toolkit label: ……的集体行为者的名称 @zh-hans
has subproperty: is name of corporate body of
has subproperty: is name of family of
has subproperty: is preferred name of collective agent of
has subproperty: is variant name of collective agent of
has subproperty: P80053
lexical alias: nameOfCollectiveAgentOf.en
status: Published
type: Property
domain: C10012
label: er navn på kollektiv agent af @da
label: er navn på kollektiv agent for @no
label: est un nom d’agent collectif de @fr
label: ir vārds/nosaukums grupai @lv
label: is naam van collectieve actor van @nl
label: ist Name eines gemeinschaftlichen Akteurs von @de
label: kolektif temsilcisinin adıdır @tr
label: kollektívágens-neve a következőnek: @hu
label: nimi kollektiivile @et
label: nimi yhteistoimijalle @fi
label: è nome di agente collettivo di @it
label: és nom d’agent col·lectiu de @ca
label: هو اسم وكيل جماعي لـ @ar
label: 是……的集体行为者的名称 @zh-hans
sub property of: is appellation of collective agent of
sub property of: is name of agent of
definition: Bir ismi, doğal dilde ve ortak söylemde kullanılan ifadelerde kolektif temsilci unvanına sahip olan kolektif bir temsilciyle ilişkilendirir. @tr
definition: Correla un nomen a un agente collettivo che ha una designazione di agente collettivo in linguaggio e frasi naturali usati nel discorso comune. @it
definition: Hozzákapcsol egy noment egy kollektív ágenshez, amelynek van egy kollektív ágenshez tartozó megnevezése természetes nyelven és közbeszédben használt kifejezéssel. @hu
definition: Liittää nomenin yhteistoimijaan, jolla on luonnollisen kielen ja yleisen diskurssin sanamuodon mukainen nimitys. @fi
definition: Met un nomen en relation avec un agent collectif qui possède une appellation d’agent collectif exprimée dans un langage et une formulation naturels et utilisée dans le langage courant. @fr
definition: Relaciona un nomen amb un agent col·lectiu que té una apel·lació d’agent col·lectiu en llenguatge i frases naturals usada en el discurs comú. @ca
definition: Relateert een nomen aan een collectieve actor die een benaming van collectieve actor heeft in natuurlijke taal en terminologie in gebruikelijke bewoording. @nl
definition: Relaterer et nomen til en kollektiv agent som har en betegnelse for kollektiv agent på et naturlig språk og med frasering brukt i alminnelig diskurs. @no
definition: Relaterer et nomen til en kollektiv agent, som har en benævnelse på kollektiv agent på normalsprog og med formuleringer, som bruges alment. @da
definition: Relates a nomen to a collective agent who has an appellation of collective agent in natural language and phrasing used in common discourse.
definition: Sasaista nomenu ar grupu, kam ir apzīmējums dabiskajā valodā, ko izmanto savstarpējā saziņā. @lv
definition: Seostab nomen'i kollektiiviga, kellel on nimetus loomulikus keeles ja sõnastuses, mida kasutatakse ühises diskursuses. @et
definition: Setzt ein Nomen in Beziehung zu einem gemeinschaftlichen Akteur, der über eine Bezeichnung für einen gemeinschaftlicher Akteur in natürlicher Sprache und Ausdrucksweise verfügt, die beim normalen Sprechen und Schreiben verwendet wird. @de
definition: يربط تسمية بوكيل جماعي له اسم وكيل جماعي في اللغة الطبيعية وفي العبارات المستخدمة في الخطاب العام. @ar
definition: 将一个命名与有用自然语言和普通话语措词表达的集体行为者的称谓的一个集体行为者关联起来。 @zh-hans

is name of corporate body of
has element type: 2
toolkit definition: A corporate body who has an appellation of corporate body in natural language and phrasing used in common discourse.
toolkit definition: Asutus, kellel on nimetus loomulikus keeles ja sõnastuses, mida kasutatakse ühises diskursuses. @et
toolkit definition: Collectivité qui possède une appellation de collectivité exprimée dans un langage et une formulation naturels et utilisée dans le langage courant. @fr
toolkit definition: Doğal dilde ve ortak söylemde kullanılan ifadelerde tüzel kişi unvanına sahip bir tüzel kişi. @tr
toolkit definition: Een corporatie die een benaming van corporatie heeft in natuurlijke taal en terminologie in gebruikelijke bewoording. @nl
toolkit definition: Egy testület, amelynek van egy testülethez tartozó megnevezése természetes nyelven és közbeszédben használt kifejezéssel. @hu
toolkit definition: Eine Körperschaft, die über eine Bezeichnung für eine Körperschaft in natürlicher Sprache und Ausdrucksweise verfügt, die beim normalen Sprechen und Schreiben verwendet wird. @de
toolkit definition: En korporasjon som har en betegnelse for korporasjon på et naturlig språk og med frasering brukt i alminnelig diskurs. @no
toolkit definition: Entitat corporativa que té una apel·lació d’entitat corporativa en llenguatge i frases naturals usada en el discurs comú. @ca
toolkit definition: Institūcija, kam ir apzīmējums dabiskajā valodā, ko izmanto savstarpējā saziņā. @lv
toolkit definition: Korporation, som har en benævnelse på korporation på normalsprog og med formuleringer, som bruges alment. @da
toolkit definition: Un ente che ha una designazione di ente nel linguaggio naturale e una formulazione usata nel linguaggio comune. @it
toolkit definition: Yhteisö, jolla on luonnollisen kielen ja yleisen diskurssin sanamuodon mukainen nimitys. @fi
toolkit definition: هيئة لها اسم هيئة في اللغة الطبيعية وفي العبارات المستخدمة في الخطاب العام. @ar
toolkit definition: 有用自然语言和普通话语措词表达的团体的称谓的一个团体 @zh-hans
toolkit label: Name einer Körperschaft von @de
toolkit label: ir vārds/nosaukums institūcijai @lv
toolkit label: naam van corporatie van @nl
toolkit label: name of corporate body of
toolkit label: navn på korporasjon for @no
toolkit label: navn på korporation af @da
toolkit label: nimi asutusele @et
toolkit label: nimi yhteisölle @fi
toolkit label: nom de collectivité de @fr
toolkit label: nom d’entitat corporativa de @ca
toolkit label: nome di ente di @it
toolkit label: tárgya a következő testületnek: @hu
toolkit label: tüzel kişiliğin adı @tr
toolkit label: اسم هيئة لـ @ar
toolkit label: ……的团体的名称 @zh-hans
has subproperty: is preferred name of corporate body of
has subproperty: is variant name of corporate body of
has subproperty: P80054
lexical alias: nameOfCorporateBodyOf.en
status: Published
type: Property
domain: C10012
label: er navn på korporasjon for @no
label: er navn på korporation af @da
label: est un nom de collectivité de @fr
label: ir vārds/nosaukums institūcijai @lv
label: is naam van corporatie van @nl
label: ist Name einer Körperschaft von @de
label: nimi asutusele @et
label: nimi yhteisölle @fi
label: tárgya a következő testületnek: @hu
label: tüzel kişisinin adıdır @tr
label: è nome di ente di @it
label: és nom d’entitat corporativa de @ca
label: هو اسم هيئة لـ @ar
label: 是……的团体的名称 @zh-hans
sub property of: is appellation of corporate body of
sub property of: is name of collective agent of
definition: Bir ismi, doğal dilde ve ortak söylemde kullanılan ifadelerde tüzel kişi unvanına sahip bir tüzel kişiyle ilişkilendirir. @tr
definition: Correla un nomen a un ente che ha una designazione di ente in linguaggio e frasi naturali usati nel discorso comune. @it
definition: Hozzákapcsol egy noment egy testülethez, amelynek van egy testülethez tartozó megnevezése természetes nyelven és közbeszédben használt kifejezéssel. @hu
definition: Liittää nomenin yhteisöön, jolla on luonnollisen kielen ja yleisen diskurssin sanamuodon mukainen nimitys. @fi
definition: Met un nomen en relation avec une collectivité qui possède une appellation de collectivité exprimée dans un langage et une formulation naturels et utilisée dans le langage courant. @fr
definition: Relaciona un nomen amb una entitat corporativa que té una apel·lació d’entitat corporativa en llenguatge i frases naturals usada en el discurs comú. @ca
definition: Relateert een nomen aan een corporatie die een benaming van corporatie heeft in natuurlijke taal en terminologie in gebruikelijke bewoording. @nl
definition: Relaterer et nomen til en korporasjon som har en betegnelse for korporasjon på et naturlig språk og med frasering brukt i alminnelig diskurs. @no
definition: Relaterer et nomen til en korporation, som har en benævnelse på korporation på normalsprog og med formuleringer, som bruges alment. @da
definition: Relates a nomen to a corporate body who has an appellation of corporate body in natural language and phrasing used in common discourse.
definition: Sasaista nomenu ar institūciju, kam ir apzīmējums dabiskajā valodā, ko izmanto savstarpējā saziņā. @lv
definition: Seostab nomen'i asutusega, kellel on nimetus loomulikus keeles ja sõnastuses, mida kasutatakse ühises diskursuses. @et
definition: Setzt ein Nomen in Beziehung zu einer Körperschaft, die über eine Bezeichnung für eine Körperschaft in natürlicher Sprache und Ausdrucksweise verfügt, die beim normalen Sprechen und Schreiben verwendet wird. @de
definition: يربط تسمية بهيئة لها تسمية هيئة في اللغة الطبيعية وفي العبارات المستخدمة في الخطاب العام. @ar
definition: 将一个命名与有用自然语言和普通话语措词表达的团体的称谓的一个团体关联起来。 @zh-hans

is name of family of
has element type: 2
toolkit definition: A family who has an appellation of family in natural language and phrasing used in common discourse.
toolkit definition: Doğal dilde ve ortak söylemde kullanılan anlatımlarda aile unvanına sahip bir aile. @tr
toolkit definition: Dzimta/ģimene, kam ir apzīmējums dabiskajā valodā, ko izmanto savstarpējā saziņā. @lv
toolkit definition: Een familie die een benaming van familie heeft in natuurlijke taal en terminologie in gebruikelijke bewoording. @nl
toolkit definition: Egy család, amelynek van egy családhoz tartozó megnevezése természetes nyelven és közbeszédben használt kifejezéssel. @hu
toolkit definition: Einer Familie, die über eine Bezeichnung für eine Familie in natürlicher Sprache und Ausdrucksweise verfügt, die beim normalen Sprechen und Schreiben verwendet wird. @de
toolkit definition: En familie som har en betegnelse for familie på et naturlig språk og med frasering brukt i alminnelig diskurs. @no
toolkit definition: Familie, som har en benævnelse på familie på normalsprog og med formuleringer, som bruges alment. @da
toolkit definition: Famille qui possède une appellation de famille exprimée dans un langage et une formulation naturels et utilisée dans le langage courant. @fr
toolkit definition: Família que té una apel·lació de família en llenguatge i frases naturals usada en el discurs comú. @ca
toolkit definition: Perekond, kellel on nimetus loomulikus keeles ja sõnastuses, mida kasutatakse ühises diskursuses. @et
toolkit definition: Suku, jolla on luonnollisen kielen ja yleisen diskurssin sanamuodon mukainen nimitys. @fi
toolkit definition: Una famiglia che ha una designazione di famiglia in linguaggio e frasi naturali usati nel discorso comune. @it
toolkit definition: عائلة لها اسم في اللغة الطبيعية وفي العبارات المستخدمة في الخطاب العام. @ar
toolkit definition: 有用自然语言和普通话语措词表达的家族的称谓的一个家族 @zh-hans
toolkit label: Name einer Familie von @de
toolkit label: aile adı @tr
toolkit label: családneve: @hu
toolkit label: ir vārds/nosaukums dzimtai/ģimenei @lv
toolkit label: naam van familie van @nl
toolkit label: name of family of
toolkit label: navn på familie af @da
toolkit label: navn på familie for @no
toolkit label: nimi perekonnale @et
toolkit label: nimi suvulle @fi
toolkit label: nom de família de @ca
toolkit label: nom d’une famille de @fr
toolkit label: nome di famiglia di @it
toolkit label: اسم عائلة لـ @ar
toolkit label: ……的家族的名称 @zh-hans
has subproperty: is preferred name of family of
has subproperty: is variant name of family of
has subproperty: P80055
lexical alias: nameOfFamilyOf.en
status: Published
type: Property
domain: C10012
label: ailesinin adıdır @tr
label: családneve a következőnek: @hu
label: er navn på familie af @da
label: er navn på familie for @no
label: est un nom d’une famille de @fr
label: ir vārds/nosaukums dzimtai/ģimenei @lv
label: is naam van familie van @nl
label: ist Name einer Familie von @de
label: nimi perekonnale @et
label: nimi suvulle @fi
label: è nome di famiglia di @it
label: és nom de família de @ca
label: هو اسم عائلة لـ @ar
label: 是……的家族的名称 @zh-hans
sub property of: is appellation of family of
sub property of: is name of collective agent of
definition: Bir ismi, doğal dilde ve ortak söylemde kullanılan ifadelerde aile unvanına sahip bir aileyle ilişkilendirir. @tr
definition: Correla un nomen a una famiglia che ha una designazione di famiglia in linguaggio e frasi naturali usati nel discorso comune. @it
definition: Hozzákapcsol egy noment egy családhoz, amelynek van egy családhoz tartozó megnevezése természetes nyelven és közbeszédben használt kifejezéssel. @hu
definition: Liittää nomenin sukuun, jolla on luonnollisen kielen ja yleisen diskurssin sanamuodon mukainen nimitys. @fi
definition: Met un nomen en relation avec une famille qui possède une appellation de famille exprimée dans un langage et une formulation naturels et utilisée dans le langage courant. @fr
definition: Relaciona un nomen amb una família que té una apel·lació de família en llenguatge i frases naturals usada en el discurs comú. @ca
definition: Relateert een nomen aan een familie die een benaming van familie heeft in natuurlijke taal en terminologie in gebruikelijke bewoording. @nl
definition: Relaterer et nomen til en familie som har en betegnelse for familie på et naturlig språk og med frasering brukt i alminnelig diskurs. @no
definition: Relaterer et nomen til en familie, som har en benævnelse på familie på normalsprog og med formuleringer, som bruges alment. @da
definition: Relates a nomen to a family who has an appellation of family in natural language and phrasing used in common discourse.
definition: Sasaista nomenu ar dzimtu/ģimeni, kam ir apzīmējums dabiskajā valodā, ko izmanto savstarpējā saziņā. @lv
definition: Seostab nomen'i perekonnaga, kellel on nimetus loomulikus keeles ja sõnastuses, mida kasutatakse ühises diskursuses. @et
definition: Setzt ein Nomen in Beziehung zu einer Familie, die über eine Bezeichnung für eine Familie in natürlicher Sprache und Ausdrucksweise verfügt, die beim normalen Sprechen und Schreiben verwendet wird. @de
definition: يربط تسمية بعائلة لها اسم في اللغة الطبيعية وفي العبارات المستخدمة في الخطاب العام. @ar
definition: 将一个命名与有用自然语言和普通话语措词表达的家族的称谓的一个家族关联起来。 @zh-hans

is name of person of
has element type: 2
toolkit definition: A person who has an appellation of person in natural language and phrasing used in common discourse.
toolkit definition: Doğal dilde ve ortak söylemde kullanılan ifadelerde kişi unvanına sahip bir kişi. @tr
toolkit definition: Een persoon die een benaming van persoon heeft in natuurlijke taal en terminologie in gebruikelijke bewoording. @nl
toolkit definition: Egy személy, amelynek van egy személyhez tartozó megnevezése természetes nyelven és közbeszédben használt kifejezéssel. @hu
toolkit definition: Eine Person, die über eine Bezeichnung für eine Person in natürlicher Sprache und Ausdrucksweise verfügt, die beim normalen Sprechen und Schreiben verwendet wird. @de
toolkit definition: En person som har en betegnelse for person på et naturlig språk og med frasering brukt i alminnelig diskurs. @no
toolkit definition: Henkilö, jolla on luonnollisen kielen ja yleisen diskurssin sanamuodon mukainen nimitys. @fi
toolkit definition: Isik, kellel on nimetus loomulikus keeles ja sõnastuses, mida kasutatakse ühises diskursuses. @et
toolkit definition: Person, som har en benævnelse på person på normalsprog og med formuleringer, som bruges alment. @da
toolkit definition: Persona que té una apel·lació de persona en llenguatge i frases naturals usada en el discurs comú. @ca
toolkit definition: Persona, kurai ir apzīmējums dabiskajā valodā, ko izmanto savstarpējā saziņā. @lv
toolkit definition: Personne qui possède une appellation de personne exprimée dans un langage et une formulation naturels et utilisée dans le langage courant. @fr
toolkit definition: Una persona che ha una designazione di persona in linguaggio e frasi naturali usati nel discorso comune. @it
toolkit definition: شخص له اسم شخص في اللغة الطبيعية والعبارات المستخدمة في الخطاب العام. @ar
toolkit definition: 有用自然语言和普通话语措词表达的个人的称谓的一个个人 @zh-hans
toolkit label: Name einer Person von @de
toolkit label: ir vārds personai @lv
toolkit label: kişi adı @tr
toolkit label: naam van persoon van @nl
toolkit label: name of person of
toolkit label: navn på person af @da
toolkit label: navn på person for @no
toolkit label: nimi henkilölle @fi
toolkit label: nimi isikule @et
toolkit label: nom de persona de @ca
toolkit label: nom de personne de @fr
toolkit label: nome di persona di @it
toolkit label: személyneve: @hu
toolkit label: اسم شخص لـ @ar
toolkit label: ……的个人的名称 @zh-hans
has subproperty: is preferred name of person of
has subproperty: is variant name of person of
has subproperty: is given name of
has subproperty: is surname of
has subproperty: is fuller form of name of
has subproperty: P80056
lexical alias: nameOfPersonOf.en
status: Published
type: Property
domain: C10012
label: er navn på person af @da
label: er navn på person for @no
label: est un nom de personne de @fr
label: ir vārds personai @lv
label: is naam van persoon van @nl
label: ist Name einer Person von @de
label: kişisinin adıdır @tr
label: nimi henkilölle @fi
label: nimi isikule @et
label: személyneve a következőnek: @hu
label: è nome di persona di @it
label: és nom de persona de @ca
label: هو اسم شخص لـ @ar
label: 是……的个人的名称 @zh-hans
sub property of: is appellation of person of
sub property of: is name of agent of
definition: Bir ismi, doğal dilde ve ortak söylemde kullanılan ifadelerde kişi unvanına sahip bir kişiyle ilişkilendirir. @tr
definition: Correla un nomen a una persona che ha una designazione di persona in linguaggio e frasi naturali usati nel discorso comune. @it
definition: Hozzákapcsol egy noment egy személyhez, amelynek van egy személyhez tartozó megnevezése természetes nyelven és közbeszédben használt kifejezéssel. @hu
definition: Liittää nomenin henkilöön, jolla on luonnollisen kielen ja yleisen diskurssin sanamuodon mukainen nimitys. @fi
definition: Met un nomen en relation avec une personne qui possède une appellation de personne exprimée dans un langage et une formulation naturels et utilisée dans le langage courant. @fr
definition: Relaciona un nomen amb una persona que té una apel·lació de persona en llenguatge i frases naturals usada en el discurs comú. @ca
definition: Relateert een nomen aan een persoon die een benaming van persoon heeft in natuurlijke taal en terminologie in gebruikelijke bewoording. @nl
definition: Relaterer et nomen til en person som har en betegnelse for person på et naturlig språk og med frasering brukt i alminnelig diskurs. @no
definition: Relaterer et nomen til en person, som har en benævnelse på person på normalsprog og med formuleringer, som bruges alment. @da
definition: Relates a nomen to a person who has an appellation of person in natural language and phrasing used in common discourse.
definition: Sasaista nomenu ar personu, kurai ir apzīmējums dabiskajā valodā, ko izmanto savstarpējā saziņā. @lv
definition: Seostab nomen'i isikuga, kellel on nimetus loomulikus keeles ja sõnastuses, mida kasutatakse ühises diskursuses. @et
definition: Setzt ein Nomen in Beziehung zu einer Person, die über eine Bezeichnung für eine Person in natürlicher Sprache und Ausdrucksweise verfügt, die beim normalen Sprechen und Schreiben verwendet wird. @de
definition: يربط تسمية بشخص له اسم شخص في اللغة الطبيعية والعبارات المستخدمة في الخطاب العام. @ar
definition: 将一个命名与有用自然语言和普通话语措词表达的个人的称谓的一个个人关联起来。 @zh-hans

is abbreviated title of
has element type: 2
toolkit definition: A manifestation that has a title of manifestation that has been abbreviated for purposes of indexing or identification.
toolkit definition: Een manifestatie die een titel van manifestatie heeft die ingekort is ten behoeve van indexeren of identificatie. @nl
toolkit definition: Egy megjelenési forma, amelynek címét indexelés vagy azonosítás céljából rövidítették. @hu
toolkit definition: Eine Manifestation, die einen Titel einer Manifestation hat, der zum Zwecke der Indexierung oder der Identifizierung gekürzt wurde. @de
toolkit definition: En manifestasjon som har en tittel for manifestasjon som er blitt forkortet for bruk til indeksering og identifikasjon. @no
toolkit definition: Kehastus, milles on kehastuse pealkiri esitatud indekseerimise või identifitseerimise tarbeks lühendatud kujul. @et
toolkit definition: Manifestaatio, jonka nimeke on lyhennetty indeksointia ja tunnistamista varten. @fi
toolkit definition: Manifestació que té un títol de manifestació que ha estat abreujat amb la finalitat de la indexació o la identificació. @ca
toolkit definition: Manifestation qui possède un titre de manifestation qui a été abrégé à des fins d’indexation ou d’identification. @fr
toolkit definition: Manifestation, som har en titel på manifestation, som er blevet forkortet med henblik på indeksering eller identifikation. @da
toolkit definition: Manifestācija, kam ir manifestācijas nosaukums, kas ticis saīsināts priekšmetošanas vai idendeksēšanas vajadzībām. @lv
toolkit definition: Una manifestazione che ha un titolo della manifestazione che è stato abbreviato per finalità di indicizzazione o identificazione. @it
toolkit definition: İndeksleme veya tanımlama amacıyla kısaltılmış bir gösterim başlığına sahip bir gösterim. @tr
toolkit definition: تجسيدة لها عنوان تجسيدة تم اختصاره لغرض التكشيف أو التعريف. @ar
toolkit definition: 有用于索引或标识目的被缩略的载体表现题名的一种载体表现 @zh-hans
toolkit label: Hozzákapcsol egy noment egy megjelenési formához, amelynek címét indexelés vagy azonosítás céljából rövidítették. @hu
toolkit label: Kurztitel von @de
toolkit label: abbreviated title of
toolkit label: afgekorte titel van @nl
toolkit label: forkortet titel på @da
toolkit label: forkortet tittel for @no
toolkit label: ir saīsināts nosaukums no @lv
toolkit label: kısaltılmış başlık @tr
toolkit label: lyhennetty nimeke manifestaatiolle @fi
toolkit label: lühendatud pealkiri kehastuses @et
toolkit label: titolo abbreviato di @it
toolkit label: titre abrégé de @fr
toolkit label: títol abreujat de @ca
toolkit label: عنوان مختصر لـ @ar
toolkit label: ……的缩略题名 @zh-hans
has subproperty: P80057
lexical alias: abbreviatedTitleOf.en
status: Published
type: Property
domain: C10012
label: er forkortet titel på @da
label: er forkortet tittel for @no
label: est un titre abrégé de @fr
label: ir saīsināts nosaukums no @lv
label: is afgekorte titel van @nl
label: ist Kurztitel von @de
label: kısaltılmış başlığıdır @tr
label: lyhennetty nimeke manifestaatiolle @fi
label: lühendatud pealkiri kehastuses @et
label: rövidített címe a következőnek: @hu
label: è titolo abbreviato di @it
label: és títol abreujat de @ca
label: هو عنوان مختصر لـ @ar
label: 是……的缩略题名 @zh-hans
sub property of: is variant title of manifestation of
definition: Bir ismi, dizinleme veya tanımlama amacıyla kısaltılmış bir gösterim başlığına sahip bir gösterimle ilişkilendirir. @tr
definition: Correla un nomen a una manifestazione che ha un titolo della manifestazione che è stato abbreviato per finalità di indicizzazione o identificazione. @it
definition: Liittää nomenin manifestaatioon, jonka nimeke on lyhennetty indeksointia ja tunnistamista varten. @fi
definition: Met un nomen en relation avec une manifestation qui possède un titre de manifestation qui a été abrégé à des fins d’indexation ou d’identification. @fr
definition: Relaciona un nomen amb una manifestació que té un títol de manifestació que ha estat abreujat amb la finalitat de la indexació o la identificació. @ca
definition: Relateert een nomen aan een manifestatie die een titel van manifestatie heeft die ingekort is ten behoeve van indexeren of identificatie. @nl
definition: Relaterer et nomen til en manifestasjon som har en tittel for manifestasjon som er blitt forkortet for bruk til indeksering og identifikasjon. @no
definition: Relaterer et nomen til en manifestation, som har en titel på manifestation, som er blevet forkortet med henblik på indeksering eller identifikation. @da
definition: Relates a nomen to a manifestation that has a title of manifestation that has been abbreviated for purposes of indexing or identification.
definition: Sasaista nomenu ar manifestāciju, kam ir manifestācijas nosaukums, kas ticis saīsināts priekšmetošanas vai idendeksēšanas vajadzībām. @lv
definition: Seostab nomen'i kehastusega, milles on kehastuse pealkiri esitatud indekseerimise või identifitseerimise tarbeks lühendatud kujul. @et
definition: Setzt ein Nomen in Beziehung zu einer Manifestation, die einen Titel einer Manifestation hat, der zum Zwecke der Indexierung oder der Identifizierung gekürzt wurde. @de
definition: rövidített címe: @hu
definition: يربط تسمية بتجسيدة لها عنوان تجسيدة تم اختصاره لغرض التكشيف أو التعريف. @ar
definition: 将一个命名与有用于索引或标识目的被缩略的载体表现题名的一种载体表现关联起来。 @zh-hans

has part nomen
has element type: 2
toolkit definition: A nomen that is a discrete component of another nomen.
toolkit definition: Başka bir ismin ayrı bir bileşeni olan bir isim. @tr
toolkit definition: Een nomen dat een afzonderlijk deel is van een andere nomen. @nl
toolkit definition: Egy nomen, amely egy másik nomen elkülöníthető alkotórésze. @hu
toolkit definition: Ein Nomen, das ein eigenständiger Bestandteil eines anderen Nomens ist. @de
toolkit definition: Et nomen som er en avgrenset del av et annet nomen. @no
toolkit definition: Nomen que és un component discret d’un altre nomen. @ca
toolkit definition: Nomen qui constitue une composante distincte d’un autre nomen. @fr
toolkit definition: Nomen, joka on itsenäinen osa toista nomenia. @fi
toolkit definition: Nomen, mis on teise nomen'i iseseisev koostisosa. @et
toolkit definition: Nomen, som er en adskilt komponent af et andet nomen. @da
toolkit definition: Nomens, kas ir cita nomena sastāvdaļa. @lv
toolkit definition: Un nomen che è una componente separata di un altro nomen. @it
toolkit definition: تسمية عبارة عن جزء منفصل عن تسمية أخرى. @ar
toolkit definition: 作为另一个命名之独立组成部分的一个命名 @zh-hans
toolkit label: Teil-Nomen @de
toolkit label: deel nomen @nl
toolkit label: del af nomen @da
toolkit label: del av nomen @no
toolkit label: niteleyici ismin bölümü @tr
toolkit label: nomen de part @ca
toolkit label: nomen'i osa @et
toolkit label: nomenin osa @fi
toolkit label: nomens: daļa @lv
toolkit label: part nomen
toolkit label: parte di nomen @it
toolkit label: partie de nomen @fr
toolkit label: résznomenje: @hu
toolkit label: تسمية جزئية @ar
toolkit label: 部分命名 @zh-hans
has subproperty: P80058
lexical alias: partNomen.en
status: Published
type: Property
domain: C10012
label: a pour partie de nomen @fr
label: ha come parte di nomen @it
label: har del af nomen @da
label: har del av nomen @no
label: hat Teil-Nomen @de
label: heeft deel nomen @nl
label: isim bileşeni ile ilişkilidir @tr
label: nomen'i osa @et
label: nomenin osa @fi
label: nomens: daļa @lv
label: résznomenje a következő: @hu
label: té com a nomen de part @ca
label: لها تسمية جزئية @ar
label: 有部分命名 @zh-hans
sub property of: has related nomen of nomen
definition: Bir ismi, başka bir niteleyici ismin ayrı bir bileşeni olan bir niteleyici isimle ilişkilendirir. @tr
definition: Correla un nomen a un nomen che è una componente separata di un altro nomen. @it
definition: Hozzákapcsol egy noment egy nomenhez, amely egy másik nomen elkülöníthető alkotóeleme. @hu
definition: Liittää nomenin nomeniin, joka on itsenäinen osa toista nomenia. @fi
definition: Met un nomen en relation avec un nomen qui constitue une composante distincte d’un autre nomen. @fr
definition: Relaciona un nomen amb un nomen que és un component discret d’un altre nomen. @ca
definition: Relateert een nomen aan een nomen dat een afzonderlijk deel is van een andere nomen. @nl
definition: Relaterer et nomen til et nomen som er en avgrenset del av et annet nomen. @no
definition: Relaterer et nomen til et nomen, som er en adskilt komponent af et andet nomen. @da
definition: Relates a nomen to a nomen that is a discrete component of another nomen.
definition: Sasaista nomenu ar nomenu, kas ir cita nomena sastāvdaļa. @lv
definition: Seostab nomen'i nomen'iga, mis on teise nomen'i iseseisev koostisosa. @et
definition: Setzt ein Nomen in Beziehung zu einem Nomen, das ein eigenständiger Bestandteil eines anderen Nomens ist. @de
definition: يربط تسمية بتسمية هي جزء منفصل من تسمية أخرى. @ar
definition: 将一个命名与作为另一个命名之独立组成部分的一个命名关联起来。 @zh-hans

is part of nomen
has element type: 2
toolkit definition: A nomen that has another nomen as a discrete component.
toolkit definition: Başka bir ismi ayrık olarak içeren bir isim. @tr
toolkit definition: Een nomen dat een andere nomen als afzonderlijk deel heeft. @nl
toolkit definition: Egy nomen, amelynek van egy másik nomenje, mint elkülöníthető alkotóelem. @hu
toolkit definition: Ein Nomen, das ein anderes Nomen als einzelnen Bestandteil enthält. @de
toolkit definition: Et nomen som har et annet nomen som en avgrenset del. @no
toolkit definition: Nomen que té un altre nomen com a component discret. @ca
toolkit definition: Nomen, jonka itsenäinen osa toinen nomen on. @fi
toolkit definition: Nomen, millesse kuulub iseseisva koostisosana teine nomen. @et
toolkit definition: Nomen, som har et andet nomen som en adskilt komponent. @da
toolkit definition: Nomens, kuram ir cits nomens kā atsevišķa sastāvdaļa. @lv
toolkit definition: Un nomen che ha un altro nomen come componente distinta. @it
toolkit definition: Œuvre qui a pour composante distincte un autre nomen. @fr
toolkit definition: تسمية لها تسمية أخرى كجزء منفصل. @ar
toolkit definition: 有另一个命名作为独立组成部分的一个命名 @zh-hans
toolkit label: Teil von (Nomen) @de
toolkit label: daļa nomenā @lv
toolkit label: deel van nomen @nl
toolkit label: del af nomen @da
toolkit label: del av nomen @no
toolkit label: niteleyici ismin bölümü @tr
toolkit label: osa nomen'ist @et
toolkit label: osa nomenia @fi
toolkit label: part d’un nomen @ca
toolkit label: part of nomen
toolkit label: parte del nomen @it
toolkit label: partie de nomen de @fr
toolkit label: résznomene: @hu
toolkit label: جزء من تسمية @ar
toolkit label: 命名的部分 @zh-hans
has subproperty: P80059
lexical alias: partOfNomen.en
status: Published
type: Property
domain: C10012
label: er del af nomen @da
label: er del av nomen @no
label: est une partie de nomen de @fr
label: ir daļa nomenā @lv
label: is deel van nomen @nl
label: ismin bir bileşenidir @tr
label: ist Teil von (Nomen) @de
label: osa nomen'ist @et
label: osa nomenia @fi
label: résznomene a következőnek: @hu
label: è parte del nomen @it
label: és part d’un nomen @ca
label: هي جزء من تسمية @ar
label: 是命名的部分 @zh-hans
sub property of: has related nomen of nomen
definition: Bir ismi, ayrı bir bileşen olarak başka bir niteleyici isme sahip olan bir niteleyici isimle ilişkilendirir. @tr
definition: Correla un nomen a un nomen che ha un altro nomen come componente separata. @it
definition: Hozzákapcsol egy noment egy nomenhez, amelynek van egy másik nomenje, mint elkülöníthető alkotóelem. @hu
definition: Liittää nomenin nomeniin, jonka itsenäinen osa toinen nomen on. @fi
definition: Met un nomen en relation avec une œuvre qui a pour composante distincte un autre nomen. @fr
definition: Relaciona un nomen amb un nomen que té un altre nomen com a component discret. @ca
definition: Relateert een nomen aan een nomen dat een andere nomen als afzonderlijk deel heeft. @nl
definition: Relaterer et nomen til et nomen som har et annet nomen som en avgrenset del. @no
definition: Relaterer et nomen til et nomen, som har et andet nomen som en adskilt komponent. @da
definition: Relates a nomen to a nomen that has another nomen as a discrete component.
definition: Sasaista nomenu ar nomenu, kuram ir cits nomens kā atsevišķa sastāvdaļa. @lv
definition: Seostab nomen'i nomen'iga, millesse kuulub iseseisva koostisosana teine nomen. @et
definition: Setzt ein Nomen in Beziehung zu einem Nomen, das ein anderes Nomen als einzelnen Bestandteil enthält. @de
definition: يربط تسمية بتسمية لها تسمية أخرى كجزء منفصل. @ar
definition: 将一个命名与有另一个命名作为独立组成部分的一个命名关联起来。 @zh-hans

has derivation
has element type: 2
toolkit definition: A nomen that is based on another nomen.
toolkit definition: Başka bir isme dayanan bir isim. @tr
toolkit definition: Een nomen dat gebaseerd is op een andere nomen. @nl
toolkit definition: Egy nomen, amely egy másik nomenen alapul. @hu
toolkit definition: Ein Nomen, das auf einem anderen Nomen basiert. @de
toolkit definition: Et nomen som er basert på et annet nomen. @no
toolkit definition: Nomen que es basa en un altre nomen. @ca
toolkit definition: Nomen qui est basé sur un autre nomen. @fr
toolkit definition: Nomen, joka perustuu toiseen nomeniin. @fi
toolkit definition: Nomen, mis põhineb teisel nomen'il. @et
toolkit definition: Nomen, som er baseret på et andet nomen. @da
toolkit definition: Nomens, kas balstīts uz citu nomenu. @lv
toolkit definition: Un nomen che è basato su un altro nomen. @it
toolkit definition: تسمية مأخوذة من تسمية أخرى. @ar
toolkit definition: 基于另一个命名的一个命名 @zh-hans
toolkit label: Ableitung @de
toolkit label: afledning @da
toolkit label: afleiding @nl
toolkit label: atvasinājums @lv
toolkit label: avledning @no
toolkit label: derivació @ca
toolkit label: derivation
toolkit label: derivazione @it
toolkit label: dérivation @fr
toolkit label: johdos @fi
toolkit label: leágazása: @hu
toolkit label: tuletis @et
toolkit label: türetme @tr
toolkit label: اشتقاق @ar
toolkit label: 衍生命名 @zh-hans
has subproperty: P80060
lexical alias: derivation.en
status: Published
type: Property
domain: C10012
label: a pour dérivation @fr
label: atvasinājums @lv
label: ha come derivazione @it
label: har afledning @da
label: har avledning @no
label: hat Ableitung @de
label: heeft afleiding @nl
label: johdos @fi
label: leágazása a következő: @hu
label: tuletis @et
label: té com a derivació @ca
label: türetim ile ilişkilidir @tr
label: لها اشتقاق @ar
label: 有衍生命名 @zh-hans
sub property of: has related nomen of nomen
definition: Bir ismi, başka bir niteleyici ismi temel alan bir niteleyici isimle ilişkilendirir. @tr
definition: Correla un nomen a un nomen che è basato su un altro nomen. @it
definition: Hozzákapcsol egy noment egy nomenhez, amely egy másik nomenen alapul. @hu
definition: Liittää nomenin nomeniin, joka perustuu toiseen nomeniin. @fi
definition: Met un nomen en relation avec un nomen qui est basé sur un autre nomen. @fr
definition: Relaciona un nomen amb un nomen que es basa en un altre nomen. @ca
definition: Relateert een nomen aan een nomen dat gebaseerd is op een andere nomen. @nl
definition: Relaterer et nomen til et nomen som er basert på et annet nomen. @no
definition: Relaterer et nomen til et nomen, som er baseret på et andet nomen. @da
definition: Relates a nomen to a nomen that is based on another nomen.
definition: Sasaista nomenu ar nomenu, kas balstīts uz citu nomenu. @lv
definition: Seostab nomen'i nomen'iga, mis põhineb teisel nomen'il. @et
definition: Setzt ein Nomen in Beziehung zu einem Nomen, das auf einem anderen Nomen basiert. @de
definition: يربط تسمية بتسمية مأخوذة من تسمية أخرى. @ar
definition: 将一个命名与基于另一个命名的一个命名关联起来。 @zh-hans

is derivation of
has element type: 2
toolkit definition: A nomen that is used as the basis of another nomen.
toolkit definition: Başka bir ismin temeli olarak kullanılan bir isim. @tr
toolkit definition: Een nomen dat gebruikt is als basis voor een andere nomen. @nl
toolkit definition: Egy nomen, amelyet egy másik nomen alapjaként használnak. @hu
toolkit definition: Ein Nomen, das als Grundlage für ein anderes Nomen verwendet wird. @de
toolkit definition: Et nomen som er brukt som utgangspunkt for et annet nomen. @no
toolkit definition: Nomen que s’usa com a base d’un altre nomen. @ca
toolkit definition: Nomen qui sert de base à un autre nomen. @fr
toolkit definition: Nomen, joka on toisen nomenin perusta. @fi
toolkit definition: Nomen, mida on kasutatud teise nomen'i alusena. @et
toolkit definition: Nomen, som bruges som basis for et andet nomen. @da
toolkit definition: Nomens, kas izmantots kā pamats citam nomenam. @lv
toolkit definition: Un nomen che è usato come base per un altro nomen. @it
toolkit definition: تسمية أُخذت من تسمية أخرى. @ar
toolkit definition: 被用作另一个命名之基础的一个命名 @zh-hans
toolkit label: Ableitung von @de
toolkit label: afgeleid van @nl
toolkit label: afledning af @da
toolkit label: avledning av @no
toolkit label: derivació de @ca
toolkit label: derivation of
toolkit label: derivazione di @it
toolkit label: dérivation de @fr
toolkit label: ir atvasinājums @lv
toolkit label: johdos nomenista @fi
toolkit label: leágazása: @hu
toolkit label: tuletis nomen'ist @et
toolkit label: türetme @tr
toolkit label: مشتقة من @ar
toolkit label: ……的衍生命名 @zh-hans
has subproperty: P80061
lexical alias: derivationOf.en
status: Published
type: Property
domain: C10012
label: er afledning af @da
label: er avledning av @no
label: est une dérivation de @fr
label: ir atvasinājums @lv
label: is afgeleid van @nl
label: ist Ableitung von @de
label: johdos nomenista @fi
label: leágazása a következőnek: @hu
label: tuletis nomen'ist @et
label: türevidir @tr
label: è derivazione di @it
label: és derivació de @ca
label: هو اشتقاق من @ar
label: 是……的衍生命名 @zh-hans
sub property of: has related nomen of nomen
definition: Bir ismi, başka bir niteleyici ismin temeli olarak kullanılan bir niteleyici isimle ilişkilendirir. @tr
definition: Correla un nomen a un nomen che è usato come base per un altro nomen. @it
definition: Hozzákapcsol egy noment egy nomenhez, amelyet egy másik nomen alapjaként használnak. @hu
definition: Liittää nomenin nomeniin, joka on toisen nomenin perusta. @fi
definition: Met un nomen en relation avec un nomen qui sert de base à un autre nomen. @fr
definition: Relaciona un nomen amb un nomen que s’usa com a base d’un altre nomen. @ca
definition: Relateert een nomen aan een nomen dat gebruikt is als basis voor een andere nomen. @nl
definition: Relaterer et nomen til et nomen som er brukt som utgangspunkt for et annet nomen. @no
definition: Relaterer et nomen til et nomen, som bruges som basis for et andet nomen. @da
definition: Relates a nomen to a nomen that is used as the basis of another nomen.
definition: Sasaista nomenu ar nomenu, kas izmantots kā pamats citam nomenam. @lv
definition: Seostab nomen'i nomen'iga, mida on kasutatud teise nomen'i alusena. @et
definition: Setzt ein Nomen in Beziehung zu einem Nomen, das als Grundlage für ein anderes Nomen verwendet wird. @de
definition: يربط تسمية بتسمية أُخذت من تسمية أخرى. @ar
definition: 将一个命名与被用作另一个命名之基础的一个命名关联起来。 @zh-hans

is title of manifestation of
has element type: 2
toolkit definition: A manifestation that has an appellation of manifestation in natural language and phrasing used in common discourse.
toolkit definition: Doğal dilde ve günlük söylemde kullanılan bir gösterim unvanına sahip bir gösterim. @tr
toolkit definition: Een manifestatie die een benaming van manifestatie heeft in natuurlijke taal en terminologie in gebruikelijke bewoording. @nl
toolkit definition: Egy megjelenési forma, amelynek van egy megjelenési formához tartozó megnevezése természetes nyelven és közbeszédben használt kifejezéssel. @hu
toolkit definition: Eine Manifestation, die über eine Bezeichnung für eine Manifestation in natürlicher Sprache und Ausdrucksweise verfügt, die beim normalen Sprechen und Schreiben verwendet wird. @de
toolkit definition: En manifestasjon som har en betegnelse for manifestasjon på et naturlig språk og med frasering brukt i alminnelig diskurs. @no
toolkit definition: Kehastus, millel on nimetus loomulikus keeles ja sõnastuses, mida kasutatakse ühises diskursuses. @et
toolkit definition: Manifestaatio, jolla on luonnollisen kielen ja yleisen diskurssin sanamuodon mukainen nimitys. @fi
toolkit definition: Manifestació que té una apel·lació de manifestació en llenguatge i frases naturals usada en el discurs comú. @ca
toolkit definition: Manifestation qui possède une appellation de manifestation exprimée dans un langage et une formulation naturels et utilisée dans le langage courant. @fr
toolkit definition: Manifestation, som har en benævnelse på manifestation på normalsprog og med formuleringer, som bruges alment. @da
toolkit definition: Manifestācija, kam ir izteiksmes apzīmējums dabiskā valodā un frāzēs, kas tiek lietots savstarpējā saziņā. @lv
toolkit definition: Una manifestazione che ha una designazione di manifestazione in linguaggio e frasi naturali usati nel discorso comune. @it
toolkit definition: تجسيدة لها اسم تجسيدة في لغة طبيعية مستخدمة في الخطاب العام. @ar
toolkit definition: 有用自然语言和普通话语措词表达的载体表现的称谓的一种载体表现 @zh-hans
toolkit label: Titel einer Manifestation von @de
toolkit label: gösterimin başlığı @tr
toolkit label: ir nosaukums manifestācijai @lv
toolkit label: megjelenésiforma-címe: @hu
toolkit label: nimeke manifestaatiolle @fi
toolkit label: pealkiri kehastuses @et
toolkit label: titel på manifestation af @da
toolkit label: titel van manifestatie van @nl
toolkit label: title of manifestation of
toolkit label: titolo della manifestazione di @it
toolkit label: titre de manifestation de @fr
toolkit label: tittel for manifestasjon for @no
toolkit label: títol de manifestació de @ca
toolkit label: عنوان تجسيدة لـ @ar
toolkit label: ……的载体表现的题名 @zh-hans
has subproperty: is title proper of
has subproperty: is variant title of manifestation of
has subproperty: is title of series of
has subproperty: P80062
lexical alias: titleOfManifestationOf.en
status: Published
type: Property
domain: C10012
label: er titel på manifestation af @da
label: er tittel for manifestasjon for @no
label: est un titre de manifestation de @fr
label: gösterimin başlığı @tr
label: ir nosaukums manifestācijai @lv
label: is titel van manifestatie van @nl
label: ist Titel einer Manifestation von @de
label: megjelenésiforma-címe a következőnek: @hu
label: nimeke manifestaatiolle @fi
label: pealkiri kehastuses @et
label: è titolo della manifestazione di @it
label: és títol de manifestació de @ca
label: هو عنوان تجسيدة لـ @ar
label: 是……的载体表现的题名 @zh-hans
sub property of: is appellation of manifestation of
sub property of: is name of RDA entity of
definition: Bir ismi, doğal dilde gösterimi ve ortak söylemde kullanılan ifadeyi içeren bir gösterimi olan bir gösterimle ilişkilendirir. @tr
definition: Correla un nomen a una manifestazione che ha una designazione di manifestazione in linguaggio e frasi naturali usati nel discorso comune. @it
definition: Hozzákapcsol egy noment egy megjelenési formához, amelynek van egy megjelenési formához tartozó megnevezése természetes nyelven és közbeszédben használt kifejezéssel. @hu
definition: Liittää nomenin manifestaatioon, jolla on luonnollisen kielen ja yleisen diskurssin sanamuodon mukainen nimitys. @fi
definition: Met un nomen en relation avec une manifestation qui possède une appellation de manifestation exprimée dans un langage et une formulation naturels et utilisée dans le langage courant. @fr
definition: Relaciona un nomen amb una manifestació que té una apel·lació de manifestació en llenguatge i frases naturals usada en el discurs comú. @ca
definition: Relateert een nomen aan een manifestatie die een benaming van manifestatie heeft in natuurlijke taal en terminologie in gebruikelijke bewoording. @nl
definition: Relaterer et nomen til en manifestasjon som har en betegnelse for manifestasjon på et naturlig språk og med frasering brukt i alminnelig diskurs. @no
definition: Relaterer et nomen til en manifestation, som har en benævnelse på manifestation på normalsprog og med formuleringer, som bruges alment. @da
definition: Relates a nomen to a manifestation that has an appellation of manifestation in natural language and phrasing used in common discourse.
definition: Sasaista nomenu ar manifestāciju, kam ir izteiksmes apzīmējums dabiskā valodā un frāzēs, kas tiek lietots savstarpējā saziņā. @lv
definition: Seostab nomen'i kehastusega, millel on nimetus loomulikus keeles ja sõnastuses, mida kasutatakse ühises diskursuses. @et
definition: Setzt ein Nomen in Beziehung zu einer Manifestation, die über eine Bezeichnung für eine Manifestation in natürlicher Sprache und Ausdrucksweise verfügt, die beim normalen Sprechen und Schreiben verwendet wird. @de
definition: يربط تسمية بتجسيدة لها اسم تجسيدة في لغة طبيعية مستخدمة في الخطاب العام. @ar
definition: 将一个命名与有用自然语言和普通话语措词表达的载体表现的称谓的一种载体表现关联起来。 @zh-hans

is title proper of
has element type: 2
toolkit definition: A manifestation that has a title of manifestation that is selected for preference in a specific application or context.
toolkit definition: Belirli bir uygulama veya bağlamda tercih edilmek üzere seçilmeyen bir gösterim başlığına sahip bir gösterim @tr
toolkit definition: Een manifestatie die een titel van manifestatie heeft die als voorkeursterm geselecteerd is in een specifieke toepassing of context. @nl
toolkit definition: Egy megjelenési forma, amelynek van egy megjelenésiforma-címe, amelyet egy bizonyos alkalmazásban vagy kontextusban előnyben részesítenek. @hu
toolkit definition: Eine Manifestation, die über einen Titel für eine Manifestation verfügt, der in einer bestimmten Anwendung oder in einem bestimmten Kontext als Vorzugsform bestimmt wird. @de
toolkit definition: En manifestasjon som har en tittel for manifestasjon som er valgt som preferanse i en bestemt applikasjon eller kontekst. @no
toolkit definition: Kehastus, millel on kindlas rakenduses või kontekstis eelistatuks valitud pealkiri. @et
toolkit definition: Manifestaatio, jonka nimeke on valittu ensisijaiseksi tietyssä sovelluksessa ja kontekstissa. @fi
toolkit definition: Manifestació que té un títol de manifestació que se selecciona com a preferent en una aplicació o un context específic. @ca
toolkit definition: Manifestation qui possède un titre de manifestation faisant l’objet d’un choix privilégié dans un schéma d’encodage de vocabulaire spécifique. @fr
toolkit definition: Manifestation, som har en titel på manifestation, som er valgt som præference i en specifik anvendelse eller kontekst. @da
toolkit definition: Manifestācija, kam ir manifestācijas nosaukums, kas izvēlēts kā prioritārs noteiktā lietojumprogrammā vai kontekstā. @lv
toolkit definition: Una manifestazione che ha un titolo di manifestazione che è stato selezionato come preferito in una specifica applicazione o contesto. @it
toolkit definition: تجسيدة لها عنوان تجسيدة اختير للتفضيل في تطبيق أو في سياق معين. @ar
toolkit definition: 有在一个给定的体系或语境中被首选的一个载体表现题名的一种载体表现 @zh-hans
toolkit label: Haupttitel von @de
toolkit label: Hozzákapcsol egy noment egy megjelenési formához, amelynek van egy megjelenésiforma-címe, amelyet egy bizonyos alkalmazásban vagy kontextusban előnyben részesítenek. @hu
toolkit label: esas başlık @tr
toolkit label: hoofdtitel van @nl
toolkit label: hovedtitel af @da
toolkit label: hovedtittel for @no
toolkit label: ir pamatnosaukums @lv
toolkit label: päänimeke manifestaatiolle @fi
toolkit label: põhipealkiri kehastuses @et
toolkit label: title proper of
toolkit label: titolo proprio di @it
toolkit label: titre propre de @fr
toolkit label: títol propi de @ca
toolkit label: عنوان فعلي لـ @ar
toolkit label: ……的正题名 @zh-hans
has subproperty: is parallel title proper of
has subproperty: P80063
lexical alias: titleProperOf.en
status: Published
type: Property
domain: C10012
label: er hovedtitel af @da
label: er hovedtittel for @no
label: est un titre propre de @fr
label: főcíme a következőnek: @hu
label: ir pamatnosaukums @lv
label: is hoofdtitel van @nl
label: ist Haupttitel von @de
label: päänimeke manifestaatiolle @fi
label: põhipealkiri kehastuses @et
label: uygun başlık @tr
label: è titolo proprio di @it
label: és títol propi de @ca
label: هو العنوان الفعلي لـ @ar
label: 是……的正题名 @zh-hans
sub property of: is title of manifestation of
definition: Bir ismi, belirli bir uygulama veya bağlamda tercih için seçilen bir gösterim başlığına sahip bir gösterimle ilişkilendirir. @tr
definition: Correla un nomen a una manifestazione che ha un titolo di manifestazione che è stato selezionato come preferito in una specifica applicazione o contesto. @it
definition: Liittää nomenin manifestaatioon, jonka nimeke on valittu ensisijaiseksi tietyssä sovelluksessa ja kontekstissa. @fi
definition: Met un nomen en relation avec une manifestation qui possède un titre de manifestation faisant l’objet d’un choix privilégié dans un schéma d’encodage de vocabulaire spécifique. @fr
definition: Relaciona un nomen amb una manifestació que té un títol de manifestació que se selecciona com a preferent en una aplicació o un context específic. @ca
definition: Relateert een nomen aan een manifestatie die een titel van manifestatie heeft die als voorkeursterm geselecteerd is in een specifieke toepassing of context. @nl
definition: Relaterer et nomen til en manifestasjon som har en tittel for manifestasjon som er valgt som preferanse i en bestemt applikasjon eller kontekst. @no
definition: Relaterer et nomen til en manifestation, som har en titel på manifestation, som er valgt som præference i en specifik anvendelse eller kontekst. @da
definition: Relates a nomen to a manifestation that has a title of manifestation that is selected for preference in a specific application or context.
definition: Sasaista nomenu ar manifestāciju, kam ir manifestācijas nosaukums, kas izvēlēts kā prioritārs noteiktā lietojumprogrammā vai kontekstā. @lv
definition: Seostab nomen'i kehastusega, millel on kindlas rakenduses või kontekstis eelistatuks valitud pealkiri. @et
definition: Setzt ein Nomen in Beziehung zu einer Manifestation, die über einen Titel für eine Manifestation verfügt, der in einer bestimmten Anwendung oder in einem bestimmten Kontext als Vorzugsform bestimmt wird. @de
definition: főcíme: @hu
definition: يربط تسمية بتجسيدة لها عنوان تجسيدة اختير للتفضيل في تطبيق أو في سياق معين. @ar
definition: 将一个命名与有在一个给定的体系或语境中被首选的一个载体表现题名的一种载体表现关联起来。 @zh-hans

is title of work of
has element type: 2
toolkit definition: A work that has an appellation of work in natural language and phrasing used in common discourse.
toolkit definition: Darbs, kam ir darba apzīmējums dabiskajā valodā un frāze, ko lieto kopējā diskursā. @lv
toolkit definition: Doğal dilde eser unvanına ve ortak söylemde kullanılan ifadelere sahip bir eser. @tr
toolkit definition: Een werk dat een benaming van werk heeft in natuurlijke taal en terminologie in gebruikelijke bewoording. @nl
toolkit definition: Egy mű, amelynek van egy műhöz tartozó megnevezése természetes nyelven és közbeszédben használt kifejezéssel. @hu
toolkit definition: Ein Werk, das über eine Bezeichnung für ein Werk in natürlicher Sprache und Ausdrucksweise verfügt, die beim normalen Sprechen und Schreiben verwendet wird. @de
toolkit definition: Et verk som har en betegnelse for verk på et naturlig språk og med frasering brukt i alminnelig diskurs. @no
toolkit definition: Obra que té una apel·lació d’obra en llenguatge i frases naturals usada en el discurs comú. @ca
toolkit definition: Teos, jolla on luonnollisen kielen ja yleisen diskurssin sanamuodon mukainen nimitys. @fi
toolkit definition: Teos, millel on nimetus loomulikus keeles ja sõnastuses, mida kasutatakse ühises diskursuses. @et
toolkit definition: Un'opera che ha una designazione di opera in linguaggio e frasi naturali usati nel discorso comune. @it
toolkit definition: Værk, som har en benævnelse på værk på normalsprog og med formuleringer, som bruges alment. @da
toolkit definition: Œuvre qui possède une appellation d'œuvre exprimée dans un langage et une formulation naturels et utilisée dans le langage courant. @fr
toolkit definition: عمل له اسم عمل في لغة طبيعية مستخدمة في الخطاب العام. @ar
toolkit definition: 有用自然语言和普通话语措词表达的作品的称谓的一种作品 @zh-hans
toolkit label: Titel eines Werks von @de
toolkit label: eserin başlığı @tr
toolkit label: ir nosaukums darbam @lv
toolkit label: műhöz tartozó címe: @hu
toolkit label: nimeke teokselle @fi
toolkit label: pealkiri teoses @et
toolkit label: titel på værk af @da
toolkit label: titel van werk van @nl
toolkit label: title of work of
toolkit label: titolo dell'opera di @it
toolkit label: titre d’œuvre de @fr
toolkit label: tittel for verk for @no
toolkit label: títol d’obra de @ca
toolkit label: عنوان عمل لـ @ar
toolkit label: ……的作品的题名 @zh-hans
has subproperty: is key title of
has subproperty: is preferred title of work of
has subproperty: is variant title of work of
has subproperty: P80064
lexical alias: titleOfWorkOf.en
status: Published
type: Property
domain: C10012
label: er titel på værk af @da
label: er tittel for verk for @no
label: eserin başlığı @tr
label: est un titre d’œuvre de @fr
label: ir nosaukums darbam @lv
label: is titel van werk van @nl
label: ist Titel eines Werks von @de
label: műhöz tartozó címe a következőnek: @hu
label: nimeke teokselle @fi
label: pealkiri teoses @et
label: è titolo dell'opera di @it
label: és títol d’obra de @ca
label: هو عنوان عمل لـ @ar
label: 是……的作品的题名 @zh-hans
sub property of: is appellation of work of
sub property of: is name of RDA entity of
definition: Bir ismi, doğal dilde ve ortak söylemde kullanılan ifadelerde çalışma unvanına sahip bir eserle ilişkilendirir. @tr
definition: Correla un nomen a un'opera che ha una designazione di opera in linguaggio e frasi naturali usati nel discorso comune. @it
definition: Hozzákapcsol egy noment egy műhöz, amelynek van egy műhöz tartozó megnevezése természetes nyelven és közbeszédben használt kifejezéssel. @hu
definition: Liittää nomenin teokseen, jolla on luonnollisen kielen ja yleisen diskurssin sanamuodon mukainen nimitys. @fi
definition: Met un nomen en relation avec une œuvre qui possède une appellation d'œuvre exprimée dans un langage et une formulation naturels et utilisée dans le langage courant. @fr
definition: Relaciona un nomen amb una obra que té una apel·lació d’obra en llenguatge i frases naturals usada en el discurs comú. @ca
definition: Relateert een nomen aan een werk dat een benaming van werk heeft in natuurlijke taal en terminologie in gebruikelijke bewoording. @nl
definition: Relaterer et nomen til et verk som har en betegnelse for verk på et naturlig språk og med frasering brukt i alminnelig diskurs. @no
definition: Relaterer et nomen til et værk, som har en benævnelse på værk på normalsprog og med formuleringer, som bruges alment. @da
definition: Relates a nomen to a work that has an appellation of work in natural language and phrasing used in common discourse.
definition: Sasaista nomenu ar darbu, kam ir darba apzīmējums dabiskajā valodā un frāze, ko lieto kopējā diskursā. @lv
definition: Seostab nomen'i teosega, millel on nimetus loomulikus keeles ja sõnastuses, mida kasutatakse ühises diskursuses. @et
definition: Setzt ein Nomen in Beziehung zu einem Werk, das über eine Bezeichnung für ein Werk in natürlicher Sprache und Ausdrucksweise verfügt, die beim normalen Sprechen und Schreiben verwendet wird. @de
definition: يربط تسمية بعمل له اسم عمل في لغة طبيعية مستخدمة في الخطاب العام. @ar
definition: 将一个命名与有用自然语言和普通话语措词表达的作品的称谓的一种作品关联起来。 @zh-hans

has intended audience of nomen
has element type: 5
toolkit definition: A class of users for which a nomen is intended.
toolkit definition: Classe d’usuaris a la qual es destina un nomen. @ca
toolkit definition: Classe d’utilisateurs à laquelle un nomen est destiné. @fr
toolkit definition: Een klasse gebruikers waarvoor een nomen bedoeld is. @nl
toolkit definition: Egy olyan használói osztály, amelynek a noment szánják. @hu
toolkit definition: Eine Gruppe von Benutzenden, für die ein Nomen gedacht ist. @de
toolkit definition: En klasse av brukere som et nomen er tenkt for. @no
toolkit definition: Kasutajarühm, kellele nomen on suunatud. @et
toolkit definition: Klasse af brugere, som et nomen er tiltænkt. @da
toolkit definition: Käyttäjänkategoria, jolle nomen on suunnattu. @fi
toolkit definition: Lietotāju klase, kurai ir paredzēts nomens. @lv
toolkit definition: Nomenin amaçlandığı bir kullanıcı sınıfı. @tr
toolkit definition: Una classe di utenti per la quale il nomen è destinato. @it
toolkit definition: فئة مستفيدين خُصصت لهم تسمية. @ar
toolkit definition: 一个命名的目标使用者的类 @zh-hans
toolkit label: Zielgruppe eines Nomens @de
toolkit label: beoogd publiek van nomen @nl
toolkit label: destinatari del nomen @it
toolkit label: destinataris previstos d’un nomen @ca
toolkit label: intended audience of nomen
toolkit label: ismin hedef kitlesi ile ilişkilidir @tr
toolkit label: målgruppe for nomen @da
toolkit label: nomen célközönsége: @hu
toolkit label: nomen'i sihtrühm @et
toolkit label: nomena mērķauditorija @lv
toolkit label: nomenin kohderyhmä @fi
toolkit label: public cible d’un nomen @fr
toolkit label: جمهور خُصصت له تسمية @ar
toolkit label: 命名的目标受众 @zh-hans
has subproperty: P80065
lexical alias: intendedAudienceOfNomen.en
status: Published
type: Property
domain: C10012
label: a pour public cible d’un nomen @fr
label: ha come destinatari del nomen @it
label: har målgruppe for nomen @da
label: hat Zielgruppe eines Nomens @de
label: heeft beoogd publiek van nomen @nl
label: ismin hedef kitlesi ile ilişkilidir @tr
label: nomen célközönsége a következő: @hu
label: nomen'i sihtrühm @et
label: nomena mērķauditorija @lv
label: nomenin kohderyhmä @fi
label: té com a destinataris previstos d’un nomen @ca
label: له جمهور خُصصت له تسمية @ar
label: 有命名的目标受众 @zh-hans
definition: Bir ismi, bir niteleyici ismin amaçlandığı bir kullanıcı sınıfıyla ilişkilendirir. @tr
definition: Correla un nomen a una classe di utenti per la quale il nomen è destinato. @it
definition: Hozzákapcsol egy noment egy olyan használói osztályhoz, amelynek a noment szánják. @hu
definition: Liittää nomenin käyttäjäkategoriaan, jolle nomen on suunnattu. @fi
definition: Met un nomen en relation avec une classe d’utilisateurs à laquelle un nomen est destiné. @fr
definition: Relaciona un nomen amb una classe d’usuaris a la qual es destina un nomen. @ca
definition: Relateert een nomen aan een klasse gebruikers waarvoor een nomen bedoeld is. @nl
definition: Relaterer et nomen til en klasse af brugere, som et nomen er tiltænkt. @da
definition: Relaterer et nomen til en klasse av brukere som et nomen er tenkt for. @no
definition: Relates a nomen to a class of users for which a nomen is intended.
definition: Sasaista nomenu ar lietotāju klasi, kurai ir paredzēts nomens. @lv
definition: Seostab nomen'i kasutajarühmaga, kellele nomen on suunatud. @et
definition: Setzt ein Nomen in Beziehung zu einer Gruppe von Benutzenden, für die ein Nomen gedacht ist. @de
definition: يربط تسمية بفئة مستخدمين خُصصت لهم تسمية. @ar
definition: 将一个命名与一个命名的目标使用者的类关联起来。 @zh-hans

has language of nomen
has element type: 5
toolkit definition: A language of a nomen.
toolkit definition: Apzīmējuma valoda. @lv
toolkit definition: Bir nomenin dili. @tr
toolkit definition: Een taal van een benaming. @nl
toolkit definition: Egy megnevezés nyelve. @hu
toolkit definition: Eine Sprache von einer Bezeichnung. @de
toolkit definition: Et språk for en betegnelse. @no
toolkit definition: Langue d’un nomen. @fr
toolkit definition: Llengua d’un nomen. @ca
toolkit definition: Nimetuse keel. @et
toolkit definition: Nimityksen kieli. @fi
toolkit definition: Sprog for en benævnelse. @da
toolkit definition: Una lingua di una designazione. @it
toolkit definition: لغة اسم. @ar
toolkit definition: 一个命名的一种语言 @zh-hans
toolkit label: Sprache eines Nomens @de
toolkit label: language of nomen
toolkit label: langue d’un nomen @fr
toolkit label: lingua del nomen @it
toolkit label: llengua d’un nomen @ca
toolkit label: niteleyici ismin dili @tr
toolkit label: nomen nyelve: @hu
toolkit label: nomen'i keel @et
toolkit label: nomena valoda @lv
toolkit label: nomenin kieli @fi
toolkit label: sprog for nomen @da
toolkit label: språk for nomen @no
toolkit label: taal van nomen @nl
toolkit label: لغة تسمية @ar
toolkit label: 命名的语言 @zh-hans
has subproperty: P80066
lexical alias: languageOfNomen.en
status: Published
type: Property
domain: C10012
label: a pour langue d’un nomen @fr
label: ha come lingua del nomen @it
label: har sprog for nomen @da
label: har språk for nomen @no
label: hat Sprache eines Nomens @de
label: heeft taal van nomen @nl
label: ismin dili ile ilişkilidir @tr
label: nomen nyelve a következő: @hu
label: nomen'i keel @et
label: nomena valoda @lv
label: nomenin kieli @fi
label: té com a llengua d’un nomen @ca
label: لها لغة تسمية @ar
label: 有命名的语言 @zh-hans
definition: Bir ismi, bir niteleyici isim diliyle ilişkilendirir. @tr
definition: Correla un nomen a una lingua di una designazione. @it
definition: Hozzákapcsol egy noment egy megnevezés nyelvéhez. @hu
definition: Liittää nomenin nimityksen kieleen. @fi
definition: Met un nomen en relation avec une langue d’un nomen. @fr
definition: Relaciona un nomen amb una llengua d’un nomen . @ca
definition: Relateert een nomen aan een taal van een benaming. @nl
definition: Relaterer et nomen til et sprog for en benævnelse. @da
definition: Relaterer et nomen til et språk for en betegnelse. @no
definition: Relates a nomen to a language of a nomen.
definition: Sasaista nomenu ar apzīmējuma valodu. @lv
definition: Seostab nomen'i nimetuse keelega. @et
definition: Setzt ein Nomen in Beziehung zu einer Sprache von einer Bezeichnung. @de
definition: يربط تسمية بلغة اسم. @ar
definition: 将一个命名与一个命名的一种语言关联起来。 @zh-hans

has context of use
has element type: 6
toolkit definition: Apstākļi vai situācija, kurā tiek izmantots RDA entītes apzīmējums. @lv
toolkit definition: Bir niteleyici ismin kullanıldığı koşullar veya durum. @tr
toolkit definition: Circonstances ou situation dans laquelle est utilisé un nomen. @fr
toolkit definition: Circumstàncies o situació en què s’usa un nomen. @ca
toolkit definition: De omstandigheden of situatie waarin de benaming van een RDA-entiteit gebruikt wordt. @nl
toolkit definition: Die Umstände oder Situation, in denen/der eine Bezeichnung für eine RDA-Entität verwendet wird. @de
toolkit definition: Egy körülmény vagy szituáció, amelyben egy RDA-entitás megnevezését használják. @hu
toolkit definition: Le circostanze o alla situazione in cui una denfominazione di un'entità RDA è usata. @it
toolkit definition: Olosuhde tai tilanne, jossa RDA-entiteetin nimitystä käytetään. @fi
toolkit definition: Omstendighetene eller situasjonen for når en betegnelse for en RDA-entitet brukes. @no
toolkit definition: Omstændighederne eller situationen, hvori en benævnelse på en RDA-entitet bruges. @da
toolkit definition: The circumstances or situation in which a nomen is used.
toolkit definition: Tingimused või olukord, mille puhul RDA olemi nimetust kasutatakse. @et
toolkit definition: الظروف أو الحالة التي يُستخدم فيها اسم كيان "وام". @ar
toolkit definition: 一个命名被使用的环境和情况 @zh-hans
toolkit label: Verwendungskontext @de
toolkit label: contesto d'uso @it
toolkit label: context d’ús @ca
toolkit label: context of use
toolkit label: context van gebruik @nl
toolkit label: contexte d’utilisation @fr
toolkit label: használati környezete: @hu
toolkit label: kasutuskontekst @et
toolkit label: kontekst for brug @da
toolkit label: kontekst for bruk @no
toolkit label: kullanım bağlamı @tr
toolkit label: käyttökonteksti @fi
toolkit label: lietojumkonteksts @lv
toolkit label: سياق الاستخدام @ar
toolkit label: 使用语境 @zh-hans
has subproperty: P80067
lexical alias: contextOfUse.en
status: Published
type: Property
domain: C10012
label: a pour contexte d’utilisation @fr
label: ha come contesto d'uso @it
label: har kontekst for brug @da
label: har kontekst for bruk @no
label: használati környezete a következő: @hu
label: hat Verwendungskontext @de
label: heeft context van gebruik @nl
label: kasutuskontekst @et
label: kullanım bağlamı ile ilişkilidir @tr
label: käyttökonteksti @fi
label: lietojumkonteksts @lv
label: té com a context d’ús @ca
label: لها سياق استخدام @ar
label: 有使用语境 @zh-hans
alternative label: Verwendungsbereich @de
alternative label: abast d’ús @ca
alternative label: ambito d'uso @it
alternative label: champ d’utilisation @fr
alternative label: felhasználási területe: @hu
alternative label: kasutusulatus @et
alternative label: kullanım kapsamı @tr
alternative label: käytön soveltamisala @fi
alternative label: rekkevidde for bruk @no
alternative label: rækkevidde for brug @da
alternative label: scope of usage
alternative label: مجال الاستخدام @ar
alternative label: 使用范围 @zh-hans
definition: Bir ismi, bir niteleyici ismin kullanıldığı koşullar veya durumla ilişkilendirir. @tr
definition: Correla un nomen alle circostanze o alla situazione in cui una denfominazione di un'entità RDA è usata. @it
definition: Hozzákapcsol egy noment egy körülményhez vagy szituációhoz, amelyben egy RDA-entitás megnevezését használják. @hu
definition: Liittää nomenin olosuhteeseen tai tilanteeseen, jossa RDA-entiteetin nimitystä käytetään. @fi
definition: Met un nomen en relation avec des circonstances ou une situation dans laquelle est utilisé un nomen. @fr
definition: Relaciona un nomen amb les circumstàncies o situació en què s’usa un nomen. @ca
definition: Relateert een nomen aan de omstandigheden of situatie waarin de benaming van een RDA-entiteit gebruikt wordt. @nl
definition: Relaterer et nomen til omstendighetene eller situasjonen for når en betegnelse for en RDA-entitet brukes. @no
definition: Relaterer et nomen til omstændighederne eller situationen, hvori en benævnelse på en RDA-entitet bruges. @da
definition: Relates a nomen to the circumstances or situation in which a nomen is used.
definition: Sasaista nomenu ar apstākļiem vai situāciju, kurā tiek izmantots RDA entītes apzīmējums. @lv
definition: Seostab nomen'i tingimuste või olukorraga, mille puhul RDA olemi nimetust kasutatakse. @et
definition: Setzt ein Nomen in Beziehung zu den Umständen oder der Situation, in denen/der eine Bezeichnung für eine RDA-Entität verwendet wird. @de
definition: يربط تسمية بالظروف أو الحالة التي يُستُخدم فيها اسم كيان "وام". @ar
definition: 将一个命名与一个命名被使用的环境和情况关联起来。 @zh-hans

has nomen string
has element type: 6
toolkit definition: Bir varlıkla bağlantılı olan bir unvan oluşturan işaretlerin birleşimi. @tr
toolkit definition: Combinació de signes que forma una apel·lació associada a una entitat. @ca
toolkit definition: Combinaison de signes qui forme une appellation associée à une entité. @fr
toolkit definition: De combinatie van tekens die een benaming vormen geassocieerd met een entiteit. @nl
toolkit definition: Die Kombination von Zeichen, die eine Bezeichnung bildet, die mit einer Entität in Verbindung steht. @de
toolkit definition: En kombinasjon av tegn som danner en betegnelse som forbindes med en entitet. @no
toolkit definition: Jelek kombinációja, amely így egy entitással társított megnevezést formál. @hu
toolkit definition: Kombination af tegn, som danner en benævnelse tilknyttet en entitet. @da
toolkit definition: La combinazione di segni che forma una designazione associata con un'entità. @it
toolkit definition: Merkkien yhdistelmä, joka muodostaa entiteettiin liittyvän nimityksen. @fi
toolkit definition: Märgikombinatsioon, mis moodustab olemiga seotud nimetuse. @et
toolkit definition: The combination of signs that forms an appellation associated with an entity.
toolkit definition: Zīmju kombinācija, kas veido ar entīti saistītu apzīmējumu. @lv
toolkit definition: مجموعة علامات تشكل تسمية ذات صلة بكيان. @ar
toolkit definition: 和一个实体有关的形成一个称谓的符号的组合 @zh-hans
toolkit label: Nomen-Zeichenkette @de
toolkit label: cadena de nomen @ca
toolkit label: chaîne de nomen @fr
toolkit label: niteleyici isim dizisi @tr
toolkit label: nomen string
toolkit label: nomen'i string @et
toolkit label: nomena virkne @lv
toolkit label: nomenin merkkijono @fi
toolkit label: nomenstreng @da
toolkit label: nomenstring @nl
toolkit label: noment alkotó karakterlánca: @hu
toolkit label: stringa del nomen @it
toolkit label: شريط بيانات التسمية @ar
toolkit label: 命名串 @zh-hans
has subproperty: P80068
lexical alias: nomenString.en
status: Published
type: Property
domain: C10012
label: a pour chaîne de nomen @fr
label: ha come stringa del nomen @it
label: har nomenstreng @da
label: hat Nomen-Zeichenkette @de
label: heeft nomenstring @nl
label: isim dizgesi ile ilişkilidir @tr
label: nomen'i string @et
label: nomena virkne @lv
label: nomenin merkkijono @fi
label: noment alkotó karakterlánca a következő: @hu
label: té com a cadena de nomen @ca
label: لها شريط بيانات التسمية @ar
label: 有命名串 @zh-hans
definition: Bir ismi, bir varlıkla ilişkili bir unvan oluşturan işaretlerin birleşimiyle ilişkilendirir. @tr
definition: Correla un nomen alla combinazione di segni che forma una designazione associata con un'entità. @it
definition: Hozzákapcsol egy noment jelek kombinációjához, amely így egy entitással társított megnevezést formál. @hu
definition: Liittää nomenin merkkien yhdistelmään, joka muodostaa entiteettiin liittyvän nimityksen. @fi
definition: Met un nomen en relation avec une combinaison de signes qui forme une appellation associée à une entité. @fr
definition: Relaciona un nomen amb la combinació de signes que forma una apel·lació associada a una entitat. @ca
definition: Relateert een nomen aan de combinatie van tekens die een benaming vormen geassocieerd met een entiteit. @nl
definition: Relaterer et nomen til en kombinasjon av tegn som danner en betegnelse som forbindes med en entitet. @no
definition: Relaterer et nomen til en kombination af tegn, som danner en benævnelse tilknyttet en entitet. @da
definition: Relates a nomen to the combination of signs that forms an appellation associated with an entity.
definition: Sasaista nomenu ar zīmju kombināciju, kas veido ar entīti saistītu apzīmējumu. @lv
definition: Seostab nomen'i märgikombinatsiooniga, mis moodustab olemiga seotud nimetuse. @et
definition: Setzt ein Nomen in Beziehung zu einer Kombination von Zeichen, die eine Bezeichnung bildet, die mit einer Entität in Verbindung steht. @de
definition: يربط تسمية بمجموعة علامات تُكوِّن اسما ذا صلة بكيان. @ar
definition: 将一个命名与和一个实体有关的形成一个称谓的符号的组合关联起来。 @zh-hans
scope note: A karakterlánc kifejezhet bármilyen formában lévő jelölést, úgymint jelek kombinációja egy írásrendszerben, kémiai struktúra szimbólumai, matematikai jelölés vagy bármely más jel, például hangok stb. @hu
scope note: De string kan uitgedrukt worden als een notatie in elke vorm, zoals een combinatie van tekens binnen alfabet, symbolen voor chemische structuren, wiskundige notatie of door andere soorten tekens, zoals geluiden etc. @nl
scope note: Die Zeichenkette kann als Notation in beliebiger Form ausgedrückt werden, zum Beispiel als eine Kombination von Zeichen innerhalb eines Schreibsystems, als Symbole einer chemischen Struktur, als mathematische Notation oder durch ein anderes beliebiges Zeichen, wie zum Beispiel Töne und so weiter. @de
scope note: Dizi, bir yazı sistemindeki işaretlerin bir kombinasyonu, kimyasal yapı sembolleri, matematiksel gösterim veya sesler vb. gibi başka herhangi bir işaret türü gibi herhangi bir biçimde bir gösterim olarak ifade edilebilir. @tr
scope note: La cadena es pot expressar com una notació en qualsevol forma com ara una combinació de signes dins un sistema d’escriptura, símbols d’estructura química, notació matemàtica, o per qualsevol altre tipus de signes, com ara sons, etc. @ca
scope note: La chaîne peut être exprimée sous n’importe quelle forme de notation, telle qu’une combinaison de signes dans un système d’écriture, de symboles de structure chimique, de notation mathématique ou de tout autre type de signe, tel que des sons, etc. @fr
scope note: La stringa può essere espressa come una notazione in qualsiasi forma, come una combinazione di segni in un sistema di scrittura, formule chimiche, notazione matematica, o per mezzo di altri tipi di segni, come suoni, etc. @it
scope note: Merkkijono voidaan ilmaista missä merkkijärjestelmässä tahansa, kuten kirjoitusjärjestelmän merkkien yhdistelmänä, kemiallisen rakenteen symboleina, matemaattisena lukujärjestelmänä tai muina merkkeinä, esim. ääninä. @fi
scope note: Märgijada võib olla väljendatud mis tahes vormis notatsiooniga, nt kirjasüsteemi märkide kombinatsiooniga, keemilise struktuuri sümbolitega, matemaatika notatsiooniga, või muud liiki märkidega, nt helidega. @et
scope note: Strengen kan udtrykkes som en notation i hvilken som helst form, såsom en kombination af tegn fra et skriftsystem, kemiske struktursymboler, matematisk notation eller ved enhver anden form for tegn, såsom lyde etc. @da
scope note: Strengen kan uttrykkes som en notasjon i hvilken som helst form, som en kombinasjon av tegn innen et skriftlig system, kjemiske struktursymboler, matematisk notasjon, eller ved andre typer tegn som lyder etc. @no
scope note: The string can be expressed as a notation in any form, such as a combination of signs within a writing system, chemical structure symbols, mathematical notation, or by any other kind of sign, such as sounds, etc.
scope note: Virkne var tikt izteikta kā apzīmējums jebkurā formā, piemēram, zīmju kombinācijā, ķīmiskās struktūras simbolus, matemātisko apzīmējumu vai jebkāda cita veida zīmes, piemēram, skaņas u.tml. @lv
scope note: سلسلة يمكن التعبير عنها برموز من أي شكل، مثل مجموعة علامات في نظام للكتابة، أو في رموز تركيبة كيميائية، أو تدوين رياضي، أو بأي نوع أخر من العلامات، مثل الأصوات، الخ. @ar
scope note: 串可以被表达为任何形式的标记，例如一种书写体系内的记号的组合、化学结构符号、数学标记、或者诸如声音等任何其他种类的记号。 @zh-hans

has scheme of nomen
has element type: 5
toolkit definition: A scheme in which a nomen is established.
toolkit definition: Bir ismin oluşturulduğu bir şema. @tr
toolkit definition: Een schema waarin een benaming is vastgesteld. @nl
toolkit definition: Egy séma, amelyben egy megnevezés testet ölt. @hu
toolkit definition: Ein Schema, in dem eine Bezeichnung festgelegt ist. @de
toolkit definition: Esquema en el qual s’estableix un nomen. @ca
toolkit definition: Et skjema hvor en betegnelse er innarbeidet. @no
toolkit definition: Järjestelmä, jossa sovellus on luotu. @fi
toolkit definition: Schéma dans lequel un nomen est établi. @fr
toolkit definition: Shēma, kurā tiek izveidots apzīmējums. @lv
toolkit definition: Skema, hvori en benævnelse etableres. @da
toolkit definition: Süsteem, mille raames nimetus on kehtestatud. @et
toolkit definition: Uno schema in cui una designazione è stabilita. @it
toolkit definition: خطة ينشأ عنها اسم. @ar
toolkit definition: 命名在其中建立的一个体系 @zh-hans
toolkit label: Schema eines Nomens @de
toolkit label: esquema de nomen @ca
toolkit label: isim şeması @tr
toolkit label: nomen sémája: @hu
toolkit label: nomen'i süsteem @et
toolkit label: nomena shēma @lv
toolkit label: nomenin järjestelmä @fi
toolkit label: schema del nomen @it
toolkit label: schema van nomen @nl
toolkit label: scheme of nomen
toolkit label: schéma d’un nomen @fr
toolkit label: skema for nomen @da
toolkit label: skjema for nomen @no
toolkit label: خطة تسمية @ar
toolkit label: 命名的体系 @zh-hans
has subproperty: P80069
lexical alias: schemeOfNomen.en
status: Published
type: Property
domain: C10012
label: a pour schéma d’un nomen @fr
label: ha come schema del nomen @it
label: har skema for nomen @da
label: har skjema for nomen @no
label: hat Schema eines Nomens @de
label: heeft schema van nomen @nl
label: isim şeması ile ilişkilidir @tr
label: nomen sémája a következő: @hu
label: nomen'i süsteem @et
label: nomena shēma @lv
label: nomenin järjestelmä @fi
label: té com a esquema de nomen @ca
label: له خطة تسمية @ar
label: 有命名的体系 @zh-hans
definition: Bir ismi, bir ismin oluşturulduğu bir şemayla ilişkilendirir. @tr
definition: Correla un nomen a uno schema in cui una designazione è stabilita. @it
definition: Hozzákapcsol egy noment egy sémához, amelyben egy megnevezés testet ölt. @hu
definition: Liittää nomenin järjestelmään, jossa sovellus on luotu. @fi
definition: Met un nomen en relation avec un schéma dans lequel un nomen est établi. @fr
definition: Relaciona un nomen amb un esquema en el qual s’estableix un nomen. @ca
definition: Relateert een nomen aan een schema waarin een benaming is vastgesteld. @nl
definition: Relaterer et nomen til et skema, hvori en benævnelse etableres. @da
definition: Relaterer et nomen til et skjema hvor en betegnelse er innarbeidet. @no
definition: Relates a nomen to a scheme in which a nomen is established.
definition: Sasaista nomenu ar shēmu, kurā tiek izveidots apzīmējums. @lv
definition: Seostab nomen'i süsteemiga, mille raames nimetus on kehtestatud. @et
definition: Setzt ein Nomen in Beziehung zu einem Schema, in dem eine Bezeichnung festgelegt ist. @de
definition: يربط تسمية بخطة ينشأ عنها اسم. @ar
definition: 将一个命名与命名在其中建立的一个体系关联起来。 @zh-hans
scope note: A séma lehet egy érték, vagy szótárkódolási séma, vagy egy karakterlánc kódolási sémája. @hu
scope note: Das Schema kann entweder ein Value oder Vocabulary Encoding Scheme oder ein String Encoding Scheme sein. @de
scope note: Het schema kan een waardelijst zijn of vocabulair coderingsschema of een string coderingsschema. @nl
scope note: Järjestelmä voi olla arvojen, sanaston tai syntaksin merkintäjärjestelmä. @fi
scope note: Le schéma peut être un schéma d’encodage de valeurs ou de vocabulaire ou un schéma d’encodage de chaînes. @fr
scope note: Lo schema può essere un valore o uno schema di codifica di vocabolario o uno schema di codifica della sintassi. @it
scope note: L’esquema pot ser un valor o un esquema de codificació de vocabulari o un esquema de codificació de cadenes. @ca
scope note: Shēma var būt vērtība, kontrolētas vārdnīcas shēma, vai virknes shēma. @lv
scope note: Skemaet kan være et værdi- eller vokabularkodningsskema eller et syntakskodningsskema. @da
scope note: Skjemaet kan være et kodeskjema for verdi eller vokabular eller et kodeskjema for syntaks. @no
scope note: Süsteem võib olla väärtuste või leksikaalne märkimissüsteem või süntaktiline märkimissüsteem. @et
scope note: The scheme can be a value or vocabulary encoding scheme or a string encoding scheme.
scope note: Şema, bir değer veya kelime kodlama şeması veya bir dizi kodlama şeması olabilir. @tr
scope note: خطة قد تكون قيمة أو خطة ترميز مفردات أو خطة ترميز سلسلة تمثيلات. @ar

has script of nomen
has element type: 5
toolkit definition: A set of characters or symbols with which a nomen is formed.
toolkit definition: Bir ismin oluşturulduğu bir dizi karakterler veya semboller kümesi. @tr
toolkit definition: Conjunt de caràcters o símbols amb els quals es forma un nomen. @ca
toolkit definition: Een verzameling karakters of symbolen waarmee een benaming gevormd is. @nl
toolkit definition: Egy karakter- vagy szimbólumkészlet, amellyel egy megnevezést megformáznak. @hu
toolkit definition: Ein Satz von Zeichen oder Symbolen, mit denen eine Bezeichnung gebildet wird. @de
toolkit definition: Ensemble de caractères ou de symboles à partir duquel un nomen est formé. @fr
toolkit definition: Et sett med tegn eller symboler som en betegnelse er formet med. @no
toolkit definition: Kirjamärkide või sümbolite kogum, millest nimetus on moodustatud. @et
toolkit definition: Merkkien ja symbolien joukko, josta nimitys muodostetaan. @fi
toolkit definition: Rakstzīmju vai simbolu kopums, ar kuriem tiek veidots apzīmējums. @lv
toolkit definition: Sæt af tegn eller symboler, som en benævnelse er dannet med. @da
toolkit definition: Un insieme di caratteri o simboli con cui si forma una designazione. @it
toolkit definition: مجموعة تمثيلات أو رموز يتكون منها اسم. @ar
toolkit definition: 用以形成一个命名的一个字符或符号的集合 @zh-hans
toolkit label: Schrift eines Nomens @de
toolkit label: escriptura d’un nomen @ca
toolkit label: isim metni @tr
toolkit label: nomen írásrendszere: @hu
toolkit label: nomen'i kirjasüsteem @et
toolkit label: nomena pieraksts @lv
toolkit label: nomenin kirjoitusjärjestelmä @fi
toolkit label: schrift van nomen @nl
toolkit label: script of nomen
toolkit label: scrittura del nomen @it
toolkit label: skriftsystem for nomen @da
toolkit label: tegnsett for nomen @no
toolkit label: écriture d’un nomen @fr
toolkit label: نص لتسمية @ar
toolkit label: 命名的文字 @zh-hans
has subproperty: P80070
lexical alias: scriptOfNomen.en
status: Published
type: Property
domain: C10012
label: a pour écriture d’un nomen @fr
label: ha come scrittura del nomen @it
label: har skriftsystem for nomen @da
label: har tegnsett for nomen @no
label: hat Schrift eines Nomens @de
label: heeft schrift van nomen @nl
label: ismin yazı sistemi ile ilişkilidir @tr
label: nomen írásrendszere a következő: @hu
label: nomen'i kirjasüsteem @et
label: nomena pieraksts @lv
label: nomenin kirjoitusjärjestelmä @fi
label: té com a escriptura d’un nomen @ca
label: له نص لتسمية @ar
label: 有命名的文字 @zh-hans
definition: Bir ismi, bir ismin oluşturulduğu bir dizi karakter veya sembolle ilişkilendirir. @tr
definition: Correla un nomen a un insieme di caratteri o simboli con cui si forma una designazione. @it
definition: Hozzákapcsol egy noment egy karakter- vagy szimbólumkészlethez, amellyel egy megnevezést megformáznak. @hu
definition: Liittää nomenin merkkien ja symbolien joukkoon, josta nimitys muodostetaan. @fi
definition: Met un nomen en relation avec un ensemble de caractères ou de symboles à partir duquel un nomen est formé. @fr
definition: Relaciona un nomen amb un conjunt de caràcters o símbols amb els quals es forma un nomen. @ca
definition: Relateert een nomen aan een verzameling karakters of symbolen waarmee een benaming gevormd is. @nl
definition: Relaterer et nomen til et sett med tegn eller symboler som en betegnelse er formet med. @no
definition: Relaterer et nomen til et sæt af tegn eller symboler, som en benævnelse er dannet med. @da
definition: Relates a nomen to a set of characters or symbols with which a nomen is formed.
definition: Sasaista nomenu ar rakstzīmju vai simbolu kopumu, ar kuriem tiek veidots apzīmējums. @lv
definition: Seostab nomen'i kirjamärkide või sümbolite kogumiga, millest nimetus on moodustatud. @et
definition: Setzt ein Nomen in Beziehung zu einem Satz von Zeichen oder Symbolen, mit denen eine Bezeichnung gebildet wird. @de
definition: يربط تسمية بمجموعة تمثيلات أو رموز تتكون من خلالها التسمية. @ar
definition: 将一个命名与用以形成一个命名的一个字符或符号的集合关联起来。 @zh-hans

has note on nomen
has element type: 6
toolkit definition: A broad unstructured description of one or more attributes of a nomen.
toolkit definition: Bir niteleyici ismin bir veya daha fazla niteliğinin yapılandırılmamış geniş tanımı. @tr
toolkit definition: Bred, ustruktureret beskrivelse af en eller flere af et nomens attributter. @da
toolkit definition: Descripció no estructurada àmplia d’un o més atributs d’un nomen. @ca
toolkit definition: Description non structurée générale d’un ou plusieurs attributs d’un nomen. @fr
toolkit definition: Een algemene ongestructureerde beschrijving van één of meer attributen van een nomen. @nl
toolkit definition: Egy nomen egy vagy több ismérvének szabad szöveges, strukturálatlan leírása. @hu
toolkit definition: Eine umfassende, unstrukturierte Beschreibung eines Merkmals oder mehrerer Merkmale eines Nomens. @de
toolkit definition: En bred, ustrukturert beskrivelse av ett eller flere attributter for et nomen. @no
toolkit definition: Plašs nestrukturēts nomena viena vai vairāku atribūtu apraksts. @lv
toolkit definition: Una descrizione non strutturata più ampia di uno o più attributi di un nomen. @it
toolkit definition: Yleisluonteinen rakenteistamaton kuvailu, joka sisältää nomenin yhden tai useamman attribuutin. @fi
toolkit definition: Üldine struktureerimata kirjeldus, mis iseloomustab üht või mitut nomen'i omadust. @et
toolkit definition: وصف واسع غير محدد لخاصية أو أكثر من خصائص تسمية. @ar
toolkit definition: 一个命名的一个或多个属性的宽泛的、非结构化的描述 @zh-hans
toolkit label: Anmerkung zum Nomen @de
toolkit label: huomautus nomenista @fi
toolkit label: märkus nomen'i kohta @et
toolkit label: niteleyici isim not @tr
toolkit label: nomenre vonatkozó megjegyzése: @hu
toolkit label: noot bij nomen @nl
toolkit label: nota sobre un nomen @ca
toolkit label: nota sul nomen @it
toolkit label: note for nomen @no
toolkit label: note om nomen @da
toolkit label: note on nomen
toolkit label: note sur un nomen @fr
toolkit label: piezīme par nomenu @lv
toolkit label: تبصرة عن تسمية @ar
toolkit label: 关于命名的附注 @zh-hans
has subproperty: P80071
lexical alias: noteOnNomen.en
status: Published
type: Property
domain: C10012
label: a pour note sur un nomen @fr
label: ha come nota sul nomen @it
label: har note for nomen @no
label: har note om nomen @da
label: hat Anmerkung zum Nomen @de
label: heeft noot bij nomen @nl
label: huomautus nomenista @fi
label: isim hakkında not ile ilişkilidir @tr
label: märkus nomen'i kohta @et
label: nomenre vonatkozó megjegyzése a következő: @hu
label: piezīme par nomenu @lv
label: té com a nota sobre un nomen @ca
label: له تبصرة عن تسمية @ar
label: 有关于命名的附注 @zh-hans
sub property of: P00015
definition: Bir ismi, bir niteleyici ismin bir veya daha fazla niteliğinin geniş, yapılandırılmamış bir tanımıyla ilişkilendirir. @tr
definition: Correla un nomen a una descrizione non strutturata più ampia di uno o più attributi di un nomen @it
definition: Hozzákapcsol egy noment egy nomen egy vagy több ismérvének szabad szöveges, strukturálatlan leírásához. @hu
definition: Liittää nomenin yleisluonteiseen rakenteistamattomaan kuvailuun, joka sisältää nomenin yhden tai useamman attribuutin. @fi
definition: Met un nomen en relation avec une description non structurée générale d’un ou plusieurs attributs d’un nomen. @fr
definition: Relaciona un nomen amb una descripció no estructurada àmplia d’un o més atributs d’un nomen. @ca
definition: Relateert een nomen aan een algemene ongestructureerde beschrijving van één of meer attributen van een nomen. @nl
definition: Relaterer et nomen til en bred, ustruktureret beskrivelse af en eller flere af et nomens attributter. @da
definition: Relaterer et nomen til en bred, ustrukturert beskrivelse av ett eller flere attributter for et nomen. @no
definition: Relates a nomen to a broad unstructured description of one or more attributes of a nomen.
definition: Sasaista nomenu ar plašu nestrukturētu nomena viena vai vairāku atribūtu aprakstu. @lv
definition: Seostab nomen'i üldise struktureerimata kirjeldusega, mis iseloomustab üht või mitut nomen'i omadust. @et
definition: Setzt ein Nomen in Beziehung zu einer umfassenden, unstrukturierten Beschreibung eines Merkmals oder mehrerer Merkmale eines Nomens. @de
definition: يربط تسمية بوصف واسع غير محدد لخاصية أو أكثر من خصائص تسمية. @ar
definition: 将一个命名与一个命名的一个或多个属性的宽泛的、非结构化的描述关联起来。 @zh-hans

is key title of
has element type: 2
toolkit definition: A work that has a title of work that is assigned by an ISSN registration agency.
toolkit definition: Bir ISSN kayıt ajansı tarafından atanan bir eser başlığına sahip bir eser. @tr
toolkit definition: Darbs, kam ir darba nosaukums, kuru piešķīrusi ISSN reģistrācijas aģentūra. @lv
toolkit definition: Een werk dat een titel van werk heeft dat toegekend is door een ISSN-registratiebureau. @nl
toolkit definition: Egy mű, amelynek van egy olyan műhöz tartozó címe, amelyet egy ISSN regisztrációs ügynökség jegyez. @hu
toolkit definition: Ein Werk, das über einen Titel eines Werks verfügt, der von einem ISSN-Zentrum vergeben wird. @de
toolkit definition: Et verk som har en verkstittel som er tildelt av et ISSN-kontor. @no
toolkit definition: Obra que té un títol d’obra que és assignat per una agència de registre de l’ISSN. @ca
toolkit definition: Teos, jolla on ISSN-rekisteröintiyksikön antama teoksen nimeke. @fi
toolkit definition: Teos, millel on ISSN registreerimise agentuuri määratud pealkiri. @et
toolkit definition: Un'opera che ha un titolo dell'opera che è assegnato da una agenzia di registrazone dell'ISSN. @it
toolkit definition: Værk, som har en titel på værk, som er tildelt af et ISSN-kontor. @da
toolkit definition: Œuvre qui possède un titre d'œuvre attribué par une agence d’enregistrement de l’ISSN. @fr
toolkit definition: عمل له عنوان عمل خصصته وكالة تسجيل ردمد. @ar
toolkit definition: 有被国际标准连续出版物号一个注册机构分配之作品的一个题名的一种作品 @zh-hans
toolkit label: Key Title von @de
toolkit label: anahtar başlığı @tr
toolkit label: avainnimeke teokselle @fi
toolkit label: ir atslēgnosaukums @lv
toolkit label: key title of
toolkit label: key title van @nl
toolkit label: kulcscíme: @hu
toolkit label: nøgletitel af @da
toolkit label: nøkkeltittel for @no
toolkit label: titolo chiave di @it
toolkit label: titre-clé de @fr
toolkit label: títol clau de @ca
toolkit label: võtmepealkiri teosele @et
toolkit label: عنوان مفتاحي لـ @ar
toolkit label: ……的识别题名 @zh-hans
has subproperty: P80072
lexical alias: keyTitleOf.en
status: Published
type: Property
domain: C10012
label: ana başlığıdır @tr
label: avainnimeke teokselle @fi
label: er nøgletitel af @da
label: er nøkkeltittel for @no
label: est un titre-clé de @fr
label: ir atslēgnosaukums @lv
label: is key title van @nl
label: ist Key Title von @de
label: kulcscíme a következőnek: @hu
label: võtmepealkiri teosele @et
label: è titolo chiave di @it
label: és títol clau de @ca
label: هو عنوان مفتاحي لـ @ar
label: 有……的识别题名 @zh-hans
sub property of: is title of work of
definition: Bir ismi, bir ISSN kayıt ajansı tarafından atanan bir eser başlığına sahip bir eserle ilişkilendirir. @tr
definition: Correla un nomen a un'opera che ha un titolo dell'opera che è assegnato da una agenzia di registrazone dell'ISSN. @it
definition: Hozzákapcsol egy noment egy műhöz, amelynek van egy olyan műhöz tartozó címe, amelyet egy ISSN regisztrációs ügynökség jegyez. @hu
definition: Liittää nomenin teokseen, jolla on ISSN-rekisteröintiyksikön antama teoksen nimeke. @fi
definition: Met un nomen en relation avec une œuvre qui possède un titre d'œuvre attribué par une agence d’enregistrement de l’ISSN. @fr
definition: Relaciona un nomen amb una obra que té un títol d’obra que és assignat per una agència de registre de l’ISSN. @ca
definition: Relateert een nomen aan een werk dat een titel van werk heeft dat toegekend is door een ISSN-registratiebureau. @nl
definition: Relaterer et nomen til et verk som har en verkstittel som er tildelt av et ISSN-kontor. @no
definition: Relaterer et nomen til et værk, som har en titel på værk, som er tildelt af et ISSN-kontor. @da
definition: Relates a nomen to a work that has a title of work that is assigned by an ISSN registration agency.
definition: Sasaista nomenu ar darbu, kam ir darba nosaukums, kuru piešķīrusi ISSN reģistrācijas aģentūra. @lv
definition: Seostab nomen'i teosega, millel on ISSN registreerimise agentuuri määratud pealkiri. @et
definition: Setzt ein Nomen in Beziehung zu einem Werk, das über einen Titel eines Werks verfügt, der von einem ISSN-Zentrum vergeben wird. @de
definition: يربط تسمية بعمل له عنوان عمل خصصته وكالة تسجيل ردمد. @ar
definition: 将一个命名与有被国际标准连续出版物号一个注册机构分配之作品的一个题名的一种作品关联起来。 @zh-hans

is assigned by agent
has element type: 2
toolkit definition: Agent que assigna un nomen a una entitat. @ca
toolkit definition: Agent qui attribue un nomen à une entité. @fr
toolkit definition: Agent, som angiver et nomen til en entitet. @da
toolkit definition: An agent who assigns a nomen to an entity.
toolkit definition: Aģents, kas piešķir entītei nomenu. @lv
toolkit definition: Bir varlığa bir isim atayan bir temsilci. @tr
toolkit definition: Een actor die een nomen toekent aan een entiteit. @nl
toolkit definition: Egy ágens, amely hozzárendel egy noment egy entitáshoz. @hu
toolkit definition: Ein Akteur, der einer Entität ein Nomen zuweist. @de
toolkit definition: En agent som angir et nomen til en entitet. @no
toolkit definition: Tegija, kes on määranud nomen'i olemile. @et
toolkit definition: Toimija, joka antaa entiteetille nomenin. @fi
toolkit definition: Un agente che assegna un nomen a un'entità. @it
toolkit definition: وكيل يخصص تسمية لكيان. @ar
toolkit definition: 给一个实体分配一个命名的一个行为者 @zh-hans
toolkit label: angitt av agent @no
toolkit label: angivet af agent @da
toolkit label: assegnato da agente @it
toolkit label: assignat per un agent @ca
toolkit label: assigned by agent
toolkit label: attribué par un agent @fr
toolkit label: hozzárendelve a következő ágens által: @hu
toolkit label: nomen'i määranud tegija @et
toolkit label: nomenin antava toimija @fi
toolkit label: nomenu piešķīris (aģents) @lv
toolkit label: temsilci tarafından atanan @tr
toolkit label: toegekend door actor @nl
toolkit label: von einem Akteur zugewiesen @de
toolkit label: خصصها وكيل @ar
toolkit label: 被一个行为者分配 @zh-hans
has subproperty: is assigned by collective agent
has subproperty: is assigned by person
has subproperty: P80073
lexical alias: assignedByAgent.en
status: Published
type: Property
domain: C10012
label: er angitt av agent @no
label: er angivet af agent @da
label: est attribué par un agent @fr
label: hozzárendelve a következő ágens által: @hu
label: ir nomenu piešķīris (aģents) @lv
label: is toegekend door actor @nl
label: ist von einem Akteur zugewiesen @de
label: nomen'i määranud tegija @et
label: nomenin antava toimija @fi
label: temsilci tarafından atanmıştır @tr
label: è assegnato da agente @it
label: és assignat per un agent @ca
label: هي خصصها وكيل @ar
label: 是被一个行为者分配 @zh-hans
sub property of: has related agent of nomen
definition: Bir ismi, bir varlığa bir niteleyici isim atayan bir temsilciyle ilişkilendirir. @tr
definition: Correla un nomen a un agente che assegna un nomen a un'entità. @it
definition: Hozzákapcsol egy noment egy ágenshez, amely hozzárendel egy noment egy entitáshoz. @hu
definition: Liittää nomenin toimijaan, joka antaa entiteetille nomenin. @fi
definition: Met un nomen en relation avec un agent qui attribue un nomen à une entité. @fr
definition: Relaciona un nomen amb un agent que assigna un nomen a una entitat. @ca
definition: Relateert een nomen aan een actor die een nomen toekent aan een entiteit. @nl
definition: Relaterer et nomen til en agent som angir et nomen til en entitet. @no
definition: Relaterer et nomen til en agent, som angiver et nomen til en entitet. @da
definition: Relates a nomen to an agent who assigns a nomen to an entity.
definition: Sasaista nomenu ar aģentu, kas piešķir entītei nomenu. @lv
definition: Seostab nomen'i tegijaga, kes on määranud nomen'i olemile. @et
definition: Setzt ein Nomen in Beziehung zu einem Akteur, der einer Entität ein Nomen zuweist. @de
definition: يربط تسمية بوكيل يخصص تسمية لكيان. @ar
definition: 将一个命名与给一个实体分配一个命名的一个行为者关联起来。 @zh-hans

is assigned by collective agent
has element type: 2
toolkit definition: A collective agent who assigns a nomen to an entity.
toolkit definition: Agent collectif qui attribue un nomen à une entité. @fr
toolkit definition: Agent col·lectiu que assigna un nomen a una entitat. @ca
toolkit definition: Bir varlığa nomen atayan kolektif bir temsilci. @tr
toolkit definition: Een collectieve actor die een nomen toekent aan een entiteit. @nl
toolkit definition: Egy kollektív ágens, amely hozzárendel egy noment egy entitáshoz. @hu
toolkit definition: Ein gemeinschaftlicher Akteur, der einer Entität ein Nomen zuweist. @de
toolkit definition: En kollektiv agent som angir et nomen til en entitet. @no
toolkit definition: Grupa, kas piešķir entītei nomenu. @lv
toolkit definition: Kollektiiv, kes on määranud nomen'i olemile. @et
toolkit definition: Kollektiv agent, som angiver et nomen til en entitet. @da
toolkit definition: Un agente collettivo che assegna un nomen a un'entità. @it
toolkit definition: Yhteistoimija, joka antaa entiteetille nomenin. @fi
toolkit definition: وكيل جماعي يخصص تسمية لكيان. @ar
toolkit definition: 给一个实体分配一个命名的一个集体行为者 @zh-hans
toolkit label: angitt av kollektiv agent @no
toolkit label: angivet af kollektiv agent @da
toolkit label: assegnato da agente collettivo @it
toolkit label: assignat per un agent col·lectiu @ca
toolkit label: assigned by collective agent
toolkit label: attribué par un agent collectif @fr
toolkit label: hozzárendelve a következő kollektív ágens által: @hu
toolkit label: kolektif temsilci tarafından atanan @tr
toolkit label: nomen'i määranud kollektiiv @et
toolkit label: nomenin antava yhteistoimija @fi
toolkit label: nomenu piešķīris (grupa) @lv
toolkit label: toegekend door collectieve actor @nl
toolkit label: von einem gemeinschaftlichen Akteur zugewiesen @de
toolkit label: خصصها وكيل جماعي @ar
toolkit label: 被一个集体行为者分配 @zh-hans
has subproperty: is assigned by corporate body
has subproperty: is assigned by family
has subproperty: P80074
lexical alias: assignedByCollectiveAgent.en
status: Published
type: Property
domain: C10012
label: er angitt av kollektiv agent @no
label: er angivet af kollektiv agent @da
label: est attribué par un agent collectif @fr
label: hozzárendelve a következő kollektív ágens által: @hu
label: ir nomenu piešķīris (grupa) @lv
label: is toegekend door collectieve actor @nl
label: ist von einem gemeinschaftlichen Akteur zugewiesen @de
label: kolektif temsilci tarafından atanmıştır @tr
label: nomen'i määranud kollektiiv @et
label: nomenin antava yhteistoimija @fi
label: è assegnato da agente collettivo @it
label: és assignat per un agent col·lectiu @ca
label: هي خصصها وكيل جماعي @ar
label: 是被一个集体行为者分配 @zh-hans
sub property of: has related collective agent of nomen
sub property of: is assigned by agent
definition: Bir ismi, bir varlığa bir niteleyici isim atayan bir kolektif temsilciyle ilişkilendirir. @tr
definition: Correla un nomen a un agente collettivo che assegna un nomen a un'entità. @it
definition: Hozzákapcsol egy noment egy kollektív ágenshez, amely hozzárendel egy noment egy entitáshoz. @hu
definition: Liittää nomenin yhteistoimijaan, joka antaa entiteetille nomenin. @fi
definition: Met un nomen en relation avec un agent collectif qui attribue un nomen à une entité. @fr
definition: Relaciona un nomen amb un agent col·lectiu que assigna un nomen a una entitat. @ca
definition: Relateert een nomen aan een collectieve actor die een nomen toekent aan een entiteit. @nl
definition: Relaterer et nomen til en kollektiv agent som angir et nomen til en entitet. @no
definition: Relaterer et nomen til en kollektiv agent, som angiver et nomen til en entitet. @da
definition: Relates a nomen to a collective agent who assigns a nomen to an entity.
definition: Sasaista nomenu ar grupu, kas piešķir entītei nomenu. @lv
definition: Seostab nomen'i kollektiiviga, kes on määranud nomen'i olemile. @et
definition: Setzt ein Nomen in Beziehung zu einem gemeinschaftlicher Akteur, der einer Entität ein Nomen zuweist. @de
definition: يربط تسمية بوكيل جماعي يخصص تسمية لكيان. @ar
definition: 将一个命名与给一个实体分配一个命名的一个集体行为者关联起来。 @zh-hans

is assigned by corporate body
has element type: 2
toolkit definition: A corporate body who assigns a nomen to an entity.
toolkit definition: Asutus, kes on määranud nomen'i olemile. @et
toolkit definition: Bir varlığa bir nomen atayan bir tüzel kişi. @tr
toolkit definition: Collectivité qui attribue un nomen à une entité. @fr
toolkit definition: Een corporatie die een nomen toekent aan een entiteit. @nl
toolkit definition: Egy testület, amely hozzárendel egy noment egy entitáshoz. @hu
toolkit definition: Eine Körperschaft, die einer Entität ein Nomen zuweist. @de
toolkit definition: En korporasjon som angir et nomen til en entitet. @no
toolkit definition: Entitat corporativa que assigna un nomen a una entitat. @ca
toolkit definition: Institūcija, kas piešķir entītei nomenu. @lv
toolkit definition: Korporation, som angiver et nomen til en entitet. @da
toolkit definition: Un ente che assegna un nomen a un'entità. @it
toolkit definition: Yhteisö, joka antaa entiteetille nomenin. @fi
toolkit definition: هيئة تخصص تسمية لكيان. @ar
toolkit definition: 给一个实体分配一个命名的一个团体 @zh-hans
toolkit label: angitt av korporasjon @no
toolkit label: angivet af korporation @da
toolkit label: assegnato da ente @it
toolkit label: assignat per una entitat corporativa @ca
toolkit label: assigned by corporate body
toolkit label: attribué par une collectivité @fr
toolkit label: hozzárendelve a következő testület által: @hu
toolkit label: nomen'i määranud asutus @et
toolkit label: nomenin antava yhteisö @fi
toolkit label: nomenu piešķīris (institūcija) @lv
toolkit label: toegekend door corporatie @nl
toolkit label: tüzel kişi tarafından atanan @tr
toolkit label: von einer Körperschaft zugewiesen @de
toolkit label: خصصتها هيئة @ar
toolkit label: 被一个团体分配 @zh-hans
has subproperty: P80075
lexical alias: assignedByCorporateBody.en
status: Published
type: Property
domain: C10012
label: er angitt av korporasjon @no
label: er angivet af korporation @da
label: est attribué par une collectivité @fr
label: hozzárendelve a következő testület által: @hu
label: ir nomenu piešķīris (institūcija) @lv
label: is toegekend door corporatie @nl
label: ist von einer Körperschaft zugewiesen @de
label: nomen'i määranud asutus @et
label: nomenin antava yhteisö @fi
label: tüzel kişi tarafından atanmıştır @tr
label: è assegnato da ente @it
label: és assignat per una entitat corporativa @ca
label: هي خصصتها هيئة @ar
label: 是被一个团体分配 @zh-hans
sub property of: has related corporate body of nomen
sub property of: is assigned by collective agent
definition: Bir ismi bir varlığa bir niteleyici isim atayan bir tüzel kişiyle ilişkilendirir. @tr
definition: Correla un nomen a un ente che assegna un nomen a un'entità. @it
definition: Hozzákapcsol egy noment egy testülethez, amely hozzárendel egy noment egy entitáshoz. @hu
definition: Liittää nomenin yhteisöön, joka antaa entiteetille nomenin. @fi
definition: Met un nomen en relation avec une collectivité qui attribue un nomen à une entité. @fr
definition: Relaciona un nomen amb una entitat corporativa que assigna un nomen a una entitat. @ca
definition: Relateert een nomen aan een corporatie die een nomen toekent aan een entiteit. @nl
definition: Relaterer et nomen til en korporasjon som angir et nomen til en entitet. @no
definition: Relaterer et nomen til en korporation, som angiver et nomen til en entitet. @da
definition: Relates a nomen to a corporate body who assigns a nomen to an entity.
definition: Sasaista nomenu ar institūciju, kas piešķir entītei nomenu. @lv
definition: Seostab nomen'i asutusega, kes on määranud nomen'i olemile. @et
definition: Setzt ein Nomen in Beziehung zu einer Körperschaft, die einer Entität ein Nomen zuweist. @de
definition: يربط تسمية بهيئة تخصص تسمية لكيان. @ar
definition: 将一个命名与给一个实体分配一个命名的一个团体关联起来。 @zh-hans

is assigned by family
has element type: 2
toolkit definition: A family who assigns a nomen to an entity.
toolkit definition: Bir varlığa nomen atayan bir aile. @tr
toolkit definition: Dzimta/ģimene, kas piešķir entītei nomenu. @lv
toolkit definition: Een familie die een nomen toekent aan een entiteit. @nl
toolkit definition: Egy család, amely hozzárendel egy noment egy entitáshoz. @hu
toolkit definition: Eine Familie, die einer Entität ein Nomen zuweist. @de
toolkit definition: En familie som angir et nomen til en entitet. @no
toolkit definition: Familie, som angiver et nomen til en entitet. @da
toolkit definition: Famille qui attribue un nomen à une entité. @fr
toolkit definition: Família que assigna un nomen a una entitat. @ca
toolkit definition: Perekond, kes on määranud nomen'i olemile. @et
toolkit definition: Suku, joka antaa entiteetille nomenin. @fi
toolkit definition: Una famiglia che assegna un nomen a un'entità. @it
toolkit definition: عائلة تخصص تسمية لكيان. @ar
toolkit definition: 给一个实体分配一个命名的一个家族 @zh-hans
toolkit label: aile tarafından atanan @tr
toolkit label: angitt av familie @no
toolkit label: angivet af familie @da
toolkit label: assegnato da famiglia @it
toolkit label: assignat per una família @ca
toolkit label: assigned by family
toolkit label: attribué par une famille @fr
toolkit label: hozzárendelve a következő család által: @hu
toolkit label: nomen'i määranud perekond @et
toolkit label: nomenin antava suku @fi
toolkit label: nomenu piešķīris (dzimta/ģimene) @lv
toolkit label: toegekend door familie @nl
toolkit label: von einer Familie zugewiesen @de
toolkit label: خصصتها عائلة @ar
toolkit label: 被一个家族分配 @zh-hans
has subproperty: P80076
lexical alias: assignedByFamily.en
status: Published
type: Property
domain: C10012
label: aile tarafından atanmıştır @tr
label: er angitt av familie @no
label: er angivet af familie @da
label: est attribué par une famille @fr
label: hozzárendelve a következő család által: @hu
label: ir nomenu piešķīris (dzimta/ģimene) @lv
label: is toegekend door familie @nl
label: ist von einer Familie zugewiesen @de
label: nomen'i määranud perekond @et
label: nomenin antava suku @fi
label: è assegnato da famiglia @it
label: és assignat per una família @ca
label: هي خصصتها عائلة @ar
label: 是被一个家族分配 @zh-hans
sub property of: has related family of nomen
sub property of: is assigned by collective agent
definition: Bir ismi, bir varlığa niteleyici bir isim atayan bir aile ile niteleyici bir ismi ilişkilendirir. @tr
definition: Correla un nomen a una famiglia che assegna un nomen a un'entità. @it
definition: Hozzákapcsol egy noment egy családhoz, amely hozzárendel egy noment egy entitáshoz. @hu
definition: Liittää nomenin sukuun, joka antaa entiteetille nomenin. @fi
definition: Met un nomen en relation avec une famille qui attribue un nomen à une entité. @fr
definition: Relaciona un nomen amb una família que assigna un nomen a una entitat. @ca
definition: Relateert een nomen aan een familie die een nomen toekent aan een entiteit. @nl
definition: Relaterer et nomen til en familie som angir et nomen til en entitet. @no
definition: Relaterer et nomen til en familie, som angiver et nomen til en entitet. @da
definition: Relates a nomen to a family who assigns a nomen to an entity.
definition: Sasaista nomenu ar dzimtu/ģimeni, kas piešķir entītei nomenu. @lv
definition: Seostab nomen'i perekonnaga, kes on määranud nomen'i olemile. @et
definition: Setzt ein Nomen in Beziehung zu einer Familie, die einer Entität ein Nomen zuweist. @de
definition: يربط تسمية بعائلة تخصص تسمية لكيان. @ar
definition: 将一个命名与给一个实体分配一个命名的一个家族关联起来。 @zh-hans

is assigned by person
has element type: 2
toolkit definition: A person who assigns a nomen to an entity.
toolkit definition: Bir varlığa bir isim atayan kişi. @tr
toolkit definition: Een persoon die een nomen toekent aan een entiteit. @nl
toolkit definition: Egy személy, aki hozzárendel egy noment egy entitáshoz. @hu
toolkit definition: Eine Person, die einer Entität ein Nomen zuweist. @de
toolkit definition: En person som angir et nomen til en entitet. @no
toolkit definition: Henkilö, joka antaa entiteetille nomenin. @fi
toolkit definition: Isik, kes on määranud nomen'i olemile. @et
toolkit definition: Person, som angiver et nomen til en entitet. @da
toolkit definition: Persona que assigna un nomen a una entitat. @ca
toolkit definition: Persona, kura piešķir entītei nomenu. @lv
toolkit definition: Personne qui attribue un nomen à une entité. @fr
toolkit definition: Una persona che assegna un nomen a un'entità. @it
toolkit definition: شخص يخصص تسمية لكيان. @ar
toolkit definition: 给一个实体分配一个命名的一个个人 @zh-hans
toolkit label: angitt av person @no
toolkit label: angivet af person @da
toolkit label: assegnato da persona @it
toolkit label: assignat per una persona @ca
toolkit label: assigned by person
toolkit label: attribué par une personne @fr
toolkit label: hozzárendelve a következő személy által: @hu
toolkit label: kişi tarafından atanan @tr
toolkit label: nomen'i määranud isik @et
toolkit label: nomenin antava henkilö @fi
toolkit label: nomenu piešķīris (persona) @lv
toolkit label: toegekend door persoon @nl
toolkit label: von einer Person zugewiesen @de
toolkit label: خصصها شخص @ar
toolkit label: 被一个个人分配 @zh-hans
has subproperty: P80077
lexical alias: assignedByPerson.en
status: Published
type: Property
domain: C10012
label: er angitt av person @no
label: er angivet af person @da
label: est attribué par une personne @fr
label: hozzárendelve a következő személy által: @hu
label: ir nomenu piešķīris (persona) @lv
label: is toegekend door persoon @nl
label: ist von einer Person zugewiesen @de
label: kişi tarafından atanmıştır @tr
label: nomen'i määranud isik @et
label: nomenin antava henkilö @fi
label: è assegnato da persona @it
label: és assignat per una persona @ca
label: هي خصصها شخص @ar
label: 是被一个个人分配 @zh-hans
sub property of: has related person of nomen
sub property of: is assigned by agent
definition: Bir ismi, bir varlığa niteleyici isim atayan bir kişiyle ilişkilendirir. @tr
definition: Correla un nomen a una persona che assegna un nomen a un'entità. @it
definition: Hozzákapcsol egy noment egy személyhez, aki hozzárendel egy noment egy entitáshoz. @hu
definition: Liittää nomenin henkilöön, joka antaa entiteetille nomenin. @fi
definition: Met un nomen en relation avec une personne qui attribue un nomen à une entité. @fr
definition: Relaciona un nomen amb una persona que assigna un nomen a una entitat. @ca
definition: Relateert een nomen aan een persoon die een nomen toekent aan een entiteit. @nl
definition: Relaterer et nomen til en person som angir et nomen til en entitet. @no
definition: Relaterer et nomen til en person, som angiver et nomen til en entitet. @da
definition: Relates a nomen to a person who assigns a nomen to an entity.
definition: Sasaista nomenu ar personu, kura piešķir entītei nomenu. @lv
definition: Seostab nomen'i isikuga, kes on määranud nomen'i olemile. @et
definition: Setzt ein Nomen in Beziehung zu einer Person, die einer Entität ein Nomen zuweist. @de
definition: يربط تسمية بشخص يخصص تسمية لكيان. @ar
definition: 将一个命名与给一个实体分配一个命名的一个个人关联起来。 @zh-hans

has category of nomen
has element type: 5
toolkit definition: A type to which a nomen belongs.
toolkit definition: A típus, amelyhez a nomen tartozik. @hu
toolkit definition: Bir ismin ait olduğu bir tür. @tr
toolkit definition: Een type waartoe een nomen behoort. @nl
toolkit definition: Eine Art, zu der ein Nomen gehört. @de
toolkit definition: En type som et nomen tilhører. @no
toolkit definition: Tipus al qual pertany un nomen. @ca
toolkit definition: Type auquel un nomen appartient. @fr
toolkit definition: Type, som et nomen tilhører. @da
toolkit definition: Tyyppi, johon nomen kuuluu. @fi
toolkit definition: Tüüp, millesse nomen kuulub. @et
toolkit definition: Un tipo al quale il nome appartiene. @it
toolkit definition: Veids, pie kura pieder nomens. @lv
toolkit definition: فئة تنتمي إليها تسمية. @ar
toolkit definition: 一个命名所属于的一个类型 @zh-hans
toolkit label: Kategorie eines Nomens @de
toolkit label: categoria de nomen @ca
toolkit label: categoria del nomen @it
toolkit label: categorie van nomen @nl
toolkit label: category of nomen
toolkit label: catégorie de nomen @fr
toolkit label: isim kategorisi @tr
toolkit label: kategori af nomen @da
toolkit label: kategori av nomen @no
toolkit label: nomen kategóriája: @hu
toolkit label: nomen'i kategooria @et
toolkit label: nomena kategorija @lv
toolkit label: nomenin kategoria @fi
toolkit label: فئة تسمية @ar
toolkit label: 命名的类别 @zh-hans
has subproperty: P80078
lexical alias: categoryOfNomen.en
status: Published
type: Property
domain: C10012
label: a pour catégorie de nomen @fr
label: ha come categoria del nomen @it
label: har kategori af nomen @da
label: har kategori av nomen @no
label: hat Kategorie eines Nomens @de
label: heeft categorie van nomen @nl
label: ismin kategorisi ile ilişkilidir @tr
label: nomen kategóriája a következő: @hu
label: nomen'i kategooria @et
label: nomena kategorija @lv
label: nomenin kategoria @fi
label: té com a categoria de nomen @ca
label: له فئة تسمية @ar
label: 有命名的类别 @zh-hans
sub property of: P00029
alternative label: Art eines Nomens @de
alternative label: isimin türü @tr
alternative label: nomen'i tüüp @et
alternative label: nomenin tyyppi @fi
alternative label: nomentípus: @hu
alternative label: tipo di nomen @it
alternative label: tipus de nomen @ca
alternative label: type af nomen @da
alternative label: type de nomen @fr
alternative label: type nomen @no
alternative label: type of nomen
alternative label: نوع تسمية @ar
alternative label: 命名的类型 @zh-hans
definition: Bir ismi, bir ismin ait olduğu bir eserle ilişkilendirir. @tr
definition: Correla un nomen a un tipo al quale il nome appartiene. @it
definition: Hozzákapcsol egy noment ahhoz a típushoz, amelyhez a nomen tartozik. @hu
definition: Liittää nomenin tyyppiin, johon nomen kuuluu. @fi
definition: Met un nomen en relation avec un type auquel un nomen appartient. @fr
definition: Relaciona un nomen amb un tipus al qual pertany un nomen. @ca
definition: Relateert een nomen aan een type waartoe een nomen behoort. @nl
definition: Relaterer et nomen til en type som et nomen tilhører. @no
definition: Relaterer et nomen til en type, som et nomen tilhører. @da
definition: Relates a nomen to a type to which a nomen belongs.
definition: Sasaista nomenu ar veidu, pie kura pieder nomens. @lv
definition: Seostab nomen'i tüübiga, millesse nomen kuulub. @et
definition: Setzt ein Nomen in Beziehung zu einer Art, zu der ein Nomen gehört. @de
definition: يربط التسمية بفئة تنتمي إليها تسمية. @ar
definition: 将一个命名与一个命名所属于的一个类型关联起来。 @zh-hans

is authorized access point for work of
has element type: 2
toolkit definition: A work that has an access point for work that is selected for preference in a specific vocabulary encoding scheme.
toolkit definition: Belirli bir kelime kodlama şemasında tercihen seçilen eser için bir erişim noktasına sahip bir eser. @tr
toolkit definition: Darbs, kam ir vārdforma, kas ir izvēlēta kā prioritāra noteiktai kontrolētas vārdnīcas shēmai. @lv
toolkit definition: Een werk dat een ingang voor werk heeft die als voorkeursterm geselecteerd is in een specifiek vocabulair coderingssysteem. @nl
toolkit definition: Egy mű, amelynek van egy olyan előnyben részesített hozzáférési pontja a műhöz, amelyet egy adott szótárkódolási sémából választanak ki. @hu
toolkit definition: Ein Werk, das über einen Sucheinstieg für ein Werk verfügt, der in einem bestimmten Vocabulary Encoding Scheme als Vorzugsform bestimmt wird. @de
toolkit definition: Et verk som har en søkeinngang for verk som er valgt som preferanse i et bestemt kodeskjema for vokabular. @no
toolkit definition: Obra que té un punt d’accés d’obra que se selecciona com a preferent en un esquema de codificació de vocabulari específic. @ca
toolkit definition: Teos, jolla on tietyssä sanaston merkintäjärjestelmässä ensisijaiseksi valittu hakutieto. @fi
toolkit definition: Teos, millel on vastavas leksikaalses märkimissüsteemis eelistatuks valitud otsielement. @et
toolkit definition: Un'opera che ha un punto d'accesso per l'opera che è stato selezionato come preferito in uno specifico schema di codifica di vocabolario. @it
toolkit definition: Værk, som har en søgeindgang for værk, som er valgt som præference i et specifikt vokabularkodningsskema. @da
toolkit definition: Œuvre qui possède un point d’accès d’une œuvre faisant l’objet d’un choix privilégié dans un schéma d’encodage de vocabulaire spécifique. @fr
toolkit definition: عمل له نقطة وصول لعمل، اختيرت للتفضيل في خطة ترميز مفردات محددة. @ar
toolkit definition: 有在一个特定的词表编码体系中被首选的作品检索点的一种作品 @zh-hans
toolkit label: Normierter Sucheinstieg für ein Werk von @de
toolkit label: auktorisoitu hakutieto teokselle @fi
toolkit label: authorized access point for work of
toolkit label: autoriseret søgeindgang for værk af @da
toolkit label: autorisert søkeinngang for verk for @no
toolkit label: autorizált hozzáférési pont a következő műhöz: @hu
toolkit label: eser için yetkili erişim noktası @tr
toolkit label: geautoriseerde ingang voor werk van @nl
toolkit label: ir autoritatīvā vārdforma darbam @lv
toolkit label: normitud otsielement teosele @et
toolkit label: point d’accès autorisé d’une œuvre de @fr
toolkit label: punt d’accés autoritzat d’obra de @ca
toolkit label: punto d'accesso autorizzato per opera di @it
toolkit label: نقطة وصول مقننة لعمل لـ @ar
toolkit label: ……的作品的规范检索点 @zh-hans
has subproperty: is authorized access point for work group of
has subproperty: P80079
lexical alias: authorizedAccessPointForWorkOf.en
status: Published
type: Property
domain: C10012
label: auktorisoitu hakutieto teokselle @fi
label: autorizált hozzáférési pont a következő műhöz: @hu
label: er autoriseret søgeindgang for værk af @da
label: er autorisert søkeinngang for verk for @no
label: eser için yetkili erişim noktasıdır @tr
label: est un point d’accès autorisé d’une œuvre de @fr
label: ir autoritatīvā vārdforma darbam @lv
label: is geautoriseerde ingang voor werk van @nl
label: ist normierter Sucheinstieg für ein Werk von @de
label: normitud otsielement teosele @et
label: è punto d'accesso autorizzato per opera di @it
label: és punt d’accés autoritzat d’obra de @ca
label: هي نقطة وصول مقننة لعمل لـ @ar
label: 是……的作品的规范检索点 @zh-hans
sub property of: is access point for work of
sub property of: is authorized access point for RDA entity of
definition: Bir ismi, belirli bir kelime kodlama şemasında tercih için seçilen eser için bir erişim noktasına sahip olan bir eserle ilişkilendirir. @tr
definition: Correla un nomen a un'opera che ha un punto d'accesso per l'opera che è stato selezionato come preferito in uno specifico schema di codifica di vocabolario. @it
definition: Hozzákapcsol egy noment egy műhöz, amelynek van egy olyan előnyben részesített hozzáférési pontja a műhöz, amelyet egy adott szótárkódolási sémából választanak ki. @hu
definition: Liittää nomenin teokseen, jolla on tietyssä sanaston merkintäjärjestelmässä ensisijaiseksi valittu hakutieto. @fi
definition: Met un nomen en relation avec une œuvre qui possède un point d’accès d’une œuvre faisant l’objet d’un choix privilégié dans un schéma d’encodage de vocabulaire spécifique. @fr
definition: Relaciona un nomen amb una obra que té un punt d’accés d’obra que se selecciona com a preferent en un esquema de codificació de vocabulari específic. @ca
definition: Relateert een nomen aan een werk dat een ingang voor werk heeft die als voorkeursterm geselecteerd is in een specifiek vocabulair coderingssysteem. @nl
definition: Relaterer et nomen til et verk som har en søkeinngang for verk som er valgt som preferanse i et bestemt kodeskjema for vokabular. @no
definition: Relaterer et nomen til et værk, som har en søgeindgang for værk, som er valgt som præference i et specifikt vokabularkodningsskema. @da
definition: Relates a nomen to a work that has an access point for work that is selected for preference in a specific vocabulary encoding scheme.
definition: Sasaista nomenu ar darbu, kam ir vārdforma, kas ir izvēlēta kā prioritāra noteiktai kontrolētas vārdnīcas shēmai. @lv
definition: Seostab nomen'i teosega, millel on vastavas leksikaalses märkimissüsteemis eelistatuks valitud otsielement. @et
definition: Setzt ein Nomen in Beziehung zu einem Werk, das über einen Sucheinstieg für ein Werk verfügt, der in einem bestimmten Vocabulary Encoding Scheme als Vorzugsform bestimmt wird. @de
definition: يربط تسمية بعمل له نقطة وصول لعمل، اختيرت للتفضيل في خطة ترميز مفردات محددة. @ar
definition: 将一个命名与有在一个特定的词表编码体系中被首选的作品检索点的一种作品关联起来。 @zh-hans

is variant access point for work of
has element type: 2
toolkit definition: A work that has an access point for work that is not selected for preference in a specific vocabulary encoding scheme.
toolkit definition: Belirli bir kelime kodlama şemasında tercihen seçilmemiş eser için bir erişim noktası olan bir eser. @tr
toolkit definition: Darbs, kam ir vārdforma, kas nav izvēlēta kā prioritāra noteiktai kontrolētas vārdnīcas shēmai. @lv
toolkit definition: Een werk dat een ingang voor werk heeft die niet als voorkeursterm geselecteerd is in een specifiek vocabulair coderingssysteem. @nl
toolkit definition: Egy mű, amelynek van egy olyan hozzáférési pontja a műhöz, amely egy bizonyos szótárkódolási sémában nem részesül előnyben. @hu
toolkit definition: Ein Werk, das über einen Sucheinstieg für ein Werk verfügt, der in einem bestimmten Vocabulary Encoding Scheme nicht als Vorzugsform bestimmt wird. @de
toolkit definition: Et verk som har en søkeinngang for verk som ikke er valgt som preferanse i et bestemt kodeskjema for vokabular. @no
toolkit definition: Obra que té un punt d’accés d’obra que no se selecciona com a preferent en un esquema de codificació de vocabulari específic. @ca
toolkit definition: Teos, jonka hakutietoa ei ole valittu ensisijaiseksi tietyssä sanaston merkintäjärjestelmässä. @fi
toolkit definition: Teos, millel on otsielement, mis ei ole valitud eelistatuks vastavas leksikaalses märkimissüsteemis. @et
toolkit definition: Un'opera che ha un punto d'accesso per l'opera che non è stato selezionato come preferito in uno specifico schema di codifica di vocabolario. @it
toolkit definition: Værk, som har en søgeindgang for værk, som ikke er valgt som præference i et specifikt vokabularkodningsskema. @da
toolkit definition: Œuvre qui possède un point d’accès d’une œuvre ne faisant pas l’objet d’un choix privilégié dans un schéma d’encodage de vocabulaire spécifique. @fr
toolkit definition: عمل له نقطة وصول لعمل، لم تُختر للتفضيل في خطة ترميز مفردات محددة. @ar
toolkit definition: 有在一个特定的词表编码体系中未被首选的作品检索点的一种作品 @zh-hans
toolkit label: Zusätzlicher Sucheinstieg für ein Werk von @de
toolkit label: alternativ søkeinngang for verk for @no
toolkit label: eser için alternatif erişim noktası @tr
toolkit label: hozzáférésipont-variánsa a következő műnek: @hu
toolkit label: ir cita vārdforma darbam @lv
toolkit label: otsielemendi variant teosele @et
toolkit label: punto d'accesso variante per opera di @it
toolkit label: variant access point for work of
toolkit label: variant af søgeindgang for værk af @da
toolkit label: variant de punt d’accés d’obra de @ca
toolkit label: variant ingang voor werk van @nl
toolkit label: variante de point d’accès d’une œuvre de @fr
toolkit label: varianttihakutieto teokselle @fi
toolkit label: نقطة وصول مختلفة لعمل لـ @ar
toolkit label: ……的作品的变异检索点 @zh-hans
has subproperty: P80080
lexical alias: variantAccessPointForWorkOf.en
status: Published
type: Property
domain: C10012
label: er alternativ søkeinngang for verk for @no
label: er variant af søgeindgang for værk af @da
label: eser için farklı erişim noktası @tr
label: est une variante de point d’accès d’une œuvre de @fr
label: hozzáférésipont-variánsa a következő műnek: @hu
label: ir cita vārdforma darbam @lv
label: is variant ingang voor werk van @nl
label: ist zusätzlicher Sucheinstieg für ein Werk von @de
label: otsielemendi variant teosele @et
label: varianttihakutieto teokselle @fi
label: è punto d'accesso variante per opera di @it
label: és variant de punt d’accés d’obra de @ca
label: هي نقطة وصول مختلفة لعمل لـ @ar
label: 是……的作品的变异检索点 @zh-hans
sub property of: is access point for work of
sub property of: is variant access point for RDA entity of
definition: Bir ismi, belirli bir kelime kodlama şemasında tercih edilmeyen bir eser için erişim noktası olan bir eserle ilişkilendirir. @tr
definition: Correla un nomen a un'opera che ha un punto d'accesso per l'opera che non è stato selezionato come preferito in uno specifico schema di codifica di vocabolario. @it
definition: Hozzákapcsol egy noment egy műhoz, amelynek van egy olyan hozzáférési pontja a műhöz, amely egy bizonyos szótárkódolási sémában nem részesül előnyben. @hu
definition: Liittää nomenin teokseen, jonka hakutietoa ei ole valittu ensisijaiseksi tietyssä sanaston merkintäjärjestelmässä. @fi
definition: Met un nomen en relation avec une œuvre qui possède un point d’accès d’une œuvre ne faisant pas l’objet d’un choix privilégié dans un schéma d’encodage de vocabulaire spécifique. @fr
definition: Relaciona un nomen amb una obra que té un punt d’accés d’obra que no se selecciona com a preferent en un esquema de codificació de vocabulari específic. @ca
definition: Relateert een nomen aan een werk dat een ingang voor werk heeft die niet als voorkeursterm geselecteerd is in een specifiek vocabulair coderingssysteem. @nl
definition: Relaterer et nomen til et verk som har en søkeinngang for verk som ikke er valgt som preferanse i et bestemt kodeskjema for vokabular. @no
definition: Relaterer et nomen til et værk, som har en søgeindgang for værk, som ikke er valgt som præference i et specifikt vokabularkodningsskema. @da
definition: Relates a nomen to a work that has an access point for work that is not selected for preference in a specific vocabulary encoding scheme.
definition: Sasaista nomenu ar darbu, kam ir vārdforma, kas nav izvēlēta kā prioritāra noteiktai kontrolētas vārdnīcas shēmai. @lv
definition: Seostab nomen'i teosega, millel on otsielement, mis ei ole valitud eelistatuks vastavas leksikaalses märkimissüsteemis. @et
definition: Setzt ein Nomen in Beziehung zu einem Werk, das über einen Sucheinstieg für ein Werk verfügt, der in einem bestimmten Vocabulary Encoding Scheme nicht als Vorzugsform bestimmt wird. @de
definition: يربط تسمية بعمل له نقطة وصول لعمل، لم تُختر للتفضيل في خطة ترميز مفردات محددة. @ar
definition: 将一个命名与有在一个特定的词表编码体系中未被首选的作品检索点的一种作品关联起来。 @zh-hans

is authorized access point for timespan of
has element type: 2
toolkit definition: A timespan that has an access point for timespan that is selected for preference in a specific vocabulary encoding scheme.
toolkit definition: Ajanjakso, jolla on tietyssä sanaston merkintäjärjestelmässä ensisijaiseksi valittu hakutieto. @fi
toolkit definition: Ajavahemik, millel on vastavas leksikaalses märkimissüsteemis eelistatuks valitud otsielement. @et
toolkit definition: Belirli bir kelime kodlama şemasında tercih için seçilen zaman aralığı için bir erişim noktası olan bir zaman aralığı. @tr
toolkit definition: Een tijdspanne die een ingang voor tijdspanne heeft die als voorkeursterm geselecteerd is in een specifiek vocabulair coderingssysteem. @nl
toolkit definition: Egy időtartam, amelynek van egy előnyben részesített hozzáférési pontja az időtartamhoz, amelyet egy adott szótárkódolási sémából választanak ki. @hu
toolkit definition: Ein Zeitraum, der über einen Sucheinstieg für einen Zeitraum verfügt, der in einem bestimmten Vocabulary Encoding Scheme als Vorzugsform bestimmt wird. @de
toolkit definition: Et tidsrom som har en søkeinngang for tidsrom som er valgt som preferanse i et bestemt kodeskjema for vokabular. @no
toolkit definition: Interval de temps que té un punt d’accés d’interval de temps que se selecciona com a preferent en un esquema de codificació de vocabulari específic. @ca
toolkit definition: Laikposma, kuram ir laikposma pamatforma, kas izvēlēta no konkrētas vārdnīcas. @lv
toolkit definition: Laps de temps qui possède un point d’accès d’un laps de temps faisant l’objet d’un choix privilégié dans un schéma d’encodage de vocabulaire spécifique. @fr
toolkit definition: Tidsperiode, som har en søgeindgang for tidsperiode, som er valgt som præference i et specifikt vokabularkodningsskema. @da
toolkit definition: Un arco di tempo che ha un punto d'accesso per l'arco di tempo che è stato selezionato come preferito in uno specifico schema di codifica di vocabolario. @it
toolkit definition: فترة زمنية لها نقطة وصول لفترة زمنية، اختيرت للتفضيل في خطة ترميز مفردات محددة. @ar
toolkit definition: 有在一个特定的词表编码体系中被首选的时间段检索点的一个时间段 @zh-hans
toolkit label: Normierter Sucheinstieg für einen Zeitraum von @de
toolkit label: auktorisoitu hakutieto ajanjaksolle @fi
toolkit label: authorized access point for timespan of
toolkit label: autoriseret søgeindgang for tidsperiode af @da
toolkit label: autorisert søkeinngang for tidsrom for @no
toolkit label: autorizált hozzáférési pont a következő időtartamhoz: @hu
toolkit label: geautoriseerde ingang voor tijdspanne van @nl
toolkit label: ir laikposma autoritatīvā pamatforma @lv
toolkit label: normitud otsielement ajavahemikule @et
toolkit label: point d’accès autorisé d’un laps de temps de @fr
toolkit label: punt d’accés autoritzat d’interval de temps de @ca
toolkit label: punto d'accesso autorizzato per arco di tempo di @it
toolkit label: zaman aralığı için yetkili erişim noktası @tr
toolkit label: نقطة وصول مقننة لفترة زمنية لـ @ar
toolkit label: ……的时间段的规范检索点 @zh-hans
has subproperty: P80081
lexical alias: authorizedAccessPointForTimespanOf.en
status: Published
type: Property
domain: C10012
label: auktorisoitu hakutieto ajanjaksolle @fi
label: autorizált hozzáférési pont a következő időtartamhoz: @hu
label: er autoriseret søgeindgang for tidsperiode af @da
label: er autorisert søkeinngang for tidsrom for @no
label: est un point d’accès autorisé d’un laps de temps de @fr
label: ir laikposma autoritatīvā pamatforma @lv
label: is geautoriseerde ingang voor tijdspanne van @nl
label: ist normierter Sucheinstieg für einen Zeitraum von @de
label: normitud otsielement ajavahemikule @et
label: zaman aralığı için yetkili erişim noktasıdır @tr
label: è punto d'accesso autorizzato per arco di tempo di @it
label: és punt d’accés autoritzat d’interval de temps de @ca
label: هي نقطة وصول مقننة لفترة زمنية لـ @ar
label: 是……的时间段的规范检索点 @zh-hans
sub property of: is access point for timespan of
sub property of: is authorized access point for RDA entity of
definition: Bir ismi, belirli bir kelime kodlama şemasında tercih için seçilen zaman aralığı için erişim noktası olan bir zaman aralığıyla ilişkilendirir. @tr
definition: Correla un nomen a un arco di tempo che ha un punto d'accesso per l'arco di tempo che è stato selezionato come preferito in uno specifico schema di codifica di vocabolario. @it
definition: Hozzákapcsol egy noment egy időtartamhoz, amelynek van egy előnyben részesített hozzáférési pontja az időtartamhoz, amelyet egy adott szótárkódolási sémából választanak ki. @hu
definition: Liittää nomenin ajanjaksoon, jolla on tietyssä sanaston merkintäjärjestelmässä ensisijaiseksi valittu hakutieto. @fi
definition: Met un nomen en relation avec un laps de temps qui possède un point d’accès d’un laps de temps faisant l’objet d’un choix privilégié dans un schéma d’encodage de vocabulaire spécifique. @fr
definition: Relaciona un nomen amb un interval de temps que té un punt d’accés d’interval de temps que se selecciona com a preferent en un esquema de codificació de vocabulari específic. @ca
definition: Relateert een nomen aan een tijdspanne die een ingang voor tijdspanne heeft die als voorkeursterm geselecteerd is in een specifiek vocabulair coderingssysteem. @nl
definition: Relaterer et nomen til en tidsperiode, som har en søgeindgang for tidsperiode, som er valgt som præference i et specifikt vokabularkodningsskema. @da
definition: Relaterer et nomen til et tidsrom som har en søkeinngang for tidsrom som er valgt som preferanse i et bestemt kodeskjema for vokabular. @no
definition: Relates a nomen to a timespan that has an access point for timespan that is selected for preference in a specific vocabulary encoding scheme.
definition: Sasaista nomenu ar laikposmu, kuram ir laikposma pamatforma, kas izvēlēta no konkrētas vārdnīcas. @lv
definition: Seostab nomen'i ajavahemikuga, millel on vastavas leksikaalses märkimissüsteemis eelistatuks valitud otsielement. @et
definition: Setzt ein Nomen in Beziehung zu einem Zeitraum, der über einen Sucheinstieg für einen Zeitraum verfügt, der in einem bestimmten Vocabulary Encoding Scheme als Vorzugsform bestimmt wird. @de
definition: يربط تسمية بفترة زمنية لها نقطة وصول لفترة زمنية، اختيرت للتفضيل في خطة ترميز مفردات محددة. @ar
definition: 将一个命名与有在一个特定的词表编码体系中被首选的时间段检索点的一个时间段关联起来。 @zh-hans

is variant access point for timespan of
has element type: 2
toolkit definition: A timespan that has an access point for timespan that is not selected for preference in a specific vocabulary encoding scheme.
toolkit definition: Ajanjakso, jonka hakutietoa ei ole valittu ensisijaiseksi tietyssä sanaston merkintäjärjestelmässä. @fi
toolkit definition: Ajavahemik, millel on otsielement, mis ei ole valitud eelistatuks vastavas leksikaalses märkimissüsteemis. @et
toolkit definition: Belirli bir kelime kodlama şemasında tercih için seçilmeyen zaman aralığı için bir erişim noktası olan bir zaman aralığı. @tr
toolkit definition: Een tijdspanne die een ingang voor tijdspanne heeft die niet als voorkeursterm geselecteerd is in een specifiek vocabulair coderingssysteem. @nl
toolkit definition: Egy időtartam, amelynek van egy olyan hozzáférési pontja időtartam számára, amelyet egy adott szótárkódolási sémában nem részesítenek előnyben. @hu
toolkit definition: Ein Zeitraum, der über einen Sucheinstieg für einen Zeitraum verfügt, der in einem bestimmten Vocabulary Encoding Scheme nicht als Vorzugsform bestimmt wird. @de
toolkit definition: Et tidsrom som har en søkeinngang for tidsrom som ikke er valgt som preferanse i et bestemt kodeskjema for vokabular. @no
toolkit definition: Interval de temps que té un punt d’accés d’interval de temps que no se selecciona com a preferent en un esquema de codificació de vocabulari específic. @ca
toolkit definition: Laikposms, kuram ir piekļuves punkts laikposmam, kas nav izvēlēts kā prioritārs noteiktai kontrolētas vārdnīcas shēmai. @lv
toolkit definition: Laps de temps qui possède un point d’accès d’un laps de temps ne faisant pas l’objet d’un choix privilégié dans un schéma d’encodage de vocabulaire spécifique. @fr
toolkit definition: Tidsperiode, som har en søgeindgang for tidsperiode, som ikke er valgt som præference i et specifikt vokabularkodningsskema. @da
toolkit definition: Un arco di tempo che ha un punto d'accesso per l'arco di tempo che non è stato selezionato come preferito in uno specifico schema di codifica di vocabolario. @it
toolkit definition: فترة زمنية لها نقطة وصول لفترة زمنية، لم تُختر للتفضيل في خطة ترميز مفردات محددة. @ar
toolkit definition: 有在一个特定的词表编码体系中未被首选的时间段检索点的一个时间段 @zh-hans
toolkit label: Zusätzlicher Sucheinstieg für einen Zeitraum von @de
toolkit label: alternativ søkeinngang for tidsrom for @no
toolkit label: hozzáférésipont-változata a következő időtartamnak: @hu
toolkit label: ir papildforma laikposmam @lv
toolkit label: otsielemendi variant ajavahemikule @et
toolkit label: punto d'accesso variante per arco di tempo di @it
toolkit label: variant access point for timespan of
toolkit label: variant af søgeindgang for tidsperiode af @da
toolkit label: variant de punt d’accés d’interval de temps de @ca
toolkit label: variant ingang voor tijdspanne van @nl
toolkit label: variante de point d’accès d’un laps de temps de @fr
toolkit label: varianttihakutieto ajanjaksolle @fi
toolkit label: zaman aralığı için alternatif erişim noktası @tr
toolkit label: نقطة وصول مختلفة لفترة زمنية لـ @ar
toolkit label: ……的时间段的变异检索点 @zh-hans
has subproperty: P80082
lexical alias: variantAccessPointForTimespanOf.en
status: Published
type: Property
domain: C10012
label: er alternativ søkeinngang for tidsrom for @no
label: er variant af søgeindgang for tidsperiode af @da
label: est une variante de point d’accès d’un laps de temps de @fr
label: hozzáférésipont-változata a következő időtartamnak: @hu
label: ir papildforma laikposmam @lv
label: is variant ingang voor tijdspanne van @nl
label: ist zusätzlicher Sucheinstieg für einen Zeitraum von @de
label: otsielemendi variant ajavahemikule @et
label: varianttihakutieto ajanjaksolle @fi
label: zaman aralığı için farklı erişim noktası @tr
label: è punto d'accesso variante per arco di tempo di @it
label: és variant de punt d’accés d’interval de temps de @ca
label: هي نقطة وصول مختلفة لفترة زمنية لـ @ar
label: 是……的时间段的变异检索点 @zh-hans
sub property of: is access point for timespan of
sub property of: is variant access point for RDA entity of
definition: Bir ismi, belirli bir kelime kodlama şemasında tercih için seçilmeyen zaman aralığı için erişim noktası olan bir zaman aralığıyla ilişkilendirir. @tr
definition: Correla un nomen a un arco di tempo che ha un punto d'accesso per l'arco di tempo che non è stato selezionato come preferito in uno specifico schema di codifica di vocabolario. @it
definition: Hozzákapcsol egy noment egy időtartamhoz, amelynek van egy olyan hozzáférési pontja időtartam számára, amelyet egy adott szótárkódolási sémában nem részesítenek előnyben. @hu
definition: Liittää nomenin ajanjaksoon, jonka hakutietoa ei ole valittu ensisijaiseksi tietyssä sanaston merkintäjärjestelmässä. @fi
definition: Met un nomen en relation avec un laps de temps qui possède un point d’accès d’un laps de temps ne faisant pas l’objet d’un choix privilégié dans un schéma d’encodage de vocabulaire spécifique. @fr
definition: Relaciona un nomen amb un interval de temps que té un punt d’accés d’interval de temps que no se selecciona com a preferent en un esquema de codificació de vocabulari específic. @ca
definition: Relateert een nomen aan een tijdspanne die een ingang voor tijdspanne heeft die niet als voorkeursterm geselecteerd is in een specifiek vocabulair coderingssysteem. @nl
definition: Relaterer et nomen til en tidsperiode, som har en søgeindgang for tidsperiode, som ikke er valgt som præference i et specifikt vokabularkodningsskema. @da
definition: Relaterer et nomen til et tidsrom som har en søkeinngang for tidsrom som ikke er valgt som preferanse i et bestemt kodeskjema for vokabular. @no
definition: Relates a nomen to a timespan that has an access point for timespan that is not selected for preference in a specific vocabulary encoding scheme.
definition: Sasaista nomenu ar laikposmu, kuram ir piekļuves punkts laikposmam, kas nav izvēlēts kā prioritārs noteiktai kontrolētas vārdnīcas shēmai. @lv
definition: Seostab nomen'i ajavahemikuga, millel on otsielement, mis ei ole valitud eelistatuks vastavas leksikaalses märkimissüsteemis. @et
definition: Setzt ein Nomen in Beziehung zu einem Zeitraum, der über einen Sucheinstieg für einen Zeitraum verfügt, der in einem bestimmten Vocabulary Encoding Scheme nicht als Vorzugsform bestimmt wird. @de
definition: يربط تسمية بفترة زمنية لها نقطة وصول لفترة زمنية، لم تُختر للتفضيل في خطة ترميز مفردات محددة. @ar
definition: 将一个命名与有在一个特定的词表编码体系中未被首选的时间段检索点的一个时间段关联起来。 @zh-hans

is preferred name of timespan of
has element type: 2
toolkit definition: A timespan that has a name of timespan that is selected for preference in a specific application or context.
toolkit definition: Ajanjakso, jonka nimi on valittu ensisijaiseksi tietyssä sovelluksessa tai kontekstissa. @fi
toolkit definition: Ajavahemik, millel on kindlas rakenduses või kontekstis eelistatuks valitud nimi. @et
toolkit definition: Belirli bir uygulama veya bağlamda tercih için seçilen bir zaman aralığı adına sahip bir zaman aralığı. @tr
toolkit definition: Een tijdspanne die een naam van tijdspanne heeft die als voorkeursterm geselecteerd is in een specifieke toepassing of context. @nl
toolkit definition: Egy időtartam, amelynek van egy olyan időtartamneve, amelyet egy adott alkalmazásban vagy kontextusban előnyben részesítenek. @hu
toolkit definition: Ein Zeitraum, der über einen Namen für einen Zeitraum verfügt, der in einer bestimmten Anwendung oder in einem bestimmten Kontext als Vorzugsform bestimmt wird. @de
toolkit definition: Et tidsrom som har et navn for tidsrom som er valgt som preferanse i en bestemt applikasjon eller kontekst. @no
toolkit definition: Interval de temps que té un nom d’interval de temps que se selecciona com a preferent en una aplicació o un context específic. @ca
toolkit definition: Laikposms, kuram ir laikposma nosaukums, kas ir izvēlēts noteiktam lietojumam vai noteiktā kontekstā. @lv
toolkit definition: Laps de temps qui possède un nom de laps de temps faisant l’objet d’un choix privilégié dans un schéma d’encodage de vocabulaire spécifique. @fr
toolkit definition: Tidsperiode, som har et navn på tidsperiode, som er valgt som præference i en specifik anvendelse eller kontekst. @da
toolkit definition: Un arco di tempo che ha un nome di arco di tempo che è stato selezionato come preferito in una specifica applicazione o contesto. @it
toolkit definition: فترة زمنية لها اسم لفترة زمنية، اختير للتفضيل في تطبيق أو في سياق معين. @ar
toolkit definition: 有在一个特定的应用或语境中被首选的一个时间段名称的一个时间段 @zh-hans
toolkit label: bevorzugter Name eines Zeitraums von @de
toolkit label: eelisnimi ajavahemikule @et
toolkit label: előnyben részesített időtartamneve: @hu
toolkit label: ensisijainen nimi ajanjaksolle @fi
toolkit label: foretrukket navn på tidsperiode af @da
toolkit label: foretrukket navn på tidsrom for @no
toolkit label: geprefereerde naam van tijdspanne van @nl
toolkit label: ir laikposma prioritārais nosaukums @lv
toolkit label: nom preferit d’interval de temps de @ca
toolkit label: nom privilégié d’un laps de temps de @fr
toolkit label: nome preferito del luogo di @it
toolkit label: preferred name of timespan of
toolkit label: zaman aralığının tercih edilen ismi @tr
toolkit label: اسم فترة زمنية مفضل لـ @ar
toolkit label: ……的时间段的首选名称 @zh-hans
has subproperty: P80083
lexical alias: preferredNameOfTimespanOf.en
status: Published
type: Property
domain: C10012
label: eelisnimi ajavahemikule @et
label: előnyben részesített időtartamneve a következőnek: @hu
label: ensisijainen nimi ajanjaksolle @fi
label: er foretrukket navn på tidsperiode af @da
label: er foretrukket navn på tidsrom for @no
label: est un nom privilégié d’un laps de temps de @fr
label: ir laikposma prioritārais nosaukums @lv
label: is geprefereerde naam van tijdspanne van @nl
label: ist bevorzugter Name eines Zeitraums von @de
label: zaman aralığının tercih edilen adıdır @tr
label: è nome preferito del luogo di @it
label: és nom preferit d’interval de temps de @ca
label: هو اسم فترة زمنية مفضل لـ @ar
label: 是……的时间段的首选名称 @zh-hans
sub property of: is name of timespan of
sub property of: is preferred name of RDA entity of
definition: Bir ismi, belirli bir uygulama veya bağlamda tercih için seçilen bir zaman aralığı adına sahip bir zaman aralığıyla ilişkilendirir. @tr
definition: Correla un nomen a un arco di tempo che ha un nome di arco di tempo che è stato selezionato come preferito in una specifica applicazione o contesto. @it
definition: Hozzákapcsol egy noment egy időtartamhoz, amelynek van egy olyan időtartamneve, amelyet egy adott alkalmazásban vagy kontextusban előnyben részesítenek. @hu
definition: Liittää nomenin ajanjaksoon, jonka nimi on valittu ensisijaiseksi tietyssä sovelluksessa tai kontekstissa. @fi
definition: Met un nomen en relation avec un laps de temps qui possède un nom de laps de temps faisant l’objet d’un choix privilégié dans un schéma d’encodage de vocabulaire spécifique. @fr
definition: Relaciona un nomen amb un interval de temps que té un nom d’interval de temps que se selecciona com a preferent en una aplicació o un context específic. @ca
definition: Relateert een nomen aan een tijdspanne die een naam van tijdspanne heeft die als voorkeursterm geselecteerd is in een specifieke toepassing of context. @nl
definition: Relaterer et nomen til en tidsperiode, som har et navn på tidsperiode, som er valgt som præference i en specifik anvendelse eller kontekst. @da
definition: Relaterer et nomen til et tidsrom som har et navn for tidsrom som er valgt som preferanse i en bestemt applikasjon eller kontekst. @no
definition: Relates a nomen to a timespan that has a name of timespan that is selected for preference in a specific application or context.
definition: Sasaista nomenu ar laikposmu, kuram ir laikposma nosaukums, kas ir izvēlēts noteiktam lietojumam vai noteiktā kontekstā. @lv
definition: Seostab nomen'i ajavahemikuga, millel on kindlas rakenduses või kontekstis eelistatuks valitud nimi. @et
definition: Setzt ein Nomen in Beziehung zu einem Zeitraum, der über einen Namen für einen Zeitraum verfügt, der in einer bestimmten Anwendung oder in einem bestimmten Kontext als Vorzugsform bestimmt wird. @de
definition: يربط تسمية بفترة زمنية لها اسم لفترة زمنية، اختير للتفضيل في تطبيق أو في سياق معين. @ar
definition: 将一个命名与有在一个特定的应用或语境中被首选的一个时间段名称的一个时间段关联起来。 @zh-hans

is variant name of timespan of
has element type: 2
toolkit definition: A timespan that has a name of timespan that is not selected for preference in a specific application or context.
toolkit definition: Ajanjakso, jonka nimeä ei ole valittu ensisijaiseksi tietyssä sovelluksessa tai kontekstissa. @fi
toolkit definition: Ajavahemik, millel on nimi, mis kindlas rakenduses või kontekstis ei ole valitud eelistatuks. @et
toolkit definition: Belirli bir uygulama veya bağlamda tercih için seçilmeyen bir zaman aralığı adına sahip bir zaman aralığı. @tr
toolkit definition: Een tijdspanne die een naam van tijdspanne heeft die niet als voorkeursterm geselecteerd is in een specifieke toepassing of context. @nl
toolkit definition: Egy időtartam, amelynek van egy időtartamneve, amelyet egy adott alkalmazásban vagy kontextusban nem részesítenek előnyben. @hu
toolkit definition: Ein Zeitraum, der über einen Namen für einen Zeitraum verfügt, der in einer bestimmten Anwendung oder in einem bestimmten Kontext nicht als Vorzugsform bestimmt wird. @de
toolkit definition: Et tidsrom som har et navn for tidsrom som ikke er valgt som preferanse i en bestemt applikasjon eller kontekst. @no
toolkit definition: Interval de temps que té un nom d’interval de temps que no se selecciona com a preferent en una aplicació o un context específic. @ca
toolkit definition: Laikposms, kam ir laikposma nosaukums, kas nav izvēlēts kā prioritārs noteiktā lietojumprogrammā vai kontekstā. @lv
toolkit definition: Laps de temps qui possède un nom de laps de temps ne faisant pas l’objet d’un choix privilégié dans un schéma d’encodage de vocabulaire spécifiques. @fr
toolkit definition: Tidsperiode, som har et navn på tidsperiode, som ikke er valgt som præference i en specifik anvendelse eller kontekst. @da
toolkit definition: Un arco di tempo che ha un nome di arco di tempo che non è stato selezionato come preferito in uno specifico schema di codifica di vocabolario. @it
toolkit definition: فترة زمنية لها اسم لفترة زمنية لم يُختر للتفضيل في تطبيق أو في سياق معين. @ar
toolkit definition: 有在一个特定的应用或语境中未被首选的一个时间段名称的一个时间段 @zh-hans
toolkit label: Abweichender Name eines Zeitraums von @de
toolkit label: cits nosaukums laikposmam @lv
toolkit label: nome variante di arco di tempo di @it
toolkit label: névváltozata a következő időtartamnak: @hu
toolkit label: variant af navn på tidsperiode af @da
toolkit label: variant de nom d’interval de temps de @ca
toolkit label: variant naam van tijdspanne van @nl
toolkit label: variant name of timespan of
toolkit label: variante de nom de laps de temps de @fr
toolkit label: variantform av navn på tidsrom for @no
toolkit label: variantnimi ajavahemikule @et
toolkit label: varianttinimi ajanjaksolle @fi
toolkit label: zaman aralığının alternatif ismi @tr
toolkit label: اسم فترة زمنية مختلف لـ @ar
toolkit label: ……的时间段的变异名称 @zh-hans
has subproperty: P80084
lexical alias: variantNameOfTimespanOf.en
status: Published
type: Property
domain: C10012
label: er variant af navn på tidsperiode af @da
label: er variantform av navn på tidsrom for @no
label: est une variante de nom de laps de temps de @fr
label: ir cits nosaukums laikposmam @lv
label: is variant naam van tijdspanne van @nl
label: ist abweichender Name eines Zeitraums von @de
label: névváltozata a következő időtartamnak: @hu
label: variantnimi ajavahemikule @et
label: varianttinimi ajanjaksolle @fi
label: zaman aralığının farklı ismi @tr
label: è nome variante di arco di tempo di @it
label: és variant de nom d’interval de temps de @ca
label: هو اسم فترة زمنية مختلف لـ @ar
label: 是……的时间段的变异名称 @zh-hans
sub property of: is name of timespan of
sub property of: is variant name of RDA entity of
definition: Bir ismi, belirli bir uygulama veya bağlamda tercih için seçilmemiş bir zaman aralığı adına sahip bir zaman aralığıyla ilişkilendirir. @tr
definition: Correla un nomen a un arco di tempo che ha un nome di arco di tempo che non è stato selezionato come preferito in uno specifico schema di codifica di vocabolario. @it
definition: Hozzákapcsol egy noment egy időtartamhoz, amelynek van egy időtartamneve, amelyet egy adott alkalmazásban vagy kontextusban nem részesítenek előnyben. @hu
definition: Liittää nomenin ajanjaksoon, jonka nimeä ei ole valittu ensisijaiseksi tietyssä sovelluksessa tai kontekstissa. @fi
definition: Met un nomen en relation avec un laps de temps qui possède un nom de laps de temps ne faisant pas l’objet d’un choix privilégié dans un schéma d’encodage de vocabulaire spécifiques. @fr
definition: Relaciona un nomen amb un interval de temps que té un nom d’interval de temps que no se selecciona com a preferent en una aplicació o un context específic. @ca
definition: Relateert een nomen aan een tijdspanne die een naam van tijdspanne heeft die niet als voorkeursterm geselecteerd is in een specifieke toepassing of context. @nl
definition: Relaterer et nomen til en tidsperiode, som har et navn på tidsperiode, som ikke er valgt som præference i en specifik anvendelse eller kontekst. @da
definition: Relaterer et nomen til et tidsrom som har et navn for tidsrom som ikke er valgt som preferanse i en bestemt applikasjon eller kontekst. @no
definition: Relates a nomen to a timespan that has a name of timespan that is not selected for preference in a specific application or context.
definition: Sasaista nomenu ar laikposmu, kam ir laikposma nosaukums, kas nav izvēlēts kā prioritārs noteiktā lietojumprogrammā vai kontekstā. @lv
definition: Seostab nomen'i ajavahemikuga, millel on nimi, mis kindlas rakenduses või kontekstis ei ole valitud eelistatuks. @et
definition: Setzt ein Nomen in Beziehung zu einem Zeitraum, der über einen Namen für einen Zeitraum verfügt, der in einer bestimmten Anwendung oder in einem bestimmten Kontext nicht als Vorzugsform bestimmt wird. @de
definition: يربط تسمية بفترة زمنية لها اسم لفترة زمنية، لم يُختر للتفضيل في تطبيق أو في سياق معين. @ar
definition: 将一个命名与有在一个特定的应用或语境中未被首选的一个时间段名称的一个时间段关联起来。 @zh-hans

is authorized access point for place of
has element type: 2
toolkit definition: A place that has an access point for place that is selected for preference in a specific vocabulary encoding scheme.
toolkit definition: Belirli bir kelime kodlama şemasında tercih edilmek üzere seçilen bir yer için erişim noktası olan bir yer. @tr
toolkit definition: Een plaats die een ingang voor plaats heeft die als voorkeursterm geselecteerd is in een specifiek vocabulair coderingssysteem. @nl
toolkit definition: Egy hely, amelynek van egy előnyben részesített hozzáférési pontja a helyhez, amelyet egy adott szótárkódolási sémából választanak ki. @hu
toolkit definition: Ein Geografikum, das über einen Sucheinstieg für ein Geografikum verfügt, der in einem bestimmten Vocabulary Encoding Scheme als Vorzugsform bestimmt wird. @de
toolkit definition: Et sted som har en søkeinngang for sted som er valgt som preferanse i et bestemt kodeskjema for vokabular. @no
toolkit definition: Koht, millel on vastavas leksikaalses märkimissüsteemis eelistatuks valitud otsielement. @et
toolkit definition: Lieu qui possède un point d’accès d’un lieu faisant l’objet d’un choix privilégié dans un schéma d’encodage de vocabulaire spécifique. @fr
toolkit definition: Lloc que té un punt d’accés de lloc que se selecciona com a preferent en un esquema de codificació de vocabulari específic. @ca
toolkit definition: Paikka, jolla on tietyssä sanaston merkintäjärjestelmässä ensisijaiseksi valittu hakutieto. @fi
toolkit definition: Sted, som har en søgeindgang for sted, som er valgt som præference i et specifikt vokabularkodningsskema. @da
toolkit definition: Un luogo che ha un punto d'accesso per il luogo che è stato selezionato come preferito in uno specifico schema di codifica di vocabolario. @it
toolkit definition: Vieta, kurai ir vietas pamatforma, kas izvēlēta no konkrētas vārdnīcas. @lv
toolkit definition: مكان له نقطة وصول لمكان اختيرت للتفضيل في خطة ترميز مفردات محددة. @ar
toolkit definition: 有在一个特定的词表编码体系中被首选的地点检索点的一个地点 @zh-hans
toolkit label: Normierter Sucheinstieg für Geografikum von @de
toolkit label: auktorisoitu hakutieto paikalle @fi
toolkit label: authorized access point for place of
toolkit label: autoriseret søgeindgang for sted af @da
toolkit label: autorisert søkeinngang for sted for @no
toolkit label: autorizált hozzáférési pont a következő helyhez: @hu
toolkit label: geautoriseerde ingang voor plaats van @nl
toolkit label: ir vietas autoritatīvā pamatforma @lv
toolkit label: normitud otsielement kohale @et
toolkit label: point d’accès autorisé d’un lieu de @fr
toolkit label: punt d’accés autoritzat de lloc de @ca
toolkit label: punto d'accesso autorizzato per luogo di @it
toolkit label: yer için yetkili erişim noktası @tr
toolkit label: نقطة وصول مقننة لمكان لـ @ar
toolkit label: ……的地点的规范检索点 @zh-hans
has subproperty: P80085
lexical alias: authorizedAccessPointForPlaceOf.en
status: Published
type: Property
domain: C10012
label: auktorisoitu hakutieto paikalle @fi
label: autorizált hozzáférési pont a következő helyhez: @hu
label: er autoriseret søgeindgang for sted af @da
label: er autorisert søkeinngang for sted for @no
label: est un point d’accès autorisé d’un lieu de @fr
label: ir vietas autoritatīvā pamatforma @lv
label: is geautoriseerde ingang voor plaats van @nl
label: ist normierter Sucheinstieg für ein Geografikum von @de
label: normitud otsielement kohale @et
label: yeri için yetkili erişim noktasıdır @tr
label: è punto d'accesso autorizzato per luogo di @it
label: és punt d’accés autoritzat de lloc de @ca
label: هي نقطة وصول مقننة لمكان لـ @ar
label: 是……的地点的规范检索点 @zh-hans
sub property of: is access point for place of
sub property of: is authorized access point for RDA entity of
definition: Bir ismi, belirli bir kelime kodlama şemasında tercih edilmek üzere seçilen bir yer için erişim noktası olan bir yerle ilişkilendirir. @tr
definition: Correla un nomen a un luogo che ha un punto d'accesso per il luogo che è stato selezionato come preferito in uno specifico schema di codifica di vocabolario. @it
definition: Hozzákapcsol egy noment egy helyhez, amelynek van egy előnyben részesített hozzáférési pontja a helyhez, amelyet egy adott szótárkódolási sémából választanak ki. @hu
definition: Liittää nomenin paikkaan, jolla on tietyssä sanaston merkintäjärjestelmässä ensisijaiseksi valittu hakutieto. @fi
definition: Met un nomen en relation avec un lieu qui possède un point d’accès d’un lieu faisant l’objet d’un choix privilégié dans un schéma d’encodage de vocabulaire spécifique. @fr
definition: Relaciona un nomen amb un lloc que té un punt d’accés de lloc que se selecciona com a preferent en un esquema de codificació de vocabulari específic. @ca
definition: Relateert een nomen aan een plaats die een ingang voor plaats heeft die als voorkeursterm geselecteerd is in een specifiek vocabulair coderingssysteem. @nl
definition: Relaterer et nomen til et sted som har en søkeinngang for sted som er valgt som preferanse i et bestemt kodeskjema for vokabular. @no
definition: Relaterer et nomen til et sted, som har en søgeindgang for sted, som er valgt som præference i et specifikt vokabularkodningsskema. @da
definition: Relates a nomen to a place that has an access point for place that is selected for preference in a specific vocabulary encoding scheme.
definition: Sasaista nomenu ar vietu, kurai ir vietas pamatforma, kas izvēlēta no konkrētas vārdnīcas. @lv
definition: Seostab nomen'i kohaga, millel on vastavas leksikaalses märkimissüsteemis eelistatuks valitud otsielement. @et
definition: Setzt ein Nomen in Beziehung zu einem Geografikum, das über einen Sucheinstieg für ein Geografikum verfügt, der in einem bestimmten Vocabulary Encoding Scheme als Vorzugsform bestimmt wird. @de
definition: يربط تسمية بمكان له نقطة وصول لمكان اختيرت للتفضيل في خطة ترميز مفردات محددة. @ar
definition: 将一个命名与有在一个特定的词表编码体系中被首选的地点检索点的一个地点关联起来。 @zh-hans

is variant access point for place of
has element type: 2
toolkit definition: A place that has an access point for place that is not selected for preference in a specific vocabulary encoding scheme.
toolkit definition: Belirli bir kelime kodlama şemasında tercih için seçilmeyen bir yer için erişim noktası olan bir yer. @tr
toolkit definition: Een plaats die een ingang voor plaats heeft die niet als voorkeursterm geselecteerd is in een specifiek vocabulair coderingssysteem. @nl
toolkit definition: Egy hely, amelynek van egy olyan hozzáférési pontja entitás a helyhez, amely egy bizonyos szótárkódolási sémában nem részesül előnyben. @hu
toolkit definition: Ein Geografikum, das über einen Sucheinstieg für ein Geografikum verfügt, der in einem bestimmten Vocabulary Encoding Scheme nicht als Vorzugsform bestimmt wird. @de
toolkit definition: Et sted som har en søkeinngang for sted som ikke er valgt som preferanse i et bestemt kodeskjema for vokabular. @no
toolkit definition: Koht, millel on otsielement, mis ei ole valitud eelistatuks vastavas leksikaalses märkimissüsteemis. @et
toolkit definition: Lieu qui possède un point d’accès d’un lieu ne faisant pas l’objet d’un choix privilégié dans un schéma d’encodage de vocabulaire spécifique. @fr
toolkit definition: Lloc que té un punt d’accés de lloc que no se selecciona com a preferent en un esquema de codificació de vocabulari específic. @ca
toolkit definition: Paikka, jonka hakutietoa ei ole valittu ensisijaiseksi tietyssä sanaston merkintäjärjestelmässä. @fi
toolkit definition: Sted, som har en søgeindgang for sted, som ikke er valgt som præference i et specifikt vokabularkodningsskema. @da
toolkit definition: Un luogo che ha un punto d'accesso per il luogo che non è stato selezionato come preferito in uno specifico schema di codifica di vocabolario. @it
toolkit definition: Vieta, kurai ir piekļuves punkts vietai, kas nav izvēlēta kā prioritāra noteiktai kontrolētas vārdnīcas shēmai. @lv
toolkit definition: مكان له نقطة وصول لمكان لم تُختر للتفضيل في خطة ترميز مفردات محددة. @ar
toolkit definition: 有在一个特定的词表编码体系中未被首选的地点检索点 @zh-hans
toolkit label: Zusätzlicher Sucheinstieg für ein Geografikum von @de
toolkit label: alternativ søkeinngang for sted for @no
toolkit label: hozzáférésipont-variánsa a következő helynek: @hu
toolkit label: ir papildforma vietai @lv
toolkit label: otsielemendi variant kohale @et
toolkit label: punto d'accesso variante per luogo di @it
toolkit label: variant access point for place of
toolkit label: variant af søgeindgang for sted af @da
toolkit label: variant de punt d’accés de lloc de @ca
toolkit label: variant ingang voor plaats van @nl
toolkit label: variante de point d’accès d’un lieu de @fr
toolkit label: varianttihakutieto paikalle @fi
toolkit label: yer için alternatif erişim noktası @tr
toolkit label: نقطة وصول مختلفة لمكان لـ @ar
toolkit label: ……的地点的变异检索点 @zh-hans
has subproperty: P80086
lexical alias: variantAccessPointForPlaceOf.en
status: Published
type: Property
domain: C10012
label: er alternativ søkeinngang for sted for @no
label: er variant af søgeindgang for sted af @da
label: est une variante de point d’accès d’un lieu de @fr
label: hozzáférésipont-variánsa a következő helynek: @hu
label: ir papildforma vietai @lv
label: is variant ingang voor plaats van @nl
label: ist zusätzlicher Sucheinstieg für ein Geografikum von @de
label: otsielemendi variant kohale @et
label: varianttihakutieto paikalle @fi
label: yer için farklı erişim noktası @tr
label: è punto d'accesso variante per luogo di @it
label: és variant de punt d’accés de lloc de @ca
label: هي نقطة وصول مختلفة لمكان لـ @ar
label: 是……的地点的变异检索点 @zh-hans
sub property of: is access point for place of
sub property of: is variant access point for RDA entity of
definition: Bir ismi, belirli bir kelime kodlama şemasında tercih için seçilmeyen bir yer için erişim noktası olan bir yerle ilişkilendirir. @tr
definition: Correla un nomen a un luogo che ha un punto d'accesso per il luogo che non è stato selezionato come preferito in uno specifico schema di codifica di vocabolario. @it
definition: Hozzákapcsol egy noment egy helyhez, amelynek van egy olyan hozzáférési pontja entitás a helyhez, amely egy bizonyos szótárkódolási sémában nem részesül előnyben. @hu
definition: Liittää nomenin paikkaan, jonka hakutietoa ei ole valittu ensisijaiseksi tietyssä sanaston merkintäjärjestelmässä. @fi
definition: Met un nomen en relation avec un lieu qui possède un point d’accès d’un lieu ne faisant pas l’objet d’un choix privilégié dans un schéma d’encodage de vocabulaire spécifique. @fr
definition: Relaciona un nomen amb un lloc que té un punt d’accés de lloc que no se selecciona com a preferent en un esquema de codificació de vocabulari específic. @ca
definition: Relateert een nomen aan een plaats die een ingang voor plaats heeft die niet als voorkeursterm geselecteerd is in een specifiek vocabulair coderingssysteem. @nl
definition: Relaterer et nomen til et sted som har en søkeinngang for sted som ikke er valgt som preferanse i et bestemt kodeskjema for vokabular. @no
definition: Relaterer et nomen til et sted, som har en søgeindgang for sted, som ikke er valgt som præference i et specifikt vokabularkodningsskema. @da
definition: Relates a nomen to a place that has an access point for place that is not selected for preference in a specific vocabulary encoding scheme.
definition: Sasaista nomenu ar vietu, kurai ir piekļuves punkts vietai, kas nav izvēlēta kā prioritāra noteiktai kontrolētas vārdnīcas shēmai. @lv
definition: Seostab nomen'i kohaga, millel on otsielement, mis ei ole valitud eelistatuks vastavas leksikaalses märkimissüsteemis. @et
definition: Setzt ein Nomen in Beziehung zu einem Geografikum, das über einen Sucheinstieg für ein Geografikum verfügt, der in einem bestimmten Vocabulary Encoding Scheme nicht als Vorzugsform bestimmt wird. @de
definition: يربط تسمية بمكان له نقطة وصول لمكان اختيرت للتفضيل في خطة ترميز مفردات محددة. @ar
definition: 将一个命名与有在一个特定的词表编码体系中未被首选的地点检索点的一个地点关联起来。 @zh-hans

is preferred name of place of
has element type: 2
toolkit definition: A place that has a name of place that is selected for preference in a specific application or context.
toolkit definition: Belirli bir uygulama veya bağlamda tercih edilmek üzere seçilen bir yer adına sahip olan bir yer. @tr
toolkit definition: Een plaats die een naam van plaats heeft die als voorkeursterm geselecteerd is in een specifieke toepassing of context. @nl
toolkit definition: Egy hely, amelynek van egy olyan helyneve, amelyet egy adott alkalmazásban vagy kontextusban előnyben részesítenek. @hu
toolkit definition: Ein Geografikum, das über einen Namen für ein Geografikum verfügt, der in einer bestimmten Anwendung oder in einem bestimmten Kontext als Vorzugsform bestimmt wird. @de
toolkit definition: Et sted som har et navn for sted som er valgt som preferanse i en bestemt applikasjon eller kontekst. @no
toolkit definition: Koht, millel on kindlas rakenduses või kontekstis eelistatuks valitud nimi. @et
toolkit definition: Lieu qui possède un nom de lieu faisant l’objet d’un choix privilégié dans une application ou un contexte spécifiques. @fr
toolkit definition: Lloc que té un nom de lloc que se selecciona com a preferent en una aplicació o un context específic. @ca
toolkit definition: Paikka, jonka nimi on valittu ensisijaiseksi tietyssä sovelluksessa tai kontekstissa. @fi
toolkit definition: Sted, som har et navn på sted, som er valgt som præference i en specifik anvendelse eller kontekst. @da
toolkit definition: Un luogo che ha un nome di luogo che è stato selezionato come preferito in una specifica applicazione o contesto. @it
toolkit definition: Vieta, kurai ir vietas nosaukums, kas ir izvēlēts noteiktam lietojumam vai noteiktā kontekstā. @lv
toolkit definition: مكان له اسم مكان اختير للتفضيل في تطبيق أو في سياق معين. @ar
toolkit definition: 有在一个特定的应用或语境中被首选的一个地点名称的一个地点 @zh-hans
toolkit label: Bevorzugter Name eines Geografikums von @de
toolkit label: eelisnimi kohale @et
toolkit label: előnyben részesített helyneve: @hu
toolkit label: ensisijainen nimi paikalle @fi
toolkit label: foretrukket navn på sted af @da
toolkit label: foretrukket navn på sted for @no
toolkit label: geprefereerde naam van plaats van @nl
toolkit label: ir vietas prioritārais nosaukums @lv
toolkit label: nom preferit de lloc de @ca
toolkit label: nom privilégié d’un lieu de @fr
toolkit label: nome preferito del luogo di @it
toolkit label: preferred name of place of
toolkit label: yerin tercih edilen ismi @tr
toolkit label: اسم مكان مفضل لـ @ar
toolkit label: ……的地点的首选名称 @zh-hans
has subproperty: P80087
lexical alias: preferredNameOfPlaceOf.en
status: Published
type: Property
domain: C10012
label: eelisnimi kohale @et
label: előnyben részesített helyneve a következőnek: @hu
label: ensisijainen nimi paikalle @fi
label: er foretrukket navn på sted af @da
label: er foretrukket navn på sted for @no
label: est un nom privilégié d’un lieu de @fr
label: ir vietas prioritārais nosaukums @lv
label: is geprefereerde naam van plaats van @nl
label: ist bevorzugter Name eines Geografikums von @de
label: yerinin tercih edilen adıdır @tr
label: è nome preferito del luogo di @it
label: és nom preferit de lloc de @ca
label: هو اسم مكان مفضل لـ @ar
label: 是……的地点的首选名称 @zh-hans
sub property of: is name of place of
sub property of: is preferred name of RDA entity of
definition: Bir ismi, belirli bir uygulama veya bağlamda tercih edilmek üzere seçilen bir yer adına sahip bir yerle ilişkilendirir. @tr
definition: Correla un nomen a un luogo che ha un nome di luogo che è stato selezionato come preferito in una specifica applicazione o contesto. @it
definition: Hozzákapcsol egy noment egy helyhez, amelynek van egy olyan helyneve, amelyet egy adott alkalmazásban vagy kontextusban előnyben részesítenek. @hu
definition: Liittää nomenin paikkaan, jonka nimi on valittu ensisijaiseksi tietyssä sovelluksessa tai kontekstissa. @fi
definition: Met un nomen en relation avec un lieu qui possède un nom de lieu faisant l’objet d’un choix privilégié dans une application ou un contexte spécifiques. @fr
definition: Relaciona un nomen amb un lloc que té un nom de lloc que se selecciona com a preferent en una aplicació o un context específic. @ca
definition: Relateert een nomen aan een plaats die een naam van plaats heeft die als voorkeursterm geselecteerd is in een specifieke toepassing of context. @nl
definition: Relaterer et nomen til et sted som har et navn for sted som er valgt som preferanse i en bestemt applikasjon eller kontekst. @no
definition: Relaterer et nomen til et sted, som har et navn på sted, som er valgt som præference i en specifik anvendelse eller kontekst. @da
definition: Relates a nomen to a place that has a name of place that is selected for preference in a specific application or context.
definition: Sasaista nomenu ar vietu, kurai ir vietas nosaukums, kas ir izvēlēts noteiktam lietojumam vai noteiktā kontekstā. @lv
definition: Seostab nomen'i kohaga, millel on kindlas rakenduses või kontekstis eelistatuks valitud nimi. @et
definition: Setzt ein Nomen in Beziehung zu einem Geografikum, das über einen Namen für ein Geografikum verfügt, der in einer bestimmten Anwendung oder in einem bestimmten Kontext als Vorzugsform bestimmt wird. @de
definition: يربط تسمية بمكان له اسم مكان اختير للتفضيل في تطبيق أو في سياق معين. @ar
definition: 将一个命名与有在一个特定的应用或语境中被首选的一个地点名称的一个地点关联起来。 @zh-hans

is variant name of place of
has element type: 2
toolkit definition: A place that has a name of place that is not selected for preference in a specific application or context.
toolkit definition: Belirli bir uygulama veya bağlamda tercih için seçilmeyen bir yer adına sahip bir yer. @tr
toolkit definition: Een plaats die een naam van plaats heeft die niet als voorkeursterm geselecteerd is in een specifieke toepassing of context. @nl
toolkit definition: Egy hely, amelynek van egy helyneve, amelyet egy adott alkalmazásban vagy kontextusban nem részesítenek előnyben. @hu
toolkit definition: Ein Geografikum, das über einen Namen für ein Geografikum verfügt, der in einer bestimmten Anwendung oder in einem bestimmten Kontext nicht als Vorzugsform bestimmt wird. @de
toolkit definition: Et sted som har et navn for sted som ikke er valgt som preferanse i en bestemt applikasjon eller kontekst. @no
toolkit definition: Koht, millel on nimi, mis kindlas rakenduses või kontekstis ei ole valitud eelistatuks. @et
toolkit definition: Lieu qui possède un nom de lieu ne faisant pas l’objet d’un choix privilégié dans un schéma d’encodage de vocabulaire spécifiques. @fr
toolkit definition: Lloc que té un nom de lloc que no se selecciona com a preferent en una aplicació o un context específic. @ca
toolkit definition: Paikka, jonka nimeä ei ole valittu ensisijaiseksi tietyssä sovelluksessa tai kontekstissa. @fi
toolkit definition: Sted, som har et navn på sted, som ikke er valgt som præference i en specifik anvendelse eller kontekst. @da
toolkit definition: Un luogo che ha un nome di luogo che non è stato selezionato come preferito in uno specifico schema di codifica di vocabolario. @it
toolkit definition: Vieta, kurai ir vietas nosaukums, kas nav izvēlēts kā prioritārs noteiktā lietojumprogrammā vai kontekstā. @lv
toolkit definition: مكان له اسم مكان لم يُختر للتفضيل في تطبيق أو في سياق معين. @ar
toolkit definition: 有在一个特定的应用或语境中未被首选的一个地点名称的一个地点 @zh-hans
toolkit label: Abweichender Name eines Geografikums von @de
toolkit label: ir cits nosaukums vietai @lv
toolkit label: nome variante di luogo di @it
toolkit label: névváltozata a következő helynek: @hu
toolkit label: variant af navn på sted af @da
toolkit label: variant de nom de lloc de @ca
toolkit label: variant naam van plaats van @nl
toolkit label: variant name of place of
toolkit label: variante de nom de lieu de @fr
toolkit label: variantform av navn på sted for @no
toolkit label: variantnimi kohale @et
toolkit label: varianttinimi paikalle @fi
toolkit label: yerin alternatif ismi @tr
toolkit label: اسم مكان مختلف لـ @ar
toolkit label: ……的地点的变异名称 @zh-hans
has subproperty: P80088
lexical alias: variantNameOfPlaceOf.en
status: Published
type: Property
domain: C10012
label: er variant af navn på sted af @da
label: er variantform av navn på sted for @no
label: est une variante de nom de lieu de @fr
label: ir cits nosaukums vietai @lv
label: is variant naam van plaats van @nl
label: ist abweichender Name eines Geografikums von @de
label: névváltozata a következő helynek: @hu
label: variantnimi kohale @et
label: varianttinimi paikalle @fi
label: yerin farklı ismi @tr
label: è nome variante di luogo di @it
label: és variant de nom de lloc de @ca
label: هو اسم مكان مختلف لـ @ar
label: 是……的地点的变异名称 @zh-hans
sub property of: is name of place of
sub property of: is variant name of RDA entity of
definition: Bir ismi, belirli bir uygulama veya bağlamda tercih için seçilmeyen bir yer adına sahip bir yerle ilişkilendirir. @tr
definition: Correla un nomen a un luogo che ha un nome di luogo che non è stato selezionato come preferito in uno specifico schema di codifica di vocabolario. @it
definition: Hozzákapcsol egy noment egy helyhez, amelynek van egy helyneve, amelyet egy adott alkalmazásban vagy kontextusban nem részesítenek előnyben. @hu
definition: Liittää nomenin paikkaan, jonka nimeä ei ole valittu ensisijaiseksi tietyssä sovelluksessa tai kontekstissa. @fi
definition: Met un nomen en relation avec un lieu qui possède un nom de lieu ne faisant pas l’objet d’un choix privilégié dans un schéma d’encodage de vocabulaire spécifiques. @fr
definition: Relaciona un nomen amb un lloc que té un nom de lloc que no se selecciona com a preferent en una aplicació o un context específic. @ca
definition: Relateert een nomen aan een plaats die een naam van plaats heeft die niet als voorkeursterm geselecteerd is in een specifieke toepassing of context. @nl
definition: Relaterer et nomen til et sted som har et navn for sted som ikke er valgt som preferanse i en bestemt applikasjon eller kontekst. @no
definition: Relaterer et nomen til et sted, som har et navn på sted, som ikke er valgt som præference i en specifik anvendelse eller kontekst. @da
definition: Relates a nomen to a place that has a name of place that is not selected for preference in a specific application or context.
definition: Sasaista nomenu ar vietu, kurai ir vietas nosaukums, kas nav izvēlēts kā prioritārs noteiktā lietojumprogrammā vai kontekstā. @lv
definition: Seostab nomen'i kohaga, millel on nimi, mis kindlas rakenduses või kontekstis ei ole valitud eelistatuks. @et
definition: Setzt ein Nomen in Beziehung zu einem Geografikum, das über einen Namen für ein Geografikum verfügt, der in einer bestimmten Anwendung oder in einem bestimmten Kontext nicht als Vorzugsform bestimmt wird. @de
definition: يربط تسمية بمكان له اسم مكان لم يُختر للتفضيل في تطبيق أو في سياق معين. @ar
definition: 将一个命名与有在一个特定的应用或语境中未被首选的一个地点名称的一个地点关联起来。 @zh-hans

is authorized access point for manifestation of
has element type: 2
toolkit definition: A manifestation that has an access point for manifestation that is selected for preference in a specific vocabulary encoding scheme.
toolkit definition: Belirli bir kelime kodlama şemasında tercih edilmek üzere seçilmeyen bir gösterim için bir erişim noktasına sahip olan bir gösterim. @tr
toolkit definition: Een manifestatie die een ingang voor manifestatie heeft die als voorkeursterm geselecteerd is in een specifiek vocabulair coderingssysteem. @nl
toolkit definition: Egy megjelenési forma, amelynek van egy előnyben részesített hozzáférési pontja a megjelenési formához, amelyet egy speciális szótárkódolási sémából választanak ki. @hu
toolkit definition: Eine Manifestation, die über einen Sucheinstieg für eine Manifestation verfügt, der in einem bestimmten Vocabulary Encoding Scheme als Vorzugsform bestimmt wird. @de
toolkit definition: En manifestasjon som har en søkeinngang for manifestasjon som er valgt som preferanse i et bestemt kodeskjema for vokabular. @no
toolkit definition: Kehastus, millel on vastavas leksikaalses märkimissüsteemis eelistatuks valitud otsielement. @et
toolkit definition: Manifestaatio, jolla on tietyssä sanaston merkintäjärjestelmässä ensisijaiseksi valittu hakutieto. @fi
toolkit definition: Manifestació que té un punt d’accés de manifestació que se selecciona com a preferent en un esquema de codificació de vocabulari específic. @ca
toolkit definition: Manifestation qui possède un point d’accès d’une manifestation faisant l’objet d’un choix privilégié dans un schéma d’encodage de vocabulaire spécifique. @fr
toolkit definition: Manifestation, som har en søgeindgang for manifestation, som er valgt som præference i et specifikt vokabularkodningsskema. @da
toolkit definition: Manifestācija, kam ir manifetācijas pamatforma, kas izvēlēta no konkrētas vārdnīcas. @lv
toolkit definition: Una manifestazione che ha un punto d'accesso per la manifestazione che è stato selezionato come preferito in uno specifico schema di codifica di vocabolario. @it
toolkit definition: تجسيدة لها نقطة وصول لتجسيدة اختيرت للتفضيل في خطة ترميز مفردات محددة. @ar
toolkit definition: 有在一个特定的词表编码体系中被首选的载体表现检索点的一种载体表现 @zh-hans
toolkit label: Normierter Sucheinstieg für eine Manifestation von @de
toolkit label: auktorisoitu hakutieto manifestaatiolle @fi
toolkit label: authorized access point for manifestation of
toolkit label: autoriseret søgeindgang for manifestation af @da
toolkit label: autorisert søkeinngang for manifestasjon for @no
toolkit label: autorizált hozzáférési pont a következő megjelenési formához: @hu
toolkit label: geautoriseerde ingang voor manifestatie van @nl
toolkit label: gösterim için yetkili erişim noktası @tr
toolkit label: ir autoritatīvā vārdforma manifestācijai @lv
toolkit label: normitud otsielement kehastusele @et
toolkit label: point d’accès autorisé d’une manifestation de @fr
toolkit label: punt d’accés autoritzat de manifestació de @ca
toolkit label: punto d'accesso autorizzato per manifestazione di @it
toolkit label: نقطة وصول مقننة لتجسيدة لـ @ar
toolkit label: ……的载体表现的规范检索点 @zh-hans
has subproperty: P80089
lexical alias: authorizedAccessPointForManifestationOf.en
status: Published
type: Property
domain: C10012
label: auktorisoitu hakutieto manifestaatiolle @fi
label: autorizált hozzáférési pont a következő megjelenési formához: @hu
label: er autoriseret søgeindgang for manifestation af @da
label: er autorisert søkeinngang for manifestasjon for @no
label: est un point d’accès autorisé d’une manifestation de @fr
label: gösterimi için yetkili erişim noktasıdır @tr
label: ir autoritatīvā vārdforma manifestācijai @lv
label: is geautoriseerde ingang voor manifestatie van @nl
label: ist normierter Sucheinstieg für eine Manifestation von @de
label: normitud otsielement kehastusele @et
label: è punto d'accesso autorizzato per manifestazione di @it
label: és punt d’accés autoritzat de manifestació de @ca
label: هي نقطة وصول مقننة لتجسيدة لـ @ar
label: 是……的载体表现的规范检索点 @zh-hans
sub property of: is access point for manifestation of
sub property of: is authorized access point for RDA entity of
definition: Bir ismi, belirli bir kelime kodlama şemasında tercih için seçilen gösterim için bir erişim noktasına sahip olan bir gösterimle ilişkilendirir. @tr
definition: Correla un nomen a una manifestazione che ha un punto d'accesso per la manifestazione che è stato selezionato come preferito in uno specifico schema di codifica di vocabolario. @it
definition: Hozzákapcsol egy noment egy megjelenési formához, amelynek van egy előnyben részesített hozzáférési pontja a megjelenési formához, amelyet egy speciális szótárkódolási sémából választanak ki. @hu
definition: Liittää nomenin manifestaatioon, jolla on tietyssä sanaston merkintäjärjestelmässä ensisijaiseksi valittu hakutieto. @fi
definition: Met un nomen en relation avec une manifestation qui possède un point d’accès d’une manifestation faisant l’objet d’un choix privilégié dans un schéma d’encodage de vocabulaire spécifique. @fr
definition: Relaciona un nomen amb una manifestació que té un punt d’accés de manifestació que se selecciona com a preferent en un esquema de codificació de vocabulari específic. @ca
definition: Relateert een nomen aan een manifestatie die een ingang voor manifestatie heeft die als voorkeursterm geselecteerd is in een specifiek vocabulair coderingssysteem. @nl
definition: Relaterer et nomen til en manifestasjon som har en søkeinngang for manifestasjon som er valgt som preferanse i et bestemt kodeskjema for vokabular. @no
definition: Relaterer et nomen til en manifestation, som har en søgeindgang for manifestation, som er valgt som præference i et specifikt vokabularkodningsskema. @da
definition: Relates a nomen to a manifestation that has an access point for manifestation that is selected for preference in a specific vocabulary encoding scheme.
definition: Sasaista nomenu ar manifestāciju, kam ir manifetācijas pamatforma, kas izvēlēta no konkrētas vārdnīcas. @lv
definition: Seostab nomen'i kehastusega, millel on vastavas leksikaalses märkimissüsteemis eelistatuks valitud otsielement. @et
definition: Setzt ein Nomen in Beziehung zu einer Manifestation, die über einen Sucheinstieg für eine Manifestation verfügt, der in einem bestimmten Vocabulary Encoding Scheme als Vorzugsform bestimmt wird. @de
definition: يربط تسمية بتجسيدة لها نقطة وصول لتجسيدة اختيرت للتفضيل في خطة ترميز مفردات محددة. @ar
definition: 将一个命名与有在一个特定的词表编码体系中被首选的载体表现检索点的一种载体表现关联起来。 @zh-hans

is variant access point for manifestation of
has element type: 2
toolkit definition: A manifestation that has an access point for manifestation that is not selected for preference in a specific vocabulary encoding scheme.
toolkit definition: Belirli bir kelime kodlama şemasında tercih edilmek üzere seçilen bir gösterim için bir erişim noktasına sahip olan bir gösterim. @tr
toolkit definition: Een manifestatie die een ingang voor manifestatie heeft die niet als voorkeursterm geselecteerd is in een specifiek vocabulair coderingssysteem. @nl
toolkit definition: Egy megjelenési forma, amelynek van egy olyan hozzáférési pontja a megjelenési formához, amely egy bizonyos szótárkódolási sémában nem részesül előnyben. @hu
toolkit definition: Eine Manifestation, die über einen Sucheinstieg für eine Manifestation verfügt, der in einem bestimmten Vocabulary Encoding Scheme nicht als Vorzugsform bestimmt wird. @de
toolkit definition: En manifestasjon som har en søkeinngang for manifestasjon som ikke er valgt som preferanse i et bestemt kodeskjema for vokabular. @no
toolkit definition: Kehastus, millel on otsielement, mis ei ole valitud eelistatuks vastavas leksikaalses märkimissüsteemis. @et
toolkit definition: Manifestaatio, jonka hakutietoa ei ole valittu ensisijaiseksi tietyssä sanaston merkintäjärjestelmässä. @fi
toolkit definition: Manifestació que té un punt d’accés de manifestació que no se selecciona com a preferent en un esquema de codificació de vocabulari específic. @ca
toolkit definition: Manifestation qui possède un point d’accès d’une manifestation ne faisant pas l’objet d’un choix privilégié dans un schéma d’encodage de vocabulaire spécifique. @fr
toolkit definition: Manifestation, som har en søgeindgang for manifestation, som ikke er valgt som præference i et specifikt vokabularkodningsskema. @da
toolkit definition: Manifestācija, kam ir piekļuves punkts manifestācijai, kas nav izvēlēta kā prioritāra noteiktai kontrolētas vārdnīcas shēmai. @lv
toolkit definition: Una manifestazione che ha un punto d'accesso per la manifestazione che non è stato selezionato come preferito in uno specifico schema di codifica di vocabolario. @it
toolkit definition: تجسيدة لها نقطة وصول لتجسيدة لم تُختر للتفضيل في خطة ترميز مفردات محددة. @ar
toolkit definition: 有在一个特定的词表编码体系中未被首选的载体表现检索点的一种载体表现 @zh-hans
toolkit label: Zusätzlicher Sucheinstieg für eine Manifestation von @de
toolkit label: alternativ søkeinngang for manifestasjon for @no
toolkit label: gösterim için alternatif erişim noktası @tr
toolkit label: hozzáférésipont-változat a következő megjelenési formához: @hu
toolkit label: ir cita vārdforma manifestācijai @lv
toolkit label: otsielemendi variant kehastusele @et
toolkit label: punto d'accesso variante per manifestazione di @it
toolkit label: variant access point for manifestation of
toolkit label: variant af søgeindgang for manifestation af @da
toolkit label: variant de punt d’accés de manifestació de @ca
toolkit label: variant ingang voor manifestatie van @nl
toolkit label: variante de point d’accès d’une manifestation de @fr
toolkit label: varianttihakutieto manifestaatiolle @fi
toolkit label: نقطة وصول مختلفة لتجسيدة لـ @ar
toolkit label: ……的载体表现的变异检索点 @zh-hans
has subproperty: P80090
lexical alias: variantAccessPointForManifestationOf.en
status: Published
type: Property
domain: C10012
label: er alternativ søkeinngang for manifestasjon for @no
label: er variant af søgeindgang for manifestation af @da
label: est une variante de point d’accès d’une manifestation de @fr
label: gösterim için farklı erişim noktası @tr
label: hozzáférésipont-variánsa a következő megjelenési formának: @hu
label: ir cita vārdforma manifestācijai @lv
label: is variant ingang voor manifestatie van @nl
label: ist zusätzlicher Sucheinstieg für eine Manifestation von @de
label: otsielemendi variant kehastusele @et
label: varianttihakutieto manifestaatiolle @fi
label: è punto d'accesso variante per manifestazione di @it
label: és variant de punt d’accés de manifestació de @ca
label: هي نقطة وصول مختلفة لتجسيدة لـ @ar
label: 是……的载体表现的变异检索点 @zh-hans
sub property of: is access point for manifestation of
sub property of: is variant access point for RDA entity of
definition: Bir ismi, belirli bir kelime kodlama şemasında tercih için seçilmeyen bir gösterim için erişim noktası olan bir gösterimle ilişkilendirir. @tr
definition: Correla un nomen a una manifestazione che ha un punto d'accesso per la manifestazione che non è stato selezionato come preferito in uno specifico schema di codifica di vocabolario. @it
definition: Hozzákapcsol egy noment egy megjelenési formához, amelynek van egy olyan hozzáférési pontja a megjelenési formához, amely egy bizonyos szótárkódolási sémában nem részesül előnyben. @hu
definition: Liittää nomenin manifestaatioon, jonka hakutietoa ei ole valittu ensisijaiseksi tietyssä sanaston merkintäjärjestelmässä. @fi
definition: Met un nomen en relation avec une manifestation qui possède un point d’accès d’une manifestation ne faisant pas l’objet d’un choix privilégié dans un schéma d’encodage de vocabulaire spécifique. @fr
definition: Relaciona un nomen amb una manifestació que té un punt d’accés de manifestació que no se selecciona com a preferent en un esquema de codificació de vocabulari específic. @ca
definition: Relateert een nomen aan een manifestatie die een ingang voor manifestatie heeft die niet als voorkeursterm geselecteerd is in een specifiek vocabulair coderingssysteem. @nl
definition: Relaterer et nomen til en manifestasjon som har en søkeinngang for manifestasjon som ikke er valgt som preferanse i et bestemt kodeskjema for vokabular. @no
definition: Relaterer et nomen til en manifestation, som har en søgeindgang for manifestation, som ikke er valgt som præference i et specifikt vokabularkodningsskema. @da
definition: Relates a nomen to a manifestation that has an access point for manifestation that is not selected for preference in a specific vocabulary encoding scheme.
definition: Sasaista nomenu ar manifestāciju, kam ir piekļuves punkts manifestācijai, kas nav izvēlēta kā prioritāra noteiktai kontrolētas vārdnīcas shēmai. @lv
definition: Seostab nomen'i kehastusega, millel on otsielement, mis ei ole valitud eelistatuks vastavas leksikaalses märkimissüsteemis. @et
definition: Setzt ein Nomen in Beziehung zu einer Manifestation, die über einen Sucheinstieg für eine Manifestation verfügt, der in einem bestimmten Vocabulary Encoding Scheme nicht als Vorzugsform bestimmt wird. @de
definition: يربط تسمية بتجسيدة لها نقطة وصول لتجسيدة لم تُختر للتفضيل في خطة ترميز مفردات محددة. @ar
definition: 将一个命名与有在一个特定的词表编码体系中未被首选的载体表现检索点的一种载体表现关联起来。 @zh-hans

is authorized access point for item of
has element type: 2
toolkit definition: An item that has an access point for item that is selected for preference in a specific vocabulary encoding scheme.
toolkit definition: Belirli bir kelime kodlama şemasında tercih için seçilen bir kopya için erişim noktası olan bir kopya. @tr
toolkit definition: Een item dat een ingang voor item heeft die als voorkeursterm geselecteerd is in een specifiek vocabulair coderingssysteem. @nl
toolkit definition: Egy példány, amelynek van egy olyan hozzáférési pontja a példányhoz, amelyet egy adott szótárkódolási sémából kiválasztva előnyben részesítenek. @hu
toolkit definition: Ein Exemplar, das über einen Sucheinstieg für eine Familie verfügt, der in einem bestimmten Vocabulary Encoding Scheme als Vorzugsform bestimmt wird. @de
toolkit definition: Eksemplar, millel on vastavas leksikaalses märkimissüsteemis eelistatuks valitud otsielement. @et
toolkit definition: Eksemplar, som har en søgeindgang for eksemplar, som er valgt som præference i et specifikt vokabularkodningsskema. @da
toolkit definition: Et eksemplar som har en søkeinngang for eksemplar som er valgt som preferanse i et bestemt kodeskjema for vokabular. @no
toolkit definition: Item qui possède un point d’accès d’un item faisant l’objet d’un choix privilégié dans un schéma d’encodage de vocabulaire spécifique. @fr
toolkit definition: Kappale, jolla on tietyssä sanaston merkintäjärjestelmässä ensisijaiseksi valittu hakutieto. @fi
toolkit definition: Un item che ha un punto d'accesso per l'item che è stato selezionato come preferito in uno specifico schema di codifica di vocabolario. @it
toolkit definition: Vienība, kurai ir vienības pamatforma, kas izvēlēta no konkrētas vārdnīcas. @lv
toolkit definition: Ítem que té un punt d’accés d’ítem que se selecciona com a preferent en un esquema de codificació de vocabulari específic. @ca
toolkit definition: مفردة لها نقطة وصول لمفردة اختيرت للتفضيل في خطة ترميز مفردات محددة. @ar
toolkit definition: 有在一个特定的词表编码体系中被首选的单件检索点的一个单件 @zh-hans
toolkit label: Normierter Sucheinstieg für ein Exemplar von @de
toolkit label: auktorisoitu hakutieto kappaleelle @fi
toolkit label: authorized access point for item of
toolkit label: autoriseret søgeindgang for eksemplar af @da
toolkit label: autorisert søkeinngang for eksemplar for @no
toolkit label: autorizált hozzáférési pont a következő példányhoz: @hu
toolkit label: geautoriseerde ingang voor item van @nl
toolkit label: ir vienības autoritatīvā pamatforma @lv
toolkit label: kopya için yetkili erişim noktası @tr
toolkit label: normitud otsielement eksemplarile @et
toolkit label: point d’accès autorisé d’un item de @fr
toolkit label: punt d’accés autoritzat d’ítem de @ca
toolkit label: punto d'accesso autorizzato per item di @it
toolkit label: نقطة وصول مقننة لمفردة لـ @ar
toolkit label: ……的单件的规范检索点 @zh-hans
has subproperty: P80091
lexical alias: authorizedAccessPointForItemOf.en
status: Published
type: Property
domain: C10012
label: auktorisoitu hakutieto kappaleelle @fi
label: autorizált hozzáférési pont a következő példányhoz: @hu
label: er autoriseret søgeindgang for eksemplar af @da
label: er autorisert søkeinngang for eksemplar for @no
label: est un point d’accès autorisé d’un item de @fr
label: ir vienības autoritatīvā pamatforma @lv
label: is geautoriseerde ingang voor item van @nl
label: ist normierter Sucheinstieg für ein Exemplar von @de
label: kopyası için yetkili erişim noktasıdır @tr
label: normitud otsielement eksemplarile @et
label: è punto d'accesso autorizzato per item di @it
label: és punt d’accés autoritzat d’ítem de @ca
label: هي نقطة وصول مقننة لمفردة لـ @ar
label: 是……的单件的规范检索点 @zh-hans
sub property of: is access point for item of
sub property of: is authorized access point for RDA entity of
definition: Bir ismi, belirli bir kelime kodlama şemasında tercih için seçilen kopya için bir erişim noktasına sahip olan bir kopyayla ilişkilendirir. @tr
definition: Correla un nomen a un item che ha un punto d'accesso per l'item che è stato selezionato come preferito in uno specifico schema di codifica di vocabolario. @it
definition: Hozzákapcsol egy noment egy példányhoz, amelynek van egy olyan hozzáférési pontja a példányhoz, amelyet egy adott szótárkódolási sémából kiválasztva előnyben részesítenek. @hu
definition: Liittää nomenin kappaleeseen, jolla on tietyssä sanaston merkintäjärjestelmässä ensisijaiseksi valittu hakutieto. @fi
definition: Met un nomen en relation avec un item qui possède un point d’accès d’un item faisant l’objet d’un choix privilégié dans un schéma d’encodage de vocabulaire spécifique. @fr
definition: Relaciona un nomen amb un ítem que té un punt d’accés d’ítem que se selecciona com a preferent en un esquema de codificació de vocabulari específic. @ca
definition: Relateert een nomen aan een item dat een ingang voor item heeft die als voorkeursterm geselecteerd is in een specifiek vocabulair coderingssysteem. @nl
definition: Relaterer et nomen til et eksemplar som har en søkeinngang for eksemplar som er valgt som preferanse i et bestemt kodeskjema for vokabular. @no
definition: Relaterer et nomen til et eksemplar, som har en søgeindgang for eksemplar, som er valgt som præference i et specifikt vokabularkodningsskema. @da
definition: Relates a nomen to an item that has an access point for item that is selected for preference in a specific vocabulary encoding scheme.
definition: Sasaista nomenu ar vienību, kurai ir vienības pamatforma, kas izvēlēta no konkrētas vārdnīcas. @lv
definition: Seostab nomen'i eksemplariga, millel on vastavas leksikaalses märkimissüsteemis eelistatuks valitud otsielement. @et
definition: Setzt ein Nomen in Beziehung zu einem Exemplar, das über einen Sucheinstieg für ein Exemplar verfügt, der in einem bestimmten Vocabulary Encoding Scheme als Vorzugsform bestimmt wird. @de
definition: يربط تسمية بمفردة لها نقطة وصول لمفردة اختيرت للتفضيل في خطة ترميز مفردات محددة. @ar
definition: 将一个命名与有在一个特定的词表编码体系中被首选的单件检索点的一个单件关联起来。 @zh-hans

is variant access point for item of
has element type: 2
toolkit definition: An item that has an access point for item that is not selected for preference in a specific vocabulary encoding scheme.
toolkit definition: Belirli bir kelime kodlama şemasında tercih için seçilmeyen bir kopya için erişim noktası olan bir kopya. @tr
toolkit definition: Een item dat een ingang voor item heeft die niet als voorkeursterm geselecteerd is in een specifiek vocabulair coderingssysteem. @nl
toolkit definition: Egy példány, amelynek van egy olyan hozzáférési pontja példányhoz, amelyet egy adott szótárkódolási sémából kiválasztva nem részesítenek előnyben. @hu
toolkit definition: Ein Exemplar, das über einen Sucheinstieg für ein Exemplar verfügt, der in einem bestimmten Vocabulary Encoding Scheme nicht als Vorzugsform bestimmt wird. @de
toolkit definition: Eksemplar, millel on otsielement, mis ei ole valitud eelistatuks vastavas leksikaalses märkimissüsteemis. @et
toolkit definition: Eksemplar, som har en søgeindgang for eksemplar, som ikke er valgt som præference i et specifikt vokabularkodningsskema. @da
toolkit definition: Et eksemplar som har en søkeinngang for eksemplar som ikke er valgt som preferanse i et bestemt kodeskjema for vokabular. @no
toolkit definition: Item qui possède un point d’accès d’un item ne faisant pas l’objet d’un choix privilégié dans un schéma d’encodage de vocabulaire spécifique. @fr
toolkit definition: Kappale, jonka hakutietoa ei ole valittu ensisijaiseksi tietyssä sanaston merkintäjärjestelmässä. @fi
toolkit definition: Un item che ha un punto d'accesso per l'item che non è stato selezionato come preferito in uno specifico schema di codifica di vocabolario. @it
toolkit definition: Vienība, kurai ir piekļuves punkts vienībai, kas nav izvēlēta kā prioritāra noteiktai kontrolētas vārdnīcas shēmai. @lv
toolkit definition: Ítem que té un punt d’accés d’ítem que no se selecciona com a preferent en un esquema de codificació de vocabulari específic. @ca
toolkit definition: مفردة لها نقطة وصول لمفردة لم تُختر للتفضيل في خطة ترميز مفردات محددة. @ar
toolkit definition: 有在一个特定的词表编码体系中未被首选的单件检索点的一个单件 @zh-hans
toolkit label: alternativ søkeinngang for eksemplar for @no
toolkit label: hozzáférésipont-változat a következő példányhoz: @hu
toolkit label: ir papildforma vienībai @lv
toolkit label: kopya için alternatif erişim noktası @tr
toolkit label: otsielemendi variant eksemplarile @et
toolkit label: punto d'accesso variante per item di @it
toolkit label: variant access point for item of
toolkit label: variant af søgeindgang for eksemplar af @da
toolkit label: variant de punt d’accés d’ítem de @ca
toolkit label: variant ingang voor item van @nl
toolkit label: variante de point d’accès d’un item de @fr
toolkit label: varianttihakutieto kappaleelle @fi
toolkit label: zusätzlicher Sucheinstieg für ein Exemplar von @de
toolkit label: نقطة وصول مختلفة لمفردة لـ @ar
toolkit label: ……的单件的变异检索点 @zh-hans
has subproperty: P80092
lexical alias: variantAccessPointForItemOf.en
status: Published
type: Property
domain: C10012
label: er alternativ søkeinngang for eksemplar for @no
label: er variant af søgeindgang for eksemplar af @da
label: est une variante de point d’accès d’un item de @fr
label: hozzáférésipont-változat a következő példányhoz: @hu
label: ir papildforma vienībai @lv
label: is variant ingang voor item van @nl
label: ist zusätzlicher Sucheinstieg für ein Exemplar von @de
label: otsielemendi variant eksemplarile @et
label: varianttihakutieto kappaleelle @fi
label: è punto d'accesso variante per item di @it
label: és variant de punt d’accés d’ítem de @ca
label: öğesi için farklı erişim noktası @tr
label: هي نقطة وصول مختلفة لمفردة لـ @ar
label: 是……的单件的变异检索点 @zh-hans
sub property of: is access point for item of
sub property of: is variant access point for RDA entity of
definition: Bir ismi, belirli bir kelime kodlama şemasında tercih için seçilmeyen bir kopya için erişim noktası olan bir kopyayla ilişkilendirir. @tr
definition: Correla un nomen a un item che ha un punto d'accesso per l'item che non è stato selezionato come preferito in uno specifico schema di codifica di vocabolario. @it
definition: Hozzákapcsol egy noment egy olyan példányhoz, amelynek van egy olyan hozzáférési pontja példányhoz, amelyet egy adott szótárkódolási sémából kiválasztva nem részesítenek előnyben. @hu
definition: Liittää nomenin kappaleeseen, jonka hakutietoa ei ole valittu ensisijaiseksi tietyssä sanaston merkintäjärjestelmässä. @fi
definition: Met un nomen en relation avec un item qui possède un point d’accès d’un item ne faisant pas l’objet d’un choix privilégié dans un schéma d’encodage de vocabulaire spécifique. @fr
definition: Relaciona un nomen amb un ítem que té un punt d’accés d’ítem que no se selecciona com a preferent en un esquema de codificació de vocabulari específic. @ca
definition: Relateert een nomen aan een item dat een ingang voor item heeft die niet als voorkeursterm geselecteerd is in een specifiek vocabulair coderingssysteem. @nl
definition: Relaterer et nomen til et eksemplar som har en søkeinngang for eksemplar som ikke er valgt som preferanse i et bestemt kodeskjema for vokabular. @no
definition: Relaterer et nomen til et eksemplar, som har en søgeindgang for eksemplar, som ikke er valgt som præference i et specifikt vokabularkodningsskema. @da
definition: Relates a nomen to an item that has an access point for item that is not selected for preference in a specific vocabulary encoding scheme.
definition: Sasaista nomenu ar vienību, kurai ir piekļuves punkts vienībai, kas nav izvēlēta kā prioritāra noteiktai kontrolētas vārdnīcas shēmai. @lv
definition: Seostab nomen'i eksemplariga, millel on otsielement, mis ei ole valitud eelistatuks vastavas leksikaalses märkimissüsteemis. @et
definition: Setzt ein Nomen in Beziehung zu einem Exemplar, das über einen Sucheinstieg für ein Exemplar verfügt, der in einem bestimmten Vocabulary Encoding Scheme nicht als Vorzugsform bestimmt wird. @de
definition: يربط تسمية بمفردة لها نقطة وصول لمفردة لم تُختر للتفضيل في خطة ترميز مفردات محددة. @ar
definition: 将一个命名与有在一个特定的词表编码体系中未被首选的单件检索点的一个单件关联起来。 @zh-hans

is preferred title of item of
has element type: 2
toolkit definition: An item that has a title of item that is selected for preference in a specific application or context.
toolkit definition: Belirli bir uygulama veya bağlamda tercih için seçilen bir gösterim başlığına sahip bir kopya. @tr
toolkit definition: Een item dat een titel van item heeft die als voorkeursterm geselecteerd is in een specifieke toepassing of context. @nl
toolkit definition: Egy példány, amely rendelkezik egy olyan példányhoz tartozó címmel, amelyet egy adott alkalmazásban vagy kontextusban előnyben részesítenek. @hu
toolkit definition: Ein Exemplar, das über einen Titel für ein Exemplar verfügt, der in einer bestimmten Anwendung oder in einem bestimmten Kontext als Vorzugsform bestimmt wird. @de
toolkit definition: Eksemplar, millel on kindlas rakenduses või kontekstis eelistatuks valitud pealkiri. @et
toolkit definition: Eksemplar, som har en titel på eksemplar, som er valgt som præference i en specifik anvendelse eller kontekst. @da
toolkit definition: Et eksemplar som har en tittel for eksemplar som er valgt som preferanse i en bestemt applikasjon eller kontekst. @no
toolkit definition: Item qui possède un titre d’item faisant l’objet d’un choix privilégié dans une application ou un contexte spécifiques. @fr
toolkit definition: Kappale, jonka nimeke on valittu ensisijaiseksi tietyssä sovelluksessa tai kontekstissa. @fi
toolkit definition: Un item che ha un titolo di item che è stato selezionato come preferito in una specifica applicazione o contesto. @it
toolkit definition: Vienība, kurai ir vienības nosaukums, kas ir izvēlēts noteiktam lietojumam vai noteiktā kontekstā. @lv
toolkit definition: Ítem que té un títol d’ítem que se selecciona com a preferent en una aplicació o un context específic. @ca
toolkit definition: مفردة لها عنوان مفردة اختير للتفضيل في تطبيق أو في سياق معين. @ar
toolkit definition: 有在一个特定的应用或语境中被首选的一个单件题名的一个单件 @zh-hans
toolkit label: Bevorzugter Titel eines Exemplars von @de
toolkit label: eelispealkiri eksemplarile @et
toolkit label: előnyben részesített címe a következő példánynak: @hu
toolkit label: ensisijainen nimeke kappaleelle @fi
toolkit label: foretrukken titel på eksemplar af @da
toolkit label: foretrukket tittel for eksemplar for @no
toolkit label: geprefereerde titel van item van @nl
toolkit label: ir vienības prioritārais nosaukums @lv
toolkit label: preferred title of item of
toolkit label: titolo preferito dell'item di @it
toolkit label: titre privilégié d’un item de @fr
toolkit label: títol preferit d’ítem de @ca
toolkit label: öğesinin tercih edilen başlığı @tr
toolkit label: عنوان مفردة مفضل لـ @ar
toolkit label: ……的单件的首选题名 @zh-hans
has subproperty: P80093
lexical alias: preferredTitleOfItemOf.en
status: Published
type: Property
domain: C10012
label: eelispealkiri eksemplarile @et
label: előnyben részesített címe a következő példánynak: @hu
label: ensisijainen nimeke kappaleelle @fi
label: er foretrukken titel på eksemplar af @da
label: er foretrukket tittel for eksemplar for @no
label: est un titre privilégié d’un item de @fr
label: ir vienības prioritārais nosaukums @lv
label: is geprefereerde titel van item van @nl
label: ist bevorzugter Titel eines Exemplars von @de
label: kopyasının tercih edilen başlığıdır @tr
label: è titolo preferito dell'item di @it
label: és títol preferit d’ítem de @ca
label: هو عنوان مفردة مفضل لـ @ar
label: 是……的单件的首选题名 @zh-hans
sub property of: is title of item of
sub property of: is preferred name of RDA entity of
definition: Bir ismi, belirli bir uygulama veya bağlamda tercih edilmek üzere seçilen kopyanın başlığına sahip bir kopyayla ilişkilendirir. @tr
definition: Correla un nomen a un item che ha un titolo di item che è stato selezionato come preferito in una specifica applicazione o contesto. @it
definition: Hozzákapcsol egy noment egy példányhoz, amely rendelkezik egy olyan példányhoz tartozó címmel, amelyet egy adott alkalmazásban vagy kontextusban előnyben részesítenek. @hu
definition: Liittää nomenin kappaleeseen, jonka nimeke on valittu ensisijaiseksi tietyssä sovelluksessa tai kontekstissa. @fi
definition: Met un nomen en relation avec un item qui possède un titre d’item faisant l’objet d’un choix privilégié dans une application ou un contexte spécifiques. @fr
definition: Relaciona un nomen amb un ítem que té un títol d’ítem que se selecciona com a preferent en una aplicació o un context específic. @ca
definition: Relateert een nomen aan een item dat een titel van item heeft die als voorkeursterm geselecteerd is in een specifieke toepassing of context. @nl
definition: Relaterer et nomen til et eksemplar som har en tittel for eksemplar som er valgt som preferanse i en bestemt applikasjon eller kontekst. @no
definition: Relaterer et nomen til et eksemplar, som har en titel på eksemplar, som er valgt som præference i en specifik anvendelse eller kontekst. @da
definition: Relates a nomen to an item that has a title of item that is selected for preference in a specific application or context.
definition: Sasaista nomenu ar vienību, kurai ir vienības nosaukums, kas ir izvēlēts noteiktam lietojumam vai noteiktā kontekstā. @lv
definition: Seostab nomen'i eksemplariga, millel on kindlas rakenduses või kontekstis eelistatuks valitud pealkiri. @et
definition: Setzt ein Nomen in Beziehung zu einem Exemplar, das über einen Titel für ein Exemplar verfügt, der in einer bestimmten Anwendung oder in einem bestimmten Kontext als Vorzugsform bestimmt wird. @de
definition: يربط تسمية بمفردة لها عنوان مفردة اختير للتفضيل في تطبيق أو في سياق معين. @ar
definition: 将一个命名与有在一个特定的应用或语境中被首选的一个单件题名的一个单件关联起来。 @zh-hans

is variant title of item of
has element type: 2
toolkit definition: An item that has a title of item that is not selected for preference in a specific application or context.
toolkit definition: Belirli bir uygulama veya bağlamda tercih için seçilmeyen bir gösterim başlığına sahip bir kopya. @tr
toolkit definition: Een item dat een titel van item heeft die niet als voorkeursterm geselecteerd is in een specifieke toepassing of context. @nl
toolkit definition: Egy példány, amely rendelkezik egy olyan példányhoz tartozó címmel, amelyet egy adott alkalmazásban vagy kontextusban nem részesítenek előnyben. @hu
toolkit definition: Ein Exemplar, das über einen Titel für ein Exemplar verfügt, der in einer bestimmten Anwendung oder in einem bestimmten Kontext nicht als Vorzugsform bestimmt wird. @de
toolkit definition: Eksemplar, millel on pealkiri, mis kindlas rakenduses või kontekstis ei ole valitud eelistatuks. @et
toolkit definition: Eksemplar, som har en titel på eksemplar, som ikke er valgt som præference i en specifik anvendelse eller kontekst. @da
toolkit definition: Et eksemplar som har en tittel for eksemplar som ikke er valgt som preferanse i en bestemt applikasjon eller kontekst. @no
toolkit definition: Item qui possède un titre d’item ne faisant pas l’objet d’un choix privilégié dans une application ou un contexte spécifiques. @fr
toolkit definition: Kappale, jonka nimekettä ei ole valittu ensisijaiseksi tietyssä sovelluksessa tai kontekstissa. @fi
toolkit definition: Un item che ha un titolo di item che non è stato selezionato come preferito in uno specifico schema di codifica di vocabolario. @it
toolkit definition: Vienība, kurai ir vienības nosaukums, kas nav izvēlēts kā prioritārs noteiktā lietojumprogrammā vai kontekstā. @lv
toolkit definition: Ítem que té un títol d’ítem que no se selecciona com a preferent en una aplicació o un context específic. @ca
toolkit definition: مفردة لها عنوان مفردة لم يُختر للتفضيل في تطبيق أو في سياق معين. @ar
toolkit definition: 有在一个特定的应用或语境中未被首选的一个单件题名的一个单件 @zh-hans
toolkit label: Abweichender Titel eines Exemplars von @de
toolkit label: cits nosaukums vienībai @lv
toolkit label: címváltozata a következő példánynak: @hu
toolkit label: kopyanın alternatif başlığı @tr
toolkit label: titolo variante dell'item di @it
toolkit label: tittelvariant for eksemplar for @no
toolkit label: variant af titel på eksemplar af @da
toolkit label: variant de títol d’ítem de @ca
toolkit label: variant titel van item van @nl
toolkit label: variant title of item of
toolkit label: variante de titre d’item de @fr
toolkit label: variantpealkiri eksemplaris @et
toolkit label: varianttinimeke kappaleelle @fi
toolkit label: عنوان مفردة مختلف لـ @ar
toolkit label: ……的单件的变异题名 @zh-hans
has subproperty: P80094
lexical alias: variantTitleOfItemOf.en
status: Published
type: Property
domain: C10012
label: címváltozata a következő példánynak: @hu
label: er tittelvariant for eksemplar for @no
label: er variant af titel på eksemplar af @da
label: est une variante de titre d’item de @fr
label: ir cits nosaukums vienībai @lv
label: is variant titel van item van @nl
label: ist abweichender Titel eines Exemplars von @de
label: variantpealkiri eksemplaris @et
label: varianttinimeke kappaleelle @fi
label: è titolo variante dell'item di @it
label: és variant de títol d’ítem de @ca
label: öğesinin farklı başlığı @tr
label: هو عنوان مفردة مختلف لـ @ar
label: 是……的单件的变异题名 @zh-hans
sub property of: is title of item of
sub property of: is variant name of RDA entity of
definition: Bir ismi, belirli bir uygulama veya bağlamda tercih edilmeyen bir öğe başlığına sahip bir kopyayla ilişkilendirir. @tr
definition: Correla un nomen a un item che ha un titolo di item che non è stato selezionato come preferito in uno specifico schema di codifica di vocabolario. @it
definition: Hozzákapcsol egy noment egy példányhoz, amely rendelkezik egy olyan példányhoz tartozó címmel, amelyet egy adott alkalmazásban vagy kontextusban nem részesítenek előnyben. @hu
definition: Liittää nomenin kappaleeseen, jonka nimekettä ei ole valittu ensisijaiseksi tietyssä sovelluksessa tai kontekstissa. @fi
definition: Met un nomen en relation avec un item qui possède un titre d’item ne faisant pas l’objet d’un choix privilégié dans une application ou un contexte spécifiques. @fr
definition: Relaciona un nomen amb un ítem que té un títol d’ítem que no se selecciona com a preferent en una aplicació o un context específic. @ca
definition: Relateert een nomen aan een item dat een titel van item heeft die niet als voorkeursterm geselecteerd is in een specifieke toepassing of context. @nl
definition: Relaterer et nomen til et eksemplar som har en tittel for eksemplar som ikke er valgt som preferanse i en bestemt applikasjon eller kontekst. @no
definition: Relaterer et nomen til et eksemplar, som har en titel på eksemplar, som ikke er valgt som præference i en specifik anvendelse eller kontekst. @da
definition: Relates a nomen to an item that has a title of item that is not selected for preference in a specific application or context.
definition: Sasaista nomenu ar vienību, kurai ir vienības nosaukums, kas nav izvēlēts kā prioritārs noteiktā lietojumprogrammā vai kontekstā. @lv
definition: Seostab nomen'i eksemplariga, millel on pealkiri, mis kindlas rakenduses või kontekstis ei ole valitud eelistatuks. @et
definition: Setzt ein Nomen in Beziehung zu einem Exemplar, das über einen Titel für ein Exemplar verfügt, der in einer bestimmten Anwendung oder in einem bestimmten Kontext nicht als Vorzugsform bestimmt wird. @de
definition: يربط تسمية بمفردة لها عنوان مفردة لم يُختر للتفضيل في تطبيق أو في سياق معين. @ar
definition: 将一个命名与有在一个特定的应用或语境中未被首选的一个单件题名的一个单件关联起来。 @zh-hans

is authorized access point for expression of
has element type: 2
toolkit definition: An expression that has an access point for expression that is selected for preference in a specific vocabulary encoding scheme.
toolkit definition: Belirli bir kelime kodlama şemasında tercih için seçilen bir erişim noktasına sahip bir anlatım. @tr
toolkit definition: Een expressie die een ingang voor expressie heeft die als voorkeursterm geselecteerd is in een specifiek vocabulair coderingssysteem. @nl
toolkit definition: Egy kifejezési forma, amelynek van egy olyan hozzáférési pontja a kifejezési forma számára, amelyet egy adott szótárkódolási sémából kiválasztva előnyben részesítenek. @hu
toolkit definition: Eine Expression, die über einen Sucheinstieg für eine Expression verfügt, der in einem bestimmten Vocabulary Encoding Scheme als Vorzugsform bestimmt wird. @de
toolkit definition: Ekspressio, jolla on tietyssä sanaston merkintäjärjestelmässä ensisijaiseksi valittu hakutieto. @fi
toolkit definition: Et uttrykk som har en søkeinngang for uttrykk som er valgt som preferanse i et bestemt kodeskjema for vokabular. @no
toolkit definition: Expression qui possède un point d’accès d’une expression faisant l’objet d’un choix privilégié dans un schéma d’encodage de vocabulaire spécifique. @fr
toolkit definition: Expressió que té un punt d’accés d’expressió que se selecciona com a preferent en un esquema de codificació de vocabulari específic. @ca
toolkit definition: Izteiksme, kam ir izteiksmes pamatforma, kas izvēlēta no konkrētas vārdnīcas. @lv
toolkit definition: Udtryk, som har en søgeindgang for udtryk, som er valgt som præference i et specifikt vokabularkodningsskema. @da
toolkit definition: Un'espressione che ha un punto d'accesso per l'espressione che è stato selezionato come preferito in uno specifico schema di codifica di vocabolario. @it
toolkit definition: Väljendus, millel on vastavas leksikaalses märkimissüsteemis eelistatuks valitud otsielement. @et
toolkit definition: تعبيرة لها نقطة وصول لتعبيرة اختيرت للتفضيل في خطة ترميز مفردات محددة. @ar
toolkit definition: 有在一个特定的词表编码体系中被首选的内容表达检索点的一种内容表达 @zh-hans
toolkit label: Normierter Sucheinstieg für eine Expression von @de
toolkit label: anlatım için yetkili erişim noktası @tr
toolkit label: auktorisoitu hakutieto ekspressiolle @fi
toolkit label: authorized access point for expression of
toolkit label: autoriseret søgeindgang for korporation af @da
toolkit label: autorisert søkeinngang for uttrykk for @no
toolkit label: autorizált hozzáférési pont a következő kifejezési formának: @hu
toolkit label: geautoriseerde ingang voor expressie van @nl
toolkit label: ir autoritatīvā vārdforma izteiksmei @lv
toolkit label: normitud otsielement väljendusele @et
toolkit label: point d’accès autorisé d’une expression de @fr
toolkit label: punt d’accés autoritzat d’expressió de @ca
toolkit label: punto d'accesso autorizzato per espressione di @it
toolkit label: نقطة وصول مقننة لتعبيرة لـ @ar
toolkit label: ……的内容表达的规范检索点 @zh-hans
has subproperty: P80095
lexical alias: authorizedAccessPointForExpressionOf.en
status: Published
type: Property
domain: C10012
label: anlatımı için yetkili erişim noktası @tr
label: auktorisoitu hakutieto ekspressiolle @fi
label: autorizált hozzáférési pont a következő kifejezési formához: @hu
label: er autoriseret søgeindgang for udtryk af @da
label: er autorisert søkeinngang for uttrykk for @no
label: est un point d’accès autorisé d’une expression de @fr
label: ir autoritatīvā vārdforma izteiksmei @lv
label: is geautoriseerde ingang voor expressie van @nl
label: ist normierter Sucheinstieg für eine Expression von @de
label: normitud otsielement väljendusele @et
label: è punto d'accesso autorizzato per espressione di @it
label: és punt d’accés autoritzat d’expressió de @ca
label: نقطة وصول مقننة لتعبيرة لـ @ar
label: 是……的内容表达的规范检索点 @zh-hans
sub property of: is access point for expression of
sub property of: is authorized access point for RDA entity of
definition: Bir ismi, belirli bir kelime kodlama şemasında tercih için seçilen anlatım için bir erişim noktası olan bir anlatımla ilişkilendirir. @tr
definition: Correla un nomen a un'espressione che ha un punto d'accesso per l'espressione che è stato selezionato come preferito in uno specifico schema di codifica di vocabolario. @it
definition: Hozzákapcsol egy noment egy kifejezési formához, amelynek van egy olyan hozzáférési pontja a kifejezési forma számára, amelyet egy adott szótárkódolási sémából kiválasztva előnyben részesítenek. @hu
definition: Liittää nomenin ekspressioon, jolla on tietyssä sanaston merkintäjärjestelmässä ensisijaiseksi valittu hakutieto. @fi
definition: Met un nomen en relation avec une expression qui possède un point d’accès d’une expression faisant l’objet d’un choix privilégié dans un schéma d’encodage de vocabulaire spécifique. @fr
definition: Relaciona un nomen amb una expressió que té un punt d’accés d’expressió que se selecciona com a preferent en un esquema de codificació de vocabulari específic. @ca
definition: Relateert een nomen aan een expressie die een ingang voor expressie heeft die als voorkeursterm geselecteerd is in een specifiek vocabulair coderingssysteem. @nl
definition: Relaterer et nomen til et udtryk, som har en søgeindgang for udtryk, som er valgt som præference i et specifikt vokabularkodningsskema. @da
definition: Relaterer et nomen til et uttrykk som har en søkeinngang for uttrykk som er valgt som preferanse i et bestemt kodeskjema for vokabular. @no
definition: Relates a nomen to an expression that has an access point for expression that is selected for preference in a specific vocabulary encoding scheme.
definition: Sasaista nomenu ar izteiksmi, kam ir izteiksmes pamatforma, kas izvēlēta no konkrētas vārdnīcas. @lv
definition: Seostab nomen'i väljendusega, millel on vastavas leksikaalses märkimissüsteemis eelistatuks valitud otsielement. @et
definition: Setzt ein Nomen in Beziehung zu einer Expression, die über einen Sucheinstieg verfügt, der in einem bestimmten Vocabulary Encoding Scheme als Vorzugsform bestimmt wird. @de
definition: يربط تسمية بتعبيرة لها نقطة وصول لتعبيرة اختيرت للتفضيل في خطة ترميز مفردات محددة. @ar
definition: 将一个命名与有在一个特定的词表编码体系中被首选的内容表达检索点的一种内容表达关联起来。 @zh-hans

is variant access point for expression of
has element type: 2
toolkit definition: An expression that has an access point for expression that is not selected for preference in a specific vocabulary encoding scheme.
toolkit definition: Belirli bir kelime kodlama şemasında tercih için seçilmeyen bir erişim noktasına sahip bir anlatım. @tr
toolkit definition: Een expressie die een ingang voor expressie heeft die niet als voorkeursterm geselecteerd is in een specifiek vocabulair coderingssysteem. @nl
toolkit definition: Egy kifejezési forma, amelynek van egy olyan hozzáférési pontja a kifejezési forma számára, amelyet egy adott szótárkódolási sémából kiválasztva nem részesítenek előnyben. @hu
toolkit definition: Eine Expression, die über einen Sucheinstieg für eine Expression verfügt, der in einem bestimmten Vocabulary Encoding Scheme nicht als Vorzugsform bestimmt wird. @de
toolkit definition: Ekspressio, jonka hakutietoa ei ole valittu ensisijaiseksi tietyssä sanaston merkintäjärjestelmässä. @fi
toolkit definition: Et uttrykk som har en søkeinngang for uttrykk som ikke er valgt som preferanse i et bestemt kodeskjema for vokabular. @no
toolkit definition: Expression qui possède un point d’accès d’une expression ne faisant pas l’objet d’un choix privilégié dans un schéma d’encodage de vocabulaire spécifique. @fr
toolkit definition: Expressió que té un punt d’accés d’expressió que no se selecciona com a preferent en un esquema de codificació de vocabulari específic. @ca
toolkit definition: Izteiksme, kam ir piekļuves punkts izteiksmei, kas nav izvēlēta kā prioritāra noteiktai kontrolētas vārdnīcas shēmai. @lv
toolkit definition: Udtryk, som har en søgeindgang for udtryk, som ikke er valgt som præference i et specifikt vokabularkodningsskema. @da
toolkit definition: Un'espressione che ha un punto d'accesso per l'espressione che non è stato selezionato come preferito in uno specifico schema di codifica di vocabolario. @it
toolkit definition: Väljendus, millel on otsielement, mis ei ole valitud eelistatuks vastavas leksikaalses märkimissüsteemis. @et
toolkit definition: تعبيرة لها نقطة وصول لتعبيرة لم تُختر للتفضيل في خطة ترميز مفردات محددة. @ar
toolkit definition: 有在一个特定的词表编码体系中未被首选的内容表达检索点的一种内容表达 @zh-hans
toolkit label: Zusätzlicher Sucheinstieg für eine Expression von @de
toolkit label: alternativ søkeinngang for uttrykk for @no
toolkit label: anlatım için alternatif erişim noktası @tr
toolkit label: hozzáférésipont-változat a következő kifejezési formához: @hu
toolkit label: ir cita vārdforma izteiksmei @lv
toolkit label: otsielemendi variant väljendusele @et
toolkit label: punto d'accesso variante per espressione di @it
toolkit label: variant access point for expression of
toolkit label: variant af søgeindgang for udtryk af @da
toolkit label: variant de punt d’accés d’expressió de @ca
toolkit label: variant ingang voor expressie van @nl
toolkit label: variante de point d’accès d’une expression de @fr
toolkit label: varianttihakutieto ekspressiolle @fi
toolkit label: نقطة وصول مختلفة لتعبيرة لـ @ar
toolkit label: ……的内容表达的变异检索点 @zh-hans
has subproperty: P80096
lexical alias: variantAccessPointForExpressionOf.en
status: Published
type: Property
domain: C10012
label: er alternativ søkeinngang for uttrykk for @no
label: er variant af søgeindgang for udtryk af @da
label: est une variante de point d’accès d’une expression de @fr
label: hozzáférésipont-változat a következő kifejezési formához: @hu
label: ifadesi için farklı erişim noktası @tr
label: ir cita vārdforma izteiksmei @lv
label: is variant ingang voor expressie van @nl
label: ist zusätzlicher Sucheinstieg für eine Expression von @de
label: otsielemendi variant väljendusele @et
label: varianttihakutieto ekspressiolle @fi
label: è punto d'accesso variante per espressione di @it
label: és variant de punt d’accés d’expressió de @ca
label: هي نقطة وصول مختلفة لتعبيرة لـ @ar
label: 是……的内容表达的变异检索点 @zh-hans
sub property of: is access point for expression of
sub property of: is variant access point for RDA entity of
definition: Bir ismi, belirli bir kelime kodlama şemasında tercih için seçilmeyen anlatım için erişim noktası olan bir anlatımla ilişkilendirir. @tr
definition: Correla un nomen a un'espressione che ha un punto d'accesso per l'espressione che non è stato selezionato come preferito in uno specifico schema di codifica di vocabolario. @it
definition: Hozzákapcsol egy noment egy olyan kifejezési formához, amelynek van egy olyan hozzáférési pontja a kifejezési forma számára, amelyet egy adott szótárkódolási sémából kiválasztva nem részesítenek előnyben. @hu
definition: Liittää nomenin ekspressioon, jonka hakutietoa ei ole valittu ensisijaiseksi tietyssä sanaston merkintäjärjestelmässä. @fi
definition: Met un nomen en relation avec une expression qui possède un point d’accès d’une expression ne faisant pas l’objet d’un choix privilégié dans un schéma d’encodage de vocabulaire spécifique. @fr
definition: Relaciona un nomen amb una expressió que té un punt d’accés d’expressió que no se selecciona com a preferent en un esquema de codificació de vocabulari específic. @ca
definition: Relateert een nomen aan een expressie die een ingang voor expressie heeft die niet als voorkeursterm geselecteerd is in een specifiek vocabulair coderingssysteem. @nl
definition: Relaterer et nomen til et udtryk, som har en søgeindgang for udtryk, som ikke er valgt som præference i et specifikt vokabularkodningsskema. @da
definition: Relaterer et nomen til et uttrykk som har en søkeinngang for uttrykk som ikke er valgt som preferanse i et bestemt kodeskjema for vokabular. @no
definition: Relates a nomen to an expression that has an access point for expression that is not selected for preference in a specific vocabulary encoding scheme.
definition: Sasaista nomenu ar izteiksmi, kam ir piekļuves punkts izteiksmei, kas nav izvēlēta kā prioritāra noteiktai kontrolētas vārdnīcas shēmai. @lv
definition: Seostab nomen'i väljendusega, millel on otsielement, mis ei ole valitud eelistatuks vastavas leksikaalses märkimissüsteemis. @et
definition: Setzt ein Nomen in Beziehung zu einer Expression, die über einen Sucheinstieg für eine Expression verfügt, der in einem bestimmten Vocabulary Encoding Scheme nicht als Vorzugsform bestimmt wird. @de
definition: يربط تسمية بتعبيرة لها نقطة وصول لتعبيرة لم تُختر للتفضيل في خطة ترميز مفردات محددة. @ar
definition: 将一个命名与有在一个特定的词表编码体系中未被首选的内容表达检索点的一种内容表达关联起来。 @zh-hans

is preferred title of expression of
has element type: 2
toolkit definition: An expression that has a title of expression that is selected for preference in a specific application or context.
toolkit definition: Belirli bir uygulama veya bağlamda tercih için seçilen bir anlatım başlığına sahip anlatım. @tr
toolkit definition: Een expressie diee een titel van expressie heeft die als voorkeursterm geselecteerd is in een specifieke toepassing of context. @nl
toolkit definition: Egy kifejezési forma, amelynek van egy olyan hozzáférési pontja a kifejezési forma számára, amelyet egy adott szótárkódolási sémából kiválasztva nem részesítenek előnyben. @hu
toolkit definition: Eine Expression, die über einen Titel für eine Expression verfügt, der in einer bestimmten Anwendung oder in einem bestimmten Kontext als Vorzugsform bestimmt wird. @de
toolkit definition: Ekspressio, jonka nimeke on valittu ensisijaiseksi tietyssä sovelluksessa tai kontekstissa. @fi
toolkit definition: Et uttrykk som har en tittel for uttrykk som er valgt som preferanse i en bestemt applikasjon eller kontekst. @no
toolkit definition: Expression qui possède un titre d’expression faisant l’objet d’un choix privilégié dans une application ou un contexte spécifiques. @fr
toolkit definition: Expressió que té un títol d’expressió que se selecciona com a preferent en una aplicació o un context específic. @ca
toolkit definition: Izteiksme, kam ir izteiksmes nosaukums, kas ir izvēlēts noteiktam lietojumam vai noteiktā kontekstā. @lv
toolkit definition: Udtryk, som har en titel på udtryk, som er valgt som præference i en specifik anvendelse eller kontekst. @da
toolkit definition: Un'espressione che ha un titolo di espressione che è stato selezionato come preferito in una specifica applicazione o contesto. @it
toolkit definition: Väljendus, millel on kindlas rakenduses või kontekstis eelistatuks valitud pealkiri. @et
toolkit definition: تعبيرة لها عنوان تعبيرة اختير للتفضيل في تطبيق أو في سياق معين. @ar
toolkit definition: 有在一个特定的应用或语境中被首选的一个内容表达题名的一种内容表达 @zh-hans
toolkit label: Anlatımın tercih edilen başlığı @tr
toolkit label: Bevorzugter Titel einer Expression von @de
toolkit label: eelispealkiri väljendusele @et
toolkit label: előnyben részesített címe a következő kifejezési formának: @hu
toolkit label: ensisijainen nimeke ekspressiolle @fi
toolkit label: foretrukken titel på udtryk af @da
toolkit label: foretrukket tittel for uttrykk for @no
toolkit label: geprefereerde titel van expressie van @nl
toolkit label: ir prioritārais nosaukums izteiksmei @lv
toolkit label: preferred title of expression of
toolkit label: titolo preferito dell'espressione di @it
toolkit label: titre privilégié d’une expression de @fr
toolkit label: títol preferit d’expressió de @ca
toolkit label: عنوان تعبيرة مفضل لـ @ar
toolkit label: ……的内容表达的首选题名 @zh-hans
has subproperty: P80097
lexical alias: preferredTitleOfExpressionOf.en
status: Published
type: Property
domain: C10012
label: anlatımının tercih edilen başlığıdır @tr
label: eelispealkiri väljendusele @et
label: előnyben részesített címe a következő kifejezési formának: @hu
label: ensisijainen nimeke ekspressiolle @fi
label: er foretrukken titel på udtryk af @da
label: er foretrukket tittel for uttrykk for @no
label: est un titre privilégié d’une expression de @fr
label: ir prioritārais nosaukums izteiksmei @lv
label: is geprefereerde titel van expressie van @nl
label: ist bevorzugter Titel einer Expression von @de
label: è titolo preferito dell'espressione di @it
label: és títol preferit d’expressió de @ca
label: هو عنوان تعبيرة مفضل لـ @ar
label: 是……的内容表达的首选题名 @zh-hans
sub property of: is title of expression of
sub property of: is preferred name of RDA entity of
definition: Bir ismi, belirli bir uygulama veya bağlamda tercih edilmek üzere seçilen bir anlatım başlığına sahip bir anlatımla ilişkilendirir. @tr
definition: Correla un nomen a un'espressione che ha un titolo di espressione che è stato selezionato come preferito in una specifica applicazione o contesto. @it
definition: Hozzákapcsol egy noment egy kifejezési formához, amely rendelkezik egy olyan kifejezési formához tartozó címmel, amelyet egy adott alkalmazásban vagy kontextusban előnyben részesítenek. @hu
definition: Liittää nomenin ekspressioon, jonka nimeke on valittu ensisijaiseksi tietyssä sovelluksessa tai kontekstissa. @fi
definition: Met un nomen en relation avec une expression qui possède un titre d’expression faisant l’objet d’un choix privilégié dans une application ou un contexte spécifiques. @fr
definition: Relaciona un nomen amb una expressió que té un títol d’expressió que se selecciona com a preferent en una aplicació o un context específic. @ca
definition: Relateert een nomen aan een expressie diee een titel van expressie heeft die als voorkeursterm geselecteerd is in een specifieke toepassing of context. @nl
definition: Relaterer et nomen til et udtryk, som har en titel på udtryk, som er valgt som præference i en specifik anvendelse eller kontekst. @da
definition: Relaterer et nomen til et uttrykk som har en tittel for uttrykk som er valgt som preferanse i en bestemt applikasjon eller kontekst. @no
definition: Relates a nomen to an expression that has a title of expression that is selected for preference in a specific application or context.
definition: Sasaista nomenu ar izteiksmi, kam ir izteiksmes nosaukums, kas ir izvēlēts noteiktam lietojumam vai noteiktā kontekstā. @lv
definition: Seostab nomen'i väljendusega, millel on kindlas rakenduses või kontekstis eelistatuks valitud pealkiri. @et
definition: Setzt ein Nomen in Beziehung zu einer Expression, die über einen Titel für eine Expression verfügt, der in einer bestimmten Anwendung oder in einem bestimmten Kontext als Vorzugsform bestimmt wird. @de
definition: يربط تسمية بتعبيرة لها عنوان تعبيرة اختير للتفضيل في تطبيق أو في سياق معين. @ar
definition: 将一个命名与有在一个特定的应用或语境中被首选的一个内容表达题名的一种内容表达关联起来。 @zh-hans

is variant title of expression of
has element type: 2
toolkit definition: An expression that has a title of expression that is not selected for preference in a specific application or context.
toolkit definition: Belirli bir uygulama veya bağlamda tercih için seçilmeyen bir anlatım başlığına sahip anlatım. @tr
toolkit definition: Een expressie die een titel van expression heeft die niet als voorkeursterm geselecteerd is in een specifieke toepassing of context. @nl
toolkit definition: Egy kifejezési forma, amely rendelkezik egy olyan kifejezési formához tartozó címmel, amelyet egy adott alkalmazásban vagy kontextusban nem részesítenek előnyben. @hu
toolkit definition: Eine Expression, die über einen Titel für eine Expression verfügt, der in einer bestimmten Anwendung oder in einem bestimmten Kontext nicht als Vorzugsform bestimmt wird. @de
toolkit definition: Ekspressio, jonka nimekettä ei ole valittu ensisijaiseksi tietyssä sovelluksessa tai kontekstissa. @fi
toolkit definition: Et uttrykk som har en tittel for uttrykk som ikke er valgt som preferanse i en bestemt applikasjon eller kontekst. @no
toolkit definition: Expression qui possède un titre d’expression ne faisant pas l’objet d’un choix privilégié dans une application ou un contexte spécifiques. @fr
toolkit definition: Expressió que té un títol d’expressió que no se selecciona com a preferent en una aplicació o un context específic. @ca
toolkit definition: Izteiksme, kam ir izteiksmes nosaukums, kas nav izvēlēts kā prioritārs noteiktā lietojumprogrammā vai kontekstā. @lv
toolkit definition: Udtryk, som har en titel på udtryk, som ikke er valgt som præference i en specifik anvendelse eller kontekst. @da
toolkit definition: Un'espressione che ha un titolo di espressione che non è stato selezionato come preferito in uno specifico schema di codifica di vocabolario. @it
toolkit definition: Väljendus, millel on pealkiri, mis kindlas rakenduses või kontekstis ei ole valitud eelistatuks. @et
toolkit definition: تعبيرة لها عنوان تعبيرة لم يُختر للتفضيل في تطبيق أو في سياق معين. @ar
toolkit definition: 有在一个特定的应用或语境中未被首选的一个内容表达题名的一种内容表达 @zh-hans
toolkit label: Abweichender Titel einer Expression von @de
toolkit label: anlatımın alternatif başlığı @tr
toolkit label: címváltozata a következő kifejezési formának: @hu
toolkit label: ir cits nosaukums izteiksmei @lv
toolkit label: titolo variante dell'espressione di @it
toolkit label: tittelvariant for uttrykk for @no
toolkit label: variant af titel på udtryk af @da
toolkit label: variant de títol d’expressió de @ca
toolkit label: variant titel van expressie van @nl
toolkit label: variant title of expression of
toolkit label: variante de titre d’expression de @fr
toolkit label: variantpealkiri väljenduses @et
toolkit label: varianttinimeke ekspressiolle @fi
toolkit label: عنوان تعبيرة مختلف لـ @ar
toolkit label: ……的内容表达的变异题名 @zh-hans
has subproperty: P80098
lexical alias: variantTitleOfExpressionOf.en
status: Published
type: Property
domain: C10012
label: címvariánsa a következő kifejezési formának: @hu
label: er tittelvariant for uttrykk for @no
label: er variant af titel på udtryk af @da
label: est une variante de titre d’expression de @fr
label: ifadesinin farklı başlığı @tr
label: ir cits nosaukums izteiksmei @lv
label: is variant titel van expressie van @nl
label: ist abweichender Titel einer Expression von @de
label: variantpealkiri väljenduses @et
label: varianttinimeke ekspressiolle @fi
label: è titolo variante dell'espressione di @it
label: és variant de títol d’expressió de @ca
label: هو عنوان تعبيرة مختلف لـ @ar
label: 是……的内容表达的变异题名 @zh-hans
sub property of: is title of expression of
sub property of: is variant name of RDA entity of
definition: Bir ismi, belirli bir uygulama veya bağlamda tercih için seçilmeyen bir anlatım başlığına sahip bir anlatımla ilişkilendirir. @tr
definition: Correla un nomen a un'espressione che ha un titolo di espressione che non è stato selezionato come preferito in uno specifico schema di codifica di vocabolario. @it
definition: Hozzákapcsol egy noment egy kifejezési formához, amely rendelkezik egy olyan kifejezési formához tartozó címmel, amelyet egy adott alkalmazásban vagy kontextusban nem részesítenek előnyben. @hu
definition: Liittää nomenin ekspressioon, jonka nimekettä ei ole valittu ensisijaiseksi tietyssä sovelluksessa tai kontekstissa. @fi
definition: Met un nomen en relation avec une expression qui possède un titre d’expression ne faisant pas l’objet d’un choix privilégié dans une application ou un contexte spécifiques. @fr
definition: Relaciona un nomen amb una expressió que té un títol d’expressió que no se selecciona com a preferent en una aplicació o un context específic. @ca
definition: Relateert een nomen aan een expressie die een titel van expression heeft die niet als voorkeursterm geselecteerd is in een specifieke toepassing of context. @nl
definition: Relaterer et nomen til et udtryk, som har en titel på udtryk, som ikke er valgt som præference i en specifik anvendelse eller kontekst. @da
definition: Relaterer et nomen til et uttrykk som har en tittel for uttrykk som ikke er valgt som preferanse i en bestemt applikasjon eller kontekst. @no
definition: Relates a nomen to an expression that has a title of expression that is not selected for preference in a specific application or context.
definition: Sasaista nomenu ar izteiksmi, kam ir izteiksmes nosaukums, kas nav izvēlēts kā prioritārs noteiktā lietojumprogrammā vai kontekstā. @lv
definition: Seostab nomen'i väljendusega, millel on pealkiri, mis kindlas rakenduses või kontekstis ei ole valitud eelistatuks. @et
definition: Setzt ein Nomen in Beziehung zu einer Expression, die über einen Titel für eine Expression verfügt, der in einer bestimmten Anwendung oder in einem bestimmten Kontext nicht als Vorzugsform bestimmt wird. @de
definition: يربط تسمية بتعبيرة لها عنوان تعبيرة لم يُختر للتفضيل في تطبيق أو في سياق معين. @ar
definition: 将一个命名与有在一个特定的应用或语境中被未首选的一个内容表达题名的一种内容表达关联起来。 @zh-hans

is authorized access point for agent of
has element type: 2
toolkit definition: Agent que té un punt d’accés d’agent que se selecciona com a preferent en un esquema de codificació de vocabulari específic. @ca
toolkit definition: Agent qui possède un point d’accès d’un agent faisant l’objet d’un choix privilégié dans un schéma d’encodage de vocabulaire spécifique. @fr
toolkit definition: Agent, som har en søgeindgang for agent, som er valgt som præference i et specifikt vokabularkodningsskema. @da
toolkit definition: An agent who has an access point for agent that is selected for preference in a specific vocabulary encoding scheme.
toolkit definition: Aģents, kam ir aģenta pamatforma, kas izvēlēta no konkrētas vārdnīcas. @lv
toolkit definition: Belirli bir kelime kodlama şemasında tercih edilmek için seçilen temsilci için erişim noktası olan bir temsilci. @tr
toolkit definition: Een actor die een ingang voor actor heeft die als voorkeursterm geselecteerd is in een specifiek vocabulair coderingssysteem. @nl
toolkit definition: Egy ágens, amelynek van egy előnyben részesített hozzáférési pontja az ágenshez, amelyet egy adott szótárkódolási sémából választanak ki. @hu
toolkit definition: Ein Akteur, der über einen Sucheinstieg verfügt, der in einem bestimmten Vocabulary Encoding Scheme als Vorzugsform bestimmt wird. @de
toolkit definition: En agent som har en søkeinngang for agent som er valgt som preferanse i et bestemt kodeskjema for vokabular. @no
toolkit definition: Tegija, kellel on vastavas leksikaalses märkimissüsteemis eelistatuks valitud otsielement. @et
toolkit definition: Toimija, jolla on tietyssä sanaston merkintäjärjestelmässä ensisijaiseksi valittu hakutieto. @fi
toolkit definition: Un agente che ha un punto d'accesso per l'agente che è stato selezionato come preferito in uno specifico schema di codifica di vocabolario. @it
toolkit definition: وكيل له نقطة وصول لوكيل اختيرت للتفضيل في خطة ترميز مفردات محددة. @ar
toolkit definition: 有在一个特定的词表编码体系中被首选的行为者检索点的一个行为者 @zh-hans
toolkit label: Normierter Sucheinstieg für einen Akteur von @de
toolkit label: auktorisoitu hakutieto toimijalle @fi
toolkit label: authorized access point for agent of
toolkit label: autoriseret søgeindgang for agent af @da
toolkit label: autorisert søkeinngang for agent for @no
toolkit label: autorizált hozzáférési pont a következő ágenshez: @hu
toolkit label: geautoriseerde ingang voor actor van @nl
toolkit label: ir aģenta autoritatīvā pamatforma @lv
toolkit label: normitud otsielement tegijale @et
toolkit label: point d’accès autorisé d’un agent de @fr
toolkit label: punt d’accés autoritzat d’agent de @ca
toolkit label: punto d'accesso autorizzato per agente di @it
toolkit label: temsilci için yetkili erişim noktası @tr
toolkit label: نقطة وصول مقننة لوكيل لـ @ar
toolkit label: ……的行为者的规范检索点 @zh-hans
has subproperty: is authorized access point for collective agent of
has subproperty: is authorized access point for person of
has subproperty: P80099
lexical alias: authorizedAccessPointForAgentOf.en
status: Published
type: Property
domain: C10012
label: auktorisoitu hakutieto toimijalle @fi
label: autorizált hozzáférési pont a következő ágenshez: @hu
label: er autoriseret søgeindgang for agent af @da
label: er autorisert søkeinngang for agent for @no
label: est un point d’accès autorisé d’un agent de @fr
label: ir aģenta autoritatīvā pamatforma @lv
label: is geautoriseerde ingang voor actor van @nl
label: ist normierter Sucheinstieg für einen Akteur von @de
label: normitud otsielement tegijale @et
label: temsilcisi için yetkili erişim noktasıdır @tr
label: è punto d'accesso autorizzato per agente di @it
label: és punt d’accés autoritzat d’agent de @ca
label: هي نقطة وصول مقننة لوكيل لـ @ar
label: 是……的行为者的规范检索点 @zh-hans
sub property of: is access point for agent of
sub property of: is authorized access point for RDA entity of
definition: Bir ismi, belirli bir kelime kodlama şemasında tercih edilmek üzere seçilen bir temsilciya erişim noktası olan bir temsilciyle ilişkilendirir. @tr
definition: Correla un nomen a un agente che ha un punto d'accesso per l'agente che è stato selezionato come preferito in uno specifico schema di codifica di vocabolario. @it
definition: Hozzákapcsol egy noment egy ágenshez, amelynek van egy előnyben részesített hozzáférési pontja az ágenshez, amelyet egy adott szótárkódolási sémából választanak ki. @hu
definition: Liittää nomenin toimijaan, jolla on tietyssä sanaston merkintäjärjestelmässä ensisijaiseksi valittu hakutieto. @fi
definition: Met un nomen en relation avec un agent qui possède un point d’accès d’un agent faisant l’objet d’un choix privilégié dans un schéma d’encodage de vocabulaire spécifique. @fr
definition: Relaciona un nomen amb un agent que té un punt d’accés d’agent que se selecciona com a preferent en un esquema de codificació de vocabulari específic. @ca
definition: Relateert een nomen aan een actor die een ingang voor actor heeft die als voorkeursterm geselecteerd is in een specifiek vocabulair coderingssysteem. @nl
definition: Relaterer et nomen til en agent som har en søkeinngang for agent som er valgt som preferanse i et bestemt kodeskjema for vokabular. @no
definition: Relaterer et nomen til en agent, som har en søgeindgang for agent, som er valgt som præference i et specifikt vokabularkodningsskema. @da
definition: Relates a nomen to an agent who has an access point for agent that is selected for preference in a specific vocabulary encoding scheme.
definition: Sasaista nomenu ar aģentu, kam ir aģenta pamatforma, kas izvēlēta no konkrētas vārdnīcas. @lv
definition: Seostab nomen'i tegijaga, kellel on vastavas leksikaalses märkimissüsteemis eelistatuks valitud otsielement. @et
definition: Setzt ein Nomen in Beziehung zu einem Akteur, der über einen Sucheinstieg verfügt, der in einem bestimmten Vocabulary Encoding Scheme als Vorzugsform bestimmt wird. @de
definition: يربط تسمية بوكيل له نقطة وصول لوكيل اختيرت للتفضيل في خطة ترميز مفردات محددة. @ar
definition: 将一个命名与有在一个特定的词表编码体系中被首选的行为者检索点的一个行为者关联起来。 @zh-hans

is variant access point for agent of
has element type: 2
toolkit definition: Agent que té un punt d’accés d’agent que no se selecciona com a preferent en un esquema de codificació de vocabulari específic. @ca
toolkit definition: Agent qui possède un point d’accès d’un agent ne faisant pas l’objet d’un choix privilégié dans un schéma d’encodage de vocabulaire spécifique. @fr
toolkit definition: Agent, som har en søgeindgang for agent, som ikke er valgt som præference i et specifikt vokabularkodningsskema. @da
toolkit definition: An agent who has an access point for agent that is not selected for preference in a specific vocabulary encoding scheme.
toolkit definition: Aģents, kam ir piekļuves punkts aģentam, kas nav izvēlēts kā prioritārs noteiktai kontrolētas vārdnīcas shēmai. @lv
toolkit definition: Belirli bir kelime kodlama şemasında tercih edilmek için seçilmeyen bir temsilci için erişim noktası olan bir temsilci. @tr
toolkit definition: Een actor die een ingang voor actor heeft die niet als voorkeursterm geselecteerd is in een specifiek vocabulair coderingssysteem. @nl
toolkit definition: Egy ágens, amelynek van egy olyan hozzáférési pontja ágens számára, amelyet egy adott szótárkódolási sémában nem részesítenek előnyben. @hu
toolkit definition: Ein Akteur, der über einen Sucheinstieg für einen Akteur verfügt, der in einem bestimmten Vocabulary Encoding Scheme nicht als Vorzugsform bestimmt wird. @de
toolkit definition: En agent som har en søkeinngang for agent som ikke er valgt som preferanse i et bestemt kodeskjema for vokabular. @no
toolkit definition: Tegija, kellel on otsielement, mis ei ole valitud eelistatuks vastavas leksikaalses märkimissüsteemis. @et
toolkit definition: Toimija, jonka hakutietoa ei ole valittu ensisijaiseksi tietyssä sanaston merkintäjärjestelmässä. @fi
toolkit definition: Un agente che ha un punto d'accesso per l'agente che non è stato selezionato come preferito in uno specifico schema di codifica di vocabolario. @it
toolkit definition: وكيل له نقطة وصول لوكيل لم تُختر للتفضيل في خطة ترميز مفردات محددة. @ar
toolkit definition: 有在一个特定的词表编码体系中未被首选的行为者检索点的一个行为者 @zh-hans
toolkit label: Zusätzlicher Sucheinstieg für einen Akteur von @de
toolkit label: alternativ søkeinngang for agent for @no
toolkit label: hozzáférésipont-variánsa a következő ágensnek: @hu
toolkit label: ir papildforma aģentam @lv
toolkit label: otsielemendi variant tegijale @et
toolkit label: punto d'accesso variante per agente di @it
toolkit label: temsilci için alternatif erişim noktası @tr
toolkit label: variant access point for agent of
toolkit label: variant af søgeindgang for agent af @da
toolkit label: variant de punt d’accés d’agent de @ca
toolkit label: variant ingang voor actor van @nl
toolkit label: variante de point d’accès d’un agent de @fr
toolkit label: varianttihakutieto toimijalle @fi
toolkit label: نقطة وصول مختلفة لوكيل لـ @ar
toolkit label: ……的行为者的变异检索点 @zh-hans
has subproperty: is variant access point for collective agent of
has subproperty: is variant access point for person of
has subproperty: P80100
lexical alias: variantAccessPointForAgentOf.en
status: Published
type: Property
domain: C10012
label: er alternativ søkeinngang for agent for @no
label: er variant af søgeindgang for agent af @da
label: est une variante de point d’accès d’un agent de @fr
label: hozzáférésipont-variánsa a következő ágensnek: @hu
label: ir papildforma aģentam @lv
label: is variant ingang voor actor van @nl
label: ist zusätzlicher Sucheinstieg für einen Akteur von @de
label: otsielemendi variant tegijale @et
label: temsilcisi için farklı erişim noktası @tr
label: varianttihakutieto toimijalle @fi
label: è punto d'accesso variante per agente di @it
label: és variant de punt d’accés d’agent de @ca
label: هي نقطة وصول مختلفة لوكيل لـ @ar
label: 是……的行为者的变异检索点 @zh-hans
sub property of: is access point for agent of
sub property of: is variant access point for RDA entity of
definition: Bir ismi, belirli bir kelime kodlama şemasında tercih için seçilmeyen bir temsilci için erişim noktası olan bir temsilciyle ilişkilendirir. @tr
definition: Correla un nomen a un agente che ha un punto d'accesso per l'agente che non è stato selezionato come preferito in uno specifico schema di codifica di vocabolario. @it
definition: Hozzákapcsol egy noment egy ágenshez, amelynek van egy olyan hozzáférési pontja ágens számára, amelyet egy adott szótárkódolási sémában nem részesítenek előnyben. @hu
definition: Liittää nomenin toimijaan, jonka hakutietoa ei ole valittu ensisijaiseksi tietyssä sanaston merkintäjärjestelmässä. @fi
definition: Met un nomen en relation avec un agent qui possède un point d’accès d’un agent ne faisant pas l’objet d’un choix privilégié dans un schéma d’encodage de vocabulaire spécifique. @fr
definition: Relaciona un nomen amb un agent que té un punt d’accés d’agent que no se selecciona com a preferent en un esquema de codificació de vocabulari específic. @ca
definition: Relateert een nomen aan een actor die een ingang voor actor heeft die niet als voorkeursterm geselecteerd is in een specifiek vocabulair coderingssysteem. @nl
definition: Relaterer et nomen til en agent som har en søkeinngang for agent som ikke er valgt som preferanse i et bestemt kodeskjema for vokabular. @no
definition: Relaterer et nomen til en agent, som har en søgeindgang for agent, som ikke er valgt som præference i et specifikt vokabularkodningsskema. @da
definition: Relates a nomen to an agent who has an access point for agent that is not selected for preference in a specific vocabulary encoding scheme.
definition: Sasaista nomenu ar aģentu, kam ir piekļuves punkts aģentam, kas nav izvēlēts kā prioritārs noteiktai kontrolētas vārdnīcas shēmai. @lv
definition: Seostab nomen'i tegijaga, kellel on otsielement, mis ei ole valitud eelistatuks vastavas leksikaalses märkimissüsteemis. @et
definition: Setzt ein Nomen in Beziehung zu einem Akteur, der über einen Sucheinstieg für einen Akteur verfügt, der in einem bestimmten Vocabulary Encoding Scheme nicht als Vorzugsform bestimmt wird. @de
definition: يربط تسمية بوكيل له نقطة وصول لوكيل لم تُختر للتفضيل في خطة ترميز مفردات محددة. @ar
definition: 将一个命名与有在一个特定的词表编码体系中未被首选的行为者检索点的一个行为者关联起来。 @zh-hans

is authorized access point for collective agent of
has element type: 2
toolkit definition: A collective agent who has an access point for collective agent that is selected for preference in a specific vocabulary encoding scheme.
toolkit definition: Agent collectif qui possède un point d’accès d’un agent collectif faisant l’objet d’un choix privilégié dans un schéma d’encodage de vocabulaire spécifique. @fr
toolkit definition: Agent col·lectiu que té un punt d’accés d’agent col·lectiu que se selecciona com a preferent en un esquema de codificació de vocabulari específic. @ca
toolkit definition: Belirli bir kelime kodlama şemasında tercih için seçilen kolektif temsilci için bir erişim noktasına sahip olan kolektif temsilci. @tr
toolkit definition: Een collectieve actor die een ingang voor collectieve actor heeft die als voorkeursterm geselecteerd is in een specifiek vocabulair coderingssysteem. @nl
toolkit definition: Egy kollektív ágens, amelynek van egy előnyben részesített hozzáférési pontja a kollektív ágenshez, amelyet egy adott szótárkódolási sémából választanak ki. @hu
toolkit definition: Ein gemeinschaftlicher Akteur, der über einen Sucheinstieg verfügt, der in einem bestimmten Vocabulary Encoding Scheme als Vorzugsform bestimmt wird. @de
toolkit definition: En kollektiv agent som har en søkeinngang for kollektiv agent som er valgt som preferanse i et bestemt kodeskjema for vokabular. @no
toolkit definition: Grupa, kam ir grupas pamatforma, kas izvēlēta no konkrētas vārdnīcas. @lv
toolkit definition: Kollektiiv, kellel on vastavas leksikaalses märkimissüsteemis eelistatuks valitud otsielement. @et
toolkit definition: Kollektiv agent, som har en søgeindgang for kollektiv agent, som er valgt som præference i et specifikt vokabularkodningsskema. @da
toolkit definition: Un agente collettivo che ha un punto d'accesso per l'agente collettivo che è stato selezionato come preferito in uno specifico schema di codifica di vocabolario. @it
toolkit definition: Yhteistoimija, jolla on tietyssä sanaston merkintäjärjestelmässä ensisijaiseksi valittu hakutieto. @fi
toolkit definition: وكيل جماعي له نقطة وصول لوكيل جماعي اختيرت للتفضيل في خطة ترميز مفردات محددة. @ar
toolkit definition: 有在一个特定的词表编码体系中被首选的集体行为者检索点的一个集体行为者 @zh-hans
toolkit label: Normierter Sucheinstieg für einen gemeinschaftlichen Akteur von @de
toolkit label: auktorisoitu hakutieto yhteistoimijalle @fi
toolkit label: authorized access point for collective agent of
toolkit label: autoriseret søgeindgang for kollektiv agent af @da
toolkit label: autorisert søkeinngang for kollektiv agent for @no
toolkit label: autorizált hozzáférési pont a következő kollektív ágenshez: @hu
toolkit label: geautoriseerde ingang voor collectieve actor van @nl
toolkit label: ir grupas autoritatīvā pamatforma @lv
toolkit label: kolektif temsilci için yetkili erişim noktası @tr
toolkit label: normitud otsielement kollektiivile @et
toolkit label: point d’accès autorisé d’un agent collectif de @fr
toolkit label: punt d’accés autoritzat d’agent col·lectiu de @ca
toolkit label: punto d'accesso autorizzato per agente collettivo di @it
toolkit label: نقطة وصول مقننة لوكيل جماعي لـ @ar
toolkit label: ……的集体行为者的规范检索点 @zh-hans
has subproperty: is authorized access point for corporate body of
has subproperty: is authorized access point for family of
has subproperty: P80101
lexical alias: authorizedAccessPointForCollectiveAgentOf.en
status: Published
type: Property
domain: C10012
label: auktorisoitu hakutieto yhteistoimijalle @fi
label: autorizált hozzáférési pont a következő kollektív ágenshez: @hu
label: er autoriseret søgeindgang for kollektiv agent af @da
label: er autorisert søkeinngang for kollektiv agent for @no
label: est un point d’accès autorisé d’un agent collectif de @fr
label: ir grupas autoritatīvā pamatforma @lv
label: is geautoriseerde ingang voor collectieve actor van @nl
label: ist normierter Sucheinstieg für einen gemeinschaftlichen Akteur von @de
label: kolektif temsilcisi için yetkili erişim noktasıdır @tr
label: normitud otsielement kollektiivile @et
label: è punto d'accesso autorizzato per agente collettivo di @it
label: és punt d’accés autoritzat d’agent col·lectiu de @ca
label: هي نقطة وصول مقننة لوكيل جماعي لـ @ar
label: 是……的集体行为者的规范检索点 @zh-hans
sub property of: is access point for collective agent of
sub property of: is authorized access point for agent of
definition: Bir ismi, belirli bir kelime kodlama şemasında tercih edilmek üzere seçilen kolektif temsilci için bir erişim noktasına sahip olan kolektif temsilciyle ilişkilendirir. @tr
definition: Correla un nomen a un agente collettivo che ha un punto d'accesso per l'agente collettivo che è stato selezionato come preferito in uno specifico schema di codifica di vocabolario. @it
definition: Hozzákapcsol egy noment egy kollektív ágenshez, amelynek van egy előnyben részesített hozzáférési pontja a kollektív ágenshez, amelyet egy adott szótárkódolási sémából választanak ki. @hu
definition: Liittää nomenin yhteistoimijaan, jolla on tietyssä sanaston merkintäjärjestelmässä ensisijaiseksi valittu hakutieto. @fi
definition: Met un nomen en relation avec un agent collectif qui possède un point d’accès d’un agent collectif faisant l’objet d’un choix privilégié dans un schéma d’encodage de vocabulaire spécifique. @fr
definition: Relaciona un nomen amb un agent col·lectiu que té un punt d’accés d’agent col·lectiu que se selecciona com a preferent en un esquema de codificació de vocabulari específic. @ca
definition: Relateert een nomen aan een collectieve actor die een ingang voor collectieve actor heeft die als voorkeursterm geselecteerd is in een specifiek vocabulair coderingssysteem. @nl
definition: Relaterer et nomen til en kollektiv agent som har en søkeinngang for kollektiv agent som er valgt som preferanse i et bestemt kodeskjema for vokabular. @no
definition: Relaterer et nomen til en kollektiv agent, som har en søgeindgang for kollektiv agent, som er valgt som præference i et specifikt vokabularkodningsskema. @da
definition: Relates a nomen to a collective agent who has an access point for collective agent that is selected for preference in a specific vocabulary encoding scheme.
definition: Sasaista nomenu ar grupu, kam ir grupas pamatforma, kas izvēlēta no konkrētas vārdnīcas. @lv
definition: Seostab nomen'i kollektiiviga, kellel on vastavas leksikaalses märkimissüsteemis eelistatuks valitud otsielement. @et
definition: Setzt ein Nomen in Beziehung zu einem gemeinschaftlichen Akteur, der über einen Sucheinstieg verfügt, der in einem bestimmten Vocabulary Encoding Scheme als Vorzugsform bestimmt wird. @de
definition: يربط تسمية بوكيل جماعي له نقطة وصول اختيرت للتفضيل في خطة ترميز مفردات محددة. @ar
definition: 将一个命名与有在一个特定的词表编码体系中被首选的集体行为者检索点的一个集体行为者关联起来。 @zh-hans

is variant access point for collective agent of
has element type: 2
toolkit definition: A collective agent who has an access point for collective agent that is not selected for preference in a specific vocabulary encoding scheme.
toolkit definition: Agent collectif qui possède un point d’accès d’un agent collectif ne faisant pas l’objet d’un choix privilégié dans un schéma d’encodage de vocabulaire spécifique. @fr
toolkit definition: Agent col·lectiu que té un punt d’accés d’agent col·lectiu que no se selecciona com a preferent en un esquema de codificació de vocabulari específic. @ca
toolkit definition: Belirli bir kelime kodlama şemasında tercih için seçilmeyen bir kolektif temsilci için erişim noktası olan bir kolektif temsilci. @tr
toolkit definition: Een collectieve actor die een ingang voor collectieve actor heeft die niet als voorkeursterm geselecteerd is in een specifiek vocabulair coderingssysteem. @nl
toolkit definition: Egy kollektív ágens, amelynek van egy olyan hozzáférési pontja a kollektív ágens számára, amelyet egy adott szótárkódolási sémában nem részesítenek előnyben. @hu
toolkit definition: Ein gemeinschaftlicher Akteur, der über einen Sucheinstieg für einen gemeinschaftlicher Akteur verfügt, der in einem bestimmten Vocabulary Encoding Scheme nicht als Vorzugsform bestimmt wird. @de
toolkit definition: En kollektiv agent som har en søkeinngang for kollektiv agent som ikke er valgt som preferanse i et bestemt kodeskjema for vokabular. @no
toolkit definition: Grupa, kam ir piekļuves punkts grupai, kas nav izvēlēta kā prioritāra noteiktai kontrolētas vārdnīcas shēmai. @lv
toolkit definition: Kollektiiv, kellel on otsielement, mis ei ole valitud eelistatuks vastavas leksikaalses märkimissüsteemis. @et
toolkit definition: Kollektiv agent, som har en søgeindgang for kollektiv agent, som ikke er valgt som præference i et specifikt vokabularkodningsskema. @da
toolkit definition: Un agente collettivo che ha un punto d'accesso per l'agente collettivo che non è stato selezionato come preferito in uno specifico schema di codifica di vocabolario. @it
toolkit definition: Yhteistoimija, jonka hakutietoa ei ole valittu ensisijaiseksi tietyssä sanaston merkintäjärjestelmässä. @fi
toolkit definition: وكيل جماعي له نقطة وصول لوكيل جماعي، لم تُختر للتفضيل في خطة ترميز مفردات محددة. @ar
toolkit definition: 有在一个特定的词表编码体系中未被首选的集体行为者检索点的一个集体行为者 @zh-hans
toolkit label: Zusätzlicher Sucheinstieg für einen gemeinschaftlichen Akteur von @de
toolkit label: alternativ søkeinngang for kollektiv agent for @no
toolkit label: hozzáférésipont-változata a következő kollektív ágensnek: @hu
toolkit label: ir papildforma grupai @lv
toolkit label: kollektif temsilci için alternatif erişim noktası @tr
toolkit label: otsielemendi variant kollektiivile @et
toolkit label: punto d'accesso variante per agente collettivo di @it
toolkit label: variant access point for collective agent of
toolkit label: variant af søgeindgang for kollektiv agent af @da
toolkit label: variant de punt d’accés d’agent col·lectiu de @ca
toolkit label: variant ingang voor collectieve actor van @nl
toolkit label: variante de point d’accès d’un agent collectif de @fr
toolkit label: varianttihakutieto yhteistoimijalle @fi
toolkit label: نقطة وصول مختلفة لوكيل جماعي لـ @ar
toolkit label: ……的集体行为者的变异检索点 @zh-hans
has subproperty: is variant access point for corporate body of
has subproperty: is variant access point for family of
has subproperty: P80102
lexical alias: variantAccessPointForCollectiveAgentOf.en
status: Published
type: Property
domain: C10012
label: er alternativ søkeinngang for kollektiv agent for @no
label: er variant af søgeindgang for kollektiv agent af @da
label: est une variante de point d’accès d’un agent collectif de @fr
label: hozzáférésipont-változata a következő kollektív ágensnek: @hu
label: ir papildforma grupai @lv
label: is variant ingang voor collectieve actor van @nl
label: ist zusätzlicher Sucheinstieg für einen gemeinschaftlichen Akteur von @de
label: kollektif temsilcisi için farklı erişim noktası @tr
label: otsielemendi variant kollektiivile @et
label: varianttihakutieto yhteistoimijalle @fi
label: è punto d'accesso variante per agente collettivo di @it
label: és variant de punt d’accés d’agent col·lectiu de @ca
label: هي نقطة وصول مختلفة لوكيل جماعي لـ @ar
label: 是……的集体行为者的变异检索点 @zh-hans
sub property of: is access point for collective agent of
sub property of: is variant access point for agent of
definition: Bir ismi, belirli bir kelime kodlama şemasında tercih için seçilmeyen bir kolektif temsilci için erişim noktası olan bir kolektif temsilciyle ilişkilendirir. @tr
definition: Correla un nomen a un agente collettivo che ha un punto d'accesso per l'agente collettivo che non è stato selezionato come preferito in uno specifico schema di codifica di vocabolario. @it
definition: Hozzákapcsol egy noment egy kollektív ágenshez, amelynek van egy olyan hozzáférési pontja a kollektív ágens számára, amelyet egy adott szótárkódolási sémában nem részesítenek előnyben. @hu
definition: Liittää nomenin yhteistoimijaan, jonka hakutietoa ei ole valittu ensisijaiseksi tietyssä sanaston merkintäjärjestelmässä. @fi
definition: Met un nomen en relation avec un agent collectif qui possède un point d’accès d’un agent collectif ne faisant pas l’objet d’un choix privilégié dans un schéma d’encodage de vocabulaire spécifique. @fr
definition: Relaciona un nomen amb un agent col·lectiu que té un punt d’accés d’agent col·lectiu que no se selecciona com a preferent en un esquema de codificació de vocabulari específic. @ca
definition: Relateert een nomen aan een collectieve actor die een ingang voor collectieve actor heeft die niet als voorkeursterm geselecteerd is in een specifiek vocabulair coderingssysteem. @nl
definition: Relaterer et nomen til en kollektiv agent som har en søkeinngang for kollektiv agent som ikke er valgt som preferanse i et bestemt kodeskjema for vokabular. @no
definition: Relaterer et nomen til en kollektiv agent, som har en søgeindgang for kollektiv agent, som ikke er valgt som præference i et specifikt vokabularkodningsskema. @da
definition: Relates a nomen to a collective agent who has an access point for collective agent that is not selected for preference in a specific vocabulary encoding scheme.
definition: Sasaista nomenu ar grupu, kam ir piekļuves punkts grupai, kas nav izvēlēta kā prioritāra noteiktai kontrolētas vārdnīcas shēmai. @lv
definition: Seostab nomen'i kollektiiviga, kellel on otsielement, mis ei ole valitud eelistatuks vastavas leksikaalses märkimissüsteemis. @et
definition: Setzt ein Nomen in Beziehung zu einem gemeinschaftlichen Akteur, der über einen Sucheinstieg für einen gemeinschaftlicher Akteur verfügt, der in einem bestimmten Vocabulary Encoding Scheme nicht als Vorzugsform bestimmt wird. @de
definition: يربط تسمية بوكيل جماعي له نقطة وصول لوكيل جماعي لم تُختر للتفضيل في خطة ترميز مفردات محددة. @ar
definition: 将一个命名与有在一个特定的词表编码体系中未被首选的集体行为者检索点的一个集体行为者关联起来。 @zh-hans

is authorized access point for corporate body of
has element type: 2
toolkit definition: A corporate body who has an access point for corporate body that is selected for preference in a specific vocabulary encoding scheme.
toolkit definition: Asutus, kellel on vastavas leksikaalses märkimissüsteemis eelistatuks valitud otsielement. @et
toolkit definition: Belirli bir kelime kodlama şemasında tercih edilmek üzere seçilen tüzel kişi için bir erişim noktasına sahip olan bir tüzel kişi. @tr
toolkit definition: Collectivité qui possède un point d’accès d’une collectivité faisant l’objet d’un choix privilégié dans un schéma d’encodage de vocabulaire spécifique. @fr
toolkit definition: Een corporatie die een ingang voor corporatie heeft die als voorkeursterm geselecteerd is in een specifiek vocabulair coderingssysteem. @nl
toolkit definition: Egy testület, amelynek van egy előnyben részesített hozzáférési pontja a testülethez, amelyet egy adott szótárkódolási sémából választanak ki. @hu
toolkit definition: Eine Körperschaft, die über einen Sucheinstieg verfügt, der in einem bestimmten Vocabulary Encoding Scheme als Vorzugsform bestimmt wird. @de
toolkit definition: En korporasjon som har en søkeinngang for korporasjon som er valgt som preferanse i et bestemt kodeskjema for vokabular. @no
toolkit definition: Entitat corporativa que té un punt d’accés d’entitat corporativa que se selecciona com a preferent en un esquema de codificació de vocabulari específic. @ca
toolkit definition: Institūcija, kam ir institūcijas pamatforma, kas izvēlēta no konkrētas vārdnīcas. @lv
toolkit definition: Korporation, som har en søgeindgang for korporation, som er valgt som præference i et specifikt vokabularkodningsskema. @da
toolkit definition: Un ente che ha un punto d'accesso per l'ente che è stato selezionato come preferito in uno specifico schema di codifica di vocabolario. @it
toolkit definition: Yhteisö, jolla on tietyssä sanaston merkintäjärjestelmässä ensisijaiseksi valittu hakutieto. @fi
toolkit definition: هيئة لها نقطة وصول لهيئة اختيرت للتفضيل في خطة ترميز مفردات محددة. @ar
toolkit definition: 有在一个特定的词表编码体系中被首选的团体检索点的一个团体 @zh-hans
toolkit label: Normierter Sucheinstieg für eine Körperschaft von @de
toolkit label: auktorisoitu hakutieto yhteisölle @fi
toolkit label: authorized access point for corporate body of
toolkit label: autoriseret søgeindgang for korporation af @da
toolkit label: autorisert søkeinngang for korporasjon for @no
toolkit label: autorizált hozzáférési pont a következő testülethez: @hu
toolkit label: geautoriseerde ingang voor corporatie van @nl
toolkit label: ir institūcijas autoritatīvā pamatforma @lv
toolkit label: normitud otsielement asutusele @et
toolkit label: point d’accès autorisé d’une collectivité de @fr
toolkit label: punt d’accés autoritzat d’entitat corporativa de @ca
toolkit label: punto d'accesso autorizzato per ente di @it
toolkit label: tüzel kişi için yetkili erişim noktası @tr
toolkit label: نقطة وصول مقننة لهيئة لـ @ar
toolkit label: ……的团体的规范检索点 @zh-hans
has subproperty: P80103
lexical alias: authorizedAccessPointForCorporateBodyOf.en
status: Published
type: Property
domain: C10012
label: auktorisoitu hakutieto yhteisölle @fi
label: autorizált hozzáférési pont a következő testülethez: @hu
label: er autoriseret søgeindgang for korporation af @da
label: er autorisert søkeinngang for korporasjon for @no
label: est un point d’accès autorisé d’une collectivité de @fr
label: ir institūcijas autoritatīvā pamatforma @lv
label: is geautoriseerde ingang voor corporatie van @nl
label: ist normierter Sucheinstieg für eine Körperschaft von @de
label: normitud otsielement asutusele @et
label: tüzel kişisi için yetkili erişim noktasıdır @tr
label: è punto d'accesso autorizzato per ente di @it
label: és punt d’accés autoritzat d’entitat corporativa de @ca
label: هي نقطة وصول مقننة لهيئة لـ @ar
label: 是……的团体的规范检索点 @zh-hans
sub property of: is access point for corporate body of
sub property of: is authorized access point for collective agent of
definition: Bir ismi, belirli bir kelime kodlama şemasında tercih edilmek üzere seçilen tüzel kişi için erişim noktası olan bir tüzel kişiyle ilişkilendirir. @tr
definition: Correla un nomen a un ente che ha un punto d'accesso per l'ente che è stato selezionato come preferito in uno specifico schema di codifica di vocabolario. @it
definition: Hozzákapcsol egy noment egy testülethez, amelynek van egy előnyben részesített hozzáférési pontja a testülethez, amelyet egy adott szótárkódolási sémából választanak ki. @hu
definition: Liittää nomenin yhteisöön, jolla on tietyssä sanaston merkintäjärjestelmässä ensisijaiseksi valittu hakutieto. @fi
definition: Met un nomen en relation avec une collectivité qui possède un point d’accès d’une collectivité faisant l’objet d’un choix privilégié dans un schéma d’encodage de vocabulaire spécifique. @fr
definition: Relaciona un nomen amb una entitat corporativa que té un punt d’accés d’entitat corporativa que se selecciona com a preferent en un esquema de codificació de vocabulari específic. @ca
definition: Relateert een nomen aan een corporatie die een ingang voor corporatie heeft die als voorkeursterm geselecteerd is in een specifiek vocabulair coderingssysteem. @nl
definition: Relaterer et nomen til en korporasjon som har en søkeinngang for korporasjon som er valgt som preferanse i et bestemt kodeskjema for vokabular. @no
definition: Relaterer et nomen til en korporation, som har en søgeindgang for korporation, som er valgt som præference i et specifikt vokabularkodningsskema. @da
definition: Relates a nomen to a corporate body who has an access point for corporate body that is selected for preference in a specific vocabulary encoding scheme.
definition: Sasaista nomenu ar institūciju, kam ir institūcijas pamatforma, kas izvēlēta no konkrētas vārdnīcas. @lv
definition: Seostab nomen'i asutusega, kellel on vastavas leksikaalses märkimissüsteemis eelistatuks valitud otsielement. @et
definition: Setzt ein Nomen in Beziehung zu einer Körperschaft, die über einen Sucheinstieg verfügt, der in einem bestimmten Vocabulary Encoding Scheme als Vorzugsform bestimmt wird. @de
definition: يربط تسمية بهيئة لها نقطة وصول لهيئة، اختيرت للتفضيل في خطة ترميز مفردات محددة. @ar
definition: 将一个命名与有在一个特定的词表编码体系中被首选的团体检索点的一个团体关联起来。 @zh-hans

is variant access point for corporate body of
has element type: 2
toolkit definition: A corporate body who has an access point for corporate body that is not selected for preference in a specific vocabulary encoding scheme.
toolkit definition: Asutus, kellel on otsielement, mis ei ole valitud eelistatuks vastavas leksikaalses märkimissüsteemis. @et
toolkit definition: Belirli bir kelime kodlama şemasında tercih edilmek üzere seçilmeyen bir tüzel kişi için erişim noktası olan bir tüzel kişi. @tr
toolkit definition: Collectivité qui possède un point d’accès d’une collectivité ne faisant pas l’objet d’un choix privilégié dans un schéma d’encodage de vocabulaire spécifique. @fr
toolkit definition: Een corporatie die een ingang voor corporatie heeft die niet als voorkeursterm geselecteerd is in een specifiek vocabulair coderingssysteem. @nl
toolkit definition: Egy testület, amelynek van egy olyan hozzáférési pontja a testület számára, amelyet egy adott szótárkódolási sémában nem részesítenek előnyben. @hu
toolkit definition: Eine Körperschaft, die über einen Sucheinstieg für eine Körperschaft verfügt, der in einem bestimmten Vocabulary Encoding Scheme nicht als Vorzugsform bestimmt wird. @de
toolkit definition: En korporasjon som har en søkeinngang for korporasjon som ikke er valgt som preferanse i et bestemt kodeskjema for vokabular. @no
toolkit definition: Entitat corporativa que té un punt d’accés d’entitat corporativa que no se selecciona com a preferent en un esquema de codificació de vocabulari específic. @ca
toolkit definition: Institūcija, kam ir piekļuves punkts institūcijai, kas nav izvēlēta kā prioritāra noteiktai kontrolētas vārdnīcas shēmai. @lv
toolkit definition: Korporation, som har en søgeindgang for korporation, som ikke er valgt som præference i et specifikt vokabularkodningsskema. @da
toolkit definition: Un ente che ha un punto d'accesso per l'ente che non è stato selezionato come preferito in uno specifico schema di codifica di vocabolario. @it
toolkit definition: Yhteisö, jonka hakutietoa ei ole valittu ensisijaiseksi tietyssä sanaston merkintäjärjestelmässä. @fi
toolkit definition: هيئة لها نقطة وصول لهيئة لم تُختر للتفضيل في خطة ترميز مفردات محددة. @ar
toolkit definition: 有在一个特定的词表编码体系中未被首选的团体检索点的一个团体 @zh-hans
toolkit label: Zusätzlicher Sucheinstieg für eine Körperschaft von @de
toolkit label: alternativ søkeinngang for korporasjon for @no
toolkit label: hozzáférésipont-variánsa a következő testületnek: @hu
toolkit label: ir papildforma institūcijai @lv
toolkit label: otsielemendi variant asutusele @et
toolkit label: punto d'accesso variante per ente di @it
toolkit label: tüzel kişi için alternatif erişim noktası @tr
toolkit label: variant access point for corporate body of
toolkit label: variant af søgeindgang for korporation af @da
toolkit label: variant de punt d’accés d’entitat corporativa de @ca
toolkit label: variant ingang voor corporatie van @nl
toolkit label: variante de point d’accès d’une collectivité de @fr
toolkit label: varianttihakutieto yhteisölle @fi
toolkit label: نقطة وصول مختلفة لهيئة لـ @ar
toolkit label: ……的团体的变异检索点 @zh-hans
has subproperty: P80104
lexical alias: variantAccessPointForCorporateBodyOf.en
status: Published
type: Property
domain: C10012
label: er alternativ søkeinngang for korporasjon for @no
label: er variant af søgeindgang for korporation af @da
label: est une variante de point d’accès d’une collectivité de @fr
label: hozzáférésipont-variánsa a következő testületnek: @hu
label: ir papildforma institūcijai @lv
label: is variant ingang voor corporatie van @nl
label: ist zusätzlicher Sucheinstieg für eine Körperschaft von @de
label: otsielemendi variant asutusele @et
label: tüzel kişiliği için farklı erişim noktası @tr
label: varianttihakutieto yhteisölle @fi
label: è punto d'accesso variante per ente di @it
label: és variant de punt d’accés d’entitat corporativa de @ca
label: هي نقطة وصول مختلفة لهيئة لـ @ar
label: 是……的团体的变异检索点 @zh-hans
sub property of: is access point for corporate body of
sub property of: is variant access point for collective agent of
definition: Bir ismi, belirli bir kelime kodlama şemasında tercih için seçilmeyen bir tüzel kişi için erişim noktası olan bir tüzel kişiyle ilişkilendirir. @tr
definition: Correla un nomen a un ente che ha un punto d'accesso per l'ente che non è stato selezionato come preferito in uno specifico schema di codifica di vocabolario @it
definition: Hozzákapcsol egy noment egy testülethez, amelynek van egy olyan hozzáférési pontja a testület számára, amelyet egy adott szótárkódolási sémában nem részesítenek előnyben. @hu
definition: Liittää nomenin yhteisöön, jonka hakutietoa ei ole valittu ensisijaiseksi tietyssä sanaston merkintäjärjestelmässä. @fi
definition: Met un nomen en relation avec une collectivité qui possède un point d’accès d’une collectivité ne faisant pas l’objet d’un choix privilégié dans un schéma d’encodage de vocabulaire spécifique. @fr
definition: Relaciona un nomen amb una entitat corporativa que té un punt d’accés d’entitat corporativa que no se selecciona com a preferent en un esquema de codificació de vocabulari específic. @ca
definition: Relateert een nomen aan een corporatie die een ingang voor corporatie heeft die niet als voorkeursterm geselecteerd is in een specifiek vocabulair coderingssysteem. @nl
definition: Relaterer et nomen til en korporasjon som har en søkeinngang for korporasjon som ikke er valgt som preferanse i et bestemt kodeskjema for vokabular. @no
definition: Relaterer et nomen til en korporation, som har en søgeindgang for korporation, som ikke er valgt som præference i et specifikt vokabularkodningsskema. @da
definition: Relates a nomen to a corporate body who has an access point for corporate body that is not selected for preference in a specific vocabulary encoding scheme.
definition: Sasaista nomenu ar institūciju, kam ir piekļuves punkts institūcijai, kas nav izvēlēta kā prioritāra noteiktai kontrolētas vārdnīcas shēmai. @lv
definition: Seostab nomen'i asutusega, kellel on otsielement, mis ei ole valitud eelistatuks vastavas leksikaalses märkimissüsteemis. @et
definition: Setzt ein Nomen in Beziehung zu einer Körperschaft, die über einen Sucheinstieg für eine Körperschaft verfügt, der in einem bestimmten Vocabulary Encoding Scheme nicht als Vorzugsform bestimmt wird. @de
definition: يربط تسمية بهيئة لها نقطة وصول لهيئة، لم تُختر للتفضيل في خطة ترميز مفردات محددة. @ar
definition: 将一个命名与有在一个特定的词表编码体系中未被首选的团体检索点的一个团体关联起来。 @zh-hans

is authorized access point for family of
has element type: 2
toolkit definition: A family who has an access point for family that is selected for preference in a specific vocabulary encoding scheme.
toolkit definition: Belirli bir kelime kodlama şemasında tercih edilmek üzere seçilen aile için erişim noktası olan bir aile. @tr
toolkit definition: Dzimta/ģimene, kam ir dzimtas/ģimenes pamatforma, kas izvēlēta no konkrētas vārdnīcas. @lv
toolkit definition: Een familie die een ingang voor familie heeft die als voorkeursterm geselecteerd is in een specifiek vocabulair coderingssysteem. @nl
toolkit definition: Egy család, amelynek van egy előnyben részesített hozzáférési pontja a családhoz, amelyet egy adott szótárkódolási sémából választanak ki. @hu
toolkit definition: Eine Familie, die über einen Sucheinstieg für eine Familie verfügt, der in einem bestimmten Vocabulary Encoding Scheme als Vorzugsform bestimmt wird. @de
toolkit definition: En familie som har en søkeinngang for familie som er valgt som preferanse i et bestemt kodeskjema for vokabular. @no
toolkit definition: Familie, som har en søgeindgang for familie, som er valgt som præference i et specifikt vokabularkodningsskema. @da
toolkit definition: Famille qui possède un point d’accès d’une famille faisant l’objet d’un choix privilégié dans un schéma d’encodage de vocabulaire spécifique. @fr
toolkit definition: Família que té un punt d’accés de família que se selecciona com a preferent en un esquema de codificació de vocabulari específic. @ca
toolkit definition: Perekond, kellel on vastavas leksikaalses märkimissüsteemis eelistatuks valitud otsielement. @et
toolkit definition: Suku, jolla on tietyssä sanaston merkintäjärjestelmässä ensisijaiseksi valittu hakutieto. @fi
toolkit definition: Una famiglia che ha un punto d'accesso per la famiglia che è stato selezionato come preferito in uno specifico schema di codifica di vocabolario. @it
toolkit definition: عائلة لها نقطة وصول لعائلة اختيرت للتفضيل في خطة ترميز مفردات محددة. @ar
toolkit definition: 有在一个特定的词表编码体系中被首选的家族检索点的一个家族 @zh-hans
toolkit label: Normierter Sucheinstieg für eine Familie von @de
toolkit label: aile için yetkili erişim noktası @tr
toolkit label: auktorisoitu hakutieto suvulle @fi
toolkit label: authorized access point for family of
toolkit label: autoriseret søgeindgang for familie af @da
toolkit label: autorisert søkeinngang for familie for @no
toolkit label: autorizált hozzáférési pont a következő családhoz: @hu
toolkit label: geautoriseerde ingang voor familie van @nl
toolkit label: ir dzimtas/ģimenes autoritatīvā pamatforma @lv
toolkit label: normitud otsielement perekonnale @et
toolkit label: point d’accès autorisé d’une famille de @fr
toolkit label: punt d’accés autoritzat de família de @ca
toolkit label: punto d'accesso autorizzato per famiglia di @it
toolkit label: نقطة وصول مقننة لعائلة لـ @ar
toolkit label: ……的家族的规范检索点 @zh-hans
has subproperty: P80105
lexical alias: authorizedAccessPointForFamilyOf.en
status: Published
type: Property
domain: C10012
label: ailesi için yetkili erişim noktasıdır @tr
label: auktorisoitu hakutieto suvulle @fi
label: autorizált hozzáférési pont a következő családhoz: @hu
label: er autoriseret søgeindgang for familie af @da
label: er autorisert søkeinngang for familie for @no
label: est un point d’accès autorisé d’une famille de @fr
label: ir dzimtas/ģimenes autoritatīvā pamatforma @lv
label: is geautoriseerde ingang voor familie van @nl
label: ist normierter Sucheinstieg für eine Familie von @de
label: normitud otsielement perekonnale @et
label: è punto d'accesso autorizzato per famiglia di @it
label: és punt d’accés autoritzat de família de @ca
label: هي نقطة وصول مقننة لعائلة لـ @ar
label: 是……的家族的规范检索点 @zh-hans
sub property of: is access point for family of
sub property of: is authorized access point for collective agent of
definition: Bir ismi, belirli bir kelime kodlama şemasında tercih edilmek üzere seçilen aile için bir erişim noktası olan bir aileyle ilişkilendirir. @tr
definition: Correla un nomen a una famiglia che ha un punto d'accesso per la famiglia che è stato selezionato come preferito in uno specifico schema di codifica di vocabolario. @it
definition: Hozzákapcsol egy noment egy családhoz, amelynek van egy előnyben részesített hozzáférési pontja a családhoz, amelyet egy adott szótárkódolási sémából választanak ki. @hu
definition: Liittää nomenin sukuun, jolla on tietyssä sanaston merkintäjärjestelmässä ensisijaiseksi valittu hakutieto. @fi
definition: Met un nomen en relation avec une famille qui possède un point d’accès d’une famille faisant l’objet d’un choix privilégié dans un schéma d’encodage de vocabulaire spécifique. @fr
definition: Relaciona un nomen amb una família que té un punt d’accés de família que se selecciona com a preferent en un esquema de codificació de vocabulari específic. @ca
definition: Relateert een nomen aan een familie die een ingang voor familie heeft die als voorkeursterm geselecteerd is in een specifiek vocabulair coderingssysteem. @nl
definition: Relaterer et nomen til en familie som har en søkeinngang for familie som er valgt som preferanse i et bestemt kodeskjema for vokabular. @no
definition: Relaterer et nomen til en familie, som har en søgeindgang for familie, som er valgt som præference i et specifikt vokabularkodningsskema. @da
definition: Relates a nomen to a family who has an access point for family that is selected for preference in a specific vocabulary encoding scheme.
definition: Sasaista nomenu ar dzimtu/ģimeni, kam ir dzimtas/ģimenes pamatforma, kas izvēlēta no konkrētas vārdnīcas. @lv
definition: Seostab nomen'i perekonnaga, kellel on vastavas leksikaalses märkimissüsteemis eelistatuks valitud otsielement. @et
definition: Setzt ein Nomen in Beziehung zu einer Familie, die über einen Sucheinstieg für eine Familie verfügt, der in einem bestimmten Vocabulary Encoding Scheme als Vorzugsform bestimmt wird. @de
definition: يربط تسمية بعائلة لها نقطة وصول لعائلة اختيرت للتفضيل في خطة ترميز مفردات محددة. @ar
definition: 将一个命名与有在一个特定的词表编码体系中被首选的家族检索点的一个家族关联起来。 @zh-hans

is variant access point for family of
has element type: 2
toolkit definition: A family who has an access point for family that is not selected for preference in a specific vocabulary encoding scheme.
toolkit definition: Belirli bir kelime kodlama şemasında tercih için seçilmeyen bir aile için erişim noktası olan bir aile. @tr
toolkit definition: Dzimta/ģimene, kam ir piekļuves punkts dzimtai/ģimenei, kas nav izvēlēta kā prioritāra noteiktai kontrolētas vārdnīcas shēmai. @lv
toolkit definition: Een familie die een ingang voor familie heeft die niet als voorkeursterm geselecteerd is in een specifiek vocabulair coderingssysteem. @nl
toolkit definition: Egy család, amelynek van egy olyan hozzáférési pontja a család számára, amelyet egy adott szótárkódolási sémában nem részesítenek előnyben. @hu
toolkit definition: Eine Familie, die über einen Sucheinstieg für eine Familie verfügt, der in einem bestimmten Vocabulary Encoding Scheme nicht als Vorzugsform bestimmt wird. @de
toolkit definition: En familie som har en søkeinngang for familie som ikke er valgt som preferanse i et bestemt kodeskjema for vokabular. @no
toolkit definition: Familie, som har en søgeindgang for familie, som ikke er valgt som præference i et specifikt vokabularkodningsskema. @da
toolkit definition: Famille qui possède un point d’accès d’une famille ne faisant pas l’objet d’un choix privilégié dans un schéma d’encodage de vocabulaire spécifique. @fr
toolkit definition: Família que té un punt d’accés de família que no se selecciona com a preferent en un esquema de codificació de vocabulari específic. @ca
toolkit definition: Perekond, kellel on otsielement, mis ei ole valitud eelistatuks vastavas leksikaalses märkimissüsteemis. @et
toolkit definition: Suku, jonka hakutietoa ei ole valittu ensisijaiseksi tietyssä sanaston merkintäjärjestelmässä. @fi
toolkit definition: Una famiglia che ha un punto d'accesso per la famiglia che non è stato selezionato come preferito in uno specifico schema di codifica di vocabolario. @it
toolkit definition: عائلة لها نقطة وصول لعائلة لم تُختر للتفضيل في خطة ترميز مفردات محددة. @ar
toolkit definition: 有在一个特定的词表编码体系中未被首选的家族检索点的一个家族 @zh-hans
toolkit label: Zusätzlicher Sucheinstieg für eine Familie von @de
toolkit label: aile için alternatif erişim noktası @tr
toolkit label: alternativ søkeinngang for familie for @no
toolkit label: hozzáférésipont-variánsa a következő családnak: @hu
toolkit label: ir papildforma dzimtai/ģimenei @lv
toolkit label: otsielemendi variant perekonnale @et
toolkit label: punto d'accesso variante per famiglia di @it
toolkit label: variant access point for family of
toolkit label: variant af søgeindgang for familie af @da
toolkit label: variant de punt d’accés de família de @ca
toolkit label: variant ingang voor familie van @nl
toolkit label: variante de point d’accès d’une famille de @fr
toolkit label: varianttihakutieto suvulle @fi
toolkit label: نقطة وصول مختلفة لعائلة لـ @ar
toolkit label: ……的家族的变异检索点 @zh-hans
has subproperty: P80106
lexical alias: variantAccessPointForFamilyOf.en
status: Published
type: Property
domain: C10012
label: ailesi için farklı erişim noktası @tr
label: er alternativ søkeinngang for familie for @no
label: er variant af søgeindgang for familie af @da
label: est une variante de point d’accès d’une famille de @fr
label: hozzáférésipont-variánsa a következő családnak: @hu
label: ir papildforma dzimtai/ģimenei @lv
label: is variant ingang voor familie van @nl
label: ist zusätzlicher Sucheinstieg für eine Familie von @de
label: otsielemendi variant perekonnale @et
label: varianttihakutieto suvulle @fi
label: è punto d'accesso variante per famiglia di @it
label: és variant de punt d’accés de família de @ca
label: هي نقطة وصول مختلفة لعائلة لـ @ar
label: 是……的家族的变异检索点 @zh-hans
sub property of: is access point for family of
sub property of: is variant access point for collective agent of
definition: Bir ismi, belirli bir kelime kodlama şemasında tercih için seçilmeyen bir aile için erişim noktası olan bir niteleyici ismi bir aileyle ilişkilendirir. @tr
definition: Correla un nomen a una famiglia che ha un punto d'accesso per la famiglia che non è stato selezionato come preferito in uno specifico schema di codifica di vocabolario @it
definition: Hozzákapcsol egy noment egy családhoz, amelynek van egy olyan hozzáférési pontja a család számára, amelyet egy adott szótárkódolási sémában nem részesítenek előnyben. @hu
definition: Liittää nomenin sukuun, jonka hakutietoa ei ole valittu ensisijaiseksi tietyssä sanaston merkintäjärjestelmässä. @fi
definition: Met un nomen en relation avec une famille qui possède un point d’accès d’une famille ne faisant pas l’objet d’un choix privilégié dans un schéma d’encodage de vocabulaire spécifique. @fr
definition: Relaciona un nomen amb una família que té un punt d’accés de família que no se selecciona com a preferent en un esquema de codificació de vocabulari específic. @ca
definition: Relateert een nomen aan een familie die een ingang voor familie heeft die niet als voorkeursterm geselecteerd is in een specifiek vocabulair coderingssysteem. @nl
definition: Relaterer et nomen til en familie som har en søkeinngang for familie som ikke er valgt som preferanse i et bestemt kodeskjema for vokabular. @no
definition: Relaterer et nomen til en familie, som har en søgeindgang for familie, som ikke er valgt som præference i et specifikt vokabularkodningsskema. @da
definition: Relates a nomen to a family who has an access point for family that is not selected for preference in a specific vocabulary encoding scheme.
definition: Sasaista nomenu ar dzimtu/ģimeni, kam ir piekļuves punkts dzimtai/ģimenei, kas nav izvēlēta kā prioritāra noteiktai kontrolētas vārdnīcas shēmai. @lv
definition: Seostab nomen'i perekonnaga, kellel on otsielement, mis ei ole valitud eelistatuks vastavas leksikaalses märkimissüsteemis. @et
definition: Setzt ein Nomen in Beziehung zu einer Familie, die über einen Sucheinstieg für eine Familie verfügt, der in einem bestimmten Vocabulary Encoding Scheme nicht als Vorzugsform bestimmt wird. @de
definition: يربط تسمية بعائلة لها نقطة وصول لعائلة لم تُختر للتفضيل في خطة ترميز مفردات محددة. @ar
definition: 将一个命名与有在一个特定的词表编码体系中未被首选的家族检索点的一个家族关联起来。 @zh-hans

is authorized access point for person of
has element type: 2
toolkit definition: A person who has an access point for person that is selected for preference in a specific vocabulary encoding scheme.
toolkit definition: Belirli bir kelime kodlama şemasında tercih için seçilen kişi için erişim noktası olan bir kişi. @tr
toolkit definition: Een persoon die een ingang voor persoon heeft die als voorkeursterm geselecteerd is in een specifiek vocabulair coderingssysteem. @nl
toolkit definition: Egy személy, akinek van egy előnyben részesített hozzáférési pontja a személyhez, amelyet egy adott szótárkódolási sémából választanak ki. @hu
toolkit definition: Eine Person, die über einen Sucheinstieg für eine Person verfügt, der in einem bestimmten Vocabulary Encoding Scheme als Vorzugsform bestimmt wird. @de
toolkit definition: En person som har en søkeinngang for person som er valgt som preferanse i et bestemt kodeskjema for vokabular. @no
toolkit definition: Henkilö, jolla on tietyssä sanaston merkintäjärjestelmässä ensisijaiseksi valittu hakutieto. @fi
toolkit definition: Isik, kellel on vastavas leksikaalses märkimissüsteemis eelistatuks valitud otsielement. @et
toolkit definition: Person, som har en søgeindgang for person, som er valgt som præference i et specifikt vokabularkodningsskema. @da
toolkit definition: Persona que té un punt d’accés de persona que se selecciona com a preferent en un esquema de codificació de vocabulari específic. @ca
toolkit definition: Persona, kurai ir personas pamatforma, kas izvēlēta no konkrētas vārdnīcas. @lv
toolkit definition: Personne qui possède un point d’accès d’une personne faisant l’objet d’un choix privilégié dans un schéma d’encodage de vocabulaire spécifique. @fr
toolkit definition: Una persona che ha un punto d'accesso per la persona che è stato selezionato come preferito in uno specifico schema di codifica di vocabolario. @it
toolkit definition: شخص له نقطة وصول لشخص اختيرت للتفضيل في خطة ترميز مفردات محددة. @ar
toolkit definition: 有在一个特定的词表编码体系中被首选的个人检索点的一个个人 @zh-hans
toolkit label: Normierter Sucheinstieg für eine Person von @de
toolkit label: auktorisoitu hakutieto henkilölle @fi
toolkit label: authorized access point for person of
toolkit label: autoriseret søgeindgang for person af @da
toolkit label: autorisert søkeinngang for person for @no
toolkit label: autorizált hozzáférési pont a következő személyhez: @hu
toolkit label: geautoriseerde ingang voor persoon van @nl
toolkit label: ir personas autoritatīvā pamatforma @lv
toolkit label: kişi için yetkili erişim noktası @tr
toolkit label: normitud otsielement isikule @et
toolkit label: point d’accès autorisé d’une personne de @fr
toolkit label: punt d’accés autoritzat de persona de @ca
toolkit label: punto d'accesso autorizzato per persona di @it
toolkit label: نقطة وصول مقننة لشخص لـ @ar
toolkit label: ……的个人的规范检索点 @zh-hans
has subproperty: P80107
lexical alias: authorizedAccessPointForPersonOf.en
status: Published
type: Property
domain: C10012
label: auktorisoitu hakutieto henkilölle @fi
label: autorizált hozzáférési pont a következő személyhez: @hu
label: er autoriseret søgeindgang for person af @da
label: er autorisert søkeinngang for person for @no
label: est un point d’accès autorisé d’une personne de @fr
label: ir personas autoritatīvā pamatforma @lv
label: is geautoriseerde ingang voor persoon van @nl
label: ist normierter Sucheinstieg für eine Person von @de
label: kişisi için yetkili erişim noktası @tr
label: normitud otsielement isikule @et
label: è punto d'accesso autorizzato per persona di @it
label: és punt d’accés autoritzat de persona de @ca
label: هي نقطة وصول مقننة لشخص لـ @ar
label: 是……的个人的规范检索点 @zh-hans
sub property of: is access point for person of
sub property of: is authorized access point for agent of
definition: Bir ismi, belirli bir kelime kodlama şemasında tercih için seçilen kişi için erişim noktası olan bir kişiyle ilişkilendirir. @tr
definition: Correla un nomen a una persona che ha un punto d'accesso per la persona che è stato selezionato come preferito in uno specifico schema di codifica di vocabolario. @it
definition: Hozzákapcsol egy noment egy személyhez, akinek van egy előnyben részesített hozzáférési pontja a személyhez, amelyet egy adott szótárkódolási sémából választanak ki. @hu
definition: Liittää nomenin henkilöön, jolla on tietyssä sanaston merkintäjärjestelmässä ensisijaiseksi valittu hakutieto. @fi
definition: Met un nomen en relation avec une personne qui possède un point d’accès d’une personne faisant l’objet d’un choix privilégié dans un schéma d’encodage de vocabulaire spécifique. @fr
definition: Relaciona un nomen amb una persona que té un punt d’accés de persona que se selecciona com a preferent en un esquema de codificació de vocabulari específic. @ca
definition: Relateert een nomen aan een persoon die een ingang voor persoon heeft die als voorkeursterm geselecteerd is in een specifiek vocabulair coderingssysteem. @nl
definition: Relaterer et nomen til en person som har en søkeinngang for person som er valgt som preferanse i et bestemt kodeskjema for vokabular. @no
definition: Relaterer et nomen til en person, som har en søgeindgang for person, som er valgt som præference i et specifikt vokabularkodningsskema. @da
definition: Relates a nomen to a person who has an access point for person that is selected for preference in a specific vocabulary encoding scheme.
definition: Sasaista nomenu ar personu, kurai ir personas pamatforma, kas izvēlēta no konkrētas vārdnīcas. @lv
definition: Seostab nomen'i isikuga, kellel on vastavas leksikaalses märkimissüsteemis eelistatuks valitud otsielement. @et
definition: Setzt ein Nomen in Beziehung zu einer Person, die über einen Sucheinstieg für eine Person verfügt, der in einem bestimmten Vocabulary Encoding Scheme als Vorzugsform bestimmt wird. @de
definition: يربط تسمية بشخص له نقطة وصول لشخص اختيرت للتفضيل في خطة ترميز مفردات محددة. @ar
definition: 将一个命名与有在一个特定的词表编码体系中被首选的个人检索点的一个个人关联起来。 @zh-hans

is variant access point for person of
has element type: 2
toolkit definition: A person who has an access point for person that is not selected for preference in a specific vocabulary encoding scheme.
toolkit definition: Belirli bir kelime kodlama şemasında tercih için seçilmemiş bir kişi için erişim noktası olan bir kişi. @tr
toolkit definition: Een persoon die een ingang voor persoon heeft die niet als voorkeursterm geselecteerd is in een specifiek vocabulair coderingssysteem. @nl
toolkit definition: Egy személy, amelynek van egy olyan hozzáférési pontja a személyhez, amelyet egy adott szótárkódolási sémában nem részesítenek előnyben. @hu
toolkit definition: Eine Person, die über einen Sucheinstieg für eine Person verfügt, der in einem bestimmten Vocabulary Encoding Scheme nicht als Vorzugsform bestimmt wird. @de
toolkit definition: En person som har en søkeinngang for person som ikke er valgt som preferanse i et bestemt kodeskjema for vokabular. @no
toolkit definition: Henkilö, jonka hakutietoa ei ole valittu ensisijaiseksi tietyssä sanaston merkintäjärjestelmässä. @fi
toolkit definition: Isik, kellel on otsielement, mis ei ole valitud eelistatuks vastavas leksikaalses märkimissüsteemis. @et
toolkit definition: Person, som har en søgeindgang for person, som ikke er valgt som præference i et specifikt vokabularkodningsskema. @da
toolkit definition: Persona que té un punt d’accés de persona que no se selecciona com a preferent en un esquema de codificació de vocabulari específic. @ca
toolkit definition: Persona, kurai ir piekļuves punkts personai, kas nav izvēlēta kā prioritāra noteiktai kontrolētas vārdnīcas shēmai. @lv
toolkit definition: Personne qui possède un point d’accès d’une personne ne faisant pas l’objet d’un choix privilégié dans un schéma d’encodage de vocabulaire spécifique. @fr
toolkit definition: Una persona che ha un punto d'accesso per la persona che non è stato selezionato come preferito in uno specifico schema di codifica di vocabolario. @it
toolkit definition: شخص له نقطة وصول لشخص لم تُختر للتفضيل في خطة ترميز مفردات محددة. @ar
toolkit definition: 有在一个特定的词表编码体系中未被首选的个人检索点的一个个人 @zh-hans
toolkit label: Zusätzlicher Sucheinstieg für eine Person von @de
toolkit label: alternativ søkeinngang for person for @no
toolkit label: hozzáférésipont-variánsa a következő személynek: @hu
toolkit label: ir papildforma personai @lv
toolkit label: kişi için alternatif erişim noktası @tr
toolkit label: otsielemendi variant isikule @et
toolkit label: punto d'accesso variante per persona di @it
toolkit label: variant access point for person of
toolkit label: variant af søgeindgang for person af @da
toolkit label: variant de punt d’accés de persona de @ca
toolkit label: variant ingang voor persoon van @nl
toolkit label: variante de point d’accès d’une personne de @fr
toolkit label: varianttihakutieto henkilölle @fi
toolkit label: نقطة وصول مختلفة لشخص لـ @ar
toolkit label: ……的个人的变异检索点 @zh-hans
has subproperty: P80108
lexical alias: variantAccessPointForPersonOf.en
status: Published
type: Property
domain: C10012
label: er alternativ søkeinngang for person for @no
label: er variant af søgeindgang for person af @da
label: est une variante de point d’accès d’une personne de @fr
label: hozzáférésipont-variánsa a következő személynek: @hu
label: ir papildforma personai @lv
label: is variant ingang voor persoon van @nl
label: ist zusätzlicher Sucheinstieg für eine Person von @de
label: kişi için farklı erişim noktası @tr
label: otsielemendi variant isikule @et
label: varianttihakutieto henkilölle @fi
label: è punto d'accesso variante per persona di @it
label: és variant de punt d’accés de persona de @ca
label: هي نقطة وصول مختلفة لشخص لـ @ar
label: 是……的个人的变异检索点 @zh-hans
sub property of: is access point for person of
sub property of: is variant access point for agent of
definition: Bir ismi, belirli bir kelime kodlama şemasında tercih için seçilmeyen kişi için erişim noktası olan bir kişiyle ilişkilendirir. @tr
definition: Correla un nomen a una persona che ha un punto d'accesso per la persona che non è stato selezionato come preferito in uno specifico schema di codifica di vocabolario. @it
definition: Hozzákapcsol egy noment egy személyhez, amelynek van egy olyan hozzáférési pontja a személyhez, amelyet egy adott szótárkódolási sémában nem részesítenek előnyben. @hu
definition: Liittää nomenin henkilöön, jonka hakutietoa ei ole valittu ensisijaiseksi tietyssä sanaston merkintäjärjestelmässä. @fi
definition: Met un nomen en relation avec une personne qui possède un point d’accès d’une personne ne faisant pas l’objet d’un choix privilégié dans un schéma d’encodage de vocabulaire spécifique. @fr
definition: Relaciona un nomen amb una persona que té un punt d’accés de persona que no se selecciona com a preferent en un esquema de codificació de vocabulari específic. @ca
definition: Relateert een nomen aan een persoon die een ingang voor persoon heeft die niet als voorkeursterm geselecteerd is in een specifiek vocabulair coderingssysteem. @nl
definition: Relaterer et nomen til en person som har en søkeinngang for person som ikke er valgt som preferanse i et bestemt kodeskjema for vokabular. @no
definition: Relaterer et nomen til en person, som har en søgeindgang for person, som ikke er valgt som præference i et specifikt vokabularkodningsskema. @da
definition: Relates a nomen to a person who has an access point for person that is not selected for preference in a specific vocabulary encoding scheme.
definition: Sasaista nomenu ar personu, kurai ir piekļuves punkts personai, kas nav izvēlēta kā prioritāra noteiktai kontrolētas vārdnīcas shēmai. @lv
definition: Seostab nomen'i isikuga, kellel on otsielement, mis ei ole valitud eelistatuks vastavas leksikaalses märkimissüsteemis. @et
definition: Setzt ein Nomen in Beziehung zu einer Person, die über einen Sucheinstieg für eine Person verfügt, der in einem bestimmten Vocabulary Encoding Scheme nicht als Vorzugsform bestimmt wird. @de
definition: يربط تسمية بشخص له نقطة وصول لشخص لم تُختر للتفضيل في خطة ترميز مفردات محددة. @ar
definition: 将一个命名与有在一个特定的词表编码体系中未被首选的个人检索点的一个个人关联起来。 @zh-hans

is preferred title of work of
has element type: 2
toolkit definition: A work that has a title of work that is selected for preference in a specific application or context.
toolkit definition: Belirli bir uygulama veya bağlamda tercihen seçilen bir eser başlığına sahip bir eser. @tr
toolkit definition: Darbs, kam ir darba nosaukums, kas ir izvēlēts noteiktam lietojumam vai noteiktā kontekstā. @lv
toolkit definition: Een werk dat een titel van werk heeft has die als voorkeursterm geselecteerd is in een specifieke toepassing of context. @nl
toolkit definition: Egy mű, amely rendelkezik egy olyan műhöz tartozó címmel, amelyet egy adott alkalmazásban vagy kontextusban előnyben részesítenek. @hu
toolkit definition: Ein Werk, das über einen Titel eines Werks verfügt, der in einer bestimmten Anwendung oder in einem bestimmten Kontext als Vorzugsform bestimmt wird. @de
toolkit definition: Et verk som har en tittel for verk som er valgt som preferanse i en bestemt applikasjon eller kontekst. @no
toolkit definition: Obra que té un títol d’obra que se selecciona com a preferent en una aplicació o un context específic. @ca
toolkit definition: Teos, jonka nimeke on valittu ensisijaiseksi tietyssä sovelluksessa tai kontekstissa. @fi
toolkit definition: Teos, millel on kindlas rakenduses või kontekstis eelistatuks valitud pealkiri. @et
toolkit definition: Un'opera che ha un titolo di opera che è stato selezionato come preferito in una specifica applicazione o contesto. @it
toolkit definition: Værk, som har en titel på værk, som er valgt som præference i en specifik anvendelse eller kontekst. @da
toolkit definition: Œuvre qui possède un titre d'œuvre faisant l’objet d’un choix privilégié dans une application ou un contexte spécifiques. @fr
toolkit definition: عمل له عنوان عمل اختير للتفضيل في تطبيق أو في سياق معين. @ar
toolkit definition: 有在一个特定的应用或语境中被首选的一个作品题名的一种作品 @zh-hans
toolkit label: Bevorzugter Titel eines Werks von @de
toolkit label: Eserin tercih edilen başlığı @tr
toolkit label: eelispealkiri teosele @et
toolkit label: előnyben részesített címe a következő műnek: @hu
toolkit label: ensisijainen nimeke teokselle @fi
toolkit label: foretrukken titel på værk af @da
toolkit label: foretrukket tittel for verk for @no
toolkit label: geprefereerde titel van werk van @nl
toolkit label: ir prioritārais nosaukums darbam @lv
toolkit label: preferred title of work of
toolkit label: titolo preferito dell'opera di @it
toolkit label: titre privilégié d’une œuvre de @fr
toolkit label: títol preferit d’obra de @ca
toolkit label: عنوان عمل مفضل لـ @ar
toolkit label: ……的作品的首选题名 @zh-hans
has subproperty: P80109
lexical alias: preferredTitleOfWorkOf.en
status: Published
type: Property
domain: C10012
label: eelispealkiri teosele @et
label: előnyben részesített címe a következő műnek: @hu
label: ensisijainen nimeke teokselle @fi
label: er foretrukken titel på værk af @da
label: er foretrukket tittel for verk for @no
label: eserin tercih edilen başlığıdır @tr
label: est un titre privilégié d’une œuvre de @fr
label: ir prioritārais nosaukums darbam @lv
label: is geprefereerde titel van werk van @nl
label: ist bevorzugter Titel eines Werks von @de
label: è titolo preferito dell'opera di @it
label: és títol preferit d’obra de @ca
label: هو عنوان عمل مفضل لـ @ar
label: 是……的作品的首选题名 @zh-hans
sub property of: is title of work of
sub property of: is preferred name of RDA entity of
definition: Bir ismi, belirli bir uygulama veya bağlamda tercih edilmek üzere seçilen bir eser başlığına sahip bir eserle ilişkilendirir. @tr
definition: Correla un nomen a un'opera che ha un titolo di opera che è stato selezionato come preferito in una specifica applicazione o contesto. @it
definition: Hozzákapcsol egy noment egy műhöz, amely rendelkezik egy olyan műhöz tartozó címmel, amelyet egy adott alkalmazásban vagy kontextusban előnyben részesítenek. @hu
definition: Liittää nomenin teokseen, jonka nimeke on valittu ensisijaiseksi tietyssä sovelluksessa tai kontekstissa. @fi
definition: Met un nomen en relation avec une œuvre qui possède un titre d'œuvre faisant l’objet d’un choix privilégié dans une application ou un contexte spécifiques. @fr
definition: Relaciona un nomen amb una obra que té un títol d’obra que se selecciona com a preferent en una aplicació o un context específic. @ca
definition: Relateert een nomen aan een werk dat een titel van werk heeft has die als voorkeursterm geselecteerd is in een specifieke toepassing of context. @nl
definition: Relaterer et nomen til et verk som har en tittel for verk som er valgt som preferanse i en bestemt applikasjon eller kontekst. @no
definition: Relaterer et nomen til et værk, som har en titel på værk, som er valgt som præference i en specifik anvendelse eller kontekst. @da
definition: Relates a nomen to a work that has a title of work that is selected for preference in a specific application or context.
definition: Sasaista nomenu ar darbu, kam ir darba nosaukums, kas ir izvēlēts noteiktam lietojumam vai noteiktā kontekstā. @lv
definition: Seostab nomen'i teosega, millel on kindlas rakenduses või kontekstis eelistatuks valitud pealkiri. @et
definition: Setzt ein Nomen in Beziehung zu einem Werk, das über einen Titel eines Werks verfügt, der in einer bestimmten Anwendung oder in einem bestimmten Kontext als Vorzugsform bestimmt wird. @de
definition: يربط تسمية بعمل له عنوان عمل اختير للتفضيل في تطبيق أو في سياق معين. @ar
definition: 将一个命名与有在一个特定的应用或语境中被首选的一个作品题名的一种作品关联起来。 @zh-hans

is variant title of work of
has element type: 2
toolkit definition: A work that has a title of work that is not selected for preference in a specific application or context.
toolkit definition: Belirli bir uygulama veya bağlamda tercihen seçilmemiş bir eser başlığına sahip bir eser. @tr
toolkit definition: Darbs, kam ir darba nosaukums, kas nav izvēlēts kā prioritārs noteiktā lietojumprogrammā vai kontekstā. @lv
toolkit definition: Een werk dat een titel van werk heeft die niet als voorkeursterm geselecteerd is in een specifieke toepassing of context. @nl
toolkit definition: Egy mű, amely rendelkezik egy olyan műhöz tartozó címmel, amelyet egy adott alkalmazásban vagy kontextusban nem részesítenek előnyben. @hu
toolkit definition: Ein Werk, das über einen Titel eines Werks verfügt, der in einer bestimmten Anwendung oder in einem bestimmten Kontext nicht als Vorzugsform bestimmt wird. @de
toolkit definition: Et verk som har en tittel for verk som ikke er valgt som preferanse i en bestemt applikasjon eller kontekst. @no
toolkit definition: Obra que té un títol d’obra que no se selecciona com a preferent en una aplicació o un context específic. @ca
toolkit definition: Teos, jonka nimekettä ei ole valittu ensisijaiseksi tietyssä sovelluksessa tai kontekstissa. @fi
toolkit definition: Teos, millel on pealkiri, mis kindlas rakenduses või kontekstis ei ole valitud eelistatuks. @et
toolkit definition: Un'opera che ha un titolo di opera che non è stato selezionato come preferito in uno specifico schema di codifica di vocabolario. @it
toolkit definition: Værk, som har en titel på værk, som ikke er valgt som præference i en specifik anvendelse eller kontekst. @da
toolkit definition: Œuvre qui possède un titre d'œuvre ne faisant pas l’objet d’un choix privilégié dans une application ou un contexte spécifiques. @fr
toolkit definition: عمل له عنوان عمل لم يُختر للتفضيل في تطبيق أو في سياق معين. @ar
toolkit definition: 有在一个特定的应用或语境中未被首选的一个作品题名的一种作品 @zh-hans
toolkit label: Abweichender Titel eines Werks von @de
toolkit label: címváltozata a következő műnek: @hu
toolkit label: eserin alternatif başlığı @tr
toolkit label: ir cits nosaukums darbam @lv
toolkit label: titolo variante dell'opera di @it
toolkit label: tittelvariant for verk for @no
toolkit label: variant af titel på værk af @da
toolkit label: variant de títol d’obra de @ca
toolkit label: variant titel van werk van @nl
toolkit label: variant title of work of
toolkit label: variante de titre d’œuvre de @fr
toolkit label: variantpealkiri teoses @et
toolkit label: varianttinimeke teokselle @fi
toolkit label: عنوان عمل مختلف لـ @ar
toolkit label: ……的作品的变异题名 @zh-hans
has subproperty: P80110
lexical alias: variantTitleOfWorkOf.en
status: Published
type: Property
domain: C10012
label: címvariánsa a következő műnek: @hu
label: er tittelvariant for verk for @no
label: er variant af titel på værk af @da
label: eserin farklı başlığı @tr
label: est une variante de titre d’œuvre de @fr
label: ir cits nosaukums darbam @lv
label: is variant titel van werk van @nl
label: ist abweichender Titel eines Werks von @de
label: variantpealkiri teoses @et
label: varianttinimeke teokselle @fi
label: è titolo variante dell'opera di @it
label: és variant de títol d’obra de @ca
label: هو عنوان عمل مختلف لـ @ar
label: 是……的作品的变异题名 @zh-hans
sub property of: is title of work of
sub property of: is variant name of RDA entity of
definition: Bir ismi, belirli bir uygulama veya bağlamda tercih edilmek üzere seçilmeyen bir eser başlığına sahip bir eserle ilişkilendirir. @tr
definition: Correla un nomen a un'opera che ha un titolo di opera che non è stato selezionato come preferito in uno specifico schema di codifica di vocabolario. @it
definition: Hozzákapcsol egy noment egy műhöz, amely rendelkezik egy olyan műhöz tartozó címmel, amelyet egy adott alkalmazásban vagy kontextusban nem részesítenek előnyben. @hu
definition: Liittää nomenin teokseen, jonka nimekettä ei ole valittu ensisijaiseksi tietyssä sovelluksessa tai kontekstissa. @fi
definition: Met un nomen en relation avec une œuvre qui possède un titre d'œuvre ne faisant pas l’objet d’un choix privilégié dans une application ou un contexte spécifiques. @fr
definition: Relaciona un nomen amb una obra que té un títol d’obra que no se selecciona com a preferent en una aplicació o un context específic. @ca
definition: Relateert een nomen aan een werk dat een titel van werk heeft die niet als voorkeursterm geselecteerd is in een specifieke toepassing of context. @nl
definition: Relaterer et nomen til et verk som har en tittel for verk som ikke er valgt som preferanse i en bestemt applikasjon eller kontekst. @no
definition: Relaterer et nomen til et værk, som har en titel på værk, som ikke er valgt som præference i en specifik anvendelse eller kontekst. @da
definition: Relates a nomen to a work that has a title of work that is not selected for preference in a specific application or context.
definition: Sasaista nomenu ar darbu, kam ir darba nosaukums, kas nav izvēlēts kā prioritārs noteiktā lietojumprogrammā vai kontekstā. @lv
definition: Seostab nomen'i teosega, millel on pealkiri, mis kindlas rakenduses või kontekstis ei ole valitud eelistatuks. @et
definition: Setzt ein Nomen in Beziehung zu einem Werk, das über einen Titel eines Werks verfügt, der in einer bestimmten Anwendung oder in einem bestimmten Kontext nicht als Vorzugsform bestimmt wird. @de
definition: يربط تسمية بعمل له عنوان عمل لم يُختر للتفضيل في تطبيق أو في سياق معين. @ar
definition: 将一个命名与有在一个特定的应用或语境中未被首选的一个作品题名的一种作品关联起来。 @zh-hans
scope note: A variant title of work includes a title or form of title appearing on a manifestation of the work or found in reference sources, a title resulting from a different transliteration of a title, etc.
scope note: Bir eserin alternatif başlığı, eserin bir gösteriminde yer alan veya referans kaynaklarında bulunan bir başlığı veya başlık biçimini, bir başlığın farklı bir çevirisinden kaynaklanan bir başlığı vb. içerir. @tr
scope note: Darba cits nosaukums ietver nosaukumu vai nosaukuma veidu, kas parādās darba manifestācijā vai atrodama atsauces avotos, nosaukumā, kas iegūts no nosaukuma atšķirīgas transliterācijas u.tml. @lv
scope note: Darunter fallen Titel oder Titelformen, die in einer Manifestation des Werks erscheinen oder in Nachschlagewerken zu finden sind, Titel, die sich aus einer abweichenden Transliteration ergeben, und so weiter. @de
scope note: Een variant titel van werk omvat een titel of vorm van titel getoond op een manifestatie van het werk of gevonden in naslagwerken, een titel die het resultaat is van een andere translitteratie van een titel etc. @nl
scope note: Egy mű címvariánsa magában foglal egy olyan címet vagy címalakot, amely a mű megjelenési formáján jelenik meg, vagy referensz-forrásokban található, de címet eredményez egy cím másféle átírása stb. is. @hu
scope note: En tittelvariant for verk inkluderer en tittel eller form for tittel som forekommer på en manifestasjon for verk eller i referanseverk, en tittel som er et resultat av en annen transkripsjon av en tittel etc. @no
scope note: Teoksen varianttinimekkeeseen kuuluu nimeke tai nimekkeen muoto, joka esiintyy teoksen manifestaatiossa tai tietolähteissä sekä nimekkeen eri translitteroinnit tms. @fi
scope note: Teose variantpealkirjaks võib olla teose kehastuses või teatmeallikates leiduv pealkiri või pealkirjavorm, pealkirja erinevast translitereerimisest tulenev pealkiri vms. @et
scope note: Una variant de títol d’obra inclou un títol o una forma de títol que figura en una manifestació de l’obra o que es troba a les fonts de referència, un títol que és el resultat d’una transliteració diferent d’un títol, etc. @ca
scope note: Une variante de titre d’œuvre comprend un titre ou une forme de titre figurant sur une manifestation de l’œuvre ou trouvée dans les sources de référence, un titre qui résulte d’une translittération différente d’un titre, etc. @fr
scope note: Variant af titel på værk omfatter en titel eller form for titel, som forekommer på en manifestation for værket eller findes i referenceværker, en titel, som er et resultat af en anden translitteration af en titel, etc. @da

is variant title of manifestation of
has element type: 2
toolkit definition: A manifestation that has a title of manifestation that is not selected for preference in a specific application or context.
toolkit definition: Belirli bir uygulama veya bağlamda tercih edilmek üzere seçilen bir gösterim başlığına sahip bir gösterim @tr
toolkit definition: Een manifestatie die een titel van manifestatie heeft die niet als voorkeursterm geselecteerd is in een specifieke toepassing of context. @nl
toolkit definition: Egy megjelenési forma, amelynek van egy megjelenésiforma-címe, amelyet egy bizonyos alkalmazásban vagy kontextusban nem részesítenek előnyben. @hu
toolkit definition: Ein Manifestation, das über einen Titel für eine Manifestation verfügt, der in einer bestimmten Anwendung oder in einem bestimmten Kontext nicht als Vorzugsform bestimmt wird. @de
toolkit definition: En manifestasjon som har en tittel for manifestasjon som ikke er valgt som preferanse i en bestemt applikasjon eller kontekst. @no
toolkit definition: Kehastus, millel on pealkiri, mis kindlas rakenduses või kontekstis ei ole valitud eelistatuks. @et
toolkit definition: Manifestaatio, jonka nimekettä ei ole valittu ensisijaiseksi tietyssä sovelluksessa tai kontekstissa. @fi
toolkit definition: Manifestació que té un títol de manifestació que no se selecciona com a preferent en una aplicació o un context específic. @ca
toolkit definition: Manifestation qui possède un titre de manifestation ne faisant pas l’objet d’un choix privilégié dans une application ou un contexte spécifiques. @fr
toolkit definition: Manifestation, som har en titel på manifestation, som ikke er valgt som præference i en specifik anvendelse eller kontekst. @da
toolkit definition: Manifestācija, kam ir manifestācijas nosaukums, kas nav izvēlēts kā prioritārs noteiktā lietojumprogrammā vai kontekstā. @lv
toolkit definition: Una manifestazione che ha un titolo di manifestazione che non è stato selezionato come preferito in uno specifico schema di codifica di vocabolario. @it
toolkit definition: تجسيدة لها عنوان تجسيدة لم يُختر للتفضيل في تطبيق أو في سياق معين. @ar
toolkit definition: 有在一个特定的应用或语境中未被首选的一个载体表现题名的一种载体表现 @zh-hans
toolkit label: Abweichender Titel einer Manifestation von @de
toolkit label: címvariánsa a következő megjelenési formának: @hu
toolkit label: gösterimin alternatif başlığı @tr
toolkit label: ir cits nosaukums manifestācijai @lv
toolkit label: titolo variante della manifestazione di @it
toolkit label: tittelvariant for manifestasjon for @no
toolkit label: variant af titel på manifestation af @da
toolkit label: variant de títol de manifestació de @ca
toolkit label: variant titel van manifestatie van @nl
toolkit label: variant title of manifestation of
toolkit label: variante de titre de manifestation de @fr
toolkit label: variantpealkiri kehastuses @et
toolkit label: varianttinimeke manifestaatiolle @fi
toolkit label: عنوان تجسيدة مختلف لـ @ar
toolkit label: ……的载体表现的变异题名 @zh-hans
has subproperty: is abbreviated title of
has subproperty: P80111
lexical alias: variantTitleOfManifestationOf.en
status: Published
type: Property
domain: C10012
label: címvariánsa a következő megjelenési formának: @hu
label: er tittelvariant for manifestasjon for @no
label: er variant af titel på manifestation af @da
label: est une variante de titre de manifestation de @fr
label: gösterimin farklı başlığı @tr
label: ir cits nosaukums manifestācijai @lv
label: is variant titel van manifestatie van @nl
label: ist abweichender Titel einer Manifestation von @de
label: variantpealkiri kehastuses @et
label: varianttinimeke manifestaatiolle @fi
label: è titolo variante della manifestazione di @it
label: és variant de títol de manifestació de @ca
label: هو عنوان تجسيدة مختلف لـ @ar
label: 是……的载体表现的变异题名 @zh-hans
sub property of: is title of manifestation of
sub property of: is variant name of RDA entity of
definition: Bir ismi, belirli bir uygulama veya bağlamda tercih edilmeyen bir gösterim başlığına sahip bir gösterimle ilişkilendirir. @tr
definition: Correla un nomen a una manifestazione che ha un titolo di manifestazione che non è stato selezionato come preferito in uno specifico schema di codifica di vocabolario. @it
definition: Hozzákapcsol egy noment egy megjelenési formához, amelynek van egy megjelenésiforma-címe, amelyet egy bizonyos alkalmazásban vagy kontextusban nem részesítenek előnyben. @hu
definition: Liittää nomenin manifestaatioon, jonka nimekettä ei ole valittu ensisijaiseksi tietyssä sovelluksessa tai kontekstissa. @fi
definition: Met un nomen en relation avec une manifestation qui possède un titre de manifestation ne faisant pas l’objet d’un choix privilégié dans une application ou un contexte spécifiques. @fr
definition: Relaciona un nomen amb una manifestació que té un títol de manifestació que no se selecciona com a preferent en una aplicació o un context específic. @ca
definition: Relateert een nomen aan een manifestatie die een titel van manifestatie heeft die niet als voorkeursterm geselecteerd is in een specifieke toepassing of context. @nl
definition: Relaterer et nomen til en manifestasjon som har en tittel for manifestasjon som ikke er valgt som preferanse i en bestemt applikasjon eller kontekst. @no
definition: Relaterer et nomen til en manifestation, som har en titel på manifestation, som ikke er valgt som præference i en specifik anvendelse eller kontekst. @da
definition: Relates a nomen to a manifestation that has a title of manifestation that is not selected for preference in a specific application or context.
definition: Sasaista nomenu ar manifestāciju, kam ir manifestācijas nosaukums, kas nav izvēlēts kā prioritārs noteiktā lietojumprogrammā vai kontekstā. @lv
definition: Seostab nomen'i kehastusega, millel on pealkiri, mis kindlas rakenduses või kontekstis ei ole valitud eelistatuks. @et
definition: Setzt ein Nomen in Beziehung zu einer Manifestation, das über einen Titel für eine Manifestation verfügt, der in einer bestimmten Anwendung oder in einem bestimmten Kontext nicht als Vorzugsform bestimmt wird. @de
definition: يربط تسمية بتجسيدة لها عنوان تجسيدة لم يُختر للتفضيل في تطبيق أو في سياق معين. @ar
definition: 将一个命名与有在一个特定的应用或语境中未被首选的一个载体表现题名的一种载体表现关联起来。 @zh-hans

is appellation of RDA entity of
has element type: 2
toolkit definition: An RDA entity that is referred to by a nomen used within a given scheme or context.
toolkit definition: Belirli bir şema veya bağlamda kullanılan bir isimle anılan bir RDA varlığı. @tr
toolkit definition: Een RDA-entiteit die aangeduid wordt door een nomen gebruikt binnen een bepaald schema of context @nl
toolkit definition: Egy RDA-entitás, amelyre egy adott sémában vagy kontextusban használt nomen hivatkozik. @hu
toolkit definition: Eine RDA-Entität, auf die ein Nomen verweist, das in einem bestimmten Schema oder Kontext verwendet wird. @de
toolkit definition: En RDA-entitet som refereres til med et nomen brukt innenfor et bestemt skjema eller kontekst. @no
toolkit definition: Entitat RDA que fa referència a un nomen usat en un esquema o un context determinat. @ca
toolkit definition: Entité RDA qui est désignée par un nomen utilisé à l’intérieur d’un schéma ou d’un contexte donnés. @fr
toolkit definition: RDA entīte, uz kuru attiecas nomens, ko lieto konkrētajā sistēmā vai kontekstā. @lv
toolkit definition: RDA olem, millele antud süsteemis või kontekstis nomen'iga viidatakse. @et
toolkit definition: RDA-entiteetti, johon viitataan tietyssä järjestelmässä tai kontekstissa käytetyllä nomenilla. @fi
toolkit definition: RDA-entitet, som henvises til af et nomen, som anvendes inden for et givet skema eller kontekst. @da
toolkit definition: Un'entità RDA a cui si fa riferimento con un nomen usato in un dato schema o contesto. @it
toolkit definition: كيان "وام" يشار إليه بتسمية مستخدمة في خطة أو في سياق معين. @ar
toolkit definition: 在一个给定的体系或语境中用一个命名指称的一个RDA实体 @zh-hans
toolkit label: Bezeichnung für eine RDA-Entität von @de
toolkit label: RDA varlığının unvanı @tr
toolkit label: apel·lació d’entitat RDA de @ca
toolkit label: appellation d’entité RDA de @fr
toolkit label: appellation of RDA entity of
toolkit label: apzīmējums RDA entītei @lv
toolkit label: benaming van RDA-entiteit van @nl
toolkit label: benævnelse på RDA-entitet af @da
toolkit label: betegnelse for RDA-entitet for @no
toolkit label: denominazione di entità RDA di @it
toolkit label: megnevezése a következő RDA-entitásnak: @hu
toolkit label: nimetus RDA olemile @et
toolkit label: nimitys RDA-entiteetille @fi
toolkit label: اسم لكيان "وام" لـ @ar
toolkit label: ……的RDA实体的称谓 @zh-hans
has subproperty: is appellation of item of
has subproperty: is appellation of agent of
has subproperty: is appellation of expression of
has subproperty: is appellation of manifestation of
has subproperty: is appellation of place of
has subproperty: is appellation of timespan of
has subproperty: is appellation of work of
has subproperty: is access point for RDA entity of
has subproperty: is identifier for RDA entity of
has subproperty: is name of RDA entity of
has subproperty: P80112
lexical alias: appellationOfRDAEntityOf.en
status: Published
type: Property
domain: C10012
label: RDA varlığının unvanıdır @tr
label: er benævnelse på RDA-entitet af @da
label: er betegnelse for RDA-entitet for @no
label: est une appellation d’entité RDA de @fr
label: ir apzīmējums RDA entītei @lv
label: is benaming van RDA-entiteit van @nl
label: ist Bezeichnung für eine RDA-Entität von @de
label: megnevezése a következő RDA-entitásnak: @hu
label: nimetus RDA olemile @et
label: nimitys RDA-entiteetille @fi
label: è denominazione di entità RDA di @it
label: és apel·lació d’entitat RDA de @ca
label: هو اسم كيان "وام" لـ @ar
label: 是……的RDA实体的称谓 @zh-hans
sub property of: has related RDA entity of nomen
definition: Bir ismi, belirli bir şema veya bağlam içinde kullanılan bir niteleyici isim tarafından başvurulan bir RDA varlığıyla ilişkilendirir. @tr
definition: Correla un nomen a un'entità RDA a cui si fa riferimento con un nomen usato in un dato schema o contesto. @it
definition: Hozzákapcsol egy noment egy RDA-entitáshoz, amelyre egy adott sémában vagy kontextusban használt nomen hivatkozik. @hu
definition: Liittää nomenin RDA-entiteettiin, johon viitataan tietyssä järjestelmässä tai kontekstissa käytetyllä nomenilla. @fi
definition: Met un nomen en relation avec une entité RDA qui est désignée par un nomen utilisé à l’intérieur d’un schéma ou d’un contexte donnés. @fr
definition: Relaciona un nomen amb una entitat RDA que fa referència a un nomen usat en un esquema o un context determinat. @ca
definition: Relateert een nomen aan een RDA-entiteit die aangeduid wordt door een nomen gebruikt binnen een bepaald schema of context @nl
definition: Relaterer et nomen til en RDA-entitet som refereres til med et nomen brukt innenfor et bestemt skjema eller kontekst. @no
definition: Relaterer et nomen til en RDA-entitet, som henvises til af et nomen, som anvendes inden for et givet skema eller kontekst. @da
definition: Relates a nomen to an RDA entity that is referred to by a nomen used within a given scheme or context.
definition: Sasaista nomenu ar RDA entīti, uz kuru attiecas nomens, ko lieto konkrētajā sistēmā vai kontekstā. @lv
definition: Seostab nomen'i RDA olemiga, millele antud süsteemis või kontekstis nomen'iga viidatakse. @et
definition: Setzt ein Nomen in Beziehung zu einer RDA-Entität, auf die mit einem Nomen referenziert wird, das in einem bestimmten Schema oder Kontext verwendet wird. @de
definition: يربط تسمية بكيان "وام" يشار إليه بتسمية مستخدمة في خطة أو في سياق معين. @ar
definition: 将一个命名与在一个给定的体系或语境中用一个命名指称的一个RDA实体关联起来。 @zh-hans

is equivalent to
has element type: 2
toolkit definition: A nomen that is an appellation of the same entity as another nomen.
toolkit definition: Başka bir isim ile aynı varlığa ait olan bir unvan. @tr
toolkit definition: Een nomen dat een benaming is van dezelfde entiteit als een andere nomen. @nl
toolkit definition: Egy nomen, amely ugyanannak az entitásnak a megnevezése, ami egy másik nomen. @hu
toolkit definition: Ein Nomen, das eine Bezeichnung für dieselbe Entität ist wie ein anderes Nomen. @de
toolkit definition: Et nomen som er en betegnelse for den samme entiteten som et annet nomen. @no
toolkit definition: Nomen que és una apel·lació de la mateixa entitat com un altre nomen. @ca
toolkit definition: Nomen qui est une appellation de la même entité qu’un autre nomen. @fr
toolkit definition: Nomen, joka on saman entiteetin nimitys kuin toinen nomen. @fi
toolkit definition: Nomen, mis on sama olemi nimetus kui teine nomen. @et
toolkit definition: Nomen, som er en benævnelse på den samme entitet som et andet nomen. @da
toolkit definition: Nomens, kas ir tās pašas entītes apzīmējums kā cits nomens. @lv
toolkit definition: Un nomen che è una designazione della stessa entità come altro nomen. @it
toolkit definition: تسمية عبارة عن اسم للكيان نفسه كتسمية أخرى. @ar
toolkit definition: 和另一个命名一样作为同一个实体的一个称谓的一个命名 @zh-hans
toolkit label: egyenértékű a következővel: @hu
toolkit label: ekvivalentne nomen'iga @et
toolkit label: equivalent a @ca
toolkit label: equivalent aan @nl
toolkit label: equivalent to
toolkit label: equivalente a @it
toolkit label: eşittir @tr
toolkit label: ir tas pats, kas @lv
toolkit label: svarende til @da
toolkit label: tilsvarende til @no
toolkit label: vastaava nomen @fi
toolkit label: äquivalent zu @de
toolkit label: équivalent de @fr
toolkit label: مكافئ لـ @ar
toolkit label: 等同于…… @zh-hans
has subproperty: P80113
lexical alias: equivalentTo.en
status: Published
type: Property
domain: C10012
label: egyenértékű a következővel: @hu
label: ekvivalentne nomen'iga @et
label: er svarende til @da
label: er tilsvarende til @no
label: est un équivalent de @fr
label: eşdeğeridir @tr
label: ir tas pats, kas @lv
label: is equivalent aan @nl
label: ist äquivalent zu @de
label: vastaava nomen @fi
label: è equivalente a @it
label: és equivalent a @ca
label: هو مكافئ لـ @ar
label: 是等同于…… @zh-hans
sub property of: has related nomen of nomen
definition: Bir ismi, başka bir niteleyici isim ile aynı varlığın adı olan bir niteleyici isimle ilişkilendirir. @tr
definition: Correla un nomen a un nomen che è una designazione della stessa entità come altro nomen. @it
definition: Hozzákapcsol egy noment egy nomenhez, amely ugyanannak az entitásnak a megnevezése, ami a másik nomen. @hu
definition: Liittää nomenin nomeniin, joka on saman entiteetin nimitys kuin toinen nomen. @fi
definition: Met un nomen en relation avec un nomen qui est une appellation de la même entité qu’un autre nomen. @fr
definition: Relaciona un nomen amb un nomen que és una apel·lació de la mateixa entitat com un altre nomen. @ca
definition: Relateert een nomen aan een nomen dat een benaming is van dezelfde entiteit als een andere nomen. @nl
definition: Relaterer et nomen til et nomen som er en betegnelse for den samme entiteten som et annet nomen. @no
definition: Relaterer et nomen til et nomen, som er en benævnelse på den samme entitet som et andet nomen. @da
definition: Relates a nomen to a nomen that is an appellation of the same entity as another nomen.
definition: Sasaista nomenu ar nomenu, kas ir tās pašas entītes apzīmējums kā cits nomens. @lv
definition: Seostab nomen'i nomen'iga, mis on sama olemi nimetus kui teine nomen. @et
definition: Setzt ein Nomen in Beziehung zu einem Nomen, das eine Bezeichnung für dieselbe Entität ist wie ein anderes Nomen. @de
definition: يربط تسمية بتسمية عبارة عن اسم للكيان نفسه، كتسمية أخرى. @ar
definition: 将一个命名与和另一个命名一样作为同一个实体的一个称谓的一个命名关联起来。 @zh-hans

is name of agent of manifestation of
has element type: 2
toolkit definition: A manifestation that has a name of agent who is responsible for distribution, printing, duplication, casting, publication, release, issue, etc., or inscription, fabrication, construction, etc.
toolkit definition: Dağıtım, basım, çoğaltma, döküm, yayınlama vb. veya yazım, üretim, yapım vb. işlemlerden sorumlu olan bir temsilcinin adı olan bir gösterim. @tr
toolkit definition: Een manifestatie die een naam van actor heeft die verantwoordelijk is voor distributie, drukken, dupliceren, gieten, uitgeven, uitbrengen, uitvaardigen etc. of afschrijven, fabriceren, construeren etc. @nl
toolkit definition: Egy megjelenési forma, amelyhez hozzátartozik egy olyan ágensnek a neve, amely felelős a terjesztésért, nyomtatásért, sokszorosításért, öntéséért, kiadásért, kibocsájtásért, megjelentetésért stb., vagy írásáért, összeállításért, készítéséért, stb. @hu
toolkit definition: Eine Manifestation, die über einen Namen eines Akteurs verfügt, der für den Vertrieb, den Druck, die Vervielfältigung, den Guss, das Veröffentlichen, das Release, die Herausgabe und so weiter oder für das Gravieren, Fabrizieren, Konstruieren und so weiter verantwortlich ist. @de
toolkit definition: En manifestasjon som har et navn på agent som er ansvarlig for distribusjon, trykking, mangfoldiggjøring, støping, publisering, tilgjengeliggjøring, utgitt etc., eller inskripsjon, fabrikasjon, konstruksjon etc. @no
toolkit definition: Kehastus, milles on levitamise, trükkimise, paljundamise, valamise, avaldamise, väljalaskmise, väljaandmise, inskribeerimise, tootmise, ehitamise vms eest vastutava tegija nimi. @et
toolkit definition: Manifestaatio, jolla on jakelusta, painamisesta, monistamisesta, kirjainten valamisesta, kustantamisesta, julkaisemisesta, ilmestymisestä tms. tai kaivertamisesta, valmistamisesta, koostamisesta tms. vastuussa olevan toimijan nimi. @fi
toolkit definition: Manifestació que té un nom d’agent el qual és responsable de la distribució, la impressió, la reproducció, el modelat, la publicació, la posada en circulació, l’emissió, etc., o de la inscripció, la fabricació, la construcció, etc. @ca
toolkit definition: Manifestation qui possède un nom d’agent responsable de la diffusion ou de la distribution, de l’impression, de la reproduction, du moulage, de la publication, de la mise à disposition, de l’édition, etc. ou de la scription, de la fabrication, de la construction, etc. @fr
toolkit definition: Manifestation, som har et navn på agent, som er ansvarlig for distribution, trykning, duplikering, støbning, publikation, frigivelse, udgivelse ect. eller indskrivning, fremstilling, konstruktion ect. @da
toolkit definition: Manifestācija, kam ir aģents ar vārdu/nosaukumu, kurš ir atbildīgs par publicētas manifestācijas izplatīšanu, iespiešanu, pavairošanu, publicēšanu, izdošanu u.tml. vai nepublicētas manifestācijas pierakstīšanu, izgatavošanu, izveidošanu u.tml. @lv
toolkit definition: Una manifestazione ha un nome di agente che è responsabile per la distribuzione, stampa, duplicazione, casting, pubblicazione, rilascio, emissione, etc. o incisione, fabbricazione, costruzione, etc. @it
toolkit definition: تجسيدة لها اسم وكيل مسئول عن التوزيع، أو الطباعة، أو النسخ، أو البث، أو النشر، أو التحرير، أو الإصدار إلخ. أو عن التدوين، أو التأليف، أو الإنشاء، إلخ. @ar
toolkit definition: 有负责发行、印刷、复制、铸造、出版、发布、经销等或者镌刻、制造、构建等的行为者的名称的一种载体表现 @zh-hans
toolkit label: Name eines Akteurs einer Manifestation von @de
toolkit label: gösterimin temsilcisinin adı @tr
toolkit label: ir aģenta vārds/nosaukums manifestācijai @lv
toolkit label: kehastuse tegija nimi kehastuses @et
toolkit label: naam van actor van manifestatie van @nl
toolkit label: name of agent of manifestation of
toolkit label: navn på agent af manifestation af @da
toolkit label: navn på agent for manifestasjon for @no
toolkit label: nimi manifestaation toimijalle @fi
toolkit label: nom d’agent d’una manifestació de @ca
toolkit label: nom d’agent d’une manifestation de @fr
toolkit label: nome di agente della manifestazione di @it
toolkit label: ágensneve a következő megjelenési formának: @hu
toolkit label: اسم وكيل لتجسيدة لـ @ar
toolkit label: ……的载体表现的行为者的名称 @zh-hans
has subproperty: is name of distributor of
has subproperty: is name of manufacturer of
has subproperty: is name of producer of
has subproperty: is name of publisher of
has subproperty: P80114
lexical alias: nameOfAgentOfManifestationOf.en
status: Published
type: Property
domain: C10012
label: er navn på agent af manifestation af @da
label: er navn på agent for manifestasjon for @no
label: est un nom d’agent d’une manifestation de @fr
label: gösteriminin temsilcisinin adıdır @tr
label: ir aģenta vārds/nosaukums manifestācijai @lv
label: is naam van actor van manifestatie van @nl
label: ist Name eines Akteurs einer Manifestation von @de
label: kehastuse tegija nimi kehastuses @et
label: nimi manifestaation toimijalle @fi
label: ágensneve a következő megjelenési formának: @hu
label: è nome di agente della manifestazione di @it
label: és nom d’agent d’una manifestació de @ca
label: هو اسم وكيل لتجسيدة لـ @ar
label: 是……的载体表现的行为者的名称 @zh-hans
sub property of: has related manifestation of nomen
definition: Bir ismi, dağıtım, basım, çoğaltma, döküm, yayım, ihraç, piyasaya sürüm vb. veya yazım, üretim, imalat vb.den sorumlu olan temsilcinin adına sahip bir gösterimle ilişkilendirir. @tr
definition: Correla un nomen a una manifestazione ha un nome di agente che è responsabile per la distribuzione, stampa, duplicazione, casting, pubblicazione, rilascio, emissione, etc. o incisione, fabbricazione, costruzione, etc. @it
definition: Hozzákapcsol egy noment egy megjelenési formához, amelyhez hozzátartozik egy olyan ágensnek a neve, amely felelős a terjesztésért, nyomtatásért, sokszorosításért, öntéséért, kiadásért, kibocsájtásért, megjelentetésért stb., vagy írásáért, összeállításért, készítéséért, stb. @hu
definition: Liittää nomenin manifestaatioon, jolla on jakelusta, painamisesta, monistamisesta, kirjainten valamisesta, kustantamisesta, julkaisemisesta, ilmestymisestä tms. tai kaivertamisesta, valmistamisesta, koostamisesta tms. vastuussa olevan toimijan nimi. @fi
definition: Met un nomen en relation avec une manifestation qui possède un nom d’agent responsable de la diffusion ou de la distribution, de l’impression, de la reproduction, du moulage, de la publication, de la mise à disposition, de l’édition, etc. ou de la scription, de la fabrication, de la construction, etc. @fr
definition: Relaciona un nomen amb una manifestació que té un nom d’agent el qual és responsable de la distribució, la impressió, la reproducció, el modelat, la publicació, la posada en circulació, l’emissió, etc., o de la inscripció, la fabricació, la construcció, etc. @ca
definition: Relateert een nomen aan een manifestatie die een naam van actor heeft die verantwoordelijk is voor distributie, drukken, dupliceren, gieten, uitgeven, uitbrengen, uitvaardigen etc. of afschrijven, fabriceren, construeren etc. @nl
definition: Relaterer et nomen til en manifestasjon som har et navn på agent som er ansvarlig for distribusjon, trykking, mangfoldiggjøring, støping, publisering, tilgjengeliggjøring, utgitt etc., eller inskripsjon, fabrikasjon, konstruksjon etc. @no
definition: Relaterer et nomen til en manifestation, som har et navn på agent, som er ansvarlig for distribution, trykning, duplikering, støbning, publikation, frigivelse, udgivelse ect. eller indskrivning, fremstilling, konstruktion ect. @da
definition: Relates a nomen to a manifestation that has a name of agent who is responsible for distribution, printing, duplication, casting, publication, release, issue, etc., or inscription, fabrication, construction, etc.
definition: Sasaista nomenu ar manifestāciju, kam ir aģents ar vārdu/nosaukumu, kurš ir atbildīgs par publicētas manifestācijas izplatīšanu, iespiešanu, pavairošanu, publicēšanu, izdošanu u.tml. vai nepublicētas manifestācijas pierakstīšanu, izgatavošanu, izveidošanu u.tml. @lv
definition: Seostab nomen'i kehastusega, milles on levitamise, trükkimise, paljundamise, valamise, avaldamise, väljalaskmise, väljaandmise, inskribeerimise, tootmise, ehitamise vms eest vastutava tegija nimi. @et
definition: Setzt ein Nomen in Beziehung zu einer Manifestation, die über einen Namen eines Akteurs verfügt, der für den Vertrieb, den Druck, die Vervielfältigung, den Guss, das Veröffentlichen, das Release, die Herausgabe und so weiter oder für das Gravieren, Fabrizieren, Konstruieren und so weiter verantwortlich ist. @de
definition: يربط تسمية بتجسيدة لها اسم وكيل مسئول عن التوزيع، أو الطباعة، أو النسخ، أو البث، أو النشر، أو التحرير، أو الإصدار إلخ. أو عن التدوين، أو التأليف، أو الإنشاء، إلخ. @ar
definition: 将一个命名与有负责发行、印刷、复制、铸造、出版、发布、经销等或者镌刻、制造、构建等的行为者的名称的一种载体表现关联起来。 @zh-hans

is name of distributor of
has element type: 2
toolkit definition: A manifestation that is published that has a name of agent who is responsible for distribution.
toolkit definition: Avaldatud kehastus, milles on levitamise eest vastutava tegija nimi. @et
toolkit definition: Dağıtımdan sorumlu bir temsilcinin adı ile yayınlanan bir gösterim. @tr
toolkit definition: Een manifestatie die gepubliceerd is die een naam van actor heeft die verantwoordelijk is voor distributie. @nl
toolkit definition: Egy közzétett megjelenési forma, amelyhez tartozik egy olyan ágensnek a neve, aki/amely felelős a terjesztésért. @hu
toolkit definition: Eine veröffentlichte Manifestation, die über einen Namen eines Akteurs verfügt, der für den Vertrieb verantwortlich ist. @de
toolkit definition: En manifestasjon som er publisert som har et navn på en agent som er ansvarlig for distribusjon. @no
toolkit definition: Julkaistu manifestaatio, jolla on jakelusta vastaavan toimijan nimi. @fi
toolkit definition: Manifestació que es publica i que té un nom d’agent el qual és responsable de la distribució. @ca
toolkit definition: Manifestation publiée qui possède un nom d’agent responsable de la diffusion ou de la distribution. @fr
toolkit definition: Manifestation, som er udgivet og som har navn på agent, som er ansvarlig for distribution. @da
toolkit definition: Manifestācija, kas ir publicēta un kurai ir aģenta vārds/nosaukums, kurš ir atbildīgs par izplatīšanu. @lv
toolkit definition: Una manifestazione pubblicata che ha un nome di agente che è responsabile per la distribuzione. @it
toolkit definition: تجسيدة منشورة لها اسم وكيل مسئول عن التوزيع. @ar
toolkit definition: 已经出版并有负责发行的行为者的名称的一种载体表现 @zh-hans
toolkit label: Distribitör adı @tr
toolkit label: Vertriebsname von @de
toolkit label: ir izplatītāja vārds/nosaukums manifestācijai @lv
toolkit label: levitaja nimi kehastuses @et
toolkit label: naam van distributeur van @nl
toolkit label: name of distributor of
toolkit label: navn på distributør af @da
toolkit label: navn på distributør for @no
toolkit label: neve a következő terjesztőjének: @hu
toolkit label: nimi jakelijalle @fi
toolkit label: nom de diffuseur ou de distributeur de @fr
toolkit label: nom de distribuïdor de @ca
toolkit label: nome di distributore di @it
toolkit label: اسم موزع لـ @ar
toolkit label: ……的发行者的名称 @zh-hans
has subproperty: is parallel name of distributor of
has subproperty: P80115
lexical alias: nameOfDistributorOf.en
status: Published
type: Property
domain: C10012
label: dağıtımcısının adıdır @tr
label: er navn på distributør af @da
label: er navn på distributør for @no
label: est un nom de diffuseur ou de distributeur de @fr
label: ir izplatītāja vārds/nosaukums manifestācijai @lv
label: is naam van distributeur van @nl
label: ist Vertriebsname von @de
label: levitaja nimi kehastuses @et
label: neve a következő terjesztőjének: @hu
label: nimi jakelijalle @fi
label: è nome di distributore di @it
label: és nom de distribuïdor de @ca
label: هو اسم موزع لـ @ar
label: 是……的发行者的名称 @zh-hans
sub property of: is name of agent of manifestation of
definition: Bir ismi, dağıtımdan sorumlu temsilcinin adına sahip yayınlanan bir gösterimle ilişkilendirir. @tr
definition: Correla un nomen a una manifestazione pubblicata che ha un nome di agente che è responsabile per la distribuzione. @it
definition: Egy noment hozzákapcsol egy közzétett megjelenési formához, amelyhez tartozik egy olyan ágensnek a neve, aki/amely felelős a terjesztésért. @hu
definition: Liittää nomenin julkaistuun manifestaatioon, jolla on jakelusta vastaavan toimijan nimi. @fi
definition: Met un nomen en relation avec une manifestation publiée qui possède un nom d’agent responsable de la diffusion ou de la distribution. @fr
definition: Relaciona un nomen amb una manifestació que es publica i que té un nom d’agent el qual és responsable de la distribució. @ca
definition: Relateert een nomen aan een manifestatie die gepubliceerd is die een naam van actor heeft die verantwoordelijk is voor distributie. @nl
definition: Relaterer et nomen til en manifestasjon som er publisert som har et navn på en agent som er ansvarlig for distribusjon. @no
definition: Relaterer et nomen til en manifestation, som er udgivet og som har navn på agent, som er ansvarlig for distribution. @da
definition: Relates a nomen to a manifestation that is published that has a name of agent who is responsible for distribution.
definition: Sasaista nomenu ar manifestāciju, kas ir publicēta un kurai ir aģenta vārds/nosaukums, kurš ir atbildīgs par izplatīšanu. @lv
definition: Seostab nomen'i avaldatud kehastusega, milles on levitamise eest vastutava tegija nimi. @et
definition: Setzt ein Nomen in Beziehung zu einer veröffentlichten Manifestation, die über einen Namen eines Akteurs verfügt, der für den Vertrieb verantwortlich ist. @de
definition: يربط تسمية بتجسيدة منشورة لها اسم وكيل مسئول عن التوزيع. @ar
definition: 将一个命名与已经出版并有负责发行的行为者的名称的一种载体表现关联起来。 @zh-hans

is name of manufacturer of
has element type: 2
toolkit definition: A manifestation that is published that has a name of agent who is responsible for printing, duplication, casting, etc.
toolkit definition: Avaldatud kehastus, milles on trükkimise, paljundamise, valamise vms eest vastutava tegija nimi. @et
toolkit definition: Basım, çoğaltma, döküm vb. işlemlerden sorumlu olan bir temsilcinin adı ile yayınlanan bir gösterim. @tr
toolkit definition: Een manifestatie die gepubliceerd is die een naam van actor heeft die verantwoordelijk is voor drukken, dupliceren, gieten etc. @nl
toolkit definition: Egy közzétett megjelenési forma, amelyhez tartozik egy olyan ágensnek a neve, aki/amely felelős a nyomtatásért, többszörözésért, öntésért stb. @hu
toolkit definition: Eine veröffentlichte Manifestation, die über einen Namen eines Akteurs verfügt, der für den Druck, die Vervielfältigung, den Guss und so weiter verantwortlich ist. @de
toolkit definition: En manifestasjon som er publisert som har et navn på en agent som er ansvarlig for trykking, mangfoldiggjøring, støping etc. @no
toolkit definition: Manifestaatio, jolla on painamisesta, monistamisesta, kirjainten valamisesta tms. vastaavan toimijan nimi. @fi
toolkit definition: Manifestació que es publica i que té un nom d’agent el qual és responsable de la impressió, la reproducció, el modelat, etc. @ca
toolkit definition: Manifestation publiée qui possède un nom d’agent responsable de l’impression, de la reproduction, du moulage, etc. @fr
toolkit definition: Manifestation, som er udgivet og som har navn på agent, som er ansvarlig for trykning, duplikering, støbning etc. @da
toolkit definition: Manifestācija, kas ir publicēta un kurai ir aģenta vārds/nosaukums, kurš ir atbildīgs par iespiešanu, pavairošanu, iesiešanu u.tml. @lv
toolkit definition: Una manifestazione pubblicata che ha un nome di agente che è responsabile per la stampa, duplicazione, casting, etc. @it
toolkit definition: تجسيدة منشورة لها اسم وكيل مسئول مسؤول عن الطباعة، النسخ، والبث، الخ. @ar
toolkit definition: 已经出版并有负责印刷、复制、铸造等的行为者的名称的一种载体表现 @zh-hans
toolkit label: Herstellername von @de
toolkit label: imalatçısının adı @tr
toolkit label: ir ražotāja vārds/nosaukums manifestācijai @lv
toolkit label: naam van vervaardiger van @nl
toolkit label: name of manufacturer of
toolkit label: navn på producent af @da
toolkit label: navn på tilvirker for @no
toolkit label: neve a következő gyártójának: @hu
toolkit label: nimi valmistajalle @fi
toolkit label: nom de fabricant de @ca
toolkit label: nome di manifattore di @it
toolkit label: valmistaja nimi kehastuses @et
toolkit label: اسم صانع لـ @ar
toolkit label: ……的生产者的名称 @zh-hans
has subproperty: is parallel name of manufacturer of
has subproperty: P80116
lexical alias: nameOfManufacturerOf.en
status: Published
type: Property
domain: C10012
label: er navn på producent af @da
label: er navn på tilvirker for @no
label: est un nom de fabricant de @fr
label: ir ražotāja vārds/nosaukums manifestācijai @lv
label: is naam van vervaardiger van @nl
label: ist Herstellername von @de
label: neve a következő gyártójának: @hu
label: nimi valmistajalle @fi
label: valmistaja nimi kehastuses @et
label: è nome di manifattore di @it
label: és nom de fabricant de @ca
label: üreticisinin adıdır @tr
label: هو اسم صانع لـ @ar
label: 是……的生产者的名称 @zh-hans
sub property of: is name of agent of manifestation of
definition: Bir ismi, basım, çoğaltma, döküm vb. işlemlerden sorumlu temsilcinin adına sahip yayınlanan bir gösterimle ilişkilendirir. @tr
definition: Correla un nomen a una manifestazione pubblicata che ha un nome di agente che è responsabile per la stampa, duplicazione, casting, etc. @it
definition: Egy noment hozzákapcsol egy közzétett megjelenési formához , amelyhez tartozik egy olyan ágensnek a neve, aki/amely felelős a nyomtatásért, többszörözésért, öntésért stb. @hu
definition: Liittää nomenin julkaistuun manifestaatioon, jolla on painamisesta, monistamisesta, kirjainten valamisesta tms. vastaavan toimijan nimi. @fi
definition: Met un nomen en relation avec une manifestation publiée qui possède un nom d’agent responsable de l’impression, de la reproduction, du moulage, etc. @fr
definition: Relaciona un nomen amb una manifestació que es publica i que té un nom d’agent el qual és responsable de la impressió, la reproducció, el modelat, etc. @ca
definition: Relateert een nomen aan een manifestatie die gepubliceerd is die een naam van actor heeft die verantwoordelijk is voor drukken, dupliceren, gieten etc. @nl
definition: Relaterer et nomen til en manifestasjon som er publisert som har et navn på en agent som er ansvarlig for trykking, mangfoldiggjøring, støping etc. @no
definition: Relaterer et nomen til en manifestation, som er publiceret og som har navn på agent, som er ansvarlig for trykning, duplikering, støbning etc. @da
definition: Relates a nomen to a manifestation that is published that has a name of agent who is responsible for printing, duplication, casting, etc.
definition: Sasaista nomenu ar manifestāciju, kas ir publicēta un kurai ir aģenta vārds/nosaukums, kurš ir atbildīgs par iespiešanu, pavairošanu, iesiešanu u.tml. @lv
definition: Seostab nomen'i avaldatud kehastusega, milles on trükkimise, paljundamise, valamise vms eest vastutava tegija nimi. @et
definition: Setzt ein Nomen in Beziehung zu einer veröffentlichten Manifestation, die über einen Namen eines Akteurs verfügt, der für den Druck, die Vervielfältigung, den Guss und so weiter verantwortlich ist. @de
definition: يربط تسمية بتجسيدة منشورة لها اسم وكيل مسئول عن الطباعة، النسخ، والبث، الخ. @ar
definition: 将一个命名与已经出版并有负责印刷、复制、铸造等的行为者的名称的一种载体表现关联起来。 @zh-hans

is name of producer of
has element type: 2
toolkit definition: A manifestation that is unpublished that has a name of agent who is responsible for inscription, fabrication, construction, etc.
toolkit definition: Avaldamata kehastus, milles on inskribeerimise, tootmise, ehitamise vms eest vastutava tegija nimi. @et
toolkit definition: Een manifestatie die ongepubliceerd is die een naam van actor heeft die verantwoordelijk is voor afschrijven, fabriceren, construeren etc. @nl
toolkit definition: Egy közzé nem tett megjelenési forma, amelyhez tartozik egy olyan ágensnek a neve, aki/amely felelős bejegyzésért, gyártásért, kivitelezésért. @hu
toolkit definition: Eine unveröffentlichte Manifestation, die über einen Namen eines Akteurs verfügt, der für das Gravieren, Fabrizieren, Konstruieren und so weiter verantwortlich ist. @de
toolkit definition: En manifestasjon som er upublisert som har et navn på en agent som er ansvarlig for inskripsjon, fabrikasjon, konstruksjon etc. @no
toolkit definition: Julkaisematon manifestaatio, jolla on kaivertamisesta, valmistamisesta, koostamisesta tms. vastaavan toimijan nimi. @fi
toolkit definition: Manifestació que no és publicada i que té un nom d’agent el qual és responsable de la inscripció, la fabricació, la construcció, etc. @ca
toolkit definition: Manifestation non publiée qui possède un nom d’agent responsable de la scription, de la fabrication, de la construction, etc. @fr
toolkit definition: Manifestation, som ikke er publiceret og som har navn på agent, som er ansvarlig for indskrivning, fremstilling, konstruktion ect. @da
toolkit definition: Manifestācija, kas ir nepublicēta un kurai ir aģenta vārds/nosaukums, kurš ir atbildīgs par pierakstīšanu, izgatavošanu, izveidošanu u.tml. @lv
toolkit definition: Una manifestazione non pubblicata che ha un nome di agente che è responsabile per l'incisione, fabbricazione, costruzione, etc. @it
toolkit definition: Yazım, üretim, yapım vb. işlerden sorumlu olan bir temsilcinin adı ile yayınlanmamış bir gösterim. @tr
toolkit definition: تجسيدة غير منشورة لها اسم وكيل مسئول عن التدوين، والتأليف، والإنشاء، الخ. @ar
toolkit definition: 非出版并有负责镌刻、制造、构建等的行为者的名称的一种载体表现 @zh-hans
toolkit label: Erzeugername von @de
toolkit label: Yapımcı adı @tr
toolkit label: ir izgatavotāja vārds/nosaukums manifestācijai @lv
toolkit label: naam van producent van @nl
toolkit label: name of producer of
toolkit label: navn på producer af @da
toolkit label: navn på produsent for @no
toolkit label: neve a következő előállítójának: @hu
toolkit label: nimi tuottajalle @fi
toolkit label: nom de producteur de @fr
toolkit label: nom de productor de @ca
toolkit label: nome di produttore di @it
toolkit label: tootja nimi kehastuses @et
toolkit label: اسم مُنْتِج لـ @ar
toolkit label: ……的制作者的名称 @zh-hans
has subproperty: is parallel name of producer of
has subproperty: P80117
lexical alias: nameOfProducerOf.en
status: Published
type: Property
domain: C10012
label: er navn på producer af @da
label: er navn på produsent for @no
label: est un nom de producteur de @fr
label: ir izgatavotāja vārds/nosaukums manifestācijai @lv
label: is naam van producent van @nl
label: ist Erzeugername von @de
label: neve a következő előállítójának: @hu
label: nimi tuottajalle @fi
label: tootja nimi kehastuses @et
label: yapımcısının adıdır @tr
label: è nome di produttore di @it
label: és nom de productor de @ca
label: هو اسم مُنْتِج لـ @ar
label: 是……的制作者的名称 @zh-hans
sub property of: is name of agent of manifestation of
definition: Bir ismi, yazım, üretim, yapım vb.den sorumlu olan temsilcinin adına sahip, yayınlanmamış bir gösterimle ilişkilendirir. @tr
definition: Correla un nomen a una manifestazione non pubblicata che ha un nome di agente che è responsabile per l'incisione, fabbricazione, costruzione, etc. @it
definition: Egy noment hozzákapcsol egy közzé nem tett megjelenési formához, amelyhez tartozik egy olyan ágensnek a neve, aki/amely felelős bejegyzésért, gyártásért, kivitelezésért. @hu
definition: Liittää nomenin julkaisemattomaan manifestaatioon, jolla on kaivertamisesta, valmistamisesta, koostamisesta tms. vastaavan toimijan nimi. @fi
definition: Met un nomen en relation avec une manifestation non publiée qui possède un nom d’agent responsable de la scription, de la fabrication, de la construction, etc. @fr
definition: Relaciona un nomen amb una manifestació que no és publicada i que té un nom d’agent el qual és responsable de la inscripció, la fabricació, la construcció, etc. @ca
definition: Relateert een nomen aan een manifestatie die ongepubliceerd is die een naam van actor heeft die verantwoordelijk is voor afschrijven, fabriceren, construeren etc. @nl
definition: Relaterer et nomen til en manifestasjon som er upublisert som har et navn på en agent som er ansvarlig for inskripsjon, fabrikasjon, konstruksjon etc. @no
definition: Relaterer et nomen til en manifestation, som ikke er publiceret og som har navn på agent, som er ansvarlig for indskrivning, fremstilling, konstruktion ect. @da
definition: Relates a nomen to a manifestation that is unpublished that has a name of agent who is responsible for inscription, fabrication, construction, etc.
definition: Sasaista nomenu ar manifestāciju, kas ir nepublicēta un kurai ir aģenta vārds/nosaukums, kurš ir atbildīgs par pierakstīšanu, izgatavošanu, izveidošanu u.tml. @lv
definition: Seostab nomen'i avaldamata kehastusega, milles on inskribeerimise, tootmise, ehitamise vms eest vastutava tegija nimi. @et
definition: Setzt ein Nomen in Beziehung zu einer unveröffentlichten Manifestation, die über einen Namen eines Akteurs verfügt, der für das Gravieren, Fabrizieren, Konstruieren und so weiter verantwortlich ist. @de
definition: يربط تسمية بتجسيدة غير منشورة لها اسم وكيل مسئول عن التدوين، والتأليف، والإنشاء، الخ. @ar
definition: 将一种命名与非出版并有负责镌刻、制造、构建等的行为者的名称的一种载体表现关联起来。 @zh-hans

is name of publisher of
has element type: 2
toolkit definition: A manifestation that is published that has a name of agent who is responsible for publication.
toolkit definition: Avaldatud kehastus, milles on avaldamise eest vastutava tegija nimi. @et
toolkit definition: Een manifestatie die gepubliceerd is die een naam van actor heeft die verantwoordelijk is voor publicatie. @nl
toolkit definition: Egy közzétett megjelenési forma, amelyhez tartozik egy olyan ágensnek a neve, aki/amely felelős annak kiadványáért. @hu
toolkit definition: Eine veröffentlichte Manifestation, die einen Namen eines Akteurs enthält, der für die Veröffentlichung verantwortlich ist. @de
toolkit definition: En manifestasjon som er publisert som har et navn på en agent som er ansvarlig for dens publisering. @no
toolkit definition: Julkaistu manifestaatio, jolla on kustantamisesta vastaavan toimijan nimi. @fi
toolkit definition: Manifestació que es publica i que té un nom d’agent el qual és responsable de la publicació. @ca
toolkit definition: Manifestation publiée qui possède un nom d’agent responsable de la publication. @fr
toolkit definition: Manifestation, som er publiceret og som har navn på agent, som er ansvarlig for dens publikation. @da
toolkit definition: Manifestācija, kas ir publicēta un kurai ir aģenta vārds/nosaukums, kurš ir atbildīgs par tās publicēšanu. @lv
toolkit definition: Una manifestazione pubblicata che ha un nome di agente che è responsabile della sua pubblicazione. @it
toolkit definition: Yayından sorumlu olan temsilcinin adı ile yayınlanan bir gösterim. @tr
toolkit definition: تجسيدة منشورة لها اسم وكيل مسئول عن النشر. @ar
toolkit definition: 已经出版并有负责出版的行为者的名称的一种载体表现 @zh-hans
toolkit label: Verlagsname von @de
toolkit label: Yayıncı adı @tr
toolkit label: ir izdevēja vārds/nosaukums manifestācijai @lv
toolkit label: kirjastaja nimi kehastuses @et
toolkit label: naam van uitgever van @nl
toolkit label: name of publisher of
toolkit label: navn på udgiver af @da
toolkit label: navn på utgiver for @no
toolkit label: neve a következő kiadójának: @hu
toolkit label: nimi kustantajalle @fi
toolkit label: nom d’editor de @ca
toolkit label: nom d’éditeur de @fr
toolkit label: nome di editore di @it
toolkit label: اسم ناشر لـ @ar
toolkit label: ……的出版者的名称 @zh-hans
has subproperty: is parallel name of publisher of
has subproperty: P80118
lexical alias: nameOfPublisherOf.en
status: Published
type: Property
domain: C10012
label: er navn på udgiver af @da
label: er navn på utgiver for @no
label: est un nom d’éditeur de @fr
label: ir izdevēja vārds/nosaukums manifestācijai @lv
label: is naam van uitgever van @nl
label: ist Verlagsname von @de
label: kirjastaja nimi kehastuses @et
label: neve a következő kiadójának: @hu
label: nimi kustantajalle @fi
label: yayıncısının adıdır @tr
label: è nome di editore di @it
label: és nom d’editor de @ca
label: هو اسم ناشر لـ @ar
label: 是……的出版者的名称 @zh-hans
sub property of: is name of agent of manifestation of
definition: Bir ismi, yayından sorumlu olan temsilcinin adına sahip yayınlanan bir gösterimle ilişkilendirir. @tr
definition: Correla un nomen a una manifestazione pubblicata che ha un nome di agente che è responsabile della sua pubblicazione. @it
definition: Egy noment hozzákapcsol egy közzétett megjelenési formához , amelyhez tartozik egy olyan ágensnek a neve, aki/amely felelős annak kiadványáért. @hu
definition: Liittää nomenin julkaistuun manifestaatioon, jolla on kustantamisesta vastaavan toimijan nimi. @fi
definition: Met un nomen en relation avec une manifestation publiée qui possède un nom d’agent responsable de la publication. @fr
definition: Relaciona un nomen amb una manifestació que es publica i que té un nom d’agent el qual és responsable de la publicació. @ca
definition: Relateert een nomen aan een manifestatie die gepubliceerd is die een naam van actor heeft die verantwoordelijk is voor publicatie. @nl
definition: Relaterer et nomen til en manifestasjon som er publisert som har et navn på en agent som er ansvarlig for dens publisering. @no
definition: Relaterer et nomen til en manifestation, som er publiceret og som har navn på agent, som er ansvarlig for dens publikation. @da
definition: Relates a nomen to a manifestation that is published that has a name of agent who is responsible for publication.
definition: Sasaista nomenu ar manifestāciju, kas ir publicēta un kurai ir aģenta vārds/nosaukums, kurš ir atbildīgs par tās publicēšanu. @lv
definition: Seostab nomen'i avaldatud kehastusega, milles on avaldamise eest vastutava tegija nimi. @et
definition: Setzt ein Nomen in Beziehung zu einer veröffentlichten Manifestation, die einen Namen eines Akteurs enthält, der für die Veröffentlichung verantwortlich ist. @de
definition: يربط تسمية بتجسيدة منشورة لها اسم وكيل مسئول عن النشر. @ar
definition: 将一个命名与已经出版并有负责出版的行为者的名称的一种载体表现关联起来。 @zh-hans
scope note: A közzététel megjelenést és kibocsátást foglal magába. @hu
scope note: Avaldamine hõlmab ka väljalaskmist ja väljaandmist. @et
scope note: Darunter fallen Freigaben und Herausgaben. @de
scope note: Kustantaminen pitää sisällään myös julkaisemisen ja ilmestymisen. @fi
scope note: La pubblicazione comprende la distribuzione e l'emissione. @it
scope note: La publication comprend la mise à disposition et l’édition. @fr
scope note: Publicació inclou la posada en circulació i l’emissió. @ca
scope note: Publication includes release and issuance.
scope note: Publicēšana ir izlaišana vai izdošana. @lv
scope note: Publikation omfatter frigivelse og udstedelse. @da
scope note: Publisering inkluderer tilgjengeliggjøring og utstedelse. @no
scope note: Uitgeven omvat uitbrengen en uitvaardigen. @nl

is numeric designation of musical work of
has element type: 2
toolkit definition: A work that is a musical work that has an identifier for work that is a serial number, opus number, or thematic index number assigned to a musical work by a composer, publisher, or a musicologist.
toolkit definition: Bir besteci, yayıncı veya bir müzikolog tarafından bir müzik eserine atanan seri numarası, eser numarası veya tematik dizin numarası gibi eser tanımlayıcısına sahip bir müzik eseri olan bir eser. @tr
toolkit definition: Een werk dat is een muziekwerk dat een identificatie voor werk heeft dat een serienummer is, een opusnummer of thematisch indexnummer toegekend aan een muziekwerk door een componist, uitgever of een musicoloog. @nl
toolkit definition: Egy zenemű, amely rendelkezik egy olyan műazonosítóval, amely egy zeneszerzőtől, kiadótól vagy egy zenetudóstól származó, a zeneművet jelölő sorozati szám, opusszám vagy egy tematikus indexszám. @hu
toolkit definition: Ein Musikwerk, das über einen Identifikator für ein Werk verfügt, der eine laufende Nummer, eine Opus-Nummer oder eine Werkverzeichnisnummer darstellt, die einem Musikwerk durch eine Komponistin/einen Komponisten, einen Verlag oder eine Musikwissenschaftlerin/einen Musikwissenschaftler zugewiesen wird. @de
toolkit definition: Et musikalsk verk som har en identifikator for verk som er et serienummer, opusnummer eller et tematisk indeksnummer tildelt et musikals verk av en komponist, utgiver eller musikolog. @no
toolkit definition: Musikværk, som har en identifikator for værk, som er et serienummer, opusnummer eller et tematisk indeksnummer tildelt et musikværk af en komponist, udgiver eller en musikolog. @da
toolkit definition: Muusikateos, millel on teose identifikaatoriks järjenumber, oopuse number või temaatilise kataloogi number, mille on muusikateosele andnud helilooja, kirjastaja või muusikateadlane. @et
toolkit definition: Mūzikas darbs, kam ir darba identifikators, kas ir darba kārtas numurs, opusa numurs vai tematiskā rādītāja numurs, ko mūzikas darbam piešķīris komponists, izdevējs vai muzikologs. @lv
toolkit definition: Obra que és una obra musical que té un identificador d’obra que és un número d’ordre, un número d’opus o un número d’índex temàtic assignat a una obra musical per un compositor, un editor o un musicòleg. @ca
toolkit definition: Teos, joka on musiikkiteos, jolla on säveltäjän, julkaisijan tai musiikintutkijan antama järjestysnumero, opusnumero tai temaattinen teosluettelon numero teoksen tunnisteena. @fi
toolkit definition: Un'opera musicale che ha un identificatore per l'opera che è un numero di serie numero di opus, o numero di indice tematico assegnato all'opera musicla eda un compositore, editore o musicologo. @it
toolkit definition: Œuvre musicale qui possède un identifiant d’œuvre consistant en un numéro d’ordre, un numéro d’opus ou un numéro de catalogue thématique attribué à une œuvre musicale par un compositeur, un éditeur ou un musicologue. @fr
toolkit definition: عمل هو عمل موسيقي له مُعرِّف لعمل عبارة عن رقم مسلسل، أو رقم قطعة موسيقية، أو رقم كشاف موضوعي مُخصص لعمل موسيقى لملحن، أو لناشر، أو لعالم في الموسيقى. @ar
toolkit definition: 作为一种音乐作品并有一个作品标识符（即作曲者、出版者或者音乐学家给作品分配的序列号、作品号或主题索引号）的一种作品 @zh-hans
toolkit label: Numerische Bezeichnung eines Musikwerks von @de
toolkit label: designació numèrica d’una obra musical de @ca
toolkit label: designazione numerica di opera musicale di @it
toolkit label: désignation numérique d’une œuvre musicale de @fr
toolkit label: ir skaitlisks apzīmējums mūzikas darbam @lv
toolkit label: muusikateose numbriline tähistus teoses @et
toolkit label: müzik eserinin sayısal tanımı @tr
toolkit label: numeric designation of musical work of
toolkit label: numerieke aanduiding van muziekwerk van @nl
toolkit label: numerisk betegnelse for musikalsk verk for @no
toolkit label: numerisk betegnelse for musikværk af @da
toolkit label: numerointi musiikkiteokselle @fi
toolkit label: számjelzése a következő zeneműnek: @hu
toolkit label: رمز رقمي لعمل موسيقى لـ @ar
toolkit label: ……的音乐作品的数字标识 @zh-hans
has subproperty: is opus number of
has subproperty: is serial number of musical work of
has subproperty: is thematic index number of
has subproperty: P80119
lexical alias: numericDesignationOfMusicalWorkOf.en
status: Published
type: Property
domain: C10012
label: er numerisk betegnelse for musikalsk verk for @no
label: er numerisk betegnelse for musikværk af @da
label: est une désignation numérique d’une œuvre musicale de @fr
label: ir skaitlisks apzīmējums mūzikas darbam @lv
label: is numerieke aanduiding van muziekwerk van @nl
label: ist numerische Bezeichnung eines Musikwerks von @de
label: muusikateose numbriline tähistus teoses @et
label: müzik eserinin sayısal tanımlamasıdır @tr
label: numerointi musiikkiteokselle @fi
label: számjelzése a következő zeneműnek: @hu
label: è designazione numerica di opera musicale di @it
label: és designació numèrica d’una obra musical de @ca
label: هو رمز رقمي لعمل موسيقى لـ @ar
label: 是……的音乐作品的数字标识 @zh-hans
sub property of: is identifier for work of
definition: Bir ismi, bir bestecinin bestenin kronolojik sırasını gösteren eserler listesinden atanan sayısal bir müzik eseri atamasına sahip bir eserle ilişkilendirir. @tr
definition: Correla un nomen a un'opera musicale che ha un identificatore per l'opera che è un numero di serie numero di opus, o numero di indice tematico assegnato all'oopera musicla eda un compositore, editore o musicologo. @it
definition: Hozzákapcsol egy noment egy zeneműhöz, amely rendelkezik egy olyan műazonosítóval, amely egy zeneszerzőtől, kiadótól vagy egy zenetudóstól származó, a zeneművet jelölő sorozati szám, opusszám vagy egy tematikus indexszám. @hu
definition: Liittää nomenin teokseen, joka on musiikkiteos, jolla on säveltäjän, julkaisijan tai musiikintutkijan antama järjestysnumero, opusnumero tai temaattinen teosluettelon numero teoksen tunnisteena. @fi
definition: Met un nomen en relation avec une œuvre musicale qui possède un identifiant d’œuvre consistant en un numéro d’ordre, un numéro d’opus ou un numéro de catalogue thématique attribué à une œuvre musicale par un compositeur, un éditeur ou un musicologue. @fr
definition: Relaciona un nomen amb una obra que és una obra musical que té un identificador d’obra que és un número d’ordre, un número d’opus o un número d’índex temàtic assignat a una obra musical per un compositor, un editor o un musicòleg. @ca
definition: Relateert een nomen aan een werk dat is een muziekwerk dat een identificatie voor werk heeft dat een serienummer is, een opusnummer of thematisch indexnummer toegekend aan een muziekwerk door een componist, uitgever of een musicoloog. @nl
definition: Relaterer et nomen til et musikalsk verk som har en identifikator for verk som er et serienummer, opusnummer eller et tematisk indeksnummer tildelt et musikals verk av en komponist, utgiver eller musikolog. @no
definition: Relaterer et nomen til et musikværk, som har en identifikator for værk, som er et serienummer, opusnummer eller et tematisk indeksnummer tildelt et musikværk af en komponist, udgiver eller en musikolog. @da
definition: Relates a nomen to a work that is a musical work that has an identifier for work that is a serial number, opus number, or thematic index number assigned to a musical work by a composer, publisher, or a musicologist.
definition: Sasaista nomenu ar darbu, kas ir mūzikas darbs, kam ir darba identifikators, kas ir darba kārtas numurs, opusa numurs vai tematiskā rādītāja numurs, ko mūzikas darbam piešķīris komponists, izdevējs vai muzikologs. @lv
definition: Seostab nomen'i muusikateosega, millel on teose identifikaatoriks järjenumber, oopuse number või temaatilise kataloogi number, mille on muusikateosele andnud helilooja, kirjastaja või muusikateadlane. @et
definition: Setzt ein Nomen in Beziehung zu einem Musikwerk, das über einen Identifikator für ein Werk verfügt, der eine laufende Nummer, eine Opus-Nummer oder eine Werkverzeichnisnummer darstellt, die einem Musikwerk durch eine Komponistin/einen Komponisten, einen Verlag oder eine Musikwissenschaftlerin/einen Musikwissenschaftler zugewiesen wird. @de
definition: يربط تسمية بعمل عبارة عن عمل موسيقي له مُعرِّف لعمل عبارة عن رقم مسلسل، أو رقم قطعة موسيقية، أو رقم كشاف موضوعي مخصص لعمل موسيقى لملحن، أو ناشر، أو عالم في الموسيقى. @ar
definition: 将一个命名与作为一种音乐作品并有一个作品标识符（即作曲者、出版者或者音乐学家给作品分配的序列号、作品号或主题索引号）的一种作品关联起来。 @zh-hans

is opus number of
has element type: 2
toolkit definition: A work that has a numeric designation of musical work that is assigned from a list of works of a composer indicating chronological order of composition.
toolkit definition: Bir bestecinin eserlerinin kronolojik sırasını gösteren bir listeden atanan müzik eserinin sayısal bir tanımına sahip bir eser. @tr
toolkit definition: Een werk dat een numerieke aanduiding van muziekwerk heeft die is toegekend uit een lijst van werken van een componist die de chronologische volgorde van compositie aangeeft. @nl
toolkit definition: Egy mű, amely rendelkezik egy a zeneszerző műveinek jegyzékéből vett olyan zenemű-azonosítóval, amely egy számjelzéssel jelzi a kompozíció kronológiai sorrendjét. @hu
toolkit definition: Ein Werk, das über eine numerische Bezeichnung eines Musikwerks verfügt, die von einer Komponistin/einem Komponisten oder einem Verlag vergeben wird oder gemäß einem Nachschlagewerk oder Werkverzeichnis verwendet wird. Sie gibt meist Aufschluss über die chronologische Reihenfolge der Komposition innerhalb eines Gesamtwerks. @de
toolkit definition: Et musikalsk verk som har en identifikator for verk som er en numerisk betegnelse som er angitt fra en liste over verk av en komponist som indikerer kronologisk rekkefølge over komposisjoner. @no
toolkit definition: Musikværk, som har en identifikator for værk, som er en numerisk betegnelse, tildelt udfra en liste over en komponists værker, som angiver den kronologiske rækkefølge for kompositionen. @da
toolkit definition: Muusikateos, millel on teose identifikaatoriks muusikateose numbriline tähistus, mis on võetud helilooja teoste nimestikust ja näitab heliteose kronoloogilist järjestust. @et
toolkit definition: Mūzikas darbs, kam ir darba identifikators, kas piešķirts no komponista darbu saraksta, norādot kompozīcijas hronoloģisko secību. @lv
toolkit definition: Obra que té una designació numèrica d’obra musical que s’assigna a partir d’una llista d’obres d’un compositor indicant l’ordre cronològic de composició. @ca
toolkit definition: Teos, jolla on musiikkiteoksen numeerinen määrite, joka on sävellykset aikajärjestyksessä esittävästä säveltäjän teosluettelosta otettu numerointi. @fi
toolkit definition: Un'opera musicale che ha un identificatore per l'opera che è una designazione numerica assegnata da una lista di opere di un compositore che indica l'ordine cronologico di composizione. @it
toolkit definition: Œuvre qui possède une désignation numérique d’une œuvre musicale attribuée à partir d’une liste des œuvres d’un compositeur indiquant l’ordre chronologique de composition. @fr
toolkit definition: عمل له رمز رقمي لعمل موسيقي خُصص له من قائمة أعمال مؤلف موسيقي، يوضح الترتيب الزمنى للقطع الموسيقية. @ar
toolkit definition: 有根据作曲者作品列表分配、表示作曲时间顺序的音乐作品的数字标识的一种作品 @zh-hans
toolkit label: Beste numarası @tr
toolkit label: Opus-Nummer von @de
toolkit label: ir opusa numurs @lv
toolkit label: numero di opus di @it
toolkit label: numéro d’opus de @fr
toolkit label: número d’opus de @ca
toolkit label: oopuse number teoses @et
toolkit label: opus number of
toolkit label: opusnumero teokselle @fi
toolkit label: opusnummer for @da
toolkit label: opusnummer van @nl
toolkit label: opusszáma: @hu
toolkit label: رقم القطعة الموسيقية لـ @ar
toolkit label: ……的作品号 @zh-hans
has subproperty: P80120
lexical alias: opusNumberOf.en
status: Published
type: Property
domain: C10012
label: er opusnummer for @da
label: est un numéro d’opus de @fr
label: ir opusa numurs @lv
label: is opusnummer van @nl
label: ist Opus-Nummer von @de
label: oopuse number teoses @et
label: opus numarasıdır @tr
label: opusnumero teokselle @fi
label: opusszáma a következőnek: @hu
label: è numero di opus di @it
label: és número d’opus de @ca
label: هو رقم القطعة الموسيقية لـ @ar
label: 是……的作品号 @zh-hans
sub property of: is numeric designation of musical work of
definition: Bir ismi, bir bestecinin bestenin kronolojik sırasını gösteren eserler listesinden atanan sayısal bir müzik eseri atamasına sahip bir eserle ilişkilendirir. @tr
definition: Correla un nomen a un'opera musicale che ha un identificatore per l'opera che è una designazione numerica assegnata da una lista di opere di un compositore che indica l'ordine cronologico di composizione. @it
definition: Hozzákapcsol egy noment egy műhöz, amely rendelkezik egy a zeneszerző műveinek jegyzékéből vett olyan zenemű-azonosítóval, amely egy számjelzéssel jelzi a kompozíció kronológiai sorrendjét. @hu
definition: Liittää nomenin teokseen, jolla on musiikkiteoksen numeerinen määrite, joka on sävellykset aikajärjestyksessä esittävästä säveltäjän teosluettelosta otettu numerointi. @fi
definition: Met un nomen en relation avec une œuvre qui possède une désignation numérique d’une œuvre musicale attribuée à partir d’une liste des œuvres d’un compositeur indiquant l’ordre chronologique de composition. @fr
definition: Relaciona un nomen amb una obra que té una designació numèrica d’obra musical que s’assigna a partir d’una llista d’obres d’un compositor indicant l’ordre cronològic de composició. @ca
definition: Relateert een nomen aan een werk dat een numerieke aanduiding van muziekwerk heeft die is toegekend uit een lijst van werken van een componist die de chronologische volgorde van compositie aangeeft. @nl
definition: Relaterer et nomen til et musikalsk verk som har en identifikator for verk som er en numerisk betegnelse som er angitt fra en liste over verk av en komponist som indikerer kronologisk rekkefølge over komposisjoner. @no
definition: Relaterer et nomen til et musikværk, som har en identifikator for værk, som er en numerisk betegnelse, tildelt udfra en liste over en komponists værker, som angiver den kronologiske rækkefølge for kompositionen. @da
definition: Relates a nomen to a work that has a numeric designation of musical work that is assigned from a list of works of a composer indicating chronological order of composition.
definition: Sasaista nomenu ar darbu, kas ir mūzikas darbs, kam ir darba identifikators, kas piešķirts no komponista darbu saraksta, norādot kompozīcijas hronoloģisko secību. @lv
definition: Seostab nomen'i muusikateosega, millel on teose identifikaatoriks muusikateose numbriline tähistus, mis on võetud helilooja teoste nimestikust ja näitab heliteose kronoloogilist järjestust. @et
definition: Setzt ein Nomen in Beziehung zu einem Werk, das über eine numerische Bezeichnung eines Musikwerks verfügt, die von einer Komponistin/einem Komponisten oder einem Verlag vergeben wird oder gemäß einem Nachschlagewerk oder Werkverzeichnis verwendet wird. Sie gibt meist Aufschluss über die chronologische Reihenfolge der Komposition innerhalb eines Gesamtwerks. @de
definition: يربط تسمية بعمل له رمز رقمي لعمل موسيقي خُصص له من قائمة أعمال مؤلف موسيقي، يوضح الترتيب زمنى للقطع الموسيقية. @ar
definition: 将一个命名与有根据作曲者作品列表分配、表示作曲时间顺序的音乐作品的数字标识的一种作品关联起来。 @zh-hans

is serial number of musical work of
has element type: 2
toolkit definition: A work that has a numeric designation of musical work that is assigned by a composer or a reference source that indicates a sequence of musical works that share the same title or that share the same title and the same representative medium of performance.
toolkit definition: Bir besteci veya bir referans kaynağı tarafından aynı adı paylaşan veya aynı adı ve aynı temsili icra ortamını paylaşan bir dizi müzik eserini belirten sayısal bir tanımlamaya sahip müzik eseri. @tr
toolkit definition: Een werk dat een numerieke aanduiding voor muziekwerk heeft, die is toegekend door een componist of een naslagwerk die een volgorde van muziekwerken aangeeft die dezelfde titel delen en hetzelfde representatieve medium van uitvoering. @nl
toolkit definition: Egy mű, amely rendelkezik egy zeneszerző vagy egy irodalomjegyzékben szereplő forrás által hozzárendelt zenemű-számjelzéssel, amely az olyan zeneművek sorrendjét jelöli, amelyek azonos címűek, vagy azonos mind a címük mind a jellegzetes előadásmédiumuk. @hu
toolkit definition: Ein Werk, das über eine numerische Bezeichnung eines Musikwerks verfügt, die von einer Komponistin/einem Komponisten vergeben oder aus einem Nachschlagewerk entnommen wird und auf eine Folge von Musikwerken hinweist, die den gleichen Titel oder den gleichen Titel und die gleiche repräsentative Besetzung haben. @de
toolkit definition: Et musikalsk verk som har en numerisk betegnelse for musikalsk verk som er angitt av en komponist eller en referansekilde som indikerer en sekvens av musikalske verk som har samme tittel eller har samme tittel og den samme representative besetningen. @no
toolkit definition: Musikværk, som har en numerisk betegnelse for musikværk, angivet af en komponist eller en referencekilde, som angiver en sekvens af musikværk, som deler samme titel, eller som deler samme titel og samme repræsentative besætning. @da
toolkit definition: Muusikateos, millel on numbriline tähistus, mille on andnud helilooja või mis on antud teatmeallikas. Järjenumber näitab selliste muusikateoste järjestust, mis kannavad ühesugust pealkirja või ühesugust pealkirja koos iseloomuliku esituskoosseisuga. @et
toolkit definition: Mūzikas darbs, kam ir komponista vai uzziņu avota piešķirts muzikas darba numerācijas apzīmējums un kurš norāda uz vienāda nosaukuma vai vienāda oriģinālā izpildījuma veida mūzikas darbu secību. @lv
toolkit definition: Obra que té una designació numèrica d’obra musical que és assignada per un compositor o una font de referència que indica una seqüència d’obres musicals que comparteixen el mateix títol o que comparteixen el mateix títol i el mateix repartiment d’execució representatiu. @ca
toolkit definition: Teos, jolla on musiikkiteoksen numeerinen määrite, joka on säveltäjän antama tai tietolähteestä otettu. Määrite ilmaisee saman nimekkeen tai saman nimekkeen ja saman edustavan esityskokoonpanon jakavien musiikkiteosten järjestystä. @fi
toolkit definition: Un'opera musicale che ha un identificatore per l'opera che è una designazione numerica assegnata da un compositore o da una fonte di reference che indica una sequernza di opere musicali che condividono lo stesso titolo o che condividono lo stesso titolo e lo stesso mezzo d'interpretazione rappresentativo. @it
toolkit definition: Œuvre qui possède une désignation numérique d’une œuvre musicale attribuée par un compositeur ou une source de référence et indiquant une séquence des œuvres musicales ayant le même titre ou ayant le même titre et la même distribution d’exécution représentative. @fr
toolkit definition: عمل له رمز رقمي لعمل موسيقى خصصه له ملحن أو مصدر مرجعي، يوضح تسلسل أعمال موسيقية لها العنوان نفسه أو لها العنوان ووسيط الأداء نفسه. @ar
toolkit definition: 由作曲者或参考信息源分配、表示有同样题名或者同样题名和同样表演表现媒介的音乐作品序列的音乐作品的数字标识的一种作品 @zh-hans
toolkit label: Laufende Nummer eines Musikwerks von @de
toolkit label: ir mūzikas darba kārtas numurs @lv
toolkit label: järjestysnumero musiikkiteokselle @fi
toolkit label: muusikateose järjenumber teoses @et
toolkit label: müzik eserinin seri numarası @tr
toolkit label: numero seriale di opera musicale di @it
toolkit label: numéro d’ordre d’une œuvre musicale de @fr
toolkit label: número d’ordre d’una obra musical de @ca
toolkit label: serial number of musical work of
toolkit label: serienummer for musikalsk verk for @no
toolkit label: serienummer for musikværk af @da
toolkit label: serienummer van muziekwerk van @nl
toolkit label: sorozatszáma a következő zeneműnek: @hu
toolkit label: رقم مسلسل لعمل موسيقى لـ @ar
toolkit label: ……的音乐作品序列号 @zh-hans
has subproperty: P80121
lexical alias: serialNumberOfMusicalWorkOf.en
status: Published
type: Property
domain: C10012
label: er serienummer for musikalsk verk for @no
label: er serienummer for musikværk af @da
label: est un numéro d’ordre d’une œuvre musicale de @fr
label: ir mūzikas darba kārtas numurs @lv
label: is serienummer van muziekwerk van @nl
label: ist laufende Nummer eines Musikwerks von @de
label: järjestysnumero musiikkiteokselle @fi
label: muusikateose järjenumber teoses @et
label: müzik eserinin seri numarası @tr
label: sorozatszáma a következő zeneműnek: @hu
label: è numero seriale di opera musicale di @it
label: és número d’ordre d’una obra musical de @ca
label: هو رقم مسلسل لعمل موسيقى لـ @ar
label: 是……的音乐作品序列号 @zh-hans
sub property of: is numeric designation of musical work of
definition: Bir ismi, bir besteci veya aynı başlığı paylaşan veya aynı başlığı ve aynı temsili icra aracını paylaşan bir dizi müzik eserini belirten bir referans kaynağı tarafından atanan bir müzik eserinin sayısal gösterimine sahip bir eserle ilişkilendirir. @tr
definition: Correla un nomen a un'opera musicale che ha un identificatore per l'opera che è una designazione numerica assegnata da un compositore o da una fonte di reference che indica una sequernza di opere musicali che condividono lo stesso titolo o che condividono lo stesso titolo e lo stesso mezzo d'interpretazione rappresentativo. @it
definition: Hozzákapcsol egy noment egy műhöz, amely rendelkezik egy zeneszerző vagy egy irodalomjegyzékben szereplő forrás által hozzárendelt zenemű-számjelzéssel, amely az olyan zeneművek sorrendjét jelöli, amelyek azonos címűek, vagy azonos mind a címük mind a jellegzetes előadásmédiumuk. @hu
definition: Liittää nomenin teokseen, jolla on musiikkiteoksen numeerinen määrite, joka on säveltäjän antama tai tietolähteestä otettu. Määrite ilmaisee saman nimekkeen tai saman nimekkeen ja saman edustavan esityskokoonpanon jakavien musiikkiteosten järjestystä. @fi
definition: Met un nomen en relation avec une œuvre qui possède une désignation numérique d’une œuvre musicale attribuée par un compositeur ou une source de référence et indiquant une séquence des œuvres musicales ayant le même titre ou ayant le même titre et la même distribution d’exécution représentative. @fr
definition: Relaciona un nomen amb una obra que té una designació numèrica d’obra musical que és assignada per un compositor o una font de referència que indica una seqüència d’obres musicals que comparteixen el mateix títol o que comparteixen el mateix títol i el mateix repartiment d’execució representatiu. @ca
definition: Relateert een nomen aan een werk dat een numerieke aanduiding voor muziekwerk heeft, die is toegekend door een componist of een naslagwerk die een volgorde van muziekwerken aangeeft die dezelfde titel delen en hetzelfde representatieve medium van uitvoering. @nl
definition: Relaterer et nomen til et musikalsk verk som har en numerisk betegnelse for musikalsk verk som er angitt av en komponist eller en referansekilde som indikerer en sekvens av musikalske verk som har samme tittel eller har samme tittel og den samme representative besetningen. @no
definition: Relaterer et nomen til et musikværk, som har en numerisk betegnelse for musikværk, angivet af en komponist eller en referencekilde, som angiver en sekvens af musikværk, som deler samme titel, eller som deler samme titel og samme repræsentative besætning. @da
definition: Relates a nomen to a work that has a numeric designation of musical work that is assigned by a composer or a reference source that indicates a sequence of musical works that share the same title or that share the same title and the same representative medium of performance.
definition: Sasaista nomenu ar darbu, kas ir mūzikas darbs, kam ir komponista vai uzziņu avota piešķirts muzikas darba numerācijas apzīmējums un kurš norāda uz vienāda nosaukuma vai vienāda oriģinālā izpildījuma veida mūzikas darbu secību. @lv
definition: Seostab nomen'i muusikateosega, millel on numbriline tähistus, mille on andnud helilooja või mis on antud teatmeallikas. Järjenumber näitab selliste muusikateoste järjestust, mis kannavad ühesugust pealkirja või ühesugust pealkirja koos iseloomuliku esituskoosseisuga. @et
definition: Setzt ein Nomen in Beziehung zu einem Werk, das über eine numerische Bezeichnung eines Musikwerks verfügt, die von einer Komponistin/einem Komponisten vergeben oder aus einem Nachschlagewerk entnommen wird und auf eine Folge von Musikwerken hinweist, die den gleichen Titel oder den gleichen Titel und die gleiche repräsentative Besetzung haben. @de
definition: يربط تسمية بعمل موسيقى له رمز رقمي لعمل موسيقي خصصه له ملحن أو مصدر مرجعي، يوضح تسلسل أعمال موسيقية لها العنوان نفسه أو لها العنوان ووسيط الأداء نفسه. @ar
definition: 将一个命名与由作曲者或参考信息源分配、表示有同样题名或者同样题名和同样表演表现媒介的音乐作品序列的音乐作品的数字标识的一种作品关联起来。 @zh-hans

is thematic index number of
has element type: 2
toolkit definition: A work that has a numeric designation of musical work that is assigned from a list of works of a composer, usually arranged in chronological order or by categories, with the theme given for each composition or for each section of large compositions.
toolkit definition: Bir bestecinin genellikle kronolojik sıraya veya kategorilere göre düzenlenmiş eserlerinin listesinden atanan, her beste veya büyük bestelerin her bölümü için tema verilen müzik eserinin sayısal tanımına sahip olan bir eser. @tr
toolkit definition: Een werk dat een numerieke aanduiding voor muziekwerk heeft die is toegekend uit een lijst van werken van een componist, meestal chronologisch gerangschikt of in categorieën, met het thema gegeven voor elke compositie of voor elke sectie van een grote compositie. @nl
toolkit definition: Egy mű, amely rendelkezik egy zeneszerző műveinek a komponálás kronológiai sorrendje vagy kategóriák szerint rendezett jegyzékéből hozzárendelt zenemű-számjelzéssel, amely minden zeneművet vagy a nagyobb zeneművek egyes szakaszait témával látja el. @hu
toolkit definition: Ein Werk, das über eine numerische Bezeichnung eines Musikwerks aus einem Werkverzeichnis einer Komponistin/eines Komponisten verfügt, das in einer chronologischen Reihenfolge oder nach Kategorien angeordnet ist. Zusätzlich können darin Notenzitate in Form von Incipits oder thematischem Material für jede Komposition oder für jede Passage längerer Kompositionen aufgeführt sein. @de
toolkit definition: Et musikalsk verk som har en identifikator for verk som er en numerisk betegnelse som er angitt fra en liste over verk av en komponist, vanligvis arrangert i kronologisk rekkefølge eller i kategorier, med gitte tema for hver komposisjon eller for hver del av store komposisjoner. @no
toolkit definition: Musikværk, som har en identifikator for værk, som er en numerisk betegnelse, tildelt fra en liste over værker af en komponist, sædvanligvis arrangeret i kronologisk rækkefølge eller efter kategorier, med givet tema for hver komposition eller for hver del af store kompositioner. @da
toolkit definition: Muusikateos, millel on teose identifikaatoriks muusikateose numbriline tähistus, mis on võetud helilooja teoste nimestikust. Nimestik on tavaliselt korrastatud kronoloogiliselt või žanrite kaupa ja sisaldab iga heliteose või suuremate teoste puhul iga osa teemat. @et
toolkit definition: Mūzikas darbs, kam ir darba numerācijas apzīmējums, kuru piešķirsaskaņā ar komponista darbu sarakstu, kas parasti ir sakārtots kategorijās vai hronoloģiskā secībā, katrai kompozīcijai vai lielas kompozīcijas katrai daļai piešķirot tematisko apzīmējumu. @lv
toolkit definition: Obra que té una designació numèrica d’obra que s’assigna a partir d’una llista d’obres d’un compositor, ordenades normalment per ordre cronològic o per categories, amb el tema de cada composició o, en el cas de composicions àmplies, de cada secció. @ca
toolkit definition: Teos, jolla on musiikkiteoksen numeerinen määrite, joka on otettu säveltäjän teosluettelosta. Teosluettelo on tavallisesti järjestetty aikajärjestykseen tai kategorioittain sisältäen teeman jokaisesta sävellyksestä tai laajan sävellyksen jokaisesta osasta. @fi
toolkit definition: Un'opera musiclae che ha un identificatore per l'opera che è una designazione numerica assegnata da una lista di opere di un compostiore, di solito organizzata in ordine cronologico o per categorie, con il tema dato per ciascuna composizione o per ciascuna sezione di composizioni ampie. @it
toolkit definition: Œuvre qui possède une désignation numérique d’une œuvre musicale attribuée à partir d’une liste des œuvres d’un compositeur dans laquelle celles-ci sont ordinairement classées par ordre chronologique ou par catégories, avec le thème de chaque composition ou de chaque section d’une composition dans le cas des compositions d’envergure. @fr
toolkit definition: عمل له رمز رقمي خُصص له من قائمة أعمال مؤلف موسيقى، تُرتب عادة ترتيبًا زمنيًا أو حسب الفئة، مع موضوع كل لحن أو موضوع كل قطعة من القطع الموسيقية الكبيرة. @ar
toolkit definition: 有根据作曲者作品列表分配、通常按年代顺序或类别顺序排列、并有每个谱曲或更大谱曲每个部分的主题的音乐作品的数字标识的一种作品 @zh-hans
toolkit label: Werkverzeichnisnummer von @de
toolkit label: ir skaņdarbu rādītāja numurs @lv
toolkit label: numero di catalogo tematico di @it
toolkit label: numéro de catalogue thématique de @fr
toolkit label: número d’índex temàtic de @ca
toolkit label: temaatilise kataloogi number teoses @et
toolkit label: temaattisen teosluettelon numero teokselle @fi
toolkit label: tematik dizin numarası @tr
toolkit label: tematikus indexszáma: @hu
toolkit label: tematisk indeksnummer for @da
toolkit label: thematic index number of
toolkit label: thematisch indexnummer van @nl
toolkit label: رقم كشاف موضوعي لـ @ar
toolkit label: ……的主题索引号 @zh-hans
has subproperty: P80122
lexical alias: thematicIndexNumberOf.en
status: Published
type: Property
domain: C10012
label: er tematisk indeksnummer for @da
label: est un numéro de catalogue thématique de @fr
label: ir skaņdarbu rādītāja numurs @lv
label: is thematisch indexnummer van @nl
label: ist Werkverzeichnisnummer von @de
label: konu ile ilgili dizin numarası @tr
label: temaatilise kataloogi number teoses @et
label: temaattisen teosluettelon numero teokselle @fi
label: tematikus indexszáma a következőnek: @hu
label: è numero di catalogo tematico di @it
label: és número d’índex temàtic de @ca
label: هو رقم كشاف موضوعي لـ @ar
label: 是……的主题索引号 @zh-hans
sub property of: is numeric designation of musical work of
definition: Bir ismi, bir bestecinin eserleri listesinden atanan, genellikle kronolojik sırayla veya kategorilere göre düzenlenmiş, her beste veya büyük bestelerin her bölümü için verilen tema ile sayısal bir müzik eseri tanımına sahip bir eserle ilişkilendirir. @tr
definition: Correla un nomen a un'opera musiclae che ha un identificatore per l'opera che è una designazione numerica assegnata da una lista di opere di un compostiore, di solito organizzata in ordine cronologico o per categorie, con il tema dato per ciascuna composizione o per ciascuna sezione di composizioni ampie. @it
definition: Hozzákapcsol egy noment egy műhöz, amely rendelkezik egy zeneszerző műveinek a komponálás kronológiai sorrendje vagy kategóriák szerint rendezett jegyzékéből hozzárendelt zenemű-számjelzéssel, amely minden zeneművet vagy a nagyobb zeneművek egyes szakaszait témával látja el. @hu
definition: Liittää nomenin teokseen, jolla on musiikkiteoksen numeerinen määrite, joka on otettu säveltäjän teosluettelosta. Teosluettelo on tavallisesti järjestetty aikajärjestykseen tai kategorioittain sisältäen teeman jokaisesta sävellyksestä tai laajan sävellyksen jokaisesta osasta. @fi
definition: Met un nomen en relation avec une œuvre qui possède une désignation numérique d’une œuvre musicale attribuée à partir d’une liste des œuvres d’un compositeur dans laquelle celles-ci sont ordinairement classées par ordre chronologique ou par catégories, avec le thème de chaque composition ou de chaque section d’une composition dans le cas des compositions d’envergure. @fr
definition: Relaciona un nomen amb una obra que té una designació numèrica d’obra que s’assigna a partir d’una llista d’obres d’un compositor, ordenades normalment per ordre cronològic o per categories, amb el tema de cada composició o, en el cas de composicions àmplies, de cada secció. @ca
definition: Relateert een nomen aan een werk dat een numerieke aanduiding voor muziekwerk heeft die is toegekend uit een lijst van werken van een componist, meestal chronologisch gerangschikt of in categorieën, met het thema gegeven voor elke compositie of voor elke sectie van een grote compositie. @nl
definition: Relaterer et nomen til et musikalsk verk som har en identifikator for verk som er en numerisk betegnelse som er angitt fra en liste over verk av en komponist, vanligvis arrangert i kronologisk rekkefølge eller i kategorier, med gitte tema for hver komposisjon eller for hver del av store komposisjoner. @no
definition: Relaterer et nomen til et musikværk, som har en identifikator for værk, som er en numerisk betegnelse, tildelt fra en liste over værker af en komponist, sædvanligvis arrangeret i kronologisk rækkefølge eller efter kategorier, med givet tema for hver komposition eller for hver del af store kompositioner. @da
definition: Relates a nomen to a work that has a numeric designation of musical work that is assigned from a list of works of a composer, usually arranged in chronological order or by categories, with the theme given for each composition or for each section of large compositions.
definition: Sasaista nomenu ar darbu, kas ir mūzikas darbs, kam ir darba numerācijas apzīmējums, kuru piešķirsaskaņā ar komponista darbu sarakstu, kas parasti ir sakārtots kategorijās vai hronoloģiskā secībā, katrai kompozīcijai vai lielas kompozīcijas katrai daļai piešķirot tematisko apzīmējumu. @lv
definition: Seostab nomen'i muusikateosega, millel on teose identifikaatoriks muusikateose numbriline tähistus, mis on võetud helilooja teoste nimestikust. Nimestik on tavaliselt korrastatud kronoloogiliselt või žanrite kaupa ja sisaldab iga heliteose või suuremate teoste puhul iga osa teemat. @et
definition: Setzt ein Nomen in Beziehung zu einem Werk, das über eine numerische Bezeichnung eines Musikwerks aus einem Werkverzeichnis einer Komponistin/eines Komponisten verfügt, das in einer chronologischen Reihenfolge oder nach Kategorien angeordnet ist. Zusätzlich können darin Notenzitate in Form von Incipits oder thematischem Material für jede Komposition oder für jede Passage längerer Kompositionen aufgeführt sein. @de
definition: يربط تسمية بعمل موسيقى له رمز رقمي، خُصص له من قائمة أعمال ملحن، تُرتب عادة ترتيبًا زمنيًا أو حسب الفئة مع موضوع كل لحن أو موضوع كل قطعة من القطع الموسيقية الكبيرة. @ar
definition: 将一个命名与有根据作曲者作品列表分配、通常按年代顺序或类别顺序排列、并有每个谱曲或更大谱曲每个部分的主题的音乐作品的数字标识的一种作品关联起来。 @zh-hans

is earlier title proper of (Deprecated)
has subproperty: P80123
status: Deprecated
type: Property

is later title proper of (Deprecated)
has subproperty: P80124
lexical alias: laterTitleProperOf.en
status: Deprecated
type: Property

is title of series of
has element type: 2
toolkit definition: A manifestation that has a title that identifies a series to which a manifestation belongs.
toolkit definition: Bir gösterimin ait olduğu bir diziyi tanımlayan bir başlığa sahip bir gösterim. @tr
toolkit definition: Een manifestatie die een titel heeft die een reeks identificeert waartoe een manifestatie behoort. @nl
toolkit definition: Egy megjelenési forma, amelynek van egy olyan címe, amely azonosítja azt a sorozatot, amelyhez a megjelenési forma tartozik. @hu
toolkit definition: Eine Manifestation, die über einen Titel verfügt, der die Reihe identifiziert, zu der eine Manifestation gehört. @de
toolkit definition: En manifestasjon som har en tittel som identifiserer en serie som en manifestasjon tilhører. @no
toolkit definition: Kehastus, millel on pealkiri, mis identifitseerib seeria, millesse kehastus kuulub. @et
toolkit definition: Manifestaatio, jonka nimeke ilmaisee sarjan, johon manifestaatio kuuluu. @fi
toolkit definition: Manifestació que té un títol que identifica una col·lecció a la qual pertany una manifestació. @ca
toolkit definition: Manifestation qui possède un titre identifiant une collection à laquelle appartient une manifestation. @fr
toolkit definition: Manifestation, som har en titel, som identificerer en serie, hvortil en manifestation tilhører. @da
toolkit definition: Manifestācija, kam ir nosaukums, kas identificē sēriju, kurai pieder manifestācija. @lv
toolkit definition: Una manifestazione che ha un titolo che identifica una serie a cui la manifestazione appartiene. @it
toolkit definition: تجسيدة لها عنوان يميز سلسلة تنتمى إليها تجسيدة. @ar
toolkit definition: 有识别一种载体表现所属于的一种丛编的题名的一种载体表现 @zh-hans
toolkit label: Titel einer Reihe von @de
toolkit label: dizinin başlığı @tr
toolkit label: ir sērijas nosaukums @lv
toolkit label: reekstitel van @nl
toolkit label: sarjan nimeke manifestaatiolle @fi
toolkit label: seeriapealkiri kehastuses @et
toolkit label: serietittel for @no
toolkit label: sorozati címe: @hu
toolkit label: titel på serie af @da
toolkit label: title of series of
toolkit label: titolo di serie di @it
toolkit label: titre de collection de @fr
toolkit label: títol de col·lecció de @ca
toolkit label: عنوان سلسلة لـ @ar
toolkit label: ……的丛编的题名 @zh-hans
has subproperty: is title proper of subseries of (Deprecated)
has subproperty: is parallel title of series of
has subproperty: P80125
lexical alias: titleOfSeriesOf.en
status: Published
type: Property
domain: C10012
label: er serietittel for @no
label: er titel på serie af @da
label: est un titre de collection de @fr
label: ir sērijas nosaukums @lv
label: is reekstitel van @nl
label: ist Titel einer Reihe von @de
label: sarjan nimeke manifestaatiolle @fi
label: seeriapealkiri kehastuses @et
label: serisinin başlığı @tr
label: sorozati címe a következőnek: @hu
label: è titolo di serie di @it
label: és títol de col·lecció de @ca
label: هو عنوان سلسلة لـ @ar
label: 是……的丛编的题名 @zh-hans
sub property of: is title of manifestation of
definition: Bir ismi, bir gösterimin ait olduğu bir diziyi tanımlayan bir başlığa sahip bir gösterimle ilişkilendirir. @tr
definition: Correla un nomen a una manifestazione che ha un titolo che identifica una serie a cui la manifestazione appartiene. @it
definition: Hozzákapcsol egy noment egy megjelenési formához, amelynek van egy olyan címe, amely azonosítja azt a sorozatot, amelyhez a megjelenési forma tartozik. @hu
definition: Liittää nomenin manifestaatioon, jonka nimeke ilmaisee sarjan, johon manifestaatio kuuluu. @fi
definition: Met un nomen en relation avec une manifestation qui possède un titre identifiant une collection à laquelle appartient une manifestation. @fr
definition: Relaciona un nomen amb una manifestació que té un títol que identifica una col·lecció a la qual pertany una manifestació. @ca
definition: Relateert een nomen aan een manifestatie die een titel heeft die een reeks identificeert waartoe een manifestatie behoort. @nl
definition: Relaterer et nomen til en manifestasjon som har en tittel som identifiserer en serie som en manifestasjon tilhører. @no
definition: Relaterer et nomen til en manifestation, som har en titel, som identificerer en serie, hvortil en manifestation tilhører. @da
definition: Relates a nomen to a manifestation that has a title that identifies a series to which a manifestation belongs.
definition: Sasaista nomenu ar manifestāciju, kam ir nosaukums, kas identificē sēriju, kurai pieder manifestācija. @lv
definition: Seostab nomen'i kehastusega, millel on pealkiri, mis identifitseerib seeria, millesse kehastus kuulub. @et
definition: Setzt ein Nomen in Beziehung zu einer Manifestation, die über einen Titel verfügt, der die Reihe identifiziert, zu der eine Manifestation gehört. @de
definition: يربط تسمية بتجسيدة لها عنوان يُميز سلسلة تنتمى إليها تجسيدة. @ar
definition: 将一个命名与有识别一种载体表现所属于的一种丛编的题名的一种载体表现关联起来。 @zh-hans

is title proper of subseries of (Deprecated)
toolkit definition: A manifestation of an issue of a subseries that has a name of series appearing on it. (Deprecated)
toolkit label: title proper of subseries of (Deprecated)
has subproperty: is parallel title proper of subseries of (Deprecated)
has subproperty: P80126
lexical alias: titleProperOfSubseriesOf.en
status: Deprecated
type: Property
domain: C10012
sub property of: is title of series of
definition: Relates a nomen to a manifestation of an issue of a subseries that has a name of series appearing on it. (Deprecated)

is parallel name of distributor of
has element type: 2
toolkit definition: A manifestation that has a name of distributor in another language or script.
toolkit definition: Başka bir dilde veya alfabede dağıtıcı adına sahip bir gösterim. @tr
toolkit definition: Een manifestatie die een naam van distributeur heeft in een andere taal of schrift. @nl
toolkit definition: Egy megjelenési forma, amely terjesztőjének van neve más nyelven vagy írásrendszerben. @hu
toolkit definition: Eine Manifestation, die einen Vertriebsnamen in einer anderen Sprache oder einer anderen Schrift hat. @de
toolkit definition: En manifestasjon som har et navn på distributør på et annet språk eller i et annet skriftsystem. @no
toolkit definition: Kehastus, millel on levitaja nimi teises keeles või kirjasüsteemis. @et
toolkit definition: Manifestaatio, jonka jakelijan nimi on toisella kielellä tai kirjoitusjärjestelmällä. @fi
toolkit definition: Manifestació que té un nom de distribuïdor en una altra llengua o escriptura. @ca
toolkit definition: Manifestation qui possède un nom de diffuseur ou de distributeur dans une autre langue ou écriture. @fr
toolkit definition: Manifestation, som har et navn på distributør på et andet sprog eller skriftsystem. @da
toolkit definition: Manifestācija, kam ir izplatītāja vārds/nosaukums citā valodā vai rakstībā. @lv
toolkit definition: Una manifestazione che ha un nome di distributore in un'altra lingua o scrittura. @it
toolkit definition: تجسيدة لها اسم موزع في لغة أو في نص آخر. @ar
toolkit definition: 有用另一种语言或文字的发行者名称的一种载体表现 @zh-hans
toolkit label: Paralleler Vertriebsname von @de
toolkit label: dağıtıcısının paralel ismi @tr
toolkit label: forme parallèle d’un nom de diffuseur ou de distributeur de @fr
toolkit label: ir izplatītāja paralēlais vārds/nosaukums @lv
toolkit label: levitaja rööpnimi kehastuses @et
toolkit label: nom paral·lel de distribuïdor de @ca
toolkit label: nome parallelo del distributore di @it
toolkit label: parallel name of distributor of
toolkit label: parallelle naam van distributeur van @nl
toolkit label: parallelt navn på distributør af @da
toolkit label: parallelt navn på distributør for @no
toolkit label: rinnakkainen jakelijan nimi manifestaatiolle @fi
toolkit label: terjesztő párhuzamos neve a következő: @hu
toolkit label: اسم مواز لموزع لـ @ar
toolkit label: ……的发行者的并列名称 @zh-hans
has subproperty: P80127
lexical alias: parallelNameOfDistributorOf.en
status: Published
type: Property
domain: C10012
label: dağıtımcısının paralel adıdır @tr
label: er parallelt navn på distributør af @da
label: er parallelt navn på distributør for @no
label: est une forme parallèle d’un nom de diffuseur ou de distributeur de @fr
label: ir izplatītāja paralēlais vārds/nosaukums @lv
label: is parallelle naam van distributeur van @nl
label: ist paralleler Vertriebsname von @de
label: levitaja rööpnimi kehastuses @et
label: rinnakkainen jakelijan nimi manifestaatiolle @fi
label: terjesztő párhuzamos neve a következő: @hu
label: è nome parallelo del distributore di @it
label: és nom paral·lel de distribuïdor de @ca
label: هو اسم مواز لموزع لـ @ar
label: 是……的发行者的并列名称 @zh-hans
sub property of: is name of distributor of
definition: Bir isimı, başka bir dilde veya alfabede dağıtıcı adına sahip bir gösterimle ilişkilendirir. @tr
definition: Correla un nomen a una manifestazione che ha un nome di distributore in un'altra lingua o scrittura. @it
definition: Hozzákapcsol egy noment egy megjelenési formához, amely terjesztőjének van neve más nyelven vagy írásrendszerben. @hu
definition: Liittää nomenin manifestaatioon, jonka jakelijan nimi on toisella kielellä tai kirjoitusjärjestelmällä. @fi
definition: Met un nomen en relation avec une manifestation qui possède un nom de diffuseur ou de distributeur dans une autre langue ou écriture. @fr
definition: Relaciona un nomen amb una manifestació que té un nom de distribuïdor en una altra llengua o escriptura. @ca
definition: Relateert een nomen aan een manifestatie die een naam van distributeur heeft in een andere taal of schrift. @nl
definition: Relaterer et nomen til en manifestasjon som har et navn på distributør på et annet språk eller i et annet skriftsystem. @no
definition: Relaterer et nomen til en manifestation, som har et navn på distributør på et andet sprog eller skriftsystem. @da
definition: Relates a nomen to a manifestation that has a name of distributor in another language or script.
definition: Sasaista nomenu ar manifestāciju, kam ir izplatītāja vārds/nosaukums citā valodā vai rakstībā. @lv
definition: Seostab nomen'i kehastusega, millel on levitaja nimi teises keeles või kirjasüsteemis. @et
definition: Setzt ein Nomen in Beziehung zu einer Manifestation, die einen Vertriebsnamen in einer anderen Sprache oder einer anderen Schrift hat. @de
definition: يربط تسمية بتجسيدة لها اسم موزع في لغة أو في نص آخر. @ar
definition: 将一个命名与有用另一种语言或文字的发行者名称的一种载体表现关联起来。 @zh-hans

is parallel name of manufacturer of
has element type: 2
toolkit definition: A manifestation that has a name of manufacturer in another language or script.
toolkit definition: Başka bir dilde veya alfabede yapımcı adına sahip bir gösterim. @tr
toolkit definition: Een manifestatie die een naam van vervaardiger heeft in een andere taal of schrift. @nl
toolkit definition: Egy megjelenési forma, amely gyártójának van neve más nyelven vagy írásrendszerben. @hu
toolkit definition: Eine Manifestation, die einen Herstellernamen in einer anderen Sprache oder einer anderen Schrift hat. @de
toolkit definition: En manifestasjon som har et navn på tilvirker på et annet språk eller i et annet skriftsystem. @no
toolkit definition: Kehastus, millel on valmistaja nimi teises keeles või kirjasüsteemis. @et
toolkit definition: Manifestaatio, jonka valmistajan nimi on toisella kielellä tai kirjoitusjärjestelmällä. @fi
toolkit definition: Manifestació que té un nom de fabricant en una altra llengua o escriptura. @ca
toolkit definition: Manifestation qui possède un nom de fabricant dans une autre langue ou écriture. @fr
toolkit definition: Manifestation, som har et navn på producent på et andet sprog eller skriftsystem. @da
toolkit definition: Manifestācija, kam ir ražotāja vārds/nosaukums citā valodā vai rakstībā. @lv
toolkit definition: Una manifestazione che ha un nome di manifattore in un'altra lingua o scrittura. @it
toolkit definition: تجسيدة لها اسم صانع في لغة أو في نص آخر. @ar
toolkit definition: 有用另一种语言或文字的生产者名称的一种载体表现 @zh-hans
toolkit label: Paralleler Herstellername von @de
toolkit label: forme parallèle d’un nom de fabricant de @fr
toolkit label: gyártó párhuzamos neve a következő: @hu
toolkit label: imatlatçısının paralel ismi @tr
toolkit label: ir ražotāja paralēlais vārds/nosaukums @lv
toolkit label: nom paral·lel de fabricant de @ca
toolkit label: nome parallelo del manifattore di @it
toolkit label: parallel name of manufacturer of
toolkit label: parallelle naam van vervaardiger van @nl
toolkit label: parallelt navn på producent af @da
toolkit label: parallelt navn på tilvirker for @no
toolkit label: rinnakkainen valmistajan nimi manifestaatiolle @fi
toolkit label: valmistaja rööpnimi kehastuses @et
toolkit label: اسم مواز لصانع لـ @ar
toolkit label: ……的生产者的并列名称 @zh-hans
has subproperty: P80128
lexical alias: parallelNameOfManufacturerOf.en
status: Published
type: Property
domain: C10012
label: er parallelt navn på producent af @da
label: er parallelt navn på tilvirker for @no
label: est une forme parallèle d’un nom de fabricant de @fr
label: gyártó párhuzamos neve a következő: @hu
label: ir ražotāja paralēlais vārds/nosaukums @lv
label: is parallelle naam van vervaardiger van @nl
label: ist paralleler Herstellername von @de
label: rinnakkainen valmistajan nimi manifestaatiolle @fi
label: valmistaja rööpnimi kehastuses @et
label: è nome parallelo del manifattore di @it
label: és nom paral·lel de fabricant de @ca
label: üreticisinin paralel adıdır @tr
label: هو اسم مواز لصانع لـ @ar
label: 是……的生产者的并列名称 @zh-hans
sub property of: is name of manufacturer of
definition: Bir ismi, başka bir dilde veya alfabede üretici adına sahip bir gösterimle ilişkilendirir. @tr
definition: Correla un nomen a una manifestazione che ha un nome di manifattore in un'altra lingua o scrittura. @it
definition: Hozzákapcsol egy noment egy megjelenési formához, amely gyártójának van neve más nyelven vagy írásrendszerben. @hu
definition: Liittää nomenin manifestaatioon, jonka valmistajan nimi on toisella kielellä tai kirjoitusjärjestelmällä. @fi
definition: Met un nomen en relation avec une manifestation qui possède un nom de fabricant dans une autre langue ou écriture. @fr
definition: Relaciona un nomen amb una manifestació que té un nom de fabricant en una altra llengua o escriptura. @ca
definition: Relateert een nomen aan een manifestatie die een naam van vervaardiger heeft in een andere taal of schrift. @nl
definition: Relaterer et nomen til en manifestasjon som har et navn på tilvirker på et annet språk eller i et annet skriftsystem. @no
definition: Relaterer et nomen til en manifestation, som har et navn på producent på et andet sprog eller skriftsystem. @da
definition: Relates a nomen to a manifestation that has a name of manufacturer in another language or script.
definition: Sasaista nomenu ar manifestāciju, kam ir ražotāja vārds/nosaukums citā valodā vai rakstībā. @lv
definition: Seostab nomen'i kehastusega, millel on valmistaja nimi teises keeles või kirjasüsteemis. @et
definition: Setzt ein Nomen in Beziehung zu einer Manifestation, die einen Herstellernamen in einer anderen Sprache oder einer anderen Schrift hat. @de
definition: يربط تسمية بتجسيدة لها اسم صانع في لغة أو في نص آخر. @ar
definition: 将一个命名与有用另一种语言或文字的生产者名称的一种载体表现关联起来。 @zh-hans

is parallel name of producer of
has element type: 2
toolkit definition: A manifestation that has a name of producer in another language or script.
toolkit definition: Başka bir dilde veya alfabede üretici adına sahip bir gösterim. @tr
toolkit definition: Een manifestatie die een naam van producent heeft in een andere taal of schrift. @nl
toolkit definition: Egy megjelenési forma, amely előállítójának van neve más nyelven vagy írásrendszerben. @hu
toolkit definition: Eine Manifestation, die einen Erzeugernamen in einer anderen Sprache oder einer anderen Schrift hat. @de
toolkit definition: En manifestasjon som har et navn på produsent på et annet språk eller i et annet skriftsystem. @no
toolkit definition: Kehastus, millel on tootja nimi teises keeles või kirjasüsteemis. @et
toolkit definition: Manifestaatio, jonka tuottajan nimi on toisella kielellä tai kirjoitusjärjestelmällä. @fi
toolkit definition: Manifestació que té un nom de productor en una altra llengua o escriptura. @ca
toolkit definition: Manifestation qui possède un nom de producteur dans une autre langue ou écriture. @fr
toolkit definition: Manifestation, som har et navn på producer på et andet sprog eller skriftsystem. @da
toolkit definition: Manifestācija, kam ir izgatavotāja vārds/nosaukums citā valodā vai rakstībā. @lv
toolkit definition: Una manifestazione che ha un nome di produttore in un'altra lingua o scrittura @it
toolkit definition: تجسيدة لها اسم منتِج في لغة أو في نص آخر. @ar
toolkit definition: 有用另一种语言或文字的制作者名称的一种载体表现 @zh-hans
toolkit label: Paralleler Erzeugername von @de
toolkit label: Yapımcının paralel ismi @tr
toolkit label: forme parallèle d’un nom de producteur de @fr
toolkit label: ir izgatavotāja paralēlais vārds/nosaukums @lv
toolkit label: neve a következő előállítójának: @hu
toolkit label: nom paral·lel de productor de @ca
toolkit label: nome parallelo del produttore di @it
toolkit label: parallel name of producer of
toolkit label: parallelle naam van producent van @nl
toolkit label: parallelt navn på producer af @da
toolkit label: parallelt navn på produsent for @no
toolkit label: rinnakkainen tuottajan nimi manifestaatiolle @fi
toolkit label: tootja rööpnimi kehastuses @et
toolkit label: اسم مواز لمنتِج لـ @ar
toolkit label: ……的制作者的并列名称 @zh-hans
has subproperty: P80129
lexical alias: parallelNameOfProducerOf.en
status: Published
type: Property
domain: C10012
label: er parallelt navn på producer af @da
label: er parallelt navn på produsent for @no
label: est une forme parallèle d’un nom de producteur de @fr
label: ir izgatavotāja paralēlais vārds/nosaukums @lv
label: is parallelle naam van producent van @nl
label: ist paralleler Erzeugername von @de
label: neve a következő előállítójának: @hu
label: rinnakkainen tuottajan nimi manifestaatiolle @fi
label: tootja rööpnimi kehastuses @et
label: yapımcısının paralel adıdır @tr
label: è nome parallelo del produttore di @it
label: és nom paral·lel de productor de @ca
label: هو اسم موازِ لمنتج لـ @ar
label: 是……的制作者的并列名称 @zh-hans
sub property of: is name of producer of
definition: Bir ismi, başka bir dilde veya alfabede yapımcı adına sahip bir gösterimle ilişkilendirir. @tr
definition: Correla un nomen a una manifestazione che ha un nome di produttore in un'altra lingua o scrittura. @it
definition: Hozzákapcsol egy noment egy megjelenési formához, amely előállítójának van neve más nyelven vagy írásrendszerben. @hu
definition: Liittää nomenin manifestaatioon, jonka tuottajan nimi on toisella kielellä tai kirjoitusjärjestelmällä. @fi
definition: Met un nomen en relation avec une manifestation qui possède un nom de producteur dans une autre langue ou écriture. @fr
definition: Relaciona un nomen amb una manifestació que té un nom de productor en una altra llengua o escriptura. @ca
definition: Relateert een nomen aan een manifestatie die een naam van producent heeft in een andere taal of schrift. @nl
definition: Relaterer et nomen til en manifestasjon som har et navn på produsent på et annet språk eller i et annet skriftsystem. @no
definition: Relaterer et nomen til en manifestation, som har et navn på producer på et andet sprog eller skriftsystem. @da
definition: Relates a nomen to a manifestation that has a name of producer in another language or script.
definition: Sasaista nomenu ar manifestāciju, kam ir izgatavotāja vārds/nosaukums citā valodā vai rakstībā. @lv
definition: Seostab nomen'i kehastusega, millel on tootja nimi teises keeles või kirjasüsteemis. @et
definition: Setzt ein Nomen in Beziehung zu einer Manifestation, die einen Erzeugernamen in einer anderen Sprache oder einer anderen Schrift hat. @de
definition: يربط تسمية بتجسيدة لها اسم منتِج في لغة أو في نص آخر. @ar
definition: 将一个命名与有用另一种语言或文字的制作者名称的一种载体表现关联起来。 @zh-hans

is parallel name of publisher of
has element type: 2
toolkit definition: A manifestation that has a name of publisher in another language or script.
toolkit definition: Başka bir dilde veya alfabede yayımcı adına sahip bir gösterim. @tr
toolkit definition: Een manifestatie die een naam van uitgever heeft in een andere taal of schrift. @nl
toolkit definition: Egy megjelenési forma, amelynek van egy kiadóneve más nyelven vagy írásrendszerben. @hu
toolkit definition: Eine Manifestation, die einen Verlagsnamen in einer anderen Sprache oder einer anderen Schrift hat. @de
toolkit definition: En manifestasjon som har et navn på utgiver på et annet språk eller i et annet skriftsystem. @no
toolkit definition: Kehastus, millel on kirjastaja nimi teises keeles või kirjasüsteemis. @et
toolkit definition: Manifestaatio, jonka kustantajan nimi on toisella kielellä tai kirjoitusjärjestelmällä. @fi
toolkit definition: Manifestació que té un nom d’editor en una altra llengua o escriptura. @ca
toolkit definition: Manifestation qui possède un nom d’éditeur dans une autre langue ou écriture. @fr
toolkit definition: Manifestation, som har et navn på udgiver på et andet sprog eller skriftsystem. @da
toolkit definition: Manifestācija, kam ir izdevēja vārds/nosaukums citā valodā vai rakstībā. @lv
toolkit definition: Una manifestazione che ha un nome di editore in un'altra lingua o scrittura. @it
toolkit definition: تجسيدة لها اسم ناشر في لغة أو في نص آخر. @ar
toolkit definition: 有用另一种语言或文字的出版者名称的一种载体表现 @zh-hans
toolkit label: Paralleler Verlagsname von @de
toolkit label: forme parallèle d’un nom d’éditeur de @fr
toolkit label: ir izdevēja paralēlais vārds/nosaukums @lv
toolkit label: kirjastaja rööpnimi kehastuses @et
toolkit label: nom paral·lel d’editor de @ca
toolkit label: nome parallelo dell'editore di @it
toolkit label: parallel name of publisher of
toolkit label: parallelle naam van uitgever van @nl
toolkit label: parallelt navn på udgiver af @da
toolkit label: parallelt navn på utgiver for @no
toolkit label: párhuzamos neve a következő kiadónak: @hu
toolkit label: rinnakkainen kustantajan nimi manifestaatiolle @fi
toolkit label: yayıncısının paralel ismi @tr
toolkit label: اسم مواز لناشر لـ @ar
toolkit label: ……的出版者的并列名称 @zh-hans
has subproperty: P80130
lexical alias: parallelNameOfPublisherOf.en
status: Published
type: Property
domain: C10012
label: er parallelt navn på udgiver af @da
label: er parallelt navn på utgiver for @no
label: est une forme parallèle d’un nom d’éditeur de @fr
label: ir izdevēja paralēlais vārds/nosaukums @lv
label: is parallelle naam van uitgever van @nl
label: ist paralleler Verlagsname von @de
label: kirjastaja rööpnimi kehastuses @et
label: párhuzamos neve a következő közreadónak: @hu
label: rinnakkainen kustantajan nimi manifestaatiolle @fi
label: yayıncısının paralel adıdır @tr
label: è nome parallelo dell'editore di @it
label: és nom paral·lel d’editor de @ca
label: هو اسم موازِ لناشر لـ @ar
label: 是……的出版者的并列名称 @zh-hans
sub property of: is name of publisher of
definition: Bir ismi, başka bir dilde veya alfabede yayıncı adına sahip bir gösterimle ilişkilendirir. @tr
definition: Correla un nomen a una manifestazione che ha un nome di editore in un'altra lingua o scrittura. @it
definition: Hozzákapcsol egy noment egy megjelenési formához, amelynek van egy kiadóneve más nyelven vagy írásrendszerben. @hu
definition: Liittää nomenin manifestaatioon, jonka kustantajan nimi on toisella kielellä tai kirjoitusjärjestelmällä. @fi
definition: Met un nomen en relation avec une manifestation qui possède un nom d’éditeur dans une autre langue ou écriture. @fr
definition: Relaciona un nomen amb una manifestació que té un nom d’editor en una altra llengua o escriptura. @ca
definition: Relateert een nomen aan een manifestatie die een naam van uitgever heeft in een andere taal of schrift. @nl
definition: Relaterer et nomen til en manifestasjon som har et navn på utgiver på et annet språk eller i et annet skriftsystem. @no
definition: Relaterer et nomen til en manifestation, som har et navn på udgiver på et andet sprog eller skriftsystem. @da
definition: Relates a nomen to a manifestation that has a name of publisher in another language or script.
definition: Sasaista nomenu ar manifestāciju, kam ir izdevēja vārds/nosaukums citā valodā vai rakstībā. @lv
definition: Seostab nomen'i kehastusega, millel on kirjastaja nimi teises keeles või kirjasüsteemis. @et
definition: Setzt ein Nomen in Beziehung zu einer Manifestation, die einen Verlagsnamen in einer anderen Sprache oder einer anderen Schrift hat. @de
definition: يربط تسمية بتجسيدة لها اسم ناشر في لغة أو في نص آخر. @ar
definition: 将一个命名与有用另一种语言或文字的出版者名称的一种载体表现关联起来。 @zh-hans

is parallel title proper of
has element type: 2
toolkit definition: A manifestation that has a title proper in another language or script.
toolkit definition: Başka bir dilde veya alfabede uygun bir başlığa sahip bir gösterim. @tr
toolkit definition: Een manifestatie die een hoofdtitel heeft in een andere taal of schrift. @nl
toolkit definition: Egy megjelenési forma, amelynek más nyelven vagy írásrendszerben is van főcíme. @hu
toolkit definition: Eine Manifestation, die einen Haupttitel in einer anderen Sprache oder einer anderen Schrift hat. @de
toolkit definition: En manifestasjon som har en hovedtittel på et annet språk eller i et annet skriftsystem. @no
toolkit definition: Kehastus, millel on põhipealkiri teises keeles või kirjasüsteemis. @et
toolkit definition: Manifestaatio, jonka päänimeke on toisella kielellä tai kirjoitusjärjestelmällä. @fi
toolkit definition: Manifestació que té un títol propi en una altra llengua o escriptura. @ca
toolkit definition: Manifestation qui possède un titre propre dans une autre langue ou écriture. @fr
toolkit definition: Manifestation, som har en hovedtitel på et andet sprog eller skriftsystem. @da
toolkit definition: Manifestācija, kam ir pamatnosaukums citā valodā vai rakstībā. @lv
toolkit definition: Una manifestazione che ha un titolo proprio in un'altra lingua o scrittura @it
toolkit definition: تجسيدة لها عنوان فعلي في لغة أو في نص آخر. @ar
toolkit definition: 有用另一种语言或文字的正题名的一种载体表现 @zh-hans
toolkit label: Paralleltitel von @de
toolkit label: ir paralēlais pamatnosaukums @lv
toolkit label: parallel hovedtitel på @da
toolkit label: parallel title proper of
toolkit label: parallell hovedtittel for @no
toolkit label: parallelle hoofdtitel van @nl
toolkit label: párhuzamos főcíme: @hu
toolkit label: rinnakkainen päänimeke manifestaatiolle @fi
toolkit label: rööppõhipealkiri kehastuses @et
toolkit label: titolo proprio parallelo di @it
toolkit label: titre propre parallèle de @fr
toolkit label: títol propi paral·lel de @ca
toolkit label: uygun paralel başlık @tr
toolkit label: عنوان فعلي مواز لـ @ar
toolkit label: ……的并列正题名 @zh-hans
has subproperty: is parallel title of series of
has subproperty: P80135
lexical alias: parallelTitleProperOf.en
status: Published
type: Property
domain: C10012
label: er parallel hovedtitel på @da
label: er parallell hovedtittel for @no
label: est un titre propre parallèle de @fr
label: ir paralēlais pamatnosaukums @lv
label: is parallelle hoofdtitel van @nl
label: ist Paralleltitel von @de
label: paralel başlığıdır @tr
label: párhuzamos főcíme a következőnek: @hu
label: rinnakkainen päänimeke manifestaatiolle @fi
label: rööppõhipealkiri kehastuses @et
label: è titolo proprio parallelo di @it
label: és títol propi paral·lel de @ca
label: هو عنوان فعلي مواز لـ @ar
label: 是……的并列正题名 @zh-hans
sub property of: is title proper of
definition: Bir ismi, başka bir dilde veya alfabede uygun bir başlığı olan bir gösterimle ilişkilendirir. @tr
definition: Correla un nomen a una manifestazione che ha un titolo proprio in un'altra lingua o scrittura. @it
definition: Hozzákapcsol egy noment egy megjelenési formához, amelynek más nyelven vagy írásrendszerben is van főcíme. @hu
definition: Liittää nomenin manifestaatioon, jonka päänimeke on toisella kielellä tai kirjoitusjärjestelmällä. @fi
definition: Met un nomen en relation avec une manifestation qui possède un titre propre dans une autre langue ou écriture. @fr
definition: Relaciona un nomen amb una manifestació que té un títol propi en una altra llengua o escriptura. @ca
definition: Relateert een nomen aan een manifestatie die een hoofdtitel heeft in een andere taal of schrift. @nl
definition: Relaterer et nomen til en manifestasjon som har en hovedtittel på et annet språk eller i et annet skriftsystem. @no
definition: Relaterer et nomen til en manifestation, som har en hovedtitel på et andet sprog eller skriftsystem. @da
definition: Relates a nomen to a manifestation that has a title proper in another language or script.
definition: Sasaista nomenu ar manifestāciju, kam ir pamatnosaukums citā valodā vai rakstībā. @lv
definition: Seostab nomen'i kehastusega, millel on põhipealkiri teises keeles või kirjasüsteemis. @et
definition: Setzt ein Nomen in Beziehung zu einer Manifestation, die einen Haupttitel in einer anderen Sprache oder einer anderen Schrift hat. @de
definition: يربط تسمية بتجسيدة لها عنوان فعلي في لغة أو في نص آخر. @ar
definition: 将一个命名与有用另一种语言或文字的正题名的一种载体表现关联起来。 @zh-hans

is parallel title of series of
has element type: 2
toolkit definition: A manifestation that has a title of series in another language or script.
toolkit definition: Başka bir dilde veya alfabede bir dizinin başlığına sahip bir gösterim. @tr
toolkit definition: Een manifestatie die een titel van reeks heeft in een andere taal of schrift. @nl
toolkit definition: Egy megjelenési forma, amelynek van egy sorozatcíme más nyelven vagy írásrendszerben. @hu
toolkit definition: Eine Manifestation, die einen Titel einer Reihe in einer anderen Sprache oder einer anderen Schrift hat. @de
toolkit definition: En manifestasjon som har en serietittel på et annet språk eller i et annet skriftsystem. @no
toolkit definition: Kehastus, millel on seeria pealkiri teises keeles või kirjasüsteemis. @et
toolkit definition: Manifestaatio, jonka sarjan nimeke on toisella kielellä tai kirjoitusjärjestelmällä. @fi
toolkit definition: Manifestació que té un títol de col·lecció en una altra llengua o escriptura. @ca
toolkit definition: Manifestation qui possède un titre de collection dans une autre langue ou écriture. @fr
toolkit definition: Manifestation, som har en serietitel på et andet sprog eller skriftsystem. @da
toolkit definition: Manifestācija, kam ir sērijas nosaukums citā valodā vai rakstībā. @lv
toolkit definition: Una manifestazione che ha un titolo di serie in un'altra lingua o scrittura. @it
toolkit definition: تجسيدة لها عنوان سلسلة في لغة أو في نص آخر. @ar
toolkit definition: 有用另一种语言或文字的丛编题名的一种载体表现 @zh-hans
toolkit label: Paralleltitel einer Reihe von @de
toolkit label: dizinin paralel başlığı @tr
toolkit label: ir paralēlais sērijas nosaukums @lv
toolkit label: parallel serietitel på @da
toolkit label: parallel title of series of
toolkit label: parallell serietittel for @no
toolkit label: parallelle reekstitel van @nl
toolkit label: párhuzamos sorozati címe: @hu
toolkit label: rinnakkainen sarjan nimeke manifestaatiolle @fi
toolkit label: seeria rööppealkiri kehastuses @et
toolkit label: titolo parallelo della serie di @it
toolkit label: titre parallèle de collection de @fr
toolkit label: títol paral·lel de col·lecció de @ca
toolkit label: عنوان مواز لسلسلة لـ @ar
toolkit label: ……的并列丛编题名 @zh-hans
has subproperty: is parallel title proper of subseries of (Deprecated)
has subproperty: P80136
lexical alias: parallelTitleOfSeriesOf.en
status: Published
type: Property
domain: C10012
label: er parallel serietitel på @da
label: er parallell serietittel for @no
label: est un titre parallèle de collection de @fr
label: ir paralēlais sērijas nosaukums @lv
label: is parallelle reekstitel van @nl
label: ist Paralleltitel einer Reihe von @de
label: párhuzamos sorozati címe a következőnek: @hu
label: rinnakkainen sarjan nimeke manifestaatiolle @fi
label: seeria rööppealkiri kehastuses @et
label: serisinin paralel başlığıdır @tr
label: è titolo parallelo della serie di @it
label: és títol paral·lel de col·lecció de @ca
label: هو عنوان موازِ لسلسلة لـ @ar
label: 是……的并列丛编题名 @zh-hans
sub property of: is title of series of
sub property of: is parallel title proper of
definition: Bir ismi, başka bir dilde veya alfabede bir dizinin başlığına sahip bir gösterimle ilişkilendirir. @tr
definition: Correla un nomen a una manifestazione che ha un titolo di serie in un'altra lingua o scrittura. @it
definition: Hozzákapcsol egy noment egy megjelenési formához, amelynek van egy sorozatcíme más nyelven vagy írásrendszerben. @hu
definition: Liittää nomenin manifestaatioon, jonka sarjan nimi on toisella kielellä tai kirjoitusjärjestelmällä. @fi
definition: Met un nomen en relation avec une manifestation qui possède un titre de collection dans une autre langue ou écriture. @fr
definition: Relaciona un nomen amb una manifestació que té un títol de col·lecció en una altra llengua o escriptura. @ca
definition: Relateert een nomen aan een manifestatie die een titel van reeks heeft in een andere taal of schrift. @nl
definition: Relaterer et nomen til en manifestasjon som har en serietittel på et annet språk eller i et annet skriftsystem. @no
definition: Relaterer et nomen til en manifestation, som har en serietitel på et andet sprog eller skriftsystem. @da
definition: Relates a nomen to a manifestation that has a title of series in another language or script.
definition: Sasaista nomenu ar manifestāciju, kam ir sērijas nosaukums citā valodā vai rakstībā. @lv
definition: Seostab nomen'i kehastusega, millel on seeria pealkiri teises keeles või kirjasüsteemis. @et
definition: Setzt ein Nomen in Beziehung zu einer Manifestation, die einen Titel einer Reihe in einer anderen Sprache oder einer anderen Schrift hat. @de
definition: يربط تسمية بتجسيدة لها عنوان سلسلة في لغة أو في نص آخر. @ar
definition: 将一个命名与有用另一种语言或文字的丛编题名的一种载体表现关联起来。 @zh-hans

is parallel title proper of subseries of (Deprecated)
toolkit definition: A manifestation that has a title proper of subseries in another language or script. (Deprecated)
toolkit label: parallel title proper of subseries of (Deprecated)
has subproperty: P80137
lexical alias: parallelTitleProperOfSubseriesOf.en
status: Deprecated
type: Property
domain: C10012
sub property of: is title proper of subseries of (Deprecated)
sub property of: is parallel title of series of
definition: Relates a nomen to a manifestation that has a title proper of subseries in another language or script. (Deprecated)

is fingerprint of
has element type: 2
toolkit definition: A manifestation that has an identifier for manifestation that consists of a group of characters from specified locations in a manifestation combined with a date of publication or other element.
toolkit definition: Bir yayın tarihi veya başka bir öğe ile birleştirilmiş bir gösterimde belirtilen konumlardan bir grup karakterden oluşan gösterim tanımlayıcısına sahip bir gösterim. @tr
toolkit definition: Een manifestatie die een identificatie voor manifestatie heeft die bestaat uit een groep karakters genomen van specifieke locaties binnen een manifestatie gecombineerd met een datum van publicatie of ander element. @nl
toolkit definition: Egy megjelenési forma, amely rendelkezik olyan megjelenésiforma-azonosítóval, amely a megjelenési forma meghatározott helyeiről származó karakterek csoportjából áll, kombinálva a kiadás dátumával vagy más elemmel. @hu
toolkit definition: Eine Manifestation, der über einen Identifikator für eine Manifestation verfügt, der aus einer Kombination von einer Gruppe von Zeichen von bestimmten Stellen einer Manifestation und einem Veröffentlichungsdatum oder einem anderen Element besteht. @de
toolkit definition: En manifestasjon som har en identifikator for manifestasjon som består av en gruppe tegn fra bestemte steder i en manifestasjon kombinert med en dato for utgivelse eller annet element. @no
toolkit definition: Kehastus, millel on identifikaator, mis koosneb kindlaksmääratud andmeallikatest võetud märkidest koos ilmumisaasta või muu elemendiga. @et
toolkit definition: Manifestaatio, jonka tunniste muodostuu manifestaation tietyistä kohdista poimittujen merkkien yhdistämisestä julkaisuaikaan tai muihin elementteihin. @fi
toolkit definition: Manifestació que té un identificador de manifestació que consisteix en un grup de caràcters de localitzacions específiques en una manifestació combinats amb una data de publicació o amb un altre element. @ca
toolkit definition: Manifestation qui possède un identifiant de manifestation consistant en un groupe de caractères provenant d’endroits précis dans une manifestation et combiné à une date de publication ou à un autre élément. @fr
toolkit definition: Manifestation, som har en identifikator for manifestation, som består af en gruppe tegn fra bestemte steder i en manifestation kombineret med en dato for udgivelse eller andet element. @da
toolkit definition: Manifestācija, kam ir identifikators, kas sastāv no rakstzīmju grupas, kas ņemta no noteiktām manifestācijas vietām apvienojumā ar publikācijas datējumu vai citu elementu. @lv
toolkit definition: Una manifestazione che ha un identificatore che è costituito da un gruppo di caratteri rilevato da specifiche parti nella manifestazione combinato con una data di pubblicazione o altro elemento. @it
toolkit definition: تجسيدة لها مُعرِّف لتجسيدة يتكون من مجموعة تمثيلات من مواقع محددة في تجسيدة مدمجة مع تاريخ نشر أو مع عنصر آخر. @ar
toolkit definition: 有由载体表现中取自特定位置的一组字符与出版日期或其他元素结合而组成的载体表现的一个标识符的一种载体表现 @zh-hans
toolkit label: Fingerabdruck von @de
toolkit label: empreinte de @fr
toolkit label: empremta de @ca
toolkit label: fingeraftryk af @da
toolkit label: fingeravtrykk for @no
toolkit label: fingerprint kehastuses @et
toolkit label: fingerprint of
toolkit label: impronta di @it
toolkit label: ir identificējošā zīmju virkne @lv
toolkit label: parmak izi @tr
toolkit label: sormenjälkitunniste manifestaatiolle @fi
toolkit label: ujjlenyomata: @hu
toolkit label: vingerafdruk van @nl
toolkit label: بصمة لـ @ar
toolkit label: ……的指纹 @zh-hans
has subproperty: P80138
lexical alias: fingerprintOf.en
status: Published
type: Property
domain: C10012
label: er fingeraftryk af @da
label: er fingeravtrykk for @no
label: est une empreinte de @fr
label: fingerprint kehastuses @et
label: ir identificējošā zīmju virkne @lv
label: is vingerafdruk van @nl
label: ist Fingerabdruck von @de
label: parmak izidir @tr
label: sormenjälkitunniste manifestaatiolle @fi
label: ujjlenyomata a következőnek: @hu
label: è impronta di @it
label: és empremta de @ca
label: هي بصمة لـ @ar
label: 是……的指纹 @zh-hans
sub property of: is identifier for manifestation of
definition: Bir ismi, bir yayın tarihi veya başka bir öğe ile birleştirilmiş bir gösterimde belirtilen konumlardan bir grup karakterden oluşan gösterim tanımlayıcısına sahip bir gösterimle ilişkilendirir. @tr
definition: Correla un nomen a una manifestazione che ha un identificatore che è costituito da un gruppo di caratteri rilevato da specifiche parti nella manifestazione combinato con una data di pubblicazione o altro elemento. @it
definition: Hozzákapcsol egy noment egy megjelenési formához, amely rendelkezik olyan megjelenésiforma-azonosítóval, amely a megjelenési forma meghatározott helyeiről származó karakterek csoportjából áll, kombinálva a kiadás dátumával vagy más elemmel. @hu
definition: Liittää nomenin manifestaatioon, jonka tunniste muodostuu manifestaation tietyistä kohdista poimittujen merkkien yhdistämisestä julkaisuaikaan tai muihin elementteihin. @fi
definition: Met un nomen en relation avec une manifestation qui possède un identifiant de manifestation consistant en un groupe de caractères provenant d’endroits précis dans une manifestation et combiné à une date de publication ou à un autre élément. @fr
definition: Relaciona un nomen amb una manifestació que té un identificador de manifestació que consisteix en un grup de caràcters de localitzacions específiques en una manifestació combinats amb una data de publicació o amb un altre element. @ca
definition: Relateert een nomen aan een manifestatie die een identificatie voor manifestatie heeft die bestaat uit een groep karakters genomen van specifieke locaties binnen een manifestatie gecombineerd met een datum van publicatie of ander element. @nl
definition: Relaterer et nomen til en manifestasjon som har en identifikator for manifestasjon som består av en gruppe tegn fra bestemte steder i en manifestasjon kombinert med en dato for utgivelse eller annet element. @no
definition: Relaterer et nomen til en manifestation, som har en identifikator for manifestation, som består af en gruppe tegn fra bestemte steder i en manifestation kombineret med en dato for udgivelse eller andet element. @da
definition: Relates a nomen to a manifestation that has an identifier for manifestation that consists of a group of characters from specified locations in a manifestation combined with a date of publication or other element.
definition: Sasaista nomenu ar manifestāciju, kam ir identifikators, kas sastāv no rakstzīmju grupas, kas ņemta no noteiktām manifestācijas vietām apvienojumā ar publikācijas datējumu vai citu elementu. @lv
definition: Seostab nomen'i kehastusega, millel on identifikaator, mis koosneb kindlaksmääratud andmeallikatest võetud märkidest koos ilmumisaasta või muu elemendiga. @et
definition: Setzt ein Nomen in Beziehung zu einer Manifestation, die über einen Identifikator für eine Manifestation verfügt, der aus einer Kombination von einer Gruppe von Zeichen von bestimmten Stellen einer Manifestation und einem Veröffentlichungsdatum oder einem anderen Element besteht. @de
definition: يربط تسمية بتجسيدة لها مُعرِّف لتجسيدة يتكون من مجموعة تمثيلات من مواقع محددة في تجسيدة مدمجة مع تاريخ نشر أو مع عنصر آخر. @ar
definition: 将一个命名与有由载体表现中取自特定位置的一组字符与出版日期或其他元素结合而组成的载体表现的一个标识符的一种载体表现关联起来。 @zh-hans

has reference source
has element type: 2
toolkit definition: A manifestation which provides evidence for the use of a nomen.
toolkit definition: Allikas, mis sisaldab tõendust nomen'i kasutamisest. @et
toolkit definition: Bir nomenin kullanımına dair kanıt sağlayan bir gösterim. @tr
toolkit definition: Een manifestatie die bewijs verschaft voor het gebruik van een nomen. @nl
toolkit definition: Egy megjelenési forma, amelyben bizonyíték van egy nomen használatára. @hu
toolkit definition: Eine Manifestation, die einen Beleg für die Verwendung eines Nomens liefert. @de
toolkit definition: En kilde som inneholder bevis for anvendelsen av et nomen. @no
toolkit definition: Kilde, hvori der er bevis for brugen af et nomen. @da
toolkit definition: Manifestaatio, joka antaa todisteen nomenin käytöstä. @fi
toolkit definition: Manifestació que proporciona evidència per a l’ús d’un nomen. @ca
toolkit definition: Manifestation qui atteste de l’utilisation d’un nomen. @fr
toolkit definition: Manifestācija, kura ir pierādījums nomena lietojumam. @lv
toolkit definition: Una fonte in cui ci sono prove per l'uso di un nomen. @it
toolkit definition: مصدر يقدم دليلا على استخدام تسمية. @ar
toolkit definition: 为一个命名的使用提供证据的一种载体表现 @zh-hans
toolkit label: Nachschlagewerk @de
toolkit label: font de referència @ca
toolkit label: fonte di reference @it
toolkit label: hivatkozási forrása: @hu
toolkit label: naslagwerk @nl
toolkit label: referans kaynağı @tr
toolkit label: referansekilde @no
toolkit label: reference source
toolkit label: referencekilde @da
toolkit label: source de référence @fr
toolkit label: teatmeallikas @et
toolkit label: tietolähde @fi
toolkit label: uzziņu avots @lv
toolkit label: مصدر مرجعى @ar
toolkit label: 参考信息源 @zh-hans
has subproperty: P80139
lexical alias: referenceSource.en
status: Published
type: Property
domain: C10012
label: a pour source de référence @fr
label: ha come fonte di reference @it
label: har referansekilde @no
label: har referencekilde @da
label: hat Nachschlagewerk @de
label: heeft naslagwerk @nl
label: hivatkozási forrása a következő: @hu
label: referans kaynağı ile ilişkilidir @tr
label: teatmeallikas @et
label: tietolähde @fi
label: té com a font de referència @ca
label: uzziņu avots @lv
label: له مصدر مرجعي @ar
label: 有参考信息源 @zh-hans
sub property of: has related manifestation of nomen
definition: Bir ismi, bir ismin kullanımına ilişkin kanıt sağlayan bir gösterimle ilişkilendirir. @tr
definition: Correla un nomen a una fonte in cui ci sono prove per l'uso di un nomen. @it
definition: Hozzákapcsol egy noment egy megjelenési formához, amelyben bizonyíték van egy nomen használatára. @hu
definition: Liittää nomenin manifestaatioon, joka antaa todisteen nomenin käytöstä. @fi
definition: Met un nomen en relation avec une manifestation qui atteste de l’utilisation d’un nomen. @fr
definition: Relaciona un nomen amb una manifestació que proporciona evidència per a l’ús d’un nomen. @ca
definition: Relateert een nomen aan een manifestatie die bewijs verschaft voor het gebruik van een nomen. @nl
definition: Relaterer et nomen til en kilde som inneholder bevis for anvendelsen av et nomen. @no
definition: Relaterer et nomen til en kilde, hvori der er bevis for brugen af et nomen. @da
definition: Relates a nomen to a manifestation which provides evidence for the use of a nomen.
definition: Sasaista nomenu ar manifestāciju, kura ir pierādījums nomena lietojumam. @lv
definition: Seostab nomen'i allikaga, mis sisaldab tõendust nomen'i kasutamisest. @et
definition: Setzt ein Nomen in Beziehung zu einer Manifestation, die einen Beleg für die Verwendung eines Nomens liefert. @de
definition: يربط تسمية بتجسيدة تقدم دليلا على استخدام تسمية. @ar
definition: 将一个命名与为一个命名的使用提供证据的一种载体表现关联起来。 @zh-hans

is preferred name of agent of
has element type: 2
toolkit definition: Agent que té un nom d’agent que se selecciona com a preferent en una aplicació o un context específic. @ca
toolkit definition: Agent qui possède un nom d’agent faisant l’objet d’un choix privilégié dans une application ou un contexte spécifiques. @fr
toolkit definition: Agent, som har et navn på agent, som er valgt som præference i en specifik anvendelse eller kontekst. @da
toolkit definition: An agent who has a name of agent that is selected for preference in a specific application or context.
toolkit definition: Aģents, kam ir aģenta vārds/nosaukums, kurš ir izvēlēts noteiktam lietojumam vai noteiktā kontekstā. @lv
toolkit definition: Belirli bir uygulama veya bağlamda tercih edilmek için seçilen bir temsilci adına sahip bir temsilci. @tr
toolkit definition: Een actor die een naam van actor heeft die als voorkeursterm geselecteerd is in een specifieke toepassing of context. @nl
toolkit definition: Egy ágens, amelynek van egy olyan ágensneve, amelyet egy adott alkalmazásban vagy kontextusban előnyben részesítenek. @hu
toolkit definition: Ein Akteur, der über einen Namen für einen Akteur verfügt, der in einer bestimmten Anwendung oder in einem bestimmten Kontext als Vorzugsform bestimmt wird. @de
toolkit definition: En agent som har et navn for agent som er valgt som preferanse i en bestemt applikasjon eller kontekst. @no
toolkit definition: Tegija, kellel on kindlas rakenduses või kontekstis eelistatuks valitud nimi. @et
toolkit definition: Toimija, jonka nimi on valittu ensisijaiseksi tietyssä sovelluksessa tai kontekstissa. @fi
toolkit definition: Un agente che ha un nome di agente che è stato selezionato come preferito in una specifica applicazione o contesto. @it
toolkit definition: وكيل له اسم وكيل اختير للتفضيل في تطبيق أو في سياق معين. @ar
toolkit definition: 有在一个特定的应用或语境下被首选的一个行为者名称的一个行为者 @zh-hans
toolkit label: Bevorzugter Name eines Akteurs von @de
toolkit label: eelisnimi tegijale @et
toolkit label: előnyben részesített neve a következő ágensnek: @hu
toolkit label: ensisijainen nimi toimijalle @fi
toolkit label: foretrukket navn på agent af @da
toolkit label: foretrukket navn på agent for @no
toolkit label: geprefereerde naam van actor van @nl
toolkit label: ir aģenta prioritārais vārds/nosaukums @lv
toolkit label: nom preferit d’agent de @ca
toolkit label: nom privilégié d’un agent de @fr
toolkit label: nome preferito dell'agente di @it
toolkit label: preferred name of agent of
toolkit label: temsilcisinin tercih edilen ismi @tr
toolkit label: اسم مفضل لوكيل لـ @ar
toolkit label: ……的行为者的首选名称 @zh-hans
has subproperty: is preferred name of collective agent of
has subproperty: is preferred name of person of
has subproperty: P80140
lexical alias: preferredNameOfAgentOf.en
status: Published
type: Property
domain: C10012
label: eelisnimi tegijale @et
label: előnyben részesített neve a következő ágensnek: @hu
label: ensisijainen nimi toimijalle @fi
label: er foretrukket navn på agent af @da
label: er foretrukket navn på agent for @no
label: est un nom privilégié d’un agent de @fr
label: ir aģenta prioritārais vārds/nosaukums @lv
label: is geprefereerde naam van actor van @nl
label: ist bevorzugter Name eines Akteurs von @de
label: temsilcisinin tercih edilen adıdır @tr
label: è nome preferito dell'agente di @it
label: és nom preferit d’agent de @ca
label: هو اسم مفضل لوكيل لـ @ar
label: 是……的行为者的首选名称 @zh-hans
sub property of: is name of agent of
sub property of: is preferred name of RDA entity of
definition: Bir ismi, belirli bir uygulama veya bağlamda tercih edilmek üzere seçilen bir temsilci adına sahip bir temsilciyle ilişkilendirir. @tr
definition: Correla un nomen a un agente che ha un nome di agente che è stato selezionato come preferito in una specifica applicazione o contesto. @it
definition: Hozzákapcsol egy noment egy ágenshez, amelynek van egy olyan ágensneve, amelyet egy adott alkalmazásban vagy kontextusban előnyben részesítenek. @hu
definition: Liittää nomenin toimijaan, jonka nimi on valittu ensisijaiseksi tietyssä sovelluksessa tai kontekstissa. @fi
definition: Met un nomen en relation avec un agent qui possède un nom d’agent faisant l’objet d’un choix privilégié dans une application ou un contexte spécifiques. @fr
definition: Relaciona un nomen amb un agent que té un nom d’agent que se selecciona com a preferent en una aplicació o un context específic. @ca
definition: Relateert een nomen aan een actor die een naam van actor heeft die als voorkeursterm geselecteerd is in een specifieke toepassing of context. @nl
definition: Relaterer et nomen til en agent som har et navn for agent som er valgt som preferanse i en bestemt applikasjon eller kontekst. @no
definition: Relaterer et nomen til en agent, som har et navn på agent, som er valgt som præference i en specifik anvendelse eller kontekst. @da
definition: Relates a nomen to an agent who has a name of agent that is selected for preference in a specific application or context.
definition: Sasaista nomenu ar aģentu, kam ir aģenta vārds/nosaukums, kurš ir izvēlēts noteiktam lietojumam vai noteiktā kontekstā. @lv
definition: Seostab nomen'i tegijaga, kellel on kindlas rakenduses või kontekstis eelistatuks valitud nimi. @et
definition: Setzt ein Nomen in Beziehung zu einem Akteur, der über einen Namen für einen Akteur verfügt, der in einer bestimmten Anwendung oder in einem bestimmten Kontext als Vorzugsform bestimmt wird. @de
definition: يربط تسمية بوكيل له اسم وكيل اختير للتفضيل في تطبيق أو في سياق معين. @ar
definition: 将一个命名与有在一个特定的应用或语境下被首选的一个行为者名称的一个行为者关联起来。 @zh-hans

is preferred name of collective agent of
has element type: 2
toolkit definition: A collective agent who has a name of collective agent that is selected for preference in a specific application or context.
toolkit definition: Agent collectif qui possède un nom d’agent collectif faisant l’objet d’un choix privilégié dans une application ou un contexte spécifiques. @fr
toolkit definition: Agent col·lectiu que té un nom d’agent col·lectiu que se selecciona com a preferent en una aplicació o un context específic. @ca
toolkit definition: Belirli bir uygulama veya bağlamda tercih edilmek üzere seçilen bir kolektif temsilci adına sahip kolektif temsilci. @tr
toolkit definition: Een collectieve actor die een naam van collectieve actor heeft die als voorkeursterm geselecteerd is in een specifieke toepassing of context. @nl
toolkit definition: Egy kollektív ágens, amelynek van egy olyan kollektívágens-neve, amelyet egy bizonyos alkalmazásban vagy kontextusban előnyben részesítenek. @hu
toolkit definition: Ein gemeinschaftlicher Akteur, der über einen Namen für einen gemeinschaftlichen Akteur verfügt, der in einer bestimmten Anwendung oder in einem bestimmten Kontext als Vorzugsform bestimmt wird. @de
toolkit definition: En kollektiv agent som har et navn for kollektiv agent som er valgt som preferanse i en bestemt applikasjon eller kontekst. @no
toolkit definition: Grupa, kam ir grupas nosaukums, kurš ir izvēlēts noteiktam lietojumam vai noteiktā kontekstā. @lv
toolkit definition: Kollektiiv, kellel on kindlas rakenduses või kontekstis eelistatuks valitud nimi. @et
toolkit definition: Kollektiv agent, som har et navn på kollektiv agent, som er valgt som præference i en specifik anvendelse eller kontekst. @da
toolkit definition: Un agente collettivo che ha un nome di agente collettico che è stato selezionato come preferito in una specifica applicazione o contesto. @it
toolkit definition: Yhteistoimija, jonka nimi on valittu ensisijaiseksi tietyssä sovelluksessa tai kontekstissa. @fi
toolkit definition: وكيل جماعي له اسم وكيل جماعي اختير للتفضيل في تطبيق أو في سياق معين. @ar
toolkit definition: 有在一个特定的应用或语境下被首选的一个集体行为者名称的一个集体行为者 @zh-hans
toolkit label: Bevorzugter Name eines gemeinschaftlichen Akteurs von @de
toolkit label: eelisnimi kollektiivile @et
toolkit label: előnyben részesített neve a következő kollektív ágensnek: @hu
toolkit label: ensisijainen nimi yhteistoimijalle @fi
toolkit label: foretrukket navn på kollektiv agent af @da
toolkit label: foretrukket navn på kollektiv agent for @no
toolkit label: geprefereerde naam van collectieve actor van @nl
toolkit label: ir grupas prioritārais nosaukums @lv
toolkit label: kolektif temsilcisinin tercih edilen ismi @tr
toolkit label: nom preferit d’agent col·lectiu de @ca
toolkit label: nom privilégié d’un agent collectif de @fr
toolkit label: nome preferito dell'agente collettivo di @it
toolkit label: preferred name of collective agent of
toolkit label: اسم مفضل لوكيل جماعي لـ @ar
toolkit label: ……的集体行为者的首选名称 @zh-hans
has subproperty: is preferred name of corporate body of
has subproperty: is preferred name of family of
has subproperty: P80141
lexical alias: preferredNameOfCollectiveAgentOf.en
status: Published
type: Property
domain: C10012
label: eelisnimi kollektiivile @et
label: előnyben részesített neve a következő kollektív ágensnek: @hu
label: ensisijainen nimi yhteistoimijalle @fi
label: er foretrukket navn på kollektiv agent af @da
label: er foretrukket navn på kollektiv agent for @no
label: est un nom privilégié d’un agent collectif de @fr
label: ir grupas prioritārais nosaukums @lv
label: is geprefereerde naam van collectieve actor van @nl
label: ist bevorzugter Name eines gemeinschaftlichen Akteurs von @de
label: kolektif temsilcisinin tercih edilen adıdır @tr
label: è nome preferito dell'agente collettivo di @it
label: és nom preferit d’agent col·lectiu de @ca
label: هو اسم مفضل لوكيل جماعي لـ @ar
label: 是……的集体行为者的首选名称 @zh-hans
sub property of: is name of collective agent of
sub property of: is preferred name of agent of
definition: Bir ismi, belirli bir uygulamada veya bağlamda tercih edilmek üzere seçilen bir kolektif temsilci adına sahip olan bir kolektif temsilciyle ilişkilendirir. @tr
definition: Correla un nomen a un agente collettivo che ha un nome di agente collettico che è stato selezionato come preferito in una specifica applicazione o contesto. @it
definition: Egy noment hozzákapcsol egy kollektív ágenshez, amelynek van egy olyan kollektívágens-neve, amelyet egy bizonyos alkalmazásban vagy kontextusban előnyben részesítenek. @hu
definition: Liittää nomenin yhteistoimijaan, jonka nimi on valittu ensisijaiseksi tietyssä sovelluksessa tai kontekstissa. @fi
definition: Met un nomen en relation avec un agent collectif qui possède un nom d’agent collectif faisant l’objet d’un choix privilégié dans une application ou un contexte spécifiques. @fr
definition: Relaciona un nomen amb un agent col·lectiu que té un nom d’agent col·lectiu que se selecciona com a preferent en una aplicació o un context específic. @ca
definition: Relateert een nomen aan een collectieve actor die een naam van collectieve actor heeft die als voorkeursterm geselecteerd is in een specifieke toepassing of context. @nl
definition: Relaterer et nomen til en kollektiv agent som har et navn for kollektiv agent som er valgt som preferanse i en bestemt applikasjon eller kontekst. @no
definition: Relaterer et nomen til en kollektiv agent, som har et navn på kollektiv agent, som er valgt som præference i en specifik anvendelse eller kontekst. @da
definition: Relates a nomen to a collective agent who has a name of collective agent that is selected for preference in a specific application or context.
definition: Sasaista nomenu ar grupu, kam ir grupas nosaukums, kurš ir izvēlēts noteiktam lietojumam vai noteiktā kontekstā. @lv
definition: Seostab nomen'i kollektiiviga, kellel on kindlas rakenduses või kontekstis eelistatuks valitud nimi. @et
definition: Setzt ein Nomen in Beziehung zu einem gemeinschaftlichen Akteur, der über einen Namen für einen gemeinschaftlichen Akteur verfügt, der in einer bestimmten Anwendung oder in einem bestimmten Kontext als Vorzugsform bestimmt wird. @de
definition: يربط تسمية بوكيل جماعي له اسم وكيل جماعي اختير للتفضيل في تطبيق أو في سياق معين. @ar
definition: 将一个命名与有在一个特定的应用或语境下被首选的一个集体行为者名称的一个集体行为者关联起来。 @zh-hans

is variant name of agent of
has element type: 2
toolkit definition: Agent que té un nom d’agent que no se selecciona com a preferent en una aplicació o un context específic. @ca
toolkit definition: Agent qui possède un nom d’agent ne faisant pas l’objet d’un choix privilégié dans un schéma d’encodage de vocabulaire spécifiques. @fr
toolkit definition: Agent, som har et navn på agent, som ikke er valgt som præference i en specifik anvendelse eller kontekst. @da
toolkit definition: An agent who has a name of agent that is not selected for preference in a specific application or context.
toolkit definition: Aģents, kam ir aģenta vārds/nosaukums, kurš nav izvēlēts kā prioritārs noteiktā lietojumprogrammā vai kontekstā. @lv
toolkit definition: Belirli bir uygulama veya bağlamda tercih edilmek için seçilmeyen bir temsilci adına sahip bir temsilci. @tr
toolkit definition: Een actor die een naam van actor heeft die niet als voorkeursterm geselecteerd is in een specifieke toepassing of context. @nl
toolkit definition: Egy ágens, amelynek van egy olyan ágensneve, amelyet egy adott alkalmazásban vagy kontextusban nem részesítenek előnyben. @hu
toolkit definition: Ein Akteur, der über einen Namen für einen Akteur verfügt, der in einer bestimmten Anwendung oder in einem bestimmten Kontext nicht als Vorzugsform bestimmt wird. @de
toolkit definition: En agent som har et navn for agent som ikke er valgt som preferanse i en bestemt applikasjon eller kontekst. @no
toolkit definition: Tegija, kellel on nimi, mis kindlas rakenduses või kontekstis ei ole valitud eelistatuks. @et
toolkit definition: Toimija, jonka nimeä ei ole valittu ensisijaiseksi tietyssä sovelluksessa tai kontekstissä. @fi
toolkit definition: Un agente che ha un nome di agente che non è stato selezionato come preferito in una specifica applicazione o contesto. @it
toolkit definition: وكيل له اسم وكيل لم يُختر للتفضيل في تطبيق أو في سياق معين. @ar
toolkit definition: 有在一个特定的应用或语境下未被首选的一个行为者名称的一个行为者 @zh-hans
toolkit label: Abweichender Name eines Akteurs von @de
toolkit label: alternativt navn på agent for @no
toolkit label: ir cits vārds/nosaukums aģentam @lv
toolkit label: nome variante dell'agente di @it
toolkit label: névváltozata a következő ágensnek: @hu
toolkit label: temsilcinin için alternatif ismi @tr
toolkit label: variant af navn på agent af @da
toolkit label: variant de nom d’agent de @ca
toolkit label: variant naam van actor van @nl
toolkit label: variant name of agent of
toolkit label: variante de nom d’agent de @fr
toolkit label: variantnimi tegijale @et
toolkit label: varianttinimi toimijalle @fi
toolkit label: اسم مختلف لوكيل لـ @ar
toolkit label: ……的行为者的变异名称 @zh-hans
has subproperty: is variant name of collective agent of
has subproperty: is variant name of person of
has subproperty: P80142
lexical alias: variantNameOfAgentOf.en
status: Published
type: Property
domain: C10012
label: er alternativt navn på agent for @no
label: er variant af navn på agent af @da
label: est une variante de nom d’agent de @fr
label: ir cits vārds/nosaukums aģentam @lv
label: is variant naam van actor van @nl
label: ist abweichender Name eines Akteurs von @de
label: névváltozata a következő ágensnek: @hu
label: temsilcisinin farklı ismi @tr
label: variantnimi tegijale @et
label: varianttinimi toimijalle @fi
label: è nome variante dell'agente di @it
label: és variant de nom d’agent de @ca
label: هو اسم مختلف لوكيل لـ @ar
label: 是……的行为者的变异名称 @zh-hans
sub property of: is name of agent of
sub property of: is variant name of RDA entity of
definition: Bir ismi, belirli bir uygulama veya bağlamda tercih için seçilmeyen bir temsilci adına sahip olan bir temsilciyle ilişkilendirir. @tr
definition: Correla un nomen a un agente che ha un nome di agente che non è stato selezionato come preferito in una specifica applicazione o contesto. @it
definition: Hozzákapcsol egy noment egy ágenshez, amelynek van egy olyan ágensneve, amelyet egy adott alkalmazásban vagy kontextusban nem részesítenek előnyben. @hu
definition: Liittää nomenin toimijaan, jonka nimeä ei ole valittu ensisijaiseksi tietyssä sovelluksessa tai kontekstissa. @fi
definition: Met un nomen en relation avec un agent qui possède un nom d’agent ne faisant pas l’objet d’un choix privilégié dans un schéma d’encodage de vocabulaire spécifiques. @fr
definition: Relaciona un nomen amb un agent que té un nom d’agent que no se selecciona com a preferent en una aplicació o un context específic. @ca
definition: Relateert een nomen aan een actor die een naam van actor heeft die niet als voorkeursterm geselecteerd is in een specifieke toepassing of context. @nl
definition: Relaterer et nomen til en agent som har et navn for agent som ikke er valgt som preferanse i en bestemt applikasjon eller kontekst. @no
definition: Relaterer et nomen til en agent, som har et navn på agent, som ikke er valgt som præference i en specifik anvendelse eller kontekst. @da
definition: Relates a nomen to an agent who has a name of agent that is not selected for preference in a specific application or context.
definition: Sasaista nomenu ar aģentu, kam ir aģenta vārds/nosaukums, kurš nav izvēlēts kā prioritārs noteiktā lietojumprogrammā vai kontekstā. @lv
definition: Seostab nomen'i tegijaga, kellel on nimi, mis kindlas rakenduses või kontekstis ei ole valitud eelistatuks. @et
definition: Setzt ein Nomen in Beziehung zu einem Akteur, der über einen Namen für einen Akteur verfügt, der in einer bestimmten Anwendung oder in einem bestimmten Kontext nicht als Vorzugsform bestimmt wird. @de
definition: يربط تسمية بوكيل له اسم وكيل لم يُختر للتفضيل في تطبيق أو في سياق معين. @ar
definition: 将一个命名与有在一个特定的应用或语境下未被首选的一个行为者名称的一个行为者关联起来。 @zh-hans

is variant name of collective agent of
has element type: 2
toolkit definition: A collective agent who has a name of collective agent that is not selected for preference in a specific application or context.
toolkit definition: Agent collectif qui possède un nom d’agent collectif ne faisant pas l’objet d’un choix privilégié dans un schéma d’encodage de vocabulaire spécifiques. @fr
toolkit definition: Agent col·lectiu que té un nom d’agent col·lectiu que no se selecciona com a preferent en una aplicació o un context específic. @ca
toolkit definition: Belirli bir uygulama veya bağlamda tercih için seçilmeyen bir kolektif temsilci adına sahip bir kolektif temsilci. @tr
toolkit definition: Een collectieve actor die een naam van collectieve actor heeft die niet als voorkeursterm geselecteerd is in een specifieke toepassing of context. @nl
toolkit definition: Egy kollektív ágens, amelynek van egy olyan kollektívágens-neve, amelyet egy bizonyos alkalmazásban vagy kontextusban nem részesítenek előnyben. @hu
toolkit definition: Ein gemeinschaftlicher Akteur, der über einen Namen für einen gemeinschaftlichen Akteur verfügt, der in einer bestimmten Anwendung oder in einem bestimmten Kontext nicht als Vorzugsform bestimmt wird. @de
toolkit definition: En kollektiv agent som har et navn for kollektiv agent som ikke er valgt som preferanse i en bestemt applikasjon eller kontekst. @no
toolkit definition: Grupa, kam ir grupas vārds/nosaukums, kurš nav izvēlēts kā prioritārs noteiktā lietojumprogrammā vai kontekstā. @lv
toolkit definition: Kollektiiv, kellel on nimi, mis kindlas rakenduses või kontekstis ei ole valitud eelistatuks. @et
toolkit definition: Kollektiv agent, som har et navn på kollektiv agent, som ikke er valgt som præference i en specifik anvendelse eller kontekst. @da
toolkit definition: Un agente collettivo che ha un nome di agente collettico che non è stato selezionato come preferito in una specifica applicazione o contesto. @it
toolkit definition: Yhteistoimija, jonka nimeä ei ole valittu ensisijaiseksi tietyssä sovelluksessa tai kontekstissä. @fi
toolkit definition: وكيل جماعي له اسم وكيل جماعي لم يُختر للتفضيل في تطبيق أو في سياق معين. @ar
toolkit definition: 有在一个特定的应用或语境下未被首选的一个集体行为者名称的一个集体行为者 @zh-hans
toolkit label: Abweichender Name eines gemeinschaftlichen Akteurs von @de
toolkit label: alternativt navn på kollektiv agent for @no
toolkit label: ir cits vārds/nosaukums grupai @lv
toolkit label: kolektif temsilcinin alternatif ismi @tr
toolkit label: nome variante dell'agente collettivo di @it
toolkit label: névvariánsa a következő kollektív ágensnek: @hu
toolkit label: variant af navn på kollektiv agent af @da
toolkit label: variant de nom d’agent col·lectiu de @ca
toolkit label: variant naam van collectieve actor van @nl
toolkit label: variant name of collective agent of
toolkit label: variante de nom d’agent collectif de @fr
toolkit label: variantnimi kollektiivile @et
toolkit label: varianttinimi yhteistoimijalle @fi
toolkit label: اسم وكيل جماعي مختلف لـ @ar
toolkit label: ……的集体行为者的变异名称 @zh-hans
has subproperty: is variant name of corporate body of
has subproperty: is variant name of family of
has subproperty: P80143
lexical alias: variantNameOfCollectiveAgentOf.en
status: Published
type: Property
domain: C10012
label: er alternativt navn på kollektiv agent for @no
label: er variant af navn på kollektiv agent af @da
label: est une variante de nom d’agent collectif de @fr
label: ir cits vārds/nosaukums grupai @lv
label: is variant naam van collectieve actor van @nl
label: ist abweichender Name eines gemeinschaftlichen Akteurs von @de
label: kolektif temsilcisinin farklı ismi @tr
label: névváltozata a következő kollektív ágensnek: @hu
label: variantnimi kollektiivile @et
label: varianttinimi yhteistoimijalle @fi
label: è nome variante dell'agente collettivo di @it
label: és variant de nom d’agent col·lectiu de @ca
label: هو اسم وكيل جماعي مختلف لـ @ar
label: 是……的集体行为者的变异名称 @zh-hans
sub property of: is name of collective agent of
sub property of: is variant name of agent of
definition: Bir ismi, belirli bir uygulama veya bağlamda tercih için seçilmeyen bir kolektif temsilci adına sahip bir kolektif temsilciyle ilişkilendirir. @tr
definition: Correla un nomen a un agente collettivo che ha un nome di agente collettico che non è stato selezionato come preferito in una specifica applicazione o contesto. @it
definition: Hozzákapcsol egy noment egy kollektív ágenshez, amelynek van egy olyan kollektívágens-neve, amelyet egy bizonyos alkalmazásban vagy kontextusban nem részesítenek előnyben. @hu
definition: Liittää nomenin yhteistoimijaan, jonka nimeä ei ole valittu ensisijaiseksi tietyssä sovelluksessa tai kontekstissä. @fi
definition: Met un nomen en relation avec un agent collectif qui possède un nom d’agent collectif ne faisant pas l’objet d’un choix privilégié dans un schéma d’encodage de vocabulaire spécifiques. @fr
definition: Relaciona un nomen amb un agent col·lectiu que té un nom d’agent col·lectiu que no se selecciona com a preferent en una aplicació o un context específic. @ca
definition: Relateert een nomen aan een collectieve actor die een naam van collectieve actor heeft die niet als voorkeursterm geselecteerd is in een specifieke toepassing of context. @nl
definition: Relaterer et nomen til en kollektiv agent som har et navn for kollektiv agent som ikke er valgt som preferanse i en bestemt applikasjon eller kontekst. @no
definition: Relaterer et nomen til en kollektiv agent, som har et navn på kollektiv agent, som ikke er valgt som præference i en specifik anvendelse eller kontekst. @da
definition: Relates a nomen to a collective agent who has a name of collective agent that is not selected for preference in a specific application or context.
definition: Sasaista nomenu ar grupu, kam ir grupas vārds/nosaukums, kurš nav izvēlēts kā prioritārs noteiktā lietojumprogrammā vai kontekstā. @lv
definition: Seostab nomen'i kollektiiviga, kellel on nimi, mis kindlas rakenduses või kontekstis ei ole valitud eelistatuks. @et
definition: Setzt ein Nomen in Beziehung zu einem gemeinschaftlichen Akteur, der über einen Namen für einen gemeinschaftlichen Akteur verfügt, der in einer bestimmten Anwendung oder in einem bestimmten Kontext nicht als Vorzugsform bestimmt wird. @de
definition: يربط تسمية بوكيل جماعي له اسم وكيل جماعي لم يُختر للتفضيل في تطبيق أو في سياق معين. @ar
definition: 将一个命名与有在一个特定的应用或语境下未被首选的一个集体行为者名称的一个集体行为者关联起来。 @zh-hans

is preferred name of corporate body of
has element type: 2
toolkit definition: A corporate body who has a name of corporate body that is selected for preference in a specific application or context.
toolkit definition: Asutus, kellel on kindlas rakenduses või kontekstis eelistatuks valitud nimi. @et
toolkit definition: Collectivité qui possède un nom de collectivité faisant l’objet d’un choix privilégié dans une application ou un contexte spécifiques. @fr
toolkit definition: Een corporatie die een naam van corporatie heeft die als voorkeursterm geselecteerd is in een specifieke toepassing of context. @nl
toolkit definition: Egy testület, amelynek van egy olyan testületneve, amelyet egy bizonyos alkalmazásban vagy kontextusban előnyben részesítenek. @hu
toolkit definition: Eine Körperschaft, die über einen Namen für eine Körperschaft verfügt, der in einer bestimmten Anwendung oder in einem bestimmten Kontext als Vorzugsform bestimmt wird. @de
toolkit definition: En korporasjon som har et navn for korporasjon som er valgt som preferanse i en bestemt applikasjon eller kontekst. @no
toolkit definition: Entitat corporativa que té un nom d’entitat corporativa que se selecciona com a preferent en una aplicació o un context específic. @ca
toolkit definition: Institūcija, kam ir institūcijas nosaukums, kurš ir izvēlēts noteiktam lietojumam vai noteiktā kontekstā. @lv
toolkit definition: Korporation, som har et navn på korporation, som er valgt som præference i en specifik anvendelse eller kontekst. @da
toolkit definition: Tüzel kişilik adı belirli bir uygulamada veya içerikte tercih edilmek üzere seçilmiş olan bir tüzel kişililik. @tr
toolkit definition: Un ente che ha un nome di ente che è stato selezionato come preferito in una specifica applicazione o contesto. @it
toolkit definition: Yhteisö, jonka nimeä ei ole valittu ensisijaiseksi tietyssä sovelluksessa tai kontekstissä. @fi
toolkit definition: هيئة لها اسم هيئة اختير للتفضيل في تطبيق أو في سياق معين. @ar
toolkit definition: 有在一个特定的应用或语境下被首选的一个团体名称的一个团体 @zh-hans
toolkit label: Bevorzugter Name einer Körperschaft von @de
toolkit label: eelisnimi asutusele @et
toolkit label: ensisijainen nimi yhteisölle @fi
toolkit label: foretrukket navn på korporasjon for @no
toolkit label: foretrukket navn på korporation af @da
toolkit label: geprefereerde naam van corporatie van @nl
toolkit label: ir institūcijas prioritārais nosaukums @lv
toolkit label: nom preferit d’entitat corporativa de @ca
toolkit label: nom privilégié d’une collectivité de @fr
toolkit label: nome preferito dell'ente di @it
toolkit label: preferred name of corporate body of
toolkit label: testület előnyben részesített neve @hu
toolkit label: tüzel kişiliğinin tercih edilen ismi @tr
toolkit label: اسم هيئة مفضل لـ @ar
toolkit label: ……的团体的首选名称 @zh-hans
has subproperty: P80144
lexical alias: preferredNameOfCorporateBodyOf.en
status: Published
type: Property
domain: C10012
label: eelisnimi asutusele @et
label: ensisijainen nimi yhteisölle @fi
label: er foretrukket navn på korporasjon for @no
label: er foretrukket navn på korporation af @da
label: est un nom privilégié d’une collectivité de @fr
label: ir institūcijas prioritārais nosaukums @lv
label: is geprefereerde naam van corporatie van @nl
label: ist bevorzugter Name einer Körperschaft von @de
label: testület előnyben részesített neve: @hu
label: tüzel kişisinin tercih edilen adıdır @tr
label: è nome preferito dell'ente di @it
label: és nom preferit d’entitat corporativa de @ca
label: هو اسم هيئة مفضل لـ @ar
label: 是……的团体的首选名称 @zh-hans
sub property of: is name of corporate body of
sub property of: is preferred name of collective agent of
definition: Bir ismi, tüzel kişilik adı belirli bir uygulamada veya içerikte tercih edilmek üzere seçilmiş olan bir tüzel kişililikle ilişkilendirir. @tr
definition: Correla un nomen a un ente che ha un nome di ente che è stato selezionato come preferito in una specifica applicazione o contesto. @it
definition: Egy noment hozzákapcsol egy testülethez, amelynek van egy olyan testületneve, amelyet egy bizonyos alkalmazásban vagy kontextusban előnyben részesítenek. @hu
definition: Liittää nomenin yhteisöön, jonka nimi on valittu ensisijaiseksi tietyssä sovelluksessa tai kontekstissä. @fi
definition: Met un nomen en relation avec une collectivité qui possède un nom de collectivité faisant l’objet d’un choix privilégié dans une application ou un contexte spécifiques. @fr
definition: Relaciona un nomen amb una entitat corporativa que té un nom d’entitat corporativa que se selecciona com a preferent en una aplicació o un context específic. @ca
definition: Relateert een nomen aan een corporatie die een naam van corporatie heeft die als voorkeursterm geselecteerd is in een specifieke toepassing of context. @nl
definition: Relaterer et nomen til en korporasjon som har et navn for korporasjon som er valgt som preferanse i en bestemt applikasjon eller kontekst. @no
definition: Relaterer et nomen til en korporation, som har et navn på korporation, som er valgt som præference i en specifik anvendelse eller kontekst. @da
definition: Relates a nomen to a corporate body who has a name of corporate body that is selected for preference in a specific application or context.
definition: Sasaista nomenu ar institūciju, kam ir institūcijas nosaukums, kurš ir izvēlēts noteiktam lietojumam vai noteiktā kontekstā. @lv
definition: Seostab nomen'i asutusega, kellel on kindlas rakenduses või kontekstis eelistatuks valitud nimi. @et
definition: Setzt ein Nomen in Beziehung zu einer Körperschaft, die über einen Namen für eine Körperschaft verfügt, der in einer bestimmten Anwendung oder in einem bestimmten Kontext als Vorzugsform bestimmt wird. @de
definition: يربط تسمية بهيئة لها اسم هيئة اختير للتفضيل في تطبيق أو في سياق معين. @ar
definition: 将一个命名与有在一个特定的应用或语境下被首选的一个团体名称的一个团体关联起来。 @zh-hans

is preferred name of family of
has element type: 2
toolkit definition: A family who has a name of family that is selected for preference in a specific application or context.
toolkit definition: Aile adı belirli bir uygulamada veya içerikte tercih edilmek üzere seçilmiş olan bir aile. @tr
toolkit definition: Dzimta/ģimene, kam ir dzimtas/ģimenes vārds, kurš ir izvēlēts noteiktam lietojumam vai noteiktā kontekstā. @lv
toolkit definition: Een familie die een naam van familie heeft die als voorkeursterm geselecteerd is in een specifieke toepassing of context. @nl
toolkit definition: Egy család, amelynek van egy olyan családneve, amelyet egy bizonyos alkalmazásban vagy kontextusban előnyben részesítenek. @hu
toolkit definition: Eine Familie, die über einen Namen für eine Familie verfügt, der in einer bestimmten Anwendung oder in einem bestimmten Kontext als Vorzugsform bestimmt wird. @de
toolkit definition: En familie som har et navn for familie som er valgt som preferanse i en bestemt applikasjon eller kontekst. @no
toolkit definition: Familie, som har et navn på familie, som er valgt som præference i en specifik anvendelse eller kontekst. @da
toolkit definition: Famille qui possède un nom d’une famille faisant l’objet d’un choix privilégié dans une application ou un contexte spécifiques. @fr
toolkit definition: Família que té un nom de família que se selecciona com a preferent en una aplicació o un context específic. @ca
toolkit definition: Perekond, kellel on kindlas rakenduses või kontekstis eelistatuks valitud nimi. @et
toolkit definition: Suku, jonka nimeä ei ole valittu ensisijaiseksi tietyssä sovelluksessa tai kontekstissä. @fi
toolkit definition: Una famiglia che ha un nome di famiglia che è stato selezionato come preferito in una specifica applicazione o contesto. @it
toolkit definition: عائلة لها اسم عائلة اختير للتفضيل في تطبيق أو في سياق معين. @ar
toolkit definition: 有在一个特定的应用或语境下被首选的一个家族名称的一个家族 @zh-hans
toolkit label: Bevorzugter Name einer Familie von @de
toolkit label: ailesinin tercih ettiği isim @tr
toolkit label: család előnyben részesített neve: @hu
toolkit label: eelisnimi perekonnale @et
toolkit label: ensisijainen nimi suvulle @fi
toolkit label: foretrukket navn på familie af @da
toolkit label: foretrukket navn på familie for @no
toolkit label: geprefereerde naam van familie van @nl
toolkit label: ir dzimtas/ģimenes prioritārais vārds @lv
toolkit label: nom preferit de família de @ca
toolkit label: nom privilégié d’une famille de @fr
toolkit label: nome preferito della famiglia di @it
toolkit label: preferred name of family of
toolkit label: اسم عائلة مفضل لـ @ar
toolkit label: ……的家族的首选名称 @zh-hans
has subproperty: P80145
lexical alias: preferredNameOfFamilyOf.en
status: Published
type: Property
domain: C10012
label: ailesinin tercih edilen adıdır @tr
label: eelisnimi perekonnale @et
label: előnyben részesített entitásneve a következőnek: @hu
label: ensisijainen nimi suvulle @fi
label: er foretrukket navn på familie af @da
label: er foretrukket navn på familie for @no
label: est un nom privilégié d’une famille de @fr
label: ir dzimtas/ģimenes prioritārais vārds @lv
label: is geprefereerde naam van familie van @nl
label: ist bevorzugter Name einer Familie von @de
label: è nome preferito della famiglia di @it
label: és nom preferit de família de @ca
label: هو اسم عائلة مفضل لـ @ar
label: 是……的家族的首选名称 @zh-hans
sub property of: is name of family of
sub property of: is preferred name of collective agent of
definition: Bir ismi, aile adı belirli bir uygulamada veya içerikte tercih edilmek üzere seçilmiş olan bir aile ile ilişkilendirir. @tr
definition: Correla un nomen a una famiglia che ha un nome di famiglia che è stato selezionato come preferito in una specifica applicazione o contesto. @it
definition: Egy noment hozzákapcsol egy családhoz, amelynek van egy olyan családneve, amelyet egy bizonyos alkalmazásban vagy kontextusban előnyben részesítenek. @hu
definition: Liittää nomenin sukuun, jonka nimi on valittu ensisijaiseksi tietyssä sovelluksessa tai kontekstissä. @fi
definition: Met un nomen en relation avec une famille qui possède un nom d’une famille faisant l’objet d’un choix privilégié dans une application ou un contexte spécifiques. @fr
definition: Relaciona un nomen amb una família que té un nom de família que se selecciona com a preferent en una aplicació o un context específic. @ca
definition: Relateert een nomen aan een familie die een naam van familie heeft die als voorkeursterm geselecteerd is in een specifieke toepassing of context. @nl
definition: Relaterer et nomen til en familie som har et navn for familie som er valgt som preferanse i en bestemt applikasjon eller kontekst. @no
definition: Relaterer et nomen til en familie, som har et navn på familie, som er valgt som præference i en specifik anvendelse eller kontekst. @da
definition: Relates a nomen to a family who has a name of family that is selected for preference in a specific application or context.
definition: Sasaista nomenu ar dzimtu/ģimeni, kam ir dzimtas/ģimenes vārds, kurš ir izvēlēts noteiktam lietojumam vai noteiktā kontekstā. @lv
definition: Seostab nomen'i perekonnaga, kellel on kindlas rakenduses või kontekstis eelistatuks valitud nimi. @et
definition: Setzt ein Nomen in Beziehung zu einer Familie, die über einen Namen für eine Familie verfügt, der in einer bestimmten Anwendung oder in einem bestimmten Kontext als Vorzugsform bestimmt wird. @de
definition: يربط تسمية بعائلة لها اسم عائلة اختير للتفضيل في تطبيق أو في سياق معين. @ar
definition: 将一个命名与有在一个特定的应用或语境下被首选的一个家族名称的一个家族关联起来。 @zh-hans

is preferred name of person of
has element type: 2
toolkit definition: A person who has a name of person that is selected for preference in a specific application or context.
toolkit definition: Belirli bir uygulama veya bağlamda tercih için seçilen bir kişinin adına sahip olan kişi. @tr
toolkit definition: Een persoon die een naam van persoon heeft die als voorkeursterm geselecteerd is in een specifieke toepassing of context. @nl
toolkit definition: Egy személy, amelynek van egy olyan személyneve, amelyet egy bizonyos alkalmazásban vagy kontextusban előnyben részesítenek. @hu
toolkit definition: Eine Person, die über einen Namen für eine Person verfügt, der in einer bestimmten Anwendung oder in einem bestimmten Kontext als Vorzugsform bestimmt wird. @de
toolkit definition: En person som har et navn for person som er valgt som preferanse i en bestemt applikasjon eller kontekst. @no
toolkit definition: Henkilö, jonka nimeä ei ole valittu ensisijaiseksi tietyssä sovelluksessa tai kontekstissä. @fi
toolkit definition: Isik, kellel on kindlas rakenduses või kontekstis eelistatuks valitud nimi. @et
toolkit definition: Person, som har et navn på person, som er valgt som præference i en specifik anvendelse eller kontekst. @da
toolkit definition: Persona que té un nom de persona que se selecciona com a preferent en una aplicació o un context específic. @ca
toolkit definition: Persona, kurai ir personas vārds, kurš ir izvēlēts noteiktam lietojumam vai noteiktā kontekstā. @lv
toolkit definition: Personne qui possède un nom de personne faisant l’objet d’un choix privilégié dans une application ou un contexte spécifiques. @fr
toolkit definition: Una persona che ha un nome di persona che è stato selezionato come preferito in una specifica applicazione o contesto. @it
toolkit definition: شخص له اسم شخص اختير للتفضيل في تطبيق أو في سياق معين. @ar
toolkit definition: 有在一个特定的应用或语境下被首选的一个个人名称的一个个人 @zh-hans
toolkit label: Bevorzugter Name einer Person von @de
toolkit label: eelisnimi isikule @et
toolkit label: előnyben részesített neve a következő személynek: @hu
toolkit label: ensisijainen nimi henkilölle @fi
toolkit label: foretrukket navn på person af @da
toolkit label: foretrukket navn på person for @no
toolkit label: geprefereerde naam van persoon van @nl
toolkit label: ir personas prioritārais vārds @lv
toolkit label: kişinin tercih ettiği isim @tr
toolkit label: nom preferit de persona de @ca
toolkit label: nom privilégié d’une personne de @fr
toolkit label: nome preferito della persona di @it
toolkit label: preferred name of person of
toolkit label: اسم شخص مفضل لـ @ar
toolkit label: ……的个人的首选名称 @zh-hans
has subproperty: P80146
lexical alias: preferredNameOfPersonOf.en
status: Published
type: Property
domain: C10012
label: eelisnimi isikule @et
label: előnyben részesített neve a következő személynek: @hu
label: ensisijainen nimi henkilölle @fi
label: er foretrukket navn på person af @da
label: er foretrukket navn på person for @no
label: est un nom privilégié d’une personne de @fr
label: ir personas prioritārais vārds @lv
label: is geprefereerde naam van persoon van @nl
label: ist bevorzugter Name einer Person von @de
label: kişisinin tercih edilen adıdır @tr
label: è nome preferito della persona di @it
label: és nom preferit de persona de @ca
label: هو اسم شخص مفضل لـ @ar
label: 是……的个人的首选名称 @zh-hans
sub property of: is name of person of
sub property of: is preferred name of agent of
definition: Bir ismi, kişinin adı belirli bir uygulamada veya içerikte tercih edilmek üzere seçilmiş olan bir kişi ile ilişkilendirir. @tr
definition: Correla un nomen a una persona che ha un nome di persona che è stato selezionato come preferito in una specifica applicazione o contesto. @it
definition: Egy noment hozzákapcsol egy személyhez, amelynek van egy olyan személyneve, amelyet egy bizonyos alkalmazásban vagy kontextusban előnyben részesítenek. @hu
definition: Liittää nomenin henkilöön, jonka nimi on valittu ensisijaiseksi tietyssä sovelluksessa tai kontekstissä. @fi
definition: Met un nomen en relation avec une personne qui possède un nom de personne faisant l’objet d’un choix privilégié dans une application ou un contexte spécifiques. @fr
definition: Relaciona un nomen amb una persona que té un nom de persona que se selecciona com a preferent en una aplicació o un context específic. @ca
definition: Relateert een nomen aan een persoon die een naam van persoon heeft die als voorkeursterm geselecteerd is in een specifieke toepassing of context. @nl
definition: Relaterer et nomen til en person som har et navn for person som er valgt som preferanse i en bestemt applikasjon eller kontekst. @no
definition: Relaterer et nomen til en person, som har et navn på person, som er valgt som præference i en specifik anvendelse eller kontekst. @da
definition: Relates a nomen to a person who has a name of person that is selected for preference in a specific application or context.
definition: Sasaista nomenu ar personu, kurai ir personas vārds, kurš ir izvēlēts noteiktam lietojumam vai noteiktā kontekstā. @lv
definition: Seostab nomen'i isikuga, kellel on kindlas rakenduses või kontekstis eelistatuks valitud nimi. @et
definition: Setzt ein Nomen in Beziehung zu einer Person, die über einen Namen für eine Person verfügt, der in einer bestimmten Anwendung oder in einem bestimmten Kontext als Vorzugsform bestimmt wird. @de
definition: يربط تسمية بشخص له اسم شخص اختير للتفضيل في تطبيق أو في سياق معين. @ar
definition: 将一个命名与有在一个特定的应用或语境下被首选的一个个人名称的一个个人关联起来。 @zh-hans

is variant name of corporate body of
has element type: 2
toolkit definition: A corporate body who has a name of corporate body that is not selected for preference in a specific application or context.
toolkit definition: Asutus, kellel on nimi, mis kindlas rakenduses või kontekstis ei ole valitud eelistatuks. @et
toolkit definition: Collectivité qui possède un nom de collectivité ne faisant pas l’objet d’un choix privilégié dans une application ou un contexte spécifiques. @fr
toolkit definition: Een corporatie die een naam van corporatie heeft die niet als voorkeursterm geselecteerd is in een specifieke toepassing of context. @nl
toolkit definition: Egy testület, amelynek van egy olyan testületneve, amelyet egy bizonyos alkalmazásban vagy kontextusban nem részesítenek előnyben. @hu
toolkit definition: Eine Körperschaft, die über einen Namen für eine Körperschaft verfügt, der in einer bestimmten Anwendung oder in einem bestimmten Kontext nicht als Vorzugsform bestimmt wird. @de
toolkit definition: En korporasjon som har et navn for korporasjon som ikke er valgt som preferanse i en bestemt applikasjon eller kontekst. @no
toolkit definition: Entitat corporativa que té un nom d’entitat corporativa que no se selecciona com a preferent en una aplicació o un context específic. @ca
toolkit definition: Institūcija, kam ir institūcijas vārds/nosaukums, kurš nav izvēlēts kā prioritārs noteiktā lietojumprogrammā vai kontekstā. @lv
toolkit definition: Korporation, som har et navn på korporation, som ikke er valgt som præference i en specifik anvendelse eller kontekst. @da
toolkit definition: Tüzel kişilik adı belirli bir uygulamada veya içerikte tercih edilmek üzere seçilmemiş olan bir tüzel kişililik. @tr
toolkit definition: Un ente che ha un nome di ente che non è stato selezionato come preferito in una specifica applicazione o contesto. @it
toolkit definition: Yhteisö, jonka nimeä ei ole valittu ensisijaiseksi tietyssä sovelluksessa tai kontekstissä. @fi
toolkit definition: هيئة لها اسم هيئة لم يُختر للتفضيل في تطبيق أو في سياق معين. @ar
toolkit definition: 有在一个特定的应用或语境下未被首选的一个团体名称的一个团体 @zh-hans
toolkit label: Abweichender Name einer Körperschaft von @de
toolkit label: alternativt navn på korporasjon for @no
toolkit label: ir cits vārds/nosaukums institūcijai @lv
toolkit label: nome variante dell'ente di @it
toolkit label: névváltozata a következő testületnek: @hu
toolkit label: tüzel kişinin alternatif ismi @tr
toolkit label: variant af navn på korporation af @da
toolkit label: variant de nom d’entitat corporativa de @ca
toolkit label: variant naam van corporatie van @nl
toolkit label: variant name of corporate body of
toolkit label: variante de nom de collectivité de @fr
toolkit label: variantnimi asutusele @et
toolkit label: varianttinimi yhteisölle @fi
toolkit label: اسم هيئة مختلف لـ @ar
toolkit label: ……的团体的变异名称 @zh-hans
has subproperty: P80147
lexical alias: variantNameOfCorporateBodyOf.en
status: Published
type: Property
domain: C10012
label: er alternativt navn på korporasjon for @no
label: er variant af navn på korporation af @da
label: est une variante de nom de collectivité de @fr
label: ir cits vārds/nosaukums institūcijai @lv
label: is variant naam van corporatie van @nl
label: ist abweichender Name einer Körperschaft von @de
label: névváltozata a következő testületnek: @hu
label: tüzel kişiliğinin farklı ismi @tr
label: variantnimi asutusele @et
label: varianttinimi yhteisölle @fi
label: è nome variante dell'ente di @it
label: és variant de nom d’entitat corporativa de @ca
label: هو اسم هيئة مختلف لـ @ar
label: 是……的团体的变异名称 @zh-hans
sub property of: is name of corporate body of
sub property of: is variant name of collective agent of
definition: Bir ismi, tüzel kişilik adı belirli bir uygulamada veya içerikte tercih edilmek üzere seçilmemiş olan bir tüzel kişililikle ilişkilendirir. @tr
definition: Correla un nomen a un ente che ha un nome di ente che non è stato selezionato come preferito in una specifica applicazione o contesto. @it
definition: Hozzákapcsol egy noment egy testülethez, amelynek van egy olyan testületneve, amelyet egy bizonyos alkalmazásban vagy kontextusban nem részesítenek előnyben. @hu
definition: Liittää nomenin yhteisöön, jonka nimeä ei ole valittu ensisijaiseksi tietyssä sovelluksessa tai kontekstissä. @fi
definition: Met un nomen en relation avec une collectivité qui possède un nom de collectivité ne faisant pas l’objet d’un choix privilégié dans une application ou un contexte spécifiques. @fr
definition: Relaciona un nomen amb una entitat corporativa que té un nom d’entitat corporativa que no se selecciona com a preferent en una aplicació o un context específic. @ca
definition: Relateert een nomen aan een corporatie die een naam van corporatie heeft die niet als voorkeursterm geselecteerd is in een specifieke toepassing of context. @nl
definition: Relaterer et nomen til en korporasjon som har et navn for korporasjon som ikke er valgt som preferanse i en bestemt applikasjon eller kontekst. @no
definition: Relaterer et nomen til en korporation, som har et navn på korporation, som ikke er valgt som præference i en specifik anvendelse eller kontekst. @da
definition: Relates a nomen to a corporate body who has a name of corporate body that is not selected for preference in a specific application or context.
definition: Sasaista nomenu ar institūciju, kam ir institūcijas vārds/nosaukums, kurš nav izvēlēts kā prioritārs noteiktā lietojumprogrammā vai kontekstā. @lv
definition: Seostab nomen'i asutusega, kellel on nimi, mis kindlas rakenduses või kontekstis ei ole valitud eelistatuks. @et
definition: Setzt ein Nomen in Beziehung zu einer Körperschaft, die über einen Namen für eine Körperschaft verfügt, der in einer bestimmten Anwendung oder in einem bestimmten Kontext nicht als Vorzugsform bestimmt wird. @de
definition: يربط تسمية بهيئة لها اسم هيئة لم يُختر للتفضيل في تطبيق أو في سياق معين. @ar
definition: 将一个命名与有在一个特定的应用或语境下未被首选的一个团体名称的一个团体关联起来。 @zh-hans

is variant name of family of
has element type: 2
toolkit definition: A family who has a name of family that is not selected for preference in a specific application or context.
toolkit definition: Ailenin adı belirli bir uygulamada veya içerikte tercih edilmek üzere seçilmemiş olan bir aile. @tr
toolkit definition: Dzimtai/ģimene, kurai ir dzimtas/ģimenes vārds, kurš nav izvēlēts kā prioritārs noteiktā lietojumprogrammā vai kontekstā. @lv
toolkit definition: Een familie die een naam van familie heeft die niet als voorkeursterm geselecteerd is in een specifieke toepassing of context. @nl
toolkit definition: Egy család, amelynek van egy olyan családneve, amelyet egy bizonyos alkalmazásban vagy kontextusban nem részesítenek előnyben. @hu
toolkit definition: Eine Familie, die über einen Namen für eine Familie verfügt, der in einer bestimmten Anwendung oder in einem bestimmten Kontext nicht als Vorzugsform bestimmt wird. @de
toolkit definition: En familie som har et navn for familie som ikke er valgt som preferanse i en bestemt applikasjon eller kontekst. @no
toolkit definition: Familie, som har et navn på familie, som ikke er valgt som præference i en specifik anvendelse eller kontekst. @da
toolkit definition: Famille qui possède un nom d’une famille ne faisant pas l’objet d’un choix privilégié dans une application ou un contexte spécifiques. @fr
toolkit definition: Família que té un nom de família que no se selecciona com a preferent en una aplicació o un context específic. @ca
toolkit definition: Perekond, kellel on nimi, mis kindlas rakenduses või kontekstis ei ole valitud eelistatuks. @et
toolkit definition: Suku, jonka nimeä ei ole valittu ensisijaiseksi tietyssä sovelluksessa tai kontekstissä. @fi
toolkit definition: Una famiglia che ha un nome di famiglia che non è stato selezionato come preferito in una specifica applicazione o contesto. @it
toolkit definition: عائلة لها اسم عائلة لم يُختر للتفضيل في تطبيق أو في سياق معين. @ar
toolkit definition: 有在一个特定的应用或语境下未被首选的一个家族名称的一个家族 @zh-hans
toolkit label: Abweichender Name einer Familie von @de
toolkit label: ailenin alternatif ismi @tr
toolkit label: alternativt navn på familie for @no
toolkit label: ir cits vārds dzimtai/ģimenei @lv
toolkit label: nome variante della famiglia di @it
toolkit label: névvariánsa a következő családnak: @hu
toolkit label: variant af navn på familie af @da
toolkit label: variant de nom de família de @ca
toolkit label: variant naam van familie van @nl
toolkit label: variant name of family of
toolkit label: variante de nom d’une famille de @fr
toolkit label: variantnimi perekonnale @et
toolkit label: varianttinimi suvulle @fi
toolkit label: اسم عائلة مختلف لـ @ar
toolkit label: ……的家族的变异名称 @zh-hans
has subproperty: P80148
lexical alias: variantNameOfFamilyOf.en
status: Published
type: Property
domain: C10012
label: ailesinin farklı ismi @tr
label: er alternativt navn på familie for @no
label: er variant af navn på familie af @da
label: est une variante de nom d’une famille de @fr
label: ir cits vārds dzimtai/ģimenei @lv
label: is variant naam van familie van @nl
label: ist abweichender Name einer Familie von @de
label: névváltozata a következő családnak: @hu
label: variantnimi perekonnale @et
label: varianttinimi suvulle @fi
label: è nome variante della famiglia di @it
label: és variant de nom de família de @ca
label: هو اسم عائلة مختلف لـ @ar
label: 是……的家族的变异名称 @zh-hans
sub property of: is name of family of
sub property of: is variant name of collective agent of
definition: Bir ismi, aile adı belirli bir uygulamada veya içerikte tercih edilmek üzere seçilmemiş olan bir aile ile ilişkilendirir. @tr
definition: Correla un nomen a una famiglia che ha un nome di famiglia che non è stato selezionato come preferito in una specifica applicazione o contesto. @it
definition: Hozzákapcsol egy noment egy családhoz, amelynek van egy olyan családneve, amelyet egy bizonyos alkalmazásban vagy kontextusban nem részesítenek előnyben. @hu
definition: Liittää nomenin sukuun, jonka nimeä ei ole valittu ensisijaiseksi tietyssä sovelluksessa tai kontekstissä. @fi
definition: Met un nomen en relation avec une famille qui possède un nom d’une famille ne faisant pas l’objet d’un choix privilégié dans une application ou un contexte spécifiques. @fr
definition: Relaciona un nomen amb una família que té un nom de família que no se selecciona com a preferent en una aplicació o un context específic. @ca
definition: Relateert een nomen aan een familie die een naam van familie heeft die niet als voorkeursterm geselecteerd is in een specifieke toepassing of context. @nl
definition: Relaterer et nomen til en familie som har et navn for familie som ikke er valgt som preferanse i en bestemt applikasjon eller kontekst. @no
definition: Relaterer et nomen til en familie, som har et navn på familie, som ikke er valgt som præference i en specifik anvendelse eller kontekst. @da
definition: Relates a nomen to a family who has a name of family that is not selected for preference in a specific application or context.
definition: Sasaista nomenu ar dzimtu/ģimeni, kam ir dzimtas/ģimenes vārds, kurš nav izvēlēts kā prioritārs noteiktā lietojumprogrammā vai kontekstā. @lv
definition: Seostab nomen'i perekonnaga, kellel on nimi, mis kindlas rakenduses või kontekstis ei ole valitud eelistatuks. @et
definition: Setzt ein Nomen in Beziehung zu einer Familie, die über einen Namen für eine Familie verfügt, der in einer bestimmten Anwendung oder in einem bestimmten Kontext nicht als Vorzugsform bestimmt wird. @de
definition: يربط تسمية بعائلة لها اسم عائلة لم يُختر للتفضيل في تطبيق أو في سياق معين. @ar
definition: 将一个命名与有在一个特定的应用或语境下未被首选的一个家族名称的一个家族关联起来。 @zh-hans

is variant name of person of
has element type: 2
toolkit definition: A person who has a name of person that is not selected for preference in a specific application or context.
toolkit definition: Belirli bir uygulama veya bağlamda tercih için seçilmemiş bir kişinin adına sahip olan kişi. @tr
toolkit definition: Een persoon die een naam van persoon heeft die niet als voorkeursterm geselecteerd is in een specifieke toepassing of context. @nl
toolkit definition: Egy személy, amelynek van egy olyan személyneve, amelyet egy bizonyos alkalmazásban vagy kontextusban nem részesítenek előnyben. @hu
toolkit definition: Eine Person, die über einen Namen für eine Person verfügt, der in einer bestimmten Anwendung oder in einem bestimmten Kontext nicht als Vorzugsform bestimmt wird. @de
toolkit definition: En person som har et navn for person som ikke er valgt som preferanse i en bestemt applikasjon eller kontekst. @no
toolkit definition: Henkilö, jonka nimeä ei ole valittu ensisijaiseksi tietyssä sovelluksessa tai kontekstissä. @fi
toolkit definition: Isik, kellel on nimi, mis kindlas rakenduses või kontekstis ei ole valitud eelistatuks. @et
toolkit definition: Person, som har et navn på person, som ikke er valgt som præference i en specifik anvendelse eller kontekst. @da
toolkit definition: Persona que té un nom de persona que no se selecciona com a preferent en una aplicació o un context específic. @ca
toolkit definition: Persona, kurai ir personas vārds, kurš nav izvēlēts kā prioritārs noteiktā lietojumprogrammā vai kontekstā. @lv
toolkit definition: Personne qui possède un nom de personne ne faisant pas l’objet d’un choix privilégié dans une application ou un contexte spécifiques. @fr
toolkit definition: Una persona che ha un nome di persona che non è stato selezionato come preferito in una specifica applicazione o contesto. @it
toolkit definition: شخص له اسم شخص لم يُختر للتفضيل في تطبيق أو في سياق معين. @ar
toolkit definition: 有在一个特定的应用或语境下未被首选的一个个人名称的一个个人 @zh-hans
toolkit label: Abweichender Name einer Person von @de
toolkit label: alternativt navn på person for @no
toolkit label: ir cits vārds personai @lv
toolkit label: kişinin alternatif ismi @tr
toolkit label: nome variante della persona di @it
toolkit label: személy névváltozata: @hu
toolkit label: variant af navn på person af @da
toolkit label: variant de nom de persona de @ca
toolkit label: variant naam van persoon van @nl
toolkit label: variant name of person of
toolkit label: variante de nom de personne de @fr
toolkit label: variantnimi isikule @et
toolkit label: varianttinimi henkilölle @fi
toolkit label: اسم شخص مختلف لـ @ar
toolkit label: ……的个人的变异名称 @zh-hans
has subproperty: P80149
lexical alias: variantNameOfPersonOf.en
status: Published
type: Property
domain: C10012
label: er alternativt navn på person for @no
label: er variant af navn på person af @da
label: est une variante de nom de personne de @fr
label: ir cits vārds personai @lv
label: is variant naam van persoon van @nl
label: ist abweichender Name einer Person von @de
label: kişisinin farklı ismi @tr
label: névváltozata a következő személynek: @hu
label: variantnimi isikule @et
label: varianttinimi henkilölle @fi
label: è nome variante della persona di @it
label: és variant de nom de persona de @ca
label: هو اسم شخص مختلف لـ @ar
label: 是……的个人的变异名称 @zh-hans
sub property of: is name of person of
sub property of: is variant name of agent of
definition: Bir ismi,kişinin adı belirli bir uygulamada veya içerikte tercih edilmek üzere seçilmemiş olan bir kişiyle ilişkilendirir. @tr
definition: Correla un nomen a una persona che ha un nome di persona che non è stato selezionato come preferito in una specifica applicazione o contesto. @it
definition: Hozzákapcsol egy noment egy személyhez, amelynek van egy olyan személyneve, amelyet egy bizonyos alkalmazásban vagy kontextusban nem részesítenek előnyben. @hu
definition: Liittää nomenin henkilöön, jonka nimeä ei ole valittu ensisijaiseksi tietyssä sovelluksessa tai kontekstissä. @fi
definition: Met un nomen en relation avec une personne qui possède un nom de personne ne faisant pas l’objet d’un choix privilégié dans une application ou un contexte spécifiques. @fr
definition: Relaciona un nomen amb una persona que té un nom de persona que no se selecciona com a preferent en una aplicació o un context específic. @ca
definition: Relateert een nomen aan een persoon die een naam van persoon heeft die niet als voorkeursterm geselecteerd is in een specifieke toepassing of context. @nl
definition: Relaterer et nomen til en person som har et navn for person som ikke er valgt som preferanse i en bestemt applikasjon eller kontekst. @no
definition: Relaterer et nomen til en person, som har et navn på person, som ikke er valgt som præference i en specifik anvendelse eller kontekst. @da
definition: Relates a nomen to a person who has a name of person that is not selected for preference in a specific application or context.
definition: Sasaista nomenu ar personu, kurai ir personas vārds, kurš nav izvēlēts kā prioritārs noteiktā lietojumprogrammā vai kontekstā. @lv
definition: Seostab nomen'i isikuga, kellel on nimi, mis kindlas rakenduses või kontekstis ei ole valitud eelistatuks. @et
definition: Setzt ein Nomen in Beziehung zu einer Person, die über einen Namen für eine Person verfügt, der in einer bestimmten Anwendung oder in einem bestimmten Kontext nicht als Vorzugsform bestimmt wird. @de
definition: يربط تسمية بشخص له اسم شخص لم يُختر للتفضيل في تطبيق أو في سياق معين. @ar
definition: 将一个命名与有在一个特定的应用或语境下未被首选的一个个人名称的一个个人关联起来。 @zh-hans

is address of corporate body of (Deprecated)
has subproperty: P80150
status: Deprecated
type: Property

is address of person of (Deprecated)
has subproperty: P80151
status: Deprecated
type: Property

is address of family of (Deprecated)
has subproperty: P80152
status: Deprecated
type: Property

is address of agent of (Deprecated)
has subproperty: P80153
status: Deprecated
type: Property

is address of collective agent of (Deprecated)
has subproperty: P80154
status: Deprecated
type: Property

is plate number for notated music of
has element type: 2
toolkit definition: A manifestation of a notated music expression that has an identifier for manifestation other than a publisher number for notated music, assigned by a publisher to indicate the printing plate used in the printing process.
toolkit definition: Bir yayıncı tarafından baskı sürecinde kullanılan baskı plakasını belirtmek üzere atanan, notalı müzik için bir yayıncı numarasından başka bir belirleyici tanımlayıcıya sahip notalı bir müzik anlatımının gösterimi. @tr
toolkit definition: Een manifestatie van een bladmuziek-expressie die een identificatie voor manifestatie heeft anders dan een uitgeversnummer voor bladmuziek, toegekend door een uitgever om de drukplaat aan te geven gebruikt in het drukprocédé. @nl
toolkit definition: Eine Manifestation einer Noten-Expression, die über einen Identifikator für eine Manifestation verfügt, der von einem Verlag zugewiesen wird, um die im Druckprozess verwendete Druckplatte anzugeben, und bei dem es sich nicht um die Noten-Bestellnummer handelt. @de
toolkit definition: En manifestasjon av uttrykk av nedskrevet musikk som har en identifikator for manifestasjon som er en annen enn utgivelsesnummer for nedskrevet musikk, tildelt av en utgiver for å vise til hvilken trykkeplate som er brukt i trykkeprosessen. @no
toolkit definition: Hozzákapcsol egy noment egy zeneilejegyzés-kifejezési forma megjelenési formájához, amelynek a megjelenésiforma-azonosítója eltér a kiadói műjegyzékszámtól, amellyel a kiadó a nyomtatás során használt nyomólemezt jelöli. @hu
toolkit definition: Manifestació d’una expressió de música notada que té un identificador de manifestació diferent d’un número d’editor de música notada, assignat per un editor per indicar la planxa utilitzada en el procés d’impressió. @ca
toolkit definition: Manifestation af et udtryk af noteret musik, som har en identifikator for manifestation andet end et editionsnummer for noteret musik, angivet af en udgiver for at angive den trykplade, som er brugt i trykprocessen. @da
toolkit definition: Manifestation d’une expression de musique notée qui possède un identifiant de manifestation, autre qu’un numéro d’éditeur pour la musique notée, attribué par un éditeur pour identifier la planche utilisée pour l’impression. @fr
toolkit definition: Manifestācija, kurai piešķirts nošu izdevēja numerācijas apzīmējums. Plātnes numurs reizēm ietver iniciāļus, saīsinājumus vai vārdus, kas identificē izdevēju. Dažreiz tam seko skaitlis, kas atbilst lappušu vai plātnes skaitam vai skaitlim, kas atbilst atsevišķai lapai vai plātnei. @lv
toolkit definition: Noodi väljenduse kehastus, mille identifikaator ei ole noodi kirjastajanumber, vaid kirjastaja määratud number, mis osutab trükkimiseks kasutatud trükiplaadile. @et
toolkit definition: Nuottiaineiston ekspression manifestaatio, jonka tunniste ei ole kustantajan nuottiaineistolle antama numero vaan nuottiaineiston laatan numero. Nuottiaineiston laatan numero ilmaisee, mitä painolaattaa on käytetty painamisprosessissa. @fi
toolkit definition: Una manifestazione di una espressione di musica notata che ha un identificatore per la manifestazione diverso dal numero di editore per la musica notata, assegnato da un editore per indicare la lastra usata nel processo di stampa. @it
toolkit definition: تجسيدة لتعبيرة موسيقى مدونة لها مُعرِّف لتجسيدة غير رقم الناشر للموسيقى المدونة، خصصه ناشر لبيان اللوحة المطبوعة المستخدمة في عملية الطباعة. @ar
toolkit definition: 有出版者分配以表示印刷过程中所用印版的除乐谱出版者编号以外的一种载体表现的标识符的一种乐谱内容表达的一种载体表现 @zh-hans
toolkit label: Druckplattennummer für Noten von @de
toolkit label: cotage pour la musique notée de @fr
toolkit label: ir plātnes numurs @lv
toolkit label: müzik notasının plaka numarası @tr
toolkit label: noodi trükiplaadinumber kehastuses @et
toolkit label: numero di lastra per la musica notata @it
toolkit label: nuottiaineiston laatan numero manifestaatiolle @fi
toolkit label: número de planxa de música notada de @ca
toolkit label: plaatnummer voor bladmuziek van @nl
toolkit label: pladenummer for noteret musiknot af @da
toolkit label: plate number for notated music of
toolkit label: platenummer for nedskrevet musikk for @no
toolkit label: zenei műjegyzéki lemezszáma: @hu
toolkit label: رقم لوحة لموسيقى مدونة لـ @ar
toolkit label: ……的乐谱的版号 @zh-hans
has subproperty: P80155
lexical alias: plateNumberForNotatedMusicOf.en
status: Published
type: Property
domain: C10012
label: er pladenummer for noteret musik af @da
label: er platenummer for nedskrevet musikk for @no
label: est un cotage pour la musique notée de @fr
label: ir plātnes numurs @lv
label: is plaatnummer voor bladmuziek van @nl
label: ist Druckplattennummer für Noten von @de
label: noodi trükiplaadinumber kehastuses @et
label: notaya alınmış müziğinin plaka numarasıdır @tr
label: nuottiaineiston laatan numero manifestaatiolle @fi
label: zenei műjegyzéki lemezszáma a következőnek: @hu
label: è numero di lastra per la musica notata @it
label: és número de planxa de música notada de @ca
label: هو رقم لوحة لموسيقى مدونة لـ @ar
label: 是……的乐谱的版号 @zh-hans
sub property of: is identifier for manifestation of
definition: Bir ismi, bir yayıncı tarafından baskı sürecinde kullanılan baskı plakasını belirtmek üzere atanan, notalı müzik için bir yayıncı numarasından başka bir belirleyici tanımlayıcıya sahip notalı bir müzik ifadesinin gösterimiyle ilişkilendirir. @tr
definition: Correla un nomen a una manifestazione di una espressione di musica notata che ha un identificatore per la manifestazione diverso dal numero di editore per la musica notata, assegnato da un editore per indicare la lastra usata nel processo di stampa. @it
definition: Egy zeneilejegyzés-kifejezési forma megjelenési formája, amelynek a megjelenésiforma-azonosítója eltér a kiadói műjegyzékszámtól, amellyel a kiadó a nyomtatás során használt nyomólemezt jelöli. @hu
definition: Liittää nomenin nuottiaineiston ekspression manifestaatioon, jonka tunniste ei ole kustantajan nuottiaineistolle antama numero vaan nuottiaineiston laatan numero. Nuottiaineiston laatan numero ilmaisee, mitä painolaattaa on käytetty painamisprosessissa. @fi
definition: Met un nomen en relation avec une manifestation d’une expression de musique notée qui possède un identifiant de manifestation, autre qu’un numéro d’éditeur pour la musique notée, attribué par un éditeur pour identifier la planche utilisée pour l’impression. @fr
definition: Relaciona un nomen amb una manifestació d’una expressió de música notada que té un identificador de manifestació diferent d’un número d’editor de música notada, assignat per un editor per indicar la planxa utilitzada en el procés d’impressió. @ca
definition: Relateert een nomen aan een manifestatie van een bladmuziek-expressie die een identificatie voor manifestatie heeft anders dan een uitgeversnummer voor bladmuziek, toegekend door een uitgever om de drukplaat aan te geven gebruikt in het drukprocédé. @nl
definition: Relaterer et nomen til en manifestasjon av uttrykk av nedskrevet musikk som har en identifikator for manifestasjon som er en annen enn utgivelsesnummer for nedskrevet musikk, tildelt av en utgiver for å vise til hvilken trykkeplate som er brukt i trykkeprosessen. @no
definition: Relaterer et nomen til en manifestation af et udtryk af noteret musik, som har en identifikator for manifestation andet end et editionsnummer for noteret musik, angivet af en udgiver for at angive den trykplade, som er brugt i trykprocessen. @da
definition: Relates a nomen to a manifestation of a notated music expression that has an identifier for manifestation other than a publisher number for notated music, assigned by a publisher to indicate the printing plate used in the printing process.
definition: Sasaista nomenu ar manifestāciju, kurai piešķirts nošu izdevēja numerācijas apzīmējums. Plātnes numurs reizēm ietver iniciāļus, saīsinājumus vai vārdus, kas identificē izdevēju. Dažreiz tam seko skaitlis, kas atbilst lappušu vai plātnes skaitam vai skaitlim, kas atbilst atsevišķai lapai vai plātnei. @lv
definition: Seostab nomen'i noodi väljenduse kehastusega, mille identifikaator ei ole noodi kirjastajanumber, vaid kirjastaja määratud number, mis osutab trükkimiseks kasutatud trükiplaadile. @et
definition: Setzt ein Nomen in Beziehung zu einer Manifestation einer Noten-Expression, die über einen Identifikator für eine Manifestation verfügt, der von einem Verlag zugewiesen wird, um die im Druckprozess verwendete Druckplatte anzugeben, und bei dem es sich nicht um die Noten-Bestellnummer handelt. @de
definition: يربط تسمية بتجسيدة لتعبيرة عن موسيقى مدونة لها مُعرِّف للتجسيدة غير رقم الناشر للموسيقى المدونة، خصصه ناشر لبيان لوحة الطباعة المستخدمة في عملية الطباعة. @ar
definition: 将一个命名与有出版者分配以表示印刷过程中所用印版的除乐谱出版者编号以外的一种载体表现的标识符的一种乐谱内容表达的一种载体表现关联起来。 @zh-hans
scope note: Az azonosító általában a lapok alján látható, azonban előfordulhat a címoldalon is. A műjegyzéki lemezszám néha magába foglal kezdőbetűket, rövidítéseket vagy a kiadót megnevező szavakat. Időnként egy szám követi, amely megfelel az oldalak vagy lemezek számának vagy egy szám, amely megfelel egyedi oldalnak vagy lemeznek. @hu
scope note: Die Nummer erscheint normalerweise am Ende jeder Seite und manchmal auf der Titelseite. Die Nummer kann aus Initialen, Abkürzungen oder Wörtern bestehen, die den Verlag identifizieren; gefolgt von einer Zahl, die der Zahl der Seiten oder Platten entspricht oder einer Zahl, die einer einzelnen Seite oder Platte entspricht. @de
scope note: Het nummer verschijnt normaliter onderaan elke pagina en soms op de titelpagina. Het nummer kan initialen, afkortingen of woorden bevatten die de uitgever identificeren, of gevolgd worden door ofwel een nummer dat correspondeert met het aantal pagina's of platen ofwel een nummer dat correspondeert met een individuele pagina of plaat. @nl
scope note: Il numero di solito è presente alla base di ciascuna pagina e a volte sul frontespizio. Il numero può comprendere iniziali, abbreviazioni, o parole che identificano l'editore, o seguito da un numero corrispondente al numero di pagine o lastre o un numero che corrisponde una singola pagina o lastra. @it
scope note: Le numéro figure habituellement au bas de chaque page et parfois sur la page de titre. Le numéro peut comprendre des initiales, des abréviations ou des mots identifiant l’éditeur, ou être suivi d’un numéro correspondant au nombre de pages ou de planches ou d’un numéro correspondant à une page ou une planche individuelle. @fr
scope note: Normalment el número figura al peu de cada pàgina, i a vegades a la portada. El número pot incloure inicials, abreviacions o paraules que identifiquen l’editor, o anar seguit d’un número que correspon al nombre de pàgines o de planxes o a un número que correspon a una pàgina o una planxa individual. @ca
scope note: Number asub tavaliselt iga lehekülje jaluses ja mõnikord tiitellehel. Number võib sisaldada kirjastajat identifitseerivaid initsiaale, lühendeid või sõnu, sellele võib järgneda arv, mis vastab lehekülgede või trükiplaatide arvule, või arv, mis vastab üksikule leheküljele või trükiplaadile. @et
scope note: Numero esiintyy yleensä jokaisen sivun alalaidassa ja joskus nimiösivulla. Numero voi sisältää kustantajaa identifioivia alkukirjaimia, lyhenteitä tai sanoja. Numeron perässä voi olla vastaavien sivujen tai laattojen numerot tai yksittäisten sivujen ja laattojen numerot. @fi
scope note: Nummeret forekommer vanligvis på bunnen av hver side, og noen ganger på tittelsiden. Nummeret kan inkludere initialer, forkortelser eller ord som identifiserer utgiveren, eller etterfulgt av et nummer som korresponderer med en enkeltside eller plate. @no
scope note: Nummeret fremtræder normalt nederst på hver side og sommetider på titelsiden. Nummeret kan sommetider indeholde intialer, forkortelser eller ord, som identificerer udgiveren, eller er efterfulgt af et nummer tilsvarende sideantal eller plader eller et nummer, som tilsvarer en enkeltside eller plade. @da
scope note: Numurs parasti atrodas katras lapas apakšā, kā arī var būt titullapā. Numurs var ietvert iniciāļus, saīsinājumus vai vārdus, kas identificē izdevēju, vai tam var sekot numurs, kas atbilst lapu vai plātņu skaitam, vai numurs, kas atbilst atsevišķai lapai vai plātnei. @lv
scope note: Sayı normalde her sayfanın altında ve bazen de başlık sayfasında yer alır. Sayı, yayıncıyı tanımlayan baş harfler, kısaltmalar veya kelimeler içerebilir ya da sayfa veya plaka sayısına karşılık gelen bir sayı veya tek bir sayfa veya levhaya karşılık gelen bir sayı ile takip edilebilir. @tr
scope note: The number normally appears at the bottom of each page, and sometimes on the title page. The number may include initials, abbreviations, or words identifying the publisher, or be followed by a number corresponding to the number of pages or plates or a number corresponding to an individual page or plate.

is publisher number for notated music of
has element type: 2
toolkit definition: A manifestation of a notated music expression that has an identifier for manifestation other than a plate number for notated music, assigned by a publisher.
toolkit definition: Bir yayıncı tarafından atanan notalı müzik için bir plaka numarasından farklı bir bir belirleyici tanımlayıcıya sahip olan notalı bir müzik anlatımının gösterimi. @tr
toolkit definition: Een manifestatie van een bladmuziek-expressie die een identificatie voor manifestatie heeft anders dan een plaatnummer voor bladmuziek, toegekend door een uitgever. @nl
toolkit definition: Eine Manifestation einer Noten-Expression, die über einen Identifikator für eine Manifestation verfügt, der von einem Verlag zugewiesen wird und bei dem es sich nicht um die Druckplattennummer handelt. @de
toolkit definition: En manifestasjon av et uttrykk av nedskrevet musikk som har en identifikator for manifestasjon som ikke er et platenummer for nedskrevet musikk, tildelt av en utgiver. @no
toolkit definition: Hozzákapcsol egy noment egy zenei lejegyzés kifejezési formájának olyan megjelenési formájához, amelynek olyan megjelenésiforma-azonosítója van, amely eltér a zenei lejegyzésnek a kiadó által adott lemezszámától. @hu
toolkit definition: Manifestació d’una expressió de música notada que té un identificador de manifestació diferent d’un número de planxa de música notada, assignat per un editor. @ca
toolkit definition: Manifestation af et udtryk af noteret musik, som har en identifikator for manifestation, som ikke er et pladenummer for noteret musik, angivet af en udgiver. @da
toolkit definition: Manifestation d’une expression de musique notée qui possède un identifiant de manifestation, autre qu’un cotage pour la musique notée, attribué par un éditeur. @fr
toolkit definition: Noodi väljenduse kehastus, mille identifikaator ei ole noodi trükiplaadinumber, vaid kirjastaja määratud number. @et
toolkit definition: Notācijas izteiksmes manifestācija, kurai ir manifestācijas identifikators, kas nav notācijas plātnes numurs, ko piešķīris izdevējs. @lv
toolkit definition: Nuottiaineiston ekspression manifestaatio, jonka tunniste on kustantajan antama tunniste, joka ei ole nuottiaineiston laatan numero. @fi
toolkit definition: Una manifestazione di un'espressione di musica notata che ha un identificatore per la manifestazione che non è un numero di lastra per la musica notata, assegnato da un editore. @it
toolkit definition: تجسيدة لتعبيرة موسيقى مدونة لها مُعرِّف لتجسيدة غير رقم لوحة الموسيقى المدونة الذي خصصه الناشر. @ar
toolkit definition: 有出版者分配的除乐谱版号以外的一种载体表现的标识符的一种乐谱内容表达的一种载体表现 @zh-hans
toolkit label: Noten-Bestellnummer von @de
toolkit label: editionsnummer for noteret musik af @da
toolkit label: ir nošizdevuma izdevējnumurs @lv
toolkit label: kiadói műjegyzékszáma: @hu
toolkit label: kustantajan nuottiaineistolle antama numero manifestaatiolle @fi
toolkit label: müzik notası için yayımcı numarası @tr
toolkit label: noodi kirjastajanumber kehastuses @et
toolkit label: numero dell'editore per la musica notata di @it
toolkit label: numéro d’éditeur pour la musique notée de @fr
toolkit label: número d’editor de música notada de @ca
toolkit label: publisher number for notated music of
toolkit label: uitgeversnummer voor bladmuziek van @nl
toolkit label: utgivelsesnummer for nedskrevet musikk for @no
toolkit label: رقم ناشر لموسيقى مدونة لـ @ar
toolkit label: ……的乐谱的出版者编号 @zh-hans
has subproperty: P80156
lexical alias: publisherNumberForNotatedMusicOf.en
status: Published
type: Property
domain: C10012
label: er editionsnummer for noteret musik af @da
label: er utgivelsesnummer for nedskrevet musikk for @no
label: est un numéro d’éditeur pour la musique notée de @fr
label: ir nošizdevuma izdevējnumurs @lv
label: is uitgeversnummer voor bladmuziek van @nl
label: ist Noten-Bestellnummer von @de
label: kiadói műjegyzékszáma a következőnek: @hu
label: kustantajan nuottiaineistolle antama numero manifestaatiolle @fi
label: noodi kirjastajanumber kehastuses @et
label: notaya alınmış müziğinin yayıncı numarasıdır @tr
label: è numero dell'editore per la musica notata di @it
label: és número d’editor de música notada de @ca
label: هو رقم ناشر لموسيقى مدونة لـ @ar
label: 是……的乐谱的出版者编号 @zh-hans
sub property of: is identifier for manifestation of
definition: Bir ismi, bir yayıncı tarafından atanan notalı müzik için bir plaka numarasından farklı bir bir belirleyici tanımlayıcıya sahip olan notalı bir müzik ifadesinin gösterimle ilişkilendirir. @tr
definition: Correla un nomen a una manifestazione di un'espressione di musica notata che ha un identificatore per la manifestazione che non è un numero di lastra per la musica notata, assegnato da un editore @it
definition: Egy zenei lejegyzés kifejezési formájának megjelenési formája, amelynek olyan megjelenésiforma-azonosítója van, amely eltér a zenei lejegyzésnek a kiadó által adott lemezszámától. @hu
definition: Liittää nomenin nuottiaineiston ekspression manifestaatioon, jonka tunniste on kustantajan antama tunniste, joka ei ole nuottiaineiston laatan numero. @fi
definition: Met un nomen en relation avec une manifestation d’une expression de musique notée qui possède un identifiant de manifestation, autre qu’un cotage pour la musique notée, attribué par un éditeur. @fr
definition: Relaciona un nomen amb una manifestació d’una expressió de música notada que té un identificador de manifestació diferent d’un número de planxa de música notada, assignat per un editor. @ca
definition: Relateert een nomen aan een manifestatie van een bladmuziek-expressie die een identificatie voor manifestatie heeft anders dan een plaatnummer voor bladmuziek, toegekend door een uitgever. @nl
definition: Relaterer et nomen til en manifestasjon av et uttrykk av nedskrevet musikk som har en identifikator for manifestasjon som ikke er et platenummer for nedskrevet musikk, tildelt av en utgiver. @no
definition: Relaterer et nomen til en manifestation af et udtryk af noteret musik, som har en identifikator for manifestation, som ikke er et pladenummer for noteret musik, angivet af en udgiver. @da
definition: Relates a nomen to a manifestation of a notated music expression that has an identifier for manifestation other than a plate number for notated music, assigned by a publisher.
definition: Sasaista nomenu ar manifestāciju, kas ir notācijas izteiksmes manifestācija, kurai ir manifestācijas identifikators, kas nav notācijas plātnes numurs, ko piešķīris izdevējs. @lv
definition: Seostab nomen'i noodi väljenduse kehastusega, mille identifikaator ei ole noodi trükiplaadinumber, vaid kirjastaja määratud number. @et
definition: Setzt ein Nomen in Beziehung zu einer Manifestation einer Noten-Expression, die über einen Identifikator für eine Manifestation verfügt, der von einem Verlag zugewiesen wird und bei dem es sich nicht um die Druckplattennummer handelt. @de
definition: يربط تسمية بتجسيدة لتعبيرة عن موسيقى مدونة لها مُعرِّف لتجسيدة غير رقم لوحة الموسيقى المدونة الذي خصصه الناشر. @ar
definition: 将一个命名与有出版者分配的除乐谱版号以外的一种载体表现的标识符的一种乐谱内容表达的一种载体表现关联起来。 @zh-hans
scope note: A szám általában a címoldalon, a borítón vagy a zenei lejegyzés első oldalán jelenik meg, és néha magába foglal kezdőbetűket, rövidítéseket vagy a kiadót megnevező szavakat. @hu
scope note: Die Nummer erscheint normalerweise nur auf der Titelseite, der Einbanddecke oder der ersten Seite von Musikalien und enthält manchmal Initialen, Abkürzungen oder Wörter, die den Verlag identifizieren. @de
scope note: El número normalment només figura a la portada, la coberta o a la primera pàgina de la música i, de vegades, inclou inicials, abreviacions o paraules identificadores de l’editor. @ca
scope note: Het nummer verschijnt normaliter alleen op de titelpagina, het omslag of de eerste pagina met muziek, en soms omvat initialen, afkortingen of woorden die de uitgever identificeren. @nl
scope note: Le numéro figure habituellement uniquement sur la page de titre, la couverture ou la première page de musique et comprend parfois des initiales, des abréviations ou des mots identifiant l’éditeur. @fr
scope note: Numero esiintyy yleensä nimiösivulla, kannessa tai nuottiaineiston ensimmäisellä sivulla ja sisältää joskus kustantajaa identifioivia alkukirjaimia, lyhenteitä tai sanoja. @fi
scope note: Nummeret forkommer normalt kun på titelsiden, omslaget, eller den første musiksiden, og indeholder sommetider initialer, forkortelser eller ord, der identificerer udgiveren. @da
scope note: Numurs parasti atrodas tikai titullapā, uz vāka vai nošizdevuma pirmajā lapā, un dažreiz ietver iniciāļus, saīsinājumus vai vārdus, kas identificē izdevēju. @lv
scope note: Sayı normalde yalnızca başlık sayfasında, kapakta veya müziğin ilk sayfasında görünür ve ara sıra baş harfler, kısaltmalar veya yayıncıyı tanımlayan sözcükler içerir. @tr
scope note: The number normally appears only on the title page, the cover, or the first page of music, and sometimes includes initials, abbreviations, or words identifying the publisher.
scope note: عادة لا يظهر الرقم إلا على صفحة العنوان، أو على الغلاف، أو على الصفحة الأولى للموسيقى، وأحيانًا يتضمن أحرفا استهلالية، أو اختصارات، أو كلمات تدل على الناشر. @ar
scope note: 该编号通常只出现在题名页、封面或乐谱的第一页，有时候包括标识出版者的缩略词或单词。 @zh-hans

is alternate identity of person of
has element type: 2
toolkit definition: A person who has an appellation of person that is a pseudonym or other assumed identity.
toolkit definition: Een persoon die een benaming van persoon heeft die een pseudoniem is of andere aangenomen identiteit. @nl
toolkit definition: Eine Person, die über eine Bezeichnung für eine Person verfügt, bei der es sich um ein Pseudonym oder eine andere angenommene Identität handelt. @de
toolkit definition: En person som har en betegnelse for person som er et pseudonym eller annen antatt identitet. @no
toolkit definition: Henkilö, jonka nimitys on pseudonyymi tai muu omaksuttu identiteetti. @fi
toolkit definition: Hozzákapcsol egy noment egy személyhez, akinek olyan személymegnevezése van, amely álnév vagy más feltételezett identitás. @hu
toolkit definition: Isik, kellel on isiku nimetuseks pseudonüüm või muu endale võetud identiteet. @et
toolkit definition: Person, som har en benævnelse på person, som er et pseudonym eller anden antaget identitet. @da
toolkit definition: Persona que té una apel·lació de persona que és un pseudònim o qualsevol altra identitat adoptada. @ca
toolkit definition: Persona, kuras vārds ir pseidonīms vai cita pieņemta identitāte. @lv
toolkit definition: Personne qui possède une appellation de personne consistant en un pseudonyme ou en une autre identité d’emprunt. @fr
toolkit definition: Takma ad veya başka bir varsayılan kimlikle kişi unvanına sahip olan kişi. @tr
toolkit definition: Una persona che ha una designazione di persona che è uno pseudonimo o un'altra identità assunta. @it
toolkit definition: شخص له اسم شخص عبارة عن اسم مستعار أو أي هوية أخرى زائفة. @ar
toolkit definition: 有化名或其他假定身份作为个人称谓的一个个人 @zh-hans
toolkit label: Andere Identität einer Person von @de
toolkit label: Kişisinin alternatif kimliği @tr
toolkit label: alternate identity of person of
toolkit label: alternatieve identiteit van persoon van @nl
toolkit label: alternativ identitet for person af @da
toolkit label: alternativ identitet for person for @no
toolkit label: alternatív identitása a következő személynek: @hu
toolkit label: identitat alternativa de persona de @ca
toolkit label: identità alternativa pdella persona di @it
toolkit label: identité alternative d’une personne de @fr
toolkit label: ir cita identitāte personai @lv
toolkit label: teine identiteet isikule @et
toolkit label: toinen identiteetti henkilölle @fi
toolkit label: هوية بديلة لشخص لـ @ar
toolkit label: ……的个人的交替身份 @zh-hans
has subproperty: P80157
lexical alias: alternateIdentityOfPersonOf.en
status: Published
type: Property
domain: C10012
label: alternatív identitása a következő személynek: @hu
label: er alternativ identitet for person af @da
label: er alternativ identitet for person for @no
label: est une identité alternative d’une personne de @fr
label: ir cita identitāte personai @lv
label: is alternatieve identiteit van persoon van @nl
label: ist andere Identität einer Person von @de
label: kişisinin alternatif kimliğidir @tr
label: teine identiteet isikule @et
label: toinen identiteetti henkilölle @fi
label: è identità alternativa della persona di @it
label: és identitat alternativa de persona de @ca
label: هي هوية بديلة لشخص لـ @ar
label: 是……的个人的交替身份 @zh-hans
sub property of: is appellation of person of
definition: Bir ismi, takma ad veya kabul edilen farklı bir kimliği olan bir kişi ile ilişkilendirir. @tr
definition: Correla un nomen a una persona che ha una designazione di persona che è uno pseudonimo o un'altra identità assunta. @it
definition: Egy személy, akinek olyan személymegnevezése van, amely álnév vagy más feltételezett identitás. @hu
definition: Liittää nomenin henkilöön, jonka nimitys on pseudonyymi tai muu omaksuttu identiteetti. @fi
definition: Met un nomen en relation avec une personne qui possède une appellation de personne consistant en un pseudonyme ou en une autre identité d’emprunt. @fr
definition: Relaciona un nomen amb una persona que té una apel·lació de persona que és un pseudònim o qualsevol altra identitat adoptada. @ca
definition: Relateert een nomen aan een persoon die een benaming van persoon heeft die een pseudoniem is of andere aangenomen identiteit. @nl
definition: Relaterer et nomen til en person som har en betegnelse for person som er et pseudonym eller annen antatt identitet. @no
definition: Relaterer et nomen til en person, som har en benævnelse på person, som er et pseudonym eller anden antaget identitet. @da
definition: Relates a nomen to a person who has an appellation of person that is a pseudonym or other assumed identity.
definition: Sasaista nomenu ar personu, kuras vārds ir pseidonīms vai cita pieņemta identitāte. @lv
definition: Seostab nomen'i isikuga, kellel on isiku nimetuseks pseudonüüm või muu endale võetud identiteet. @et
definition: Setzt ein Nomen in Beziehung zu einer Person, die über eine Bezeichnung für eine Person verfügt, bei der es sich um ein Pseudonym oder eine andere angenommene Identität handelt. @de
definition: يربط تسمية بشخص له اسم شخص عبارة عن اسم مستعار أو أي هوية أخرى زائفة . @ar
definition: 将一个命名与有化名或其他假定身份作为个人称谓的一个个人关联起来。 @zh-hans

is real identity of person of
has element type: 2
toolkit definition: A person who has an appellation of person that is a real identity.
toolkit definition: Een persoon die een benaming van persoon heeft die een echte identiteit is. @nl
toolkit definition: Egy személy, akinek olyan személymegnevezése van, amely a valódi identitása. @hu
toolkit definition: Eine Person, die über eine Bezeichnung für eine Person verfügt, bei der es sich um eine wirkliche Identität handelt. @de
toolkit definition: En person som har en betegnelse for person som er en virkelig identitet. @no
toolkit definition: Gerçek kimliği olan bir kişi unvanına sahip olan kişi. @tr
toolkit definition: Henkilö, jonka nimitys on todellinen identiteetti. @fi
toolkit definition: Isik, kellel on isiku nimetuseks tegelik identiteet. @et
toolkit definition: Person, som har en benævnelse på person, som er en sand identitet. @da
toolkit definition: Persona que té una apel·lació de persona que és una identitat real. @ca
toolkit definition: Persona, kurai ir personas apzīmējums, kas ir tās patiesā identitāte. @lv
toolkit definition: Personne qui possède une appellation de personne consistant en une identité réelle. @fr
toolkit definition: Una persona che ha una designazione di persona che è una identità reale. @it
toolkit definition: شخص له اسم شخص عبارة عن هوية حقيقية. @ar
toolkit definition: 有真实身份作为个人称谓的一个个人 @zh-hans
toolkit label: Wahre Identität einer Person von @de
toolkit label: echte identiteit van persoon van @nl
toolkit label: identitat real de persona de @ca
toolkit label: identità reale della persona di @it
toolkit label: identité réelle d’une personne de @fr
toolkit label: ir personas patiesā identitāte @lv
toolkit label: kişisinin gerçek kimliği @tr
toolkit label: real identity of person of
toolkit label: sand identitet for person af @da
toolkit label: személy valódi identitása: @hu
toolkit label: tegelik identiteet isikule @et
toolkit label: todellinen identiteetti henkilölle @fi
toolkit label: virkelig identitet for person for @no
toolkit label: هوية حقيقية لشخص لـ @ar
toolkit label: ……的个人的真实身份 @zh-hans
has subproperty: P80158
lexical alias: realIdentityOfPersonOf.en
status: Published
type: Property
domain: C10012
label: er sand identitet for person af @da
label: er virkelig identitet for person for @no
label: est une identité réelle d’une personne de @fr
label: ir personas patiesā identitāte @lv
label: is echte identiteit van persoon van @nl
label: ist wahre Identität einer Person von @de
label: kişisinin gerçek kimliğidir @tr
label: személy valódi identitása a következőnek: @hu
label: tegelik identiteet isikule @et
label: todellinen identiteetti henkilölle @fi
label: è identità reale della persona di @it
label: és identitat real de persona de @ca
label: هي هوية حقيقية لشخص لـ @ar
label: 是……的个人的真实身份 @zh-hans
sub property of: is appellation of person of
definition: Bir ismi, gerçek kimliğinde olan unvanına sahip bir kişiyle ilişkilendirir. @tr
definition: Correla un nomen a una persona che ha una designazione di persona che è una identità reale. @it
definition: Hozzákapcsol egy noment egy személyhez, akinek olyan személymegnevezése van, amely a valódi identitása. @hu
definition: Liittää nomenin henkilöön, jonka nimitys on todellinen identiteetti. @fi
definition: Met un nomen en relation avec une personne qui possède une appellation de personne consistant en une identité réelle. @fr
definition: Relaciona un nomen amb una persona que té una apel·lació de persona que és una identitat real. @ca
definition: Relateert een nomen aan een persoon die een benaming van persoon heeft die een echte identiteit is. @nl
definition: Relaterer et nomen til en person, som har en benævnelse på person, som er en sand identitet. @da
definition: Relaterer et noment til en person som har en betegnelse for person som er en virkelig identitet. @no
definition: Relates a nomen to a person who has an appellation of person that is a real identity.
definition: Sasaista nomenu ar personu, kurai ir personas apzīmējums, kas ir tās patiesā identitāte. @lv
definition: Seostab nomen'i isikuga, kellel on isiku nimetuseks tegelik identiteet. @et
definition: Setzt ein Nomen in Beziehung zu einer Person, die über eine Bezeichnung für eine Person verfügt, bei der es sich um eine wirkliche Identität handelt. @de
definition: يربط تسمية بشخص له اسم شخص عبارة عن هوية حقيقية. @ar
definition: 将一个命名与有真实身份作为个人称谓的一个个人关联起来。 @zh-hans

is access point for RDA entity of
has element type: 2
toolkit definition: An RDA entity that has an appellation in natural language that is taken from a vocabulary encoding scheme or is constructed using a string encoding scheme.
toolkit definition: Bir kelime kodlama şemasından alınan veya bir dize kodlama şeması kullanılarak oluşturulan doğal dilde bir unvana sahip bir RDA varlığı. @tr
toolkit definition: Een RDA-entiteit die een benaming heeft in natuurlijke taal ontleend aan een vocabulair coderingssysteem of gevormd is volgens een string coderingsschema. @nl
toolkit definition: Egy RDA-entitás, amelynek van egy olyan természetes nyelvű megnevezése, amely egy szótárkódolási sémából származik, vagy egy karakterlánc-kódolási séma használatával szerkesztett. @hu
toolkit definition: Eine RDA-Entität, die eine Bezeichnung in natürlicher Sprache hat, die einem Vocabulary Encoding Scheme entnommen oder mit einem String Encoding Scheme konstruiert wird. @de
toolkit definition: En RDA-entitet som har en betegnelse på et naturlig språk som er hentet fra et kodeskjema for vokabular eller som er konstruert ved hjelp av et kodeskjema for syntaks. @no
toolkit definition: Entitat RDA que té una apel·lació en llenguatge natural que s’obté d’un esquema de codificació de vocabulari o s’elabora usant un esquema de codificació de cadenes. @ca
toolkit definition: Entité RDA qui possède une appellation en langage naturel provenant d’un schéma d’encodage de vocabulaire ou construite à l’aide d’un schéma d’encodage de chaînes. @fr
toolkit definition: RDA entīte, kurai ir vārds/nosaukums dabiskā valodā, kas ņemts no shēmas kontrolētu vārdnīcu kodēšanai vai tiek konstruēts, izmantojot virknes kodēšanas shēmu @lv
toolkit definition: RDA olem, millel on loomulikus keeles nimetus, mis on võetud leksikaalsest märkimissüsteemist või moodustatud stringilise märkimissüsteemi alusel. @et
toolkit definition: RDA-entiteetti, jonka luonnollisen kielen mukainen nimitys on otettu jostakin sanaston merkintäjärjestelmästä tai muodostettu jotakin merkkijonon merkintäjärjestelmää käyttäen. @fi
toolkit definition: RDA-entitet, som har en benævnelse på normalsprog, som er taget fra et vokabularkodningsskema eller er konstrueret ved hjælp af et strengkodningsskema. @da
toolkit definition: Un'entità RDA che ha una denominazione nel linguaggio naturale che è tratta da uno schema di codifica di vocabolario o è costruita usando uno schema di codifica di stringa. @it
toolkit definition: كيان "وام" له اسم في لغة طبيعية مأخوذ من خطة ترميز مفردات أو مبني باستخدام خطة ترميز سلسلة تمثيلات. @ar
toolkit definition: 有取自一个词表编码体系或者用一个串编码体系构建、用自然语言的一个称谓的一个RDA实体 @zh-hans
toolkit label: RDA varlığı için erişim noktası @tr
toolkit label: Sucheinstieg für eine RDA-Entität von @de
toolkit label: access point for RDA entity of
toolkit label: hakutieto RDA-entiteetille @fi
toolkit label: hozzáférési pont a következő RDA-entitás számára: @hu
toolkit label: ingang voor RDA-entiteit van @nl
toolkit label: ir pamatforma RDA entītei @lv
toolkit label: otsielement RDA olemile @et
toolkit label: point d’accès d’une entité RDA de @fr
toolkit label: punt d’accés d’entitat RDA de @ca
toolkit label: punto d'accesso per l'entità RDA di @it
toolkit label: søgeindgang for RDA-entitet af @da
toolkit label: søkeinngang for RDA-entitet for @no
toolkit label: نقطة وصول لكيان "وام" لـ @ar
toolkit label: ……的RDA实体的检索点 @zh-hans
has subproperty: is access point for item of
has subproperty: is access point for agent of
has subproperty: is access point for expression of
has subproperty: is access point for manifestation of
has subproperty: is access point for place of
has subproperty: is access point for timespan of
has subproperty: is access point for work of
has subproperty: is authorized access point for RDA entity of
has subproperty: is variant access point for RDA entity of
has subproperty: P80159
lexical alias: accessPointForRDAEntityOf.en
status: Published
type: Property
domain: C10012
label: RDA varlığı için erişim noktasıdır @tr
label: er søgeindgang for RDA-entitet af @da
label: er søkeinngang for RDA-entitet for @no
label: est un point d’accès d’une entité RDA de @fr
label: hakutieto RDA-entiteetille @fi
label: hozzáférési pont a következő RDA-entitás számára: @hu
label: ir pamatforma RDA entītei @lv
label: is ingang voor RDA-entiteit van @nl
label: ist Sucheinstieg für eine RDA-Entität von @de
label: otsielement RDA olemile @et
label: è punto d'accesso per l'entità RDA di @it
label: és punt d’accés d’entitat RDA de @ca
label: هي نقطة وصول لكيان "وام" لـ @ar
label: 是……的RDA实体的检索点 @zh-hans
sub property of: is appellation of RDA entity of
definition: Bir ismi, bir kelime kodlama şemasından alınan veya bir dize kodlama şeması kullanılarak oluşturulan doğal dilde adlandırılan bir RDA varlığıyla ilişkilendirir. @tr
definition: Correla un nomen a un'entità RDA che ha una denominazione nel linguaggio naturale che è tratta da uno schema di codifica di vocabolario o è costruita usando uno schema di codifica di stringa. @it
definition: Hozzákapcsol egy noment egy RDA-entitáshoz, amelynek van egy olyan természetes nyelvű megnevezése, amely egy szótárkódolási sémából származik, vagy egy karakterlánc-kódolási séma használatával szerkesztett. @hu
definition: Liittää nomenin RDA-entiteettiin, jonka luonnollisen kielen mukainen nimitys on otettu jostakin sanaston merkintäjärjestelmästä tai muodostettu jotakin merkkijonon merkintäjärjestelmää käyttäen. @fi
definition: Met un nomen en relation avec une entité RDA qui possède une appellation en langage naturel provenant d’un schéma d’encodage de vocabulaire ou construite à l’aide d’un schéma d’encodage de chaînes. @fr
definition: Relaciona un nomen amb una entitat RDA que té una apel·lació en llenguatge natural que s’obté d’un esquema de codificació de vocabulari o s’elabora usant un esquema de codificació de cadenes. @ca
definition: Relateert een nomen aan een RDA-entiteit die een benaming heeft in natuurlijke taal ontleend aan een vocabulair coderingssysteem of gevormd is volgens een string coderingsschema. @nl
definition: Relaterer et nomen til en RDA-entitet som har en betegnelse på et naturlig språk som er hentet fra et kodeskjema for vokabular eller som er konstruert ved hjelp av et kodeskjema for syntaks. @no
definition: Relaterer et nomen til en RDA-entitet, som har en benævnelse på normalsprog, som er taget fra et vokabularkodningsskema eller er konstrueret ved hjælp af et strengkodningsskema. @da
definition: Relates a nomen to an RDA entity that has an appellation in natural language that is taken from a vocabulary encoding scheme or is constructed using a string encoding scheme.
definition: Sasaista nomenu ar RDA entīti, kurai ir vārds/nosaukums dabiskā valodā, kas ņemts no shēmas kontrolētu vārdnīcu kodēšanai vai tiek konstruēts, izmantojot virknes kodēšanas shēmu. @lv
definition: Seostab nomen'i RDA olemiga, millel on loomulikus keeles nimetus, mis on võetud leksikaalsest märkimissüsteemist või moodustatud stringilise märkimissüsteemi alusel. @et
definition: Setzt ein Nomen in Beziehung zu einer RDA-Entität, die eine Bezeichnung in natürlicher Sprache hat, die einem Vocabulary Encoding Scheme entnommen oder mit einem String Encoding Scheme konstruiert wird. @de
definition: يربط تسمية بكيان "وام" له اسم في لغة طبيعية مأخوذة من خطة ترميز مفردات أو مبنية باستخدام خطة ترميز سلسلة تمثيلات. @ar
definition: 将一个命名与有取自一个词表编码体系或者用一个串编码体系构建、用自然语言的一个称谓的一个RDA实体关联起来。 @zh-hans

is identifier for RDA entity of
has element type: 2
toolkit definition: An RDA entity that has an appellation of RDA entity that is a reference code taken from a vocabulary encoding scheme.
toolkit definition: Bir kelime kodlama şemasından alınan bir referans kodu olan RDA varlığı unvanına sahip bir RDA varlığı. @tr
toolkit definition: Een RDA-entiteit die een benaming van RDA-entiteit heeft die een referentiecode is ontleend aan een vocabulair coderingssysteem. @nl
toolkit definition: Egy RDA-entitás, amelynek van olyan RDA-entitás-megnevezése, amely egy szótárkódolási sémából származó hivatkozási kód. @hu
toolkit definition: Eine RDA-Entität, die über eine Bezeichnung für eine RDA-Entität verfügt, die einen Referenzcode darstellt, der aus einem Vocabulary Encoding Scheme entnommen wird. @de
toolkit definition: En RDA-entitet som har en betegnelse for verk som er en referansekode som er hentet fra et kodeskjema for vokabular. @no
toolkit definition: Entitat RDA que té una apel·lació d’entitat RDA que és un codi de referència obtingut d’un esquema de codificació de vocabulari. @ca
toolkit definition: Entité RDA qui possède une appellation d’entité RDA consistant en un code de référence provenant d’un schéma d’encodage de vocabulaire. @fr
toolkit definition: RDA entīte, kurai ir izteiksmes apzīmējums kodētā vārdnīcā. @lv
toolkit definition: RDA olem, millel on RDA olemi nimetuseks leksikaalsest märkimissüsteemist võetud viitekood. @et
toolkit definition: RDA-entiteetti, jolla on RDA-entiteetin nimitys, joka on sanaston merkintäjärjestelmästä otettu viitekoodi. @fi
toolkit definition: RDA-entitet, som har en benævnelse på RDA-entitet, som er en referencekode hentet fra et vokabularkodningsskema. @da
toolkit definition: Un'entità RDA che ha una denominazione di Entità RDA che è un codice di riferimento tratto da uno schema di codifica di vocabolario. @it
toolkit definition: كيان "وام" له اسم كيان "وام" عبارة عن رمز إحالة مأخوذ من خطة ترميز مفردات. @ar
toolkit definition: 有一个取自一个词表编码体系的指称代码作为RDA实体称谓的一个RDA实体 @zh-hans
toolkit label: Identifikator für eine RDA-Entität von @de
toolkit label: RDA varlığının tanımlayıcısıdır @tr
toolkit label: azonosító a következő RDA-entitás számára: @hu
toolkit label: identifiant d’entité RDA de @fr
toolkit label: identificador d’entitat RDA de @ca
toolkit label: identificatie voor RDA-entiteit van @nl
toolkit label: identificatore per l'entità RDA di @it
toolkit label: identifier for RDA entity of
toolkit label: identifikaator RDA olemile @et
toolkit label: identifikator for RDA-entitet af @da
toolkit label: identifikator for RDA-entitet for @no
toolkit label: ir identifikators RDA entītei @lv
toolkit label: tunniste RDA-entiteetille @fi
toolkit label: مُعرِّف لكيان "وام" لـ @ar
toolkit label: ……的RDA实体的标识符 @zh-hans
has subproperty: is identifier for agent of
has subproperty: is identifier for place of
has subproperty: is identifier for expression of
has subproperty: is identifier for item of
has subproperty: is identifier for manifestation of
has subproperty: is identifier for work of
has subproperty: is identifier for timespan of
has subproperty: P80160
lexical alias: identifierForRDAEntityOf.en
status: Published
type: Property
domain: C10012
label: RDA varlığının tanımlayıcısıdır @tr
label: azonosító a következő RDA-entitás számára: @hu
label: er identifikator for RDA-entitet af @da
label: er identifikator for RDA-entitet for @no
label: est un identifiant d’entité RDA de @fr
label: identifikaator RDA olemile @et
label: ir identifikators RDA entītei @lv
label: is identificatie voor RDA-entiteit van @nl
label: ist Identifikator für eine RDA-Entität von @de
label: tunniste RDA-entiteetille @fi
label: è identificatore per l'entità RDA di @it
label: és identificador d’entitat RDA de @ca
label: هو مُعرِّف لكيان "وام" لـ @ar
label: 是……的RDA实体的标识符 @zh-hans
sub property of: is appellation of RDA entity of
definition: Bir ismi bir kelime kodlama şemasından alınan bir referans kodu olan RDA varlığı ifadesine sahip bir RDA varlığıyla ilişkilendirir. @tr
definition: Correla un nomen a un'entità RDA che ha una denominazione di Entità RDA che è un codice di riferimento tratto da uno schema di codifica di vocabolario. @it
definition: Hozzákapcsol egy noment egy RDA-entitáshoz, amelynek van olyan RDA-entitás-megnevezése, amely egy szótárkódolási sémából származó hivatkozási kód. @hu
definition: Liittää nomenin RDA-entiteettiin, jolla on RDA-entiteetin nimitys, joka on sanaston merkintäjärjestelmästä otettu viitekoodi. @fi
definition: Met un nomen en relation avec une entité RDA qui possède une appellation d’entité RDA consistant en un code de référence provenant d’un schéma d’encodage de vocabulaire. @fr
definition: Relaciona un nomen amb una entitat RDA que té una apel·lació d’entitat RDA que és un codi de referència obtingut d’un esquema de codificació de vocabulari. @ca
definition: Relateert een nomen aan een RDA-entiteit die een benaming van RDA-entiteit heeft die een referentiecode is ontleend aan een vocabulair coderingssysteem. @nl
definition: Relaterer et nomen til en RDA-entitet som har en betegnelse for verk som er en referansekode som er hentet fra et kodeskjema for vokabular. @no
definition: Relaterer et nomen til en RDA-entitet, som har en benævnelse på RDA-entitet, som er en referencekode hentet fra et vokabularkodningsskema. @da
definition: Relates a nomen to an RDA entity that has an appellation of RDA Entity that is a reference code taken from a vocabulary encoding scheme.
definition: Sasaista nomenu ar RDA entīti, kurai ir izteiksmes apzīmējums kodētā vārdnīcā. @lv
definition: Seostab nomen'i RDA olemiga, millel on RDA olemi nimetuseks leksikaalsest märkimissüsteemist võetud viitekood. @et
definition: Setzt ein Nomen in Beziehung zu einer RDA-Entität, die über eine Bezeichnung für eine RDA-Entität verfügt, die einen Referenzcode darstellt, der aus einem Vocabulary Encoding Scheme entnommen wird. @de
definition: يربط تسمية بكيان "وام" له اسم لكيان "وام" عبارة عن رمز إحالة مأخوذ من خطة ترميز مفردات. @ar
definition: 将一个命名与有一个取自一个词表编码体系的指称代码作为RDA实体称谓的一个RDA实体关联起来。 @zh-hans

is name of RDA entity of
has element type: 2
toolkit definition: An RDA entity that has an appellation of RDA entity in natural language and phrasing used in common discourse.
toolkit definition: Doğal dilde ve yaygın söylemde kullanılan ifadelerde RDA varlığı unvanına sahip bir RDA varlığı. @tr
toolkit definition: Een RDA-entiteit die een benaming van RDA-entiteit heeft in natuurlijke taal en terminologie in gebruikelijke bewoording. @nl
toolkit definition: Egy RDA-entitás, amelynek van egy RDA-entitás-megnevezése természetes nyelven és közbeszédben használt kifejezéssel. @hu
toolkit definition: Eine RDA-Entität, die über eine Bezeichnung für eine RDA-Entität in natürlicher Sprache und Ausdrucksweise verfügt, die beim normalen Sprechen und Schreiben verwendet wird. @de
toolkit definition: En RDA-entitet som har en betegnelse for RDA-entitet på en naturlig språk og med frasering brukt i alminnelig diskurs. @no
toolkit definition: Entitat RDA que té una apel·lació d’entitat RDA en llenguatge i frases naturals usada en el discurs comú. @ca
toolkit definition: Entité RDA qui possède une appellation d’entité RDA exprimée dans un langage et une formulation naturels et utilisée dans le langage courant. @fr
toolkit definition: RDA entīte, kurai ir RDA entītes apzīmējums dabiskajā valodā, ko izmanto savstarpējā saziņā. @lv
toolkit definition: RDA olem, millel on nimetus loomulikus keeles ja sõnastuses, mida kasutatakse ühises diskursuses. @et
toolkit definition: RDA-entiteetti, jolla on luonnollisen kielen ja yleisen diskurssin sanamuodon mukainen nimitys. @fi
toolkit definition: RDA-entitet, som har en benævnelse på RDA-entitet på normalsprog og med formuleringer, som bruges alment. @da
toolkit definition: Un'entità RDA che ha una designazione di entità RDA in linguaggio e frasi naturali usati nel discorso comune. @it
toolkit definition: كيان "وام" له اسم لكيان "وام" في لغة طبيعية مستخدم في الخطاب العام. @ar
toolkit definition: 有用自然语言和普通话语措词表达的RDA实体称谓的一个RDA实体 @zh-hans
toolkit label: Name einer RDA-Entität von @de
toolkit label: RDA varlığının adı @tr
toolkit label: RDA-entitás neve: @hu
toolkit label: naam van RDA-entiteit van @nl
toolkit label: name of RDA entity of
toolkit label: navn for RDA-entitet for @no
toolkit label: navn på RDA-entitet af @da
toolkit label: nimi RDA olemile @et
toolkit label: nimi RDA-entiteetille @fi
toolkit label: nom d’entitat RDA de @ca
toolkit label: nom d’entité RDA de @fr
toolkit label: nome dell'entità RDA di @it
toolkit label: nosaukums RDA entītei @lv
toolkit label: اسم كيان "وام" لـ @ar
toolkit label: ……的RDA实体的名称 @zh-hans
has subproperty: is title of item of
has subproperty: is title of expression of
has subproperty: is name of timespan of
has subproperty: is name of place of
has subproperty: is name of agent of
has subproperty: is title of manifestation of
has subproperty: is title of work of
has subproperty: is preferred name of RDA entity of
has subproperty: is variant name of RDA entity of
has subproperty: P80161
lexical alias: nameOfRDAEntityOf.en
status: Published
type: Property
domain: C10012
label: RDA varlığının adıdır @tr
label: RDA-entitás neve a következőnek: @hu
label: er navn for RDA-entitet for @no
label: er navn på RDA-entitet af @da
label: est un nom d’entité RDA de @fr
label: ir nosaukums RDA entītei @lv
label: is naam van RDA-entiteit van @nl
label: ist Name einer RDA-Entität von @de
label: nimi RDA olemile @et
label: nimi RDA-entiteetille @fi
label: è nome dell'entità RDA di @it
label: és nom d’entitat RDA de @ca
label: هو اسم كيان "وام" لـ @ar
label: 是……的RDA实体的名称 @zh-hans
sub property of: is appellation of RDA entity of
definition: Bir ismi, doğal dilde ve yaygın söylemde kullanılan ifadelerde RDA varlığı olarak adlandırılan bir RDA varlığıyla ilişkilendirir. @tr
definition: Correla un nomen a un'entità RDA che ha una designazione di entità RDA in linguaggio e frasi naturali usati nel discorso comune. @it
definition: Hozzákapcsol egy noment egy RDA-entitáshoz, amelynek van egy RDA-entitás-megnevezése természetes nyelven és közbeszédben használt kifejezéssel. @hu
definition: Liittää nomenin RDA-entiteettiin, jolla on luonnollisen kielen ja yleisen diskurssin sanamuodon mukainen nimitys. @fi
definition: Met un nomen en relation avec une entité RDA qui possède une appellation d’entité RDA exprimée dans un langage et une formulation naturels et utilisée dans le langage courant. @fr
definition: Relaciona un nomen amb una entitat RDA que té una apel·lació d’entitat RDA en llenguatge i frases naturals usada en el discurs comú. @ca
definition: Relateert een nomen aan een RDA-entiteit die een benaming van RDA-entiteit heeft in natuurlijke taal en terminologie in gebruikelijke bewoording. @nl
definition: Relaterer et nomen til en RDA-entitet som har en betegnelse for RDA-entitet på en naturlig språk og med frasering brukt i alminnelig diskurs. @no
definition: Relaterer et nomen til en RDA-entitet, som har en benævnelse på RDA-entitet på normalsprog og med formuleringer, som bruges alment. @da
definition: Relates a nomen to an RDA entity that has an appellation of RDA entity in natural language and phrasing used in common discourse.
definition: Sasaista nomenu ar RDA entīti, kurai ir Sasaista nomenu ar RDA entītis apzīmējums dabiskajā valodā, ko izmanto savstarpējā saziņā. @lv
definition: Seostab nomen'i RDA olemiga, millel on nimetus loomulikus keeles ja sõnastuses, mida kasutatakse ühises diskursuses. @et
definition: Setzt ein Nomen in Beziehung zu einer RDA-Entität, die über eine Bezeichnung für eine RDA-Entität in natürlicher Sprache und Ausdrucksweise verfügt, die beim normalen Sprechen und Schreiben verwendet wird. @de
definition: يربط تسمية بكيان "وام" له اسم لكيان "وام" في لغة طبيعية مستخدم في الخطاب العام. @ar
definition: 将一个命名与有用自然语言和普通话语措词表达的RDA实体称谓的一个RDA实体关联起来。 @zh-hans

is authorized access point for RDA entity of
has element type: 2
toolkit definition: An RDA entity that has an access point for RDA entity that is selected for preference in a specific vocabulary encoding scheme.
toolkit definition: Belirli bir kelime kodlama şemasında tercih edilmek üzere seçilen bir RDA varlığına erişim noktası olan bir RDA varlığı. @tr
toolkit definition: Een RDA-entiteit die een ingang voor RDA-entiteit heeft die als voorkeursterm geselecteerd is in een specifiek vocabulair coderingssysteem. @nl
toolkit definition: Egy RDA-entitás, amelynek van egy olyan hozzáférési pontja az RDA-entitás számára, amelyet egy adott szótárkódolási sémából kiválasztva előnyben részesítenek. @hu
toolkit definition: Eine RDA-Entität, die über einen Sucheinstieg für eine RDA-Entität verfügt, der in einem bestimmten Vocabulary Encoding Scheme als Vorzugsform bestimmt wird. @de
toolkit definition: En RDA-entitet som har en søkeinngang for RDA-entitet som er valgt som preferanse i et bestemt kodeskjema for vokabular. @no
toolkit definition: Entitat RDA que té un punt d’accés d’entitat RDA que se selecciona en un esquema de codificació de vocabulari específic. @ca
toolkit definition: Entité RDA qui possède un point d’accès d’une entité RDA faisant l’objet d’un choix privilégié dans un schéma d’encodage de vocabulaire spécifique. @fr
toolkit definition: RDA entīte, kurai ir RDA entītes pamatforma, kas izvēlēta no konkrētas vārdnīcas. @lv
toolkit definition: RDA olem, millel on vastavas leksikaalses märkimissüsteemis eelistatuks valitud otsielement. @et
toolkit definition: RDA-entiteetti, jolla on tietyssä sanaston merkintäjärjestelmässä ensisijaiseksi valittu hakutieto. @fi
toolkit definition: RDA-entitet, som har en søgeindgang for RDA-entitet, som er valgt som præference i et specifikt vokabularkodningsskema. @da
toolkit definition: Un'entità RDA che ha un punto d'accesso per l'entità RDA che è stato selezionato come preferito in uno specifico schema di codifica di vocabolario. @it
toolkit definition: كيان "وام" له نقطة وصول لكيان "وام" اختيرت للتفضيل في خطة ترميز مفردات محددة. @ar
toolkit definition: 有在一个特定的词表编码体系中被首选的RDA实体检索点的一个RDA实体 @zh-hans
toolkit label: Normierter Sucheinstieg für eine RDA-Entität von @de
toolkit label: RDA varlığı için yetkili erişim noktası @tr
toolkit label: auktorisoitu hakutieto RDA-entiteetille @fi
toolkit label: authorized access point for RDA entity of
toolkit label: autoriseret søgeindgang for RDA-entitet af @da
toolkit label: autorisert søkeinngang for RDA-entitet for @no
toolkit label: autorizált hozzáférési pont a következő RDA-entitás számára: @hu
toolkit label: geautoriseerde ingang voor RDA-entiteit van @nl
toolkit label: ir RDA entītes autoritatīvā pamatforma @lv
toolkit label: normitud otsielement RDA olemile @et
toolkit label: point d’accès autorisé d’une entité RDA de @fr
toolkit label: punt d’accés autoritzat d’entitat RDA de @ca
toolkit label: punto d'accesso autorizzato per l'entità RDA di @it
toolkit label: نقطة وصول مقننة لكيان "وام" لـ @ar
toolkit label: ……的RDA实体的规范检索点 @zh-hans
has subproperty: is authorized access point for work of
has subproperty: is authorized access point for timespan of
has subproperty: is authorized access point for place of
has subproperty: is authorized access point for manifestation of
has subproperty: is authorized access point for item of
has subproperty: is authorized access point for expression of
has subproperty: is authorized access point for agent of
has subproperty: P80162
lexical alias: authorizedAccessPointForRDAEntityOf.en
status: Published
type: Property
domain: C10012
label: RDA varlığı için yetkili erişim noktasıdır @tr
label: auktorisoitu hakutieto RDA-entiteetille @fi
label: autorizált hozzáférési pont a következő RDA-entitás számára: @hu
label: er autoriseret søgeindgang for RDA-entitet af @da
label: er autorisert søkeinngang for RDA-entitet for @no
label: est un point d’accès autorisé d’une entité RDA de @fr
label: ir RDA entītes autoritatīvā pamatforma @lv
label: is geautoriseerde ingang voor RDA-entiteit van @nl
label: ist normierter Sucheinstieg für eine RDA-Entität von @de
label: normitud otsielement RDA olemile @et
label: è punto d'accesso autorizzato per l'entità RDA di @it
label: és punt d’accés autoritzat d’entitat RDA de @ca
label: هي نقطة وصول مقننة لكيان "وام" لـ @ar
label: 是……的RDA实体的规范检索点 @zh-hans
sub property of: is access point for RDA entity of
definition: Bir ismi, belirli bir kelime kodlama şemasında tercih edilmek üzere seçilen RDA varlığına erişim noktası olan bir RDA varlığıyla ilişkilendirir. @tr
definition: Correla un nomen a un'entità RDA che ha un punto d'accesso per l'entità RDA che è stato selezionato come preferito in uno specifico schema di codifica di vocabolario. @it
definition: Hozzákapcsol egy noment egy RDA-entitáshoz, amelynek van egy olyan hozzáférési pontja az RDA-entitás számára, amelyet egy adott szótárkódolási sémából kiválasztva előnyben részesítenek. @hu
definition: Liittää nomenin RDA-entiteettiin, jolla on tietyssä sanaston merkintäjärjestelmässä ensisijaiseksi valittu hakutieto. @fi
definition: Met un nomen en relation avec une entité RDA qui possède un point d’accès d’une entité RDA faisant l’objet d’un choix privilégié dans un schéma d’encodage de vocabulaire spécifique. @fr
definition: Relaciona un nomen amb una entitat RDA que té un punt d’accés d’entitat RDA que se selecciona en un esquema de codificació de vocabulari específic. @ca
definition: Relateert een nomen aan een RDA-entiteit die een ingang voor RDA-entiteit heeft die als voorkeursterm geselecteerd is in een specifiek vocabulair coderingssysteem. @nl
definition: Relaterer et nomen til en RDA-entitet som har en søkeinngang for RDA-entitet som er valgt som preferanse i et bestemt kodeskjema for vokabular. @no
definition: Relaterer et nomen til en RDA-entitet, som har en søgeindgang for RDA-entitet, som er valgt som præference i et specifikt vokabularkodningsskema. @da
definition: Relates a nomen to an RDA entity that has an access point for RDA entity that is selected for preference in a specific vocabulary encoding scheme.
definition: Sasaista nomenu ar RDA entīti, kurai ir Sasaista nomenu ar RDA entītis pamatforma, kas izvēlēta no konkrētas vārdnīcas. @lv
definition: Seostab nomen'i RDA olemiga, millel on vastavas leksikaalses märkimissüsteemis eelistatuks valitud otsielement. @et
definition: Setzt ein Nomen in Beziehung zu einer RDA-Entität, die über einen Sucheinstieg für eine RDA-Entität verfügt, der in einem bestimmten Vocabulary Encoding Scheme als Vorzugsform bestimmt wird. @de
definition: يربط تسمية بكيان "وام" له نقطة وصول لكيان "وام" اختيرت للتفضيل في خطة ترميز مفردات محددة. @ar
definition: 将一个命名与有在一个特定的词表编码体系中被首选的RDA实体检索点的一个RDA实体关联起来。 @zh-hans

is preferred name of RDA entity of
has element type: 2
toolkit definition: An RDA entity that has a name of RDA entity that is selected for preference in a specific application or context.
toolkit definition: Belirli bir uygulama veya bağlamda tercih edilmek üzere seçilen bir RDA varlığı adına sahip bir RDA varlığı. @tr
toolkit definition: Een RDA-entiteit die een naam van RDA-entiteit heeft die als voorkeursterm geselecteerd is in een specifieke toepassing of context. @nl
toolkit definition: Egy RDA-entitás, amelynek van egy olyan RDA-entitásneve, amelyet egy bizonyos alkalmazásban vagy kontextusban előnyben részesítenek. @hu
toolkit definition: Eine RDA-Entität, die über einen Namen für eine RDA-Entität verfügt, der in einer bestimmten Anwendung oder in einem bestimmten Kontext als Vorzugsform bestimmt wird. @de
toolkit definition: En RDA-entitet som har et navn for RDA-entitet som er valgt som preferanse i en bestemt applikasjon eller kontekst. @no
toolkit definition: Entitat RDA que té un nom d’entitat RDA que se selecciona com a preferent en una aplicació o un context específic. @ca
toolkit definition: Entité RDA qui possède un nom d’entité RDA faisant l’objet d’un choix privilégié dans une application ou un contexte spécifiques. @fr
toolkit definition: RDA entīte, kurai ir RDA entītes nosaukums, kas ir izvēlēts noteiktam lietojumam vai noteiktā kontekstā. @lv
toolkit definition: RDA olem, millel on kindlas rakenduses või kontekstis eelistatuks valitud nimi. @et
toolkit definition: RDA-entiteetti, jonka nimi on valittu ensisijaiseksi tietyssä sovelluksessa tai kontekstissä. @fi
toolkit definition: RDA-entitet, som har et navn på RDA-entitet, som er valgt som præference i en specifik anvendelse eller kontekst. @da
toolkit definition: Un'entità RDA che ha un nome di entità RDA che è stato selezionato come preferito in una specifica applicazione o contesto. @it
toolkit definition: كيان "وام" له اسم كيان "وام" اختير للتفضيل في تطبيق أو في سياق معين. @ar
toolkit definition: 有在一个特定的应用或语境中被首选的一个RDA实体名称的一个RDA实体 @zh-hans
toolkit label: Bevorzugter Name einer RDA-Entität von @de
toolkit label: RDA varlığının tercih edilen ismi @tr
toolkit label: eelisnimi RDA olemile @et
toolkit label: előnyben részesített RDA-entitás neve: @hu
toolkit label: ensisijainen nimi RDA-entiteetille @fi
toolkit label: foretrukket navn for RDA-entitet for @no
toolkit label: foretrukket navn på RDA-entitet af @da
toolkit label: geprefereerde naam van RDA-entiteit @nl
toolkit label: ir RDA entītes prioritārais nosaukums @lv
toolkit label: nom preferit d’entitat RDA de @ca
toolkit label: nom privilégié d’une entité RDA de @fr
toolkit label: nome preferito dell'entità RDA di @it
toolkit label: preferred name of RDA entity of
toolkit label: اسم مفضل لكيان "وام" لـ @ar
toolkit label: ……的RDA实体的首选名称 @zh-hans
has subproperty: is preferred name of timespan of
has subproperty: is preferred name of place of
has subproperty: is preferred title of item of
has subproperty: is preferred title of expression of
has subproperty: is preferred title of work of
has subproperty: is preferred name of agent of
has subproperty: P80163
lexical alias: preferredNameOfRDAEntityOf.en
status: Published
type: Property
domain: C10012
label: RDA varlığının tercih edilen adıdır @tr
label: eelisnimi RDA olemile @et
label: előnyben részesített RDA-entitás neve a következőnek: @hu
label: ensisijainen nimi RDA-entiteetille @fi
label: er foretrukket navn for RDA-entitet for @no
label: er foretrukket navn på RDA-entitet af @da
label: est un nom privilégié d’une entité RDA de @fr
label: ir RDA entītes prioritārais nosaukums @lv
label: is geprefereerde naam van RDA-entiteit @nl
label: ist bevorzugter Name einer RDA-Entität von @de
label: è nome preferito dell'entità RDA di @it
label: és nom preferit d’entitat RDA de @ca
label: هو اسم مفضل لكيان "وام" لـ @ar
label: 是……的RDA实体的首选名称 @zh-hans
sub property of: is name of RDA entity of
definition: Bir ismi, belirli bir uygulama veya bağlamda tercih edilmek üzere seçilen bir RDA varlığı adına sahip bir RDA varlığıyla ilişkilendirir. @tr
definition: Correla un nomen a un'entità RDA che ha un nome di entità RDA che è stato selezionato come preferito in una specifica applicazione o contesto. @it
definition: Hozzákapcsol egy noment egy RDA-entitáshoz, amelynek van egy olyan RDA-entitásneve, amelyet egy bizonyos alkalmazásban vagy kontextusban előnyben részesítenek. @hu
definition: Liittää nomenin RDA-entiteettiin, jonka nimi on valittu ensisijaiseksi tietyssä sovelluksessa tai kontekstissä. @fi
definition: Met un nomen en relation avec une entité RDA qui possède un nom d’entité RDA faisant l’objet d’un choix privilégié dans une application ou un contexte spécifiques. @fr
definition: Relaciona un nomen amb una entitat RDA que té un nom d’entitat RDA que se selecciona com a preferent en una aplicació o un context específic. @ca
definition: Relateert een nomen aan een RDA-entiteit die een naam van RDA-entiteit heeft die als voorkeursterm geselecteerd is in een specifieke toepassing of context. @nl
definition: Relaterer et nomen til en RDA-entitet som har et navn for RDA-entitet som er valgt som preferanse i en bestemt applikasjon eller kontekst. @no
definition: Relaterer et nomen til en RDA-entitet, som har et navn på RDA-entitet, som er valgt som præference i en specifik anvendelse eller kontekst. @da
definition: Relates a nomen to an RDA entity that has a name of RDA entity that is selected for preference in a specific application or context.
definition: Sasaista nomenu ar RDA entīti, kurai ir Sasaista nomenu ar RDA entītis nosaukums, kas ir izvēlēts noteiktam lietojumam vai noteiktā kontekstā. @lv
definition: Seostab nomen'i RDA olemiga, millel on kindlas rakenduses või kontekstis eelistatuks valitud nimi. @et
definition: Setzt ein Nomen in Beziehung zu einer RDA-Entität, die über einen Namen für eine RDA-Entität verfügt, der in einer bestimmten Anwendung oder in einem bestimmten Kontext als Vorzugsform bestimmt wird. @de
definition: يربط تسمية بكيان "وام" له اسم كيان "وام" اختير للتفضيل في تطبيق أو في سياق معين. @ar
definition: 将一个命名与有在一个特定的应用或语境中被首选的一个RDA实体名称的一个RDA实体关联起来。 @zh-hans

is variant name of RDA entity of
has element type: 2
toolkit definition: An RDA entity that has a name of RDA entity that is not selected for preference in a specific application or context.
toolkit definition: Belirli bir uygulama veya bağlamda tercih edilmek üzere seçilmeyen bir RDA varlığı adına sahip bir RDA varlığı. @tr
toolkit definition: Een RDA-entiteit die een naam van RDA-entiteit heeft die niet als voorkeursterm geselecteerd is in een specifieke toepassing of context. @nl
toolkit definition: Egy RDA-entitás, amelynek van egy olyan RDA-entitásneve, amelyet egy bizonyos alkalmazásban vagy kontextusban nem részesítenek előnyben. @hu
toolkit definition: Eine RDA-Entität, die über einen Namen für eine RDA-Entität verfügt, der in einer bestimmten Anwendung oder in einem bestimmten Kontext nicht als Vorzugsform bestimmt wird. @de
toolkit definition: En RDA-entitet som har et navn for RDA-entitet som ikke er valgt som preferanse i en bestemt applikasjon eller kontekst. @no
toolkit definition: Entitat RDA que té un nom d’entitat RDA que no se selecciona com a preferent en una aplicació o un context específic. @ca
toolkit definition: Entité RDA qui possède un nom d’entité RDA ne faisant pas l’objet d’un choix privilégié dans une application ou un contexte spécifiques. @fr
toolkit definition: RDA entīte, kam ir RDA entītes nosaukums, kas nav izvēlēts kā prioritārs noteiktā lietojumprogrammā vai kontekstā. @lv
toolkit definition: RDA olem, millel on nimi, mis kindlas rakenduses või kontekstis ei ole valitud eelistatuks. @et
toolkit definition: RDA-entiteetti, jonka nimeä ei ole valittu ensisijaiseksi tietyssä sovelluksessa tai kontekstissä. @fi
toolkit definition: RDA-entitet, som har et navn på RDA-entitet, som ikke er valgt som præference i en specifik anvendelse eller kontekst. @da
toolkit definition: Un'entità RDA che ha un nome di entità RDA che non è stato selezionato come preferito in una specifica applicazione o contesto. @it
toolkit definition: كيان "وام" له اسم كيان "وام" لم يُختر للتفضيل في تطبيق أو في سياق معين. @ar
toolkit definition: 有在一个特定的应用或语境中未被首选的一个RDA实体名称的一个RDA实体 @zh-hans
toolkit label: Abweichender Name einer RDA-Entität von @de
toolkit label: RDA varlığının alternatif ismi @tr
toolkit label: RDA-entitás névvariánsa: @hu
toolkit label: alternativt navn for RDA-entitet for @no
toolkit label: ir cits nosaukums RDA entītei @lv
toolkit label: nome variante dell'entità RDA di @it
toolkit label: variant af navn på RDA-entitet af @da
toolkit label: variant de nom d’entitat RDA de @ca
toolkit label: variant naam van RDA-entiteit @nl
toolkit label: variant name of RDA entity of
toolkit label: variante de nom d’entité RDA de @fr
toolkit label: variantnimi RDA olemile @et
toolkit label: varianttinimi RDA-entiteetille @fi
toolkit label: اسم مختلف لكيان "وام" لـ @ar
toolkit label: ……的RDA实体的变异名称 @zh-hans
has subproperty: is variant name of timespan of
has subproperty: is variant name of place of
has subproperty: is variant title of item of
has subproperty: is variant title of expression of
has subproperty: is variant title of work of
has subproperty: is variant title of manifestation of
has subproperty: is variant name of agent of
has subproperty: P80164
lexical alias: variantNameOfRDAEntityOf.en
status: Published
type: Property
domain: C10012
label: RDA öğesinin farklı ismi @tr
label: RDA-entitás névvariánsa a következőnek: @hu
label: er alternativt navn for RDA-entitet for @no
label: er variant af navn på RDA-entitet af @da
label: est une variante de nom d’entité RDA de @fr
label: ir cits nosaukums RDA entītei @lv
label: is variant naam van RDA-entiteit @nl
label: ist abweichender Name einer RDA-Entität von @de
label: variantnimi RDA olemile @et
label: varianttinimi RDA-entiteetille @fi
label: è nome variante dell'entità RDA di @it
label: és variant de nom d’entitat RDA de @ca
label: هو اسم مختلف لكيان "وام" لـ @ar
label: 是……的RDA实体的变异名称 @zh-hans
sub property of: is name of RDA entity of
definition: Bir ismi belirli bir uygulama veya bağlamda tercih edilmek üzere seçilmeyen bir RDA varlığı adına sahip bir RDA varlığıyla ilişkilendirir. @tr
definition: Correla un nomen a un'entità RDA che ha un nome di entità RDA che non è stato selezionato come preferito in una specifica applicazione o contesto. @it
definition: Hozzákapcsol egy noment egy RDA-entitáshoz, amelynek van egy olyan RDA-entitásneve, amelyet egy bizonyos alkalmazásban vagy kontextusban nem részesítenek előnyben. @hu
definition: Liittää nomenin RDA-entiteettiin, jonka nimeä ei ole valittu ensisijaiseksi tietyssä sovelluksessa tai kontekstissä. @fi
definition: Met un nomen en relation avec une entité RDA qui possède un nom d’entité RDA ne faisant pas l’objet d’un choix privilégié dans une application ou un contexte spécifiques. @fr
definition: Relaciona un nomen amb una entitat RDA que té un nom d’entitat RDA que no se selecciona com a preferent en una aplicació o un context específic. @ca
definition: Relateert een nomen aan een RDA-entiteit die een naam van RDA-entiteit heeft die niet als voorkeursterm geselecteerd is in een specifieke toepassing of context. @nl
definition: Relaterer et nomen til en RDA-entitet som har et navn for RDA-entitet som ikke er valgt som preferanse i en bestemt applikasjon eller kontekst. @no
definition: Relaterer et nomen til en RDA-entitet, som har et navn på RDA-entitet, som ikke er valgt som præference i en specifik anvendelse eller kontekst. @da
definition: Relates a nomen to an RDA entity that has a name of RDA entity that is not selected for preference in a specific application or context.
definition: Sasaista nomenu ar RDA entīti, kam ir Sasaista nomenu ar RDA entītis nosaukums, kas nav izvēlēts kā prioritārs noteiktā lietojumprogrammā vai kontekstā. @lv
definition: Seostab nomen'i RDA olemiga, millel on nimi, mis kindlas rakenduses või kontekstis ei ole valitud eelistatuks. @et
definition: Setzt ein Nomen in Beziehung zu einer RDA-Entität, die über einen Namen für eine RDA-Entität verfügt, der in einer bestimmten Anwendung oder in einem bestimmten Kontext nicht als Vorzugsform bestimmt wird. @de
definition: يربط تسمية بكيان "وام" له اسم كيان "وام" لم يُختر للتفضيل في تطبيق أو في سياق معين. @ar
definition: 将一个命名与有有在一个特定的应用或语境中未被首选的一个RDA实体名称的一个RDA实体关联起来。 @zh-hans

is variant access point for RDA entity of
has element type: 2
toolkit definition: An RDA entity that has an access point for RDA entity that is not selected for preference in a specific vocabulary encoding scheme.
toolkit definition: Belirli bir kelime kodlama şemasında tercih edilmek üzere seçilmeyen bir RDA varlığına erişim noktası olan bir RDA varlığı. @tr
toolkit definition: Een RDA-entiteit die een ingang voor RDA-entiteit heeft die niet als voorkeursterm geselecteerd is in een specifieke toepassing of context. @nl
toolkit definition: Egy RDA-entitás, amelynek van egy olyan hozzáférési pontja az RDA-entitás számára, amely egy speciális szótárkódolási sémából kiválasztva nem részesül előnyben. @hu
toolkit definition: Eine RDA-Entität, die über einen Sucheinstieg für eine RDA-Entität verfügt, der in einem bestimmten Vocabulary Encoding Scheme nicht als Vorzugsform bestimmt wird. @de
toolkit definition: En RDA-entitet som har en søkeinngang for RDA-entitet som ikke er valgt som preferanse i et bestemt kodeskjema for vokabular. @no
toolkit definition: Entitat RDA que té un punt d’accés d’entitat RDA que no se selecciona com a preferent en un esquema de codificació de vocabulari específic. @ca
toolkit definition: Entité RDA qui possède un point d’accès d’une entité RDA ne faisant pas l’objet d’un choix privilégié dans un schéma d’encodage de vocabulaire spécifique. @fr
toolkit definition: RDA entīte, kurai ir piekļuves punkts RDA entītei, kas nav izvēlēta kā prioritāra noteiktai kontrolētas vārdnīcas shēmai. @lv
toolkit definition: RDA olem, millel on otsielement, mis ei ole valitud eelistatuks vastavas leksikaalses märkimissüsteemis. @et
toolkit definition: RDA-entiteetti, jonka hakutietoa ei ole valittu ensisijaiseksi tietyssä sanaston merkintäjärjestelmässä. @fi
toolkit definition: RDA-entitet, som har en søgeindgang for entitet, som ikke er valgt som præference i et specifikt vokabularkodningsskema. @da
toolkit definition: Un'entità RDA che ha un punto d'accesso per l'entità RDA che non è stato selezionato come preferito in uno specifico schema di codifica di vocabolario. @it
toolkit definition: كيان "وام" له نقطة وصول لكيان "وام" لم تُختر للتفضيل في خطة ترميز مفردات محددة. @ar
toolkit definition: 有在一个特定的词表编码体系中未被首选的RDA实体检索点的一个RDA实体 @zh-hans
toolkit label: RDA varlığı için alternatif erişim noktası @tr
toolkit label: Zusätzlicher Sucheinstieg für eine RDA-Entität von @de
toolkit label: alternativ søkeinngang for RDA-entitet for @no
toolkit label: hozzáférési pont változata a következő RDA-entitás számára: @hu
toolkit label: ir papildforma RDA entītei @lv
toolkit label: otsielemendi variant RDA olemile @et
toolkit label: punto d'accesso variante per l'entità RDA di @it
toolkit label: variant access point for RDA entity of
toolkit label: variant af søgeindgang for RDA-entitet af @da
toolkit label: variant de punt d’accés d’entitat RDA de @ca
toolkit label: variant ingang voor RDA-entiteit van @nl
toolkit label: variante de point d’accès d’une entité RDA de @fr
toolkit label: varianttihakutieto RDA-entiteetille @fi
toolkit label: نقطة وصول مختلفة لكيان "وام" لـ @ar
toolkit label: ……的RDA实体的变异检索点 @zh-hans
has subproperty: is variant access point for work of
has subproperty: is variant access point for timespan of
has subproperty: is variant access point for place of
has subproperty: is variant access point for manifestation of
has subproperty: is variant access point for item of
has subproperty: is variant access point for expression of
has subproperty: is variant access point for agent of
has subproperty: P80165
lexical alias: variantAccessPointForRDAEntityOf.en
status: Published
type: Property
domain: C10012
label: RDA öğesinin farklı erişim noktasıdır @tr
label: er alternativ søkeinngang for RDA-entitet for @no
label: er variant af søgeindgang for RDA-entitet af @da
label: est une variante de point d’accès d’une entité RDA de @fr
label: hozzáférési pont változata a következő RDA-entitás számára: @hu
label: ir papildforma RDA entītei @lv
label: is variant ingang voor RDA-entiteit van @nl
label: ist zusätzlicher Sucheinstieg für eine RDA-Entität von @de
label: otsielemendi variant RDA olemile @et
label: varianttihakutieto RDA-entiteetille @fi
label: è punto d'accesso variante per l'entità RDA di @it
label: és variant de punt d’accés d’entitat RDA de @ca
label: هي نقطة وصول مختلفة لكيان "وام" لـ @ar
label: 是……的RDA实体的变异检索点 @zh-hans
sub property of: is access point for RDA entity of
definition: Bir ismi, belirli bir kelime kodlama şemasında tercih edilmek üzere seçilmeyen RDA varlığıyla ilişkilendirir. @tr
definition: Correla un nomen a un'entità RDA che ha un punto d'accesso per l'entità RDA che non è stato selezionato come preferito in uno specifico schema di codifica di vocabolario. @it
definition: Hozzákapcsol egy noment egy olyan RDA-entitáshoz, amelynek van egy olyan hozzáférési pontja az RDA-entitás számára, amely egy speciális szótárkódolási sémából kiválasztva nem részesül előnyben. @hu
definition: Liittää nomenin RDA-entiteettiin, jonka hakutietoa ei ole valittu ensisijaiseksi tietyssä sanaston merkintäjärjestelmässä. @fi
definition: Met un nomen en relation avec une entité RDA qui possède un point d’accès d’une entité RDA ne faisant pas l’objet d’un choix privilégié dans un schéma d’encodage de vocabulaire spécifique. @fr
definition: Relaciona un nomen amb una entitat RDA que té un punt d’accés d’entitat RDA que no se selecciona com a preferent en un esquema de codificació de vocabulari específic. @ca
definition: Relateert een nomen aan een RDA-entiteit die een ingang voor RDA-entiteit heeft die niet als voorkeursterm geselecteerd is in een specifieke toepassing of context. @nl
definition: Relaterer et nomen til en RDA-entitet som har en søkeinngang for RDA-entitet som ikke er valgt som preferanse i et bestemt kodeskjema for vokabular. @no
definition: Relaterer et nomen til en RDA-entitet, som har en søgeindgang for entitet, som ikke er valgt som præference i et specifikt vokabularkodningsskema. @da
definition: Relates a nomen to an RDA entity that has an access point for entity that is not selected for preference in a specific vocabulary encoding scheme.
definition: Sasaista nomenu ar RDA entīti, kurai ir piekļuves punkts Sasaista nomenu ar RDA entītii, kas nav izvēlēta kā prioritāra noteiktai kontrolētas vārdnīcas shēmai. @lv
definition: Seostab nomen'i RDA olemiga, millel on otsielement, mis ei ole valitud eelistatuks vastavas leksikaalses märkimissüsteemis. @et
definition: Setzt ein Nomen in Beziehung zu einer RDA-Entität, die über einen Sucheinstieg für eine RDA-Entität verfügt, der in einem bestimmten Vocabulary Encoding Scheme nicht als Vorzugsform bestimmt wird. @de
definition: يربط تسمية بكيان "وام" له نقطة وصول لكيان لم تُختر للتفضيل في خطة ترميز مفردات محددة. @ar
definition: 将一个命名与有在一个特定的词表编码体系中未被首选的RDA实体检索点的一个RDA实体关联起来。 @zh-hans

has date of usage
has element type: 3
toolkit definition: A timespan that is a date or range of dates that is associated with the use of a nomen.
toolkit definition: Ajanjakso, joka on ajankohta tai aikaväli, joka liittyy RDA-entiteetin nimityksen käyttöön. @fi
toolkit definition: Bir ismin kullanımı ile bağlantılı olan bir tarih veya belirli bir tarih dilimi olan bir zaman aralığı. @tr
toolkit definition: Daatum või daatumite vahemik, mis on seotud RDA olemi nimetuse kasutusega. @et
toolkit definition: Dato eller flere datoer, som er knyttet til anvendelsen af en benævnelse på en RDA-entitet. @da
toolkit definition: Een tijdspanne die is een datum of bereik van data die geassocieerd wordt met het gebruik van een benaming van een RDA-entiteit. @nl
toolkit definition: Egy időtartam, egy dátum vagy dátumtartomány, amelyet egy RDA-entitás megnevezésének használatával társítottak. @hu
toolkit definition: Ein Zeitraum, bei dem es sich um ein Datum oder einen Datumsbereich handelt, der mit der Verwendung einer Bezeichnung für eine RDA-Entität in Verbindung steht. @de
toolkit definition: En dato eller et tidsspenn som forbindes med anvendelsen av en betegnelse for en RDA-entitet. @no
toolkit definition: Interval de temps que és una data o un rang de dates que s’associa amb l’ús d’un nomen. @ca
toolkit definition: Laikposms, kas ir viens vai vairāki datējumi, kas saistīti ar RDA entītes nosaukuma lietojumu. @lv
toolkit definition: Laps de temps qui consise en une date ou une fourchette de dates associée à l’utilisation d’un nomen. @fr
toolkit definition: Una data o intervallo di date che è associata con l'uso di una designazione di un'entità RDA. @it
toolkit definition: تاريخ أو مدى تواريخ مرتبط باستخدام اسم لكيان "وام". @ar
toolkit definition: 作为和一个命名的使用有关的一个日期或者日期范围的一个时间段 @zh-hans
toolkit label: Verwendungsdatum @de
toolkit label: data d'uso @it
toolkit label: data d’ús @ca
toolkit label: date d’utilisation @fr
toolkit label: date of usage
toolkit label: dato for brug @da
toolkit label: dato for bruk @no
toolkit label: datum van gebruik @nl
toolkit label: használat időpontja: @hu
toolkit label: kasutusaeg @et
toolkit label: kullanım tarihi @tr
toolkit label: käyttöajankohta @fi
toolkit label: lietojuma datējums @lv
toolkit label: تاريخ استخدام @ar
toolkit label: 利用日期 @zh-hans
has subproperty: P80166
lexical alias: dateOfUsage.en
status: Published
type: Property
domain: C10012
label: a pour date d’utilisation @fr
label: ha come data d'uso @it
label: har dato for brug @da
label: har dato for bruk @no
label: használat időpontja a következő: @hu
label: hat Verwendungsdatum @de
label: heeft datum van gebruik @nl
label: kasutusaeg @et
label: kullanım tarihi ile ilişkilidir @tr
label: käyttöajankohta @fi
label: lietojuma datējums @lv
label: té com a data d’ús @ca
label: له تاريخ استخدام @ar
label: 有利用日期 @zh-hans
sub property of: has related timespan of nomen
definition: Bir ismi, ismin kullanımı ile ilişkili bir tarih veya tarih aralığı olan bir zaman aralığı ile ilişkilendirir. @tr
definition: Correla un nomen a una data o intervallo di date che è associata con l'uso di una designazione di un'entità RDA. @it
definition: Hozzákapcsol egy noment egy időtartamhoz, egy dátumhoz vagy dátumtartományhoz, amelyet egy RDA-entitás megnevezésének használatával társítottak. @hu
definition: Liittää nomenin ajanjaksoon, joka on ajankohta tai aikaväli, joka liittyy RDA-entiteetin nimityksen käyttöön. @fi
definition: Met un nomen en relation avec un laps de temps qui consiste en une date ou une fourchette de dates associée à l’utilisation d’un nomen. @fr
definition: Relaciona un nomen amb un interval de temps que és una data o un rang de dates que s’associa amb l’ús d’un nomen. @ca
definition: Relateert een nomen aan een tijdspanne die is een datum of bereik van data die geassocieerd wordt met het gebruik van een benaming van een RDA-entiteit. @nl
definition: Relaterer et nomen til en dato eller et tidsspenn som forbindes med anvendelsen av en betegnelse for en RDA-entitet. @no
definition: Relaterer et nomen til en dato eller flere datoer, som er knyttet til anvendelsen af en benævnelse på en RDA-entitet. @da
definition: Relates a nomen to a timespan that is a date or range of dates that is associated with the use of a nomen.
definition: Sasaista nomenu ar laikposmu, kas ir viens vai vairāki datējumi, kas saistīti ar RDA entītes nosaukuma lietojumu. @lv
definition: Seostab nomen'i daatumi või daatumite vahemikuga, mis on seotud RDA olemi nimetuse kasutusega. @et
definition: Setzt ein Nomen in Beziehung zu einem Zeitraum, bei dem es sich um ein Datum oder einen Datumsbereich handelt, der mit der Verwendung einer Bezeichnung für eine RDA-Entität in Verbindung steht. @de
definition: يربط تسمية بتاريخ أو مدى من التواريخ مرتبط باستخدام اسم لكيان "وام". @ar
definition: 将一个命名与作为和一个命名的使用有关的一个日期或者日期范围的一个时间段关联起来。 @zh-hans

has scope of usage (Deprecated)
has element type: 3
toolkit definition: A type or form of work associated with the usage of a name of agent.
toolkit label: scope of usage
has subproperty: P80167
lexical alias: scopeOfUsage.en
status: Deprecated
type: Property
domain: C10012
definition: Relates a nomen to a type or form of work associated with the usage of a name of agent.

has status of identification
has element type: 4
toolkit definition: An indication of a level of authentication of the nomen.
toolkit definition: Angivelse af identificeringsniveau for et nomen for en entitet. @da
toolkit definition: Bir ismin doğrulama düzeyinin bir göstergesi. @tr
toolkit definition: Een indicatie van het niveau van authenticatie van de nomen van een entiteit. @nl
toolkit definition: Egy entitás nomenjének hitelesítési szintjére vonatkozó jelzéshez. @hu
toolkit definition: Eine Angabe über einen Grad der Authentifizierung des Nomens einer Entität. @de
toolkit definition: En angivelse av identifiseringsnivå for nomenet for en entitet. @no
toolkit definition: Entīti identificējošo datu uzticamības līmenis. @lv
toolkit definition: Ilmaus entiteetin nomenin oikeaksi todistamisen tasosta. @fi
toolkit definition: Indicació d’un nivell d’autenticació del nomen. @ca
toolkit definition: Indication d’un niveau d’authentification du nomen. @fr
toolkit definition: Tähis, mis näitab olemi nomen'i õigeks tunnistamise astet. @et
toolkit definition: Una indicazione del livello di autenticazione del nomen di un'entità. @it
toolkit definition: مؤشر لمستوى مصداقية تسمية كيان. @ar
toolkit definition: 命名认证级别的指示 @zh-hans
toolkit label: Status der Identifikation @de
toolkit label: azonosítás státusza: @hu
toolkit label: estat d’identificació @ca
toolkit label: identificēšanas statuss @lv
toolkit label: identifitseerimistase @et
toolkit label: status d'identificazione @it
toolkit label: status for identifikasjon @no
toolkit label: status for identifikation @da
toolkit label: status of identification
toolkit label: status van identificatie @nl
toolkit label: statut d’identification @fr
toolkit label: tanımlama durumu @tr
toolkit label: tunnistamistaso @fi
toolkit label: حالة تعريف @ar
toolkit label: 标识状态 @zh-hans
has subproperty: P80168
lexical alias: statusOfIdentification.en
status: Published
type: Property
domain: C10012
label: a pour statut d’identification @fr
label: azonosítás státusza a következő: @hu
label: ha come status d'identificazione @it
label: har status for identifikasjon @no
label: har status for identifikation @da
label: hat Status der Identifikation @de
label: heeft status van identificatie @nl
label: identificēšanas statuss @lv
label: identifitseerimistase @et
label: tanımlama durumu ile ilişkilidir @tr
label: tunnistamistaso @fi
label: té com a estat d’identificació @ca
label: لها حالة تعريف @ar
label: 有标识状态 @zh-hans
definition: Bir ismi, ismin kimlik doğrulama düzeyinin göstergesiyle ilişkilendirir. @tr
definition: Correla un nomen con una indicazione del livello di autenticazione del nomen di un'entità. @it
definition: Hozzákapcsol egy noment egy entitás nomenjének hitelesítési szintjére vonatkozó jelzéshez. @hu
definition: Liittää nomenin ilmaukseen entiteetin nomenin oikeaksi todistamisen tasosta. @fi
definition: Met un nomen en relation avec une indication d’un niveau d’authentification du nomen. @fr
definition: Relaciona un nomen amb una indicació d’un nivell d’autenticació del nomen. @ca
definition: Relateert een nomen aan een indicatie van het niveau van authenticatie van de nomen van een entiteit. @nl
definition: Relaterer et nomen til en angivelse af identificeringsniveau for et nomen for en entitet. @da
definition: Relaterer et nomen til en angivelse av identifiseringsnivå for nomenet for en entitet. @no
definition: Relates a nomen to an indication of a level of authentication of the nomen.
definition: Sasaista nomenu ar entīti identificējošo datu uzticamības līmeni. @lv
definition: Seostab nomen'i tähisega, mis näitab olemi nomen'i õigeks tunnistamise astet. @et
definition: Setzt ein Nomen in Beziehung zu einer Angabe über einen Grad der Authentifizierung des Nomens einer Entität. @de
definition: يربط تسمية بمؤشر لمستوى مصداقية تسمية كيان. @ar
definition: 将一个命名与命名认证级别的指示关联起来。 @zh-hans

has undifferentiated name indicator
has element type: 3
toolkit definition: A categorization indicating that a nomen is insufficient to differentiate between two or more entities.
toolkit definition: Apzīmējums, kas norāda, ka nomens nav pietiekams, lai atšķirtu divas vai vairākas entītes. @lv
toolkit definition: Categorització que indica que un nomen és insuficient per diferenciar entre dues o més entitats. @ca
toolkit definition: Catégorisation qui indique qu’un nomen est insuffisant pour différencier deux ou plusieurs entités. @fr
toolkit definition: Een categorisatie die aangeeft dat een nomen onvoldoende is om onderscheid te maken tussen twee of meer entiteiten. @nl
toolkit definition: Egy kategorizálás, amely jelzi, hogy a nomen nem alkalmas két vagy több entitás megkülönböztetésére. @hu
toolkit definition: Eine Kategorisierung die angibt, dass ein Nomen nicht ausreicht, um zwischen zwei oder mehreren Entitäten zu unterscheiden. @de
toolkit definition: En kategorisering som angir at et nomen er utilstrekkelig for å skille mellom to eller flere entiteter. @no
toolkit definition: Kategorisering, som angiver, at et nomen er utilstrækkelig til at skelne mellem to eller flere entiteter. @da
toolkit definition: Kategorisointi, jolla ilmaistaan nomenin riittämättömyys erottaa kahta tai useampaa entiteettiä toisistaan. @fi
toolkit definition: Liigitus, mis näitab, et nomen'ist ei piisa kahe või enama olemi eristamiseks. @et
toolkit definition: Una categorizzazione che indica che un nomen non è sufficiente per differenziare tra due o più entità. @it
toolkit definition: İki veya daha fazla varlık arasında ayırt etme için bir nomenin yetersiz olduğunu belirten bir kategorizasyon. @tr
toolkit definition: تصنيف يشير إلى تسمية غير ملائمة للتمييز بين كيانين أو أكثر. @ar
toolkit definition: 表明一个命名不足以区分两个或更多实体的一个类别 @zh-hans
toolkit label: Indikator für nicht individualisierte Namen @de
toolkit label: ayırt edilemeyen ad göstergesi @tr
toolkit label: indicador de nom no diferenciat @ca
toolkit label: indicateur de nom indifférencié @fr
toolkit label: indicatore di nome indifferenziato @it
toolkit label: individualiseerimata nime tähis @et
toolkit label: nem differenciált névjelzője: @hu
toolkit label: niet-onderscheiden naam indicatie @nl
toolkit label: udifferensiert navneangivelse @no
toolkit label: udifferentieret navneangivelse @da
toolkit label: undifferentiated name indicator
toolkit label: vārda/nosaukuma atšķiramības pazīme @lv
toolkit label: yksilöimättömän nimen ilmaus @fi
toolkit label: مؤشر لاسم غير ملائم @ar
toolkit label: 未区分名称指示符 @zh-hans
has subproperty: P80169
lexical alias: undifferentiatedNameIndicator.en
status: Published
type: Property
domain: C10012
label: a pour indicateur de nom indifférencié @fr
label: ayırt edilemeyen ad göstergesi ile ilişkilidir @tr
label: ha come indicatore di nome indifferenziato @it
label: har udifferensiert navneangivelse @no
label: har udifferentieret navneangivelse @da
label: hat Indikator für nicht individualisierte Namen @de
label: heeft niet-onderscheiden naam indicatie @nl
label: individualiseerimata nime tähis @et
label: nem differenciált névjelzője a következő: @hu
label: té com a indicador de nom no diferenciat @ca
label: vārda/nosaukuma atšķiramības pazīme @lv
label: yksilöimättömän nimen ilmaus @fi
label: لها مؤشر لاسم غير ملائم @ar
label: 有未区分名称指示符 @zh-hans
definition: Bir ismi, iki veya daha fazla varlık arasında ayrım yapmak için bir ismin yetersiz olduğunu belirten bir sınıflandırmayla ilişkilendirir. @tr
definition: Correla un nomen a una categorizzazione che indica che un nomen non è sufficiente per differenziare tra due o più entità. @it
definition: Hozzákapcsol egy noment egy kategorizáláshoz, amely jelzi, hogy a nomen nem alkalmas két vagy több entitás megkülönböztetésére. @hu
definition: Liittää nomenin kategorisointiin, jolla ilmaistaan nomenin riittämättömyys erottaa kahta tai useampaa entiteettiä toisistaan. @fi
definition: Met un nomen en relation avec une catégorisation qui indique qu’un nomen est insuffisant pour différencier deux ou plusieurs entités. @fr
definition: Relaciona un nomen amb una categorització que indica que un nomen és insuficient per diferenciar entre dues o més entitats. @ca
definition: Relateert een nomen aan een categorisatie die aangeeft dat een nomen onvoldoende is om onderscheid te maken tussen twee of meer entiteiten. @nl
definition: Relaterer et nomen til en kategorisering som angir at et nomen er utilstrekkelig for å skille mellom to eller flere entiteter. @no
definition: Relaterer et nomen til en kategorisering, som angiver, at et nomen er utilstrækkelig til at skelne mellem to eller flere entiteter. @da
definition: Relates a nomen to a categorization indicating that a nomen is insufficient to differentiate between two or more entities.
definition: Sasaista nomenu ar apzīmējumu, kas norāda, ka nomens nav pietiekams, lai atšķirtu divas vai vairākas entītes. @lv
definition: Seostab nomen'i liigitusega, mis näitab, et nomen'ist ei piisa kahe või enama olemi eristamiseks. @et
definition: Setzt ein Nomen in Beziehung zu einer Kategorisierung die angibt, dass ein Nomen nicht ausreicht, um zwischen zwei oder mehreren Entitäten zu unterscheiden. @de
definition: يربط تسمية بفئة تشير إلى تسمية غير ملائمة للتمييز بين كيانين أو أكثر. @ar
definition: 将一个命名与表明一个命名不足以区分两个或更多实体的一个类别关联起来。 @zh-hans

is ISSN of
has element type: 2
toolkit definition: A work that has an identifier assigned by an ISSN registration agency.
toolkit definition: Darbs, kam ir ISSN reģistrācijas aģentūras piešķirts identifikators. @lv
toolkit definition: Een werk dat een identificatie heeft toegekend door een ISSN-registratiebureau. @nl
toolkit definition: Egy mű, amelynek van egy ISSN regisztrációs ügynökség által jegyzett azonosítója. @hu
toolkit definition: Ein Werk, das über einen Identifikator verfügt, der von einem ISSN-Zentrum vergeben wird. @de
toolkit definition: Et verk som har en identifikator som er tildelt av et ISSN-kontor. @no
toolkit definition: ISSN kayıt ajansı tarafından atanmış bir tanımlayıcıya sahip bir eser. @tr
toolkit definition: Obra que té un identificador assignat per una agència de registre de l’ISSN. @ca
toolkit definition: Teos, jolla on ISSN-rekisteröintiyksikön antama tunniste. @fi
toolkit definition: Teos, millel on ISSN registreerimise agentuuri määratud identifikaator. @et
toolkit definition: Un'opera che ha un identificatore assegnato da una agenzia di registrazione dell'ISSN. @it
toolkit definition: Værk, som har en identifikator tildelt af et ISSN-kontor. @da
toolkit definition: Œuvre qui possède un identifiant attribué par une agence d’enregistrement de l’ISSN. @fr
toolkit definition: عمل له مُعرِّف خصصته له وكالة تسجيل ردمد. @ar
toolkit definition: 被一个国际标准连续出版物号注册机构分配一个标识符的一种作品 @zh-hans
toolkit label: ISSN de @ca
toolkit label: ISSN di @it
toolkit label: ISSN einer Reihe von @de
toolkit label: ISSN for @da
toolkit label: ISSN of
toolkit label: ISSN teokselle @fi
toolkit label: ISSN teosele @et
toolkit label: ISSN van @nl
toolkit label: ISSN'idir @tr
toolkit label: ISSN-je: @hu
toolkit label: ir ISSN no @lv
toolkit label: ردمد لـ @ar
toolkit label: ……的国际标准连续出版物号 @zh-hans
has subproperty: P80170
lexical alias: issnOf.en
status: Published
type: Property
domain: C10012
label: ISSN teokselle @fi
label: ISSN teosele @et
label: ISSN'idir @tr
label: ISSN-je a következőnek: @hu
label: er ISSN for @da
label: est un ISSN de @fr
label: ir ISSN no @lv
label: is ISSN van @nl
label: ist ISSN einer Reihe von @de
label: è ISSN di @it
label: és ISSN de @ca
label: هو ردمد لـ @ar
label: 是……的国际标准连续出版物号 @zh-hans
sub property of: is identifier for work of
alternative label: International Standard Serial Number for @da
alternative label: International Standard Serial Number of
alternative label: International Standard Serial Number teokselle @fi
alternative label: International Standard Serial Number von @de
alternative label: Número Internacional Normalitzat per a Publicacions en Sèrie de @ca
alternative label: időszaki kiadványok nemzetközi azonosító száma: @hu
alternative label: numéro international normalisé des publications en série de @fr
alternative label: rahvusvaheline jadaväljaande standardnumber teosele @et
alternative label: الرقم المعياري الدولي للدوريات لـ @ar
alternative label: ……的国际标准连续出版物号 @zh-hans
definition: Bir ismi, ISSN kayıt ajansı tarafından atanmış bir tanımlayıcıya sahip bir eserle ilişkilendirir. @tr
definition: Correla un nomen a un'opera che ha un identificatore assegnato da una agenzia di registrazione dell'ISSN. @it
definition: Hozzákapcsol egy noment egy műhöz, amelynek van egy ISSN regisztrációs ügynökség által jegyzett azonosítója. @hu
definition: Liittää nomenin teokseen, jolla on ISSN-rekisteröintiyksikön antama tunniste. @fi
definition: Met un nomen en relation avec une œuvre qui possède un identifiant attribué par une agence d’enregistrement de l’ISSN. @fr
definition: Relaciona un nomen amb una obra que té un identificador assignat per una agència de registre de l’ISSN. @ca
definition: Relateert een nomen aan een werk dat een identificatie heeft toegekend door een ISSN-registratiebureau. @nl
definition: Relaterer et nomen til et verk som har en identifikator som er tildelt av et ISSN-kontor. @no
definition: Relaterer et nomen til et værk, som har en identifikator tildelt af et ISSN-kontor. @da
definition: Relates a nomen to a work that has an identifier assigned by an ISSN registration agency.
definition: Sasaista nomenu ar darbu, kam ir ISSN reģistrācijas aģentūras piešķirts identifikators. @lv
definition: Seostab nomen'i teosega, millel on ISSN registreerimise agentuuri määratud identifikaator. @et
definition: Setzt ein Nomen in Beziehung zu einem Werk, das über einen Identifikator verfügt, der von einem ISSN-Zentrum vergeben wird. @de
definition: يربط تسمية بعمل له مُعرِّف خصصته له وكالة تسجيل ردمد. @ar
definition: 将一个命名与被一个国际标准连续出版物号注册机构分配一个标识符的一种作品关联起来。 @zh-hans

is appellation of work group of
has element type: 2
toolkit definition: A work that is referred to by a nomen used within a given scheme or context to refer to a work as a member of a work group.
toolkit definition: Bir çalışma grubunun üyesi olarak bir çalışmaya atıfta bulunmak için belirli bir şema veya bağlamda kullanılan bir isimle anılan bir çalışma. @tr
toolkit definition: Darbs, uz kuru attiecas nomens, ko lieto konkrētajā sistēmā vai kontekstā, lai atsauktos uz darbu kā darbu sakopojumu @lv
toolkit definition: Een werk dat aangeduid wordt door een nomen gebruikt binnen een bepaald schema of context om een werk aan te duiden als lid van een werkgroep. @nl
toolkit definition: Egy mű, amelyre egy adott sémában vagy kontextusban használt nomen hivatkozik. @hu
toolkit definition: Ein Werk, auf das mit einem Nomen referenziert wird, das in einem bestimmten Schema oder Kontext verwendet wird, um zu einem Werk als Teil einer Werkgruppe zu referenzieren. @de
toolkit definition: Et verk som refereres til av et nomen som brukes innen et gitt skjema eller kontekst for å referere til et verk som et medlem av en verksgruppe. @no
toolkit definition: Obra a la qual fa referència un nomen usat en un esquema o un context determinat per referir-se a una obra com a membre d’un grup d’obres. @ca
toolkit definition: Teos, millele viidatakse nomen'iga, mida antud süsteemis või kontekstis kasutatakse viitamiseks teosele kui teoserühma liikmele. @et
toolkit definition: Teosryhmään kuuluva teos, johon viitataan tietyssä järjestelmässä tai kontekstissa käytetyllä nomenilla. @fi
toolkit definition: Un'opera a cui ci si riferisce con un nomen usato in un dato schema o contesto per riferirsi all'opera come membro di un gruppo di opere. @it
toolkit definition: Værk, som henvises til af et nomen, som anvendes inden for et givet skema eller kontekst for at referere til et værk, som et medlem af en værksgruppe. @da
toolkit definition: Œuvre qui est désignée par un nomen utilisé à l’intérieur d’un schéma ou d’un contexte donnés pour désigner une œuvre en tant que membre d’un groupe d’œuvres. @fr
toolkit definition: عمل يشار إليه بتسمية مستخدمة في خطة أو في سياق معين للإشارة إلى عمل ضمن مجموعة عمل. @ar
toolkit definition: 在一个特定的体系或语境中被用来指称作为一个作品群之一个成员的一种作品的一个命名又被用来指称的一种作品 @zh-hans
toolkit label: Bezeichnung einer Werkgruppe von @de
toolkit label: apel·lació de grup d’obres de @ca
toolkit label: appellation de groupe d’œuvres de @fr
toolkit label: appellation of work group of
toolkit label: benaming van werkgroep van @nl
toolkit label: benævnelse på værksgruppe af @da
toolkit label: betegnelse for verksgruppe for @no
toolkit label: denominazione di gruppo di opere di @it
toolkit label: eser grubunun unvanı @tr
toolkit label: ir apzīmējums darba grupai @lv
toolkit label: műcsoport-megnevezése: @hu
toolkit label: nimitys teosryhmälle @fi
toolkit label: teoserühma nimetus teoses @et
toolkit label: اسم مجموعة عمل لـ @ar
toolkit label: ……的作品群的称谓 @zh-hans
has subproperty: is identifier for work group of
has subproperty: is authorized access point for work group of
has subproperty: P80171
lexical alias: appellationOfWorkGroupOf.en
status: Published
type: Property
domain: C10012
label: er benævnelse på værksgruppe af @da
label: er betegnelse for verksgruppe for @no
label: est une appellation de groupe d’œuvres de @fr
label: ir apzīmējums darba grupai @lv
label: is benaming van werkgroep van @nl
label: ist Bezeichnung einer Werkgruppe von @de
label: műcsoport-megnevezése a következőnek: @hu
label: nimitys teosryhmälle @fi
label: teoserühma nimetus teoses @et
label: çalışma grubunun unvanıdır @tr
label: è denominazione di gruppo di opere di @it
label: és apel·lació de grup d’obres de @ca
label: هو اسم مجموعة عمل لـ @ar
label: 是……的作品群的称谓 @zh-hans
sub property of: is appellation of work of
definition: Bir ismi, bir çalışma grubunun üyesi olarak bir çalışmaya atıfta bulunmak için belirli bir şema veya bağlamda kullanılan atıfta bulunulan eserle ilişkilendirir. @tr
definition: Correla un nomen a un'opera a cui ci si riferisce con un nomen usato in un dato schema o contesto per riferirsi all'opera come membro di un gruppo di opere. @it
definition: Hozzákapcsol egy noment egy műhöz, amelyre egy adott sémában vagy kontextusban használt nomen hivatkozik. @hu
definition: Liittää nomenin teosryhmään kuuluvaan teokseen, johon viitataan tietyssä järjestelmässä tai kontekstissa käytetyllä nomenilla. @fi
definition: Met un nomen en relation avec une œuvre qui est désignée par un nomen utilisé à l’intérieur d’un schéma ou d’un contexte donnés pour désigner une œuvre en tant que membre d’un groupe d’œuvres. @fr
definition: Relaciona un nomen amb una obra a la qual fa referència un nomen usat en un esquema o un context determinat per referir-se a una obra com a membre d’un grup d’obres. @ca
definition: Relateert een nomen aan een werk dat aangeduid wordt door een nomen gebruikt binnen een bepaald schema of context om een werk aan te duiden als lid van een werkgroep. @nl
definition: Relaterer et nomen til et verk som refereres til av et nomen som brukes innen et gitt skjema eller kontekst for å referere til et verk som et medlem av en verksgruppe. @no
definition: Relaterer et nomen til værk, som henvises til af et nomen, som anvendes inden for et givet skema eller kontekst for at referere til et værk, som et medlem af en værksgruppe. @da
definition: Relates a nomen to work that is referred to by a nomen used within a given scheme or context to refer to a work as a member of a work group.
definition: Sasaista nomenu ar darbu, uz kuru attiecas nomens, ko lieto konkrētajā sistēmā vai kontekstā, lai atsauktos uz darbu kā darbu sakopojumu. @lv
definition: Seostab nomen'i teosega, millele viidatakse nomen'iga, mida antud süsteemis või kontekstis kasutatakse viitamiseks teosele kui teoserühma liikmele. @et
definition: Setzt ein Nomen in Beziehung zu einem Werk, auf das mit einem Nomen referenziert wird, das in einem bestimmten Schema oder Kontext verwendet wird, um zu einem Werk als Teil einer Werkgruppe zu referenzieren. @de
definition: يربط تسمية بعمل يشار إليه بتسمية مستخدمة في خطة أو سياق معين للإشارة إلى عمل ضمن مجموعة عمل. @ar
definition: 将一个命名与在一个特定的体系或语境中被用来指称作为一个作品群之一个成员的一种作品的一个命名又被用来指称的一种作品关联起来。 @zh-hans

is identifier for work group of
has element type: 2
toolkit definition: A work that has an appellation of work that is a reference code taken from a vocabulary encoding scheme used to identify a work group.
toolkit definition: Bir eser grubunu tanımlamak için kullanılan bir kelime kodlama şemasından alınan referans kodu olan bir unvana sahip bir eser. @tr
toolkit definition: Darbs, kam ir darba apzīmējums kodētā vārdnīcā, lai identificētu darbu grupu. @lv
toolkit definition: Een werk dat een benaming voor werk heeft die een referentiecode is ontleend aan een vocabulair coderingssysteem gebruikt om een werkgroep te identificeren. @nl
toolkit definition: Egy mű, amelynek van olyan műmegnevezése, amely egy szótárkódolási sémából származó hivatkozási kód. @hu
toolkit definition: Eine Werk, das über eine Bezeichnung für ein Werk verfügt, die einen Referenzcode darstellt, der aus einem Vocabulary Encoding Scheme entnommen wird, um eine Werkgruppe zu identifizieren. @de
toolkit definition: Et verk som har en betegnelse for verk som er en referansekode hentet fra et kodeskjema for vokabular som brukes for å identifisere en verksgruppe. @no
toolkit definition: Obra que té una apel·lació d’obra que és un codi de referència obtingut d’un esquema de codificació de vocabulari usat per identificar un grup d’obres. @ca
toolkit definition: Teos, jolla on sanaston merkintäjärjestelmästä otettu teosryhmän viitekoodi nimityksenään. @fi
toolkit definition: Teos, millel on teose nimetuseks leksikaalsest märkimissüsteemist võetud, teoserühma identifitseeriv viitekood. @et
toolkit definition: Un'opera che ha una denominazione di opera che è un codice di riferimento tratto da uno schema di codifica di vocabolario. @it
toolkit definition: Værk, som har en benævnelse på værk, som er en referencekode hentet fra et vokabularkodningsskema, som bruges for at identificere en værksgruppe. @da
toolkit definition: Œuvre qui possède une appellation d’œuvre consistant en un code de référence provenant d’un schéma d’encodage de vocabulaire utilisé pour identifier un groupe d’œuvres. @fr
toolkit definition: عمل له اسم لعمل عبارة عن رمز إحالة مأخوذ من خطة ترميز مفردات مستخدم لتعريف مجموعة عمل. @ar
toolkit definition: 有一个作品的称谓而且它也是用于标识一个作品群的取自一个词表编码体系的指称代码的一种作品 @zh-hans
toolkit label: Identifikator für eine Werkgruppe von @de
toolkit label: azonosító a következő műcsoport számára: @hu
toolkit label: eser grubunun tanımlayıcısıdır @tr
toolkit label: identifiant de groupe d’œuvres de @fr
toolkit label: identificador de grup d’obres de @ca
toolkit label: identificatie van werkgroep van @nl
toolkit label: identificatore per gruppo di opere di @it
toolkit label: identifier for work group of
toolkit label: identifikator for verksgruppe for @no
toolkit label: identifikator for værksgruppe af @da
toolkit label: ir identifikators darbu grupai @lv
toolkit label: teoserühma identifikaator teosele @et
toolkit label: tunniste teosryhmälle @fi
toolkit label: مُعرِّف لمجموعة عمل @ar
toolkit label: ……的作品群的标识符 @zh-hans
has subproperty: P80172
lexical alias: identifierForWorkGroupOf.en
status: Published
type: Property
domain: C10012
label: azonosító a következő műcsoport számára: @hu
label: er identifikator for verksgruppe for @no
label: er identifikator for værksgruppe af @da
label: eser grubunun tanımlayıcısıdır @tr
label: est un identifiant de groupe d’œuvres de @fr
label: ir identifikators darbu grupai @lv
label: is identificatie van werkgroep van @nl
label: ist Identifikator für eine Werkgruppe von @de
label: teoserühma identifikaator teosele @et
label: tunniste teosryhmälle @fi
label: è identificatore per gruppo di opere di @it
label: és identificador de grup d’obres de @ca
label: هو مُعرِّف لمجموعة عمل لـ @ar
label: 是……的作品群的标识符 @zh-hans
sub property of: is identifier for work of
sub property of: is appellation of work group of
definition: Bir ismi, çalışma grubunu tanımlamak için kullanılan bir kelime kodlama şemasından alınan referans kodu olan bir unvana sahip bir eserle ilişkilendirir. @tr
definition: Correla un nomen a un'opera che ha una denominazione di opera che è un codice di riferimento tratto da uno schema di codifica di vocabolario. @it
definition: Hozzákapcsol egy noment egy műhöz, amelynek van olyan műmegnevezése, amely egy szótárkódolási sémából származó hivatkozási kód. @hu
definition: Liittää nomenin teokseen, jolla on sanaston merkintäjärjestelmästä otettu teosryhmän viitekoodi nimityksenään. @fi
definition: Met un nomen en relation avec une œuvre qui possède une appellation d’œuvre consistant en un code de référence provenant d’un schéma d’encodage de vocabulaire utilisé pour identifier un groupe d’œuvres. @fr
definition: Relaciona un nomen amb una obra que té una apel·lació d’obra que és un codi de referència obtingut d’un esquema de codificació de vocabulari usat per identificar un grup d’obres. @ca
definition: Relateert een nomen aan een werk dat een benaming voor werk heeft die een referentiecode is ontleend aan een vocabulair coderingssysteem gebruikt om een werkgroep te identificeren. @nl
definition: Relaterer et nomen til et verk som har en betegnelse for verk som er en referansekode hentet fra et kodeskjema for vokabular som brukes for å identifisere en verksgruppe. @no
definition: Relaterer et nomen til et værk, som har en benævnelse på værk, som er en referencekode hentet fra et vokabularkodningsskema, som bruges for at identificere en værksgruppe. @da
definition: Relates a nomen to a work that has an appellation of work that is a reference code taken from a vocabulary encoding scheme used to identify a work group.
definition: Sasaista nomenu ar darbu, kam ir darba apzīmējums kodētā vārdnīcā, lai identificētu darbu grupu. @lv
definition: Seostab nomen'i teosega, millel on teose nimetuseks leksikaalsest märkimissüsteemist võetud, teoserühma identifitseeriv viitekood. @et
definition: Setzt ein Nomen in Beziehung zu einem Werk, das über eine Bezeichnung für ein Werk verfügt, die einen Referenzcode darstellt, der aus einem Vocabulary Encoding Scheme entnommen wird, um eine Werkgruppe zu identifizieren. @de
definition: يربط تسمية بعمل له اسم لعمل عبارة عن رمز إحالة مأخوذ من خطة ترميز مفردات مستخدم لتعريف مجموعة عمل. @ar
definition: 将一个命名与有一个作品的称谓而且它也是用于标识一个作品群的取自一个词表编码体系的指称代码的一种作品关联起来。 @zh-hans

is authorized access point for work group of
has element type: 2
toolkit definition: A work that has an authorized access point for work used in a specific vocabulary encoding scheme to identify a work group.
toolkit definition: Darbs, kam ir vārdforma, kas ir izvēlēta kā prioritāra noteiktai kontrolētas vārdnīcas shēmai, lai identificētu darbu grupu. @lv
toolkit definition: Een werk dat een voorkeursingang voor werk heeft in een specifiek vocabulair coderingssysteem gebruikt om een werkgroep te identificeren. @nl
toolkit definition: Egy mű, amelynek van egy előnyben részesített hozzáférési pontja a műhöz, amelyet egy speciális szótárkódolási sémából választanak ki. @hu
toolkit definition: Ein Werk, das über einen Sucheinstieg für ein Werk verfügt, der in einem bestimmten Vocabulary Encoding Scheme als Vorzugsform bestimmt wird, um eine Werkgruppe zu identifizieren. @de
toolkit definition: Eser grubunu tanımlamak için kullanılan belirli bir kelime kodlama şemasında tercihen seçilen eser için bir erişim noktasına sahip olan bir eser. @tr
toolkit definition: Et verk som har en søkeinngang for verk som er valgt som preferanse i et bestemt kodeskjema for vokabular som brukes for å identifisere en verksgruppe. @no
toolkit definition: Obra que té un punt d’accés autoritzat d’obra usat en un esquema de codificació de vocabulari específic per identificar un grup d’obres. @ca
toolkit definition: Teos, jolla on tietyssä sanaston merkintäjärjestelmässä ensisijaiseksi valittu teosryhmän hakutieto. @fi
toolkit definition: Teos, millel on vastavas leksikaalses märkimissüsteemis eelistatuks valitud, teoserühma identifitseeriv otsielement. @et
toolkit definition: Un'opera che ha un punto d'accesso per l'opera che è stato selezionato come preferito in uno specifico schema di codifica di vocabolario. @it
toolkit definition: Værk, som har en søgeindgang for værk, som er valgt som præference i et specifikt vokabularkodningsskema, som bruges for at identificere en værksgruppe. @da
toolkit definition: Œuvre qui possède un point d’accès autorisé d’une œuvre utilisé dans un schéma d’encodage de vocabulaire spécifique pour identifier un groupe d’œuvres. @fr
toolkit definition: عمل له نقطة وصول لعمل اختيرت للتفضيل في خطة ترميز مفردات محددة مستخدمة لتعريف مجموعة عمل. @ar
toolkit definition: 有在一个特定的词表编码体系中被首选用于标识一个作品群的作品检索点的一种作品 @zh-hans
toolkit label: Normierter Sucheinstieg für eine Werkgruppe von @de
toolkit label: auktorisoitu hakutieto teosryhmälle @fi
toolkit label: authorized access point for work group of
toolkit label: autoriseret søgeindgang for værksgruppe af @da
toolkit label: autorisert søkeinngang for verksgruppe for @no
toolkit label: autorizált hozzáférési pont a következő műhöz: @hu
toolkit label: eser grubu için yetkili erişim noktası @tr
toolkit label: geautoriseerde ingang voor werkgroep van @nl
toolkit label: ir autoritatīvā vārdforma darbu grupai @lv
toolkit label: point d’accès autorisé d’un groupe d’œuvres de @fr
toolkit label: punt d’accés autoritzat de grup d’obres de @ca
toolkit label: punto d'accesso autorizzato per gruppo di opere di @it
toolkit label: teoserühma otsielement teosele @et
toolkit label: نقطة وصول مقننة لمجموعة عمل لـ @ar
toolkit label: ……的作品群的规范检索点 @zh-hans
has subproperty: P80173
lexical alias: authorizedAccessPointForWorkGroupOf.en
status: Published
type: Property
domain: C10012
label: auktorisoitu hakutieto teosryhmälle @fi
label: autorizált hozzáférési pont a következő műcsoport számára: @hu
label: er autoriseret søgeindgang for værksgruppe af @da
label: er autorisert søkeinngang for verksgruppe for @no
label: est un point d’accès autorisé d’un groupe d’œuvres de @fr
label: ir autoritatīvā vārdforma darbu grupai @lv
label: is geautoriseerde ingang voor werkgroep van @nl
label: ist normierter Sucheinstieg für eine Werkgruppe von @de
label: teoserühma otsielement teosele @et
label: çalışma grubunun yetkili erişim noktasıdır @tr
label: è punto d'accesso autorizzato per gruppo di opere di @it
label: és punt d’accés autoritzat de grup d’obres de @ca
label: هي نقطة وصول مقننة لمجموعة عمل لـ @ar
label: 是……的作品群的规范检索点 @zh-hans
sub property of: is authorized access point for work of
sub property of: is appellation of work group of
definition: Bir ismi, çalışma grubunu tanımlamak için kullanılan belirli bir sözcük kodlama düzeninde tercih için seçilen eser için bir erişim noktasına sahip olan bir eserle ilişkilendirir. @tr
definition: Correla un nomen a un'opera che ha un punto d'accesso per l'opera che è stato selezionato come preferito in uno specifico schema di codifica di vocabolario. @it
definition: Hozzákapcsol egy noment egy műhöz, amelynek van egy előnyben részesített hozzáférési pontja a műhöz, amelyet egy speciális szótárkódolási sémából választanak ki. @hu
definition: Liittää nomenin teokseen, jolla on tietyssä sanaston merkintäjärjestelmässä ensisijaiseksi valittu teosryhmän hakutieto. @fi
definition: Met un nomen en relation avec une œuvre qui possède un point d’accès autorisé d’une œuvre utilisé dans un schéma d’encodage de vocabulaire spécifique pour identifier un groupe d’œuvres. @fr
definition: Relaciona un nomen amb una obra que té un punt d’accés autoritzat d’obra usat en un esquema de codificació de vocabulari específic per identificar un grup d’obres. @ca
definition: Relateert een nomen aan een werk dat een voorkeursingang voor werk heeft in een specifiek vocabulair coderingssysteem gebruikt om een werkgroep te identificeren. @nl
definition: Relaterer et nomen til et verk som har en søkeinngang for verk som er valgt som preferanse i et bestemt kodeskjema for vokabular som brukes for å identifisere en verksgruppe. @no
definition: Relaterer et nomen til et værk, som har en søgeindgang for værk, som er valgt som præference i et specifikt vokabularkodningsskema, som bruges for at identificere en værksgruppe. @da
definition: Relates a nomen to a work that has an authorized access point for work used in a specific vocabulary encoding scheme to identify a work group.
definition: Sasaista nomenu ar darbu, kam ir vārdforma, kas ir izvēlēta kā prioritāra noteiktai kontrolētas vārdnīcas shēmai, lai identificētu darbu grupu. @lv
definition: Seostab nomen'i teosega, millel on vastavas leksikaalses märkimissüsteemis eelistatuks valitud, teoserühma identifitseeriv otsielement. @et
definition: Setzt ein Nomen in Beziehung zu einem Werk, das über einen Sucheinstieg für ein Werk verfügt, der in einem bestimmten Vocabulary Encoding Scheme als Vorzugsform bestimmt wird, um eine Werkgruppe zu identifizieren. @de
definition: يربط تسمية بعمل له نقطة وصول لعمل اختيرت للتفضيل في خطة ترميز مفردات محددة مستخدمة لتعريف مجموعة عمل. @ar
definition: 将一个命名与有在一个特定的词表编码体系中被首选用于标识一个作品群的作品检索点的一种作品关联起来。 @zh-hans

has related entity of nomen
has element type: 1
toolkit definition: An entity that is associated with a nomen.
toolkit definition: Bir isimle bağlantılı olan bir varlık. @tr
toolkit definition: Een entiteit die is geassocieerd met een nomen. @nl
toolkit definition: Egy entitás, amelyet egy nomenhez társítanak. @hu
toolkit definition: Eine Entität, die mit einem Nomen in Verbindung steht. @de
toolkit definition: En entitet som forbindes med et nomen. @no
toolkit definition: Entitat que s’associa amb un nomen. @ca
toolkit definition: Entiteetti, joka liittyy nomeniin. @fi
toolkit definition: Entitet, som er knyttet til et nomen. @da
toolkit definition: Entité qui est associée à un nomen. @fr
toolkit definition: Entīte, kas saistīta ar nomenu. @lv
toolkit definition: Nomen'iga seotud olem. @et
toolkit definition: Un'entità che è associata con un nomen. @it
toolkit definition: كيان ذو صلة بتسمية. @ar
toolkit definition: 和一个命名有关的一个实体 @zh-hans
toolkit label: Nomenin ilişkili olduğu varlık @tr
toolkit label: ar nomenu saistītā entīte @lv
toolkit label: entitat relacionada amb un nomen @ca
toolkit label: entitet relateret til nomen @da
toolkit label: entità correlata di nomen @it
toolkit label: entité en relation avec un nomen @fr
toolkit label: gerelateerde entiteit van nomen @nl
toolkit label: mit Nomen in Beziehung stehende Entität @de
toolkit label: nomen kapcsolódó entitása: @hu
toolkit label: nomen'iga seotud olem @et
toolkit label: nomeniin liittyvä entiteetti @fi
toolkit label: related entity of nomen
toolkit label: relatert entitet for nomen @no
toolkit label: كيان مرتبط بتسمية @ar
toolkit label: 命名的关联实体 @zh-hans
has subproperty: has related RDA entity of nomen
has subproperty: P80174
lexical alias: relatedEntityOfNomen.en
status: Published
type: Property
domain: C10012
label: a pour entité en relation avec un nomen @fr
label: ar nomenu saistītā entīte @lv
label: ha come entità correlata di nomen @it
label: har entitet relateret til nomen @da
label: har relatert entitet for nomen @no
label: hat mit Nomen in Beziehung stehende Entität @de
label: heeft gerelateerde entiteit van nomen @nl
label: ismin ilgili varlığı ile ilişkilidir @tr
label: nomen kapcsolódó entitása a következő: @hu
label: nomen'iga seotud olem @et
label: nomeniin liittyvä entiteetti @fi
label: té com a entitat relacionada amb un nomen @ca
label: له كيان مرتبط بتسمية @ar
label: 有命名的关联实体 @zh-hans
sub property of: P00028
definition: Bir ismi, isimle bağlantılı olan bir varlıkla ilişkilendirir. @tr
definition: Correla un nomen a un'entità che è associata con un nomen. @it
definition: Hozzákapcsol egy noment egy entitáshoz, amelyet egy nomenhez társítanak. @hu
definition: Liittää nomenin entiteettiin, joka liittyy nomeniin. @fi
definition: Met un nomen en relation avec une entité qui est associée à un nomen. @fr
definition: Relaciona un nomen amb una entitat que s’associa amb un nomen. @ca
definition: Relateert een nomen aan een entiteit die is geassocieerd met een nomen. @nl
definition: Relaterer et nomen til en entitet som forbindes med et nomen. @no
definition: Relaterer et nomen til en entitet, som er knyttet til et nomen. @da
definition: Relates a nomen to an entity that is associated with a nomen.
definition: Sasaista nomenu ar entīti, kas saistīta ar nomenu. @lv
definition: Seostab nomen'i nomen'iga seotud olemiga. @et
definition: Setzt ein Nomen in Beziehung zu einer Entität, die mit einem Nomen in Verbindung steht. @de
definition: يربط تسمية بكيان ذي صلة بتسمية. @ar
definition: 将一个命名与和一个命名有关的一个实体关联起来。 @zh-hans

is given name of
has element type: 2
toolkit definition: A person who uses a name given at birth or at some later point in addition to, or instead of, a surname.
toolkit definition: Een persoon die een naam gebruikt gegeven bij geboorte of later in aanvulling op, of in plaats van, een achternaam. @nl
toolkit definition: Egy személy, aki születésekor kapott utónevét használja, vagy később vette fel, vagy a vezetékneve helyett használja. @hu
toolkit definition: Eine Person, die einen Namen verwendet, der ihr bei der Geburt oder zu einem späteren Zeitpunkt, zusätzlich oder anstatt eines Nachnamens, gegeben wird. @de
toolkit definition: En person som bruker et navn gitt ved fødsel eller ved et senere tidspunkt i tillegg til eller i stedet for et etternavn. @no
toolkit definition: Henkilö, joka käyttää sukunimen lisäksi tai sen sijaan syntymässä tai jossain myöhemmässä vaiheessa annettua nimeä. @fi
toolkit definition: Isik, kes kasutab nime, mis on antud pärast sündi või hiljem perekonnanimele lisaks või selle asemel. @et
toolkit definition: Person, som anvendet et navn givet ved fødslen eller på et senere tidspunkt oveni, eller i stedet for, et efternavn. @da
toolkit definition: Persona que usa un nom de pila donat al naixement o en un moment posterior a més de, o en lloc d’un cognom. @ca
toolkit definition: Persona, kura papildus uzvārdam vai tā vietā izmanto vārdu, kas dots piedzimstot vai vēlāk. @lv
toolkit definition: Personne qui utilise un nom donné à la naissance ou plus tard en plus ou au lieu d’un nom de famille. @fr
toolkit definition: Soyadına ek olarak veya soyadı yerine doğumda veya daha sonraki bir noktada verilen bir adı kullanan bir kişi. @tr
toolkit definition: Una persona che usa un nome proprio dato alla nascita o in un momento successivo in aggiunta a, o in luogo di, un cognome. @it
toolkit definition: شخص يستخدم اسما سُمي به عند الولادة، أو في وقت لاحق، إضافة إلى أو عوضا عن اسم عائلة. @ar
toolkit definition: 使用出生时或以后某个时间点被赋予的姓以外或取代姓的一个名的一个个人 @zh-hans
toolkit label: Vorname von @de
toolkit label: eesnimi isikule @et
toolkit label: etunimi henkilölle @fi
toolkit label: fornavn for @da
toolkit label: given name of
toolkit label: ir vārds @lv
toolkit label: nom de pila de @ca
toolkit label: nome proprio di @it
toolkit label: prénom de @fr
toolkit label: utóneve: @hu
toolkit label: verilen ad @tr
toolkit label: voornaam van @nl
toolkit label: الاسم الأول لـ @ar
toolkit label: ……的名 @zh-hans
has subproperty: P80175
lexical alias: givenNameOf.en
status: Published
type: Property
domain: C10012
label: adıdır @tr
label: eesnimi isikule @et
label: er fornavn for @da
label: est un prénom de @fr
label: etunimi henkilölle @fi
label: ir vārds @lv
label: is voornaam van @nl
label: ist Vorname von @de
label: utóneve a következőnek: @hu
label: è nome proprio di @it
label: és nom de pila de @ca
label: هو الاسم الأول لـ @ar
label: 是……的名 @zh-hans
sub property of: is name of person of
alternative label: gegeven naam van @nl
definition: Bir ismi, soyadına ek olarak veya soyadı yerine doğumda veya daha sonraki bir noktada verilen bir adı kullanan bir kişiyle ilişkilendirir. @tr
definition: Correla un nomen a una persona che usa un nome proprio dato alla nascita o in un momento successivo in aggiunta a, o al posto di, un cognome. @it
definition: Hozzákapcsol egy noment egy személyhez, aki születésekor kapott utónevét használja, vagy később vette fel, vagy a vezetékneve helyett használja. @hu
definition: Liittää nomenin henkilöön, joka käyttää sukunimen lisäksi tai sen sijaan syntymässä tai jossain myöhemmässä vaiheessa annettua nimeä. @fi
definition: Met un nomen en relation avec une personne qui utilise un nom donné à la naissance ou plus tard en plus ou au lieu d’un nom de famille. @fr
definition: Relaciona un nomen amb una persona que usa un nom de pila donat al naixement o en un moment posterior a més de, o en lloc d’un cognom. @ca
definition: Relateert een nomen aan een persoon die een naam gebruikt gegeven bij geboorte of later in aanvulling op, of in plaats van, een achternaam. @nl
definition: Relaterer et nomen til en person som bruker et navn gitt ved fødsel eller ved et senere tidspunkt i tillegg til eller i stedet for et etternavn. @no
definition: Relaterer et nomen til en person, som anvendet et navn givet ved fødslen eller på et senere tidspunkt oveni, eller i stedet for, et efternavn. @da
definition: Relates a nomen to a person who uses a name given at birth or at some later point in addition to, or instead of, a surname.
definition: Sasaista nomenu ar personu, kura papildus uzvārdam vai tā vietā izmanto vārdu, kas dots piedzimstot vai vēlāk. @lv
definition: Seostab nomen'i isikuga, kes kasutab nime, mis on antud pärast sündi või hiljem perekonnanimele lisaks või selle asemel. @et
definition: Setzt ein Nomen in Beziehung zu einer Person, die einen Namen verwendet, der ihr bei der Geburt oder zu einem späteren Zeitpunkt, zusätzlich oder anstatt eines Nachnamens, gegeben wird. @de
definition: يربط تسمية بشخص يستخدم اسما سُمي به عند الولادة، أو في وقت لاحق، إضافة إلى أو عوضا عن اسم عائلة. @ar
definition: 将一个命名与使用出生时或以后某个时间点被赋予的姓以外或取代姓的一个名的一个个人关联起来。 @zh-hans

is surname of
has element type: 2
toolkit definition: A person who uses a family name.
toolkit definition: Bir aile ismini kullanan bir kişi @tr
toolkit definition: Een persoon die een familienaam gebruikt. @nl
toolkit definition: Egy személy, aki családnevet használ. @hu
toolkit definition: Eine Person, die einen Familiennamen verwendet. @de
toolkit definition: En person som bruker et familienavn. @no
toolkit definition: Henkilö, joka käyttää suvun nimeä. @fi
toolkit definition: Isik, kes kasutab perekonnanime. @et
toolkit definition: Person, som anvender et familienavn. @da
toolkit definition: Persona que usa un nom de família. @ca
toolkit definition: Persona, kura lieto uzvārdu. @lv
toolkit definition: Personne qui utilise un nom de famille. @fr
toolkit definition: Una persona che usa un nome di famiglia. @it
toolkit definition: شخص يستخدم اسم عائلة. @ar
toolkit definition: 使用家族名的一个个人 @zh-hans
toolkit label: Nachname von @de
toolkit label: Soyadı @tr
toolkit label: achternaam van @nl
toolkit label: cognom de @ca
toolkit label: cognome di @it
toolkit label: efternavn for @da
toolkit label: etternavn for @no
toolkit label: ir uzvārds @lv
toolkit label: nom de famille de @fr
toolkit label: perekonnanimi isikule @et
toolkit label: sukunimi henkilölle @fi
toolkit label: surname of
toolkit label: vezetékneve: @hu
toolkit label: اسم عائلة لـ @ar
toolkit label: ……的姓 @zh-hans
has subproperty: P80176
lexical alias: surnameOf.en
status: Published
type: Property
domain: C10012
label: er efternavn for @da
label: er etternavn for @no
label: est un nom de famille de @fr
label: ir uzvārds @lv
label: is achternaam van @nl
label: ist Nachname von @de
label: perekonnanimi isikule @et
label: soyadıdır @tr
label: sukunimi henkilölle @fi
label: vezetékneve a következőnek: @hu
label: è cognome di @it
label: és cognom de @ca
label: هو اسم عائلة لـ @ar
label: 是……的姓 @zh-hans
sub property of: is name of person of
definition: Bir ismi kullanan bir kişiyle bir niteleyici aile isimle ilişkilendirir. @tr
definition: Correla un nomen a una persona che usa un nome di famiglia. @it
definition: Hozzákapcsol egy noment egy személyhez, aki családnevet használ. @hu
definition: Liittää nomenin henkilöön, joka käyttää suvun nimeä. @fi
definition: Met un nomen en relation avec une personne qui utilise un nom de famille. @fr
definition: Relaciona un nomen amb una persona que usa un nom de família. @ca
definition: Relateert een nomen aan een persoon die een familienaam gebruikt. @nl
definition: Relaterer et nomen til en person som bruker et familienavn. @no
definition: Relaterer et nomen til en person, som anvender et familienavn. @da
definition: Relates a nomen to a person who uses a family name.
definition: Sasaista nomenu ar personu, kura lieto uzvārdu. @lv
definition: Seostab nomen'i isikuga, kes kasutab perekonnanime. @et
definition: Setzt ein Nomen in Beziehung zu einer Person, die einen Familiennamen verwendet. @de
definition: يربط تسمية بشخص يستخدم اسم عائلة. @ar
definition: 将一个命名与使用家族名的一个个人关联起来。 @zh-hans

is fuller form of name of
has element type: 2
toolkit definition: A person who has a fuller form of a name or part of a name represented by an initial, abbreviation, or shortened or otherwise modified form.
toolkit definition: Bir ismin tam biçimine veya bir baş harf, kısaltma veya kısaltılmış veya başka bir şekilde değiştirilmiş biçimle temsil edilen bir ismin bir kısmına sahip olan kişi. @tr
toolkit definition: Een persoon die een meer volledige vorm van een naam heeft of deel van een naam vertegenwoordigd door een initiaal, afkorting, of ingekort of op andere wijze aangepaste vorm. @nl
toolkit definition: Egy személy, akinek van egy teljesebb névformája, vagy nevének egy részét egy kezdőbetű, rövidítés vagy rövidített, illetve más módosító forma reprezentálja. @hu
toolkit definition: Eine Person, die über eine vollständigere Namensform oder einen Teil eines Namens verfügt, der nur durch eine Initiale, eine Abkürzung oder sonst irgendwie gekürzte oder anderweitig veränderte Form dargestellt wird. @de
toolkit definition: En person som har en mer fullstendig navneform eller del av navnet representert av en initital, forkortelse eller på annen modifisert form. @no
toolkit definition: Henkilö, jolla on alkukirjaimin, lyhenteellä tai muuten lyhennetyn tai muokatun nimen tai nimen osan täydellisempi muoto. @fi
toolkit definition: Isik, kellel on nime täielikum vorm või see osa nimest, mis on esitatud initsiaalina, lühendina või lühendatud või muul viisil muudetud vormina. @et
toolkit definition: Person, som har en mere fuldstændig navneform eller del af et navn repræsenteret af et initial, forkortelse eller lignende tilpasninger. @da
toolkit definition: Persona que té una forma més completa o una part d’un nom, representada per una inicial, una abreviació, o una forma escurçada o modificada altrament. @ca
toolkit definition: Persona, kurai ir pilnīgāka vārda forma vai nosaukuma daļa, ko attēlo ar iniciāli, abreviatūru vai saīsinājumu, vai citādi pārveidotu formu. @lv
toolkit definition: Personne qui possède une forme développée d’un nom ou d’une partie d’un nom représentée par une initiale, une abréviation ou une forme raccourcie ou autrement modifiée. @fr
toolkit definition: Una persona che ha una forma completa di un nome o parte di un nome rappresentato da un'iniziale, abbreviazione o abbreviata o forma modificata in altro modo. @it
toolkit definition: شخص له صيغة أكمل لاسم، أو لجزء من اسم يُعبر عنه بحروف استهلالية، أو باختصار، أو بأي شكل مختصر أو مُعدل بطريقة أخرى. @ar
toolkit definition: 有用首字母缩写、缩略语、缩短或其他修改形式表示的一个名称或一个名称的部分的较完整的形式的一个个人 @zh-hans
toolkit label: Vollständigere Namensform von @de
toolkit label: forma completa del nome di @it
toolkit label: forma més completa d’un nom de @ca
toolkit label: forme développée du nom de @fr
toolkit label: fuller form of name of
toolkit label: ir personvārda pilnīgāka forma @lv
toolkit label: ismin tam hali @tr
toolkit label: meer volledige vorm van naam van @nl
toolkit label: mer fullstendig navneform for @no
toolkit label: mere fuldstændig navneform for @da
toolkit label: nimen täydellisempi muoto henkilölle @fi
toolkit label: teljesebb névformája: @hu
toolkit label: täielikum nimevorm isikule @et
toolkit label: صيغة أكمل لاسم لـ @ar
toolkit label: ……的名称的较完整形式 @zh-hans
has subproperty: P80177
lexical alias: fullerFormOfNameOf.en
status: Published
type: Property
domain: C10012
label: er mer fullstendig navneform for @no
label: er mere fuldstændig navneform for @da
label: est une forme développée du nom de @fr
label: ir personvārda pilnīgāka forma @lv
label: is meer volledige vorm van naam van @nl
label: isminin tam halidir @tr
label: ist vollständigere Namensform von @de
label: nimen täydellisempi muoto henkilölle @fi
label: teljesebb névformája a következőnek: @hu
label: täielikum nimevorm isikule @et
label: è forma completa del nome di @it
label: és forma més completa d’un nom de @ca
label: هي صيغة أكمل لاسم لـ @ar
label: 是……的名称的较完整形式 @zh-hans
sub property of: is name of person of
definition: Bir ismi, bir ismin daha tam bir biçimine veya baş harf, kısaltma veya kısaltılmış veya başka bir şekilde değiştirilmiş biçimle temsil edilen bir ismin bir kısmına sahip olan bir kişiyle ilişkilendirir. @tr
definition: Correla un nomen a una persona che ha una forma completa di un nome o parte di un nome rappresentato da un'iniziale, abbreviazione o abbreviata o forma modificata in altro modo. @it
definition: Hozzákapcsol egy noment egy személyhez, akinek van egy teljesebb névformája, vagy nevének egy részét egy kezdőbetű, rövidítés vagy rövidített, illetve más módosító forma reprezentálja. @hu
definition: Liittää nomenin henkilöön, jolla on alkukirjaimin, lyhenteellä tai muuten lyhennetyn tai muokatun nimen tai nimen osan täydellisempi muoto. @fi
definition: Met un nomen en relation avec une personne qui possède une forme développée d’un nom ou d’une partie d’un nom représentée par une initiale, une abréviation ou une forme raccourcie ou autrement modifiée. @fr
definition: Relaciona un nomen amb una persona que té una forma més completa o una part d’un nom, representada per una inicial, una abreviació, o una forma escurçada o modificada altrament. @ca
definition: Relateert een nomen aan een persoon die een meer volledige vorm van een naam heeft of deel van een naam vertegenwoordigd door een initiaal, afkorting, of ingekort of op andere wijze aangepaste vorm. @nl
definition: Relaterer et nomen til en person som har en mer fullstendig navneform eller del av navnet representert av en initital, forkortelse eller på annen modifisert form. @no
definition: Relaterer et nomen til en person, som har en mere fuldstændig navneform eller del af et navn repræsenteret af et initial, forkortelse eller lignende tilpasninger. @da
definition: Relates a nomen to a person who has a fuller form of a name or part of a name represented by an initial, abbreviation, or shortened or otherwise modified form.
definition: Sasaista nomenu ar personu, kurai ir pilnīgāka vārda forma vai nosaukuma daļa, ko attēlo ar iniciāli, abreviatūru vai saīsinājumu, vai citādi pārveidotu formu. @lv
definition: Seostab nomen'i isikuga, kellel on nime täielikum vorm või see osa nimest, mis on esitatud initsiaalina, lühendina või lühendatud või muul viisil muudetud vormina. @et
definition: Setzt ein Nomen in Beziehung zu einer Person, die über eine vollständigere Namensform oder einen Teil eines Namens verfügt, der nur durch eine Initiale, eine Abkürzung oder sonst irgendwie gekürzte oder anderweitig veränderte Form dargestellt wird. @de
definition: يربط تسمية بشخص له صيغة أكمل لاسم، أو لجزء من اسم يُعبر عنه بحروف استهلالية، أو باختصار، أو أو بأي شكل مختصر أو مُعدل بطريقة أخرى. @ar
definition: 将一个命名与有用首字母缩写、缩略语、缩短或其他修改形式表示的一个名称或一个名称的部分的较完整的形式的一个个人关联起来。 @zh-hans

is nomen described by
has element type: 2
toolkit definition: A work that is a description of a nomen.
toolkit definition: Bir ismin tanımı olan bir eser @tr
toolkit definition: Darbs, kurā aprakstīts konkrētais nomens. @lv
toolkit definition: Een werk dat een nomen beschrijft. @nl
toolkit definition: Egy mű, amely leír egy noment. @hu
toolkit definition: Ein Werk, das ein Nomen beschreibt. @de
toolkit definition: Et verk som beskriver et nomen. @no
toolkit definition: Obra que és una descripció d’un nomen. @ca
toolkit definition: Teos, joka kuvaa nomenia. @fi
toolkit definition: Teos, milles nomen'it kirjeldatakse. @et
toolkit definition: Un'opera che che descrive un nomen. @it
toolkit definition: Værk, som beskriver et nomen. @da
toolkit definition: Œuvre qui consiste en une description d’un nomen. @fr
toolkit definition: عمل يصف تسمية. @ar
toolkit definition: 作为一个命名之描述的一种作品 @zh-hans
toolkit label: Nomen beschrieben in @de
toolkit label: Tarafından tanımlanan isim @tr
toolkit label: nomen beschreven in @nl
toolkit label: nomen beskrevet i @da
toolkit label: nomen beskrevet i @no
toolkit label: nomen described by
toolkit label: nomen descrit per @ca
toolkit label: nomen descritto in @it
toolkit label: nomen décrit par @fr
toolkit label: nomen leírva a következőben: @hu
toolkit label: nomen'i kirjeldus @et
toolkit label: nomena apraksts @lv
toolkit label: nomenia kuvaava teos @fi
toolkit label: تسمية موصوفة في @ar
toolkit label: 被……描述的命名 @zh-hans
has subproperty: is nomen described with metadata by
has subproperty: P80178
lexical alias: nomenDescribedBy.en
status: Published
type: Property
domain: C10012
label: er nomen beskrevet i @da
label: est un nomen décrit par @fr
label: ir nomena apraksts @lv
label: is nomen beschreven in @nl
label: ist Nomen beschrieben in @de
label: nomen leírva a következőben: @hu
label: nomen'i kirjeldus @et
label: nomenia kuvaava teos @fi
label: tarafından tanımlanan isimdir @tr
label: è nomen descritto in @it
label: és nomen descrit per @ca
label: هي تسمية موصوفة في @ar
label: 是被……描述的命名 @zh-hans
sub property of: is subject nomen of
alternative label: nomen described in
alternative label: nomen descrit en @ca
alternative label: nomen décrit dans @fr
alternative label: nomenia kuvattu teoksessa @fi
alternative label: tanımlanan isim @tr
alternative label: 被描述于……的命名 @zh-hans
definition: Bir ismi, bir niteleyici isim tanımlayan bir eserle ilişkilendirir. @tr
definition: Correla un nomen a un'opera che che descrive un nomen. @it
definition: Hozzákapcsol egy noment egy műhöz, amelyet egy noment ír le. @hu
definition: Liittää nomenin teokseen, joka kuvaa nomenia. @fi
definition: Met un nomen en relation avec une œuvre qui consiste en une description d’un nomen. @fr
definition: Relaciona un nomen amb una obra que descriu un nomen. @ca
definition: Relateert een nomen aan een werk dat een nomen beschrijft. @nl
definition: Relaterer et nomen til et verk som beskriver et nomen. @no
definition: Relaterer et nomen til et værk, som beskriver et nomen. @da
definition: Relates a nomen to a work that describes a nomen.
definition: Sasaista nomenu ar darbu, kurā aprakstīts konkrētais nomens. @lv
definition: Seostab nomen'i teosega, milles nomen'it kirjeldatakse. @et
definition: Setzt ein Nomen in Beziehung zu einem Werk, das ein Nomen beschreibt. @de
definition: يربط تسمية بعمل يصف تسمية. @ar
definition: 将一个命名与作为一个命名之描述的一种作品关联起来。 @zh-hans

is numbering within sequence of
has element type: 2
toolkit definition: A manifestation that has a designation that identifies its position in a sequence of individual parts of a larger manifestation or parts or issues of a larger work.
toolkit definition: Daha büyük bir gösterimin veya daha büyük bir eserin bölümleri ya da sayıları dizisindeki konumunu belirten bir tanımlamaya sahip bir gösterim. @tr
toolkit definition: Een manifestatie die een aanduiding heeft die haar positie identificeert in een volgorde van individuele delen van een grotere manifestatie of delen of afleveringen van een groter werk. @nl
toolkit definition: Egy megjelenési forma, amelynek megjelölése azonosítja annak elhelyezkedését az egyedi részek sorrendiségében egy nagyobb mű részeként vagy számaként. @hu
toolkit definition: Eine Manifestation, die über eine Bezeichnung verfügt, die ihre Position in einer Reihe einzelner Teile einer größeren Manifestation oder Teilen oder Ausgaben eines größeren Werks identifiziert. @de
toolkit definition: Manifestaation, jonka määrite identifioi sen sijainnin laajemman manifestaation yksittäisten osien tai laajemman teoksen osien tai numeroiden jaksossa. @fi
toolkit definition: Manifestació que té una designació que identifica la seva posició en una seqüència de parts individuals d’una manifestació més gran o parts o números d’una obra més gran. @ca
toolkit definition: Manifestation der har en betegnelse der identificerer dets position i en rækkefølge af individuelle dele af en større manifestation eller dele eller udgaver af et større værk. @da
toolkit definition: Manifestation qui possède une désignation identifiant sa position dans une séquence de parties individuelles d’une manifestation plus vaste ou de parties ou livraisons d’une œuvre plus vaste. @fr
toolkit definition: Manifestācija, kurai ir apzīmējums, kas identificē tās pozīciju lielākas manifestācijas atsevišķu daļu vai lielāka darba daļu vai laidienu virknē. @lv
toolkit definition: تجسيدة لها تسمية تحدد ترتيبها في تسلسل أجزاء فردية لتجسيدة أكبر، أو في أجزاء، أو في إصدارات لعمل أكبر. @ar
toolkit definition: 有标识其在一种较大载体表现中的个别部分或者一种较大作品中的部分或期的序列中的位置的一个标识的一种载体表现 @zh-hans
toolkit label: Sırası içinde numaralandırma @tr
toolkit label: Zählung innerhalb einer Reihe von @de
toolkit label: numbering within sequence of
toolkit label: numeració dins una seqüència de @ca
toolkit label: numerointijakson sisäinen numerointi manifestaatiossa @fi
toolkit label: numerācija virknes ietvaros @lv
toolkit label: nummerering indenfor en rækkefølge af @da
toolkit label: nummering binnen volgorde van @nl
toolkit label: numérotation au sein d’une séquence de @fr
toolkit label: sorrendiséget jelző számozása: @hu
toolkit label: هو ترقيم ضمن تسلسل لـ @ar
toolkit label: 在……的序列中的编号 @zh-hans
has subproperty: P80179
lexical alias: numberingWithinSequenceOf.en
status: Published
type: Property
domain: C10012
label: er nummerering indenfor en rækkefølge af @da
label: est une numérotation au sein d’une séquence de @fr
label: ir numerācija virknes ietvaros @lv
label: is nummering binnen volgorde van @nl
label: ist Zählung innerhalb einer Reihe von @de
label: numerointijakson sisäinen numerointi manifestaatiossa @fi
label: sorrendiséget jelző számozása a következőnek: @hu
label: sırası içinde numaralandırılmıştır @tr
label: és numeració dins una seqüència de @ca
label: هو ترقيم ضمن تسلسل لـ @ar
label: 是在……的序列中的编号 @zh-hans
sub property of: has related manifestation of nomen
definition: Bir ismi, daha büyük bir gösterimin tek tek bölümlerinin bir dizisindeki konumunu veya daha büyük bir çalışmanın bölümleri veya konuları içindeki konumunu tanımlayan bir adlandırmaya sahip bir gösterimle ilişkilendirir. @tr
definition: Hozzákapcsol egy noment egy megjelenési formához, amelynek megjelölése azonosítja annak elhelyezkedését az egyedi részek sorrendiségében egy nagyobb mű részeként vagy számaként. @hu
definition: Liittää nomenin manifestaatioon, jonka määrite identifioi sen sijainnin laajemman manifestaation yksittäisten osien tai laajemman teoksen osien tai numeroiden jaksossa. @fi
definition: Met un nomen en relation avec une manifestation qui possède une désignation identifiant sa position dans une séquence de parties individuelles d’une manifestation plus vaste ou de parties ou livraisons d’une œuvre plus vaste. @fr
definition: Relaciona un nomen amb una manifestació que té una designació que identifica la seva posició en una seqüència de parts individuals d’una manifestació més gran o parts o números d’una obra més gran. @ca
definition: Relateert een nomen aan een manifestatie die een aanduiding heeft die haar positie identificeert in een volgorde van individuele delen van een grotere manifestatie of delen of afleveringen van een groter werk. @nl
definition: Relaterer et nomen til en manifestation der har en betegnelse der identificerer dets position i en rækkefølge af individuelle dele af en større manifestation eller dele eller udgaver af et større værk. @da
definition: Relates a nomen to a manifestation that has a designation that identifies its position in a sequence of individual parts of a larger manifestation or parts or issues of a larger work.
definition: Sasaista nomenu ar manifestāciju, kurai ir apzīmējums, kas identificē tās pozīciju lielākas manifestācijas atsevišķu daļu vai lielāka darba daļu vai laidienu virknē. @lv
definition: Setzt ein Nomen in Beziehung zu einer Manifestation, die über eine Bezeichnung verfügt, die ihre Position in einer Reihe einzelner Teile einer größeren Manifestation oder Teilen oder Ausgaben eines größeren Werks identifiziert. @de
definition: يربط تسمية بتجسيدة لها تسمية تحدد ترتيبها في تسلسل أجزاء فردية لتجسيدة أكبر، أو في أجزاء، أو في اصدارات لعمل أكبر. @ar
definition: 将一个命名与有标识其在一种较大载体表现中的个别部分或者一种较大作品中的部分或期的序列中的位置的一个标识的一种载体表现关联起来。 @zh-hans

is first alphanumeric designation of alternative sequence of
has element type: 2
toolkit definition: A manifestation that has a designation in the form of numbers or alphabetic characters that is used to indicate the first in a concurrent sequence of numbering of parts or iterations.
toolkit definition: Een manifestatie die een aanduiding heeft in de vorm van nummers of alfabetische karakters, die gebruikt is om aan te geven wat de eerste is in een gelijktijdige volgorde van nummering van delen of iteraties. @nl
toolkit definition: Egy megjelenési forma, amelynek megjelölése számok vagy alfabetikus karakterek formájában jelzi az elsőt a részek vagy iterációk konkurens számozási sorrendjében. @hu
toolkit definition: Eine Manifestation, die über eine Bezeichnung in Form von Nummern oder Buchstaben verfügt, die verwendet wird, um in einer alternativen Zählfolge der Ausgaben oder Iterationen auf die erste hinzuweisen. @de
toolkit definition: Manifestaation numeroista ja/tai kirjaimista muodostuvaan määrite, joka osoittaa osien tai iteraatioiden rinnakkaisen numerointijakson ensimmäisen määritteen. @fi
toolkit definition: Manifestació que té una designació en la forma de números o caràcters alfabètics que s’usen per indicar la primera en una seqüència concurrent de numeració de parts o iteracions. @ca
toolkit definition: Manifestation der har en betegnelse i form af cifre eller alfabetiske karakterer der anvendes for at angive det første nummer i en samtidig rækkefølge af nummerering af dele eller iterationer. @da
toolkit definition: Manifestation qui possède une désignation sous forme de nombres ou de caractères alphabétiques servant à indiquer la première partie ou itération dans une séquence concomitante de numérotation de parties ou itérations. @fr
toolkit definition: Manifestācija, kurai ir apzīmējums skaitļu vai alfabēta rakstzīmju veidā, ko izmanto, lai paralēlā daļu vai iterāciju numerācijas virknē norādītu pirmo. @lv
toolkit definition: Parçaların veya yinelemelerin eşzamanlı numaralandırma dizisindeki ilki belirtmek için kullanılan, sayılar veya alfabetik karakterler biçiminde bir belirtece sahip bir gösterim. @tr
toolkit definition: تجسيدة لها تسمية في شكل أرقام أو حروف هجائية تستخدم للإشارة إلى الأول في تسلسل مرتب زمنيا لترقيم أجزاء أو تكرارات. @ar
toolkit definition: 有以数字或字母字符形式标识用于标识部分或更新后整体的并存编号序列中第一个的一种载体表现 @zh-hans
toolkit label: Alternative alphanumerische Bezeichnung der ersten Ausgabe einer fortlaufenden Ressource von @de
toolkit label: alfanumerikus kezdőjelölése a következő alternatív sorrendiségének: @hu
toolkit label: alternatif sıralamanın ilk alfanümerik tanımlaması @tr
toolkit label: eerste alfanumerieke aanduiding van alternatieve volgorde van @nl
toolkit label: first alphanumeric designation of alternative sequence of
toolkit label: første alfanumeriske betegnelse af alternativ rækkefølge af @da
toolkit label: pirmais alternatīvās virknes burtciparu apzīmējums @lv
toolkit label: première désignation alphanumérique d’une autre séquence de @fr
toolkit label: primera designació alfanumèrica d’una seqüència alternativa de @ca
toolkit label: vaihtoehtoisen numerointijakson ensimmäinen numero- ja/tai kirjainmäärite manifestaatiossa @fi
toolkit label: أول تسمية رقمية في تسلسل بديل لـ @ar
toolkit label: ……的交替序列的第一个字母数字标识 @zh-hans
has subproperty: P80180
lexical alias: firstAlphanumericDesignationOfAlternativeSequenceOf.en
status: Published
type: Property
domain: C10012
label: alfanumerikus kezdőjelölése a következő alternatív sorrendiségének: @hu
label: alternatif sırasının ilk alfanümerik tanımlanmasıdır @tr
label: er første alfanumeriske betegnelse af alternativ rækkefølge af @da
label: est la première désignation alphanumérique d’une autre séquence de @fr
label: ir pirmais alternatīvās virknes burtciparu apzīmējums @lv
label: is eerste alfanumerieke aanduiding van alternatieve volgorde van @nl
label: ist alternative alphanumerische Bezeichnung der ersten Ausgabe einer fortlaufenden Ressource von @de
label: vaihtoehtoisen numerointijakson ensimmäinen numero- ja/tai kirjainmäärite manifestaatiossa @fi
label: és primera designació alfanumèrica d’una seqüència alternativa de @ca
label: هي أول تسمية هجائية رقمية لتسلسل بديل لـ @ar
label: 是……的交替序列的第一个字母数字标识 @zh-hans
sub property of: is first alphanumeric designation of sequence of
definition: Bir ismi, parçaların veya yinelemelerin eşzamanlı numaralandırma dizisindeki ilki belirtmek için kullanılan, sayılar veya alfabetik karakterler biçiminde bir adlandırmaya sahip bir gösterimle ilişkilendirir. @tr
definition: Hozzákapcsol egy noment egy megjelenési formához, amelynek megjelölése számok vagy alfabetikus karakterek formájában jelzi az elsőt a részek vagy iterációk konkurens számozási sorrendjében. @hu
definition: Liittää nomenin manifestaation numeroista ja/tai kirjaimista muodostuvaan määritteeseen, joka osoittaa osien tai iteraatioiden rinnakkaisten numerointijaksojen ensimmäisen määritteen. @fi
definition: Met un nomen en relation avec une manifestation qui possède une désignation sous forme de nombres ou de caractères alphabétiques servant à indiquer la première partie ou itération dans une séquence concomitante de numérotation de parties ou itérations. @fr
definition: Relaciona un nomen amb una manifestació que té una designació en la forma de números o caràcters alfabètics que s’usen per indicar la primera en una seqüència concurrent de numeració de parts o iteracions. @ca
definition: Relateert een nomen aan een manifestatie die een aanduiding heeft in de vorm van nummers of alfabetische karakters, die gebruikt is om aan te geven wat de eerste is in een gelijktijdige volgorde van nummering van delen of iteraties. @nl
definition: Relaterer et nomen til en manifestation der har en betegnelse i form af cifre eller alfabetiske karakterer der anvendes for at angive det første nummer i en samtidig rækkefølge af nummerering af dele eller iterationer. @da
definition: Relates a nomen to a manifestation that has a designation in the form of numbers or alphabetic characters that is used to indicate the first in a concurrent sequence of numbering of parts or iterations.
definition: Sasaista nomenu ar manifestāciju, kurai ir apzīmējums skaitļu vai alfabēta rakstzīmju veidā, ko izmanto, lai paralēlā daļu vai iterāciju numerācijas virknē norādītu pirmo. @lv
definition: Setzt ein Nomen in Beziehung zu einer Manifestation, die über eine Bezeichnung in Form von Nummern oder Buchstaben verfügt, die verwendet wird, um in einer alternativen Zählfolge der Ausgaben oder Iterationen auf die erste hinzuweisen. @de
definition: يربط تسمية بتجسيدة لها تسمية في شكل أرقام أو حروف هجائية تستخدم للإشارة إلى الأول في تسلسل الترقيم لأجزاء أو تكرارات. @ar
definition: 将一个命名与有以数字或字母字符形式标识用于标识部分或更新后整体的并存编号序列中第一个的一种载体表现关联起来。 @zh-hans

is first alphanumeric designation of sequence of
has element type: 2
toolkit definition: A manifestation that has a designation in the form of numbers or alphabetic characters that is used to indicate the first in a sequence of numbering of parts or iterations.
toolkit definition: Een manifestatie die een aanduiding heeft in de vorm van nummers of alfabetische karakters, die gebruikt is om aan te geven wat de eerste is in een volgorde van nummering van delen of iteraties. @nl
toolkit definition: Egy megjelenési forma, amelynek megjelölése számok vagy alfabetikus karakterek formájában jelzi az elsőt a részek vagy iterációk számozási sorrendjében. @hu
toolkit definition: Eine Manifestation, die über eine Bezeichnung in Form von Nummern oder Buchstaben verfügt, die verwendet wird, um in einer Zählfolge der Ausgaben auf die erste hinzuweisen. @de
toolkit definition: Manifestaation numeroista ja/tai kirjaimista muodostuvaan määrite, joka osoittaa osien tai iteraatioiden numerointijakson ensimmäisen määritteen. @fi
toolkit definition: Manifestació que té una designació en la forma de números o caràcters alfabètics que s’usen per indicar la primera en una seqüència de numeració de parts o iteracions. @ca
toolkit definition: Manifestation der har en betegnelse i form af cifre eller alfabetiske karakterer der anvendes for at angive det første nummer i en rækkefølge af nummerering af dele eller iterationer. @da
toolkit definition: Manifestation qui possède une désignation sous forme de nombres ou de caractères alphabétiques servant à indiquer la première partie ou itération dans une séquence de numérotation de parties ou itérations. @fr
toolkit definition: Manifestācija, kurai ir apzīmējums skaitļu vai alfabēta rakstzīmju veidā, ko izmanto, lai daļu vai iterāciju numerācijas virknē norādītu pirmo. @lv
toolkit definition: Parçaların veya yinelemelerin numaralandırma dizisindeki ilki belirtmek için kullanılan, sayılar veya alfabetik karakterler biçiminde bir belirtece sahip bir gösterim. @tr
toolkit definition: تجسيدة لها تسمية في شكل أرقام أو حروف هجائية تُستخدم للإشارة إلى الأول في تسلسل أرقام أو في أجزاء أو في تكرارات. @ar
toolkit definition: 有以数字或字母字符形式标识用于标识部分或更新后整体的编号序列中第一个的一种载体表现 @zh-hans
toolkit label: Alphanumerische Bezeichnung der ersten Ausgabe einer fortlaufenden Ressource von @de
toolkit label: alfanumerikus kezdőjelölése a következő sorrendiségének: @hu
toolkit label: eerste alfanumerieke aanduiding van volgorde van @nl
toolkit label: first alphanumeric designation of sequence of
toolkit label: første alfanumeriske betegnelse af rækkefølge af @da
toolkit label: numerointijakson ensimmäinen numero- ja/tai kirjainmäärite manifestaatiossa @fi
toolkit label: pirmais virknes burtciparu apzīmējums @lv
toolkit label: première designation alphanumérique d’une séquence de @fr
toolkit label: primera designació alfanumèrica d’una seqüència de @ca
toolkit label: sıralamanın ilk alfanümerik tanımlaması @tr
toolkit label: أول تسمية رقمية هجائية في تسلسل لـ @ar
toolkit label: ……的序列的第一个字母数字标识 @zh-hans
has subproperty: is first alphanumeric designation of alternative sequence of
has subproperty: P80181
lexical alias: firstAlphanumericDesignationOfSequenceOf.en
status: Published
type: Property
domain: C10012
label: alfanumerikus kezdőjelölése a következő sorrendiségének: @hu
label: er første alfanumeriske betegnelse af rækkefølge af @da
label: est la première designation alphanumérique d’une séquence de @fr
label: ir pirmais virknes burtciparu apzīmējums @lv
label: is eerste alfanumerieke aanduiding van volgorde van @nl
label: ist alphanumerische Bezeichnung der ersten Ausgabe einer fortlaufenden Ressource von @de
label: numerointijakson ensimmäinen numero- ja/tai kirjainmäärite manifestaatiossa @fi
label: sırasının ilk alfanümerik tanımlanmasıdır @tr
label: és primera designació alfanumèrica d’una seqüència de @ca
label: هي أول تسمية هجائية رقمية في تسلسل لـ @ar
label: 是……的序列的第一个字母数字标识 @zh-hans
sub property of: has related manifestation of nomen
definition: Bir ismi, parçaların veya yinelemelerin numaralandırma dizisindeki ilki belirtmek için kullanılan, sayılar veya alfabetik karakterler biçiminde bir adlandırmaya sahip bir gösterimle ilişkilendirir. @tr
definition: Hozzákapcsol egy noment egy megjelenési formához, amelynek megjelölése számok vagy alfabetikus karakterek formájában jelzi az elsőt a részek vagy iterációk számozási sorrendjében. @hu
definition: Liittää nomenin manifestaation numeroista ja/tai kirjaimista muodostuvaan määritteeseen, joka osoittaa osien tai iteraatioiden numerointijakson ensimmäisen määritteen. @fi
definition: Met un nomen en relation avec une manifestation qui possède une désignation sous forme de nombres ou de caractères alphabétiques servant à indiquer la première partie ou itération dans une séquence de numérotation de parties ou itérations. @fr
definition: Relaciona un nomen amb una manifestació que té una designació en la forma de números o caràcters alfabètics que s’usen per indicar la primera en una seqüència de numeració de parts o iteracions. @ca
definition: Relateert een nomen aan een manifestatie die een aanduiding heeft in de vorm van nummers of alfabetische karakters, die gebruikt is om aan te geven wat de eerste is in een volgorde van nummering van delen of iteraties. @nl
definition: Relaterer et nomen til en manifestation der har en betegnelse i form af cifre eller alfabetiske karakterer der anvendes for at angive det første nummer i en rækkefølge af nummerering af dele eller iterationer. @da
definition: Relates a nomen to a manifestation that has a designation in the form of numbers or alphabetic characters that is used to indicate the first in a sequence of numbering of parts or iterations.
definition: Sasaista nomenu ar manifestāciju, kurai ir apzīmējums skaitļu vai alfabēta rakstzīmju veidā, ko izmanto, lai daļu vai iterāciju numerācijas virknē norādītu pirmo. @lv
definition: Setzt ein Nomen in Beziehung zu einer Manifestation, die über eine Bezeichnung in Form von Nummern oder Buchstaben verfügt, die verwendet wird, um in einer Zählfolge der Ausgaben auf die erste hinzuweisen. @de
definition: يربط تسمية بتجسيدة لها تسمية في شكل أرقام أو حروف هجائية تُستخدم للإشارة إلى الأول في تسلسل متزامن لترقيم أجزاء أو تكرارات. @ar
definition: 将一个命名与有以数字或字母字符形式标识用于标识部分或更新后整体的编号序列中第一个的一种载体表现关联起来。 @zh-hans

is first chronological designation of alternative sequence of
has element type: 2
toolkit definition: A manifestation that has a designation in the form of a date or other timespan that is used to indicate the first in a concurrent sequence of numbering of parts or iterations.
toolkit definition: Een manifestatie die een aanduiding heeft in de vorm van een datum of andere tijdspanne, die gebruikt is om aan te geven wat de eerste is in een gelijktijdige volgorde van nummering van delen of iteraties. @nl
toolkit definition: Eine Manifestation, die über eine Bezeichnung in Form eines Datums oder eines anderen Zeitraums verfügt, die verwendet wird, um in einer alternativen Zählfolge der Ausgaben auf die erste hinzuweisen. @de
toolkit definition: Hozzákapcsol egy noment egy megjelenési formához, amelynek megjelölése számok vagy alfabetikus karakterek formájában jelzi az elsőt a részek vagy iterációk számozási sorrendjében. @hu
toolkit definition: Manifestaation päivämäärästä tai muusta ajanjaksosta muodostuva määrite, joka on manifestaation osien tai iteraatioiden rinnakkaisen numerointijakson ensimmäinen määrite. @fi
toolkit definition: Manifestació que té una designació en la forma d’una data o un altre interval de temps que s’usa per indicar la primera en una seqüència concurrent de numeració de parts o iteracions. @ca
toolkit definition: Manifestation der har en betegnelse i form af et dato eller andet tidsforløb der bruges for at betegne den første i en samtidig rækkefølge af nummerereing af dele eller iterationer. @da
toolkit definition: Manifestation qui possède une désignation sous forme de date ou d’un autre laps de temps servant à indiquer la première partie ou itération dans une séquence de numérotation concomitante de parties ou itérations. @fr
toolkit definition: Manifestācija, kurai ir apzīmējums datuma vai citāda laikposma veidā, ko izmanto, lai paralēlā daļu vai iterāciju numerācijas virknē norādītu pirmo. @lv
toolkit definition: Parçaların veya yinelemelerin eşzamanlı numaralandırma dizisindeki ilki belirtmek için kullanılan bir tarih veya başka bir zaman aralığı biçiminde bir belirtece sahip bir gösterim. @tr
toolkit definition: تجسيدة لها تسمية في شكل تاريخ أو فترة زمنية أخرى تُستخدم للإشارة إلى الأول في تسلسل متزامن لأرقام أو أجزاء أو تكرارات. @ar
toolkit definition: 有以日期或其他时间段形式标识用于标识部分或更新后整体的并存编号序列中第一个的一种载体表现 @zh-hans
toolkit label: Alternative chronologische Bezeichnung der ersten Ausgabe einer fortlaufenden Ressource von @de
toolkit label: alternatif sıralamanın ilk kronolojik tanımlaması @tr
toolkit label: eerste chronologische aanduiding van alternatieve volgorde van @nl
toolkit label: first chronological designation of alternative sequence of
toolkit label: første kronologiske betegnelse af alternativ rækkefølge af @da
toolkit label: kronológiai kezdőjelölése a következő alternatív sorrendiségének: @hu
toolkit label: pirmais alternatīvās virknes hronoloģiskais apzīmējums @lv
toolkit label: première désignation chronologique d’une autre séquence de @fr
toolkit label: primera designació cronològica d’una seqüència alternativa de @ca
toolkit label: vaihtoehtoisen numerointijakson ensimmäinen aikamäärite manifestaatiossa @fi
toolkit label: أول اسم زمني لتسلسل بديل @ar
toolkit label: ……的交替序列的第一个年代标识 @zh-hans
has subproperty: P80182
lexical alias: firstChronologicalDesignationOfAlternativeSequenceOf.en
status: Published
type: Property
domain: C10012
label: alternatif sırasının ilk kronolojik tanımlanmasıdır @tr
label: er første kronologiske betegnelse af alternativ rækkefølge af @da
label: est la première désignation chronologique d’une autre séquence de @fr
label: ir pirmais alternatīvās virknes hronoloģiskais apzīmējums @lv
label: is eerste chronologische aanduiding van alternatieve volgorde van @nl
label: ist alternative chronologische Bezeichnung einer ersten Ausgabe einer fortlaufenden Ressource von @de
label: kronológiai kezdőjelölése a következő alternatív sorrendiségének: @hu
label: vaihtoehtoisen numerointijakson ensimmäinen aikamäärite manifestaatiossa @fi
label: és primera designació cronològica d’una seqüència alternativa de @ca
label: هي أول تسمية هجائية رقمية لتسلسل بديل لـ @ar
label: 是……的交替序列的第一个年代标识 @zh-hans
sub property of: is first chronological designation of sequence of
definition: Bir ismi, parçaların veya yinelemelerin eşzamanlı numaralandırma dizisindeki ilki belirtmek için kullanılan bir tarih veya başka bir zaman aralığı biçiminde bir adlandırmaya sahip bir gösterim ilişkilendirir. @tr
definition: Hozzákapcsol egy noment egy megjelenési formához, amelynek megjelölése dátum vagy más időtartam formájában jelzi az elsőséget a részek vagy iterációk konkurens számozási sorrendjében. @hu
definition: Liittää nomenin manifestaation päivämäärästä tai muusta ajanjaksosta muodostuvaan määritteeseen, joka on manifestaation osien tai iteraatioiden rinnakkaisen numerointijakson ensimmäinen määrite. @fi
definition: Met un nomen en relation avec une manifestation qui possède une désignation sous forme de date ou d’un autre laps de temps servant à indiquer la première partie ou itération dans une séquence de numérotation concomitante de parties ou itérations. @fr
definition: Relaciona un nomen amb una manifestació que té una designació en la forma d’una data o un altre interval de temps que s’usa per indicar la primera en una seqüència concurrent de numeració de parts o iteracions. @ca
definition: Relateert een nomen aan een manifestatie die een aanduiding heeft in de vorm van een datum of andere tijdspanne, die gebruikt is om aan te geven wat de eerste is in een gelijktijdige volgorde van nummering van delen of iteraties. @nl
definition: Relaterer et nomen til en manifestation der har en betegnelse i form af et dato eller andet tidsforløb der bruges for at betegne den første i en samtidig rækkefølge af nummerereing af dele eller iterationer. @da
definition: Relates a nomen to a manifestation that has a designation in the form of a date or other timespan that is used to indicate the first in a concurrent sequence of numbering of parts or iterations.
definition: Sasaista nomenu ar manifestāciju, kurai ir apzīmējums datuma vai citāda laikposma veidā, ko izmanto, lai paralēlā daļu vai iterāciju numerācijas virknē norādītu pirmo. @lv
definition: Setzt ein Nomen in Beziehung zu einer Manifestation, die über eine Bezeichnung in Form eines Datums oder eines anderen Zeitraums verfügt, die verwendet wird, um in einer alternativen Zählfolge der Ausgaben auf die erste hinzuweisen. @de
definition: يربط تسمية بتجسيدة لها اسم في شكل تاريخ أو فترة زمنية أخرى تُستخدم للإشارة إلى الأول في تسلسل متزامن لأرقام أو أجزاء أو تكرارات. @ar
definition: 将一个命名与有以日期或其他时间段形式标识用于标识部分或更新后整体的并存编号序列中第一个的一种载体表现关联起来。 @zh-hans

is first chronological designation of sequence of
has element type: 2
toolkit definition: A manifestation that has a designation in the form of a date or other timespan that is used to indicate the first in a sequence of numbering of parts or iterations.
toolkit definition: Een manifestatie die een aanduiding heeft in de vorm van een datum of andere tijdspanne, die gebruikt is om aan te geven wat de eerste is in een volgorde van nummering van delen of iteraties. @nl
toolkit definition: Egy megjelenési forma, amelynek megjelölése dátum vagy más időtartam formájában jelzi az elsőt a részek vagy iterációk számozási sorrendjében. @hu
toolkit definition: Eine Manifestation, die über eine Bezeichnung in Form eines Datums oder eines anderen Zeitraums verfügt, die verwendet wird, um in einer Zählfolge der Ausgaben auf die erste hinzuweisen. @de
toolkit definition: Manifestaation päivämäärästä tai muusta ajanjaksosta muodostuva määrite, joka ilmaisee manifestaation osien tai iteraatioiden numerointijakson ensimmäisen määritteen. @fi
toolkit definition: Manifestació que té una designació en la forma d’una data o un altre interval de temps que s’usa per indicar la primera en una seqüència de numeració de parts o iteracions. @ca
toolkit definition: Manifestation der har en betegnelse i form af et dato eller andet tidsforløb der bruges for at betegne den første i en rækkefølge af nummerereing af dele eller iterationer. @da
toolkit definition: Manifestation qui possède une désignation sous forme de date ou d’un autre laps de temps servant à indiquer la première partie ou itération dans une séquence de numérotation de parties ou itérations. @fr
toolkit definition: Manifestācija, kurai ir apzīmējums datuma vai citāda laikposma veidā, ko izmanto, lai daļu vai iterāciju numerācijas virknē norādītu pirmo. @lv
toolkit definition: Parçaların veya yinelemelerin numaralandırılma dizisindeki ilki belirtmek için kullanılan bir tarih veya başka bir zaman aralığı biçiminde bir berlitece sahip bir gösterim. @tr
toolkit definition: تجسيدة لها تسمية في شكل تاريخ أو فترة زمنية أخرى تُستخدم للإشارة إلى الأول في تسلسل أرقام أو في أجزاء أو في تكرارات. @ar
toolkit definition: 有以日期或其他时间段形式标识用于标识部分或更新后整体的编号序列中第一个的一种载体表现 @zh-hans
toolkit label: Chronologische Bezeichnung der ersten Ausgabe einer fortlaufenden Ressource von @de
toolkit label: eerste chronologische aanduiding van volgorde van @nl
toolkit label: first chronological designation of sequence of
toolkit label: første kronologiske betegnelse af rækkefølge af @da
toolkit label: kronológiai kezdőjelölése a következő sorrendiségének: @hu
toolkit label: numerointijakson ensimmäinen aikamäärite manifestaatiossa @fi
toolkit label: pirmais virknes hronoloģiskais apzīmējums @lv
toolkit label: première désignation chronologique d’une séquence de @fr
toolkit label: primera designació cronològica d’una seqüència de @ca
toolkit label: sıralamanın ilk kronolojik tanımlaması @tr
toolkit label: هو أول اسم زمني في تسلسل لـ @ar
toolkit label: ……的序列的第一个年代标识 @zh-hans
has subproperty: is first chronological designation of alternative sequence of
has subproperty: P80183
lexical alias: firstChronologicalDesignationOfSequenceOf.en
status: Published
type: Property
domain: C10012
label: er første kronologiske betegnelse af rækkefølge af @da
label: est la première désignation chronologique d’une séquence de @fr
label: ir pirmais virknes hronoloģiskais apzīmējums @lv
label: is eerste chronologische aanduiding van volgorde van @nl
label: ist chronologische Bezeichnung der ersten Ausgabe einer fortlaufenden Ressource von @de
label: kronológiai kezdőjelölése a következő sorrendiségének: @hu
label: numerointijakson ensimmäinen aikamäärite manifestaatiossa @fi
label: sırasının ilk kronolojik tanımlanmasıdır @tr
label: és primera designació cronològica d’una seqüència de @ca
label: هو أول اسم زمني في تسلسل لـ @ar
label: 是……的序列的第一个年代标识 @zh-hans
sub property of: has related manifestation of nomen
definition: Bir ismi, parçaların veya yinelemelerin numaralandırma dizisindeki ilki belirtmek için kullanılan bir tarih veya başka bir zaman aralığı biçiminde bir adlandırmaya sahip bir gösterimle ilişkilendirir. @tr
definition: Hozzákapcsol egy noment egy megjelenési formához, amelynek megjelölése dátum vagy más időtartam formájában jelzi az elsőt a részek vagy iterációk számozási sorrendjében. @hu
definition: Liittää manifestaation päivämäärästä tai muusta ajanjaksosta muodostuvaan määritteeseen, joka ilmaisee manifestaation osien tai iteraatioiden numerointijakson ensimmäisen määritteen. @fi
definition: Met un nomen en relation avec une manifestation qui possède une désignation sous forme de date ou d’un autre laps de temps servant à indiquer la première partie ou itération dans une séquence de numérotation de parties ou itérations. @fr
definition: Relaciona un nomen amb una manifestació que té una designació en la forma d’una data o un altre interval de temps que s’usa per indicar la primera en una seqüència de numeració de parts o iteracions. @ca
definition: Relateert een nomen aan een manifestatie die een aanduiding heeft in de vorm van een datum of andere tijdspanne, die gebruikt is om aan te geven wat de eerste is in een volgorde van nummering van delen of iteraties. @nl
definition: Relaterer et nomen til en manifestation der har en betegnelse i form af et dato eller andet tidsforløb der bruges for at betegne den første i en rækkefølge af nummerereing af dele eller iterationer. @da
definition: Relates a nomen to a manifestation that has a designation in the form of a date or other timespan that is used to indicate the first in a sequence of numbering of parts or iterations.
definition: Sasaista nomenu ar manifestāciju, kurai ir apzīmējums datuma vai citāda laikposma veidā, ko izmanto, lai daļu vai iterāciju numerācijas virknē norādītu pirmo. @lv
definition: Setzt ein Nomen in Beziehung zu einer Manifestation, die über eine Bezeichnung in Form eines Datums oder eines anderen Zeitraums verfügt, die verwendet wird, um in einer Zählfolge der Ausgaben auf die erste hinzuweisen. @de
definition: يربط تسمية بتجسيدة لها تسمية في شكل تاريخ أو فترة زمنية أخرى تُستخدم للإشارة إلى الأول في تسلسل أرقام أو في أجزاء أو في تكرارات. @ar
definition: 将一个命名与有以日期或其他时间段形式标识用于标识部分或更新后整体的编号序列中第一个的一种载体表现关联起来。 @zh-hans

is last alphanumeric designation of alternative sequence of
has element type: 2
toolkit definition: A manifestation that has a designation in the form of numbers or alphabetic characters that is used to indicate the last in a concurrent sequence of numbering of parts or iterations.
toolkit definition: Een manifestatie die een aanduiding heeft in de vorm van nummers of alfabetische karakters, die gebruikt is om aan te geven wat de laatste is in een volgorde van nummering van delen of iteraties. @nl
toolkit definition: Egy megjelenési forma, amelynek megjelölése számok vagy alfabetikus karakterek formájában jelzi az utolsót a részek vagy iterációk konkurens számozási sorrendjében. @hu
toolkit definition: Eine Manifestation, die über eine Bezeichnung in Form von Nummern oder Buchstaben verfügt, die verwendet wird, um in einer alternativen Zählfolge der Ausgaben oder Iterationen auf die letzte hinzuweisen. @de
toolkit definition: Manifestaation numeroista ja/tai kirjaimista muodostuva määrite, joka on manifestaation osien tai iteraatioiden rinnakkaisen numerointijakson viimeinen määrite. @fi
toolkit definition: Manifestació que té una designació en la forma de números o caràcters alfabètics que s’usen per indicar la darrera en una seqüència concurrent de numeració de parts o iteracions. @ca
toolkit definition: Manifestation der har en betegnelse i form af cifre eller alfabetiske karakterer der bruges for at betegne den sidste i en samtidig rækkefølge af nummerering af dele eller iterationer. @da
toolkit definition: Manifestation qui possède une désignation sous forme de nombres ou de caractères alphabétiques servant à indiquer la dernière partie ou itération dans une séquence concomitante de numérotation de parties ou itérations. @fr
toolkit definition: Manifestācija, kurai ir apzīmējums skaitļu vai alfabēta rakstzīmju veidā, ko izmanto, lai paralēlā daļu vai iterāciju numerācijas virknē norādītu pēdējo. @lv
toolkit definition: Parçaların veya yinelemelerin eşzamanlı numaralandırma dizisindeki sonuncuyu belirtmek için kullanılan, sayılar veya alfabetik karakterler biçiminde bir belirtece sahip bir gösterim. @tr
toolkit definition: تجسيدة لها تسمية في شكل أرقام أو حروف هجائية تُستخدم للإشارة إلى أول عدد في تسلسل متزامن لترقيم أجزاء أو تكرارات. @ar
toolkit definition: 有以数字或字母字符形式标识用于标识部分或更新后整体的并存编号序列中最后一个的一种载体表现 @zh-hans
toolkit label: Alternatif dizisinin son alfanümerik adlandırması @tr
toolkit label: Alternative alphanumerische Bezeichnung der letzten Ausgabe oder des letzten Teils einer Folge von @de
toolkit label: alfanumerikus zárójelölése a következő alternatív sorrendiségének: @hu
toolkit label: darrera designació alfanumèrica d’una seqüència alternativa de @ca
toolkit label: dernière désignation alphanumérique d’une autre séquence de @fr
toolkit label: laatste alfanumerieke aanduiding van alternatieve volgorde van @nl
toolkit label: last alphanumeric designation of alternative sequence of
toolkit label: pēdējais alternatīvās virknes burtciparu apzīmējums @lv
toolkit label: sidste alfanumeriske betegnelse af alternativ rækkefølge af @da
toolkit label: vaihtoehtoisen numerointijakson viimeinen numero- ja/tai kirjainmäärite manifestaatiossa @fi
toolkit label: اسم هجائي رقمي في تسلسل بديل لـ @ar
toolkit label: ……的交替序列的最后一个字母数字标识 @zh-hans
has subproperty: P80184
lexical alias: lastAlphanumericDesignationOfAlternativeSequenceOf.en
status: Published
type: Property
domain: C10012
label: alfanumerikus zárójelölése a következő alternatív sorrendiségének: @hu
label: alternatif sırasının son alfanümerik tanımlanmasıdır @tr
label: er sidste alfanumeriske betegnelse af alternativ rækkefølge af @da
label: est la dernière désignation alphanumérique d’une autre séquence de @fr
label: ir pēdējais alternatīvās virknes burtciparu apzīmējums @lv
label: is laatste alfanumerieke aanduiding van alternatieve volgorde van @nl
label: ist alternative alphanumerische Bezeichnung der letzten Ausgabe oder des letzten Teils einer Folge von @de
label: vaihtoehtoisen numerointijakson viimeinen numero- ja/tai kirjainmäärite manifestaatiossa @fi
label: és darrera designació alfanumèrica d’una seqüència alternativa de @ca
label: هي آخر تسمية هجائية رقمية في تسلسل بديل لـ @ar
label: 是……的交替序列的最后一个字母数字标识 @zh-hans
sub property of: is last alphanumeric designation of sequence of
definition: Bir ismi, parçaların veya yinelemelerin eşzamanlı numaralandırma dizisindeki sonuncuyu belirtmek için kullanılan, sayılar veya alfabetik karakterler biçiminde bir adlandırmaya sahip bir gösterimle ilişkilendirir. @tr
definition: Hozzákapcsol egy noment egy megjelenési formához, amelynek megjelölése számok vagy alfabetikus karakterek formájában jelzi az utolsót a részek vagy iterációk konkurens számozási sorrendjében. @hu
definition: Liittää nomenin manifestaation numeroista ja/tai kirjaimista muodostuvaan määritteeseen, joka on manifestaation osien tai iteraatioiden rinnakkaisen numerointijakson viimeinen määrite. @fi
definition: Met un nomen en relation avec une manifestation qui possède une désignation sous forme de nombres ou de caractères alphabétiques servant à indiquer la dernière partie ou itération dans une séquence concomitante de numérotation de parties ou itérations. @fr
definition: Relaciona un nomen amb una manifestació que té una designació en la forma de números o caràcters alfabètics que s’usen per indicar la darrera en una seqüència concurrent de numeració de parts o iteracions. @ca
definition: Relateert een nomen aan een manifestatie die een aanduiding heeft in de vorm van nummers of alfabetische karakters, die gebruikt is om aan te geven wat de laatste is in een gelijktijdige volgorde van nummering van delen of iteraties. @nl
definition: Relaterer et nomen til en manifestation der har en betegnelse i form af cifre eller alfabetiske karakterer der bruges for at betegne den sidste i en samtidig rækkefølge af nummerering af dele eller iterationer. @da
definition: Relates a nomen to a manifestation that has a designation in the form of numbers or alphabetic characters that is used to indicate the last in a concurrent sequence of numbering of parts or iterations.
definition: Sasaista nomenu ar manifestāciju, kurai ir apzīmējums skaitļu vai alfabēta rakstzīmju veidā, ko izmanto, lai paralēlā daļu vai iterāciju numerācijas virknē norādītu pēdējo. @lv
definition: Setzt ein Nomen in Beziehung zu einer Manifestation, die über eine Bezeichnung in Form von Nummern oder Buchstaben verfügt, die verwendet wird, um in einer alternativen Zählfolge der Ausgaben oder Iterationen auf die letzte hinzuweisen. @de
definition: يربط تسمية بتجسيدة لها تسمية في شكل تاريخ أو فترة زمنية أخرى تُستخدم للإشارة إلى الآخر في تسلسل متزامن لأرقام أو أجزاء أو تكرارات. @ar
definition: 将一个命名与有以数字或字母字符形式标识用于标识部分或更新后整体的并存编号序列中最后一个的一种载体表现关联起来。 @zh-hans

is last alphanumeric designation of sequence of
has element type: 2
toolkit definition: A manifestation that has a designation in the form of numbers or alphabetic characters that is used to indicate the last in a sequence of numbering of parts or iterations.
toolkit definition: Een manifestatie die een aanduiding heeft in de vorm van nummers of alfabetische karakters, die gebruikt is om aan te geven wat de laatste is in een volgorde van nummering van delen of iteraties. @nl
toolkit definition: Egy megjelenési forma, amelynek megjelölése számok vagy alfabetikus karakterek formájában jelzi az utolsót a részek vagy iterációk számozási sorrendjében. @hu
toolkit definition: Eine Manifestation, die über eine Bezeichnung in Form von Nummern oder Buchstaben verfügt, die verwendet wird, um in einer Zählfolge der Ausgaben auf die letzte hinzuweisen. @de
toolkit definition: Manifestaation numeroista ja/tai kirjaimista muodostuva määrite, joka ilmaisee manifestaation osien tai iteraatioiden numerointijakson viimeisen määritteen. @fi
toolkit definition: Manifestació que té una designació en la forma de números o caràcters alfabètics que s’usen per indicar la darrera en una seqüència de numeració de parts o iteracions. @ca
toolkit definition: Manifestation der har en betegnelse i form af cifre eller alfabetiske karakterer der bruges for at betegne den sidste i en rækkefølge af nummerering af dele eller iterationer. @da
toolkit definition: Manifestation qui possède une désignation sous forme de nombres ou de caractères alphabétiques servant à indiquer la dernière partie ou itération dans une séquence de numérotation de parties ou itérations. @fr
toolkit definition: Manifestācija, kurai ir apzīmējums skaitļu vai alfabēta rakstzīmju veidā, ko izmanto, lai norādītu daļu vai iterāciju numerācijas secībā pēdējo. @lv
toolkit definition: Parçaların veya yinelemelerin numaralandırma dizisindeki sonuncuyu belirtmek için kullanılan, sayılar veya alfabetik karakterler biçiminde bir belirtece olan bir gösterim. @tr
toolkit definition: تجسيدة لها تسمية في شكل تاريخ أو فترة زمنية أخرى تُستخدم للإشارة إلى الآخر في تسلسل متزامن لأرقام أو أجزاء أو تكرارات. @ar
toolkit definition: 有以数字或字母字符形式标识用于标识部分或更新后整体的编号序列中最后一个的一种载体表现 @zh-hans
toolkit label: Alphanumerische Bezeichnung der letzten Ausgabe einer fortlaufenden Ressource von @de
toolkit label: Dizisinin son alfanümerik adlandırması @tr
toolkit label: alfanumerikus zárójelölése a következő sorrendiségének: @hu
toolkit label: darrera designació alfanumèrica d’una seqüència de @ca
toolkit label: dernière désignation alphanumérique d’une séquence de @fr
toolkit label: laatste alfanumerieke aanduiding van volgorde van @nl
toolkit label: last alphanumeric designation of sequence of
toolkit label: numerointijakson viimeinen numero- ja/tai kirjainmäärite manifestaatiossa @fi
toolkit label: pēdējais virknes burtciparu apzīmējums @lv
toolkit label: sidste alfanumeriske betegnelse af rækkefølge af @da
toolkit label: آخر تسمية رقمية في تسلسل @ar
toolkit label: ……的序列的最后一个字母数字标识 @zh-hans
has subproperty: is last alphanumeric designation of alternative sequence of
has subproperty: P80185
lexical alias: lastAlphanumericDesignationOfSequenceOf.en
status: Published
type: Property
domain: C10012
label: er sidste alfanumeriske betegnelse af rækkefølge af @da
label: est la dernière désignation alphanumérique d’une séquence de @fr
label: ir pēdējais virknes burtciparu apzīmējums @lv
label: is laatste alfanumerieke aanduiding van volgorde van @nl
label: ist alphanumerische Bezeichnung der letzten Ausgabe einer fortlaufenden Ressource von @de
label: numerointijakson viimeinen numero- ja/tai kirjainmäärite manifestaatiossa @fi
label: sırasının son alfanümerik tanımlanmasıdır @tr
label: záró alfanumerikus megjelölése a következő sorrendiségének: @hu
label: és darrera designació alfanumèrica d’una seqüència de @ca
label: هو آخر تسمية هجائية رقمية في تسلسل لـ @ar
label: 是……的序列的最后一个字母数字标识 @zh-hans
sub property of: has related manifestation of nomen
definition: Bir ismi, parçaların veya yinelemelerin numaralandırma dizisindeki sonuncuyu belirtmek için kullanılan, sayılar veya alfabetik karakterler biçiminde bir adlandırmaya sahip bir gösterimle ilişkilendirir. @tr
definition: Hozzákapcsol egy noment egy megjelenési formához, amelynek megjelölése számok vagy alfabetikus karakterek formájában jelzi az utolsót a részek vagy iterációk számozási sorrendjében. @hu
definition: Liittää nomenin manifestaation numeroista ja/tai kirjaimista muodostuvaan määritteeseen, joka ilmaisee manifestaation osien tai iteraatioiden numerointijakson viimeisen määritteen. @fi
definition: Met un nomen en relation avec une manifestation qui possède une désignation sous forme de nombres ou de caractères alphabétiques servant à indiquer la dernière partie ou itération dans une séquence de numérotation de parties ou itérations. @fr
definition: Relaciona un nomen amb una manifestació que té una designació en la forma de números o caràcters alfabètics que s’usen per indicar la darrera en una seqüència de numeració de parts o iteracions. @ca
definition: Relateert een nomen aan een manifestatie die een aanduiding heeft in de vorm van nummers of alfabetische karakters, die gebruikt is om aan te geven wat de laatste is in een volgorde van nummering van delen of iteraties. @nl
definition: Relaterer et nomen til en manifestation der har en betegnelse i form af cifre eller alfabetiske karakterer der bruges for at betegne den sidste i en rækkefølge af nummerering af dele eller iterationer. @da
definition: Relates a nomen to a manifestation that has a designation in the form of numbers or alphabetic characters that is used to indicate the last in a sequence of numbering of parts or iterations.
definition: Sasaista nomenu ar manifestāciju, kurai ir apzīmējums skaitļu vai alfabēta rakstzīmju veidā, ko izmanto, lai norādītu daļu vai iterāciju numerācijas secībā pēdējo. @lv
definition: Setzt ein Nomen in Beziehung zu einer Manifestation, die über eine Bezeichnung in Form von Nummern oder Buchstaben verfügt, die verwendet wird, um in einer Zählfolge der Ausgaben auf die letzte hinzuweisen. @de
definition: يربط تسمية بتجسيدة لها تسمية في شكل تاريخ أو فترة زمنية أخرى تُستخدم للإشارة إلى الآخر في تسلسل متزامن لأرقام أو أجزاء أو تكرارات. @ar
definition: 将一个命名与有以数字或字母字符形式标识用于标识部分或更新后整体的编号序列中最后一个的一种载体表现关联起来。 @zh-hans

is last chronological designation of alternative sequence of
has element type: 2
toolkit definition: A manifestation that has a designation in the form of a date or other timespan that is used to indicate the last in a concurrent sequence of numbering of parts or iterations.
toolkit definition: Een manifestatie die een aanduiding heeft in de vorm van een datum of andere tijdspanne, die gebruikt is om aan te geven wat de laatste is in een gelijktijdige volgorde van nummering van delen of iteraties. @nl
toolkit definition: Egy megjelenési forma, amelynek megjelölése dátum vagy más időtartam formájában jelzi az utolsót a részek vagy iterációk konkurens számozási sorrendjében. @hu
toolkit definition: Eine Manifestation, die über eine Bezeichnung in Form eines Datums oder eines anderen Zeitraums verfügt, die verwendet wird, um in einer alternativen Zählfolge der Ausgaben oder Iterationen auf die letzte hinzuweisen. @de
toolkit definition: Manifestaation päivämäärästä tai muusta ajanjaksosta muodostuva määrite, joka on manifestaation osien tai iteraatioiden rinnakkaisen numerointijakson viimeinen määrite. @fi
toolkit definition: Manifestació que té una designació en la forma d’una data o un altre interval de temps que s’usa per indicar la darrera en una seqüència concurrent de numeració de parts o iteracions. @ca
toolkit definition: Manifestation der har en betegnelse i form af et dato eller andet tidsforløb der bruges for at betegne den sidste i en samtidig rækkefølge af nummerering af dele eller iterationer. @da
toolkit definition: Manifestation qui possède une désignation sous forme de date ou d’un autre laps de temps servant à indiquer la dernière partie ou itération dans une séquence de numérotation concomitante de parties ou itérations. @fr
toolkit definition: Manifestācija, kurai ir apzīmējums datuma vai citāda laikposma veidā, ko izmanto, lai paralēlā daļu vai iterāciju numerācijas virknē norādītu pēdējo. @lv
toolkit definition: Parçaların veya yinelemelerin eşzamanlı numaralandırma dizisindeki sonuncuyu belirtmek için kullanılan bir tarih veya başka bir zaman aralığı biçiminde bir belirtece sahip bir gösterim. @tr
toolkit definition: تجسيدة لها تسمية في شكل تاريخ أو فترة زمنية أخرى تُستخدم للإشارة إلى الآخر في تسلسل متزامن لأرقام أو أجزاء أو تكرارات. @ar
toolkit definition: 有以日期或其他时间段形式标识用于标识部分或更新后整体的并存编号序列中最后一个的一种载体表现 @zh-hans
toolkit label: Alternatif dizisinin son kronolojik tanımlanması @tr
toolkit label: Alternative chronologische Bezeichnung einer letzten Ausgabe oder eines letzten Teils einer Folge von @de
toolkit label: darrera designació cronològica d’una seqüència alternativa de @ca
toolkit label: dernière désignation chronologique d’une autre séquence de @fr
toolkit label: kronológiai zárójelölése a következő alternatív sorrendiségének: @hu
toolkit label: laatste chronologische aanduiding van alternatieve volgorde van @nl
toolkit label: last chronological designation of alternative sequence of
toolkit label: pēdējais alternatīvās virknes hronoloģiskais apzīmējums @lv
toolkit label: sidste kronoligiske betegnelse af alternativ rækkefølge af @da
toolkit label: vaihtoehtoisen numerointijakson viimeinen aikamäärite manifestaatiossa @fi
toolkit label: آخر تسمية زمنية في تسلسل بديل لـ @ar
toolkit label: ……的交替序列的最后一个年代标识 @zh-hans
has subproperty: P80186
lexical alias: lastChronologicalDesignationOfAlternativeSequenceOf.en
status: Published
type: Property
domain: C10012
label: alternatif sırasının son kronolojik tanımlanmasıdır @tr
label: er sidste kronologiske betegnelse af alternativ rækkefølge af @da
label: est la dernière désignation chronologique d’une autre séquence de @fr
label: ir pēdējais alternatīvās virknes hronoloģiskais apzīmējums @lv
label: is laatste chronologische aanduiding van alternatieve volgorde van @nl
label: ist alternative chronologische Bezeichnung einer letzten Ausgabe oder eines letzten Teils einer Folge von @de
label: kronológiai zárójelölése a következő alternatív sorrendiségének: @hu
label: vaihtoehtoisen numerointijakson viimeinen aikamäärite manifestaatiossa @fi
label: és darrera designació cronològica d’una seqüència alternativa de @ca
label: هي أول تسمية زمنية في تسلسل بديل لـ @ar
label: 是……的交替序列的最后一个年代标识 @zh-hans
sub property of: is last chronological designation of sequence of
definition: Bir ismi, parçaların veya yinelemelerin eşzamanlı numaralandırma dizisindeki sonuncuyu belirtmek için kullanılan bir tarih veya başka bir zaman aralığı biçiminde bir adlandırmaya sahip bir gösterimle ilişkilendirir. @tr
definition: Hozzákapcsol egy noment egy megjelenési formához, amelynek megjelölése dátum vagy más időtartam formájában jelzi az utolsót a részek vagy iterációk konkurens számozási sorrendjében. @hu
definition: Liittää nomenin manifestaation päivämäärästä tai muusta ajanjaksosta muodostuvaan määritteeseen, joka on manifestaation osien tai iteraatioiden rinnakkaisen numerointijakson viimeinen määrite. @fi
definition: Met un nomen en relation avec une manifestation qui possède une désignation sous forme de date ou d’un autre laps de temps servant à indiquer la dernière partie ou itération dans une séquence de numérotation concomitante de parties ou itérations. @fr
definition: Relaciona un nomen amb una manifestació que té una designació en la forma d’una data o un altre interval de temps que s’usa per indicar la darrera en una seqüència concurrent de numeració de parts o iteracions. @ca
definition: Relateert een nomen aan een manifestatie die een aanduiding heeft in de vorm van een datum of andere tijdspanne, die gebruikt is om aan te geven wat de laatste is in een gelijktijdige volgorde van nummering van delen of iteraties. @nl
definition: Relaterer et nomen til en manifestation der har en betegnelse i form af et dato eller andet tidsforløb der bruges for at betegne den sidste i en samtidig rækkefølge af nummerering af dele eller iterationer. @da
definition: Relates a nomen to a manifestation that has a designation in the form of a date or other timespan that is used to indicate the last in a concurrent sequence of numbering of parts or iterations.
definition: Sasaista nomenu ar manifestāciju, kurai ir apzīmējums datuma vai citāda laikposma veidā, ko izmanto, lai paralēlā daļu vai iterāciju numerācijas virknē norādītu pēdējo. @lv
definition: Setzt ein Nomen in Beziehung zu einer Manifestation, die über eine Bezeichnung in Form eines Datums oder eines anderen Zeitraums verfügt, die verwendet wird, um in einer alternativen Zählfolge der Ausgaben oder Iterationen auf die letzte hinzuweisen. @de
definition: يربط تسمية بتجسيدة لها تسمية في شكل تاريخ أو فترة زمنية أخرى تُستخدم للإشارة إلى الآخر في تسلسل تزامن لأرقام أو أجزاء أو تكرارات. @ar
definition: 将一个命名与有以日期或其他时间段形式标识用于标识部分或更新后整体的并存编号序列中最后一个的一种载体表现关联起来。 @zh-hans

is last chronological designation of sequence of
has element type: 2
toolkit definition: A manifestation that has a designation in the form of a date or other timespan that is used to indicate the last in a sequence of numbering of parts or iterations.
toolkit definition: Een manifestatie die een aanduiding heeft in de vorm van een datum of andere tijdspanne, die gebruikt is om aan te geven wat de laatste is in een volgorde van nummering van delen of iteraties. @nl
toolkit definition: Egy megjelenési forma, amlelynek megjelölése dátum vagy más időtartam formájában jelzi az utolsót a részek vagy iterációk számozási sorrendjében. @hu
toolkit definition: Eine Manifestation, die über eine Bezeichnung in Form eines Datums oder eines anderen Zeitraums verfügt, die verwendet wird, um in einer Zählfolge der Ausgaben auf die letzte hinzuweisen. @de
toolkit definition: Manifestaatio päivämäärästä tai muusta ajanjaksosta muodostuva määrite, joka ilmaisee manifestaation osien tai iteraatioiden numerointijakson viimeisen määritteen. @fi
toolkit definition: Manifestació que té una designació en la forma d’una data o un altre interval de temps que s’usa per indicar la darrera en una seqüència de numeració de parts o iteracions. @ca
toolkit definition: Manifestation der har en betegnelse i form af et dato eller andet tidsforløb der bruges for at betegne den sidste i en rækkefølge af nummerering af dele eller iterationer. @da
toolkit definition: Manifestation qui possède une désignation sous forme de date ou d’un autre laps de temps servant à indiquer la dernière partie ou itération dans une séquence de numérotation de parties ou itérations. @fr
toolkit definition: Manifestācija, kurai ir apzīmējums datuma vai citāda laikposma veidā, ko izmanto, lai daļu vai iterāciju numerācijas virknē norādītu pēdējo. @lv
toolkit definition: Parçaların veya yinelemelerin numaralandırma dizisindeki sonuncuyu belirtmek için kullanılan bir tarih veya başka bir zaman aralığı biçiminde bir belirtece sahip bir gösterim. @tr
toolkit definition: تجسيدة لها تسمية في شكل تاريخ أو فترة زمنية أخرى تُستخدم للإشارة إلى الآخر في تسلسل أرقام أو أجزاء أو تكرارات. @ar
toolkit definition: 有以日期或其他时间段形式标识用于标识部分或更新后整体的编号序列中最后一个的一种载体表现 @zh-hans
toolkit label: Chronologische Bezeichnung der letzten Ausgabe einer fortlaufenden Ressource von @de
toolkit label: Dizisinin son kronolojik tanımlandırılması @tr
toolkit label: darrera designació cronològica d’una seqüència de @ca
toolkit label: dernière désignation chronologique d’une séquence de @fr
toolkit label: kronológiai zárójelölése a következő sorrendiségének: @hu
toolkit label: laatste chronologische aanduiding van volgorde van @nl
toolkit label: last chronological designation of sequence of
toolkit label: numerointijakson viimeinen aikamäärite manifestaatiossa @fi
toolkit label: pēdējais virknes hronoloģiskais apzīmējums @lv
toolkit label: sidste kronologiske betegnelse af rækkefølge af @da
toolkit label: آخر تسمية زمنية في تسلسل لـ @ar
toolkit label: ……的序列的最后一个年代标识 @zh-hans
has subproperty: is last chronological designation of alternative sequence of
has subproperty: P80187
lexical alias: lastChronologicalDesignationOfSequenceOf.en
status: Published
type: Property
domain: C10012
label: er sidste kronologiske betegnelse af rækkefølge af @da
label: est la dernière désignation chronologique d’une séquence de @fr
label: ir pēdējais virknes hronoloģiskais apzīmējums @lv
label: is laatste chronologische aanduiding van volgorde van @nl
label: ist chronologische Bezeichnung der letzten Ausgabe einer fortlaufenden Ressource von @de
label: kronológiai zárójelölése a következő sorrendiségének: @hu
label: numerointijakson viimeinen aikamäärite manifestaatiossa @fi
label: sırasının son kronolojik tanımlanmasıdır @tr
label: és darrera designació cronològica d’una seqüència de @ca
label: هي آخر تسمية زمنية في تسلسل لـ @ar
label: 是……的序列的最后一个年代标识 @zh-hans
sub property of: has related manifestation of nomen
definition: Bir ismi, parçaların veya yinelemelerin numaralandırma dizisindeki sonuncuyu belirtmek için kullanılan bir tarih veya başka bir zaman aralığı biçiminde bir adlandırmaya sahip bir gösterimle ilişkilendirir. @tr
definition: Hozzákapcsol egy noment egy megjelenési formához, amelynek megjelölése dátum vagy más időtartam formájában jelzi az utolsót a részek vagy iterációk számozási sorrendjében. @hu
definition: Liittää nomenin manifestaation päivämäärästä tai muusta ajanjaksosta muodostuvaan määritteeseen, joka ilmaisee manifestaation osien tai iteraatioiden numerointijakson viimeiseen määritteen. @fi
definition: Met un nomen en relation avec une manifestation qui possède une désignation sous forme de date ou d’un autre laps de temps servant à indiquer la dernière partie ou itération dans une séquence de numérotation de parties ou itérations. @fr
definition: Relaciona un nomen amb una manifestació que té una designació en la forma d’una data o un altre interval de temps que s’usa per indicar la darrera en una seqüència de numeració de parts o iteracions. @ca
definition: Relateert een nomen aan een manifestatie die een aanduiding heeft in de vorm van een datum of andere tijdspanne, die gebruikt is om aan te geven wat de laatste is in een volgorde van nummering van delen of iteraties. @nl
definition: Relaterer et nomen til en manifestation der har en betegnelse i form af et dato eller andet tidsforløb der bruges for at betegne den sidste i en rækkefølge af nummerering af dele eller iterationer. @da
definition: Relates a nomen to a manifestation that has a designation in the form of a date or other timespan that is used to indicate the last in a sequence of numbering of parts or iterations.
definition: Sasaista nomenu ar manifestāciju, kurai ir apzīmējums datuma vai citāda laikposma veidā, ko izmanto, lai daļu vai iterāciju numerācijas virknē norādītu pēdējo. @lv
definition: Setzt ein Nomen in Beziehung zu einer Manifestation, die über eine Bezeichnung in Form eines Datums oder eines anderen Zeitraums verfügt, die verwendet wird, um in einer Zählfolge der Ausgaben auf die letzte hinzuweisen. @de
definition: يربط تسمية بتجسيدة لها تسمية في شكل تاريخ أو فترة زمنية أخرى تُستخدم للإشارة إلى الآخر في تسلسل متزامن لأرقام أو أجزاء أو تكرارات. @ar
definition: 将一个命名与有以日期或其他时间段形式标识用于标识部分或更新后整体的编号序列中最后一个的一种载体表现关联起来。 @zh-hans

is nomen described with metadata by
has element type: 2
toolkit definition: A work that is a metadata work for a nomen.
toolkit definition: Bir isim için üstveri çalışması olan bir eser. @tr
toolkit definition: Obra que és una obra de metadades per a un nomen. @ca
toolkit definition: Teos, joka on nomenin metatietoteos. @fi
toolkit definition: Œuvre qui consiste en une œuvre de métadonnées pour un nomen. @fr
toolkit definition: 作为一个命名之元数据作品的一种作品 @zh-hans
toolkit label: Tarafından üstveriyle tanımlanan isim @tr
toolkit label: nomen described with metadata by
toolkit label: nomen descrit amb metadades per @ca
toolkit label: nomen décrit avec des métadonnées par @fr
toolkit label: nomenia metatiedoilla kuvaileva teos @fi
toolkit label: 被……用元数据描述的命名 @zh-hans
has subproperty: P80188
lexical alias: nomenDescribedWithMetadataBy.en
status: Published
type: Property
domain: C10012
label: est un nomen décrit avec des métadonnées par @fr
label: nomenia metatiedoilla kuvaileva teos @fi
label: tarafından üstveri ile tanımlanmış isimdir @tr
label: és nomen descrit amb metadades per @ca
label: 是被……用元数据描述的命名 @zh-hans
sub property of: is nomen described by
definition: Bir ismi, bir an için üst veri eseri olan bir eserle ilişkilendirir. @tr
definition: Liittää nomenin teokseen, joka on nomenin metatietoteos. @fi
definition: Met un nomen en relation avec une œuvre qui consiste en une œuvre de métadonnées pour un nomen. @fr
definition: Relaciona un nomen amb una obra que és una obra de metadades per a un nomen. @ca
definition: Relates a nomen to a work that is a metadata work for a nomen.
definition: 将一个命名与作为一个命名之元数据作品的一种作品关联起来。 @zh-hans