Place properties
type: Ontology
description: Properties that represent the attribute and relationship elements of the RDA Place entity.
preferred namespace prefix: rdap
rights: Copyright © 2020 American Library Association, Canadian Federation of Library Associations, and CILIP: Chartered Institute of Library and Information Professionals
licence: deed.en US
creator: RDA Steering Committee
contributor: RSC Technical Working Group
publisher: ALA Digital Reference
type: http://rdaregistry.info/termList/RDALinkedDataWork/1003
issued: 2016-07-11
title: RDA:n paikan ominaisuudet @fi
description: RDA-elementeistä johdetut ominaisuudet RDA:n paikan määrittelyjoukossa. @fi
version info: v5.4.2
modified: 2025-05-16

has access point for place
status: Published
type: Property
lexical alias: accessPointForPlace.en
definition: Relates a place to a nomen that is an appellation of place in natural language that is taken from a vocabulary encoding scheme or is constructed using a string encoding scheme.
domain: C10009
toolkit label: access point for place
toolkit definition: A nomen that is an appellation of place in natural language that is taken from a vocabulary encoding scheme or is constructed using a string encoding scheme.
sub property of: has appellation of place
has element type: 3
sub property of: P00016
label: paikan hakutieto @fi
definition: Liittää paikan nomeniin, joka on luonnollisen kielen mukainen paikan nimitys, joka on otettu sanaston merkintäjärjestelmästä tai muodostettu merkkijonon merkintäjärjestelmää käyttäen. @fi
toolkit label: paikan hakutieto @fi
toolkit definition: Nomen, joka on luonnollisen kielen mukainen paikan nimitys, joka on otettu sanaston merkintäjärjestelmästä tai muodostettu merkkijonon merkintäjärjestelmää käyttäen. @fi
label: har søkeinngang for sted @no
definition: Relaterer et sted til en betegnelse for sted på et naturlig språk som er hentet fra et kodeskjema for vokabular eller er laget ved hjelp av et kodeskjema for syntaks. @no
toolkit label: søkeinngang for sted @no
toolkit definition: En betegnelse for sted på et naturlig språk som er hentet fra et kodeskjema for vokabular eller er laget ved hjelp av et kodeskjema for syntaks. @no
label: a pour point d’accès d’un lieu @fr
definition: Met un lieu en relation avec un nomen qui est une appellation de lieu en langage naturel provenant d’un schéma d’encodage de vocabulaire ou construite à l’aide d’un schéma d’encodage de chaînes. @fr
toolkit label: point d’accès d’un lieu @fr
toolkit definition: Nomen qui est une appellation de lieu en langage naturel provenant d’un schéma d’encodage de vocabulaire ou construite à l’aide d’un schéma d’encodage de chaînes. @fr
label: heeft ingang voor plaats @nl
definition: Relateert een plaats aan een nomen dat is een benaming van plaats in natuurlijke taal dat ontleend is aan een vocabulair coderingsschema of gevormd is volgens een string coderingsschema. @nl
toolkit label: ingang voor plaats @nl
toolkit definition: Een nomen dat is een benaming van plaats in natuurlijke taal dat ontleend is aan een vocabulair coderingsschema of gevormd is volgens een string coderingsschema. @nl
label: له نقطة وصول لمكان @ar
definition: يربط بين مكان وتسمية عبارة عن اسم تعريفي لمكان باللغة الطبيعية مأخوذ من خطة ترميز مفردات أو بُني باستخدام خطة ترميز سلسلة تمثيلات. @ar
toolkit label: نقطة وصول لمكان @ar
toolkit definition: تسمية عبارة عن اسم تعريفي لمكان باللغة الطبيعية مأخوذ من خطة ترميز مفردات أو بُني باستخدام خطة ترميز سلسلة تمثيلات. @ar
label: té com a punt d’accés de lloc @ca
definition: Relaciona un lloc amb un nomen que és una apel·lació de lloc en llenguatge natural que s’obté d’un esquema de codificació de vocabulari o s’elabora usant un esquema de codificació de cadenes. @ca
toolkit label: punt d’accés de lloc @ca
toolkit definition: Nomen que és una apel·lació de lloc en llenguatge natural que s’obté d’un esquema de codificació de vocabulari o s’elabora usant un esquema de codificació de cadenes. @ca
label: har søgeindgang for sted @da
definition: Relaterer et sted til en benævnelse på sted på normalsprog, som er taget fra et vokabularkodningsskema eller er konstrueret ved hjælp af et strengkodningsskema. @da
toolkit label: søgeindgang for sted @da
toolkit definition: Benævnelse på sted på normalsprog, som er taget fra et vokabularkodningsskema eller er konstrueret ved hjælp af et strengkodningsskema. @da
label: koha otsielement @et
definition: Seostab koha koha nimetusega loomulikus keeles, mis on võetud leksikaalsest märkimissüsteemist või moodustatud stringilise märkimissüsteemi alusel. @et
toolkit label: koha otsielement @et
toolkit definition: Koha nimetus loomulikus keeles, mis on võetud leksikaalsest märkimissüsteemist või moodustatud stringilise märkimissüsteemi alusel. @et
label: hat Sucheinstieg für ein Geografikum @de
definition: Setzt ein Geografikum in Beziehung zu einer Bezeichnung für ein Geografikum in natürlicher Sprache, die einem Vocabulary Encoding Scheme entnommen oder mit einem String Encoding Scheme konstruiert wird. @de
toolkit label: Sucheinstieg für ein Geografikum @de
toolkit definition: Eine Bezeichnung für ein Geografikum in natürlicher Sprache, die einem Vocabulary Encoding Scheme entnommen oder mit einem String Encoding Scheme konstruiert wird. @de
label: hozzáférési pontja helyhez a következő: @hu
definition: Hozzákapcsol egy helyet egy nomenhez, amely egy hely szótárkódolási sémából vett vagy karakterlánc-kódolási séma felhasználásával konstruált természetes nyelvi megnevezése. @hu
toolkit label: hozzáférési pontja helyhez a következő: @hu
toolkit definition: Egy nomen, amely egy hely szótárkódolási sémából vett vagy karakterlánc-kódolási séma felhasználásával konstruált természetes nyelvi megnevezése. @hu
label: ha come punto di accesso per luogo @it
definition: Correla un luogo a una designazione di luogo nel linguaggio naturale che è tratta da uno schema di codifica di vocabolario o è costruita usando uno schema di codifica di stringa. @it
toolkit label: punto di accesso per luogo @it
toolkit definition: Designazione di luogo nel linguaggio naturale che è tratta da uno schema di codifica di vocabolario o è costruita usando uno schema di codifica di stringa. @it
label: vietas pamatforma @lv
definition: Sasaista vietu ar nomenu, kas ir vietas vārds/nosaukums dabiskā valodā, kas ņemts no shēmas kontrolētu vārdnīcu kodēšanai vai tiek konstruēts, izmantojot virknes kodēšanas shēmu. @lv
toolkit label: vietas pamatforma @lv
toolkit definition: Vietas vārds/nosaukums dabiskā valodā, kas ņemts no shēmas kontrolētu vārdnīcu kodēšanai vai tiek konstruēts, izmantojot virknes kodēšanas shēmu. @lv
has subproperty: has authorized access point for place
has subproperty: has variant access point for place
has subproperty: P70018
label: 有地点的检索点 @zh-hans
definition: 将一个地点与作为一个地点的称谓、取自一个词表编码体系或者用一个串编码体系构建、用自然语言的一个命名关联起来。 @zh-hans
toolkit label: 地点的检索点 @zh-hans
toolkit definition: 作为一个地点的称谓、取自一个词表编码体系或者用一个串编码体系构建、用自然语言的一个命名 @zh-hans
label: yer için erişim noktası ile ilişkilidir @tr
definition: Bir yeri, bir kelime kodlama şemasından alınan veya bir dizi kodlama şeması kullanılarak oluşturulmuş, doğal dilde bir yer unvanı olan bir isim ile ilişkilendirir. @tr
toolkit label: Yer için erişim noktası @tr
toolkit definition: Bir kelime kodlama şemasından alınan veya bir dizi kodlama şeması kullanılarak oluşturulan, doğal dilde bir yer unvanı olan bir isim. @tr

has appellation of place
status: Published
type: Property
lexical alias: appellationOfPlace.en
definition: Relates a place to a nomen that is used within a given scheme or context to refer to a place.
domain: C10009
toolkit label: appellation of place
toolkit definition: A nomen that is used within a given scheme or context to refer to a place.
sub property of: has related nomen of place
has element type: 3
sub property of: P00017
label: paikan nimitys @fi
definition: Liittää paikan nomeniin, jota käytetään viitattaessa paikkaan tietyssä järjestelmässä tai kontekstissä. @fi
toolkit label: paikan nimitys @fi
toolkit definition: Nomen, jota käytetään viitattaessa paikkaan tietyssä järjestelmässä tai kontekstissä. @fi
label: har betegnelse for sted @no
definition: Relaterer et sted til et nomen som er brukt i et bestemt skjema eller kontekst for å referere til et sted. @no
toolkit label: betegnelse for sted @no
toolkit definition: Et nomen som er brukt i et bestemt skjema eller kontekst for å referere til et sted. @no
label: a pour appellation de lieu @fr
definition: Met un lieu en relation avec un nomen qui est utilisé à l’intérieur d’un schéma ou d’un contexte donnés pour désigner un lieu. @fr
toolkit label: appellation de lieu @fr
toolkit definition: Nomen qui est utilisé à l’intérieur d’un schéma ou d’un contexte donnés pour désigner un lieu. @fr
label: heeft benaming van plaats @nl
definition: Relateert een plaats aan een nomen dat is gebruikt binnen een bepaald schema of context om te verwijzen naar een plaats. @nl
toolkit label: benaming van plaats @nl
toolkit definition: Een nomen dat is gebruikt binnen een bepaald schema of context om te verwijzen naar een plaats. @nl
label: له اسم تعريفي لمكان @ar
definition: يربط بين مكان وتسمية مستخدم ضمن خطة بعينها أو سياق بعينه يشير إلى مكان. @ar
toolkit label: اسم تعريفي لمكان @ar
toolkit definition: تسمية مستخدمة ضمن خطة بعينها أو سياق بعينه يشير إلى مكان. @ar
label: té com a apel·lació de lloc @ca
definition: Relaciona un lloc amb un nomen usat en un esquema o context determinat per referir-se a un lloc. @ca
toolkit label: apel·lació de lloc @ca
toolkit definition: Nomen usat en un esquema o context determinat per referir-se a un lloc. @ca
label: har benævnelse på sted @da
definition: Relaterer et sted til et nomen, som anvendes inden for et givet skema eller kontekst for at henvise til et sted. @da
toolkit label: benævnelse på sted @da
toolkit definition: Nomen, som anvendes inden for et givet skema eller kontekst for at henvise til et sted. @da
label: koha nimetus @et
definition: Seostab koha nomen'iga, mida antud süsteemis või kontekstis kasutatakse kohale viitamiseks. @et
toolkit label: koha nimetus @et
toolkit definition: Nomen, mida antud süsteemis või kontekstis kasutatakse kohale viitamiseks. @et
label: hat Bezeichnung für ein Geografikum @de
definition: Setzt ein Geografikum in Beziehung zu einem Nomen, das in einem bestimmten Schema oder Kontext verwendet wird, um ein Geografikum zu referenzieren. @de
toolkit label: Bezeichnung für ein Geografikum @de
toolkit definition: Ein Nomen, das in einem bestimmten Schema oder Kontext verwendet wird, um eine Familie zu referenzieren. @de
label: hely megnevezése a következő: @hu
definition: Hozzákapcsol egy helyet egy nomenhez, amelyet egy adott sémán vagy kontextuson belül használnak egy helyre való hivatkozásra. @hu
toolkit label: hely megnevezése: @hu
toolkit definition: Egy nomen, amelyet egy adott sémán vagy kontextuson belül használnak egy helyre való hivatkozásra. @hu
label: ha come denominazione di luogo @it
definition: Correla un luogo a un nomen usato in un dato schema o contesto per riferirsi a un luogo. @it
toolkit label: denominazione di luogo @it
toolkit definition: Nomen usato in un dato schema o contesto per riferirsi a un luogo. @it
label: vietas apzīmējums @lv
definition: Sasaista vietu ar nomenu, ko lieto konkrētajā sistēmā vai kontekstā, lai norādītu uz vietu. @lv
toolkit label: vietas apzīmējums @lv
toolkit definition: Nomens, ko lieto konkrētajā sistēmā vai kontekstā, lai norādītu uz vietu @lv
has subproperty: has access point for place
has subproperty: has name of place
has subproperty: has identifier for place
has subproperty: P70019
label: 有地点的称谓 @zh-hans
definition: 将一个地点与在一个给定的体系或语境中指称一个地点所用的一个命名关联起来。 @zh-hans
toolkit label: 地点的称谓 @zh-hans
toolkit definition: 在一个给定的体系或语境中指称一个地点所用的一个命名 @zh-hans
label: yerin unvanı ile ilişkilidir @tr
definition: Bir yeri, belirli bir şema veya bağlamda bir yere atıfta bulunmak için kullanılan bir isim ile ilişkilendirir. @tr
toolkit label: yerin unvanı @tr
toolkit definition: Belirli bir şema veya bağlam içinde bir yere atıfta bulunmak için kullanılan bir isim. @tr

has authorized access point for place
status: Published
type: Property
lexical alias: authorizedAccessPointForPlace.en
definition: Relates a place to a nomen that is an access point of place that is selected for preference in a specific vocabulary encoding scheme.
domain: C10009
toolkit label: authorized access point for place
toolkit definition: A nomen that is an access point of place that is selected for preference in a specific vocabulary encoding scheme.
sub property of: has access point for place
has element type: 3
sub property of: P00020
label: paikan auktorisoitu hakutieto @fi
definition: Liittää paikan nomeniin, joka on paikan hakutieto, joka on valittu ensisijaiseksi tietyssä sanaston merkintäjärjestelmässä. @fi
toolkit label: paikan auktorisoitu hakutieto @fi
toolkit definition: Nomen, joka on paikan hakutieto, joka on valittu ensisijaiseksi tietyssä sanaston merkintäjärjestelmässä. @fi
label: har autorisert søkeinngang for sted @no
definition: Relaterer et sted til en søkeinngang for sted som er valgt som preferanse i et bestemt kodeskjema for vokabular. @no
toolkit label: autorisert søkeinngang for sted @no
toolkit definition: En søkeinngang for sted som er valgt som preferanse i et bestemt kodeskjema for vokabular. @no
label: a pour point d’accès autorisé d’un lieu @fr
definition: Met un lieu en relation avec un nomen qui est un point d’accès d’un lieu faisant l’objet d’un choix privilégié dans un schéma d’encodage de vocabulaire spécifique. @fr
toolkit label: point d’accès autorisé d’un lieu @fr
toolkit definition: Nomen qui est un point d’accès d’un lieu faisant l’objet d’un choix privilégié dans un schéma d’encodage de vocabulaire spécifique. @fr
label: heeft geautoriseerde ingang voor plaats @nl
definition: Relateert een plaats aan een nomen dat is een ingang van plaats die als voorkeursterm geselecteerd is in een specifiek vocabulair coderingssysteem. @nl
toolkit label: geautoriseerde ingang voor plaats @nl
toolkit definition: Een nomen dat is een ingang van plaats die als voorkeursterm geselecteerd is in een specifiek vocabulair coderingssysteem. @nl
label: له نقطة وصول مقننة لمكان @ar
definition: يربط بين مكان وتسمية عبارة عن نقطة وصول لمكان تم اختيارها بتفضيل استخدامها في خطة ترميز مفردات محددة. @ar
toolkit label: نقطة وصول مقننة لمكان @ar
toolkit definition: تسمية عبارة عن نقطة وصول لمكان تم اختيارها بتفضيل استخدامها في خطة ترميز مفردات محددة. @ar
label: té com a punt d’accés autoritzat de lloc @ca
definition: Relaciona un lloc amb un nomen que és un punt d’accés de lloc que se selecciona com a preferent en un esquema de codificació de vocabulari específic. @ca
toolkit label: punt d’accés autoritzat de lloc @ca
toolkit definition: Nomen que és un punt d’accés de lloc que se selecciona com a preferent en un esquema de codificació de vocabulari específic. @ca
label: har autoriseret søgeindgang for sted @da
definition: Relaterer et sted til en søgeindgang for sted, som er valgt som præference i et specifikt vokabularkodningsskema. @da
toolkit label: autoriseret søgeindgang for sted @da
toolkit definition: Søgeindgang for sted, som er valgt som præference i et specifikt vokabularkodningsskema. @da
label: koha normitud otsielement @et
definition: Seostab koha koha otsielemendiga, mis on valitud eelistatuks vastavas leksikaalses märkimissüsteemis. @et
toolkit label: koha normitud otsielement @et
toolkit definition: Koha otsielement, mis on valitud eelistatuks vastavas leksikaalses märkimissüsteemis. @et
label: hat normierten Sucheinstieg für ein Geografikum @de
definition: Setzt ein Geografikum in Beziehung zu einem Sucheinstieg für ein Geografikum, der in einem bestimmten Vocabulary Encoding Scheme als Vorzugsform bestimmt wird. @de
toolkit label: Normierter Sucheinstieg für ein Geografikum @de
toolkit definition: Ein Sucheinstieg für ein Geografikum, der in einem bestimmten Vocabulary Encoding Scheme als Vorzugsform bestimmt wird. @de
label: autorizált hozzáférési pont helyhez a következő: @hu
definition: Hozzákapcsol egy helyet egy nomenhez, amely egy előnyben részesített hozzáférési pont a helyhez, amelyet egy speciális szótárkódolási sémából választanak ki. @hu
toolkit label: autorizált hozzáférési pont helyhez a következő: @hu
toolkit definition: Egy nomen, amely egy előnyben részesített hozzáférési pont a helyhez, amelyet egy speciális szótárkódolási sémából választanak ki. @hu
label: ha come punto d'accesso autorizzato per luogo @it
definition: Correla un luogo a un punto d'accesso per un luogo che è stato selezionato come preferito in uno specifico schema di codifica di vocabolario. @it
toolkit label: punto d'accesso autorizzato per luogo @it
toolkit definition: Punto d'accesso per un luogo che è stato selezionato come preferito in uno specifico schema di codifica di vocabolario. @it
label: vietas autoritatīvā pamatforma @lv
definition: Sasaista vietu ar nomenu, kas ir vietas pamatforma, kas ir izvēle no konkrētas vārdnīcas. @lv
toolkit label: vietas autoritatīvā pamatforma @lv
toolkit definition: Vietas pamatforma, kas ir izvēle no konkrētas vārdnīcas. @lv
has subproperty: P70045
label: 有地点的规范检索点 @zh-hans
definition: 将一个地点与作为一个地点的检索点并在一个特定的词表编码体系中被首选的一个命名关联起来。 @zh-hans
toolkit label: 地点的规范检索点 @zh-hans
toolkit definition: 作为一个地点的检索点并在一个特定的词表编码体系中被首选的一个命名 @zh-hans
label: yer için yetkili erişim noktası ile ilişkilidir @tr
definition: Bir yeri, belirli bir kelime kodlama şemasında tercih için seçilen bir yerin erişim noktası olan bir isim ile ilişkilendirir. @tr
toolkit label: yer için yetkili erişim noktası @tr
toolkit definition: Belirli bir kelime kodlama şemasında tercih için seçilen bir yerin erişim noktası olan bir isim @tr

has category of place
status: Published
type: Property
lexical alias: categoryOfPlace.en
definition: Relates a place to a type to which a place belongs.
domain: C10009
toolkit label: category of place
toolkit definition: A type to which a place belongs.
has element type: 5
alternative label: type of place
sub property of: P00029
label: paikan kategoria @fi
definition: Liittää paikan tyyppiin, johon paikka kuuluu. @fi
alternative label: paikan tyyppi @fi
toolkit label: paikan kategoria @fi
toolkit definition: Tyyppi, johon paikka kuuluu. @fi
label: har kategori av sted @no
definition: Relaterer et sted til en type som et sted tilhører. @no
alternative label: type sted @no
toolkit label: kategori av sted @no
toolkit definition: En type som et sted tilhører. @no
label: a pour catégorie de lieu @fr
definition: Met un lieu en relation avec un type auquel un lieu appartient. @fr
alternative label: type de lieu @fr
toolkit label: catégorie de lieu @fr
toolkit definition: Type auquel un lieu appartient. @fr
label: heeft categorie van plaats @nl
definition: Relateert een plaats aan een type waartoe een plaats behoort. @nl
alternative label: plaatstype @nl
toolkit label: categorie van plaats @nl
toolkit definition: Een type waartoe een plaats behoort. @nl
label: له فئة لمكان @ar
definition: يربط بين مكان ونوع ينتمي إليه مكان. @ar
alternative label: نوع مكان @ar
toolkit label: فئة لمكان @ar
toolkit definition: نوع ينتمي إليه مكان. @ar
label: té com a categoria de lloc @ca
definition: Relaciona un lloc amb un tipus al qual pertany un lloc. @ca
alternative label: tipus de lloc @ca
toolkit label: categoria de lloc @ca
toolkit definition: Tipus al qual pertany un lloc. @ca
label: har kategori af sted @da
definition: Relaterer et sted til en type, som et sted tilhører. @da
alternative label: type af sted @da
toolkit label: kategori af sted @da
toolkit definition: Type, som et sted tilhører. @da
label: koha kategooria @et
definition: Seostab koha tüübiga, millesse koht kuulub. @et
alternative label: koha tüüp @et
toolkit label: koha kategooria @et
toolkit definition: Tüüp, millesse koht kuulub. @et
label: hat Kategorie eines Geografikums @de
definition: Setzt ein Geografikum in Beziehung zu einer Art, zu der ein Geografikum gehört. @de
toolkit label: Kategorie eines Geografikums @de
toolkit definition: Eine Art, zu der ein Geografikum gehört. @de
label: hely kategóriája a következő: @hu
definition: Hozzákapcsol egy helyet ahhoz a típushoz, amelyhez a hely tartozik. @hu
alternative label: hely típusa: @hu
toolkit label: hely kategóriája @hu
toolkit definition: Egy típus, amelyhez egy hely tartozik. @hu
label: ha come categoria di luogo @it
definition: Correla un luogo al tipo a cui il luogo appartiene. @it
alternative label: tipo di luogo @it
toolkit label: categoria di luogo @it
toolkit definition: Tipo a cui il luogo appartiene. @it
label: vietas kategorija @lv
definition: Sasaista vietu ar vietas veidu. @lv
toolkit label: vietas kategorija @lv
toolkit definition: Vietas veids. @lv
alternative label: Art eines Geografikums @de
has subproperty: P70044
alternative label: 地点的类型 @zh-hans
label: 有地点的类别 @zh-hans
definition: 将一个地点与一个地点所属于的一个类型关联起来。 @zh-hans
toolkit label: 地点的类别 @zh-hans
toolkit definition: 一个地点所属于的一个类型 @zh-hans
alternative label: yerin türü @tr
label: yerin kategorisi ile ilişkilidir @tr
definition: Bir yeri, ait olduğu bir tür ile ilişkilendirir. @tr
toolkit label: yer kategorisi @tr
toolkit definition: Bir yerin ait olduğu bir tür. @tr

is coordinates of cartographic content of
status: Published
type: Property
lexical alias: coordinatesOfCartographicContentOf.en
domain: C10009
toolkit label: coordinates of cartographic content of
sub property of: has related work of place
has element type: 2
definition: Relates a place to a work that is a cartographic work that has an area of coverage that is described using a mathematical system to identify its boundaries or location.
toolkit definition: A work that is a cartographic work that has an area of coverage that is described using a mathematical system to identify its boundaries or location.
label: kartografisen sisällön koordinaatit teokselle @fi
definition: Liittää paikan teokseen, joka on kartografinen teos, jonka kattama alue on kuvailtu käyttäen matemaattista järjestelmää rajojen ja sijainnin identifioimiseksi. @fi
toolkit label: kartografisen sisällön koordinaatit teokselle @fi
toolkit definition: Teos, joka on kartografinen teos, jonka kattama alue on kuvailtu käyttäen matemaattista järjestelmää rajojen ja sijainnin identifioimiseksi. @fi
label: har koordinater for kartografisk innhold av @no
definition: Relaterer et sted til et verk som er kartografisk som lokaliserer et område ved bruk av et matematisk system. @no
toolkit label: koordinater for kartografisk innhold av @no
toolkit definition: Et verk som er kartografisk som lokaliserer et område ved bruk av et matematisk system. @no
label: consiste en coordonnées d’un contenu cartographique de @fr
definition: Met un lieu en relation avec une œuvre cartographique qui possède une zone de couverture décrite à l’aide d’un système mathématique permettant d'identifier ses limites ou son emplacement. @fr
toolkit label: coordonnées d’un contenu cartographique de @fr
toolkit definition: Œuvre cartographique qui possède une zone de couverture décrite à l’aide d’un système mathématique permettant d'identifier ses limites ou son emplacement. @fr
label: is coördinaten van cartografische content van @nl
definition: Relateert een plaats aan een werk dat is een cartografisch werk dat een bestreken gebied heeft dat is beschreven met gebruikmaking van een wiskundig systeem om de grenzen of locatie te identificeren. @nl
toolkit label: coördinaten van cartografische content van @nl
toolkit definition: Een werk dat is een cartografisch werk dat een bestreken gebied heeft dat is beschreven met gebruikmaking van een wiskundig systeem om de grenzen of locatie te identificeren. @nl
label: هو إحداثيات لمحتوى خرائطي لـ @ar
definition: يربط بين مكان وعمل عبارة عن مادة خرائطية لها نطاق تغطية موصوف باستخدام نظام رياضي لتحديد حدوده أو موقعه. @ar
toolkit label: إحداثيات لمحتوى خرائطي لـ @ar
toolkit definition: عمل عبارة عن مادة خرائطية لها نطاق تغطية موصوف باستخدام نظام رياضي لتحديد حدوده أو موقعه. @ar
label: és coordenades d’un contingut cartogràfic de @ca
definition: Relaciona un lloc amb una obra que és una obra cartogràfica que té una àrea de cobertura que es descriu usant un sistema matemàtic per identificar els seus límits o la seva localització. @ca
toolkit label: coordenades d’un contingut cartogràfic de @ca
toolkit definition: Obra que és una obra cartogràfica que té una àrea de cobertura que es descriu usant un sistema matemàtic per identificar els seus límits o la seva localització. @ca
label: er koordinater for kartografisk indhold af @da
definition: Relaterer et sted til et værk, som er kartografisk, som lokaliserer et område ved at bruge et matematisk system. @da
toolkit label: koordinater for kartografisk indhold af @da
toolkit definition: Værk, som er kartografisk, som lokaliserer et område ved at bruge et matematisk system. @da
label: kartograafilise sisu koordinaadid teoses @et
definition: Seostab koha kartograafilise teosega, mis hõlmab ala, mida selle piiride ja asukoha tuvastamiseks on kirjeldatud matemaatilise süsteemi abil. @et
toolkit label: kartograafilise sisu koordinaadid teoses @et
toolkit definition: Kartograafiline teos, mis hõlmab ala, mida selle piiride ja asukoha tuvastamiseks on kirjeldatud matemaatilise süsteemi abil. @et
label: sind Koordinaten von kartografischem Inhalt von @de
definition: Setzt ein Gebiet in Beziehung zu einem kartografischen Werk, dessen Abdeckungsbereich mit Hilfe eines mathematischen Systems beschrieben wird, um seine Grenzen oder Lage zu identifizieren. @de
toolkit label: Koordinaten von kartografischem Inhalt von @de
toolkit definition: Ein kartografisches Werk, dessen Abdeckungsbereich mit Hilfe eines mathematischen Systems beschrieben wird, um seine Grenzen oder Lage zu identifizieren. @de
label: kartográfiai tartalom koordinátái a következőnek: @hu
definition: Hozzákapcsol egy helyet egy kartográfiai műhöz, amely az általa lefedett területet matematikai módszert használva ír le, hogy meghatározza a határát vagy a helyzetét. @hu
toolkit label: kartográfiai tartalom koordinátái: @hu
toolkit definition: Egy kartográfiai mű, amely az általa lefedett területet matematikai módszert használva ír le, hogy meghatározza a határát vagy a helyzetét. @hu
label: è coordinate di contenuto cartografico di @it
definition: Correla un luogo a un'opera cartografica che localizza un'area utilizzando un sistema matematico. @it
toolkit label: coordinate di contenuto cartografico di @it
toolkit definition: Opera cartografica che localizza un'area utilizzando un sistema matematico. @it
label: ir koordinātas kartogrāfiskā saturā @lv
toolkit label: ir koordinātas kartogrāfiskā saturā @lv
definition: Sasaista vietu ar darbu, kas ir kartogrāfisks darbs, kas nosaka teritoriju, izmantojot matemātisko sistēmu. @lv
toolkit definition: Kartogrāfisks darbs, kas nosaka teritoriju, izmantojot matemātisko sistēmu. @lv
has subproperty: is longitude and latitude of
has subproperty: is right ascension and declination of
has subproperty: is strings of coordinate pairs of
has subproperty: P70023
label: 是……的地图内容的坐标 @zh-hans
toolkit label: ……的地图内容的坐标 @zh-hans
definition: 将一个地点与作为一种地图作品、有覆盖范围、并被使用一个数学体系描述以标识其边界或位置的一种作品关联起来。 @zh-hans
toolkit definition: 作为一种地图作品、有覆盖范围、并被使用一个数学体系描述以标识其边界或位置的一种作品 @zh-hans
label: kartografik içeriğinin koordinatlarıdır @tr
toolkit label: kartografik içeriğin koordinatları @tr
definition: Bir yeri, sınırlarını veya konumunu belirlemek için matematiksel bir sistem kullanılarak tanımlanan bir kapsama alanına sahip kartografik bir eser olan bir eser ile ilişkilendirir. @tr
toolkit definition: Sınırlarını veya konumunu belirlemek için matematiksel bir sistem kullanılarak tanımlanan bir kapsama alanına sahip kartografik çalışma olan bir eser. @tr

is country associated with person of
status: Published
type: Property
lexical alias: countryAssociatedWithPersonOf.en
domain: C10009
toolkit label: country associated with person of
sub property of: has related person of place
has element type: 2
definition: Relates a place to a person who is identified with a country.
toolkit definition: A person who is identified with a country.
label: maa liittyy henkilöön @fi
definition: Liittää paikan henkilöön, joka tunnistetaan maan avulla. @fi
toolkit label: maa liittyy henkilöön @fi
toolkit definition: Henkilö, joka identifioidaan maan avulla. @fi
label: er land forbundet med person for @no
definition: Relaterer et sted til en person som er identifisert med et land. @no
toolkit label: land forbundet med person for @no
toolkit definition: En person som er identifisert med et land. @no
label: est un pays associé à une personne de @fr
definition: Met un lieu en relation avec une personne qui est associée à un pays. @fr
toolkit label: pays associé à une personne de @fr
toolkit definition: Personne qui est associée à un pays. @fr
label: is land geassocieerd met persoon van @nl
definition: Relateert een plaats aan een persoon die geïdentificeerd wordt met een land. @nl
toolkit label: land geassocieerd met persoon van @nl
toolkit definition: Een persoon die geïdentificeerd wordt met een land. @nl
label: هو دولة مرتبطة بشخص لـ @ar
definition: يربط بين مكان وشخص مُعرف بدولة. @ar
toolkit label: دولة مرتبطة بشخص لـ @ar
toolkit definition: شخص معرف بدولة @ar
label: és país associat amb una persona de @ca
definition: Relaciona un lloc amb una persona que s’identifica amb un país. @ca
toolkit label: país associat amb una persona de @ca
toolkit definition: Persona que s’identifica amb un país. @ca
label: er land knyttet til person af @da
definition: Relaterer et sted til en person, som er forbundet med et land. @da
toolkit label: land knyttet til person af @da
toolkit definition: Person, som er forbundet med et land. @da
label: maaga seotud isik @et
definition: Seostab koha isikuga, kes on maaga lahutamatult seotud. @et
toolkit label: maaga seotud isik @et
toolkit definition: Isik, kes on maaga lahutamatult seotud. @et
label: ist Land, das mit einer Person in Verbindung steht von @de
definition: Setzt ein Geografikum in Beziehung zu einer Person, die mit einem Land identifiziert wird. @de
toolkit label: Land, das mit einer Person in Verbindung steht von @de
toolkit definition: Eine Person, die mit einem Land identifiziert wird. @de
label: személlyel kapcsolatos országa a következőnek: @hu
definition: Hozzákapcsol egy helyet egy személyhez, akit egy országhoz társítanak. @hu
toolkit label: személyhez köthető országa: @hu
toolkit definition: Egy személy, akit egy országhoz társítanak. @hu
label: è paese associato a persona di @it
definition: Correla un luogo con una persona che è identificata con un paese. @it
toolkit label: paese associato a persona di @it
toolkit definition: Persona che è identificata con un paese. @it
label: ir ar valsti saistītā persona @lv
toolkit label: ar valsti saistītā persona @lv
definition: Sasaista vietu ar personu, ar kuru saistīta valsts. @lv
toolkit definition: Persona, ar kuru saistīta valsts. @lv
has subproperty: P70024
label: 是和……的个人有关的国家 @zh-hans
toolkit label: 和……的个人有关的国家 @zh-hans
definition: 将一个地点与被一个国家标识的一个个人关联起来。 @zh-hans
toolkit definition: 被一个国家标识的一个个人 @zh-hans
label: kişisinin ülkesi ile ilişkilidir @tr
toolkit label: kişiyle bağlantılı ülke @tr
definition: Bir yeri, bir ülke ile özdeşleşmiş bir kişi ile ilişkilendirir. @tr
toolkit definition: Bir ülke ile özdeşleşmiş kişi. @tr

has name of place
status: Published
type: Property
definition: Relates a place to a nomen that is an appellation of place in natural language and phrasing used in common discourse.
domain: C10009
lexical alias: nameOfPlace.en
toolkit label: name of place
toolkit definition: A nomen that is an appellation of place in natural language and phrasing used in common discourse.
instruction number: 16.2
label: har navn på sted @da
definition: Relaterer en tidsperiode til en benævnelse på sted på normalsprog og med formuleringer, som bruges alment. @da
toolkit label: navn på sted @da
toolkit definition: Benævnelse på sted på normalsprog og med formuleringer, som bruges alment. @da
label: có tên địa điểm @vi
definition: Liên kết địa điểm với từ, ký tự, hoặc nhóm từ và/hoặc ký tự mà theo đó địa điểm được biết đến. @vi
toolkit label: tên địa điểm @vi
toolkit definition: Từ, ký tự, hoặc nhóm từ hoặc ký tự mà theo đó địa điểm được biết đến. @vi
label: hat Namen eines Geografikums @de
definition: Setzt ein Geografikum in Beziehung zu einer Bezeichnung für ein Geografikum in natürlicher Sprache und Ausdrucksweise, die beim normalen Sprechen und Schreiben verwendet wird. @de
toolkit label: Name eines Geografikums @de
toolkit definition: Eine Bezeichnung für ein Geografikum in natürlicher Sprache und Ausdrucksweise, die beim normalen Sprechen und Schreiben verwendet wird. @de
label: té com a nom de lloc @ca
definition: Relaciona un lloc amb un nomen que és una apel·lació de lloc en llenguatge i frases naturals usada en el discurs comú. @ca
toolkit label: nom de lloc @ca
toolkit definition: Nomen que és una apel·lació de lloc en llenguatge i frases naturals usada en el discurs comú. @ca
definition: Liittää paikan nomeniin, joka on luonnollisen kielen ja sanamuodon mukaiseen paikan nimitys, jota käytetään yleisessä diskurssissa. @fi
toolkit label: paikan nimi @fi
toolkit definition: Nomen, joka on luonnollisen kielen ja sanamuodon mukainen paikan nimitys, jota käytetään yleisessä diskurssissa. @fi
label: a pour nom de lieu @fr
definition: Met un lieu en relation avec un nomen qui est une appellation de lieu exprimée dans un langage et une formulation naturels et utilisée dans le langage courant. @fr
toolkit label: nom de lieu @fr
toolkit definition: Nomen qui est une appellation de lieu exprimée dans un langage et une formulation naturels et utilisée dans le langage courant. @fr
toolkit label: stedsnavn @no
toolkit definition: En betegnelse for sted på naturlig språk og med frasering brukt i alminnelig diskurs. @no
label: έχει όνομα του τόπου @el
definition: Συνδέει έναν τόπο με μια λέξη, έναν χαρακτήρα ή μια ομάδα λέξεων ή/και χαρακτήρων με τους οποίους είναι γνωστός ένας τόπος. @el
toolkit label: όνομα του τόπου @el
toolkit definition: Μια λέξη, ένας χαρακτήρας ή μια ομάδα λέξεων ή χαρακτήρων με τους οποίους είναι γνωστός ένας τόπος. @el
sub property of: has appellation of place
has element type: 3
label: helyneve a következő: @hu
definition: Hozzákapcsol egy helyet egy nomenhez, egy hely természetes nyelvi, a közbeszéd során használt megnevezéséhez és megfogalmazásához. @hu
toolkit label: helyneve: @hu
toolkit definition: Egy nomen, amely egy hely természetes nyelvi, a közbeszéd során használt megnevezése és megfogalmazása. @hu
sub property of: P00019
label: paikan nimi @fi
label: har stedsnavn @no
definition: Relaterer et sted til en betegnelse for sted på naturlig språk og med frasering brukt i alminnelig diskurs. @no
label: heeft naam van plaats @nl
definition: Relateert een plaats aan een nomen dat is een benaming van plaats in natuurlijke taal en terminologie in gebruikelijke bewoording. @nl
toolkit label: naam van plaats @nl
toolkit definition: Een nomen dat is een benaming van plaats in natuurlijke taal en terminologie in gebruikelijke bewoording. @nl
label: له اسم لمكان @ar
definition: يربط بين مكان وتسمية عبارة عن اسم تعريفي لمكان في اللغة الطبيعية والصياغة المستخدمة في الخطاب العام. @ar
toolkit label: اسم لمكان @ar
toolkit definition: تسمية عبارة عن اسم تعريفي لمكان في اللغة الطبيعية والصياغة المستخدمة في الخطاب العام. @ar
label: koha nimi @et
definition: Seostab koha koha nimetusega loomulikus keeles ja sõnastuses, mida kasutatakse ühises diskursuses. @et
toolkit label: koha nimi @et
toolkit definition: Koha nimetus loomulikus keeles ja sõnastuses, mida kasutatakse ühises diskursuses. @et
label: ha come nome di luogo @it
definition: Correla un luogo a una designazione di luogo in linguaggio e frasi naturali usati nel discorso comune. @it
toolkit label: nome di luogo @it
toolkit definition: Designazione di luogo in linguaggio e frasi naturali usati nel discorso comune. @it
label: vietas nosaukums @lv
definition: Sasaista vietu ar nomenu, kas ir vietas apzīmējums dabiskajā valodā, ko izmanto savstarpējā saziņā. @lv
toolkit label: vietas nosaukums @lv
toolkit definition: Vietas apzīmējums dabiskajā valodā, ko izmanto savstarpējā saziņā. @lv
has subproperty: has variant name of place
has subproperty: has preferred name of place
has subproperty: P70001
label: 有地点的名称 @zh-hans
definition: 将一个地点与作为用自然语言和普通话语措词表达的一个地点之称谓的一个命名关联起来。 @zh-hans
toolkit label: 地点的名称 @zh-hans
toolkit definition: 作为用自然语言和普通话语措词表达的一个地点之称谓的一个命名 @zh-hans
label: yerin adı ile ilişkilidir @tr
definition: Bir yeri, doğal dilde ve ortak söylemde kullanılan ifadelerde bir yer adı olan bir isim ile ilişkilendirir. @tr
toolkit label: Yerin adı @tr
toolkit definition: Doğal dilde ve ortak söylemde kullanılan ifadelerde bir yerin unvanı olan bir isim. @tr

has variant name of place
status: Published
type: Property
definition: Relates a place to a nomen that is a name of place that is not selected for preference in a specific application or context.
sub property of: has name of place
domain: C10009
lexical alias: variantNameOfPlace.en
toolkit label: variant name of place
toolkit definition: A nomen that is a name of place that is not selected for preference in a specific application or context.
instruction number: 16.2.3
scope note: Variant name for place includes a name found in reference sources, or a name resulting from a different transliteration of a name, etc.
label: har variant af navn på sted @da
definition: Relaterer et sted til et navn på sted, som ikke er valgt som præference i en specifik anvendelse eller kontekst. @da
toolkit label: variant af navn på sted @da
toolkit definition: Navn på sted, som ikke er valgt som præference i en specifik anvendelse eller kontekst. @da
label: có tên khác của địa điểm @vi
definition: Liên kết địa điểm với tên hoặc hình thái của tên mà theo đó địa điểm được biết đến khác với tên hoặc hình thái của tên được chọn lựa như là tên ưu tiên. @vi
scope note: Tên khác của địa điểm bao gồm tên hoặc hình thái của tên được tìm thấy trong các nguồn tham khảo, hoặc tên sinh ra từ phiên âm khác nhau của tên, v.v... @vi
toolkit label: tên khác của địa điểm @vi
toolkit definition: Tên hoặc hình thái của tên mà theo đó địa điểm được biết đến khác với tên hoặc hình thái của tên được chọn lựa như là tên ưu tiên. @vi
label: hat abweichenden Namen eines Geografikums @de
definition: Setzt ein Geografikum in Beziehung zu einem Namen eines Geografikums, der in einer bestimmten Anwendung oder in einem bestimmten Kontext nicht als Vorzugsform bestimmt wird. @de
scope note: Darunter fallen Namen oder Namensformen, wie sie in Nachschlagewerken gefunden werden, oder Namen, die sich aus einer anderen Transliteration eines Namens ergeben und so weiter. @de
toolkit label: Abweichender Name eines Geografikums @de
toolkit definition: Ein Name eines Geografikums, der in einer bestimmten Anwendung oder in einem bestimmten Kontext nicht als Vorzugsform bestimmt wird. @de
label: té com a variant de nom de lloc @ca
definition: Relaciona un lloc amb un nomen que és un nom de lloc que no se selecciona com a preferent en una aplicació o un context específic. @ca
scope note: La variant de nom de lloc inclou un nom trobat en les fonts de referència, o un nom que és el resultat d’una transliteració diferent d’un nom, etc. @ca
toolkit label: variant de nom de lloc @ca
toolkit definition: Nomen que és un nom de lloc que no se selecciona com a preferent en una aplicació o un context específic. @ca
definition: Liittää paikan nomeniin, joka on paikan nimi, jota ei ole valittu ensisijaiseksi tietyssä sovelluksessa tai kontekstissa. @fi
scope note: Paikan varianttinimi on nimi, jota on käytetty tietolähteissä tai joka on translitteroitu eri tavoin tms. @fi
toolkit label: paikan varianttinimi @fi
toolkit definition: Nomen, joka on paikan nimi, jota ei ole valittu ensisijaiseksi tietyssä sovelluksessa tai kontekstissa. @fi
label: a pour variante de nom de lieu @fr
definition: Met un lieu en relation avec un nomen qui est un nom de lieu ne faisant pas l’objet d’un choix privilégié dans une application ou un contexte spécifiques. @fr
scope note: Une variante de nom de lieu comprend un nom trouvé dans les sources de référence ou un nom qui résulte d’une translittération différente d’un nom, etc. @fr
toolkit label: variante de nom de lieu @fr
toolkit definition: Nomen qui est un nom de lieu ne faisant pas l’objet d’un choix privilégié dans une application ou un contexte spécifiques. @fr
toolkit label: variantform av stedsnavn @no
toolkit definition: Et navn på sted som ikke er valgt som preferanse i en bestemt applikasjon eller kontekst. @no
label: έχει εναλλακτικό όνομα για τόπο @el
definition: Συνδέει έναν τόπο με ένα όνομα ή μια μορφή του ονόματος με το οποίο είναι γνωστός ένας τόπος, το οποίο διαφέρει από ένα όνομα ή μια μορφή ονόματος που επιλέγεται ως το προτιμώμενο όνομα. @el
scope note: Το εναλλακτικό όνομα για έναν τόπο περιλαμβάνει ένα όνομα ή μια μορφή του ονόματος που εντοπίζεται στις πηγές αναφοράς ή ένα όνομα που προκύπτει από έναν διαφορετικό μεταγραμματισμό ενός ονόματος κ.λπ. @el
toolkit label: εναλλακτικό όνομα για τόπο @el
toolkit definition: Ένα όνομα ή μια μορφή του ονόματος με το οποίο είναι γνωστός ένας τόπος, το οποίο διαφέρει από ένα όνομα ή μια μορφή ονόματος που επιλέγεται ως το προτιμώμενο όνομα. @el
has element type: 3
label: helynévváltozata a következő: @hu
definition: Hozzákapcsol egy helyet egy nomenhez, amely egy olyan helynév, amelyet egy adott alkalmazásban vagy kontextusban nem részesítenek előnyben. @hu
scope note: hely névvariánsa: @hu
toolkit label: helynévváltozata: @hu
toolkit definition: Egy nomen, amely egy olyan helynév, amelyet egy adott alkalmazásban vagy kontextusban nem részesítenek előnyben. @hu
sub property of: P00023
alternative label: variant name for place
label: paikan varianttinimi @fi
label: har variantform av stedsnavn @no
definition: Relaterer et sted til et navn på sted som ikke er valgt som preferanse i en bestemt applikasjon eller kontekst. @no
scope note: Variantform av stedsnavn inkluderer navn som finnes i referanseverk eller navn som er resultat av en annen transkripsjon av et navn etc. @no
label: heeft variant naam van plaats @nl
definition: Relateert een plaats aan een nomen dat is een naam van plaats die niet als voorkeursterm geselecteerd is in een specifieke toepassing of context. @nl
scope note: Variant naam voor plaats omvat een naam gevonden in naslagwerken, of een naam volgens een andere translitteratie van een naam etc. @nl
toolkit label: variant naam van plaats @nl
toolkit definition: Een nomen dat is een naam van plaats die niet als voorkeursterm geselecteerd is in een specifieke toepassing of context. @nl
label: له اسم مختلف لمكان @ar
definition: يربط بين مكان وتسمية عبارة عن اسم لمكان لم يتم اختياره بتفضيل استخدامه في تطبيق محدد أو سياق محدد. @ar
scope note: يشمل الاسم المختلف للمكان اسم موجود في مصادر مرجعية، أو اسم ناتج عن نقحرة مختلفة لاسم، إلخ. @ar
toolkit label: اسم مختلف لمكان @ar
toolkit definition: تسمية عبارة عن اسم لمكان لم يتم اختياره بتفضيل استخدامه في تطبيق محدد أو سياق محدد. @ar
scope note: Variant af navn på sted omfatter et navn, som findes i referenceværk, eller et navn, som resulterer fra en anden translitteration af et navn, etc. @da
label: koha variantnimi @et
definition: Seostab koha koha nimega, mis kindlas rakenduses või kontekstis ei ole valitud eelistatuks. @et
scope note: Koha variantnimeks võib olla teatmeallikates leiduv nimi, nime erinevast translitereerimisest tulenev nimi vms. @et
toolkit label: koha variantnimi @et
toolkit definition: Koha nimi, mis kindlas rakenduses või kontekstis ei ole valitud eelistatuks. @et
label: ha come nome variante di luogo @it
definition: Correla un luogo a un nome di luogo che non è stato selezionato come preferito in una specifica applicazione o contesto. @it
scope note: Il nome variante di luogo comprende un nome trovato nelle fonti di reference o un nome che risulta da una diversa traslitterazione di un nome, etc. @it
toolkit label: nome variante di luogo @it
toolkit definition: Nome di luogo che non è stato selezionato come preferito in una specifica applicazione o contesto. @it
label: vietas cits nosaukums @lv

has preferred name of place
status: Published
type: Property
definition: Relates a place to a nomen that is a name of place that is selected for preference in a specific application or context.
sub property of: has name of place
domain: C10009
lexical alias: preferredNameOfPlace.en
toolkit label: preferred name of place
toolkit definition: A nomen that is a name of place that is selected for preference in a specific application or context.
instruction number: 16.2.2
label: har foretrukket navn på sted @da
definition: Relaterer et sted til et navn på sted, som er valgt som præference i en specifik anvendelse eller kontekst. @da
toolkit label: foretrukket navn på sted @da
toolkit definition: Navn på sted, som er valgt som præference i en specifik anvendelse eller kontekst. @da
label: có tên ưu tiên của địa điểm @vi
definition: Liên kết địa điểm với tên hoặc hình thái của tên được chọn lựa để nhận dạng địa điểm. @vi
toolkit label: tên ưu tiên của địa điểm @vi
toolkit definition: Tên hoặc hình thái của tên được chọn lựa để nhận dạng địa điểm. @vi
label: hat bevorzugten Namen eines Geografikums @de
definition: Setzt ein Geografikum in Beziehung zu einem Namen eines Geografikums, der in einer bestimmten Anwendung oder in einem bestimmten Kontext als Vorzugsform bestimmt wird. @de
toolkit label: Bevorzugter Name eines Geografikums @de
toolkit definition: Ein Name eines Geografikums, der in einer bestimmten Anwendung oder in einem bestimmten Kontext als Vorzugsform bestimmt wird. @de
label: té com a nom preferit de lloc @ca
definition: Relaciona un lloc amb un nomen que és un nom de lloc que se selecciona com a preferent en una aplicació o context específic. @ca
toolkit label: nom preferit de lloc @ca
toolkit definition: Nomen que és un nom de lloc que se selecciona com a preferent en una aplicació o context específic. @ca
definition: Liittää paikan nomeniin, joka on paikan nimi, joka on valittu ensisijaiseksi tietyssä sovelluksessa tai kontekstissa. @fi
toolkit label: paikan ensisijainen nimi @fi
toolkit definition: Nomen, joka on paikan nimi, joka on valittu ensisijaiseksi tietyssä sovelluksessa tai kontekstissa. @fi
label: a pour nom privilégié d’un lieu @fr
definition: Met un lieu en relation avec un nomen qui est un nom de lieu faisant l’objet d’un choix privilégié dans une application ou un contexte spécifiques. @fr
toolkit label: nom privilégié d’un lieu @fr
toolkit definition: Nomen qui est un nom de lieu faisant l’objet d’un choix privilégié dans une application ou un contexte spécifiques. @fr
toolkit label: foretrukket stedsnavn @no
toolkit definition: Et navn på sted som er valgt som preferanse i en bestemt applikasjon eller kontekst. @no
label: έχει προτιμώμενο όνομα για τόπο @el
definition: Συνδέει έναν τόπο με ένα όνομα ή μια μορφή του ονόματος που επιλέγεται για την ταύτιση ενός τόπου. @el
toolkit label: προτιμώμενο όνομα για τόπο @el
toolkit definition: Ένα όνομα ή μια μορφή του ονόματος που επιλέγεται για την ταύτιση ενός τόπου. @el
has element type: 3
label: előnyben részesített helyneve a következő: @hu
definition: Hozzákapcsol egy helyet egy nomenhez, amely egy olyan helynév, amelyet egy bizonyos alkalmazásban vagy kontextusban előnyben részesítenek. @hu
toolkit label: előnyben részesített helyneve: @hu
toolkit definition: Egy nomen, amely egy olyan helynév, amelyet egy bizonyos alkalmazásban vagy kontextusban előnyben részesítenek. @hu
sub property of: P00021
alternative label: preferred name for place
label: paikan ensisijainen nimi @fi
label: har foretrukket stedsnavn @no
definition: Relaterer et sted til et navn på sted som er valgt som preferanse i en bestemt applikasjon eller kontekst. @no
label: heeft geprefereerde naam van plaats @nl
definition: Relateert een plaats aan een nomen dat is een naam van plaats die als voorkeursterm geselecteerd is in een specifieke toepassing of context. @nl
toolkit label: geprefereerde naam van plaats @nl
toolkit definition: Een nomen dat is een naam van plaats die als voorkeursterm geselecteerd is in een specifieke toepassing of context. @nl
label: له اسم مفضل لمكان @ar
definition: يربط بين مكان وتسمية عبارة عن اسم لمكان تم اختياره بتفضيل استخدامه في تطبيق محدد أو سياق محدد. @ar
toolkit label: اسم مفضل لمكان @ar
toolkit definition: تسمية عبارة عن اسم لمكان يتم اختياره بتفضيل استخدامه في تطبيق محدد أو سياق محدد. @ar
label: koha eelisnimi @et
definition: Seostab koha koha nimega, mis kindlas rakenduses või kontekstis on valitud eelistatuks. @et
toolkit label: koha eelisnimi @et
toolkit definition: Koha nimi, mis kindlas rakenduses või kontekstis on valitud eelistatuks. @et
label: ha come nome preferito di luogo @it
definition: Correla un luogo a un nome di luogo che è stato selezionato come preferito in una specifica applicazione o contesto. @it
toolkit label: nome preferito di luogo @it
toolkit definition: Nome di luogo che è stato selezionato come preferito in una specifica applicazione o contesto. @it
label: vietas prioritārais nosaukums @lv
definition: Sasaista vietu ar nomenu, kas ir vietas nosaukums, kas ir izvēlēts noteiktam lietojumam vai noteiktā kontekstā. @lv
toolkit label: vietas prioritārais nosaukums @lv
toolkit definition: Vietas nosaukums, kas ir izvēlēts noteiktam lietojumam vai noteiktā kontekstā. @lv
alternative label: اسم مفضل لمكان @ar
has subproperty: P70002
alternative label: 地点的首选名称 @zh-hans
label: 有地点的首选名称 @zh-hans
definition: 将一个地点与作为在一个特定的应用或语境中被首选的一个地点名称的一个命名关联起来。 @zh-hans
toolkit label: 地点的首选名称 @zh-hans
toolkit definition: 作为在一个特定的应用或语境中被首选的一个地点名称的一个命名 @zh-hans
alternative label: előnyben részesített helynév: @hu
alternative label: Yer için tercih edilen isim @tr
label: tercih edilen yer adı ile ilişkilidir @tr
definition: Bir yeri, belirli bir uygulama veya bağlamda tercih edilmek üzere seçilen yerin adı olan bir isim ile ilişkilendirir. @tr

is subject place of
status: Published
type: Property
lexical alias: subjecfPlaceOf.en
definition: Relates a place to a work that is about a place.
domain: C10009
sub property of: has related work of place
label: er sted, som er subjekt af @da
definition: Relaterer et sted til et værk, som handler om et sted. @da
label: là chủ đề của (địa điểm) @vi
definition: Liên kết địa điểm với tác phẩm về địa điểm. @vi
label: és lloc de matèria de @ca
definition: Relaciona un lloc amb una obra que tracta sobre un lloc. @ca
definition: Liittää paikan teokseen, jonka aiheena paikka on. @fi
label: est un lieu sujet de @fr
definition: Met un lieu en relation avec une œuvre qui traite d’un lieu. @fr
label: είναι θέμα του (τόπος) @el
definition: Συνδέει έναν τόπο με ένα έργο που αναφέρεται σε έναν τόπο. @el
toolkit label: subject place of
toolkit definition: A work that is about a place.
has element type: 2
alternative label: subject of (place)
label: hely tárgya a következőnek: @hu
definition: Hozzákapcsol egy helyet egy műhöz, amelyet egy helyhez társítanak. @hu
sub property of: P00014
toolkit label: paikka aiheena teoksessa @fi
toolkit definition: Teos, jonka aiheena paikka on. @fi
label: paikka aiheena teoksessa @fi
label: er sted som emne for @no
definition: Relaterer et sted til et verk som handler om et sted. @no
alternative label: emne for (sted) @no
toolkit label: sted som emne for @no
toolkit definition: Et verk som handler om et sted. @no
alternative label: sujet de (lieu) @fr
toolkit label: lieu sujet de @fr
toolkit definition: Œuvre qui traite d’un lieu. @fr
label: is onderwerp-plaats van @nl
definition: Relateert een plaats aan een werk dat over een plaats gaat. @nl
toolkit label: onderwerp-plaats van @nl
toolkit definition: Een werk dat over een plaats gaat. @nl
label: هو مكان موضوع لـ @ar
definition: يربط بين مكان وعمل عن مكان. @ar
alternative label: موضوع عن (مكان) @ar
toolkit label: مكان موضوع لـ @ar
toolkit definition: عمل عن مكان @ar
alternative label: matèria de (lloc) @ca
toolkit label: lloc de matèria de @ca
toolkit definition: Obra que tracta sobre un lloc. @ca
alternative label: subjekt af (sted) @da
toolkit label: sted, som er subjekt af @da
toolkit definition: Værk, som handler om et sted. @da
label: teema (koht) teoses @et
definition: Seostab koha teosega, mis on koha kohta. @et
toolkit label: teema (koht) teoses @et
toolkit definition: Teos, mis on koha kohta. @et
label: ist Geografikum als Thema von @de
definition: Setzt ein Geografikum in Beziehung zu einem Werk, das von einem Geografikum handelt. @de
toolkit label: Geografikum als Thema von @de
toolkit definition: Ein Werk, das von einem Geografikum handelt. @de
alternative label: tárgya a következőnek (hely): @hu
toolkit label: hely mint tárgya: @hu
toolkit definition: Egy mű, amelyet egy helyhez társítanak. @hu
label: è luogo soggetto di @it
definition: Correla un luogo a un'opera che è su un luogo. @it
alternative label: soggetto di (luogo) @it
toolkit label: luogo soggetto di @it
toolkit definition: opera che è su un luogo. @it
label: ir temats (vieta) @lv
definition: Sasaista vietu ar darbu, kura temats ir vieta. @lv
toolkit label: ir temats (vieta) @lv
toolkit definition: Darbs, kura temats ir vieta. @lv
has subproperty: is place described by
has subproperty: P70017
alternative label: ……的主题（地点） @zh-hans
label: 是……的主题地点 @zh-hans
definition: 将一个地点与关于一个地点的一种作品关联起来。 @zh-hans
toolkit label: ……的主题地点 @zh-hans
toolkit definition: 关于一个地点的一种作品 @zh-hans
alternative label: (yerin) konusu @tr
toolkit label: konu akınan yer @tr
toolkit definition: Bir yer hakkındaki bir eser. @tr

has identifier for place
status: Published
type: Property
lexical alias: identifierForPlace.en
definition: Relates a place to a nomen that is an appellation of place that consists of a code, number, or other string, usually independent of natural language and social naming conventions, used to identify a place.
domain: C10009
toolkit label: identifier for place
toolkit definition: A nomen that is an appellation of place that consists of a code, number, or other string, usually independent of natural language and social naming conventions, used to identify a place.
sub property of: has appellation of place
has element type: 3
instruction number: 16.3
sub property of: P00018
label: paikan tunniste @fi
definition: Liittää paikan nomeniin, joka on paikan nimitys, joka koostuu koodista, numerosta tai muusta merkkijonosta ja joka yleensä on luonnollisesta kielestä ja kielen sosiaalisista konventioista riippumaton paikan tunnistamiskeino. @fi
toolkit label: paikan tunniste @fi
toolkit definition: Nomen, joka on paikan nimitys, joka koostuu koodista, numerosta tai muusta merkkijonosta ja joka yleensä on luonnollisesta kielestä ja kielen sosiaalisista konventioista riippumaton paikan tunnistamiskeino. @fi
label: har identifikator for sted @no
definition: Relaterer et sted til en betegnelse for sted som består av en kode, et nummer eller en annen streng, vanligvis uavhengig av et naturlig språk og sosiale navnekonvensjoner, brukt for å identifisere et sted. @no
toolkit label: identifikator for sted @no
toolkit definition: En betegnelse for sted som består av en kode, et nummer eller en annen streng, vanligvis uavhengig av et naturlig språk og sosiale navnekonvensjoner, brukt for å identifisere et sted. @no
label: a pour identifiant de lieu @fr
definition: Met un lieu en relation avec un nomen qui est une appellation de lieu consistant en un code, un nombre ou une autre chaîne, généralement indépendante du langage naturel et des conventions sociales de dénomination, utilisée pour identifier un lieu. @fr
toolkit label: identifiant de lieu @fr
toolkit definition: Nomen qui est une appellation de lieu consistant en un code, un nombre ou une autre chaîne, généralement indépendante du langage naturel et des conventions sociales de dénomination, utilisée pour identifier un lieu. @fr
label: heeft identificatie voor plaats @nl
definition: Relateert een plaats aan een nomen dat is een benaming van plaats die bestaat uit een code, nummer of andere tekenreeks, meestal onafhankelijk van natuurlijke taal of sociale naamgeving, gebruikt om een plaats te identificeren. @nl
toolkit label: identificatie voor plaats @nl
toolkit definition: Een nomen dat is een benaming van plaats die bestaat uit een code, nummer of andere tekenreeks, meestal onafhankelijk van natuurlijke taal of sociale naamgeving, gebruikt om een plaats te identificeren. @nl
label: té com a identificador de lloc @ca
definition: Relaciona un lloc amb un nomen que és una apel·lació de lloc que consisteix en un codi, un número o una altra cadena, normalment independent del llenguatge natural i de les convencions de denominació social, usat per identificar un lloc. @ca
toolkit label: identificador de lloc @ca
toolkit definition: Nomen que és una apel·lació de lloc que consisteix en un codi, un número o una altra cadena, normalment independent del llenguatge natural i de les convencions de denominació social, usat per identificar un lloc. @ca
definition: Relaterer et sted til en benævnelse på sted, som består af en kode, nummer eller anden streng, ofte uafhængig af normalsprog og navngivningskonventioner, brugt til at identificere et sted. @da
toolkit definition: Benævnelse på sted, som består af en kode, nummer eller anden streng, ofte uafhængig af normalsprog og navngivningskonventioner, brugt til at identificere et sted. @da
label: koha identifikaator @et
definition: Seostab koha koha nimetusega, mis koosneb kohta identifitseerivast koodist, numbrist või muust loomulikust keelest ja üldtuntud nimetamistavadest sõltumatust stringist. @et
toolkit label: koha identifikaator @et
toolkit definition: Koha nimetus, mis koosneb kohta identifitseerivast koodist, numbrist või muust loomulikust keelest ja üldtuntud nimetamistavadest sõltumatust stringist. @et
label: hat Identifikator für ein Geografikum @de
definition: Setzt ein Geografikum in Beziehung zu einer Bezeichnung für ein Geografikum, die aus einem Code, einer Nummer oder einer anderen Zeichenkette besteht, der/die normalerweise nicht in natürlicher Sprache und unabhängig von den sozialen Benennungskonventionen ist und zur Identifizierung eines Geografikums verwendet wird. @de
toolkit label: Identifikator für ein Geografikum @de
toolkit definition: Eine Bezeichnung für ein Geografikum, die aus einem Code, einer Nummer oder einer anderen Zeichenkette besteht, der/die normalerweise nicht in natürlicher Sprache und unabhängig von den sozialen Benennungskonventionen ist und zur Identifizierung eines Geografikums verwendet wird. @de
label: azonosító helyhez a következő: @hu
definition: Hozzákapcsol egy helyet egy nomenhez, egy hely megnevezéséhez, amely egy kód-, szám-, vagy más típusú karakterláncból áll, amely általában független a természetes nyelvektől és társadalmi névkonvencióktól, és egy hely azonosítására használják. @hu
toolkit label: azonosító helyhez: @hu
toolkit definition: Egy nomen, egy hely megnevezése, amely egy kód-, szám-, vagy más típusú karakterláncból áll, amely általában független a természetes nyelvektől és társadalmi névkonvencióktól, és egy hely azonosítására használják. @hu
label: ha come identificatore per luogo @it
definition: Correla un luogo a una designazione di luogo che è costituita da un codice, numero, o altra stringa, di solito indipendente dal linguaggio naturale e dalle convenzioni sociali di denominazione, usata per identificare un luogo. @it
toolkit label: identificatore per luogo @it
toolkit definition: Designazione di luogo che è costituita da un codice, numero, o altra stringa, di solito indipendente dal linguaggio naturale e dalle convenzioni sociali di denominazione, usata per identificare un luogo. @it
label: vietas identifikators @lv
definition: Sasaista vietu ar nomenu, kas ir vietas apzīmējums, kas sastāv no koda, skaitļa vai citas virknes, kas parasti ir neatkarīgs no dabiskas valodas vai sabiedrībā pieņemtām nosaukšanas tradīcijām, ko izmanto, lai identificētu vietu. @lv
toolkit label: vietas identifikators @lv
toolkit definition: Vietas apzīmējums, kas sastāv no koda, skaitļa vai citas virknes, kas parasti ir neatkarīgs no dabiskas valodas vai sabiedrībā pieņemtām nosaukšanas tradīcijām, ko izmanto, lai identificētu vietu. @lv
label: له معرف لمكان @ar
definition: يربط بين مكان وتسمية عبارة عن اسم تعريفي لمكان يتكون من رمز، أو رقم، أو سلسلة تمثيلات أخرى، مستقلة عادة عن اللغة الطبيعية والتسميات المتعارف عليها اجتماعيا المستخدمة لتعريف مكان. @ar
toolkit label: معرف لمكان @ar
toolkit definition: تسمية عبارة عن اسم تعريفي لمكان يتكون من رمز، أو رقم، أو سلسلة تمثيلات أخرى، مستقلة عادة عن اللغة الطبيعية وعن التسميات المتعارف عليها اجتماعيا، وتستخدم لتحديد مكان. @ar
has subproperty: P70020
label: 有地点的标识符 @zh-hans
definition: 将一个地点与作为一个由代码、数字、或其他字符串构成、通常独立于自然语言和社会命名惯例、用以标识一个地点的一个地点称谓的命名关联起来。 @zh-hans
toolkit label: 地点的标识符 @zh-hans
toolkit definition: 作为一个由代码、数字、或其他字符串构成、通常独立于自然语言和社会命名惯例、用以标识一个地点的一个地点称谓的命名 @zh-hans
label: yerin tanımlayıcısı ile ilişkilidir @tr
definition: Bir yeri, bir yeri tanımlamak için kullanılan, genellikle doğal dilden ve sosyal adlandırma kurallarından bağımsız olarak, bir kod, sayı veya başka bir dizgiden oluşan yer adı olan bir isim ile ilişkilendirir. @tr
toolkit label: yerin tanımlayıcısı ile ilişkilidir @tr
toolkit definition: Bir yeri tanımlamak için kullanılan, genellikle doğal dilden ve sosyal adlandırma kurallarından bağımsız, bir kod, sayı veya başka bir dizeden oluşan bir yer unvanı olan bir isim. @tr

is place governed by
status: Published
type: Property
definition: Relates a place to a corporate body who is a government of a place.
domain: C10009
has element type: 2
sub property of: has related corporate body of place
toolkit label: place governed by
toolkit definition: A corporate body who is a government of a place.
label: soveltava lainkäyttöalue yhteisölle @fi
definition: Liittää paikan yhteisöön, joka on hallintoalueen julkishallinnollinen yhteisö, jota toisen julkishallinnollisen yhteisön säätämät lait, asetukset tms. ohjaavat. @fi
toolkit label: soveltava lainkäyttöalue yhteisölle @fi
toolkit definition: Yhteisö, joka on hallintoalueen julkishallinnollinen yhteisö, jota toisen julkishallinnollisen yhteisön säätämät lait, asetukset tms. ohjaavat. @fi
label: er jurisdiksjon som styres for @no
definition: Relaterer et sted til en korporasjon som er en myndighet for en jurisdiksjon som styres av en lov, vedtekt etc. som ble vedtatt av en annen myndighet. @no
toolkit label: jurisdiksjon som styres for @no
toolkit definition: En korporasjon som er en myndighet for en jurisdiksjon som styres av en lov, vedtekt etc. som ble vedtatt av en annen myndighet. @no
label: est un lieu régi par @fr
definition: Met un lieu en relation avec une collectivité qui constitue un gouvernement d’un lieu. @fr
toolkit label: lieu régi par @fr
toolkit definition: Collectivité qui constitue un gouvernement d’un lieu. @fr
label: is jurisdictie geregeerd door @nl
definition: Relateert een plaats die een jurisdictie is aan een corporatie die een overheid is van een jurisdictie geregeerd door een wet, regel etc. die uitgevaardigd was door een andere overheid. @nl
toolkit label: jurisdictie geregeerd door @nl
toolkit definition: Een corporatie die een overheid is van een jurisdictie geregeerd door een wet, regel etc. die uitgevaardigd was door een andere overheid. @nl
label: هو نطاق جغرافي خاضع لـ @ar
definition: يربط بين مكان وهيئة عبارة عن حكومة ولاية قضائية تخضع لقانون، أو لائحة، إلخ، سنتها حكومة أخرى. @ar
toolkit label: ولاية قضائية خاضعة لـ @ar
toolkit definition: هيئة عبارة عن حكومة ولاية قضائية تخضع لقانون، أو لائحة، إلخ، سنتها حكومة أخرى. @ar
label: és lloc regit per @ca
definition: Relaciona un lloc amb una entitat corporativa que és un govern d’un lloc. @ca
toolkit label: lloc regit per @ca
toolkit definition: Entitat corporativa que és un govern d’un lloc. @ca
label: er jurisdiktion underlagt af @da
definition: Relaterer et sted, som er en jurisdiktion, til en korporation, som er en jurisdiktions myndighed, og som styres af en lov, forordning, etc., som blev vedtaget af en anden myndighed. @da
toolkit label: jurisdiktion underlagt af @da
toolkit definition: Korporation, som er en jurisdiktions myndighed, og som styres af en lov, forordning, etc., som blev vedtaget af en anden myndighed. @da
label: võimkond valitsevale asutusele @et
definition: Seostab võimkonnaks oleva koha võimkonda valitseva asutusega, mis valitseb seaduste, määruste vms alusel, mille on kehtestanud teine valitsus. @et
toolkit label: võimkond valitsevale asutusele @et
toolkit definition: Võimkonda valitsev asutus, mis valitseb seaduste, määruste vms alusel, mille on kehtestanud teine valitsus. @et
label: ist geregelte Gebietskörperschaft von @de
definition: Setzt eine Gebietskörperschaft in Beziehung zu einer Körperschaft, bei der es sich um die Regierung einer Gebietskörperschaft handelt, die durch ein Gesetz, eine Verordnung und so weiter geregelt wird, das/die von einer anderen Regierung erlassen wurde. @de
toolkit label: Geregelte Gebietskörperschaft von @de
toolkit definition: Eine Körperschaft, bei der es sich um die Regierung einer Gebietskörperschaft handelt, die durch ein Gesetz, eine Verordnung und so weiter geregelt wird, das/die von einer anderen Regierung erlassen wurde. @de
label: joghatósága a következőnek: @hu
definition: Hozzákapcsol egy helyet egy igazgatási szerv testülethez, amely egy másik igazgatási szerv által hozott törvény, rendelet stb. hatálya alá tartozik. @hu
toolkit label: joghatósága: @hu
toolkit definition: Egy igazgatási szerv testület, amely egy másik igazgatási szerv által hozott törvény, rendelet stb. hatálya alá tartozik. @hu
label: è giurisdizione governata da @it
definition: Correla un luogo che è una giurisdizione di un ente che è il governo di una giurisdizione governata da una legge, regolamenti, etc, che è stata promulgata da un altro governo. @it
toolkit label: giurisdizione governata da @it
toolkit definition: Ente che è una giurisdizione di un ente che è il governo di una giurisdizione governata da una legge, regolamenti, etc, che è stata promulgata da un altro governo. @it
label: ir jurisdikcijas pārvaldītājs @lv
definition: Sasaista vietu ar institūciju, kas pārvalda noteiktu teritoriju, balstoties likumos, noteikumos u.tml., kurus pieņēmusi cita jurisdikcija. @lv
toolkit label: jurisdikcijas pārvaldītājs @lv
toolkit definition: Institūcija, kas pārvalda noteiktu teritoriju, balstoties likumos, noteikumos u.tml., kurus pieņēmusi cita jurisdikcija. @lv
alternative label: jurisdiction governed of
lexical alias: placeGovernedBy.en
has subproperty: P70051
label: 是……所管理的辖区 @zh-hans
definition: 将一个地点与作为根据另一个政府所颁布的法律、法规等管理的一个辖区的一个政府的一个团体关联起来。 @zh-hans
toolkit label: ……所管理的辖区 @zh-hans
toolkit definition: 作为根据另一个政府所颁布的法律、法规等管理的一个辖区的一个政府的一个团体 @zh-hans
alternative label: juridiction régie de @fr
alternative label: jurisdicció regida de @ca
label: yönetilen yargı alanıdır @tr
definition: Bir yeri, başka bir hükümet tarafından çıkarılan bir yasa, yönetmelik vb. tarafından yönetilen bir yargı yetkisine sahip bir hükümeti olan bir tüzel kişiyle ilişkilendirir. @tr
toolkit label: yargı yetkisine @tr
toolkit definition: Başka bir hükümet tarafından çıkarılan bir yasa, yönetmelik vb. tarafından yönetilen bir yargı yetkisinin hükümeti olan bir tüzel kişilik. @tr

has related agent of place
status: Published
type: Property
lexical alias: relatedAgentOfPlace.en
definition: Relates a place to an agent who is associated with a place.
domain: C10009
sub property of: has related RDA entity of place
label: har agent relateret til sted @da
definition: Relaterer et sted til en agent, som er knyttet til et sted. @da
label: có tác nhân có liên quan (địa điểm) @vi
definition: Liên kết địa điểm với tác nhân liên quan tới địa điểm đang được mô tả. @vi
label: té com a agent relacionat amb un lloc @ca
definition: Relaciona un lloc amb un agent que s’associa amb un lloc. @ca
definition: Liittää paikan toimijaan, johon paikka liittyy. @fi
label: a pour agent en relation avec un lieu @fr
definition: Met un lieu en relation avec un agent qui est associé à un lieu. @fr
label: έχει σχετικό φορέα (τόπος) @el
definition: Συνδέει έναν τόπο με έναν φορέα που συνδέεται με έναν περιγραφόμενο τόπο. @el
toolkit label: related agent of place
toolkit definition: An agent who is associated with a place.
has element type: 1
sub property of: P00006
label: hely kapcsolódó ágense a következő: @hu
definition: Hozzákapcsol egy helyet egy ágenshez, amelyet egy helyhez társítanak. @hu
toolkit label: paikkaan liittyvä toimija @fi
toolkit definition: Toimija, johon paikka liittyy. @fi
label: paikkaan liittyvä toimija @fi
label: har agent relatert til sted @no
definition: Relaterer et sted til en agent som forbindes med et sted. @no
toolkit label: agent relatert til sted @no
toolkit definition: En agent som forbindes med et sted. @no
toolkit label: agent en relation avec un lieu @fr
toolkit definition: Agent qui est associé à un lieu. @fr
label: heeft gerelateerde actor van plaats @nl
definition: Relateert een plaats aan een actor die geassocieerd is met een plaats. @nl
toolkit label: gerelateerde actor van plaats @nl
toolkit definition: Een actor die geassocieerd is met een plaats. @nl
label: له وكيل مرتبط بمكان @ar
definition: يربط بين مكان ووكيل مرتبط بمكان. @ar
toolkit label: وكيل مرتبط بمكان @ar
toolkit definition: وكيل مرتبط بمكان. @ar
toolkit label: agent relacionat amb un lloc @ca
toolkit definition: Agent que s’associa amb un lloc. @ca
toolkit label: agent relateret til sted @da
toolkit definition: Agent, som er knyttet til et sted. @da
label: kohaga seotud tegija @et
definition: Seostab koha kohaga seotud tegijaga. @et
toolkit label: kohaga seotud tegija @et
toolkit definition: Kohaga seotud tegija. @et
label: hat mit Geografikum in Beziehung stehenden Akteur @de
definition: Setzt ein Geografikum in Beziehung zu einem Akteur, der mit einem Geografikum in Verbindung steht. @de
toolkit label: mit Geografikum in Beziehung stehender Akteur @de
toolkit definition: Ein Akteur, der mit einem Geografikum in Verbindung steht. @de
toolkit label: hely kapcsolódó ágense: @hu
toolkit definition: Egy ágens, amelyet egy helyhez társítanak. @hu
label: ha come agente correlato di luogo @it
definition: Correla un luogo a un agente associato a un luogo. @it
toolkit label: agente correlato di luogo @it
toolkit definition: Agente associato a un luogo. @it
label: ar vietu saistītais aģents @lv
definition: Sasaista vietu ar aģentu, kas saistīts ar vietu. @lv
toolkit label: ar vietu saistītais aģents @lv
toolkit definition: Aģents, kas saistīts ar vietu. @lv
has subproperty: has related collective agent of place
has subproperty: has related person of place
has subproperty: P70008
label: 有地点的关联行为者 @zh-hans
definition: 将一个地点与和一个地点有关的一个行为者关联起来。 @zh-hans
toolkit label: 地点的关联行为者 @zh-hans
toolkit definition: 和一个地点有关的一个行为者 @zh-hans
label: yerin ilgili temsilcisi ile ilişkilidir @tr
definition: Bir yeri, bir yerle bağlantılı olan bir temsilciyle ilişkilendirir. @tr
toolkit label: Yerin ilişkili temsilcisi @tr
toolkit definition: Bir yerle bağlantılı olan bir temsilci. @tr

has related family of place
status: Published
sub property of: has related collective agent of place
type: Property
lexical alias: relatedFamilyOfPlace.en
definition: Relates a place to a family who is associated with a place.
domain: C10009
label: har familie relateret til sted @da
definition: Relaterer et sted til en familie, som er knyttet til et sted. @da
label: có gia đình có liên quan (địa điểm) @vi
definition: Liên kết địa điểm với gia đình liên quan tới địa điểm đang được mô tả. @vi
label: té com a família relacionada amb un lloc @ca
definition: Relaciona un lloc amb una família que s’associa amb un lloc. @ca
definition: Liittää paikan sukuun, johon paikka liittyy. @fi
label: a pour famille en relation avec un lieu @fr
definition: Met un lieu en relation avec une famille qui est associée à un lieu. @fr
label: έχει σχετική οικογένεια (τόπος) @el
definition: Συνδέει έναν τόπο με μια οικογένεια που συνδέεται με έναν περιγραφόμενο τόπο. @el
toolkit label: related family of place
toolkit definition: A family who is associated with a place.
has element type: 1
sub property of: P00008
label: hely kapcsolódó családja a következő: @hu
definition: Hozzákapcsol egy helyet egy családhoz, amelyet egy helyhez társítanak. @hu
alternative label: place associated with family of
toolkit label: paikkaan liittyvä suku @fi
toolkit definition: Suku, johon paikka liittyy. @fi
label: paikkaan liittyvä suku @fi
label: har familie relatert til sted @no
definition: Relaterer et sted til en familie som forbindes med et sted. @no
alternative label: sted forbundet med familie for @no
toolkit label: familie relatert til sted @no
toolkit definition: En familie som forbindes med et sted. @no
alternative label: lieu associé à une famille de @fr
toolkit label: famille en relation avec un lieu @fr
toolkit definition: Famille qui est associée à un lieu. @fr
label: heeft gerelateerde familie van plaats @nl
definition: Relateert een plaats aan een familie die geassocieerd is met een plaats. @nl
toolkit label: gerelateerde familie van plaats @nl
toolkit definition: Een familie die geassocieerd is met een plaats. @nl
label: له عائلة مرتبطة بمكان @ar
definition: يربط بين مكان وعائلة مرتبطة بمكان. @ar
alternative label: مكان مرتبط بعائلة لـ @ar
toolkit label: عائلة مرتبطة بمكان @ar
toolkit definition: عائلة مرتبطة بمكان. @ar
alternative label: lloc associat amb una família de @ca
toolkit label: família relacionada amb un lloc @ca
toolkit definition: Família que s’associa amb un lloc. @ca
alternative label: sted, som er knyttet til familie af @da
toolkit label: familie relateret til sted @da
toolkit definition: Familie, som er knyttet til et sted. @da
label: kohaga seotud perekond @et
definition: Seostab koha kohaga seotud perekonnaga. @et
toolkit label: kohaga seotud perekond @et
toolkit definition: Kohaga seotud perekond. @et
label: hat mit Geografikum in Beziehung stehende Familie @de
definition: Setzt ein Geografikum in Beziehung zu einer Familie, die mit einem Geografikum in Verbindung steht. @de
toolkit label: mit Geografikum in Beziehung stehende Familie @de
toolkit definition: Eine Familie, die mit einem Geografikum in Verbindung steht. @de
alternative label: a következő családhoz társított hely: @hu
toolkit label: hely kapcsolódó családja: @hu
toolkit definition: Egy család, amelyet egy helyhez társítanak. @hu
label: ha come famiglia correlata di luogo @it
definition: Correla un luogo a una famiglia associata a un luogo. @it
alternative label: luogo associato a famiglia di @it
toolkit label: famiglia correlata di luogo @it
toolkit definition: Famiglia associata a un luogo. @it
label: ar vietu saistītā dzimta/ģimene @lv
definition: Sasaista vietu ar dzimtu/ģimeni, kas saistīta ar vietu. @lv
toolkit label: ar vietu saistītā dzimta/ģimene @lv
toolkit definition: Dzimta/ģimene, kas saistīta ar vietu. @lv
has subproperty: P70015
alternative label: 和……的家族有关的地点 @zh-hans
label: 有地点的关联家族 @zh-hans
definition: 将一个地点与和一个地点有关的一个家族关联起来。 @zh-hans
toolkit label: 地点的关联家族 @zh-hans
toolkit definition: 和一个地点有关的一个家族 @zh-hans
alternative label: Ailesi ile ilgili yer @tr
label: yerin ilgili ailesi ile ilişkilidir @tr
toolkit label: Yerle ilişkili aile @tr
toolkit definition: Bir yerle bağlantılı olan bir aile. @tr

has related place of place
status: Published
type: Property
lexical alias: relatedPlaceOfPlace.en
definition: Relates a place to a place that is associated with a place.
domain: C10009
sub property of: has related RDA entity of place
label: har sted relateret til sted @da
definition: Relaterer et sted til et sted, som er knyttet til et sted. @da
label: có địa điểm có liên quan (địa điểm) @vi
definition: Liên kết địa điểm với địa điểm liên quan tới địa điểm đang được mô tả. @vi
label: té com a lloc relacionat amb un lloc @ca
definition: Relaciona un lloc amb un lloc que s’associa amb un lloc. @ca
definition: Liittää paikan paikkaan, johon paikka liittyy. @fi
label: a pour lieu en relation avec un lieu @fr
definition: Met un lieu en relation avec un lieu qui est associé à un lieu. @fr
label: έχει σχετικό τόπο (τόπος) @el
definition: Συνδέει έναν τόπο με έναν τόπο που συνδέεται με έναν περιγραφόμενο τόπο. @el
toolkit label: related place of place
toolkit definition: A place that is associated with a place.
has element type: 1
sub property of: P00010
label: hely kapcsolódó helye a következő: @hu
definition: Hozzákapcsol egy helyet egy helyhez, amelyet egy helyhez társítanak. @hu
toolkit label: paikkaan liittyvä paikka @fi
toolkit definition: Paikka, johon paikka liittyy. @fi
label: paikkaan liittyvä paikka @fi
label: har sted relatert til sted @no
definition: Relaterer et sted til et sted som forbindes med et sted. @no
toolkit label: sted relatert til sted @no
toolkit definition: Et sted som forbindes med et sted. @no
toolkit label: lieu en relation avec un lieu @fr
toolkit definition: Lieu qui est associé à un lieu. @fr
label: heeft gerelateerde plaats van plaats @nl
definition: Relateert een plaats aan een plaats die geassocieerd is met een plaats. @nl
toolkit label: gerelateerde plaats van plaats @nl
toolkit definition: Een plaats die geassocieerd is met een plaats. @nl
label: له مكان مرتبط بمكان @ar
definition: يربط بين مكان ومكان مرتبط بمكان. @ar
toolkit label: مكان مرتبط بمكان @ar
toolkit definition: مكان مرتبط بمكان. @ar
toolkit label: lloc relacionat amb un lloc @ca
toolkit definition: Lloc que s’associa amb un lloc. @ca
toolkit label: sted relateret til sted @da
toolkit definition: Sted, som er knyttet til et sted. @da
label: kohaga seotud koht @et
definition: Seostab koha kohaga seotud kohaga. @et
toolkit label: kohaga seotud koht @et
toolkit definition: Kohaga seotud koht. @et
label: hat mit Geografikum in Beziehung stehendes Geografikum @de
definition: Setzt ein Geografikum in Beziehung zu einem Geografikum, das mit einem Geografikum in Verbindung steht. @de
toolkit label: mit Geografikum in Beziehung stehendes Geografikum @de
toolkit definition: Ein Geografikum, das mit einem Geografikum in Verbindung steht. @de
toolkit label: hely kapcsolódó helye: @hu
toolkit definition: Egy hely, amelyet egy helyhez társítanak. @hu
label: ha come luogo correlato di luogo @it
definition: Correla un luogo a un luogo associato a un luogo. @it
toolkit label: luogo correlato di luogo @it
toolkit definition: Luogo associato a un luogo. @it
label: ar vietu saistītā vieta @lv
definition: Sasaista vietu ar vietu, kas saistīta ar vietu. @lv
toolkit label: ar vietu saistītā vieta @lv
toolkit definition: Vieta, kas saistīta ar vietu. @lv
has subproperty: is part of place
has subproperty: has part place
has subproperty: P70010
label: 有地点的关联地点 @zh-hans
definition: 将一个地点与和一个地点有关的一个地点关联起来。 @zh-hans
toolkit label: 地点的关联地点 @zh-hans
toolkit definition: 和一个地点有关的一个地点 @zh-hans
label: yerin ilgili yeri ile ilişkilidir @tr
definition: Bir yeri, bir yerle ilişkili bir yerle ilişkilendirir. @tr
toolkit label: Yerle ilişkili yer @tr
toolkit definition: Bir yerle bağlantılı olan bir yer. @tr

has related timespan of place
status: Published
type: Property
lexical alias: relatedTimespanOfPlace.en
definition: Relates a place to a timespan that is associated with a place.
domain: C10009
sub property of: has related RDA entity of place
label: har tidsperiode relateret til sted @da
definition: Relaterer et sted til en tidsperiode, som er knyttet til et sted. @da
label: có khung thời gian có liên quan (địa điểm) @vi
definition: Liên kết địa điểm với khung thời gian liên quan tới địa điểm đang được mô tả. @vi
label: té com a interval de temps relacionat amb un lloc @ca
definition: Relaciona un lloc amb un interval de temps que s’associa amb un lloc. @ca
definition: Liittää paikan ajankohtaan, johon paikka liittyy. @fi
label: a pour laps de temps en relation avec un lieu @fr
definition: Met un lieu en relation avec un laps de temps qui est associé à un lieu. @fr
label: έχει σχετικό χρονικό διάστημα (τόπος) @el
definition: Συνδέει έναν τόπο με ένα χρονικό διάστημα που συνδέεται με έναν περιγραφόμενο τόπο. @el
toolkit label: related timespan of place
toolkit definition: A timespan that is associated with a place.
has element type: 1
sub property of: P00011
label: hely kapcsolódó időtartama a következő: @hu
definition: Hozzákapcsol egy helyet egy időtartamhoz, amelyet egy helyhez társítanak. @hu
toolkit label: paikkaan liittyvä ajankohta @fi
toolkit definition: Ajankohta, johon paikka liittyy. @fi
label: paikkaan liittyvä ajankohta @fi
label: har tidsrom relatert til sted @no
definition: Relaterer et sted til et tidsrom som forbindes med et sted. @no
toolkit label: tidsrom relatert til sted @no
toolkit definition: Et tidsrom som forbindes med et sted. @no
toolkit label: laps de temps en relation avec un lieu @fr
toolkit definition: Laps de temps qui est associé à un lieu. @fr
label: heeft gerelateerde tijdspanne van plaats @nl
definition: Relateert een plaats aan een tijdspanne die geassocieerd is met een plaats. @nl
toolkit label: gerelateerde tijdspanne van plaats @nl
toolkit definition: Een tijdspanne die geassocieerd is met een plaats. @nl
label: له فترة زمنية مرتبطة بمكان @ar
definition: يربط بين مكان وفترة زمنية مرتبطة بمكان. @ar
toolkit label: فترة زمنية مرتبطة بمكان @ar
toolkit definition: فترة زمنية مرتبطة بمكان. @ar
toolkit label: interval de temps relacionat amb un lloc @ca
toolkit definition: Interval de temps que s’associa amb un lloc. @ca
toolkit label: tidsperiode relateret til sted @da
toolkit definition: Tidsperiode, som er knyttet til et sted. @da
label: kohaga seotud ajavahemik @et
definition: Seostab koha kohaga seotud ajavahemikuga. @et
toolkit label: kohaga seotud ajavahemik @et
toolkit definition: Kohaga seotud ajavahemik. @et
label: hat mit Geografikum in Beziehung stehenden Zeitraum @de
definition: Setzt ein Geografikum in Beziehung zu einem Zeitraum, der mit einem Geografikum in Verbindung steht. @de
toolkit label: mit Geografikum in Beziehung stehender Zeitraum @de
toolkit definition: Ein Zeitraum, der mit einem Geografikum in Verbindung steht. @de
toolkit label: hely kapcsolódó időtartama: @hu
toolkit definition: Egy időtartam, amelyet egy helyhez társítanak. @hu
label: ha come arco di tempo correlato di luogo @it
definition: Correla un luogo a un arco di tempo associato a un luogo. @it
toolkit label: arco di tempo correlato di luogo @it
toolkit definition: Arco di tempo associato a un luogo. @it
label: ar vietu saistītais laikposms @lv
definition: Sasaista vietu ar laikposmu, kas saistīts ar vietu. @lv
toolkit label: ar vietu saistītais laikposms @lv
toolkit definition: Laikposms, kas saistīts ar vietu. @lv
has subproperty: P70011
label: 有地点的关联时间段 @zh-hans
definition: 将一个地点与和一个地点有关的一个时间段关联起来。 @zh-hans
toolkit label: 地点的关联时间段 @zh-hans
toolkit definition: 和一个地点有关的一个时间段 @zh-hans
label: yerin ilgili zaman aralığı ile ilişkilidir @tr
definition: Bir yeri, bir yerle bağlantılı olan bir zaman aralığıyla ilişkilendirir. @tr
toolkit label: Yerin zaman aralığıyla ilişkisi @tr
toolkit definition: Bir yerle bağlantılı olan bir zaman aralığı. @tr

has related expression of place
status: Published
type: Property
lexical alias: relatedExpressionOfPlace.en
definition: Relates a place to an expression that is associated with a place.
domain: C10009
sub property of: has related RDA entity of place
label: har udtryk relateret til sted @da
definition: Relaterer et sted til et udtryk, som er knyttet til et sted. @da
label: có biểu hiện có liên quan (địa điểm) @vi
definition: Liên kết địa điểm với biểu hiện liên quan tới địa điểm đang được mô tả. @vi
label: té com a expressió relacionada amb un lloc @ca
definition: Relaciona un lloc amb una expressió que s’associa amb un lloc. @ca
definition: Liittää paikan ekspressioon, johon paikka liittyy. @fi
label: a pour expression en relation avec un lieu @fr
definition: Met un lieu en relation avec une expression qui est associée à un lieu. @fr
label: έχει σχετική έκφραση (τόπος) @el
definition: Συνδέει έναν τόπο με μια έκφραση που συνδέεται με έναν περιγραφόμενο τόπο. @el
toolkit label: related expression of place
toolkit definition: An expression that is associated with a place.
has element type: 1
sub property of: P00003
label: hely kapcsolódó kifejezési formája a következő: @hu
definition: Hozzákapcsol egy helyet egy kifejezési formához, amelyet egy helyhez társítanak. @hu
toolkit label: paikkaan liittyvä ekspressio @fi
toolkit definition: Ekspressio, johon paikka liittyy. @fi
label: paikkaan liittyvä ekspressio @fi
label: har uttrykk relatert til sted @no
definition: Relaterer et sted til et uttrykk som forbindes med et sted. @no
toolkit label: uttrykk relatert til sted @no
toolkit definition: Et uttrykk som forbindes med et sted. @no
toolkit label: expression en relation avec un lieu @fr
toolkit definition: Expression qui est associée à un lieu. @fr
label: heeft gerelateerde expressie van plaats @nl
definition: Relateert een plaats aan een expressie die geassocieerd is met een plaats. @nl
toolkit label: gerelateerde expressie van plaats @nl
toolkit definition: Een expressie die geassocieerd is met een plaats. @nl
label: له تعبيرة مرتبطة بمكان @ar
definition: يربط بين مكان وتعبيرة مرتبطة بمكان. @ar
toolkit label: تعبيرة مرتبطة بمكان @ar
toolkit definition: تعبيرة مرتبطة بمكان. @ar
toolkit label: expressió relacionada amb un lloc @ca
toolkit definition: Expressió que s’associa amb un lloc. @ca
toolkit label: udtryk relateret til sted @da
toolkit definition: Udtryk, som er knyttet til et sted. @da
label: kohaga seotud väljendus @et
definition: Seostab koha kohaga seotud väljendusega. @et
toolkit label: kohaga seotud väljendus @et
toolkit definition: Kohaga seotud väljendus. @et
label: hat mit Geografikum in Beziehung stehende Expression @de
definition: Setzt ein Geografikum in Beziehung zu einer Expression, die mit einem Geografikum in Verbindung steht. @de
toolkit label: mit Geografikum in Beziehung stehende Expression @de
toolkit definition: Eine Expression, die mit einem Geografikum in Verbindung steht. @de
toolkit label: hely kapcsolódó kifejezési formája @hu
toolkit definition: Egy kifejezési forma, amelyet egy helyhez társítanak. @hu
label: ha come espressione correlata di luogo @it
definition: Correla un luogo a un'espressione associata a un luogo. @it
toolkit label: espressione correlata di luogo @it
toolkit definition: Espressione associata a un luogo. @it
label: ar vietu saistītā izteiksme @lv
definition: Sasaista vietu ar izteiksmi, kas ir saistīta ar vietu. @lv
toolkit label: ar vietu saistītā izteiksme @lv
toolkit definition: Izteiksme, kas ir saistīta ar vietu. @lv
has subproperty: is place of capture of
has subproperty: P70005
label: 有地点的关联内容表达 @zh-hans
definition: 将一个地点与和一个地点有关的一种内容表达关联起来。 @zh-hans
toolkit label: 地点的关联内容表达 @zh-hans
toolkit definition: 和一个地点有关的一种内容表达 @zh-hans
label: yerin ilgili anlatımı ile ilişkilidir @tr
definition: Bir yeri, bir yerle bağlantılı olan bir anlatımla ilişkilendirir. @tr
toolkit label: Yerin ilişkili anlatımı @tr
toolkit definition: Bir yerle bağlantılı olan bir anlatım. @tr

has related collective agent of place
status: Published
type: Property
lexical alias: relatedCollectiveAgentOfPlace.en
definition: Relates a place to a collective agent who is associated with a place.
domain: C10009
sub property of: has related agent of place
label: har kollektiv agent relateret til sted @da
definition: Relaterer et sted til en kollektiv agent, som er knyttet til et sted. @da
label: có tác nhân tập thể có liên quan (địa điểm) @vi
definition: Liên kết địa điểm với tác nhân tập thể liên quan tới địa điểm đang được mô tả. @vi
label: té com a agent col·lectiu relacionat amb un lloc @ca
definition: Relaciona un lloc amb un agent col·lectiu que s’associa amb un lloc. @ca
definition: Liittää paikan yhteistoimijaan, johon kuvailun kohteena oleva paikka liittyy. @fi
label: a pour agent collectif en relation avec un lieu @fr
definition: Met un lieu en relation avec un agent collectif qui est associé à un lieu. @fr
label: έχει σχετικό συλλογικό φορέα (τόπος) @el
definition: Συνδέει έναν τόπο με έναν συλλογικό φορέα που συνδέεται με έναν περιγραφόμενο τόπο. @el
toolkit label: related collective agent of place
toolkit definition: A collective agent who is associated with a place.
has element type: 1
sub property of: P00012
label: hely kapcsolódó kollektív ágense a következő: @hu
definition: Hozzákapcsol egy helyet egy kollektív ágenshez, amelyet egy helyhez társítanak. @hu
toolkit label: paikkaan liittyvä yhteistoimija @fi
toolkit definition: Yhteistoimija, johon kuvailun kohteena oleva paikka liittyy. @fi
label: paikkaan liittyvä yhteistoimija @fi
label: har kollektiv agent relatert til sted @no
definition: Relaterer et sted til en kollektiv agent som forbindes med et sted. @no
toolkit label: kollektiv agent relatert til sted @no
toolkit definition: En kollektiv agent som forbindes med et sted. @no
toolkit label: agent collectif en relation avec un lieu @fr
toolkit definition: Agent collectif qui est associé à un lieu. @fr
label: heeft gerelateerde collectieve actor van plaats @nl
definition: Relateert een plaats aan een collectieve actor die geassocieerd is met een plaats. @nl
toolkit label: gerelateerde collectieve actor van plaats @nl
toolkit definition: Een collectieve actor die geassocieerd is met een plaats. @nl
label: له وكيل جماعي مرتبط بمكان @ar
definition: يربط بين مكان ووكيل جماعي مرتبط بمكان. @ar
toolkit label: وكيل جماعي مرتبط بمكان @ar
toolkit definition: وكيل جماعي مرتبط بمكان. @ar
toolkit label: agent col·lectiu relacionat amb un lloc @ca
toolkit definition: Agent col·lectiu que s’associa amb un lloc. @ca
toolkit label: kollektiv agent relateret til sted @da
toolkit definition: Kollektiv agent, som er knyttet til et sted. @da
label: kohaga seotud kollektiiv @et
definition: Seostab koha kohaga seotud kollektiiviga. @et
toolkit label: kohaga seotud kollektiiv @et
toolkit definition: Kohaga seotud kollektiiv. @et
label: hat mit Geografikum in Beziehung stehenden gemeinschaftlichen Akteur @de
definition: Setzt ein Geografikum in Beziehung zu einem gemeinschaftlichen Akteur, der mit einem Geografikum in Verbindung steht. @de
toolkit label: mit Geografikum in Beziehung stehender gemeinschaftlicher Akteur @de
toolkit definition: Ein gemeinschaftlicher Akteur, der mit einem Geografikum in Verbindung steht. @de
toolkit label: hely kapcsolódó kollektív ágense: @hu
toolkit definition: Egy kollektív ágens, amelyet egy helyhez társítanak. @hu
label: ha come agente collettivo correlato di luogo @it
definition: Correla un luogo a un agente collettivo associato a un luogo. @it
toolkit label: agente collettivo correlato di luogo @it
toolkit definition: Agente collettivo associato a un luogo. @it
label: ar vietu saistītā grupa @lv
definition: Sasaista vietu ar grupu, kas saistīta ar vietu. @lv
toolkit label: ar vietu saistītā grupa @lv
toolkit definition: Grupa, kas saistīta ar vietu. @lv
has subproperty: has related family of place
has subproperty: has related corporate body of place
has subproperty: P70009
label: 有地点的关联集体行为者 @zh-hans
definition: 将一个地点与和一个地点有关的一个集体行为者关联起来。 @zh-hans
toolkit label: 地点的关联集体行为者 @zh-hans
toolkit definition: 和一个地点有关的一个集体行为者 @zh-hans
label: yerin ilgili kolektif temsilcisi ile ilişkilidir @tr
definition: Bir yeri, bir yerle ibağlantılı olan kolektif bir temsilciyle ilişkilendirir. @tr
toolkit label: Yerin kolektif temsilciyle ilişkisi @tr
toolkit definition: Bir yerle ilişkilendirilen kolektif bir temsilci. @tr

has related manifestation of place
status: Published
type: Property
lexical alias: relatedManifestationOfPlace.en
definition: Relates a place to a manifestation that is associated with a place.
domain: C10009
sub property of: has related RDA entity of place
label: har manifestation relateret til sted @da
definition: Relaterer et sted til en manifestation, som er knyttet til et sted. @da
label: có biểu thị có liên quan (địa điểm) @vi
definition: Liên kết địa điểm với biểu thị liên quan tới địa điểm đang được mô tả. @vi
label: té com a manifestació relacionada amb un lloc @ca
definition: Relaciona un lloc amb una manifestació que s’associa amb un lloc. @ca
definition: Liittää paikan manifestaatioon, johon paikka liittyy. @fi
label: a pour manifestation en relation avec un lieu @fr
definition: Met un lieu en relation avec une manifestation qui est associée à un lieu. @fr
label: έχει σχετική εκδήλωση (τόπος) @el
definition: Συνδέει έναν τόπο με μια εκδήλωση που συνδέεται με έναν περιγραφόμενο τόπο. @el
toolkit label: related manifestation of place
toolkit definition: A manifestation that is associated with a place.
has element type: 1
sub property of: P00004
label: hely kapcsolódó megjelenési formája a következő: @hu
definition: Hozzákapcsol egy helyet egy megjelenési formához, amelyet egy helyhez társítanak. @hu
toolkit label: paikkaan liittyvä manifestaatio @fi
toolkit definition: Manifestaatio, johon paikka liittyy. @fi
label: paikkaan liittyvä manifestaatio @fi
label: har manifestasjon relatert til sted @no
definition: Relaterer et sted til en manifestasjon som forbindes med et sted. @no
toolkit label: manifestasjon relatert til sted @no
toolkit definition: En manifestasjon som forbindes med et sted. @no
toolkit label: manifestation en relation avec un lieu @fr
toolkit definition: Manifestation qui est associée à un lieu. @fr
label: heeft gerelateerde manifestatie van plaats @nl
definition: Relateert een plaats aan een manifestatie die geassocieerd is met een plaats. @nl
toolkit label: gerelateerde manifestatie van plaats @nl
toolkit definition: Een manifestatie die geassocieerd is met een plaats. @nl
label: له تجسيدة مرتبطة بمكان @ar
definition: يربط بين مكان وتجسيدة مرتبطة بمكان. @ar
toolkit label: تجسيدة مرتبطة بمكان @ar
toolkit definition: تجسيدة مرتبطة بمكان. @ar
toolkit label: manifestació relacionada amb un lloc @ca
toolkit definition: Manifestació que s’associa amb un lloc. @ca
toolkit label: manifestation relateret til sted @da
toolkit definition: Manifestation, som er knyttet til et sted. @da
label: kohaga seotud kehastus @et
definition: Seostab koha kohaga seotud kehastusega. @et
toolkit label: kohaga seotud kehastus @et
toolkit definition: Kohaga seotud kehastus. @et
label: hat mit Geografikum in Beziehung stehende Manifestation @de
definition: Setzt ein Geografikum in Beziehung zu einer Manifestation, die mit einem Geografikum in Verbindung steht. @de
toolkit label: mit Geografikum in Beziehung stehende Manifestation @de
toolkit definition: Eine Manifestation, die mit einem Geografikum in Verbindung steht. @de
toolkit label: hely kapcsolódó megjelenési formája @hu
toolkit definition: Egy megjelenési forma, amelyet egy helyhez társítanak. @hu
label: ha come manifestazione correlata di luogo @it
definition: Correla un luogo a una manifestazione associata a un luogo. @it
toolkit label: manifestazione correlata di luogo @it
toolkit definition: Manifestazione associata a un luogo. @it
label: ar vietu saistītā manifestācija @lv
definition: Sasaista vietu ar manifestāciju, kas ir saistīta ar vietu. @lv
toolkit label: ar vietu saistītā manifestācija @lv
toolkit definition: Manifestācija, kas ir saistīta ar vietu. @lv
has subproperty: is place of manifestation of
has subproperty: is location of collection of
has subproperty: P70006
label: 有地点的关联载体表现 @zh-hans
definition: 将一个地点与和一个地点有关的一种载体表现关联起来。 @zh-hans
toolkit label: 地点的关联载体表现 @zh-hans
toolkit definition: 和一个地点有关的一种载体表现 @zh-hans
label: yerin ilgili gösterimi ile ilişkilidir @tr
definition: Bir yeri, bir yerle bağlantılı olan bir gösterim ile ilişkilendirir. @tr
toolkit label: Yerin ilişkili gösterimi @tr
toolkit definition: Bir yerle bağlantılı olan bir gösterim. @tr

has related work of place
status: Published
type: Property
lexical alias: relatedWorkOfPlace.en
definition: Relates a place to a work that is associated with a place.
domain: C10009
sub property of: has related RDA entity of place
label: har værk relateret til sted @da
definition: Relaterer et sted til et værk, som er knyttet til et sted. @da
label: có tác phẩm có liên quan (địa điểm) @vi
definition: Liên kết địa điểm với tác phẩm liên quan tới địa điểm đang được mô tả. @vi
label: té com a obra relacionada amb un lloc @ca
definition: Relaciona un lloc amb una obra que s’associa amb un lloc. @ca
definition: Liittää paikan teokseen, johon paikka liittyy. @fi
label: a pour œuvre en relation avec un lieu @fr
definition: Met un lieu en relation avec une œuvre qui est associée à un lieu. @fr
label: έχει σχετικό έργο (τόπος) @el
definition: Συνδέει έναν τόπο με ένα έργο που συνδέεται με έναν περιγραφόμενο τόπο. @el
toolkit label: related work of place
toolkit definition: A work that is associated with a place.
has element type: 1
sub property of: P00002
label: hely kapcsolódó műve a következő: @hu
definition: Hozzákapcsol egy helyet egy műhöz, amelyet egy helyhez társítanak. @hu
toolkit label: paikkaan liittyvä teos @fi
toolkit definition: Teos, johon paikka liittyy. @fi
label: paikkaan liittyvä teos @fi
label: har verk relatert til sted @no
definition: Relaterer et sted til et verk som forbindes med et sted. @no
toolkit label: verk relatert til sted @no
toolkit definition: Et verk som forbindes med et sted. @no
toolkit label: œuvre en relation avec un lieu @fr
toolkit definition: Œuvre qui est associée à un lieu. @fr
label: heeft gerelateerd werk van plaats @nl
definition: Relateert een plaats aan een werk dat geassocieerd is met een plaats. @nl
toolkit label: gerelateerd werk van plaats @nl
toolkit definition: Een werk dat geassocieerd is met een plaats. @nl
label: له عمل مرتبط بمكان @ar
definition: يربط بين مكان وعمل مرتبط بمكان. @ar
toolkit label: عمل مرتبط بمكان @ar
toolkit definition: عمل مرتبط بمكان. @ar
toolkit label: obra relacionada amb un lloc @ca
toolkit definition: Obra que s’associa amb un lloc. @ca
toolkit label: værk relateret til sted @da
toolkit definition: Værk, som er knyttet til et sted. @da
label: kohaga seotud teos @et
definition: Seostab koha kohaga seotud teosega. @et
toolkit label: kohaga seotud teos @et
toolkit definition: Kohaga seotud teos. @et
label: hat mit Geografikum in Beziehung stehendes Werk @de
definition: Setzt ein Geografikum in Beziehung zu einem Werk, das mit einem Geografikum in Verbindung steht. @de
toolkit label: mit Geografikum in Beziehung stehendes Werk @de
toolkit definition: Ein Werk, das mit einem Geografikum in Verbindung steht. @de
toolkit label: hely kapcsolódó műve @hu
toolkit definition: Egy mű, amelyet egy helyhez társítanak. @hu
label: ha come opera correlata di luogo @it
definition: Correla un luogo a un'opera associata a un luogo. @it
toolkit label: opera correlata di luogo @it
toolkit definition: Opera associata a un luogo. @it
label: ar vietu saistītais darbs @lv
definition: Sasaista vietu ar darbu, kas saistīts ar vietu. @lv
toolkit label: ar vietu saistītais darbs @lv
toolkit definition: Darbs, kas saistīts ar vietu. @lv
has subproperty: is coordinates of cartographic content of
has subproperty: is subject place of
has subproperty: is place of capture of representative expression of
has subproperty: is place of origin of work of
has subproperty: P70004
label: 有地点的关联作品 @zh-hans
definition: 将一个地点与和一个地点有关的一种作品关联起来。 @zh-hans
toolkit label: 地点的关联作品 @zh-hans
toolkit definition: 和一个地点有关的一种作品 @zh-hans
label: yerin ilgili eseri ile ilişkilidir @tr
definition: Bir yeri, bir yerle bağlantılı olan bir eserle ilişkilendirir. @tr
toolkit label: Yerle ilişkili eser @tr
toolkit definition: Bir yerle bağlantılı olan bir eser. @tr

has related nomen of place
status: Published
type: Property
lexical alias: relatedNomenOfPlace.en
definition: Relates a place to a nomen that is associated with a place.
domain: C10009
sub property of: has related RDA entity of place
label: har nomen relateret til sted @da
definition: Relaterer et sted til et nomen, som er knyttet til et sted. @da
label: có danh pháp có liên quan (địa điểm) @vi
definition: Liên kết địa điểm với danh pháp liên quan tới địa điểm đang được mô tả. @vi
label: té com a nomen relacionat amb un lloc @ca
definition: Relaciona un lloc amb un nomen que s’associa amb un lloc. @ca
definition: Liittää paikan nomeniin, johon paikka liittyy. @fi
label: a pour nomen en relation avec un lieu @fr
definition: Met un lieu en relation avec un nomen qui est associé à un lieu. @fr
label: έχει σχετικό όνομα (τόπος) @el
definition: Συνδέει έναν τόπο με ένα όνομα που συνδέεται με έναν περιγραφόμενο τόπο. @el
toolkit label: related nomen of place
toolkit definition: A nomen that is associated with a place.
has element type: 1
sub property of: P00013
label: hely kapcsolódó nomenje a következő: @hu
definition: Hozzákapcsol egy helyet egy nomenhez, amelyet egy helyhez társítanak. @hu
toolkit label: paikkaan liittyvä nomen @fi
toolkit definition: Nomen, johon paikka liittyy. @fi
label: paikkaan liittyvä nomen @fi
label: har nomen relatert til sted @no
definition: Relaterer et sted til et nomen som forbindes med et sted. @no
toolkit label: nomen relatert til sted @no
toolkit definition: Et nomen som forbindes med et sted. @no
toolkit label: nomen en relation avec un lieu @fr
toolkit definition: Nomen qui est associé à un lieu. @fr
label: heeft gerelateerde nomen van plaats @nl
definition: Relateert een plaats aan een nomen dat geassocieerd is met een plaats. @nl
toolkit label: gerelateerde nomen van plaats @nl
toolkit definition: Een nomen dat geassocieerd is met een plaats. @nl
label: له تسمية مرتبطة بمكان @ar
definition: يربط بين مكان وتسمية مرتبطة بمكان. @ar
toolkit label: تسمية مرتبطة بمكان @ar
toolkit definition: تسمية مرتبطة بمكان. @ar
toolkit label: nomen relacionat amb un lloc @ca
toolkit definition: Nomen que s’associa amb un lloc. @ca
toolkit label: nomen relateret til sted @da
toolkit definition: Nomen, som er knyttet til et sted. @da
label: kohaga seotud nomen @et
definition: Seostab koha kohaga seotud nomen'iga. @et
toolkit label: kohaga seotud nomen @et
toolkit definition: Kohaga seotud nomen. @et
label: hat mit Geografikum in Beziehung stehendes Nomen @de
definition: Setzt ein Geografikum in Beziehung zu einem Nomen, das mit einem Geografikum in Verbindung steht. @de
toolkit label: mit Geografikum in Beziehung stehendes Nomen @de
toolkit definition: Ein Nomen, das mit einem Geografikum in Verbindung steht. @de
toolkit label: hely kapcsolódó nomenje: @hu
toolkit definition: Egy nomen, amelyet egy helyhez társítanak. @hu
label: ha come nomen correlato di luogo @it
definition: Correla un luogo a un nomen associato a un luogo. @it
toolkit label: nomen correlato di luogo @it
toolkit definition: Nomen associato a un luogo. @it
label: ar vietu saistītais nomens @lv
definition: Sasaista vietu ar nomenu, kas saistīts ar vietu. @lv
toolkit label: ar vietu saistītais nomens @lv
toolkit definition: Nomens, kas saistīts ar vietu. @lv
has subproperty: has appellation of place
has subproperty: P70012
label: 有地点的关联命名 @zh-hans
definition: 将一个地点与和一个地点有关的一个命名关联起来。 @zh-hans
toolkit label: 地点的关联命名 @zh-hans
toolkit definition: 和一个地点有关的一个命名 @zh-hans
label: yerin ilgili ismi ile ilişkilidir @tr
definition: Bir yeri, bir yerle bağlantılı olan bir isim ile ilişkilendirir. @tr
toolkit label: Yerin ilişkili ismi @tr
toolkit definition: Bir yerle bağlantılı olan bir isim. @tr

has related item of place
status: Published
type: Property
lexical alias: relatedItemOfPlace.en
definition: Relates a place to an item that is associated with a place.
domain: C10009
sub property of: has related RDA entity of place
label: har eksemplar relateret til sted @da
definition: Relaterer et sted til et eksemplar, som er knyttet til et sted. @da
label: có bản có liên quan (địa điểm) @vi
definition: Liên kết địa điểm với bản liên quan tới địa điểm đang được mô tả. @vi
label: té com a ítem relacionat amb un lloc @ca
definition: Relaciona un lloc amb un ítem que s’associa amb un lloc. @ca
definition: Liittää paikan kappaleeseen, johon paikka liittyy. @fi
label: a pour item en relation avec un lieu @fr
definition: Met un lieu en relation avec un item qui est associé à un lieu. @fr
label: έχει σχετικό αντίτυπο (τόπος) @el
definition: Συνδέει έναν τόπο με ένα αντίτυπο που συνδέεται με έναν περιγραφόμενο τόπο. @el
toolkit label: related item of place
toolkit definition: An item that is associated with a place.
has element type: 1
sub property of: P00005
label: hely kapcsolódó példánya a következő: @hu
definition: Hozzákapcsol egy helyet egy példányhoz, amelyet egy helyhez társítanak. @hu
toolkit label: paikkaan liittyvä kappale @fi
toolkit definition: Kappale, johon paikka liittyy. @fi
label: paikkaan liittyvä kappale @fi
label: har eksemplar relatert til sted @no
definition: Relaterer et sted til et eksemplar som forbindes med et sted. @no
toolkit label: eksemplar relatert til sted @no
toolkit definition: Et eksemplar som forbindes med et sted. @no
toolkit label: item en relation avec un lieu @fr
toolkit definition: Item qui est associé à un lieu. @fr
label: heeft gerelateerd item van plaats @nl
definition: Relateert een plaats aan een item dat geassocieerd is met een plaats. @nl
toolkit label: gerelateerd item van plaats @nl
toolkit definition: Een item dat geassocieerd is met een plaats. @nl
label: له مفردة مرتبطة بمكان @ar
definition: يربط بين مكان ومفردة مرتبطة بمكان. @ar
toolkit label: مفردة مرتبطة بمكان @ar
toolkit definition: مفردة مرتبطة بمكان. @ar
toolkit label: ítem relacionat amb un lloc @ca
toolkit definition: Ítem que s’associa amb un lloc. @ca
toolkit label: eksemplar relateret til sted @da
toolkit definition: Eksemplar, som er knyttet til et sted. @da
label: kohaga seotud eksemplar @et
definition: Seostab koha kohaga seotud eksemplariga. @et
toolkit label: kohaga seotud eksemplar @et
toolkit definition: Kohaga seotud eksemplar. @et
label: hat mit Geografikum in Beziehung stehendes Exemplar @de
definition: Setzt ein Geografikum in Beziehung zu einem Exemplar, das mit einem Geografikum in Verbindung steht. @de
toolkit label: mit Geografikum in Beziehung stehendes Exemplar @de
toolkit definition: Ein Exemplar, das mit einem Geografikum in Verbindung steht. @de
toolkit label: hely kapcsolódó példánya @hu
toolkit definition: Egy példány, amelyet egy helyhez társítanak. @hu
label: ha come item correlato di luogo @it
definition: Correla un luogo a un item associato a un luogo. @it
toolkit label: item correlato di luogo @it
toolkit definition: Item associato a un luogo. @it
label: ar vietu saistītā vienība @lv
definition: Sasaista vietu ar vienību, kas ir saistīta ar vietu. @lv
toolkit label: ar vietu saistītā vienība @lv
toolkit definition: Vienība, kas ir saistīta ar vietu. @lv
has subproperty: is location of item of
has subproperty: P70007
label: 有地点的关联单件 @zh-hans
definition: 将一个地点与和一个地点有关的一个单件关联起来。 @zh-hans
toolkit label: 地点的关联单件 @zh-hans
toolkit definition: 和一个地点有关的一个单件 @zh-hans
label: kopyanın ilgili kopyası ile ilişkilidir @tr
definition: Bir yeri, bir yerle bağlantılı olan bir kopyayla ilişkilendirir. @tr
toolkit label: Yer ile ilişkili kopya @tr
toolkit definition: Bir yerle bağlantılı olan bir kopya. @tr

has related person of place
status: Published
sub property of: has related agent of place
type: Property
lexical alias: relatedPersonOfPlace.en
definition: Relates a place to a person who is associated with a place.
domain: C10009
label: har person relateret til sted @da
definition: Relaterer et sted til en person, som er knyttet til et sted. @da
label: có cá nhân có liên quan (địa điểm) @vi
definition: Liên kết địa điểm với cá nhân liên quan tới địa điểm đang được mô tả. @vi
label: té com a persona relacionada amb un lloc @ca
definition: Relaciona un lloc amb una persona que s’associa amb un lloc. @ca
definition: Liittää paikan henkilöön, johon paikka liittyy. @fi
label: a pour personne en relation avec un lieu @fr
definition: Met un lieu en relation avec une personne qui est associée à un lieu. @fr
label: έχει σχετικό φυσικό πρόσωπο (τόπος) @el
definition: Συνδέει έναν τόπο με ένα φυσικό πρόσωπο που συνδέεται με έναν περιγραφόμενο τόπο. @el
toolkit label: related person of place
toolkit definition: A person who is associated with a place.
has element type: 1
sub property of: P00007
label: hely kapcsolódó személye a következő: @hu
definition: Hozzákapcsol egy helyet egy személyhez, akit egy helyhez társítanak. @hu
toolkit label: paikkaan liittyvä henkilö @fi
toolkit definition: Henkilö, johon paikka liittyy. @fi
label: paikkaan liittyvä henkilö @fi
label: har person relatert til sted @no
definition: Relaterer et sted til en person som forbindes med et sted. @no
toolkit label: person relatert til sted @no
toolkit definition: En person som forbindes med et sted. @no
toolkit label: personne en relation avec un lieu @fr
toolkit definition: Personne qui est associée à un lieu. @fr
label: heeft gerelateerde persoon van plaats @nl
definition: Relateert een plaats aan een persoon die geassocieerd is met een plaats. @nl
toolkit label: gerelateerde persoon van plaats @nl
toolkit definition: Een persoon die geassocieerd is met een plaats. @nl
label: له شخص مرتبط بمكان @ar
definition: يربط بين مكان وشخص مرتبط بمكان. @ar
toolkit label: شخص مرتبط بمكان @ar
toolkit definition: شخص مرتبط بمكان. @ar
toolkit label: persona relacionada amb un lloc @ca
toolkit definition: Persona que s’associa amb un lloc. @ca
toolkit label: person relateret til sted @da
toolkit definition: Person, som er knyttet til et sted. @da
label: kohaga seotud isik @et
definition: Seostab koha kohaga seotud isikuga. @et
toolkit label: kohaga seotud isik @et
toolkit definition: Kohaga seotud isik. @et
label: hat mit Geografikum in Beziehung stehende Person @de
definition: Setzt ein Geografikum in Beziehung zu einer Person, die mit einem Geografikum in Verbindung steht. @de
toolkit label: mit Geografikum in Beziehung stehende Person @de
toolkit definition: Eine Person, die mit einem Geografikum in Verbindung steht. @de
toolkit label: hely kapcsolódó személye @hu
toolkit definition: Egy személy, akit egy helyhez társítanak. @hu
label: ha come persona correlata di luogo @it
definition: Correla un luogo a una persona associata a un luogo. @it
toolkit label: persona correlata di luogo @it
toolkit definition: Persona associata a un luogo. @it
label: ar vietu saistītā persona @lv
definition: Sasaista vietu ar personu, kura saistīta ar vietu. @lv
toolkit label: ar vietu saistītā persona @lv
toolkit definition: Persona, kura saistīta ar vietu. @lv
has subproperty: is country associated with person of
has subproperty: is place of birth of
has subproperty: is place of death of
has subproperty: is place of residence of
has subproperty: P70014
label: 有地点的关联个人 @zh-hans
definition: 将一个地点与和一个地点有关的一个个人关联起来。 @zh-hans
toolkit label: 地点的关联个人 @zh-hans
toolkit definition: 和一个地点有关的一个个人 @zh-hans
label: yerin ilgili kişisi ile ilişkilidir @tr
definition: Bir yeri, bir yerle bağlantılı olan bir kişiyle ilişkilendirir. @tr
toolkit label: Yerle ilişkili kişi @tr
toolkit definition: Bir yerle bağlantılı olan bir kişi. @tr

has related corporate body of place
status: Published
sub property of: has related collective agent of place
type: Property
lexical alias: relatedCorporateBodyOfPlace.en
definition: Relates a place to a corporate body who is associated with a place.
domain: C10009
label: har korporation relateret til sted @da
definition: Relaterer et sted til en korporation, som er knyttet til et sted. @da
label: có tập thể có liên quan (địa điểm) @vi
definition: Liên kết địa điểm với tập thể liên quan tới địa điểm đang được mô tả. @vi
label: té com a entitat corporativa relacionada amb un lloc @ca
definition: Relaciona un lloc amb una entitat corporativa que s’associa amb un lloc. @ca
definition: Liittää paikan yhteisöön, johon paikka liittyy. @fi
label: a pour collectivité en relation avec un lieu @fr
definition: Met un lieu en relation avec une collectivité qui est associée à un lieu. @fr
label: έχει σχετικό συλλογικό όργανο (τόπος) @el
definition: Συνδέει έναν τόπο με ένα συλλογικό όργανο που συνδέεται με έναν περιγραφόμενο τόπο. @el
toolkit label: related corporate body of place
toolkit definition: A corporate body who is associated with a place.
has element type: 1
sub property of: P00009
label: hely kapcsolódó testülete a következő: @hu
definition: Hozzákapcsol egy helyet egy testülethez, amelyet egy helyhez társítanak. @hu
alternative label: place associated with corporate body of
toolkit label: paikkaan liittyvä yhteisö @fi
toolkit definition: Yhteisö, johon paikka liittyy. @fi
label: paikkaan liittyvä yhteisö @fi
label: har korporasjon relatert til sted @no
definition: Relaterer et sted til en korporasjon som forbindes med et sted. @no
alternative label: sted forbundet med korporasjon for @no
toolkit label: korporasjon relatert til sted @no
toolkit definition: En korporasjon som forbindes med et sted. @no
alternative label: lieu associé à une collectivité de @fr
toolkit label: collectivité en relation avec un lieu @fr
toolkit definition: Collectivité qui est associée à un lieu. @fr
label: heeft gerelateerde corporatie van plaats @nl
definition: Relateert een plaats aan een corporatie die geassocieerd is met een plaats. @nl
toolkit label: gerelateerde corporatie van plaats @nl
toolkit definition: Een corporatie die geassocieerd is met een plaats. @nl
label: له هيئة مرتبطة بمكان @ar
definition: يربط بين مكان وهيئة مرتبطة بمكان. @ar
alternative label: مكان مرتبط باسم هيئة لـ @ar
toolkit label: هيئة مرتبطة بمكان @ar
toolkit definition: هيئة مرتبطة بمكان. @ar
alternative label: lloc associat amb una entitat corporativa de @ca
toolkit label: entitat corporativa relacionada amb un lloc @ca
toolkit definition: Entitat corporativa que s’associa amb un lloc. @ca
alternative label: sted, som er knyttet til korporation af @da
toolkit label: korporation relateret til sted @da
toolkit definition: Korporation, som er knyttet til et sted. @da
label: kohaga seotud asutus @et
definition: Seostab koha kohaga seotud asutusega. @et
toolkit label: kohaga seotud asutus @et
toolkit definition: Kohaga seotud asutus. @et
label: hat mit Geografikum in Beziehung stehende Körperschaft @de
definition: Setzt ein Geografikum in Beziehung zu einer Körperschaft, die mit einem Geografikum in Verbindung steht. @de
toolkit label: mit Geografikum in Beziehung stehende Körperschaft @de
toolkit definition: Eine Körperschaft, die mit einem Geografikum in Verbindung steht. @de
alternative label: a testülethez társított hely @hu
toolkit label: hely kapcsolódó testülete: @hu
toolkit definition: Egy testület, amelyeyt egy helyhez társítanak. @hu
label: ha come ente correlato di luogo @it
definition: Correla un luogo a un ente associato a un luogo. @it
alternative label: luogo associato a ente di @it
toolkit label: ente correlato di luogo @it
toolkit definition: Ente associato a un luogo. @it
label: ar vietu saistītā institūcija @lv
definition: Sasaista vietu ar institūciju, kas saistīta ar vietu. @lv
toolkit label: ar vietu saistītā institūcija @lv
toolkit definition: Institūcija, kas saistīta ar vietu. @lv
has subproperty: is place governed by
has subproperty: is place of conference of
has subproperty: P70016
alternative label: 和……的团体有关的地点 @zh-hans
label: 有地点的关联团体 @zh-hans
definition: 将一个地点与和一个地点有关的一个团体关联起来。 @zh-hans
toolkit label: 地点的关联团体 @zh-hans
toolkit definition: 和一个地点有关的一个团体 @zh-hans
toolkit label: Yerin tüzel kişiyle ilişkisi @tr
toolkit definition: Bir yerle ilişkilendirilen bir tüzel kişi. @tr

has location
status: Published
type: Property
lexical alias: location.en
definition: Relates a place to a delimitation of the physical territory of the place.
domain: C10009
toolkit label: location
toolkit definition: A delimitation of the physical territory of a place.
has element type: 6
label: sijainti @fi
definition: Liittää paikan paikan fyysisen alueen rajaukseen. @fi
toolkit label: sijainti @fi
toolkit definition: Paikan fyysisen alueen rajaus. @fi
label: har lokalisering @no
definition: Relaterer et sted til en avgrensning av det fysiske området for et sted. @no
toolkit label: lokalisering @no
toolkit definition: En avgrensning av det fysiske området for et sted. @no
label: a pour emplacement @fr
definition: Met un lieu en relation avec une délimitation du territoire physique d’un lieu. @fr
toolkit label: emplacement @fr
toolkit definition: Délimitation du territoire physique d’un lieu. @fr
label: heeft locatie @nl
definition: Relateert een plaats aan een afbakening van het fysieke gebied van een plaats. @nl
toolkit label: locatie @nl
toolkit definition: Een afbakening van het fysieke gebied van een plaats. @nl
label: له موقع @ar
definition: يربط بين مكان وترسيم حدود الأراضي الطبيعية لمكان. @ar
toolkit label: موقع @ar
toolkit definition: ترسيم حدود الأراضي الطبيعية لمكان. @ar
label: té com a localització @ca
definition: Relaciona un lloc amb una delimitació del territori físic d’un lloc. @ca
toolkit label: localització @ca
toolkit definition: Delimitació del territori físic d’un lloc. @ca
label: har lokation @da
definition: Relaterer et sted til en afgrænsning af et steds fysiske område. @da
toolkit label: lokation @da
toolkit definition: Afgrænsning af et steds fysiske område. @da
label: asukoht @et
definition: Seostab koha koha füüsilise territooriumi piiritlusega. @et
toolkit label: asukoht @et
toolkit definition: Koha füüsilise territooriumi piiritlus. @et
label: hat Standort @de
definition: Setzt ein Geografikum in Beziehung zu einer Abgrenzung des physischen Gebiets eines Geografikums. @de
toolkit label: Standort @de
toolkit definition: Eine Abgrenzung des physischen Gebiets eines Geografikums. @de
label: elhelyezkedése a következő: @hu
definition: Hozzákapcsol egy helyet a hely fizikai területének lehatárolásához. @hu
toolkit label: elhelyezkedése: @hu
toolkit definition: Egy hely fizikai területének lehatárolása. @hu
label: ha come ubicazione @it
definition: Correla un luogo a una delimitazione del territorio fisico del luogo. @it
toolkit label: ubicazione @it
toolkit definition: Delimitazione del territorio fisico del luogo. @it
label: atrašanās vieta @lv
definition: Sasaista vietu ar vietas fiziskas teritorijas norobežojumu. @lv
toolkit label: atrašanās vieta @lv
toolkit definition: Vietas fiziskas teritorijas norobežojums. @lv
has subproperty: P70043
label: 有位置 @zh-hans
definition: 将一个地点与一个地点的物理区域的界定关联起来。 @zh-hans
toolkit label: 位置 @zh-hans
toolkit definition: 一个地点的物理区域的界定 @zh-hans
label: konum ile ilişkilidir @tr
definition: Bir yeri, o yerin fiziksel bölgesinin sınırlandırılmasıyla ilişkilendirir. @tr
toolkit label: konum @tr
toolkit definition: Bir yerin fiziksel bölgesinin sınırlandırılması. @tr

is longitude and latitude of
status: Published
type: Property
lexical alias: longitudeAndLatitudeOf.en
domain: C10009
toolkit label: longitude and latitude of
sub property of: is coordinates of cartographic content of
has element type: 2
definition: Relates a place to a work that is a cartographic work that has an area of coverage that is identified using longitude of the westernmost and easternmost boundaries and latitude of the northernmost and southernmost boundaries.
toolkit definition: A work that is a cartographic work that has an area of coverage that is identified using longitude of the westernmost and easternmost boundaries and latitude of the northernmost and southernmost boundaries.
label: pituus- ja leveysasteet teokselle @fi
definition: Liittää paikan teokseen, joka on kartografinen teos, jonka kattama alue indentifioidaan käyttämällä läntisimmän ja itäisimmän rajan pituusastetta sekä pohjoisimman ja eteläisimmän rajan leveysastetta. @fi
toolkit label: pituus- ja leveysasteet teokselle @fi
toolkit definition: Teos, joka on kartografinen teos, jonka kattama alue indentifioidaan käyttämällä läntisimmän ja itäisimmän rajan pituusastetta sekä pohjoisimman ja eteläisimmän rajan leveysastetta. @fi
label: er lengdegrad og breddegrad for @no
definition: Relaterer et sted til et verk som er kartografisk som lokaliserer et område ved bruk av lengdegrader for vestligste og østligste grense og breddegrader for nordligste og sørligste grense. @no
toolkit label: lengdegrad og breddegrad for @no
toolkit definition: Et verk som er kartografisk som lokaliserer et område ved bruk av lengdegrader for vestligste og østligste grense og breddegrader for nordligste og sørligste grense. @no
label: est une longitude et une latitude de @fr
definition: Met un lieu en relation avec une œuvre cartographique qui possède une zone de couverture identifiée à l’aide de la longitude des limites ouest et est et de la latitude des limites nord et sud. @fr
toolkit label: longitude et latitude de @fr
toolkit definition: Œuvre cartographique qui possède une zone de couverture identifiée à l’aide de la longitude des limites ouest et est et de la latitude des limites nord et sud. @fr
label: is lengtegraad en breedtegraad van @nl
definition: Relateert een plaats aan een werk dat is een cartografisch werk dat een bestreken gebied heeft dat geïdentificeerd wordt met gebruikmaking van de lengtegraad van de meest westelijke en meest oostelijke grenzen en de breedtegraad van de meest noordelijke en meest zuidelijke grenzen. @nl
toolkit label: lengtegraad en breedtegraad van @nl
toolkit definition: Een werk dat is een cartografisch werk dat een bestreken gebied heeft dat geïdentificeerd wordt met gebruikmaking van de lengtegraad van de meest westelijke en meest oostelijke grenzen en de breedtegraad van de meest noordelijke en meest zuidelijke grenzen. @nl
label: هو خط الطول وخط العرض لـ @ar
definition: يربط بين مكان وعمل عبارة عن مادة خرائطية لها نطاق تغطية محدد باستخدام خط الطول لأقصى الحدود الغربية والشرقية وخط العرض لأقصى الحدود الشمالية والجنوبية. @ar
toolkit label: خط الطول وخط العرض لـ @ar
toolkit definition: عمل عبارة عن مادة خرائطية لها نطاق تغطية محدد باستخدام خط الطول لأقصى الحدود الغربية والشرقية وخط العرض لأقصى الحدود الشمالية والجنوبية. @ar
label: és longitud i latitud de @ca
definition: Relaciona un lloc amb una obra que és una obra cartogràfica que té una àrea de cobertura que s’identifica usant la longitud dels límits oest i est i la latitud dels límits nord i sud. @ca
toolkit label: longitud i latitud de @ca
toolkit definition: Obra que és una obra cartogràfica que té una àrea de cobertura que s’identifica usant la longitud dels límits oest i est i la latitud dels límits nord i sud. @ca
label: er længdegrad og breddegrad for @da
definition: Relaterer et sted til et værk, som er kartografisk, som lokaliserer et område ved brug af længdegrader for den vestligste og østligste grænse og breddegrader for den nordligste og sydligste grænse. @da
toolkit label: længdegrad og breddegrad for @da
toolkit definition: Værk, som er kartografisk, som lokaliserer et område ved brug af længdegrader for den vestligste og østligste grænse og breddegrader for den nordligste og sydligste grænse. @da
label: pikkuskraad ja laiuskraad teoses @et
definition: Seostab koha kartograafilise teosega, mis hõlmab ala, mis on tuvastatud läänepoolseima ja idapoolseima piirjoone pikkuskraadi ning põhjapoolseima ja lõunapoolseima piirjoone laiuskraadi abil. @et
toolkit label: pikkuskraad ja laiuskraad teoses @et
toolkit definition: Kartograafiline teos, mis hõlmab ala, mis on tuvastatud läänepoolseima ja idapoolseima piirjoone pikkuskraadi ning põhjapoolseima ja lõunapoolseima piirjoone laiuskraadi abil. @et
label: ist Längengrad und Breitengrad von @de
definition: Setzt ein Gebiet in Beziehung zu einem kartografischen Werk, dessen Abdeckungsbereich anhand des Längengrads der westlichsten und östlichsten Grenze sowie des Breitengrads der nördlichsten und südlichsten Grenze identifiziert wird. @de
toolkit label: Längengrad und Breitengrad von @de
toolkit definition: Ein kartografisches Werk, dessen Abdeckungsbereich anhand des Längengrads der westlichsten und östlichsten Grenze sowie des Breitengrads der nördlichsten und südlichsten Grenze identifiziert wird. @de
label: hosszúsági és szélességi foka a következőnek: @hu
definition: Hozzákapcsol egy helyet egy kartográfiai műhöz, amely egy terület elhelyezkedésének meghatározásához legnyugatibb és legkeletibb határainak hosszúsági, valamint a legészakibb és legdélibb határainak szélességi fokát használja. @hu
toolkit label: hosszúsági és szélességi foka: @hu
toolkit definition: Egy kartográfiai mű, amely egy terület elhelyezkedésének meghatározásához legnyugatibb és legkeletibb határainak hosszúsági, valamint a legészakibb és legdélibb határainak szélességi fokát használja. @hu
label: è longitudine e latitudine di @it
definition: Correla un luogo a un'opera cartografica che localizza un'area usando la longitudine dei confini più occidentali e orientali e la latitudine dei confini più settentrionali e meridionali. @it
toolkit label: longitudine e latitudine di @it
toolkit definition: Opera cartografica che localizza un'area usando la longitudine dei confini più occidentali e orientali e la latitudine dei confini più settentrionali e meridionali. @it
label: ir ģeogrāfiskais garums un platums @lv
toolkit label: ir ģeogrāfiskais garums un platums @lv
definition: Sasaista vietu ar darbu, kas ir kartogrāfisks darbs un kurā norāda teritoriju, kurā atrodas izmantojot ģeogrāfiskā garuma tālākās rietumu un austrumu robežas un ģeogrāfiskā platuma tālākās ziemeļu un dienvidu robežas. @lv
toolkit definition: Kartogrāfisks darbs un kurā norāda teritoriju, kurā atrodas izmantojot ģeogrāfiskā garuma tālākās rietumu un austrumu robežas un ģeogrāfiskā platuma tālākās ziemeļu un dienvidu robežas. @lv
has subproperty: P70034
label: 是……的经度和纬度 @zh-hans
toolkit label: ……的经度和纬度 @zh-hans
definition: 将一个地点与作为地图作品、有覆盖范围、用最西和最东边界的经度以及最北和最南边界的纬度标识的一种作品关联起来。 @zh-hans
toolkit definition: 作为地图作品、有覆盖范围、用最西和最东边界的经度以及最北和最南边界的纬度标识的一种作品 @zh-hans
label: enlemi ve boylamıdır @tr
toolkit label: boylam ve enlem @tr
definition: Bir yeri, en batı ve en doğu sınırlarının boylamı ve en kuzey ve en güney sınırlarının enlemi kullanılarak tanımlanan bir kapsama alanına sahip kartografik bir çalışma olan bir eserle ilişkilendirir. @tr
toolkit definition: En batı ve en doğu sınırlarının boylamı ve en kuzey ve en güney sınırlarının enlemi kullanılarak tanımlanan bir kapsama alanına sahip kartografik çalışma olan bir eser. @tr

has note on place
status: Published
type: Property
lexical alias: noteOnPlace.en
definition: Relates a place to a broad unstructured description of one or more attributes of a place.
domain: C10009
toolkit label: note on place
toolkit definition: A broad unstructured description of one or more attributes of a place.
has element type: 6
sub property of: P00015
label: huomautus paikasta @fi
definition: Liittää paikan yleisluonteiseen rakenteistamattomaan kuvailuun, joka sisältää paikan yhden tai useamman attribuutin. @fi
toolkit label: huomautus paikasta @fi
toolkit definition: Yleisluonteinen rakenteistamaton kuvailu, joka sisältää paikan yhden tai useamman attribuutin. @fi
label: har note for sted @no
definition: Relaterer et sted til en bred ustrukturert beskrivelse av ett eller flere attributter for et sted. @no
toolkit label: note for sted @no
toolkit definition: En bred ustrukturert beskrivelse av ett eller flere attributter for et sted. @no
label: a pour note sur un lieu @fr
definition: Met un lieu en relation avec une description non structurée générale d’un ou plusieurs attributs d’un lieu. @fr
toolkit label: note sur un lieu @fr
toolkit definition: Description non structurée générale d’un ou plusieurs attributs d’un lieu. @fr
label: heeft noot bij plaats @nl
definition: Relateert een plaats aan een algemene ongestructureerde beschrijving van één of meer attributen van een plaats. @nl
toolkit label: noot bij plaats @nl
toolkit definition: Een algemene ongestructureerde beschrijving van één of meer attributen van een plaats. @nl
label: له تبصرة على مكان @ar
definition: يربط بين مكان ووصف واسع وغير مُهيكل لخاصية واحدة أو أكثر من خصائص مكان. @ar
toolkit label: تبصرة على مكان @ar
toolkit definition: وصف واسع وغير مُهيكل لخاصية واحدة أو أكثر من خصائص مكان. @ar
label: té com a nota sobre un lloc @ca
definition: Relaciona un lloc amb una descripció no estructurada àmplia d’un o més atributs d’un lloc. @ca
toolkit label: nota sobre un lloc @ca
toolkit definition: Descripció no estructurada àmplia d’un o més atributs d’un lloc. @ca
label: har note om sted @da
definition: Relaterer et sted til en bred, ustruktureret beskrivelse af en eller flere af et steds attributter. @da
toolkit label: note om sted @da
toolkit definition: Relaterer et sted til en bred, ustruktureret beskrivelse af en eller flere af et steds attributter. @da
label: märkus koha kohta @et
definition: Seostab koha üldise struktureerimata kirjeldusega, mis iseloomustab üht või mitut koha omadust. @et
toolkit label: märkus koha kohta @et
toolkit definition: Üldine struktureerimata kirjeldus, mis iseloomustab üht või mitut koha omadust. @et
label: hat Anmerkung zum Geografikum @de
definition: Setzt ein Geografikum in Beziehung zu einer umfassenden, unstrukturierten Beschreibung eines Merkmals oder mehrerer Merkmale eines Geografikums. @de
toolkit label: Anmerkung zum Geografikum @de
toolkit definition: Eine umfassende, unstrukturierte Beschreibung eines Merkmals oder mehrerer Merkmale eines Geografikums. @de
label: helyre vonatkozó megjegyzése a következő: @hu
definition: Hozzákapcsol egy helyet egy hely egy vagy több ismérvének szabad szöveges, strukturálatlan leírásához. @hu
toolkit label: helyre vonatkozó megjegyzése: @hu
toolkit definition: Egy hely egy vagy több ismérvének szabad szöveges, strukturálatlan leírása. @hu
label: ha come nota su luogo @it
definition: Correla un luogo a una descrizione non strutturata generale di uno o più attributi di un luogo. @it
toolkit label: nota su luogo @it
toolkit definition: Descrizione non strutturata più ampia di uno o più attributi di un luogo. @it
label: piezīme par vietu @lv
definition: Sasaista vietu ar plašu nestrukturētu vietas viena vai vairāku atribūtu aprakstu. @lv
toolkit label: piezīme par vietu @lv
toolkit definition: Plašs nestrukturēts vietas viena vai vairāku atribūtu apraksts. @lv
has subproperty: P70022
label: 有关于地点的附注 @zh-hans
definition: 将一个地点与关于一个地点的一个或多个属性的宽泛的非结构化的描述关联起来。 @zh-hans
toolkit label: 关于地点的附注 @zh-hans
toolkit definition: 关于一个地点的一个或多个属性的宽泛的非结构化的描述 @zh-hans
label: yer hakkında not ile ilişkilidir @tr
definition: Bir yeri, bir yerin bir veya daha fazla özelliğinin yapılandırılmamış geniş açıklamasıyla ilişkilendirir. @tr
toolkit label: Yer hakkında not @tr
toolkit definition: Bir yerin bir veya daha fazla niteliğinin yapılandırılmamış geniş tanımı. @tr

is other place associated with corporate body of (Deprecated)
status: Deprecated
type: Property
has element type: 3
has subproperty: P70029

is parallel place of distribution of
status: Published
type: Property
has element type: 2
lexical alias: parallelPlaceOfDistributionOf.en
definition: Relates a place to a manifestation that is a published manifestation that is distributed from a place.
toolkit label: parallel place of distribution of
toolkit definition: A manifestation that is a published manifestation that is distributed from a place.
sub property of: is place of distribution of
domain: C10009
label: rinnakkainen jakelupaikka manifestaatiolle @fi
definition: Liittää paikan julkaistuun manifestaatioon, jota jaellaan paikasta käsin. @fi
toolkit label: rinnakkainen jakelupaikka manifestaatiolle @fi
toolkit definition: Julkaistu manifestaatio, jota jaellaan paikasta käsin. @fi
label: er parallelt distribusjonssted for @no
definition: Relaterer et sted til en manifestasjon som er en publisert manifestasjon som er distribuert fra et sted. @no
toolkit label: parallelt distribusjonssted for @no
toolkit definition: En manifestasjon som er en publisert manifestasjon som er distribuert fra et sted. @no
label: est une forme parallèle d’un lieu de diffusion ou de distribution de @fr
definition: Met un lieu en relation avec une manifestation publiée qui est diffusée ou distribuée à partir d’un lieu. @fr
toolkit label: forme parallèle d’un lieu de diffusion ou de distribution de @fr
toolkit definition: Manifestation publiée qui est diffusée ou distribuée à partir d’un lieu. @fr
label: is parallelle plaats van distributie van @nl
definition: Relateert een plaats aan een manifestatie die een gepubliceerde manifestatie is die gedistribueerd is vanuit een plaats. @nl
toolkit label: parallel-plaats van distributie van @nl
toolkit definition: Een manifestatie die een gepubliceerde manifestatie is die gedistribueerd is vanuit een plaats. @nl
label: هو مكان توزيع موازي لـ @ar
definition: يربط بين مكان وتجسيدة منشورة وُزعت من مكان. @ar
toolkit label: مكان توزيع موازي لـ @ar
toolkit definition: تجسيدة منشورة وُزعت من مكان. @ar
label: és lloc paral·lel de distribució de @ca
definition: Relaciona un lloc amb una manifestació que és una manifestació publicada que es distribueix des d’un lloc. @ca
toolkit label: lloc paral·lel de distribució de @ca
toolkit definition: Manifestació que és una manifestació publicada que es distribueix des d’un lloc. @ca
label: er parallelt sted for distribution af @da
definition: Relaterer et sted til en manifestation, som er en publiceret manifestation, som er distribueret fra et sted. @da
toolkit label: parallelt sted for distribution af @da
toolkit definition: Manifestation, som er en publiceret manifestation, som er distribueret fra et sted. @da
label: levitamiskoha rööpandmed kehastuses @et
definition: Seostab koha avaldatud kehastusega, mida sellest kohast levitatakse. @et
toolkit label: levitamiskoha rööpandmed kehastuses @et
toolkit definition: Avaldatud kehastus, mida sellest kohast levitatakse. @et
label: ist paralleler Vertriebsort von @de
definition: Setzt ein Geografikum in Beziehung zu einer veröffentlichten Manifestation, die an einem Ort vertrieben wird. @de
toolkit label: Paralleler Vertriebsort von @de
toolkit definition: Eine veröffentlichte Manifestation, die an einem Ort vertrieben wird. @de
label: párhuzamos terjesztési helye a következő: @hu
definition: Hozzákapcsol egy helyet egy kiadott megjelenési formához, amelyet egy bizonyos helyen terjesztenek. @hu
toolkit label: párhuzamos terjesztési helye a következő: @hu
toolkit definition: Egy kiadott megjelenési forma, amelyet egy bizonyos helyen terjesztenek. @hu
label: è luogo parallelo di distribuzione di @it
definition: Correla un luogo a una manifestazione che è una manifestazione pubblicata che è distribuita da un luogo. @it
toolkit label: luogo parallelo di distribuzione di @it
toolkit definition: Manifestazione pubblicata che è distribuita da un luogo. @it
label: ir izplatīšanas vieta @lv
definition: Sasaista vietu ar manifestāciju, kas ir publicēta manifestācija, kas ir izplatīta no norādītās vietas. @lv
toolkit label: ir izplatīšanas vieta @lv
toolkit definition: Manifestācija, kas ir publicēta manifestācija, kas ir izplatīta no norādītās vietas. @lv
has subproperty: P70047
label: 是……的发行的并列地点 @zh-hans
definition: 将一个地点与作为一种出版载体表现并从一个地点发行的一种载体表现关联起来。 @zh-hans
toolkit label: ……的发行的并列地点 @zh-hans
toolkit definition: 作为一种出版载体表现并从一个地点发行的一种载体表现 @zh-hans
label: dağıtımının paralel yeridir @tr
definition: Bir yeri, bir yerden dağıtılan yayınlanmış bir gösterim olan bir gösterim ile ilişkilendirir. @tr
toolkit label: paralel dağıtım yeri @tr
toolkit definition: Bir yerden dağıtılan yayınlanmış bir gösterim olan bir gösterim. @tr

is parallel place of manufacture of
status: Published
type: Property
has element type: 2
lexical alias: parallelPlaceOfManufactureOf.en
definition: Relates a place to a manifestation that is a published manifestation that is printed, duplicated, cast, etc., in a place.
toolkit label: parallel place of manufacture of
toolkit definition: A manifestation that is a published manifestation that is printed, duplicated, cast, etc., in a place.
sub property of: is place of manufacture of
domain: C10009
label: rinnakkainen valmistuspaikka manifestaatiolle @fi
definition: Liittää paikan julkaistuun manifestaatioon, joka on painettu, monistettu, valettu kirjainten osalta tms. paikassa. @fi
toolkit label: rinnakkainen valmistuspaikka manifestaatiolle @fi
toolkit definition: Julkaistu manifestaatio, joka on painettu, monistettu, valettu kirjainten osalta tms. paikassa. @fi
label: er parallelt framstillingssted for @no
definition: Relaterer et sted til en manifestasjon som er en publisert manifestasjon som er trykt, mangfoldiggjort, støpt etc. på et sted. @no
toolkit label: parallelt framstillingssted for @no
toolkit definition: En manifestasjon som er en publisert manifestasjon som er trykt, mangfoldiggjort, støpt etc. på et sted. @no
label: est une forme parallèle d’un lieu de fabrication de @fr
definition: Met un lieu en relation avec une manifestation publiée qui est imprimée, reproduite, moulée, etc. dans un lieu. @fr
toolkit label: forme parallèle d’un lieu de fabrication de @fr
toolkit definition: Manifestation publiée qui est imprimée, reproduite, moulée, etc. dans un lieu. @fr
label: is parallelle plaats van vervaardiging van @nl
definition: Relateert een plaats aan een manifestatie die een gepubliceerde manifestatie is die is gedrukt, gedupliceerd, gegoten etc. in een plaats. @nl
toolkit label: parallel-plaats van vervaardiging van @nl
toolkit definition: Een manifestatie die een gepubliceerde manifestatie is die is gedrukt, gedupliceerd, gegoten etc. in een plaats. @nl
label: هو مكان تصنيع موازي لـ @ar
definition: يربط بين مكان وتجسيدة منشورة طُبعت، ونُسخت، وبُثت، إلخ، في مكان. @ar
toolkit label: مكان تصنيع موازي لـ @ar
toolkit definition: تجسيدة منشورة طُبعت، ونُسخت، وبُثت، إلخ، في مكان. @ar
label: és lloc paral·lel de fabricació de @ca
definition: Relaciona un lloc amb una manifestació que és una manifestació publicada que s’imprimeix, es reprodueix, es modela, etc., en un lloc. @ca
toolkit label: lloc paral·lel de fabricació de @ca
toolkit definition: Manifestació que és una manifestació publicada que s’imprimeix, es reprodueix, es modela, etc., en un lloc. @ca
label: er parallelt sted for fremstilling af @da
definition: Relaterer et sted til en manifestation, som er en publiceret manifestation, som er trykt, duplikeret, støbt ect. et sted. @da
toolkit label: parallelt sted for fremstilling af @da
toolkit definition: Manifestation, som er en publiceret manifestation, som er trykt, duplikeret, støbt ect. et sted. @da
label: valmistamiskoha rööpandmed kehastuses @et
definition: Seostab koha avaldatud kehastusega, mis on selles kohas trükitud, paljundatud, valatud vms. @et
toolkit label: valmistamiskoha rööpandmed kehastuses @et
toolkit definition: Avaldatud kehastus, mis on selles kohas trükitud, paljundatud, valatud vms. @et
label: ist paralleler Herstellungsort von @de
definition: Setzt ein Geografikum in Beziehung zu einer veröffentlichten Manifestation, die an einem Ort gedruckt, vervielfältigt, gegossen und so weiter wird. @de
toolkit label: Paralleler Herstellungsort von @de
toolkit definition: Eine veröffentlichte Manifestation, die an einem Ort gedruckt, vervielfältigt, gegossen und so weiter wird. @de
label: párhuzamos gyártási helye a következő: @hu
definition: Hozzákapcsol egy helyet egy kiadott megjelenési formához, amelyet egy bizonyos helyen nyomtattak, sokszoroztak, öntöttek stb. @hu
toolkit label: párhuzamos gyártási helye a következő: @hu
toolkit definition: Egy kiadott megjelenési forma, amelyet egy bizonyos helyen nyomtattak, sokszoroztak, öntöttek stb. @hu
label: è luogo parallelo di manifattura di @it
definition: Correla un luogo a una manifestione è che una manifestazione pubblicata che è stampata, duplicata, lanciata, etc. in un luogo. @it
toolkit label: luogo parallelo di manifattura di @it
toolkit definition: Manifestione pubblicata che è stampata, duplicata, lanciata, etc. in un luogo. @it
label: ir paralēlā ražošanas vieta @lv
definition: Sasaista vietu ar manifestāciju, kas ir publicēta manifestācija, kas ir iespiesta, pavairota, iesieta norādītā paralēlā vietā. @lv
toolkit label: ir paralēlā ražošanas vieta @lv
toolkit definition: Manifestācija, kas ir publicēta manifestācija, kas ir iespiesta, pavairota, iesieta norādītā paralēlā vietā. @lv
has subproperty: P70048
label: 是……的生产的并列地点 @zh-hans
definition: 将一个地点与作为一种出版载体表现并从一个地点印刷、复制、铸造等的一种载体表现关联起来。 @zh-hans
toolkit label: ……的生产的并列地点 @zh-hans
toolkit definition: 作为一种出版载体表现并从一个地点印刷、复制、铸造等的一种载体表现 @zh-hans
label: üretiminin paralel yeridir @tr
definition: Bir yeri, bir yerde basılan, çoğaltılan, biçimlendirilen, vb. yayınlanmış bir gösterim olan bir gösteriyle ilişkilendirir @tr
toolkit label: paralel üretim yeri @tr
toolkit definition: Bir yerde basılan çoğaltılan biçim verilmiş vb. yayınlanmış bir gösterim olan bir gösterim. @tr

is parallel place of production of
status: Published
type: Property
has element type: 2
lexical alias: parallelPlaceOfProductionOf.en
definition: Relates a place to a manifestation that is an unpublished manifestation that is inscribed, fabricated, constructed, etc., in a place.
toolkit label: parallel place of production of
toolkit definition: A manifestation that is an unpublished manifestation that is inscribed, fabricated, constructed, etc., in a place.
sub property of: is place of production of
domain: C10009
label: rinnakkainen tuotantopaikka manifestaatiolle @fi
definition: Liittää paikan julkaisemattomaan manifestaatioon, joka on kaiverrettu, valmistettu, koottu tms. paikassa. @fi
toolkit label: rinnakkainen tuotantopaikka manifestaatiolle @fi
toolkit definition: Julkaisematon manifestaatio, joka on kaiverrettu, valmistettu, koottu tms. paikassa. @fi
label: er parallelt produksjonssted for @no
definition: Relaterer et sted til en manifestasjon som er en upublisert manifestasjon som er inskribert, fabrikert, konstruert etc. på et sted. @no
toolkit label: parallelt produksjonssted for @no
toolkit definition: En manifestasjon som er en upublisert manifestasjon som er inskribert, fabrikert, konstruert etc. på et sted. @no
label: est une forme parallèle d’un lieu de production de @fr
definition: Met un lieu en relation avec une manifestation non publiée qui est écrite à la main, fabriquée, construite, etc. dans un lieu. @fr
toolkit label: forme parallèle d’un lieu de production de @fr
toolkit definition: Manifestation non publiée qui est écrite à la main, fabriquée, construite, etc. dans un lieu. @fr
label: is parallelle plaats van productie van @nl
definition: Relateert een plaats aan een manifestatie die een ongepubliceerde manifestatie is die is afgeschreven, gefabriceerd, geconstrueerd etc. in een plaats. @nl
toolkit label: parallel-plaats van productie van @nl
toolkit definition: Een manifestatie die een ongepubliceerde manifestatie is die is afgeschreven, gefabriceerd, geconstrueerd etc. in een plaats. @nl
label: هو مكان إنتاج موازي لـ @ar
definition: يربط بين مكان وتجسيدة غير منشورة دُونت، ووُضعت، وأُنشئت، إلخ، في مكان. @ar
toolkit label: مكان إنتاج موازي لـ @ar
toolkit definition: تجسيدة غير منشورة دُونت، ووُضعت، وأُنشئت، إلخ، في مكان. @ar
label: és lloc paral·lel de producció de @ca
definition: Relaciona un lloc amb una manifestació que és una manifestació no publicada que s’inscriu, es fabrica, es construeix, etc., en un lloc. @ca
toolkit label: lloc paral·lel de producció de @ca
toolkit definition: Manifestació que és una manifestació no publicada que s’inscriu, es fabrica, es construeix, etc., en un lloc. @ca
label: er parallelt sted for produktion af @da
definition: Relaterer et sted til en manifestation, som er en upubliceret manifestation, som er indskrevet, fremstillet, konstrueret ect. et sted. @da
toolkit label: parallelt sted for produktion af @da
toolkit definition: Manifestation, som er en upubliceret manifestation, som er indskrevet, fremstillet, konstrueret ect. et sted. @da
label: tootmiskoha rööpandmed kehastuses @et
definition: Seostab koha avaldamata kehastusega, mis on selles kohas inskribeeritud, toodetud, ehitatud vms. @et
toolkit label: tootmiskoha rööpandmed kehastuses @et
toolkit definition: Avaldamata kehastus, mis on selles kohas inskribeeritud, toodetud, ehitatud vms. @et
label: ist paralleler Entstehungsort von @de
definition: Setzt ein Geografikum in Beziehung zu einer unveröffentlichten Manifestation, die an einem Ort beschriftet, fabriziert, konstruiert und so weiter wird. @de
toolkit label: Paralleler Entstehungsort von @de
toolkit definition: Eine unveröffentlichte Manifestation, die an einem Ort beschriftet, fabriziert, konstruiert und so weiter wird. @de
label: gyártás párhuzamos helye a következő: @hu
definition: Hozzákapcsol egy helyet egy kiadatlan megjelenési formához, amelyet egy bizonyos helyen írnak, készítenek, szerkesztenek stb. @hu
toolkit label: gyártás párhuzamos helye a következő: @hu
toolkit definition: Egy kiadatlan megjelenési forma, amelyet egy bizonyos helyen írnak, készítenek, szerkesztenek stb. @hu
label: è luogo parallelo di produzione di @it
definition: Correla un luogo a una manifestazione è che una manifestazione non pubblicata che è incisa, fabbricata, costruita, etc. in un luogo. @it
toolkit label: luogo parallelo di produzione di @it
toolkit definition: Manifestazione non pubblicata che è incisa, fabbricata, costruita, etc. in un luogo. @it
label: ir paralēlā izgatavošanas vieta @lv
definition: Sasaista vietu ar manifestāciju, kas ir publicēta manifestācija, kas ir uzrakstīta, izgatavota, radīta u.tml. norādītā paralēlā vietā. @lv
toolkit label: ir paralēlā izgatavošanas vieta @lv
toolkit definition: Manifestācija, kas ir publicēta manifestācija, kas ir uzrakstīta, izgatavota, radīta u.tml. norādītā paralēlā vietā. @lv
has subproperty: P70049
label: 是……的制作的并列地点 @zh-hans
definition: 将一个地点与作为一种非出版载体表现在一个地点镌刻、制造、构建等的一种载体表现关联起来。 @zh-hans
toolkit label: ……的制作的并列地点 @zh-hans
toolkit definition: 作为一种非出版载体表现在一个地点镌刻、制造、构建等的一种载体表现 @zh-hans
label: yapımının paralel yeridir @tr
definition: Bir yeri, bir yerde yazılı olan, imal edilen, inşa edilen, vb. yayınlanmamış bir gösterimle ilişkilendirir. @tr
toolkit label: paralel üretim yeri @tr
toolkit definition: Bir yerde yazılan, üretilen, yapılandırılan, vb. yayınlanmamış bir gösterim olan bir gösterim. @tr

is parallel place of publication of
status: Published
type: Property
has element type: 2
lexical alias: parallelPlaceOfPublicationOf.en
definition: Relates a place to a manifestation that is a published manifestation that is published, released, or issued in a place.
toolkit label: parallel place of publication of
toolkit definition: A manifestation that is a published manifestation that is published, released, or issued in a place.
sub property of: is place of publication of
domain: C10009
label: rinnakkainen kustannuspaikka manifestaatiolle @fi
definition: Liittää paikan julkaistuun manifestaatioon, joka on kustannettu, julkaistu, ilmestynyt tms. paikassa. @fi
toolkit label: rinnakkainen kustannuspaikka manifestaatiolle @fi
toolkit definition: Julkaistu manifestaatio, joka on kustannettu, julkaistu, ilmestynyt tms. paikassa. @fi
label: er parallelt utgivelsessted for @no
definition: Relaterer et sted til en manifestasjon som er en publisert manifestasjon som er publisert, tilgjengeliggjort eller utgitt på et sted. @no
toolkit label: parallelt utgivelsessted for @no
toolkit definition: En manifestasjon som er en publisert manifestasjon som er publisert, tilgjengeliggjort eller utgitt på et sted. @no
label: est une forme parallèle d’un lieu de publication de @fr
definition: Met un lieu en relation avec une manifestation publiée qui est publiée, mise à disposition ou éditée dans un lieu. @fr
toolkit label: forme parallèle d’un lieu de publication de @fr
toolkit definition: Manifestation publiée qui est publiée, mise à disposition ou éditée dans un lieu. @fr
label: is parallelle plaats van publicatie van @nl
definition: Relateert een plaats aan een manifestatie die een gepubliceerde manifestatie is die gepubliceerd, uitgebracht of uitgevaardigd is in een plaats. @nl
toolkit label: parallel-plaats van uitgave van @nl
toolkit definition: Een manifestatie die een gepubliceerde manifestatie is die gepubliceerd, uitgebracht of uitgevaardigd is in een plaats. @nl
label: هو مكان نشر موازي لـ @ar
definition: يربط بين مكان وتجسيدة منشورة نُشرت، أو أُصدرت في مكان. @ar
toolkit label: مكان نشر موازي لـ @ar
toolkit definition: تجسيدة منشورة نُشرت، أو أُصدرت في مكان. @ar
label: és lloc paral·lel de publicació de @ca
definition: Relaciona un lloc amb una manifestació que és una manifestació publicada que es publica, es posa en circulació o s’emet en un lloc. @ca
toolkit label: lloc paral·lel de publicació de @ca
toolkit definition: Manifestació que és una manifestació publicada que es publica, es posa en circulació o s’emet en un lloc. @ca
label: er parallelt sted for udgivelse af @da
definition: Relaterer et sted til en manifestation, som er en publiceret manifestation, som er publiceret, frigivet eller udgivet et sted. @da
toolkit label: parallelt sted for udgivelse af @da
toolkit definition: Manifestation, som er en publiceret manifestation, som er publiceret, frigivet eller udgivet et sted. @da
label: ilmumiskoha rööpandmed kehastuses @et
definition: Seostab koha avaldatud kehastusega, mis on selles kohas avaldatud, välja lastud või välja antud. @et
toolkit label: ilmumiskoha rööpandmed kehastuses @et
toolkit definition: Avaldatud kehastus, mis on selles kohas avaldatud, välja lastud või välja antud. @et
label: ist paralleler Erscheinungsort von @de
definition: Setzt ein Geografikum in Beziehung zu einer veröffentlichten Manifestation, die an einem Ort veröffentlicht, freigegeben oder herausgegeben wird. @de
toolkit label: Paralleler Erscheinungsort von @de
toolkit definition: Eine veröffentlichte Manifestation, die an einem Ort veröffentlicht, freigegeben oder herausgegeben wird. @de
label: közzététel párhuzamos helye a következő: @hu
definition: Hozzákapcsol egy helyet egy kiadott megjelenési formához, amelyet egy bizonyos helyen adnak ki, bocsájtanak ki vagy jelentetnek meg. @hu
toolkit label: közzététel párhuzamos helye a következő: @hu
toolkit definition: Egy kiadott megjelenési forma, amelyet egy bizonyos helyen adnak ki, bocsájtanak ki vagy jelentetnek meg. @hu
label: è luogo parallelo di pubblicazione di @it
definition: Correla un luogo a una manifestazione è che una manifestazione non pubblicata che è incisa, fabbricata, costruita, etc. in un luogo. @it
toolkit label: luogo parallelo di pubblicazione di @it
toolkit definition: Manifestazione non pubblicata che è incisa, fabbricata, costruita, etc. in un luogo. @it
label: ir izdošanas vieta @lv
definition: Sasaista vietu ar manifestāciju, kas ir publicēta manifestācija, kas ir publicēta, izlaista, izdota norādītā vietā. @lv
toolkit label: ir izdošanas vieta @lv
toolkit definition: Manifestācija, kas ir publicēta manifestācija, kas ir publicēta, izlaista, izdota norādītā vietā. @lv
has subproperty: P70050
label: 是……的出版的并列地点 @zh-hans
definition: 将一个地点与作为一种出版载体表现并在一个地点出版、发布、发行的一种载体表现关联起来。 @zh-hans
toolkit label: ……的出版的并列地点 @zh-hans
toolkit definition: 作为一种出版载体表现并在一个地点出版、发布、发行的一种载体表现 @zh-hans
label: yayınının paralel yeridir @tr
definition: Bir yeri, bir yerde yayınlanan, piyasaya sürülen veya yayınlanan yayınlanmış bir gösterim olan bir gösterimle ilişkilendirir. @tr
toolkit label: paralel yayın yeri @tr
toolkit definition: Bir yerde yayınlanan, piyasaya sürülen vb. yayınlanmış bir gösterim olan bir gösterim. @tr

is part of place
status: Published
type: Property
lexical alias: partOfPlace.en
domain: C10009
toolkit label: part of place
sub property of: has related place of place
has element type: 2
definition: Relates a place to a place that encompasses another place.
toolkit definition: A place that encompasses another place.
label: osa paikkaa @fi
definition: Liittää paikan paikkaan, joka sisältää toisen paikan. @fi
toolkit label: osa paikkaa @fi
toolkit definition: Paikka, joka sisältää toisen paikan. @fi
label: er del av sted @no
definition: Relaterer et sted til et sted som omfatter et annet sted. @no
toolkit label: del av sted @no
toolkit definition: Et sted som omfatter et annet sted. @no
label: est une partie de lieu de @fr
definition: Met un lieu en relation avec un lieu qui comprend un autre lieu. @fr
toolkit label: partie de lieu de @fr
toolkit definition: Lieu qui comprend un autre lieu. @fr
label: is deel van plaats @nl
definition: Relateert een plaats aan een plaats die een andere plaats omvat. @nl
toolkit label: deel van plaats @nl
toolkit definition: Een plaats die een andere plaats omvat. @nl
label: هو جزء من مكان @ar
definition: يربط بين مكان ومكان يشتمل على مكان آخر. @ar
toolkit label: جزء من مكان @ar
toolkit definition: مكان يشتمل على مكان آخر. @ar
label: és part d’un lloc @ca
definition: Relaciona un lloc amb un lloc que comprèn un altre lloc. @ca
toolkit label: part d’un lloc @ca
toolkit definition: Lloc que comprèn un altre lloc. @ca
label: er del af sted @da
definition: Relaterer et sted til et sted, som omfatter et andet sted. @da
toolkit label: del af sted @da
toolkit definition: Sted, som omfatter et andet sted. @da
label: osa kohast @et
definition: Seostab koha kohaga, mis hõlmab teist kohta. @et
toolkit label: osa kohast @et
toolkit definition: Koht, mis hõlmab teist kohta. @et
label: ist Teil von Geografikum @de
definition: Setzt ein Geografikum in Beziehung zu einem Geografikum, das ein anderes Geografikum umschließt. @de
toolkit label: Teil von Geografikum @de
toolkit definition: Ein Geografikum, das ein anderes Geografikum umschließt. @de
label: része a következő helynek: @hu
definition: Hozzákapcsol egy helyet egy olyan helyhez, amely magában foglal egy másik helyet. @hu
toolkit label: része a következő helynek: @hu
toolkit definition: Egy hely, amely magában foglal egy másik helyet. @hu
label: è parte di luogo @it
definition: Correla un luogo a un luogo che comprende un altro luogo. @it
toolkit label: parte di luogo @it
toolkit definition: Luogo che comprende un altro luogo. @it
label: ir daļa vietā @lv
toolkit label: daļa vietā @lv
definition: Sasaista vietu ar vietu, kas ietver citu vietu. @lv
toolkit definition: Vieta, kas ietver citu vietu. @lv
has subproperty: P70032
label: 是地点的部分 @zh-hans
toolkit label: 地点的部分 @zh-hans
definition: 将一个地点与包含另一个地点的一个地点关联起来。 @zh-hans
toolkit definition: 包含另一个地点的一个地点 @zh-hans
label: yerin bir bileşenidir @tr
toolkit label: yerin bölümü @tr
definition: Bir yeri başka bir yeri kapsayan bir yer ile ilişkilendirir. @tr
toolkit definition: Başka bir yeri kapsayan bir yer. @tr

has part place
status: Published
type: Property
lexical alias: partPlace.en
domain: C10009
toolkit label: part place
sub property of: has related place of place
has element type: 2
definition: Relates a place to a place that is located within another place.
toolkit definition: A place that is located within another place.
label: paikan osa @fi
definition: Liittää paikan paikkaan, joka sijaitsee toisen paikan sisällä. @fi
toolkit label: paikan osa @fi
toolkit definition: Paikka, joka sijaitsee toisen paikan sisällä. @fi
label: har del av sted @no
definition: Relaterer et sted til et sted som er lokalisert innenfor et annet sted. @no
toolkit label: del av sted @no
toolkit definition: Et sted som er lokalisert innenfor et annet sted. @no
label: a pour partie de lieu @fr
definition: Met un lieu en relation avec un lieu qui est situé à l’intérieur d’un autre lieu. @fr
toolkit label: partie de lieu @fr
toolkit definition: Lieu qui est situé à l’intérieur d’un autre lieu. @fr
label: heeft deel plaats @nl
definition: Relateert een plaats aan een plaats die gelegen is binnen een andere plaats. @nl
toolkit label: deel plaats @nl
toolkit definition: Een plaats die gelegen is binnen een andere plaats. @nl
label: له جزء من مكان @ar
definition: يربط بين مكان ومكان يقع داخل مكان آخر. @ar
toolkit label: جزء من مكان @ar
toolkit definition: مكان يقع داخل مكان آخر. @ar
label: té com a lloc de part @ca
definition: Relaciona un lloc amb un lloc situat dins un altre lloc. @ca
toolkit label: lloc de part @ca
toolkit definition: Lloc situat dins un altre lloc. @ca
label: har del af sted @da
definition: Relaterer et sted til et sted, som er lokaliseret inden for et andet sted. @da
toolkit label: del af sted @da
toolkit definition: Sted, som er lokaliseret inden for et andet sted. @da
label: koha osa @et
definition: Seostab koha kohaga, mis paikneb teise koha sees. @et
toolkit label: koha osa @et
toolkit definition: Koht, mis paikneb teise koha sees. @et
label: hat Teil-Geografikum @de
definition: Setzt ein Geografikum in Beziehung zu einem Geografikum, das von einem anderen Geografikum umschlossen ist. @de
toolkit label: Teil-Geografikum @de
toolkit definition: Ein Geografikum, das von einem anderen Geografikum umschlossen ist. @de
label: részhelye a következő: @hu
definition: Hozzákapcsol egy helyet egy helyhez, amely egy másik helyen belül található. @hu
toolkit label: részhelye: @hu
toolkit definition: Egy hely, amely egy másik helyen belül található. @hu
label: ha come luogo parte @it
definition: Correla un luogo a un luogo che è localizzato in un altro luogo. @it
toolkit label: luogo come parte @it
toolkit definition: Luogo che è localizzato in un altro luogo. @it
label: vieta: daļa @lv
toolkit label: vieta: daļa @lv
definition: Sasaista vietu ar vietu, kas atrodas citā vietā. @lv
toolkit definition: Vieta, kas atrodas citā vietā. @lv
has subproperty: P70033
label: 有部分地点 @zh-hans
toolkit label: 部分地点 @zh-hans
definition: 将一个地点与位于另一个地点内部的一个地点关联起来。 @zh-hans
toolkit definition: 位于另一个地点内部的一个地点 @zh-hans
label: yer bileşeni ile ilişkilidir @tr
toolkit label: yer bölümü @tr
definition: Bir yeri, başka bir yerin içinde bulunan bir yerle ilişkilendirir. @tr
toolkit definition: Başka bir yerin içinde bulunan bir yer. @tr

is place associated with corporate body of (Deprecated)
status: Deprecated
type: Property
has element type: 2
has subproperty: P70030

is place associated with family of (Deprecated)
status: Deprecated
type: Property
has element type: 2
has subproperty: P70031

is place described by
status: Published
definition: Relates a place to a work that is a description of a place.
toolkit label: place described by
toolkit definition: A work that is a description of a place.
type: Property
domain: C10009
sub property of: is subject place of
has element type: 2
label: paikkaa kuvaava teos @fi
definition: Liittää paikan teokseen, joka kuvaa paikkaa. @fi
toolkit label: paikkaa kuvaava teos @fi
toolkit definition: Teos, joka kuvaa paikkaa. @fi
label: er sted beskrevet i @no
definition: Relaterer et sted til et verk som beskriver et sted. @no
toolkit label: sted beskrevet i @no
toolkit definition: Et verk som beskriver et sted. @no
label: est un lieu décrit par @fr
definition: Met un lieu en relation avec une œuvre qui consiste en une description d’un lieu. @fr
toolkit label: lieu décrit par @fr
toolkit definition: Œuvre qui consiste en une description d’un lieu. @fr
label: is plaats beschreven in @nl
definition: Relateert een plaats aan een werk dat een plaats beschrijft. @nl
toolkit label: plaats beschreven in @nl
toolkit definition: Een werk dat een plaats beschrijft. @nl
label: هو مكان موصوف في @ar
definition: يربط بين مكان وعمل يصف مكان. @ar
toolkit label: مكان موصوف في @ar
toolkit definition: عمل يصف مكان. @ar
label: és lloc descrit per @ca
definition: Relaciona un lloc amb una obra que és una descripció d’un lloc. @ca
toolkit label: lloc descrit per @ca
toolkit definition: Obra que és una descripció d’un lloc. @ca
definition: Relaterer et sted til et værk, som beskriver et sted. @da
toolkit label: sted beskrevet i @da
toolkit definition: Værk, som beskriver et sted. @da
label: koha kirjeldus @et
definition: Seostab koha teosega, milles kirjeldatakse kohta. @et
toolkit label: koha kirjeldus @et
toolkit definition: Teos, milles kirjeldatakse kohta. @et
label: ist Geografikum beschrieben in @de
definition: Setzt ein Geografikum in Beziehung zu einem Werk, das ein Geografikum beschreibt. @de
toolkit label: Geografikum beschrieben in @de
toolkit definition: Ein Werk, das ein Geografikum beschreibt. @de
label: hely leírva a következőben: @hu
definition: Hozzákapcsol egy helyet egy műhöz, amely egy helyet ír le. @hu
toolkit label: hely leírva a következőben: @hu
toolkit definition: Egy mű, amely egy helyet ír le. @hu
label: è luogo descritto in @it
definition: Correla un luogo con un'opera che descrive un luogo. @it
toolkit label: luogo descritto in @it
toolkit definition: Opera che descrive un luogo. @it
alternative label: place described in
lexical alias: placeDescribedBy.en
label: ir vietas apraksts @lv
definition: Sasaista vietu ar darbu, kurā aprakstīta konkrētā vieta. @lv
toolkit label: vietas apraksts @lv
toolkit definition: Darbs, kurā aprakstīta konkrētā vieta. @lv
alternative label: paikkaa kuvattu teoksessa @fi
has subproperty: is place described with metadata by
has subproperty: P70054
alternative label: 被描述于……的地点 @zh-hans
label: 是被……描述的一个地点 @zh-hans
definition: 将一个地点与作为一个地点之描述的一种作品关联起来。 @zh-hans
toolkit label: 被……描述的一个地点 @zh-hans
toolkit definition: 作为一个地点之描述的一种作品 @zh-hans
alternative label: lloc descrit en @ca
alternative label: lieu décrit dans @fr
alternative label: Tanımlanan yer @tr
label: tarafından tanımlanmış yerdir @tr
definition: Bir yeri, bir yerin tanımı olan bir eserle ilişkilendirir. @tr
toolkit label: tarafından tanımlanan yer @tr
toolkit definition: Bir yerin tanımı olan bir eser @tr

is place of birth of
status: Published
type: Property
lexical alias: placeOfBirthOf.en
domain: C10009
toolkit label: place of birth of
definition: Relates a place to a person who was born in a place.
toolkit definition: A person who was born in a place.
sub property of: has related person of place
has element type: 2
label: syntymäpaikka henkilölle @fi
definition: Liittää paikan henkilöön, joka syntyi paikassa. @fi
toolkit label: syntymäpaikka henkilölle @fi
toolkit definition: Henkilö, joka syntyi paikassa. @fi
label: er fødested for @no
definition: Relaterer et sted til en person som ble født på et sted. @no
toolkit label: fødested for @no
toolkit definition: En person som ble født på et sted. @no
label: est un lieu de naissance de @fr
definition: Met un lieu en relation avec une personne qui est née dans un lieu. @fr
toolkit label: lieu de naissance de @fr
toolkit definition: Personne qui est née dans un lieu. @fr
label: is geboorteplaats van @nl
definition: Relateert een plaats aan een persoon die geboren werd in een plaats. @nl
toolkit label: geboorteplaats van @nl
toolkit definition: Een persoon die geboren werd in een plaats. @nl
label: هو مكان الميلاد لـ @ar
definition: يربط بين مكان وشخص وُلد في مكان. @ar
toolkit label: مكان الميلاد لـ @ar
toolkit definition: شخص كان مولودا في مكان. @ar
label: és lloc de naixement de @ca
definition: Relaciona un lloc amb una persona que va néixer en un lloc. @ca
toolkit label: lloc de naixement de @ca
toolkit definition: Persona que va néixer en un lloc. @ca
label: er fødested af @da
definition: Relaterer et sted til en person, som blev født et sted. @da
toolkit label: fødested af @da
toolkit definition: Person, som blev født et sted. @da
label: sünnikoht isikule @et
definition: Seostab koha isikuga, kes sündis selles kohas. @et
toolkit label: sünnikoht isikule @et
toolkit definition: Isik, kes sündis selles kohas. @et
label: ist Geburtsort von @de
definition: Setzt ein Geografikum in Beziehung zu einer Person, die an einem Ort geboren wurde. @de
toolkit label: Geburtsort von @de
toolkit definition: Eine Person, die an einem Ort geboren wurde. @de
label: születési helye a következőnek: @hu
definition: Hozzákapcsol egy helyet egy személyhez, aki azon a helyen született. @hu
toolkit label: születési helye: @hu
toolkit definition: Egy személy, aki azon a helyen született. @hu
label: è luogo di nascita di @it
definition: Correla un luogo con una persona che è nata in un luogo. @it
toolkit label: luogo di nascita di @it
toolkit definition: Persona che è nata in un luogo. @it
label: ir dzimšanas vieta @lv
toolkit label: ir dzimšanas vieta @lv
definition: Sasaista vietu ar personu, kura dzimusi norādītajā vietā. @lv
toolkit definition: Persona, kura dzimusi norādītajā vietā. @lv
has subproperty: P70025
label: 是……的出生地点 @zh-hans
toolkit label: ……的出生地点 @zh-hans
definition: 将一个地点与在一个地点出生的一个个人关联起来。 @zh-hans
toolkit definition: 在一个地点出生的一个个人 @zh-hans
label: doğum yeridir @tr
toolkit label: doğum yeri @tr
definition: Bir yeri, bir yerde doğmuş olan bir kişi ile ilişkilendirir. @tr
toolkit definition: Bir yerde doğmuş bir kişi. @tr

is place of capture of
status: Published
type: Property
lexical alias: placeOfCaptureOf.en
domain: C10009
toolkit label: place of capture of
definition: Relates a place to an expression that has content that is recorded, filmed, etc., in a place.
toolkit definition: An expression that has content that is recorded, filmed, etc., in a place.
sub property of: has related expression of place
has element type: 2
label: tallennuspaikka teokselle @fi
definition: Liittää paikan ekspressioon, jonka sisältö on äänitetty, kuvauttu tms. paikassa. @fi
toolkit label: tallennuspaikka teokselle @fi
toolkit definition: Ekspressio, jonka sisältö on äänitetty, kuvauttu tms. paikassa. @fi
label: er innspillingssted for @no
definition: Relaterer et sted til et uttrykk som har innhold som er tatt opp, filmet etc. på et sted. @no
toolkit label: innspillingssted for @no
toolkit definition: Et uttrykk som har innhold som er tatt opp, filmet etc. på et sted. @no
label: est un lieu de captation de @fr
definition: Met un lieu en relation avec une expression qui possède un contenu qui est enregistré, filmé, etc. dans un lieu. @fr
toolkit label: lieu de captation de @fr
toolkit definition: Expression qui possède un contenu qui est enregistré, filmé, etc. dans un lieu. @fr
label: is plaats van vastleggen van @nl
definition: Relateert een plaats aan een expressie die content heeft die is opgenomen, gefilmd etc. in een plaats. @nl
toolkit label: plaats van vastleggen van @nl
toolkit definition: Een expressie die content heeft die is opgenomen, gefilmd etc. in een plaats. @nl
label: هو مكان التقاط لـ @ar
definition: يربط بين مكان وتعبيرة لها محتوى مسجل، أو مصور، إلخ في مكان. @ar
toolkit label: مكان التقاط لـ @ar
toolkit definition: تعبيرة لها محتوى مسجل، أو مصور، إلخ في مكان. @ar
label: és lloc de captura de @ca
definition: Relaciona un lloc amb una expressió que té contingut que s’enregistra, filma, etc. en un lloc. @ca
toolkit label: lloc de captura de @ca
toolkit definition: Expressió que té contingut que s’enregistra, filma, etc. en un lloc. @ca
label: er sted for indspilning af @da
definition: Relaterer et sted til et udtryk, som har indhold, som er indspillet, filmet, etc. et sted. @da
toolkit label: sted for indspilning af @da
toolkit definition: Udtryk, som har indhold, som er indspillet, filmet, etc. et sted. @da
label: jäädvustamiskoht väljenduses @et
definition: Seostab koha väljendusega, mille sisu on salvestatud, filmitud vms selles kohas. @et
toolkit label: jäädvustamiskoht väljenduses @et
toolkit definition: Väljendus, mille sisu on salvestatud, filmitud vms selles kohas. @et
label: ist Aufzeichnungsort von @de
definition: Setzt ein Geografikum in Beziehung zu einer Expression, deren Inhalt an einem Ort aufgenommen, gefilmt und so weiter wird. @de
toolkit label: Aufzeichnungsort von @de
toolkit definition: Eine Expression, deren Inhalt an einem Ort aufgenommen, gefilmt und so weiter wird. @de
label: rögzítési helye a következőnek: @hu
definition: Hozzákapcsol egy helyet egy kifejezési formához, amelynek tartalmát egy bizonyos helyen rögzítették, filmezték stb. @hu
toolkit label: rögzítési helye: @hu
toolkit definition: Egy kifejezési forma, amelynek tartalmát egy bizonyos helyen rögzítették, filmezték stb. @hu
label: è luogo di cattura @it
definition: Correla un luogo a un'espressione che ha il contenuto che è stato registrato, filmato, etc. in un luogo. @it
toolkit label: luogo di cattura @it
toolkit definition: Espressione che ha il contenuto che è stato registrato, filmato, etc. in un luogo. @it
label: ir tveršanas vieta @lv
toolkit label: ir tveršanas vieta @lv
definition: Sasaista vietu ar izteiksmi, kam ir satura ierakstīšanas, filmēšanas vieta. @lv
toolkit definition: Izteiksme, kam ir satura ierakstīšanas, filmēšanas vieta. @lv
has subproperty: P70038
label: 是……的摄录的地点 @zh-hans
toolkit label: ……的摄录的地点 @zh-hans
definition: 将一个地点与有在一个地点录制、摄影等的内容的一种内容表达关联起来。 @zh-hans
toolkit definition: 有在一个地点录制、摄影等的内容的一种内容表达 @zh-hans
label: kayıt yeridir @tr
toolkit label: çekim yapılan yer @tr
definition: Bir yeri, bir yerde kaydedilmiş, filme alınmış vb. içeriğe sahip bir anlatımla ilişkilendirir. @tr
toolkit definition: Bir yerde kaydedilmiş, filme alınmış vb. içeriğe sahip bir anlatım. @tr

is place of capture of representative expression of
status: Published
type: Property
lexical alias: placeOfCaptureOfRepresentativeExpressionOf.en
domain: C10009
toolkit label: place of capture of representative expression of
has element type: 2
definition: Relates a place to a work that has content of a representative expression that is recorded, filmed, etc., in a place.
toolkit definition: A work that has content of a representative expression that is recorded, filmed, etc., in a place.
sub property of: has related work of place
label: tallennuspaikka edustavalle ekspressiolle @fi
definition: Liittää paikan teokseen, johon sisältyvän edustavan ekspression sisältö on äänitetty, kuvauttu tms. paikassa. @fi
toolkit label: tallennuspaikka edustavalle ekspressiolle @fi
toolkit definition: Teos, johon sisältyvän edustavan ekspression sisältö on äänitetty, kuvauttu tms. paikassa. @fi
label: er innspillingssted for representativt uttrykk av @no
definition: Relaterer et sted til et verk som har innhold av et representativt uttrykk som er tatt opp, filmet etc. på et sted. @no
toolkit label: innspillingssted for representativt uttrykk av @no
toolkit definition: Et verk som har innhold av et representativt uttrykk som er tatt opp, filmet etc. på et sted. @no
label: est un lieu de captation d’une expression représentative de @fr
definition: Met un lieu en relation avec une œuvre qui possède un contenu d’une expression représentative qui est enregistré, filmé, etc. dans un lieu. @fr
toolkit label: lieu de captation d’une expression représentative de @fr
toolkit definition: Œuvre qui possède un contenu d’une expression représentative qui est enregistré, filmé, etc. dans un lieu. @fr
label: is plaats van vastleggen van representatieve expressie van @nl
definition: Relateert een plaats aan een werk dat content heeft van een representatieve expressie die is opgenomen, gefilmd etc. in een plaats. @nl
toolkit label: plaats van vastleggen van representatieve expressie van @nl
toolkit definition: Een werk dat content heeft van een representatieve expressie die is opgenomen, gefilmd etc. in een plaats. @nl
label: هو مكان لالتقاط تعبيرة ممثِلة لـ @ar
definition: يربط بين مكان وعمل له محتوى تعبيرة ممثِلة سُجلت، وصُورت، إلخ، في مكان. @ar
toolkit label: مكان لالتقاط تعبيرة ممثِلة لـ @ar
toolkit definition: عمل له محتوى تعبيرة ممثِلة سُجلت، وصُورت، إلخ، في مكان. @ar
label: és lloc de captura d’una expressió representativa de @ca
definition: Relaciona un lloc amb una obra que té el contingut d’una expressió representativa que s’enregistra, es filma, etc. en un lloc. @ca
toolkit label: lloc de captura d’una expressió representativa de @ca
toolkit definition: Obra que té el contingut d’una expressió representativa que s’enregistra, es filma, etc. en un lloc. @ca
label: er sted for indspilning af repræsentativt udtryk af @da
definition: Relaterer et sted til et værk, som har et repræsentativt udtryks indhold, som er indspillet, filmet, etc. et sted. @da
toolkit label: sted for indspilning af repræsentativt udtryk af @da
toolkit definition: Værk, som har et repræsentativt udtryks indhold, som er indspillet, filmet, etc. et sted. @da
label: iseloomuliku väljenduse jäädvustamise koht teoses @et
definition: Seostab koha teosega, mille sisu esindav iseloomulik väljendus on selles kohas salvestatud, filmitud vms. @et
toolkit label: iseloomuliku väljenduse jäädvustamise koht teoses @et
toolkit definition: Teos, mille sisu esindav iseloomulik väljendus on selles kohas salvestatud, filmitud vms. @et
label: ist Aufzeichnungsort einer repräsentativer Expression von @de
definition: Setzt ein Geografikum in Beziehung zu einem Werk mit dem Inhalt einer repräsentativen Expression, der an einem Ort aufgenommen, gefilmt und so weiter wird. @de
toolkit label: Aufzeichnungsort einer repräsentativen Expression von @de
toolkit definition: Ein Werk mit dem Inhalt einer repräsentativen Expression, der an einem Ort aufgenommen, gefilmt und so weiter wird. @de
label: reprezentatív kifejezési formájának rögzítési helye a következő: @hu
definition: reprezentatív kifejezési forma rögzítési helye a következő: @hu
toolkit label: Hozzákapcsol egy helyet egy műhöz, amely reprezentatív kifejezési formájának tartalmát egy bizonyos helyen rögzítették, filmezték stb. @hu
toolkit definition: Egy mű, amely reprezentatív kifejezési formájának tartalmát egy bizonyos helyen rögzítették, filmezték stb. @hu
label: è luogo di cattura dell'espressione rappresentativa di @it
definition: Correla un luogo a un'opera che ha il contenuto di un'espressione rappresentativa che è stata registrata, filmata, etc. in un luogo. @it
toolkit label: luogo di cattura dell'espressione rappresentativa di @it
toolkit definition: Opera che ha il contenuto di un'espressione rappresentativa che è stata registrata, filmata, etc. in un luogo. @it
label: ir tveršanas vieta reprezentatīvajai izteiksmei @lv
toolkit label: ir tveršanas vieta reprezentatīvajai izteiksmei @lv
definition: Sasaista vietu ar darbu, kam ir reprezentatīvās izteiksmes satura ierakstīšanas, filmēšanas u.tml. vieta. @lv
toolkit definition: Darbs, kam ir reprezentatīvās izteiksmes satura ierakstīšanas, filmēšanas u.tml. vieta. @lv
has subproperty: P70052
label: 是……的代表性内容表达的摄录的地点 @zh-hans
toolkit label: ……的代表性内容表达的摄录的地点 @zh-hans
definition: 将一个地点与有代表性内容表达并在一个地点录制、拍摄等的一种作品关联起来。 @zh-hans
toolkit definition: 有代表性内容表达并在一个地点录制、拍摄等的一种作品 @zh-hans
label: temsili anlatımın kayıt yeridir @tr
toolkit label: temsili anlatımın çekime alındığı yer @tr
definition: Bir yeri, bir yerde kaydedilmiş, filme alınmış vb. temsili bir ifade içeriğine sahip bir eserle ilişkilendirir. @tr
toolkit definition: Bir yerde kaydedilmiş, filme alınmış vb. temsili anlatım içeriğine sahip eser. @tr

is place of conference of
status: Published
type: Property
lexical alias: placeOfConferenceOf.en
domain: C10009
toolkit label: place of conference of
sub property of: has related corporate body of place
has element type: 2
definition: Relates a place to a corporate body who is a conference, exhibition, or other formally named and convened event that gives rise to a work and that is held in a place.
toolkit definition: A corporate body who is a conference, exhibition, or other formally named and convened event that gives rise to a work and that is held in a place.
alternative label: location of conference, etc. of
label: paikka konferenssille @fi
definition: Liittää paikan yhteisöön, joka on konferenssi, näyttely tai muu muodollisesti nimetty ja kokoonkutsuttu tilaisuus, joka saa aikaan teoksen ja joka järjestetään jossakin paikassa. @fi
toolkit label: paikka konferenssille @fi
toolkit definition: Yhteisö, joka on konferenssi, näyttely tai muu muodollisesti nimetty ja kokoonkutsuttu tilaisuus, joka saa aikaan teoksen ja joka järjestetään jossakin paikassa. @fi
label: er konferansested for @no
definition: Relaterer et sted til en konferanse, utstilling eller annen formelt navngitt og avholdt arrangement som gir opphav til et verk. @no
toolkit label: konferansested for @no
toolkit definition: En konferanse, utstilling eller annen formelt navngitt og avholdt arrangement som gir opphav til et verk. @no
label: est un lieu d’un congrès de @fr
definition: Met un lieu en relation avec une collectivité qui consiste en un congrès, une exposition ou un autre événement formellement nommé et convoqué qui donne lieu à la création d’une œuvre et qui se tient dans un lieu. @fr
alternative label: emplacement d’un congrès, etc. de @fr
toolkit label: lieu d’un congrès de @fr
toolkit definition: Collectivité qui consiste en un congrès, une exposition ou un autre événement formellement nommé et convoqué qui donne lieu à la création d’une œuvre et qui se tient dans un lieu. @fr
label: is plaats van conferentie van @nl
definition: Relateert een plaats aan een corporatie die is een conferentie, tentoonstelling of ander formeel benoemde en samengekomen gebeurtenis die aanleiding geeft tot een werk en die is gehouden in een plaats. @nl
toolkit label: plaats van conferentie van @nl
toolkit definition: Een corporatie die is een conferentie, tentoonstelling of ander formeel benoemde en samengekomen gebeurtenis die aanleiding geeft tot een werk en die is gehouden in een plaats. @nl
label: هو مكان لمؤتمر لـ @ar
definition: يربط بين مكان وهيئة عبارة عن مؤتمر، أو معرض، أو حدث آخر سُميَ وعقد رسميًا وأسفر عن عمل أقيم في مكان. @ar
alternative label: موقع لمؤتمر، إلخ لـ @ar
toolkit label: مكان لمؤتمر لـ @ar
toolkit definition: هيئة عبارة عن مؤتمر، أو معرض، أو حدث آخر سُميَ وعقد رسميًا وأسفر عن عمل أقيم في مكان. @ar
label: és lloc de congrés de @ca
definition: Relaciona un lloc amb una entitat corporativa que és un congrés, una exposició o qualsevol altre esdeveniment formalment mencionat i convocat que dona origen a una obra i que se celebra en un lloc. @ca
alternative label: localització de congrés, etc. de @ca
toolkit label: lloc de congrés de @ca
toolkit definition: Entitat corporativa que és un congrés, una exposició o qualsevol altre esdeveniment formalment mencionat i convocat que dona origen a una obra i que se celebra en un lloc. @ca
label: har sted for konference af @da
definition: Relaterer et sted til en konference, udstilling eller anden formelt navngivet og indkaldt begivenhed, som giver anledning til et værk. @da
alternative label: lokation for konference etc. af @da
toolkit label: sted for konference af @da
toolkit definition: Konference, udstilling eller anden formelt navngivet og indkaldt begivenhed, som giver anledning til et værk. @da
label: toimumiskoht konverentsile @et
definition: Seostab koha konverentsi, näituse või muu vormiliselt nimetatud ja kokku kutsutud üritusega, mis paneb aluse teosele. @et
alternative label: asukoht konverentsile vms @et
toolkit label: toimumiskoht konverentsile @et
toolkit definition: Konverents, näitus või muu vormiliselt nimetatud ja kokku kutsutud üritus, mis paneb aluse teosele. @et
label: ist Ort einer Konferenz von @de
definition: Setzt ein Geografikum in Beziehung zu einer Körperschaft, bei der es sich um eine Konferenz, eine Ausstellung oder eine andere formal benannte und einberufene Veranstaltung handelt, die an einem Ort stattgefunden hat und aus der ein Werk hervorgeht. @de
toolkit label: Ort einer Konferenz von @de
toolkit definition: Eine Körperschaft, bei der es sich um eine Konferenz, eine Ausstellung oder eine andere formal benannte und einberufene Veranstaltung handelt, die an einem Ort stattgefunden hat und aus der ein Werk hervorgeht. @de
label: konferenciahelyszíne a következőnek: @hu
definition: Hozzákapcsol egy helyet egy testülethez, egy konferenciához, kiállításhoz, vagy más hivatalos névvel rendelkező és szervezett eseményhez, amely egy mű létrejöttét eredményezi és egy helyen tartanak. @hu
alternative label: konferenciahelyszíne, stb.: @hu
toolkit label: konferenciahelyszíne: @hu
toolkit definition: Egy testület, egy konferencia, kiállítás, vagy más hivatalos névvel rendelkező és szervezett esemény, amely egy mű létrejöttét eredményezi és egy helyen tartanak. @hu
label: è luogo di conferenza @it
definition: Correla un luogo a una conferenza, mostra, o altro evento formalmente nominato o convocato che dà origine a un'opera. @it
toolkit label: luogo di conferenza @it
toolkit definition: Conferenza, mostra, o altro evento formalmente nominato o convocato che dà origine a un'opera. @it
label: ir pasākuma norises vieta @lv
toolkit label: ir pasākuma norises vieta @lv
definition: Sasaista vietu ar institūciju, kas ir konference, izstāde vai cits formāli nosaukts un organizēts pasākums. @lv
toolkit definition: Konference, izstāde vai cits formāli nosaukts un organizēts pasākums. @lv
alternative label: paikka konferenssille tms. @fi
alternative label: Ort einer Konferenz usw. von @de
has subproperty: P70028
alternative label: ……的会议等的位置 @zh-hans
label: 是……的会议的地点 @zh-hans
toolkit label: ……的会议的地点 @zh-hans
definition: 将一个地点与作为一个导致一种作品产生并在一个地点举行的会议、展览或其他正式命名并举办的活动的一个团体关联起来。 @zh-hans
toolkit definition: 作为一个导致一种作品产生并在一个地点举行的会议、展览或其他正式命名并举办的活动的一个团体 @zh-hans
alternative label: konferansın konumu vs. @tr
label: konferansının yeridir @tr
toolkit label: konferans yeri @tr
definition: Bir yeri, bir yerde düzenlenen ve bir çalışmaya yol açan bir konferans, sergi veya diğer resmi olarak adlandırılmış ve toplanmış bir olay olan bir tüzel kişiliğe ilişkindir. @tr
toolkit definition: Bir yerde düzenlenen ve bir çalışmaya yol açan bir konferans, sergi veya diğer resmi olarak adlandırılmış ve toplanmış bir etkinlik olan bir tüzel kişilik. @tr

is place of death of
status: Published
type: Property
lexical alias: placeOfDeathOf.en
domain: C10009
toolkit label: place of death of
definition: Relates a place to a person who died in a place.
toolkit definition: A person who died in a place.
sub property of: has related person of place
has element type: 2
label: kuolinpaikka henkilölle @fi
definition: Liittää paikan henkilöön, joka kuoli paikassa. @fi
toolkit label: kuolinpaikka henkilölle @fi
toolkit definition: Henkilö, joka kuoli paikassa. @fi
label: er dødssted for @no
definition: Relaterer et sted til en person som døde på et sted. @no
toolkit label: dødssted for @no
toolkit definition: En person som døde på et sted. @no
label: est un lieu de décès de @fr
definition: Met un lieu en relation avec une personne qui est morte dans un lieu. @fr
toolkit label: lieu de décès de @fr
toolkit definition: Personne qui est morte dans un lieu. @fr
label: is sterfplaats van @nl
definition: Relateert een plaats aan een persoon die stierf in een plaats. @nl
toolkit label: sterfplaats van @nl
toolkit definition: Een persoon die stierf in een plaats. @nl
label: هو مكان الوفاة لـ @ar
definition: يربط بين مكان وشخص توفي في مكان. @ar
toolkit label: مكان الوفاة لـ @ar
toolkit definition: شخص توفي في مكان. @ar
label: és lloc de defunció de @ca
definition: Relaciona un lloc amb una persona que va morir en un lloc. @ca
toolkit label: lloc de defunció de @ca
toolkit definition: Persona que va morir en un lloc. @ca
label: er dødssted af @da
definition: Relaterer et sted til en person, som døde et sted. @da
toolkit label: dødssted af @da
toolkit definition: Person, som døde et sted. @da
label: surmakoht isikule @et
definition: Seostab koha isikuga, kes suri selles kohas. @et
toolkit label: surmakoht isikule @et
toolkit definition: Isik, kes suri selles kohas. @et
label: ist Sterbeort von @de
definition: Setzt ein Geografikum in Beziehung zu einer Person, die an einem Ort gestorben ist. @de
toolkit label: Sterbeort von @de
toolkit definition: Eine Person, die an einem Ort gestorben ist. @de
label: halálozási helye a következőnek: @hu
definition: Hozzákapcsol egy helyet egy személyhez, aki azon a helyen halt meg. @hu
toolkit label: halálozási helye: @hu
toolkit definition: Egy személy, aki azon a helyen halt meg. @hu
label: è luogo di morte di @it
definition: Correla un luogo con una persona che è morta in un luogo. @it
toolkit label: luogo di morte di @it
toolkit definition: Persona che è morta in un luogo. @it
label: ir miršanas vieta @lv
toolkit label: ir miršanas vieta @lv
definition: Sasaista vietu ar personu, kura mirusi norādītajā vietā. @lv
toolkit definition: Persona, kura mirusi norādītajā vietā. @lv
has subproperty: P70026
label: 是……的去世地点 @zh-hans
toolkit label: ……的去世地点 @zh-hans
definition: 将一个地点与在一个地点去世的一个个人关联起来。 @zh-hans
toolkit definition: 在一个地点去世的一个个人 @zh-hans
label: ölüm yeridir @tr
toolkit label: ölüm yeri @tr
definition: Bir yeri, bir yerde ölmüş olan bir kişi ile ilişkilendirir. @tr
toolkit definition: Bir yerde ölen bir kişi. @tr

is place of distribution of
status: Published
type: Property
lexical alias: placeOfDistributionOf.en
domain: C10009
toolkit label: place of distribution of
definition: Relates a place to a manifestation that is a published manifestation that is distributed from a place.
toolkit definition: A manifestation that is a published manifestation that is distributed from a place.
sub property of: is place of manifestation of
has element type: 2
label: jakelupaikka manifestaatiolle @fi
definition: Liittää paikan julkaistuun manifestaatioon, jota jaellaan paikasta käsin. @fi
toolkit label: jakelupaikka manifestaatiolle @fi
toolkit definition: Julkaistu manifestaatio, jota jaellaan paikasta käsin. @fi
label: er distribusjonssted for @no
definition: Relaterer et sted til en manifestasjon som er en publisert manifestasjon som er distribuert fra et sted. @no
toolkit label: distribusjonssted for @no
toolkit definition: En manifestasjon som er en publisert manifestasjon som er distribuert fra et sted. @no
label: est un lieu de diffusion ou de distribution de @fr
definition: Met un lieu en relation avec une manifestation publiée qui est diffusée ou distribuée à partir d’un lieu. @fr
toolkit label: lieu de diffusion ou de distribution de @fr
toolkit definition: Manifestation publiée qui est diffusée ou distribuée à partir d’un lieu. @fr
label: is plaats van distributie van @nl
definition: Relateert een plaats aan een manifestatie die een gepubliceerde manifestatie is die gedistribueerd is vanuit een plaats. @nl
toolkit label: plaats van distributie van @nl
toolkit definition: Een manifestatie die een gepubliceerde manifestatie is die gedistribueerd is vanuit een plaats. @nl
label: هو مكان توزيع لـ @ar
definition: يربط بين مكان وتجسيدة منشورة وُزعت من مكان. @ar
toolkit label: مكان توزيع لـ @ar
toolkit definition: تجسيدة منشورة وُزعت من مكان. @ar
label: és lloc de distribució de @ca
definition: Relaciona un lloc amb una manifestació que és una manifestació publicada que es distribueix des d’un lloc. @ca
toolkit label: lloc de distribució de @ca
toolkit definition: Manifestació que és una manifestació publicada que es distribueix des d’un lloc. @ca
label: er sted for distribution af @da
definition: Relaterer et sted til en manifestation, som er en publiceret manifestation, som er distribueret fra et sted. @da
toolkit label: sted for distribution af @da
toolkit definition: Manifestation, som er en publiceret manifestation, som er distribueret fra et sted. @da
label: levitamiskoht kehastuses @et
definition: Seostab koha avaldatud kehastusega, mida sellest kohast levitatakse. @et
toolkit label: levitamiskoht kehastuses @et
toolkit definition: Avaldatud kehastus, mida sellest kohast levitatakse. @et
label: ist Vertriebsort von @de
definition: Setzt ein Geografikum in Beziehung zu einer veröffentlichten Manifestation, die an einem Ort vertrieben wird. @de
toolkit label: Vertriebsort von @de
toolkit definition: Eine veröffentlichte Manifestation, die an einem Ort vertrieben wird. @de
label: terjesztési helye a következőnek: @hu
definition: Hozzákapcsol egy helyet egy kiadott megjelenési formához, amelyet egy bizonyos helyen terjesztenek. @hu
toolkit label: terjesztési helye: @hu
toolkit definition: Egy kiadott megjelenési formához, amelyet egy bizonyos helyen terjesztenek. @hu
label: è luogo di distribuzione di @it
definition: Correla un luogo a una manifestazione pubblicata che è distribuita da un luogo. @it
toolkit label: luogo di distribuzione di @it
toolkit definition: Manifestazione pubblicata che è distribuita da un luogo. @it
label: ir paralēlā izplatīšanas vieta @lv
toolkit label: ir paralēlā izplatīšanas vieta @lv
definition: Sasaista vietu ar manifestāciju, kas ir publicēta manifestācija, kas ir izplatīta no norādītās paralēlās vietas. @lv
toolkit definition: Manifestācija, kas ir publicēta manifestācija, kas ir izplatīta no norādītās paralēlās vietas. @lv
has subproperty: is parallel place of distribution of
has subproperty: P70039
label: 是……的发行的地点 @zh-hans
toolkit label: ……的发行的地点 @zh-hans
definition: 将一个地点与作为一种出版载体表现从一个地点发行的一种载体表现关联起来。 @zh-hans
toolkit definition: 作为一种出版载体表现从一个地点发行的一种载体表现 @zh-hans
label: dağıtım yeridir @tr
toolkit label: dağıtım yeri @tr
definition: Bir yeri, bir yerden dağıtılan yayınlanmış bir gösterim olan bir gösterim ile ilişkilendirir. @tr
toolkit definition: Bir yerden dağıtılan yayınlanmış bir gösterim olan bir gösterim. @tr

is place of manifestation of
status: Published
type: Property
lexical alias: placeOfManifestationOf.en
domain: C10009
toolkit label: place of manifestation of
definition: Relates a place to a manifestation that is a published manifestation that is distributed, printed, duplicated, cast, published, released, or issued, etc., or an unpublished manifestation that is inscribed, fabricated, constructed, etc., in a place.
toolkit definition: A manifestation that is a published manifestation that is distributed, printed, duplicated, cast, published, released, or issued, etc., or an unpublished manifestation that is inscribed, fabricated, constructed, etc., in a place.
sub property of: has related manifestation of place
has element type: 2
label: paikka manifestaatiolle @fi
definition: Liittää paikan julkaistuun manifestaatioon, joka on jaettu, painettu, monistettu, valattu kirjasintin osalta, kustannettu, julkaistu, ilmestynyt tms. paikassa. Liittää paikan julkaisemattomaan manifestaatioon, joka on kaiverrettu, valmistettu, koottu tms. paikassa. @fi
toolkit label: paikka manifestaatiolle @fi
toolkit definition: Julkaistu manifestaatio, joka on jaettu, painettu, monistettu, valattu kirjasintin osalta, kustannettu, julkaistu, ilmestynyt tms. paikassa. Julkaisematon manifestaatio, joka on kaiverrettu, valmistettu, koottu tms. paikassa. @fi
label: er sted for manifestasjon av @no
definition: Relaterer et sted til en manifestasjon som er en publisert manifestasjon som er distribuert, trykt, mangfoldiggjort, støpt, publisert, tilgjengeliggjort eller utstedt etc., eller en upublisert manifestasjon som er inskribert, fabrikert, konstruert, etc., på et sted. @no
toolkit label: sted for manifestasjon av @no
toolkit definition: En manifestasjon som er en publisert manifestasjon som er distribuert, trykt, mangfoldiggjort, støpt, publisert, tilgjengeliggjort eller utstedt etc., eller en upublisert manifestasjon som er inskribert, fabrikert, konstruert, etc., på et sted. @no
label: est un lieu d’une manifestation de @fr
definition: Met un lieu en relation avec une manifestation publiée qui est diffusée ou distribuée, imprimée, reproduite, moulée, publiée, mise à disposition ou éditée, etc., ou une manifestation non publiée qui est écrite à la main, fabriquée, construite, etc. dans un lieu. @fr
toolkit label: lieu d’une manifestation de @fr
toolkit definition: Manifestation publiée qui est diffusée ou distribuée, imprimée, reproduite, moulée, publiée, mise à disposition ou éditée, etc., ou une manifestation non publiée qui est écrite à la main, fabriquée, construite, etc. dans un lieu. @fr
label: is plaats van manifestatie van @nl
definition: Relateert een plaats aan een manifestatie die een gepubliceerde manifestatie is, die is gedistribueerd, gedrukt, gedupliceerd, gegoten, gepubliceerd, uitgebracht of uitgevaardigd etc. of een ongepubliceerde manifestatie die is afgeschreven, gefabriceerd, geconstrueerd etc. in een plaats. @nl
toolkit label: plaats van manifestatie van @nl
toolkit definition: Een manifestatie die een gepubliceerde manifestatie is, die is gedistribueerd, gedrukt, gedupliceerd, gegoten, gepubliceerd, uitgebracht of uitgevaardigd etc. of een ongepubliceerde manifestatie die is afgeschreven, gefabriceerd, geconstrueerd etc. in een plaats. @nl
label: هو مكان لتجسيدة لـ @ar
definition: يربط بين مكان وتجسيدة منشورة وُزعت، أو طُبعت، أو نُسخت، أو بُثت، أو نُشرت، أو أُصدرت، إلخ، أو تجسيدة غير منشورة دُونت، ووُضعت، وأُنشئت، إلخ، في مكان. @ar
toolkit label: مكان لتجسيدة لـ @ar
toolkit definition: تجسيدة منشورة وُزعت، أو طُبعت، أو نُسخت، أو بُثت، أو نُشرت، أو أُصدرت، إلخ، أو تجسيدة غير منشورة دُونت، ووُضعت، وأُنشئت، إلخ، في مكان. @ar
label: és lloc d’una manifestació de @ca
definition: Relaciona un lloc amb una manifestació que és una manifestació publicada que es distribueix, s’imprimeix, es reprodueix, es modela, es publica, es posa en circulació, s’emet, etc., o una manifestació no publicada que s’inscriu, es fabrica, es construeix, etc., en un lloc. @ca
toolkit label: lloc d’una manifestació de @ca
toolkit definition: Manifestació que és una manifestació publicada que es distribueix, s’imprimeix, es reprodueix, es modela, es publica, es posa en circulació, s’emet, etc., o una manifestació no publicada que s’inscriu, es fabrica, es construeix, etc., en un lloc. @ca
label: er sted for manifestation af @da
definition: Relaterer et sted til en manifestation, som er en publiceret manifestation, som et givet sted er distribueret, trykt, duplikeret, støbt, publiceret, frigivet eller udgivet ect., eller en upubliceret manifestation, som et givet sted er indskrevet, fremstillet, konstrueret ect. @da
toolkit label: sted for manifestation af @da
toolkit definition: Manifestation, som er en publiceret manifestation, som et givet sted er distribueret, trykt, duplikeret, støbt, publiceret, frigivet eller udgivet ect., eller en upubliceret manifestation, som et givet sted er indskrevet, fremstillet, konstrueret ect. @da
label: kehastuse koht kehastuses @et
definition: Seostab koha kehastusega, mis on selles kohas levitatud, trükitud, paljundatud, valatud, avaldatud, välja lastud, välja antud vms (avaldatud kehastus), või inskribeeritud, toodetud, ehitatud vms (avaldamata kehastus). @et
toolkit label: kehastuse koht kehastuses @et
toolkit definition: Kehastus, mis on selles kohas levitatud, trükitud, paljundatud, valatud, avaldatud, välja lastud, välja antud vms (avaldatud kehastus), või inskribeeritud, toodetud, ehitatud vms (avaldamata kehastus). @et
label: ist Geografikum einer Manifestation von @de
definition: Setzt ein Geografikum in Beziehung zu einer veröffentlichten Manifestation, die an einem Geografikum vertrieben, gedruckt, vervielfältigt, gegossen, veröffentlicht, freigegeben oder herausgegeben und so weiter wird oder zu einer unveröffentlichte Manifestation, die an einem Geografikum beschriftet, fabriziert, konstruiert und so weiter wird. @de
toolkit label: Geografikum einer Manifestation von @de
toolkit definition: Eine veröffentlichte Manifestation, die an einem Geografikum vertrieben, gedruckt, vervielfältigt, gegossen, veröffentlicht, freigegeben oder herausgegeben und so weiter wird oder eine unveröffentlichte Manifestation, die an einem Geografikum beschriftet, fabriziert, konstruiert und so weiter wird. @de
label: helye a következő megjelenési formának: @hu
definition: megjelenésiforma-helye: @hu
toolkit label: Hozzákapcsol egy helyet egy kiadott megjelenési formához, amelyet terjesztenek, nyomtatnak, sokszorosítanak, öntenek, kiadnak, kibocsájtanak vagy megjelentetnek stb. vagy egy kiadatlan megjelenési formához, amelyet bejegyeznek, gyártanak, összeállítanak stb. egy helyen. @hu
toolkit definition: Egy kiadott megjelenési forma, amelyet terjesztenek, nyomtatnak, sokszorosítanak, öntenek, kiadnak, kibocsájtanak vagy megjelentetnek stb. vagy egy kiadatlan megjelenési forma, amelyet bejegyeznek, gyártanak, összeállítanak stb. egy helyen. @hu
label: è luogo di manifestazione di @it
definition: Correla un luogo a una manifestazione che è pubblicata, rilasciata, edita, stampata, duplicata, lanciata, distribuita, etc. in forma pubblicata o è incisa, fabbricata, costruita, etc. in forma non pubblicata in un luogo. @it
toolkit label: luogo di manifestazione di @it
toolkit definition: Manifestazione che è pubblicata, rilasciata, edita, stampata, duplicata, lanciata, distribuita, etc. in forma pubblicata o è incisa, fabbricata, costruita, etc. in forma non pubblicata in un luogo. @it
label: ir manifestācijas vieta @lv
toolkit label: ir manifestācijas vieta @lv
definition: Sasaista vietu ar manifestāciju, kas ir publicēta manifestācija, kas ir izplatīta, iespiesta, pavairota, iesieta, publicēta, izlaista vai izdota u.tml. noteiktā vietā, vai kas ir nepublicēta manifestācija, kas uzrakstīta, izgatavota, radīta u.tml. noteiktā vietā. @lv
toolkit definition: Manifestācija, kas ir publicēta manifestācija, kas ir izplatīta, iespiesta, pavairota, iesieta, publicēta, izlaista vai izdota u.tml. noteiktā vietā, vai kas ir nepublicēta manifestācija, kas uzrakstīta, izgatavota, radīta u.tml. noteiktā vietā. @lv
has subproperty: is place of distribution of
has subproperty: is place of manufacture of
has subproperty: is place of production of
has subproperty: is place of publication of
has subproperty: P70021
label: 是……的载体表现的地点 @zh-hans
toolkit label: ……的载体表现的地点 @zh-hans
definition: 将一个地点与作为一种出版载体表现在一个地点被发行、印刷、复制、铸造、出版、发布或经销等、或者一种非出版载体表现在一个地点被镌刻、制造、构造等的一种载体表现关联起来。 @zh-hans
toolkit definition: 作为一种出版载体表现在一个地点被发行、印刷、复制、铸造、出版、发布或经销等、或者一种非出版载体表现在一个地点被镌刻、制造、构造等的一种载体表现 @zh-hans
label: gösterim yeridir @tr
toolkit label: gösterim yeri @tr
definition: Bir yeri, bir yerde dağıtılan, basılan, çoğaltılan, biçim verilen, yayınlanan, piyasaya sürülen veya yayınlanan vb. yayınlanmış bir gösterim olan veya bir yere kaydedilen, üretilen, düzenlenen vb. yayınlanmamış bir gösterim olan bir gösterim ile ilişkilendirir. @tr
toolkit definition: Bir yerde dağıtılan, basılan, çoğaltılan,dökülen, yayınlanan, piyasaya sürülen veya çıkarılan vb. yayınlanmış bir gösterim olan veya bir yerde kaydedilen, üretilen, yapılandırılan vb. yayınlanmamış bir gösterim olan bir gösterim. @tr

is place of manufacture of
status: Published
type: Property
lexical alias: placeOfManufactureOf.en
domain: C10009
toolkit label: place of manufacture of
definition: Relates a place to a manifestation that is a published manifestation that is printed, duplicated, cast, etc., in a place.
toolkit definition: A manifestation that is a published manifestation that is printed, duplicated, cast, etc., in a place.
sub property of: is place of manifestation of
has element type: 2
label: valmistuspaikka manifestaatiolle @fi
definition: Liittää paikan julkaistuun manifestaatioon, joka on painettu, monistettu, valettu kirjainten osalta tms. paikassa. @fi
toolkit label: valmistuspaikka manifestaatiolle @fi
toolkit definition: Julkaistu manifestaatio, joka on painettu, monistettu, valettu kirjainten osalta tms. paikassa. @fi
label: er framstillingssted for @no
definition: Relaterer et sted til en manifestasjon som er en publisert manifestasjon som er trykt, mangfoldiggjort, støpt etc. på et sted. @no
toolkit label: framstillingssted for @no
toolkit definition: En manifestasjon som er en publisert manifestasjon som er trykt, mangfoldiggjort, støpt etc. på et sted. @no
label: est un lieu de fabrication de @fr
definition: Met un lieu en relation avec une manifestation publiée qui est imprimée, reproduite, moulée, etc. dans un lieu. @fr
toolkit label: lieu de fabrication de @fr
toolkit definition: Manifestation publiée qui est imprimée, reproduite, moulée, etc. dans un lieu. @fr
label: is plaats van vervaardiging van @nl
definition: Relateert een plaats aan een manifestatie die een gepubliceerde manifestatie is die is gedrukt, gedupliceerd, gegoten etc. in een plaats. @nl
toolkit label: plaats van vervaardiging van @nl
toolkit definition: Een manifestatie die een gepubliceerde manifestatie is die is gedrukt, gedupliceerd, gegoten etc. in een plaats. @nl
label: és lloc de fabricació de @ca
definition: Relaciona un lloc amb una manifestació que és una manifestació publicada que s’imprimeix, es reprodueix, es modela, etc., en un lloc. @ca
toolkit label: lloc de fabricació de @ca
toolkit definition: Manifestació que és una manifestació publicada que s’imprimeix, es reprodueix, es modela, etc., en un lloc. @ca
label: er sted for fremstilling af @da
definition: Relaterer et sted til en manifestation, som er en publiceret manifestation, som er trykt, duplikeret, støbt ect. et sted. @da
toolkit label: sted for fremstilling af @da
toolkit definition: Manifestation, som er en publiceret manifestation, som er trykt, duplikeret, støbt ect. et sted. @da
label: valmistamiskoht kehastuses @et
definition: Seostab koha avaldatud kehastusega, mis on selles kohas trükitud, paljundatud, valatud vms. @et
toolkit label: valmistamiskoht kehastuses @et
toolkit definition: Avaldatud kehastus, mis on selles kohas trükitud, paljundatud, valatud vms. @et
label: ist Herstellungsort von @de
definition: Setzt ein Geografikum in Beziehung zu einer veröffentlichten Manifestation, die an einem Ort gedruckt, vervielfältigt, gegossen und so weiter wird. @de
toolkit label: Herstellungsort von @de
toolkit definition: Eine veröffentlichte Manifestation, die an einem Ort gedruckt, vervielfältigt, gegossen und so weiter wird. @de
label: gyártási helye a következőnek: @hu
definition: Hozzákapcsol egy helyet egy kiadott megjelenési formához, amelyet egy bizonyos helyen nyomtattak, sokszoroztak, öntöttek stb. @hu
toolkit label: gyártási helye: @hu
toolkit definition: Egy kiadott megjelenési forma, amelyet egy bizonyos helyen nyomtattak, sokszoroztak, öntöttek stb. @hu
label: è luogo di manifattura di @it
definition: Correla un luogo a una manifestazione pubblicata che è stampata, duplicata, lanciata, etc. in un luogo. @it
toolkit label: luogo di manifattura di @it
toolkit definition: Manifestazione pubblicata che è stampata, duplicata, lanciata, etc. in un luogo. @it
label: ir ražošanas vieta @lv
toolkit label: ir ražošanas vieta @lv
definition: Sasaista vietu ar manifestāciju, kas ir publicēta manifestācija, kas ir iespiesta, pavairota, iesieta norādītā vietā. @lv
toolkit definition: Manifestācija, kas ir publicēta manifestācija, kas ir iespiesta, pavairota, iesieta norādītā vietā. @lv
label: مكان تصنيع موازي لـ @ar
toolkit label: مكان تصنيع لـ @ar
definition: يربط بين مكان وتجسيدة منشورة طُبعت، ونُسخت، وبُثت، إلخ، في مكان. @ar
toolkit definition: تجسيدة منشورة طُبعت، ونُسخت، وبُثت، إلخ، في مكان. @ar
has subproperty: is parallel place of manufacture of
has subproperty: P70040
label: 是……的生产的地点 @zh-hans
toolkit label: ……的生产的地点 @zh-hans
definition: 将一个地点与作为一种出版载体表现在一个地点印刷、复制、铸造等的一种载体表现关联起来。 @zh-hans
toolkit definition: 作为一种出版载体表现在一个地点印刷、复制、铸造等的一种载体表现 @zh-hans
label: üretim yeridir @tr
toolkit label: Üretim yeri @tr
definition: Bir yeri, bir yerde basılmış, çoğaltılmış, biçim verilmiş vb. yayınlanmış bir gösterim olan bir gösterim ile ilişkilendirir. @tr
toolkit definition: Bir yerde basılan çoğaltılan biçim verilmiş vb. yayınlanmış bir gösterim olan bir gösterim. @tr

is place of origin of work of
status: Published
type: Property
lexical alias: placeOfOriginOfWorkOf.en
domain: C10009
toolkit label: place of origin of work of
definition: Relates a place to a work that originated in a place.
toolkit definition: A work that originated in a place.
sub property of: has related work of place
has element type: 2
label: alkuperään liittyvä paikka teokselle @fi
definition: Liittää paikan teokseen, joka on saanut alkunsa paikassa. @fi
toolkit label: alkuperään liittyvä paikka teokselle @fi
toolkit definition: Teos, joka on saanut alkunsa paikassa. @fi
label: er opprinnelsessted for verk for @no
definition: Relaterer et sted til et verk som har sitt opphav fra et sted. @no
toolkit label: opprinnelsessted for verk for @no
toolkit definition: Et verk som har sitt opphav fra et sted. @no
label: est un lieu d’origine d’une œuvre de @fr
definition: Met un lieu en relation avec une œuvre qui est originaire d’un lieu. @fr
toolkit label: lieu d’origine d’une œuvre de @fr
toolkit definition: Œuvre qui est originaire d’un lieu. @fr
label: is plaats van herkomst van werk van @nl
definition: Relateert een plaats aan een werk dat ontstaan is in een plaats. @nl
toolkit label: plaats van herkomst van werk van @nl
toolkit definition: Een werk dat ontstaan is in een plaats. @nl
label: هو مكان لمنشأ عمل لـ @ar
definition: يربط بين مكان وعمل نشأ من مكان. @ar
toolkit label: مكان لمنشأ عمل لـ @ar
toolkit definition: عمل نشأ من مكان. @ar
label: és lloc d’origen d’una obra de @ca
definition: Relaciona un lloc amb una obra que s’originà en un lloc. @ca
toolkit label: lloc d’origen d’una obra de @ca
toolkit definition: Obra que s’originà en un lloc. @ca
label: er oprindelsessted for værk af @da
definition: Relaterer et sted til et værk, som stammer fra et sted. @da
toolkit label: oprindelsessted for værk af @da
toolkit definition: Værk, som stammer fra et sted. @da
label: teose päritoluga seotud koht teoses @et
definition: Seostab koha teosega, mis pärineb sellest kohast. @et
toolkit label: teose päritoluga seotud koht teoses @et
toolkit definition: Teos, mis pärineb sellest kohast. @et
label: ist Ursprungsort eines Werks von @de
definition: Setzt ein Geografikum in Beziehung zu einem Werk, das in einem Geografikum entstanden ist. @de
toolkit label: Ursprungsort eines Werks von @de
toolkit definition: Ein Werk, das in einem Geografikum entstanden ist. @de
label: származási helye a következő műnek: @hu
definition: Hozzákapcsol egy helyet egy műhöz, amely arról a helyről származik. @hu
toolkit label: származási helye a következő műnek: @hu
toolkit definition: Egy mű, amely arról a helyről származik. @hu
label: è luogo di origine dell'opera di @it
definition: Correla un luogo a un'opera che ha avuto origine da un luogo. @it
toolkit label: luogo di origine dell'opera di @it
toolkit definition: Opera che ha avuto origine da un luogo. @it
label: ir darba izcelsmes vieta @lv
toolkit label: ir darba izcelsmes vieta @lv
definition: Sasaista vietu ar darbu, kas radīts vietā. @lv
toolkit definition: Darbs, kas radīts vietā. @lv
has subproperty: P70035
label: 是……的作品的原地点 @zh-hans
toolkit label: ……的作品的原地点 @zh-hans
definition: 将一个地点与起源于一个地点的一种作品关联起来。 @zh-hans
toolkit definition: 起源于一个地点的一种作品 @zh-hans
label: eserinin menşei yeridir @tr
toolkit label: Eserin menşei yeri @tr
definition: Bir yeri, bir yerde ortaya çıkan bir eserle ilişkilendirir. @tr
toolkit definition: Bir yerde ortaya çıkan bir eser. @tr

is place of production of
status: Published
type: Property
lexical alias: placeOfProductionOf.en
domain: C10009
toolkit label: place of production of
definition: Relates a place to a manifestation that is an unpublished manifestation that is inscribed, fabricated, constructed, etc., in a place.
toolkit definition: A manifestation that is an unpublished manifestation that is inscribed, fabricated, constructed, etc., in a place.
sub property of: is place of manifestation of
has element type: 2
label: tuotantopaikka manifestaatiolle @fi
definition: Liittää paikan julkaisemattomaan manifestaatioon, joka on kaiverrettu, valmistettu, koottu tms. paikassa. @fi
toolkit label: tuotantopaikka manifestaatiolle @fi
toolkit definition: Julkaisematon manifestaatio, joka on kaiverrettu, valmistettu, koottu tms. paikassa. @fi
label: er produksjonssted for @no
definition: Relaterer et sted til en manifestasjon som er en upublisert manifestasjon som er inskribert, fabrikert, konstruert etc. på et sted. @no
toolkit label: produksjonssted for @no
toolkit definition: En manifestasjon som er en upublisert manifestasjon som er inskribert, fabrikert, konstruert etc. på et sted. @no
label: est un lieu de production de @fr
definition: Met un lieu en relation avec une manifestation non publiée qui est écrite à la main, fabriquée, construite, etc. dans un lieu. @fr
toolkit label: lieu de production de @fr
toolkit definition: Manifestation non publiée qui est écrite à la main, fabriquée, construite, etc. dans un lieu. @fr
label: is plaats van productie van @nl
definition: Relateert een plaats aan een manifestatie die een ongepubliceerde manifestatie is die is afgeschreven, gefabriceerd, geconstrueerd etc. in een plaats. @nl
toolkit label: plaats van productie van @nl
toolkit definition: Een manifestatie die een ongepubliceerde manifestatie is die is afgeschreven, gefabriceerd, geconstrueerd etc. in een plaats. @nl
label: هو مكان إنتاج لـ @ar
definition: يربط بين مكان وتجسيدة غير منشورة دُونت، ووُضعت، وأُنشئت، إلخ، في مكان. @ar
toolkit label: مكان إنتاج لـ @ar
toolkit definition: تجسيدة غير منشورة دُونت، ووُضعت، وأُنشئت، إلخ، في مكان. @ar
label: és lloc de producció de @ca
definition: Relaciona un lloc amb una manifestació que és una manifestació no publicada que s’inscriu, es fabrica, es construeix, etc., en un lloc. @ca
toolkit label: lloc de producció de @ca
toolkit definition: Manifestació que és una manifestació no publicada que s’inscriu, es fabrica, es construeix, etc., en un lloc. @ca
label: er sted for produktion af @da
definition: Relaterer et sted til en manifestation, som er en upubliceret manifestation, som er indskrevet, fremstillet, konstrueret ect. et sted. @da
toolkit label: sted for produktion af @da
toolkit definition: Manifestation, som er en upubliceret manifestation, som er indskrevet, fremstillet, konstrueret ect. et sted. @da
label: tootmiskoht kehastuses @et
definition: Seostab koha avaldamata kehastusega, mis on selles kohas inskribeeritud, toodetud, ehitatud vms. @et
toolkit label: tootmiskoht kehastuses @et
toolkit definition: Avaldamata kehastus, mis on selles kohas inskribeeritud, toodetud, ehitatud vms. @et
label: ist Entstehungsort von @de
definition: Setzt ein Geografikum in Beziehung zu einer unveröffentlichten Manifestation, die an einem Ort beschriftet, fabriziert, konstruiert und so weiter wird. @de
toolkit label: Entstehungsort von @de
toolkit definition: Eine unveröffentlichte Manifestation, die an einem Ort beschriftet, fabriziert, konstruiert und so weiter wird. @de
label: előállítási helye a következőnek: @hu
definition: Hozzákapcsol egy helyet egy kiadatlan megjelenési formához, amelyet egy bizonyos helyen írnak, készítenek, szerkesztenek stb. @hu
toolkit label: előállítási helye: @hu
toolkit definition: Egy kiadatlan megjelenési forma, amelyet egy bizonyos helyen írnak, készítenek, szerkesztenek stb. @hu
label: è luogo di produzione di @it
definition: Correla un luogo a una manifestazione non pubblicata che è incisa, fabbricata, costruita, etc. in un luogo. @it
toolkit label: luogo di produzione di @it
toolkit definition: Manifestazione non pubblicata che è incisa, fabbricata, costruita, etc. in un luogo. @it
label: ir izgatavošanas vieta @lv
toolkit label: ir izgatavošanas vieta @lv
definition: Sasaista vietu ar manifestāciju, kas ir publicēta manifestācija, kas ir uzrakstīta, izgatavota, radīta u.tml. norādītā vietā. @lv
toolkit definition: Manifestācija, kas ir publicēta manifestācija, kas ir uzrakstīta, izgatavota, radīta u.tml. norādītā vietā. @lv
has subproperty: is parallel place of production of
has subproperty: P70041
label: 是……的制作的地点 @zh-hans
toolkit label: 作为一种出版载体表现在一个地点印刷、复制、铸造等的一种载体表现 @zh-hans
definition: 将一个地点与作为一种非出版载体表现在一个地点镌刻、制造、构建等的一种载体表现关联起来。 @zh-hans
toolkit definition: 作为一种非出版载体表现在一个地点镌刻、制造、构建等的一种载体表现 @zh-hans
label: yapım yeridir @tr
toolkit label: üretim yeri @tr
definition: Bir yeri, bir yere kaydedilen, üretilen, düzenlenen vb. yayınlanmamış bir gösterim olan bir gösterim ile ilişkilendirir. @tr
toolkit definition: Bir yerde yazılan, üretilen, yapılandırılan, vb. yayınlanmamış bir gösterim olan bir gösterim. @tr

is place of publication of
status: Published
type: Property
lexical alias: placeOfPublicationOf.en
domain: C10009
toolkit label: place of publication of
definition: Relates a place to a manifestation that is a published manifestation that is published, released, or issued in a place.
toolkit definition: A manifestation that is a published manifestation that is published, released, or issued in a place.
sub property of: is place of manifestation of
has element type: 2
label: kustannuspaikka manifestaatiolle @fi
definition: Liittää paikan julkaistuun manifestaatioon, joka on kustannettu, julkaistu, ilmestynyt tms. paikassa. @fi
toolkit label: kustannuspaikka manifestaatiolle @fi
toolkit definition: Julkaistu manifestaatio, joka on kustannettu, julkaistu, ilmestynyt tms. paikassa. @fi
label: er utgivelsessted for @no
definition: Relaterer et sted til en manifestasjon som er en publisert manifestasjon som er publisert, tilgjengeliggjort eller utgitt på et sted. @no
toolkit label: utgivelsessted for @no
toolkit definition: En manifestasjon som er en publisert manifestasjon som er publisert, tilgjengeliggjort eller utgitt på et sted. @no
label: est un lieu de publication de @fr
definition: Met un lieu en relation avec une manifestation publiée qui est publiée, mise à disposition ou éditée dans un lieu. @fr
toolkit label: lieu de publication de @fr
toolkit definition: Manifestation publiée qui est publiée, mise à disposition ou éditée dans un lieu. @fr
label: is plaats van publicatie van @nl
definition: Relateert een plaats aan een manifestatie die een gepubliceerde manifestatie is die gepubliceerd, uitgebracht of uitgevaardigd is in een plaats. @nl
toolkit label: plaats van uitgave van @nl
toolkit definition: Een manifestatie die een gepubliceerde manifestatie is die gepubliceerd, uitgebracht of uitgevaardigd is in een plaats. @nl
label: هو مكان النشر لـ @ar
definition: يربط بين مكان وتجسيدة منشورة نُشرت، أو أُصدرت في مكان. @ar
toolkit label: مكان النشر لـ @ar
toolkit definition: تجسيدة منشورة نُشرت، أو أُصدرت في مكان. @ar
label: és lloc de publicació de @ca
definition: Relaciona un lloc amb una manifestació que és una manifestació publicada que es publica o es posa en circulació, s’emet en un lloc. @ca
toolkit label: lloc de publicació de @ca
toolkit definition: Manifestació que és una manifestació publicada que es publica, es posa en circulació o s’emet en un lloc. @ca
label: er sted for udgivelse af @da
definition: Relaterer et sted til en manifestation, som er en publiceret manifestation, som er publiceret, frigivet eller udgivet et sted. @da
toolkit label: sted for udgivelse af @da
toolkit definition: Manifestation, som er en upubliceret manifestation, som er indskrevet, fremstillet, konstrueret ect. et sted. @da
label: ilmumiskoht kehastuses @et
definition: Seostab koha avaldatud kehastusega, mis on selles kohas avaldatud, välja lastud või välja antud. @et
toolkit label: ilmumiskoht kehastuses @et
toolkit definition: Avaldatud kehastus, mis on selles kohas avaldatud, välja lastud või välja antud. @et
label: ist Erscheinungsort von @de
definition: Setzt ein Geografikum in Beziehung zu einer veröffentlichten Manifestation, die an einem Ort veröffentlicht, freigegeben oder herausgegeben wird. @de
toolkit label: Erscheinungsort von @de
toolkit definition: Eine veröffentlichte Manifestation, die an einem Ort veröffentlicht, freigegeben oder herausgegeben wird. @de
label: közzétételi helye a következőnek: @hu
definition: Hozzákapcsol egy helyet egy kiadott megjelenési formához, amelyet egy bizonyos helyen adnak ki, bocsájtanak ki vagy jelentetnek meg. @hu
toolkit label: kiadási helye: @hu
toolkit definition: Egy kiadott megjelenési forma, amelyet egy bizonyos helyen adnak ki, bocsájtanak ki vagy jelentetnek meg. @hu
label: è luogo di pubblicazione di @it
definition: Correla un luogo a una manifestazione che è pubblicata, rilasciata o edita in forma pubblicata in un luogo. @it
toolkit label: luogo di pubblicazione di @it
toolkit definition: Manifestazione che è pubblicata, rilasciata o edita in forma pubblicata in un luogo. @it
label: ir paralēlā publicēšanas vieta @lv
toolkit label: ir paralēlā publicēšanas vieta @lv
definition: Sasaista vietu ar manifestāciju, kas ir publicēta manifestācija, kas ir publicēta, izlaista, izdota norādītā paralēlā vietā. @lv
toolkit definition: Manifestācija, kas ir publicēta manifestācija, kas ir publicēta, izlaista, izdota norādītā paralēlā vietā. @lv
has subproperty: is parallel place of publication of
has subproperty: P70042
label: 是……的出版的地点 @zh-hans
toolkit label: ……的出版的地点 @zh-hans
definition: 将一个地点与作为一种出版载体表现在一个地点出版、发布或发行等的一种载体表现关联起来。 @zh-hans
toolkit definition: 作为一种出版载体表现在一个地点出版、发布或发行等的一种载体表现 @zh-hans
label: yayın yeridir @tr
toolkit label: yayın yeri @tr
definition: Bir yeri, bir yerde yayınlanan, piyasaya sürülen veya yayınlanan bir gösterim olan bir gösterim ile ilişkilendirir. @tr
toolkit definition: Bir yerde yayınlanan, piyasaya sürülen vb. yayınlanmış bir gösterim olan bir gösterim. @tr

is place of residence of
status: Published
type: Property
lexical alias: placeOfResidenceOf.en
domain: C10009
toolkit label: place of residence of
definition: Relates a place to a person who resides or has resided in a place.
toolkit definition: A person who resides or has resided in a place.
sub property of: has related person of place
has element type: 2
label: asuinpaikka henkilölle @fi
definition: Liittää paikan henkilöön, joka asui tai on asunut paikassa. @fi
toolkit label: asuinpaikka henkilölle @fi
toolkit definition: Henkilö, joka asui tai on asunut paikassa. @fi
label: er bosted for @no
definition: Relaterer et sted til en person som bor eller har bodd på et sted. @no
toolkit label: bosted for @no
toolkit definition: En person som bor eller har bodd på et sted. @no
label: est un lieu de résidence de @fr
definition: Met un lieu en relation avec une personne qui réside ou a résidé dans un lieu. @fr
toolkit label: lieu de résidence de @fr
toolkit definition: Personne qui réside ou a résidé dans un lieu. @fr
label: is verblijfplaats van @nl
definition: Relateert een plaats aan een persoon die verblijft of heeft verbleven in een plaats. @nl
toolkit label: verblijfplaats van @nl
toolkit definition: Een persoon die verblijft of heeft verbleven in een plaats. @nl
label: هو مكان الإقامة لـ @ar
definition: يربط بين مكان وشخص يقيم أو أقام في مكان. @ar
toolkit label: مكان الإقامة لـ @ar
toolkit definition: شخص يقيم أو أقام في مكان. @ar
label: és lloc de residència de @ca
definition: Relaciona un lloc amb una persona que resideix o ha residit en un lloc. @ca
toolkit label: lloc de residència de @ca
toolkit definition: Persona que resideix o ha residit en un lloc. @ca
label: er opholdssted af @da
definition: Relaterer et sted til en person, som bor eller har boet et sted. @da
toolkit label: opholdssted af @da
toolkit definition: Person, som bor eller har boet et sted. @da
label: elukoht isikule @et
definition: Seostab koha isikuga, kes elab või elas selles kohas. @et
toolkit label: elukoht isikule @et
toolkit definition: Isik, kes elab või elas selles kohas. @et
label: ist Wohnort von @de
definition: Setzt ein Geografikum in Beziehung zu einer Person, die an einem Ort wohnt oder gewohnt hat. @de
toolkit label: Wohnort von @de
toolkit definition: Eine Person, die an einem Ort wohnt oder gewohnt hat. @de
label: lakóhelye a következőnek: @hu
definition: Egy helyet hozzákapcsol egy személyhez, aki azona helyen lakik vagy tartózkodik. @hu
toolkit label: lakóhelye: @hu
toolkit definition: Egy személy, aki egy bizonyos helyen lakik vagy tartózkodik. @hu
label: è luogo di residenza di @it
definition: Correla un luogo con una persona che è risiede o aveva risieduto in un luogo. @it
toolkit label: luogo di residenza di @it
toolkit definition: Persona che è risiede o aveva risieduto in un luogo. @it
label: ir uzturēšanās vieta @lv
toolkit label: ir uzturēšanās vieta @lv
definition: Sasaista vietu ar personu, kura dzīvo vai ir uzturējusies kādā vietā. @lv
toolkit definition: Persona, kura dzīvo vai ir uzturējusies kādā vietā. @lv
has subproperty: P70027
label: 是……的居住地点 @zh-hans
toolkit label: ……的居住地点 @zh-hans
definition: 将一个地点与在一个地点居住或居住过的一个个人关联起来。 @zh-hans
toolkit definition: 在一个地点居住或居住过的一个个人 @zh-hans
label: ikamet yeridir @tr
toolkit label: ikamet yeri @tr
definition: Bir yeri, bir yerde ikamet eden veya ikamet etmiş olan bir kişi ile ilişkilendirir. @tr
toolkit definition: Bir yerde ikamet eden veya ikamet etmiş bir kişi. @tr

has related entity of place
status: Published
lexical alias: relatedEntityOfPlace.en
definition: Relates a place to an entity that is associated with a place.
toolkit label: related entity of place
toolkit definition: An entity that is associated with a place.
type: Property
domain: C10009
has element type: 1
sub property of: P00028
label: paikkaan liittyvä entiteetti @fi
definition: Liittää paikan entiteettiin, johon paikka liittyy. @fi
toolkit label: paikkaan liittyvä entiteetti @fi
toolkit definition: Entiteetti, johon paikka liittyy. @fi
label: har relatert entitet for sted @no
definition: Relaterer et sted til en entitet som forbindes med et sted. @no
toolkit label: relatert entitet for sted @no
toolkit definition: En entitet som forbindes med et sted. @no
label: a pour entité en relation avec un lieu @fr
definition: Met un lieu en relation avec une entité qui est associée à un lieu. @fr
toolkit label: entité en relation avec un lieu @fr
toolkit definition: Entité qui est associée à un lieu. @fr
label: heeft gerelateerde entiteit van plaats @nl
definition: Relateert een plaats aan een entiteit die geassocieerd is met een plaats. @nl
toolkit label: gerelateerde entiteit van plaats @nl
toolkit definition: Een entiteit die geassocieerd is met een plaats. @nl
label: له كيان مرتبط بمكان @ar
definition: يربط بين مكان وكيان مرتبط بمكان. @ar
toolkit label: له كيان مرتبط بمكان @ar
toolkit definition: كيان مرتبط بمكان. @ar
label: té com a entitat relacionada amb un lloc @ca
definition: Relaciona un lloc amb una entitat que s’associa amb un lloc. @ca
toolkit label: entitat relacionada amb un lloc @ca
toolkit definition: Entitat que s’associa amb un lloc. @ca
label: har entitet relateret til sted @da
definition: Relaterer et sted til en entitet, som er knyttet til et sted. @da
toolkit label: entitet relateret til sted @da
toolkit definition: Entitet, som er knyttet til et sted. @da
label: kohaga seotud olem @et
definition: Seostab koha kohaga seotud olemiga. @et
toolkit label: kohaga seotud olem @et
toolkit definition: Kohaga seotud olem. @et
label: hat mit Geografikum in Beziehung stehende Entität @de
definition: Setzt ein Geografikum in Beziehung zu einer Entität, die mit einem Geografikum in Verbindung steht. @de
toolkit label: mit Geografikum in Beziehung stehende Entität @de
toolkit definition: Eine Entität, die mit einem Geografikum in Verbindung steht. @de
label: hely kapcsolódó entitása a következő: @hu
definition: Hozzákapcsol egy helyet egy entitáshoz, amelyet egy helyhez társítanak. @hu
toolkit label: hely kapcsolódó entitása: @hu
toolkit definition: Egy entitás, amelyet egy helyhez társítanak. @hu
label: ha come entità correlata di luogo @it
definition: Correla un luogo con un'entità associata a un luogo. @it
toolkit label: entità correlata di luogo @it
toolkit definition: Entità associata a un luogo. @it
label: ar vietu saistītā entīte @lv
definition: Sasaista vietu ar entīti, kas saistīta ar vietu. @lv
toolkit label: ar vietu saistītā entīte @lv
toolkit definition: Entīte, kas saistīta ar vietu. @lv
has subproperty: has related RDA entity of place
has subproperty: P70053
label: 有地点的相关实体 @zh-hans
definition: 将一个地点与和一个地点有关的一个实体关联起来。 @zh-hans
toolkit label: 地点的相关实体 @zh-hans
toolkit definition: 和一个地点有关的一个实体 @zh-hans
label: yerin ilgili varlığı ile ilişkilidir @tr
definition: Bir yeri, bir yerle bağlantılı olan bir varlıkla ilişkilendirir. @tr
toolkit label: Yerin ilişkili olduğu varlık @tr
toolkit definition: Bir yerle bağlantılı olan bir varlık. @tr

has related RDA entity of place
status: Published
type: Property
lexical alias: relatedRDAEntityOfPlace.en
definition: Relates a place to an RDA entity that is associated with a place.
domain: C10009
label: har RDA-entitet relateret til sted @da
definition: Relaterer et sted til en RDA-entitet, som er knyttet til et sted. @da
label: có thực thể có liên quan (địa điểm) @vi
definition: Liên kết địa điểm với thực thể liên quan tới địa điểm đang được mô tả. @vi
label: té com a entitat RDA relacionada amb un lloc @ca
definition: Relaciona un lloc amb una entitat RDA que s’associa amb un lloc. @ca
definition: Liittää paikan RDA-entiteettiin, johon paikka liittyy. @fi
label: a pour entité RDA en relation avec un lieu @fr
definition: Met un lieu en relation avec une entité RDA qui est associée à un lieu. @fr
label: έχει σχετική οντότητα (τόπος) @el
definition: Συνδέει έναν τόπο με μια οντότητα που συνδέεται με έναν περιγραφόμενο τόπο. @el
toolkit label: related RDA entity of place
toolkit definition: An RDA entity that is associated with a place.
has element type: 1
sub property of: has related entity of place
label: hely kapcsolódó RDA-entitása a következő: @hu
definition: Hozzákapcsol egy helyet egy RDA-entitáshoz, amelyet egy helyhez társítanak. @hu
sub property of: P00001
toolkit label: paikkaan liittyvä RDA-entiteetti @fi
toolkit definition: RDA-entiteetti, johon paikka liittyy. @fi
label: paikkaan liittyvä RDA-entiteetti @fi
label: har RDA-entitet relatert til sted @no
definition: Relaterer et sted til en RDA-entitet som forbindes med et sted. @no
toolkit label: RDA-entitet relatert til sted @no
toolkit definition: En RDA-entitet som forbindes med et sted. @no
toolkit label: entité RDA en relation avec un lieu @fr
toolkit definition: Entité RDA qui est associée à un lieu. @fr
label: heeft gerelateerde RDA-entiteit van plaats @nl
definition: Relateert een plaats aan een RDA-entiteit die geassocieerd is met een plaats. @nl
toolkit label: gerelateerde RDA-entiteit van plaats @nl
toolkit definition: Een RDA-entiteit die geassocieerd is met een plaats. @nl
label: له كيان "وام" مرتبط بمكان @ar
definition: يربط بين مكان وكيان "وام" مرتبط بمكان. @ar
toolkit label: كيان "وام" مرتبط بمكان @ar
toolkit definition: كيان "وام" مرتبط بمكان. @ar
toolkit label: entitat RDA relacionada amb un lloc @ca
toolkit definition: Entitat RDA que s’associa amb un lloc. @ca
toolkit label: RDA-entitet relateret til sted @da
toolkit definition: RDA-entitet, som er knyttet til et sted. @da
label: kohaga seotud RDA olem @et
definition: Seostab koha kohaga seotud RDA olemiga. @et
toolkit label: kohaga seotud RDA olem @et
toolkit definition: Kohaga seotud RDA olem. @et
label: hat mit Geografikum in Beziehung stehende RDA-Entität @de
definition: Setzt ein Geografikum in Beziehung zu einer RDA-Entität, die mit einem Geografikum in Verbindung steht. @de
toolkit label: mit Geografikum in Beziehung stehende RDA-Entität @de
toolkit definition: Eine RDA-Entität, die mit einem Geografikum in Verbindung steht. @de
toolkit label: hely kapcsolódó RDA-entitása a következő: @hu
toolkit definition: Egy RDA-entitás, amelyet egy helyhez társítanak. @hu
label: ha come entità RDA correlata di luogo @it
definition: Correla un luogo a un'entità RDA associata a un luogo. @it
toolkit label: entità RDA correlata di luogo @it
toolkit definition: Entità RDA associata a un luogo. @it
label: ar vietu saistītā RDA entīte @lv
definition: Sasaista vietu ar RDA entīti, kas saistīta ar vietu. @lv
toolkit label: ar vietu saistītā RDA entīte @lv
toolkit definition: RDA entīte, kas saistīta ar vietu. @lv
has subproperty: has related agent of place
has subproperty: has related place of place
has subproperty: has related timespan of place
has subproperty: has related expression of place
has subproperty: has related manifestation of place
has subproperty: has related work of place
has subproperty: has related nomen of place
has subproperty: has related item of place
has subproperty: P70013
label: 有地点的关联RDA实体 @zh-hans
definition: 将一个地点与和一个地点有关的一个RDA实体关联起来。 @zh-hans
toolkit label: 地点的关联RDA实体 @zh-hans
toolkit definition: 和一个地点有关的一个RDA实体 @zh-hans
label: yerin ilgili RDA varlığı ile ilişkilidir @tr
definition: Bir yeri, bir yerle bağlantılı olan bir RDA varlığıyla ilişkilendirir. @tr
toolkit label: Yerin RDA varlığıyla ilişkisi @tr
toolkit definition: Bir yerle bağlantılı olan bir RDA varlığı. @tr

is right ascension and declination of
status: Published
type: Property
lexical alias: rightAscensionAndDeclinationOf.en
domain: C10009
toolkit label: right ascension and declination of
sub property of: is coordinates of cartographic content of
has element type: 2
definition: Relates a place to a work that is a cartographic work that locates a celestial body that is the coverage of the work and is identified using the angles of right ascension and declination.
toolkit definition: A work that is a cartographic work that locates a celestial body that is the coverage of the work and is identified using the angles of right ascension and declination.
label: rektaskensio ja deklinaatio teokselle @fi
definition: Liittää paikan teokseen, joka on kartografinen teos, joka määrittää taivaankappaleen sijainnin ja teoksen sisällöllisen kattavuuden käyttämällä rektaskension ja deklinaation kulmamittoja. @fi
toolkit label: rektaskensio ja deklinaatio teokselle @fi
toolkit definition: Teos, joka on kartografinen teos, joka määrittää taivaankappaleen sijainnin ja teoksen sisällöllisen kattavuuden käyttämällä rektaskension ja deklinaation kulmamittoja. @fi
label: er rektascensjon og deklinasjon for @no
definition: Relaterer et sted til et verk som er kartografisk som lokaliserer et himmellegeme ved hjelp av vinklene for rektascensjon og deklinasjon. @no
toolkit label: rektascensjon og deklinasjon for @no
toolkit definition: Et verk som er kartografisk som lokaliserer et himmellegeme ved hjelp av vinklene for rektascensjon og deklinasjon. @no
label: est une ascension droite et une déclinaison de @fr
definition: Met un lieu en relation avec une œuvre cartographique qui situe un corps céleste constituant la couverture de l'œuvre et identifié à l’aide des angles d’ascension droite et de déclinaison. @fr
toolkit label: ascension droite et déclinaison de @fr
toolkit definition: Œuvre cartographique qui situe un corps céleste constituant la couverture de l'œuvre et identifié à l’aide des angles d’ascension droite et de déclinaison. @fr
label: is rechte klimming en declinatie van @nl
definition: Relateert een plaats aan een werk dat is een cartografisch werk dat een hemellichaam lokaliseert dat de dekking van het werk is en is geïdentificeerd met gebruikmaking van de hoeken van rechte klimming en declinatie. @nl
toolkit label: rechte klimming en declinatie van @nl
toolkit definition: Een werk dat is een cartografisch werk dat een hemellichaam lokaliseert dat de dekking van het werk is en is geïdentificeerd met gebruikmaking van de hoeken van rechte klimming en declinatie. @nl
label: هو صعود مستقيم وانحراف لـ @ar
definition: يربط بين مكان وعمل عبارة عن مادة خرائطية تحدد موقع جسم سماوي عبارة عن تغطية لعمل ومحدد باستخدام زوايا الصعود المستقيم والانحراف. @ar
toolkit label: صعود مستقيم وانحراف لـ @ar
toolkit definition: عمل عبارة عن مادة خرائطية تحدد موقع جسم سماوي عبارة عن تغطية لعمل ومحدد باستخدام زوايا الصعود المستقيم والانحراف. @ar
label: és ascensió recta i declinació de @ca
definition: Relaciona un lloc amb una obra que és una obra cartogràfica que localitza un cos celeste que és la cobertura de l’obra i s’identifica usant els angles d’ascensió recta i de declinació. @ca
toolkit label: ascensió recta i declinació de @ca
toolkit definition: Obra que és una obra cartogràfica que localitza un cos celeste que és la cobertura de l’obra i s’identifica usant els angles d’ascensió recta i de declinació. @ca
label: er rektascension og deklination for @da
definition: Relaterer et sted til et værk, som er kartografisk, som lokaliserer et himmellegeme ved hjælp af vinklene for rektascension og deklination. @da
toolkit label: rektascension og deklination for @da
toolkit definition: Værk, som er kartografisk, som lokaliserer et himmellegeme ved hjælp af vinklene for rektascension og deklination. @da
label: otsetõus ja kääne teoses @et
definition: Seostab koha kartograafilise teosega, mis hõlmab taevakeha, mille asukoht on tuvastatud, kasutades otsetõusu ja käände nurgamõõte. @et
toolkit label: otsetõus ja kääne teoses @et
toolkit definition: Kartograafiline teos, mis hõlmab taevakeha, mille asukoht on tuvastatud, kasutades otsetõusu ja käände nurgamõõte. @et
label: Rektaszension und Deklination von @de
definition: Setzt einen Ort in Beziehung zu einem kartografischen Werk, das einen Himmelskörpers verortet, der Gegenstand des Werks ist und anhand der Winkel der Rektaszension und der Deklination identifiziert wird. @de
toolkit label: Rektaszension und Deklination von @de
toolkit definition: Ein kartografisches Werk, das einen Himmelskörpers verortet, der Gegenstand des Werks ist und anhand der Winkel der Rektaszension und der Deklination identifiziert wird. @de
label: rektaszcenziója és deklinációja a következőnek: @hu
definition: Hozzákapcsol egy helyet egy kartográfiai műhöz, amely rektaszcenzió és deklináció szögei segítségével határozza meg az égitestek helyzetét az égbolton. @hu
toolkit label: rektaszcenziója és deklinációja: @hu
toolkit definition: Egy kartográfiai mű, amely rektaszcenzió és deklináció szögei segítségével határozza meg az égitestek helyzetét az égbolton. @hu
label: è ascensione retta e declinazione di @it
definition: Correla un luogo a un'opera cartografica che localizza un oggetto celeste nel cielo usando gli angoli di ascensione retta e declinazione. @it
toolkit label: ascensione retta e declinazione di @it
toolkit definition: Opera cartografica che localizza un oggetto celeste nel cielo usando gli angoli di ascensione retta e declinazione. @it
label: ir rektascensija un deklinācija @lv
toolkit label: ir rektascensija un deklinācija @lv
definition: Sasaista vietu ar darbu, kas ir kartogrāfisks darbs, kas nosaka objekta vietu debesīs, izmantojot rektascensijas un deklinācijas leņķus. @lv
toolkit definition: Kartogrāfisks darbs, kas nosaka objekta vietu debesīs, izmantojot rektascensijas un deklinācijas leņķus. @lv
has subproperty: P70036
label: 是……的赤经和赤纬 @zh-hans
toolkit label: ……的赤经和赤纬 @zh-hans
definition: 将一个地点与作为地图作品、定位作为作品覆盖范围并用赤经和赤纬的角度标识的天体的一种作品关联起来。 @zh-hans
toolkit definition: 作为地图作品、定位作为作品覆盖范围并用赤经和赤纬的角度标识的天体的一种作品 @zh-hans
label: yükseliş ve düşüş @tr
toolkit label: yükseliş ve sapma @tr
definition: Bir yeri, işin kapsamı olan bir gök cisminin yerini tespit eden ve sağa yükselme ve sapma açıları kullanılarak tanımlanan kartografik bir eser olan bir eserle ilişkilendirir. @tr
toolkit definition: Bir gök cisminin konumunu belirleyen ve kapsamı bu gök cismi olan, dik yükselme ve sapma açıları kullanılarak tanımlanan kartografik çalışma olan bir eser. @tr

is strings of coordinate pairs of
status: Published
type: Property
lexical alias: stringsOfCoordinatePairsOf.en
domain: C10009
toolkit label: strings of coordinate pairs of
sub property of: is coordinates of cartographic content of
has element type: 2
definition: Relates a place to a work that is a cartographic work that has an area of coverage that is identified by a polygon using coordinates for each vertex.
toolkit definition: A work that is a cartographic work that has an area of coverage that is identified by a polygon using coordinates for each vertex.
label: koordinaattiparit teoksella @fi
definition: Liittää paikan teokseen, joka on kartografinen teos, jonka kattama alue identifioidaan polygonein käyttämällä monikulmion jokaisen kärjen koordinaatteja. @fi
toolkit label: koordinaattiparit teoksella @fi
toolkit definition: Teos, joka on kartografinen teos, jonka kattama alue identifioidaan polygonein käyttämällä monikulmion jokaisen kärjen koordinaatteja. @fi
label: er strenger med koordinatpar for @no
definition: Relaterer et sted til et verk som er kartografisk lokaliserer et presist område ved hjelp av koordinater for hvert hjørne av et polygon. @no
toolkit definition: Et verk som er kartografisk lokaliserer et presist område ved hjelp av koordinater for hvert hjørne av et polygon. @no
label: est une chaînes de paires de coordonnées de @fr
definition: Met un lieu en relation avec une œuvre cartographique qui possède une zone de couverture identifiée par un polygone à l’aide des coordonnées de chaque sommet. @fr
toolkit label: chaînes de paires de coordonnées de @fr
toolkit definition: Œuvre cartographique qui possède une zone de couverture identifiée par un polygone à l’aide des coordonnées de chaque sommet. @fr
label: is tekenreeksen van coördinatenparen van @nl
definition: Relateert een plaats aan een werk dat is een cartografisch werk dat een bestreken gebied heeft dat geïdentificeerd is door een polygoon met gebruikmaking van coördinaten voor elk toppunt. @nl
toolkit label: tekenreeksen van coördinatenparen van @nl
toolkit definition: Een werk dat is een cartografisch werk dat een bestreken gebied heeft dat geïdentificeerd is door een polygoon met gebruikmaking van coördinaten voor elk toppunt. @nl
label: هو خطوط إحداثيات مزدوجة لـ @ar
definition: يربط بين مكان وعمل عبارة عن مادة خرائطية لها نطاق تغطية يحدد بدقة من خلال مضلع باستخدام إحداثيات لكل قمة مضلع. @ar
toolkit label: خطوط إحداثيات مزدوجة لـ @ar
toolkit definition: عمل عبارة عن مادة خرائطية لها نطاق تغطية يحدد بدقة من خلال مضلع باستخدام إحداثيات لكل قمة مضلع. @ar
label: és cadenes de parells de coordenades de @ca
definition: Relaciona un lloc amb una obra que és una obra cartogràfica que té una àrea de cobertura que s’identifica per un polígon mitjançant les coordenades de cada vèrtex. @ca
toolkit label: cadenes de parells de coordenades de @ca
toolkit definition: Obra que és una obra cartogràfica que té una àrea de cobertura que s’identifica per un polígon mitjançant les coordenades de cada vèrtex. @ca
label: er strenge med koordinatpar for @da
definition: Relaterer et sted til et værk, som er kartografisk, som lokaliserer et præcist område ved hjælp af koordinater for hvert hjørne af et polygon. @da
toolkit label: strenge med koordinatpar for @da
toolkit definition: Værk, som er kartografisk, som lokaliserer et præcist område ved hjælp af koordinater for hvert hjørne af et polygon. @da
label: koordinaatide paaride rida teoses @et
definition: Seostab koha kartograafilise teosega, mis hõlmab ala, mis on tuvastatud, kasutades hulknurga iga tipu koordinaate. @et
toolkit label: koordinaatide paaride rida teoses @et
toolkit definition: Kartograafiline teos, mis hõlmab ala, mis on tuvastatud, kasutades hulknurga iga tipu koordinaate. @et
label: sind Reihen von Koordinatenpaaren von @de
definition: Setzt ein Gebiet in Beziehung zu einem kartografischen Werk, dessen Abdeckungsbereich durch ein Vieleck mit Koordinaten für jeden Eckpunkt identifiziert wird. @de
toolkit label: Reihen von Koordinatenpaaren von @de
toolkit definition: Ein kartografisches Werk, dessen Abdeckungsbereich durch ein Vieleck mit Koordinaten für jeden Eckpunkt identifiziert wird. @de
label: koordinátapár-láncai a következőnek: @hu
definition: Hozzákapcsol egy helyet egy kartográfiai műhöz, amely egy pontos terület azonosításához a poligon csúcsainak koordinátáit használja. @hu
toolkit label: koordinátapár-láncai: @hu
toolkit definition: Egy kartográfiai mű, amely egy pontos terület azonosításához a poligon csúcsainak koordinátáit használja. @hu
label: è stringhe di coppie di coordinate @it
definition: Correla un luogo a un'opera cartografica che localizza un'area precisa usando le coordinate per ciascun vertice di un poligono. @it
toolkit label: stringhe di coppie di coordinate @it
toolkit definition: Opera cartografica che localizza un'area precisa usando le coordinate per ciascun vertice di un poligono. @it
label: ir koordinātu pāru virknes @lv
toolkit label: ir koordinātu pāru virknes @lv
definition: Sasaista vietu ar darbu, kas ir kartogrāfisks darbs, kas nosaka precīzu teritoriju, izmantojot katras daudzstūra virsotnes koordinātas. @lv
toolkit definition: Kartogrāfisks darbs, kas nosaka precīzu teritoriju, izmantojot katras daudzstūra virsotnes koordinātas. @lv
has subproperty: P70037
label: 是……的坐标对串 @zh-hans
toolkit label: ……的坐标对串 @zh-hans
definition: 将一个地点与作为地图作品、有通过使用每个角的坐标表示的多边形标识的覆盖范围的一种作品关联起来。 @zh-hans
toolkit definition: 作为地图作品、有通过使用每个角的坐标表示的多边形标识的覆盖范围的一种作品 @zh-hans
label: koordinat çiftlerinin dizileridir @tr
toolkit label: koordinat çiftleri dizgesi @tr
definition: Bir yeri, her tepe noktası için koordinatlar kullanan bir çokgen tarafından tanımlanan bir kapsama alanına sahip kartografik bir çalışma olan bir eserle ilişkilendirir. @tr
toolkit definition: Her köşe için koordinatlar kullanılarak bir çokgen tarafından tanımlanan bir kapsama alanına sahip kartografik çalışma olan bir eser. @tr

has variant access point for place
status: Published
type: Property
lexical alias: variantAccessPointForPlace.en
definition: Relates a place to a nomen that is an access point of place that is not selected for preference in a specific vocabulary encoding scheme.
domain: C10009
toolkit label: variant access point for place
toolkit definition: A nomen that is an access point of place that is not selected for preference in a specific vocabulary encoding scheme.
sub property of: has access point for place
has element type: 3
sub property of: P00022
label: paikan varianttihakutieto @fi
definition: Liittää paikan nomeniin, joka on paikan hakutieto, jota ei ole valittu ensisijaiseksi tietyssä sanaston merkintäjärjestelmässä. @fi
toolkit label: paikan varianttihakutieto @fi
toolkit definition: Nomen, joka on paikan hakutieto, jota ei ole valittu ensisijaiseksi tietyssä sanaston merkintäjärjestelmässä. @fi
label: har alternativ søkeinngang for sted @no
definition: Relaterer et sted til en søkeinngang for sted som ikke er valgt som preferanse i et bestemt kodeskjema for vokabular. @no
toolkit label: alternativ søkeinngang for sted @no
toolkit definition: En søkeinngang for sted som ikke er valgt som preferanse i et bestemt kodeskjema for vokabular. @no
label: a pour variante de point d’accès d’un lieu @fr
definition: Met un lieu en relation avec un nomen qui est un point d’accès d’un lieu ne faisant pas l’objet d’un choix privilégié dans un schéma d’encodage de vocabulaire spécifique. @fr
toolkit label: variante de point d’accès d’un lieu @fr
toolkit definition: Nomen qui est un point d’accès d’un lieu ne faisant pas l’objet d’un choix privilégié dans un schéma d’encodage de vocabulaire spécifique. @fr
label: heeft variant ingang voor plaats @nl
definition: Relateert een plaats aan een nomen dat is een ingang van plaats die niet als voorkeursterm geselecteerd is in een specifiek vocabulair coderingssysteem. @nl
toolkit label: variant ingang voor plaats @nl
toolkit definition: Een nomen dat is een ingang van plaats die niet als voorkeursterm geselecteerd is in een specifiek vocabulair coderingssysteem. @nl
label: له نقطة وصول مختلفة لمكان @ar
definition: يربط بين مكان وتسمية عبارة عن نقطة وصول لمكان لم يتم اختيارها بتفضيل استخدامها في خطة ترميز مفردات محددة. @ar
toolkit label: نقطة وصول مختلفة لمكان @ar
toolkit definition: تسمية عبارة عن نقطة وصول لمكان لم يتم اختيارها بتفضيل استخدامها في خطة ترميز مفردات محددة. @ar
label: té com a variant de punt d’accés de lloc @ca
definition: Relaciona un lloc amb un nomen que és un punt d’accés de lloc que no se selecciona com a preferent en un esquema de codificació de vocabulari específic. @ca
toolkit label: variant de punt d’accés de lloc @ca
toolkit definition: Nomen que és un punt d’accés de lloc que no se selecciona com a preferent en un esquema de codificació de vocabulari específic. @ca
label: har variant af søgeindgang for sted @da
definition: Relaterer et sted til en søgeindgang for sted, som ikke er valgt som præference i et specifikt vokabularkodningsskema. @da
toolkit label: variant af søgeindgang for sted @da
toolkit definition: Søgeindgang for sted, som ikke er valgt som præference i et specifikt vokabularkodningsskema. @da
label: koha otsielemendi variant @et
definition: Seostab koha koha otsielemendiga, mis ei ole valitud eelistatuks vastavas leksikaalses märkimissüsteemis. @et
toolkit label: koha otsielemendi variant @et
toolkit definition: Koha otsielement, mis ei ole valitud eelistatuks vastavas leksikaalses märkimissüsteemis. @et
label: hat zusätzlichen Sucheinstieg für ein Geografikum @de
definition: Setzt ein Geografikum in Beziehung zu einem Sucheinstieg für ein Geografikum, der in einem bestimmten Vocabulary Encoding Scheme nicht als Vorzugsform bestimmt wird. @de
toolkit label: Zusätzlicher Sucheinstieg für ein Geografikum @de
toolkit definition: Ein Sucheinstieg für ein Geografikum, der in einem bestimmten Vocabulary Encoding Scheme nicht als Vorzugsform bestimmt wird. @de
label: hozzáférésipont-változat helyhez a következő: @hu
definition: Hozzákapcsol egy helyet egy nomenhez, amely egy olyan hozzáférési pont a helyhez, amely egy bizonyos szótárkódolási sémában nem részesül előnyben. @hu
toolkit label: hozzáférésipont-változat helyhez a következő: @hu
toolkit definition: Egy nomen, amely egy olyan hozzáférési pont a helyhez, amely egy bizonyos szótárkódolási sémában nem részesül előnyben. @hu
label: ha come punto d'accesso variante per luogo @it
definition: Correla un luogo a un punto d'accesso per un luogo che non è stato selezionato come preferito in uno specifico schema di codifica di vocabolario. @it
toolkit label: punto d'accesso variante per luogo @it
toolkit definition: Punto d'accesso per un luogo che non è stato selezionato come preferito in uno specifico schema di codifica di vocabolario. @it
label: vietas papildforma @lv
definition: Sasaista vietu ar nomenu, kas ir piekļuves punkts vietai, kas nav izvēlēta kā prioritāra noteiktai kontrolētas vārdnīcas shēmai. @lv
toolkit label: vietas papildforma @lv
toolkit definition: Piekļuves punkts vietai, kas nav izvēlēta kā prioritāra noteiktai kontrolētas vārdnīcas shēmai. @lv
has subproperty: P70046
label: 有地点的变异检索点 @zh-hans
definition: 将一个地点与作为一个地点的检索点并在一个特定的词表编码体系中未被首选的一个命名关联起来。 @zh-hans
toolkit label: 地点的变异检索点 @zh-hans
toolkit definition: 作为一个地点的检索点并在一个特定的词表编码体系中未被首选的一个命名 @zh-hans
label: yer için alternatif erişim noktası ile ilişkilidir @tr
definition: Bir yeri, belirli bir kelime kodlama şemasında tercih için seçilmemiş bir yerin erişim noktası olan bir isim ile ilişkilendirir. @tr
toolkit label: yer için alternatif erişim noktası @tr
toolkit definition: Belirli bir kelime kodlama şemasında tercih için seçilmemiş bir yerin erişim noktası olan bir isim. @tr

Published
type: Concept

Deprecated
type: Concept

is location of collection of
status: Published
definition: Relates a place to a manifestation of a collection work that is stored in a place.
type: Property
domain: C10009
lexical alias: locationOfCollectionOf.en
has element type: 2
toolkit label: location of collection of
toolkit definition: A manifestation of a collection work that is stored in a place.
sub property of: has related manifestation of place
toolkit definition: Kokoelmateoksen manifestaatio, jota säilytetään paikassa. @fi
toolkit label: sijainti kokoelmalle @fi
definition: Liittää paikan kokoelmateoksen manifestaatioon, jota säilytetään paikassa. @fi
label: sijainti kokoelmalle @fi
has subproperty: P70055
label: 是……的收藏的位置 @zh-hans
definition: 将一个地点与在一个地点储存的一种收藏作品的一种载体表现关联起来。 @zh-hans
toolkit label: ……的收藏的位置 @zh-hans
toolkit definition: 在一个地点储存的一种收藏作品的一种载体表现 @zh-hans
label: és localització de col·lecció de recursos de @ca
definition: Relaciona un lloc amb una manifestació d’una obra de col·lecció de recursos que s’emmagatzema en un lloc. @ca
toolkit label: localització de col·lecció de recursos de @ca
toolkit definition: Manifestació d’una obra de col·lecció de recursos que s’emmagatzema en un lloc. @ca
label: est un emplacement d’une collection de ressources de @fr
definition: Met un lieu en relation avec une manifestation d’une collection de ressources qui est conservée dans un lieu. @fr
toolkit label: emplacement d’une collection de ressources de @fr
toolkit definition: Manifestation d’une collection de ressources qui est conservée dans un lieu. @fr
label: koleksiyonunun konumudur @tr
definition: Bir yeri, bir yerde saklanan bir koleksiyon eserinin gösterimiyle ilişkilendirir. @tr
toolkit label: koleksiyon konumu @tr
toolkit definition: Bir yerde saklanan bir koleksiyon eserinin gösterimi @tr

is location of item of
status: Published
definition: Relates a place to an item that is held, stored, or made available for access in a place.
type: Property
domain: C10009
lexical alias: locationOfItemOf.en
has element type: 2
toolkit label: location of item of
toolkit definition: An item that is held, stored, or made available for access in a place.
sub property of: has related item of place
toolkit definition: Kappale, joka säilytetään tai asetetaan saataville paikassa. @fi
toolkit label: sijainti kappaleelle @fi
definition: Liittää paikan kappaleeseen, joka säilytetään tai asetetaan saataville paikassa. @fi
label: sijainti kappaleelle @fi
has subproperty: P70056
label: 是……的单件的位置 @zh-hans
definition: 将一个地点与在一个地点收藏、储存或提供获取的一个单件关联起来。 @zh-hans
toolkit label: ……的单件的位置 @zh-hans
toolkit definition: 在一个地点收藏、储存或提供获取的一个单件 @zh-hans
label: és localització d’ítem de @ca
definition: Relaciona un lloc amb un ítem que es aplegat, emmagatzemat o és fet disponible per a l’accés en un lloc. @ca
toolkit label: localització d’ítem de @ca
toolkit definition: Ítem que es aplegat, emmagatzemat o és fet disponible per a l’accés en un lloc. @ca
label: est un emplacement d’un item de @fr
definition: Met un lieu en relation avec un tem qui est conservé, entreposé ou rendu accessible dans un lieu. @fr
toolkit label: emplacement d’un item de @fr
toolkit definition: Item qui est conservé, entreposé ou rendu accessible dans un lieu. @fr
label: kopyasının konumudur @tr
definition: Bir yeri, bir yerde tutulan, depolanan veya erişime açık hale getirilen bir kopyayla ilişkilendirir. @tr
toolkit label: kopyanın konumu @tr
toolkit definition: Bir yerde tutulan, depolanan veya erişime açık hale getirilen bir kopya. @tr

is place described with metadata by
status: Published
definition: Relates a place to a work that is a metadata work for a place.
type: Property
domain: C10009
lexical alias: placeDescribedWithMetadataBy.en
has element type: 2
toolkit label: place described with metadata by
toolkit definition: A work that is a metadata work for a place.
sub property of: is place described by
toolkit definition: Teos, joka on paikan metatietoteos. @fi
toolkit label: paikkaa metatiedoilla kuvaileva teos @fi
definition: Liittää paikan teokseen, joka on paikan metatietoteos. @fi
label: paikkaa metatiedoilla kuvaileva teos @fi
has subproperty: P70057
label: 是被……用元数据描述的地点 @zh-hans
definition: 将一个地点与作为一个地点之元数据描述的一种作品关联起来。 @zh-hans
toolkit label: 被……用元数据描述的地点 @zh-hans
toolkit definition: 作为一个地点之元数据描述的一种作品 @zh-hans
label: és lloc descrit amb metadades per @ca
definition: Relaciona un lloc amb una obra que és una obra de metadades per a un lloc. @ca
toolkit label: lloc descrit amb metadades per @ca
toolkit definition: Obra que és una obra de metadades per a un lloc. @ca
label: est un lieu décrit avec des métadonnées par @fr
definition: Met un lieu en relation avec une œuvre qui consiste en une œuvre de métadonnées pour un lieu. @fr
toolkit label: lieu décrit avec des métadonnées par @fr
toolkit definition: Œuvre qui consiste en une œuvre de métadonnées pour un lieu. @fr
label: tarafından üstveri ile tanımlanmış yerdir @tr
definition: Bir yeri, bir yer için üst veri çalışması olan bir eserle ilişkilendirir. @tr
toolkit label: tarafından metadatalarla tanımlanan yer @tr
toolkit definition: Bir yer için üstveri çalışması olan bir eser. @tr