Published
type: Concept

Deprecated
type: Concept

Place properties
licence: deed.en US
contributor: RSC Technical Working Group
creator: RDA Steering Committee
description: Properties that represent the attribute and relationship elements of the RDA Place entity.
description: RDA-elementeistä johdetut ominaisuudet RDA:n paikan määrittelyjoukossa. @fi
issued: 2016-07-11
modified: 2025-05-16
publisher: ALA Digital Reference
rights: Copyright © 2020 American Library Association, Canadian Federation of Library Associations, and CILIP: Chartered Institute of Library and Information Professionals
title: RDA:n paikan ominaisuudet @fi
type: http://rdaregistry.info/termList/RDALinkedDataWork/1003
preferred namespace prefix: rdap
type: Ontology
version info: v5.4.2

has name of place
has element type: 3
instruction number: 16.2
toolkit definition: A nomen that is an appellation of place in natural language and phrasing used in common discourse.
toolkit definition: Benævnelse på sted på normalsprog og med formuleringer, som bruges alment. @da
toolkit definition: Designazione di luogo in linguaggio e frasi naturali usati nel discorso comune. @it
toolkit definition: Doğal dilde ve ortak söylemde kullanılan ifadelerde bir yerin unvanı olan bir isim. @tr
toolkit definition: Een nomen dat is een benaming van plaats in natuurlijke taal en terminologie in gebruikelijke bewoording. @nl
toolkit definition: Egy nomen, amely egy hely természetes nyelvi, a közbeszéd során használt megnevezése és megfogalmazása. @hu
toolkit definition: Eine Bezeichnung für ein Geografikum in natürlicher Sprache und Ausdrucksweise, die beim normalen Sprechen und Schreiben verwendet wird. @de
toolkit definition: En betegnelse for sted på naturlig språk og med frasering brukt i alminnelig diskurs. @no
toolkit definition: Koha nimetus loomulikus keeles ja sõnastuses, mida kasutatakse ühises diskursuses. @et
toolkit definition: Nomen que és una apel·lació de lloc en llenguatge i frases naturals usada en el discurs comú. @ca
toolkit definition: Nomen qui est une appellation de lieu exprimée dans un langage et une formulation naturels et utilisée dans le langage courant. @fr
toolkit definition: Nomen, joka on luonnollisen kielen ja sanamuodon mukainen paikan nimitys, jota käytetään yleisessä diskurssissa. @fi
toolkit definition: Từ, ký tự, hoặc nhóm từ hoặc ký tự mà theo đó địa điểm được biết đến. @vi
toolkit definition: Vietas apzīmējums dabiskajā valodā, ko izmanto savstarpējā saziņā. @lv
toolkit definition: Μια λέξη, ένας χαρακτήρας ή μια ομάδα λέξεων ή χαρακτήρων με τους οποίους είναι γνωστός ένας τόπος. @el
toolkit definition: تسمية عبارة عن اسم تعريفي لمكان في اللغة الطبيعية والصياغة المستخدمة في الخطاب العام. @ar
toolkit definition: 作为用自然语言和普通话语措词表达的一个地点之称谓的一个命名 @zh-hans
toolkit label: Name eines Geografikums @de
toolkit label: Yerin adı @tr
toolkit label: helyneve: @hu
toolkit label: koha nimi @et
toolkit label: naam van plaats @nl
toolkit label: name of place
toolkit label: navn på sted @da
toolkit label: nom de lieu @fr
toolkit label: nom de lloc @ca
toolkit label: nome di luogo @it
toolkit label: paikan nimi @fi
toolkit label: stedsnavn @no
toolkit label: tên địa điểm @vi
toolkit label: vietas nosaukums @lv
toolkit label: όνομα του τόπου @el
toolkit label: اسم لمكان @ar
toolkit label: 地点的名称 @zh-hans
has subproperty: has preferred name of place
has subproperty: has variant name of place
has subproperty: P70001
lexical alias: nameOfPlace.en
status: Published
type: Property
domain: C10009
label: a pour nom de lieu @fr
label: có tên địa điểm @vi
label: ha come nome di luogo @it
label: har navn på sted @da
label: har stedsnavn @no
label: hat Namen eines Geografikums @de
label: heeft naam van plaats @nl
label: helyneve a következő: @hu
label: koha nimi @et
label: paikan nimi @fi
label: té com a nom de lloc @ca
label: vietas nosaukums @lv
label: yerin adı ile ilişkilidir @tr
label: έχει όνομα του τόπου @el
label: له اسم لمكان @ar
label: 有地点的名称 @zh-hans
sub property of: has appellation of place
sub property of: P00019
definition: Bir yeri, doğal dilde ve ortak söylemde kullanılan ifadelerde bir yer adı olan bir isim ile ilişkilendirir. @tr
definition: Correla un luogo a una designazione di luogo in linguaggio e frasi naturali usati nel discorso comune. @it
definition: Hozzákapcsol egy helyet egy nomenhez, egy hely természetes nyelvi, a közbeszéd során használt megnevezéséhez és megfogalmazásához. @hu
definition: Liittää paikan nomeniin, joka on luonnollisen kielen ja sanamuodon mukaiseen paikan nimitys, jota käytetään yleisessä diskurssissa. @fi
definition: Liên kết địa điểm với từ, ký tự, hoặc nhóm từ và/hoặc ký tự mà theo đó địa điểm được biết đến. @vi
definition: Met un lieu en relation avec un nomen qui est une appellation de lieu exprimée dans un langage et une formulation naturels et utilisée dans le langage courant. @fr
definition: Relaciona un lloc amb un nomen que és una apel·lació de lloc en llenguatge i frases naturals usada en el discurs comú. @ca
definition: Relateert een plaats aan een nomen dat is een benaming van plaats in natuurlijke taal en terminologie in gebruikelijke bewoording. @nl
definition: Relaterer en tidsperiode til en benævnelse på sted på normalsprog og med formuleringer, som bruges alment. @da
definition: Relaterer et sted til en betegnelse for sted på naturlig språk og med frasering brukt i alminnelig diskurs. @no
definition: Relates a place to a nomen that is an appellation of place in natural language and phrasing used in common discourse.
definition: Sasaista vietu ar nomenu, kas ir vietas apzīmējums dabiskajā valodā, ko izmanto savstarpējā saziņā. @lv
definition: Seostab koha koha nimetusega loomulikus keeles ja sõnastuses, mida kasutatakse ühises diskursuses. @et
definition: Setzt ein Geografikum in Beziehung zu einer Bezeichnung für ein Geografikum in natürlicher Sprache und Ausdrucksweise, die beim normalen Sprechen und Schreiben verwendet wird. @de
definition: Συνδέει έναν τόπο με μια λέξη, έναν χαρακτήρα ή μια ομάδα λέξεων ή/και χαρακτήρων με τους οποίους είναι γνωστός ένας τόπος. @el
definition: يربط بين مكان وتسمية عبارة عن اسم تعريفي لمكان في اللغة الطبيعية والصياغة المستخدمة في الخطاب العام. @ar
definition: 将一个地点与作为用自然语言和普通话语措词表达的一个地点之称谓的一个命名关联起来。 @zh-hans

has preferred name of place
has element type: 3
instruction number: 16.2.2
toolkit definition: A nomen that is a name of place that is selected for preference in a specific application or context.
toolkit definition: Belirli bir uygulama veya bağlamda tercih için seçilen bir yer adı olan bir isim. @tr
toolkit definition: Een nomen dat is een naam van plaats die als voorkeursterm geselecteerd is in een specifieke toepassing of context. @nl
toolkit definition: Egy nomen, amely egy olyan helynév, amelyet egy bizonyos alkalmazásban vagy kontextusban előnyben részesítenek. @hu
toolkit definition: Ein Name eines Geografikums, der in einer bestimmten Anwendung oder in einem bestimmten Kontext als Vorzugsform bestimmt wird. @de
toolkit definition: Et navn på sted som er valgt som preferanse i en bestemt applikasjon eller kontekst. @no
toolkit definition: Koha nimi, mis kindlas rakenduses või kontekstis on valitud eelistatuks. @et
toolkit definition: Navn på sted, som er valgt som præference i en specifik anvendelse eller kontekst. @da
toolkit definition: Nome di luogo che è stato selezionato come preferito in una specifica applicazione o contesto. @it
toolkit definition: Nomen que és un nom de lloc que se selecciona com a preferent en una aplicació o context específic. @ca
toolkit definition: Nomen qui est un nom de lieu faisant l’objet d’un choix privilégié dans une application ou un contexte spécifiques. @fr
toolkit definition: Nomen, joka on paikan nimi, joka on valittu ensisijaiseksi tietyssä sovelluksessa tai kontekstissa. @fi
toolkit definition: Tên hoặc hình thái của tên được chọn lựa để nhận dạng địa điểm. @vi
toolkit definition: Vietas nosaukums, kas ir izvēlēts noteiktam lietojumam vai noteiktā kontekstā. @lv
toolkit definition: Ένα όνομα ή μια μορφή του ονόματος που επιλέγεται για την ταύτιση ενός τόπου. @el
toolkit definition: تسمية عبارة عن اسم لمكان يتم اختياره بتفضيل استخدامه في تطبيق محدد أو سياق محدد. @ar
toolkit definition: 作为在一个特定的应用或语境中被首选的一个地点名称的一个命名 @zh-hans
toolkit label: Bevorzugter Name eines Geografikums @de
toolkit label: Yerin tercih edilen ismi @tr
toolkit label: előnyben részesített helyneve: @hu
toolkit label: foretrukket navn på sted @da
toolkit label: foretrukket stedsnavn @no
toolkit label: geprefereerde naam van plaats @nl
toolkit label: koha eelisnimi @et
toolkit label: nom preferit de lloc @ca
toolkit label: nom privilégié d’un lieu @fr
toolkit label: nome preferito di luogo @it
toolkit label: paikan ensisijainen nimi @fi
toolkit label: preferred name of place
toolkit label: tên ưu tiên của địa điểm @vi
toolkit label: vietas prioritārais nosaukums @lv
toolkit label: προτιμώμενο όνομα για τόπο @el
toolkit label: اسم مفضل لمكان @ar
toolkit label: 地点的首选名称 @zh-hans
has subproperty: P70002
lexical alias: preferredNameOfPlace.en
status: Published
type: Property
domain: C10009
label: a pour nom privilégié d’un lieu @fr
label: có tên ưu tiên của địa điểm @vi
label: előnyben részesített helyneve a következő: @hu
label: ha come nome preferito di luogo @it
label: har foretrukket navn på sted @da
label: har foretrukket stedsnavn @no
label: hat bevorzugten Namen eines Geografikums @de
label: heeft geprefereerde naam van plaats @nl
label: koha eelisnimi @et
label: paikan ensisijainen nimi @fi
label: tercih edilen yer adı ile ilişkilidir @tr
label: té com a nom preferit de lloc @ca
label: vietas prioritārais nosaukums @lv
label: έχει προτιμώμενο όνομα για τόπο @el
label: له اسم مفضل لمكان @ar
label: 有地点的首选名称 @zh-hans
sub property of: has name of place
sub property of: P00021
alternative label: Yer için tercih edilen isim @tr
alternative label: előnyben részesített helynév: @hu
alternative label: preferred name for place
alternative label: اسم مفضل لمكان @ar
alternative label: 地点的首选名称 @zh-hans
definition: Bir yeri, belirli bir uygulama veya bağlamda tercih edilmek üzere seçilen yerin adı olan bir isim ile ilişkilendirir. @tr
definition: Correla un luogo a un nome di luogo che è stato selezionato come preferito in una specifica applicazione o contesto. @it
definition: Hozzákapcsol egy helyet egy nomenhez, amely egy olyan helynév, amelyet egy bizonyos alkalmazásban vagy kontextusban előnyben részesítenek. @hu
definition: Liittää paikan nomeniin, joka on paikan nimi, joka on valittu ensisijaiseksi tietyssä sovelluksessa tai kontekstissa. @fi
definition: Liên kết địa điểm với tên hoặc hình thái của tên được chọn lựa để nhận dạng địa điểm. @vi
definition: Met un lieu en relation avec un nomen qui est un nom de lieu faisant l’objet d’un choix privilégié dans une application ou un contexte spécifiques. @fr
definition: Relaciona un lloc amb un nomen que és un nom de lloc que se selecciona com a preferent en una aplicació o context específic. @ca
definition: Relateert een plaats aan een nomen dat is een naam van plaats die als voorkeursterm geselecteerd is in een specifieke toepassing of context. @nl
definition: Relaterer et sted til et navn på sted som er valgt som preferanse i en bestemt applikasjon eller kontekst. @no
definition: Relaterer et sted til et navn på sted, som er valgt som præference i en specifik anvendelse eller kontekst. @da
definition: Relates a place to a nomen that is a name of place that is selected for preference in a specific application or context.
definition: Sasaista vietu ar nomenu, kas ir vietas nosaukums, kas ir izvēlēts noteiktam lietojumam vai noteiktā kontekstā. @lv
definition: Seostab koha koha nimega, mis kindlas rakenduses või kontekstis on valitud eelistatuks. @et
definition: Setzt ein Geografikum in Beziehung zu einem Namen eines Geografikums, der in einer bestimmten Anwendung oder in einem bestimmten Kontext als Vorzugsform bestimmt wird. @de
definition: Συνδέει έναν τόπο με ένα όνομα ή μια μορφή του ονόματος που επιλέγεται για την ταύτιση ενός τόπου. @el

has variant name of place
has element type: 3
instruction number: 16.2.3
toolkit definition: A nomen that is a name of place that is not selected for preference in a specific application or context.
toolkit definition: Belirli bir uygulama veya bağlamda tercih için seçilmemiş bir yer adı olan bir isim. @tr
toolkit definition: Een nomen dat is een naam van plaats die niet als voorkeursterm geselecteerd is in een specifieke toepassing of context. @nl
toolkit definition: Egy nomen, amely egy olyan helynév, amelyet egy adott alkalmazásban vagy kontextusban nem részesítenek előnyben. @hu
toolkit definition: Ein Name eines Geografikums, der in einer bestimmten Anwendung oder in einem bestimmten Kontext nicht als Vorzugsform bestimmt wird. @de
toolkit definition: Et navn på sted som ikke er valgt som preferanse i en bestemt applikasjon eller kontekst. @no
toolkit definition: Koha nimi, mis kindlas rakenduses või kontekstis ei ole valitud eelistatuks. @et
toolkit definition: Navn på sted, som ikke er valgt som præference i en specifik anvendelse eller kontekst. @da
toolkit definition: Nome di luogo che non è stato selezionato come preferito in una specifica applicazione o contesto. @it
toolkit definition: Nomen que és un nom de lloc que no se selecciona com a preferent en una aplicació o un context específic. @ca
toolkit definition: Nomen qui est un nom de lieu ne faisant pas l’objet d’un choix privilégié dans une application ou un contexte spécifiques. @fr
toolkit definition: Nomen, joka on paikan nimi, jota ei ole valittu ensisijaiseksi tietyssä sovelluksessa tai kontekstissa. @fi
toolkit definition: Tên hoặc hình thái của tên mà theo đó địa điểm được biết đến khác với tên hoặc hình thái của tên được chọn lựa như là tên ưu tiên. @vi
toolkit definition: Vietas nosaukums, kas nav izvēlēts kā prioritārs noteiktā lietojumprogrammā vai kontekstā. @lv
toolkit definition: Ένα όνομα ή μια μορφή του ονόματος με το οποίο είναι γνωστός ένας τόπος, το οποίο διαφέρει από ένα όνομα ή μια μορφή ονόματος που επιλέγεται ως το προτιμώμενο όνομα. @el
toolkit definition: تسمية عبارة عن اسم لمكان لم يتم اختياره بتفضيل استخدامه في تطبيق محدد أو سياق محدد. @ar
toolkit definition: 作为在一个特定的应用或语境中未被首选的一个地点名称的一个命名 @zh-hans
toolkit label: Abweichender Name eines Geografikums @de
toolkit label: helynévváltozata: @hu
toolkit label: koha variantnimi @et
toolkit label: nome variante di luogo @it
toolkit label: paikan varianttinimi @fi
toolkit label: tên khác của địa điểm @vi
toolkit label: variant af navn på sted @da
toolkit label: variant de nom de lloc @ca
toolkit label: variant naam van plaats @nl
toolkit label: variant name of place
toolkit label: variante de nom de lieu @fr
toolkit label: variantform av stedsnavn @no
toolkit label: vietas cits nosaukums @lv
toolkit label: yerin alternatif ismi @tr
toolkit label: εναλλακτικό όνομα για τόπο @el
toolkit label: اسم مختلف لمكان @ar
toolkit label: 地点的变异名称 @zh-hans
has subproperty: P70003
lexical alias: variantNameOfPlace.en
status: Published
type: Property
domain: C10009
label: a pour variante de nom de lieu @fr
label: có tên khác của địa điểm @vi
label: ha come nome variante di luogo @it
label: har variant af navn på sted @da
label: har variantform av stedsnavn @no
label: hat abweichenden Namen eines Geografikums @de
label: heeft variant naam van plaats @nl
label: helynévváltozata a következő: @hu
label: koha variantnimi @et
label: paikan varianttinimi @fi
label: té com a variant de nom de lloc @ca
label: vietas cits nosaukums @lv
label: yerin alternatif ismi ile ilişkilidir @tr
label: έχει εναλλακτικό όνομα για τόπο @el
label: له اسم مختلف لمكان @ar
label: 有地点的变异名称 @zh-hans
sub property of: has name of place
sub property of: P00023
alternative label: A helynévváltozat magában foglal referenszforrásokban található nevet, vagy olyan nevet, amely a név eltérő átírásából származik. @hu
alternative label: Yer için alternatif isim @tr
alternative label: variant af navn for sted @da
alternative label: variant name for place
alternative label: اسم مختلف لمكان @ar
alternative label: 地点的变异名称 @zh-hans
definition: Bir yeri, belirli bir uygulama veya bağlamda tercih edilmek üzere seçilmeyen yerin adı olan bir isim ile ilişkilendirir. @tr
definition: Correla un luogo a un nome di luogo che non è stato selezionato come preferito in una specifica applicazione o contesto. @it
definition: Hozzákapcsol egy helyet egy nomenhez, amely egy olyan helynév, amelyet egy adott alkalmazásban vagy kontextusban nem részesítenek előnyben. @hu
definition: Liittää paikan nomeniin, joka on paikan nimi, jota ei ole valittu ensisijaiseksi tietyssä sovelluksessa tai kontekstissa. @fi
definition: Liên kết địa điểm với tên hoặc hình thái của tên mà theo đó địa điểm được biết đến khác với tên hoặc hình thái của tên được chọn lựa như là tên ưu tiên. @vi
definition: Met un lieu en relation avec un nomen qui est un nom de lieu ne faisant pas l’objet d’un choix privilégié dans une application ou un contexte spécifiques. @fr
definition: Relaciona un lloc amb un nomen que és un nom de lloc que no se selecciona com a preferent en una aplicació o un context específic. @ca
definition: Relateert een plaats aan een nomen dat is een naam van plaats die niet als voorkeursterm geselecteerd is in een specifieke toepassing of context. @nl
definition: Relaterer et sted til et navn på sted som ikke er valgt som preferanse i en bestemt applikasjon eller kontekst. @no
definition: Relaterer et sted til et navn på sted, som ikke er valgt som præference i en specifik anvendelse eller kontekst. @da
definition: Relates a place to a nomen that is a name of place that is not selected for preference in a specific application or context.
definition: Sasaista vietu ar nomenu, kas ir vietas nosaukums, kas nav izvēlēts kā prioritārs noteiktā lietojumprogrammā vai kontekstā. @lv
definition: Seostab koha koha nimega, mis kindlas rakenduses või kontekstis ei ole valitud eelistatuks. @et
definition: Setzt ein Geografikum in Beziehung zu einem Namen eines Geografikums, der in einer bestimmten Anwendung oder in einem bestimmten Kontext nicht als Vorzugsform bestimmt wird. @de

has related work of place
has element type: 1
toolkit definition: A work that is associated with a place.
toolkit definition: Bir yerle bağlantılı olan bir eser. @tr
toolkit definition: Darbs, kas saistīts ar vietu. @lv
toolkit definition: Een werk dat geassocieerd is met een plaats. @nl
toolkit definition: Egy mű, amelyet egy helyhez társítanak. @hu
toolkit definition: Ein Werk, das mit einem Geografikum in Verbindung steht. @de
toolkit definition: Et verk som forbindes med et sted. @no
toolkit definition: Kohaga seotud teos. @et
toolkit definition: Obra que s’associa amb un lloc. @ca
toolkit definition: Opera associata a un luogo. @it
toolkit definition: Teos, johon paikka liittyy. @fi
toolkit definition: Værk, som er knyttet til et sted. @da
toolkit definition: Œuvre qui est associée à un lieu. @fr
toolkit definition: عمل مرتبط بمكان. @ar
toolkit definition: 和一个地点有关的一种作品 @zh-hans
toolkit label: Yerle ilişkili eser @tr
toolkit label: ar vietu saistītais darbs @lv
toolkit label: gerelateerd werk van plaats @nl
toolkit label: hely kapcsolódó műve @hu
toolkit label: kohaga seotud teos @et
toolkit label: mit Geografikum in Beziehung stehendes Werk @de
toolkit label: obra relacionada amb un lloc @ca
toolkit label: opera correlata di luogo @it
toolkit label: paikkaan liittyvä teos @fi
toolkit label: related work of place
toolkit label: verk relatert til sted @no
toolkit label: værk relateret til sted @da
toolkit label: œuvre en relation avec un lieu @fr
toolkit label: عمل مرتبط بمكان @ar
toolkit label: 地点的关联作品 @zh-hans
has subproperty: is subject place of
has subproperty: is coordinates of cartographic content of
has subproperty: is place of origin of work of
has subproperty: is place of capture of representative expression of
has subproperty: P70004
lexical alias: relatedWorkOfPlace.en
status: Published
type: Property
domain: C10009
label: a pour œuvre en relation avec un lieu @fr
label: ar vietu saistītais darbs @lv
label: có tác phẩm có liên quan (địa điểm) @vi
label: ha come opera correlata di luogo @it
label: har verk relatert til sted @no
label: har værk relateret til sted @da
label: hat mit Geografikum in Beziehung stehendes Werk @de
label: heeft gerelateerd werk van plaats @nl
label: hely kapcsolódó műve a következő: @hu
label: kohaga seotud teos @et
label: paikkaan liittyvä teos @fi
label: té com a obra relacionada amb un lloc @ca
label: yerin ilgili eseri ile ilişkilidir @tr
label: έχει σχετικό έργο (τόπος) @el
label: له عمل مرتبط بمكان @ar
label: 有地点的关联作品 @zh-hans
sub property of: has related RDA entity of place
sub property of: P00002
definition: Bir yeri, bir yerle bağlantılı olan bir eserle ilişkilendirir. @tr
definition: Correla un luogo a un'opera associata a un luogo. @it
definition: Hozzákapcsol egy helyet egy műhöz, amelyet egy helyhez társítanak. @hu
definition: Liittää paikan teokseen, johon paikka liittyy. @fi
definition: Liên kết địa điểm với tác phẩm liên quan tới địa điểm đang được mô tả. @vi
definition: Met un lieu en relation avec une œuvre qui est associée à un lieu. @fr
definition: Relaciona un lloc amb una obra que s’associa amb un lloc. @ca
definition: Relateert een plaats aan een werk dat geassocieerd is met een plaats. @nl
definition: Relaterer et sted til et verk som forbindes med et sted. @no
definition: Relaterer et sted til et værk, som er knyttet til et sted. @da
definition: Relates a place to a work that is associated with a place.
definition: Sasaista vietu ar darbu, kas saistīts ar vietu. @lv
definition: Seostab koha kohaga seotud teosega. @et
definition: Setzt ein Geografikum in Beziehung zu einem Werk, das mit einem Geografikum in Verbindung steht. @de
definition: Συνδέει έναν τόπο με ένα έργο που συνδέεται με έναν περιγραφόμενο τόπο. @el
definition: يربط بين مكان وعمل مرتبط بمكان. @ar
definition: 将一个地点与和一个地点有关的一种作品关联起来。 @zh-hans

has related expression of place
has element type: 1
toolkit definition: An expression that is associated with a place.
toolkit definition: Bir yerle bağlantılı olan bir anlatım. @tr
toolkit definition: Een expressie die geassocieerd is met een plaats. @nl
toolkit definition: Egy kifejezési forma, amelyet egy helyhez társítanak. @hu
toolkit definition: Eine Expression, die mit einem Geografikum in Verbindung steht. @de
toolkit definition: Ekspressio, johon paikka liittyy. @fi
toolkit definition: Espressione associata a un luogo. @it
toolkit definition: Et uttrykk som forbindes med et sted. @no
toolkit definition: Expression qui est associée à un lieu. @fr
toolkit definition: Expressió que s’associa amb un lloc. @ca
toolkit definition: Izteiksme, kas ir saistīta ar vietu. @lv
toolkit definition: Kohaga seotud väljendus. @et
toolkit definition: Udtryk, som er knyttet til et sted. @da
toolkit definition: تعبيرة مرتبطة بمكان. @ar
toolkit definition: 和一个地点有关的一种内容表达 @zh-hans
toolkit label: Yerin ilişkili anlatımı @tr
toolkit label: ar vietu saistītā izteiksme @lv
toolkit label: espressione correlata di luogo @it
toolkit label: expression en relation avec un lieu @fr
toolkit label: expressió relacionada amb un lloc @ca
toolkit label: gerelateerde expressie van plaats @nl
toolkit label: hely kapcsolódó kifejezési formája @hu
toolkit label: kohaga seotud väljendus @et
toolkit label: mit Geografikum in Beziehung stehende Expression @de
toolkit label: paikkaan liittyvä ekspressio @fi
toolkit label: related expression of place
toolkit label: udtryk relateret til sted @da
toolkit label: uttrykk relatert til sted @no
toolkit label: تعبيرة مرتبطة بمكان @ar
toolkit label: 地点的关联内容表达 @zh-hans
has subproperty: is place of capture of
has subproperty: P70005
lexical alias: relatedExpressionOfPlace.en
status: Published
type: Property
domain: C10009
label: a pour expression en relation avec un lieu @fr
label: ar vietu saistītā izteiksme @lv
label: có biểu hiện có liên quan (địa điểm) @vi
label: ha come espressione correlata di luogo @it
label: har udtryk relateret til sted @da
label: har uttrykk relatert til sted @no
label: hat mit Geografikum in Beziehung stehende Expression @de
label: heeft gerelateerde expressie van plaats @nl
label: hely kapcsolódó kifejezési formája a következő: @hu
label: kohaga seotud väljendus @et
label: paikkaan liittyvä ekspressio @fi
label: té com a expressió relacionada amb un lloc @ca
label: yerin ilgili anlatımı ile ilişkilidir @tr
label: έχει σχετική έκφραση (τόπος) @el
label: له تعبيرة مرتبطة بمكان @ar
label: 有地点的关联内容表达 @zh-hans
sub property of: has related RDA entity of place
sub property of: P00003
definition: Bir yeri, bir yerle bağlantılı olan bir anlatımla ilişkilendirir. @tr
definition: Correla un luogo a un'espressione associata a un luogo. @it
definition: Hozzákapcsol egy helyet egy kifejezési formához, amelyet egy helyhez társítanak. @hu
definition: Liittää paikan ekspressioon, johon paikka liittyy. @fi
definition: Liên kết địa điểm với biểu hiện liên quan tới địa điểm đang được mô tả. @vi
definition: Met un lieu en relation avec une expression qui est associée à un lieu. @fr
definition: Relaciona un lloc amb una expressió que s’associa amb un lloc. @ca
definition: Relateert een plaats aan een expressie die geassocieerd is met een plaats. @nl
definition: Relaterer et sted til et udtryk, som er knyttet til et sted. @da
definition: Relaterer et sted til et uttrykk som forbindes med et sted. @no
definition: Relates a place to an expression that is associated with a place.
definition: Sasaista vietu ar izteiksmi, kas ir saistīta ar vietu. @lv
definition: Seostab koha kohaga seotud väljendusega. @et
definition: Setzt ein Geografikum in Beziehung zu einer Expression, die mit einem Geografikum in Verbindung steht. @de
definition: Συνδέει έναν τόπο με μια έκφραση που συνδέεται με έναν περιγραφόμενο τόπο. @el
definition: يربط بين مكان وتعبيرة مرتبطة بمكان. @ar
definition: 将一个地点与和一个地点有关的一种内容表达关联起来。 @zh-hans

has related manifestation of place
has element type: 1
toolkit definition: A manifestation that is associated with a place.
toolkit definition: Bir yerle bağlantılı olan bir gösterim. @tr
toolkit definition: Een manifestatie die geassocieerd is met een plaats. @nl
toolkit definition: Egy megjelenési forma, amelyet egy helyhez társítanak. @hu
toolkit definition: Eine Manifestation, die mit einem Geografikum in Verbindung steht. @de
toolkit definition: En manifestasjon som forbindes med et sted. @no
toolkit definition: Kohaga seotud kehastus. @et
toolkit definition: Manifestaatio, johon paikka liittyy. @fi
toolkit definition: Manifestació que s’associa amb un lloc. @ca
toolkit definition: Manifestation qui est associée à un lieu. @fr
toolkit definition: Manifestation, som er knyttet til et sted. @da
toolkit definition: Manifestazione associata a un luogo. @it
toolkit definition: Manifestācija, kas ir saistīta ar vietu. @lv
toolkit definition: تجسيدة مرتبطة بمكان. @ar
toolkit definition: 和一个地点有关的一种载体表现 @zh-hans
toolkit label: Yerin ilişkili gösterimi @tr
toolkit label: ar vietu saistītā manifestācija @lv
toolkit label: gerelateerde manifestatie van plaats @nl
toolkit label: hely kapcsolódó megjelenési formája @hu
toolkit label: kohaga seotud kehastus @et
toolkit label: manifestació relacionada amb un lloc @ca
toolkit label: manifestasjon relatert til sted @no
toolkit label: manifestation en relation avec un lieu @fr
toolkit label: manifestation relateret til sted @da
toolkit label: manifestazione correlata di luogo @it
toolkit label: mit Geografikum in Beziehung stehende Manifestation @de
toolkit label: paikkaan liittyvä manifestaatio @fi
toolkit label: related manifestation of place
toolkit label: تجسيدة مرتبطة بمكان @ar
toolkit label: 地点的关联载体表现 @zh-hans
has subproperty: is place of manifestation of
has subproperty: is location of collection of
has subproperty: P70006
lexical alias: relatedManifestationOfPlace.en
status: Published
type: Property
domain: C10009
label: a pour manifestation en relation avec un lieu @fr
label: ar vietu saistītā manifestācija @lv
label: có biểu thị có liên quan (địa điểm) @vi
label: ha come manifestazione correlata di luogo @it
label: har manifestasjon relatert til sted @no
label: har manifestation relateret til sted @da
label: hat mit Geografikum in Beziehung stehende Manifestation @de
label: heeft gerelateerde manifestatie van plaats @nl
label: hely kapcsolódó megjelenési formája a következő: @hu
label: kohaga seotud kehastus @et
label: paikkaan liittyvä manifestaatio @fi
label: té com a manifestació relacionada amb un lloc @ca
label: yerin ilgili gösterimi ile ilişkilidir @tr
label: έχει σχετική εκδήλωση (τόπος) @el
label: له تجسيدة مرتبطة بمكان @ar
label: 有地点的关联载体表现 @zh-hans
sub property of: has related RDA entity of place
sub property of: P00004
definition: Bir yeri, bir yerle bağlantılı olan bir gösterim ile ilişkilendirir. @tr
definition: Correla un luogo a una manifestazione associata a un luogo. @it
definition: Hozzákapcsol egy helyet egy megjelenési formához, amelyet egy helyhez társítanak. @hu
definition: Liittää paikan manifestaatioon, johon paikka liittyy. @fi
definition: Liên kết địa điểm với biểu thị liên quan tới địa điểm đang được mô tả. @vi
definition: Met un lieu en relation avec une manifestation qui est associée à un lieu. @fr
definition: Relaciona un lloc amb una manifestació que s’associa amb un lloc. @ca
definition: Relateert een plaats aan een manifestatie die geassocieerd is met een plaats. @nl
definition: Relaterer et sted til en manifestasjon som forbindes med et sted. @no
definition: Relaterer et sted til en manifestation, som er knyttet til et sted. @da
definition: Relates a place to a manifestation that is associated with a place.
definition: Sasaista vietu ar manifestāciju, kas ir saistīta ar vietu. @lv
definition: Seostab koha kohaga seotud kehastusega. @et
definition: Setzt ein Geografikum in Beziehung zu einer Manifestation, die mit einem Geografikum in Verbindung steht. @de
definition: Συνδέει έναν τόπο με μια εκδήλωση που συνδέεται με έναν περιγραφόμενο τόπο. @el
definition: يربط بين مكان وتجسيدة مرتبطة بمكان. @ar
definition: 将一个地点与和一个地点有关的一种载体表现关联起来。 @zh-hans

has related item of place
has element type: 1
toolkit definition: An item that is associated with a place.
toolkit definition: Bir yerle bağlantılı olan bir kopya. @tr
toolkit definition: Een item dat geassocieerd is met een plaats. @nl
toolkit definition: Egy példány, amelyet egy helyhez társítanak. @hu
toolkit definition: Ein Exemplar, das mit einem Geografikum in Verbindung steht. @de
toolkit definition: Eksemplar, som er knyttet til et sted. @da
toolkit definition: Et eksemplar som forbindes med et sted. @no
toolkit definition: Item associato a un luogo. @it
toolkit definition: Item qui est associé à un lieu. @fr
toolkit definition: Kappale, johon paikka liittyy. @fi
toolkit definition: Kohaga seotud eksemplar. @et
toolkit definition: Vienība, kas ir saistīta ar vietu. @lv
toolkit definition: Ítem que s’associa amb un lloc. @ca
toolkit definition: مفردة مرتبطة بمكان. @ar
toolkit definition: 和一个地点有关的一个单件 @zh-hans
toolkit label: Yer ile ilişkili kopya @tr
toolkit label: ar vietu saistītā vienība @lv
toolkit label: eksemplar relateret til sted @da
toolkit label: eksemplar relatert til sted @no
toolkit label: gerelateerd item van plaats @nl
toolkit label: hely kapcsolódó példánya @hu
toolkit label: item correlato di luogo @it
toolkit label: item en relation avec un lieu @fr
toolkit label: kohaga seotud eksemplar @et
toolkit label: mit Geografikum in Beziehung stehendes Exemplar @de
toolkit label: paikkaan liittyvä kappale @fi
toolkit label: related item of place
toolkit label: ítem relacionat amb un lloc @ca
toolkit label: مفردة مرتبطة بمكان @ar
toolkit label: 地点的关联单件 @zh-hans
has subproperty: is location of item of
has subproperty: P70007
lexical alias: relatedItemOfPlace.en
status: Published
type: Property
domain: C10009
label: a pour item en relation avec un lieu @fr
label: ar vietu saistītā vienība @lv
label: có bản có liên quan (địa điểm) @vi
label: ha come item correlato di luogo @it
label: har eksemplar relateret til sted @da
label: har eksemplar relatert til sted @no
label: hat mit Geografikum in Beziehung stehendes Exemplar @de
label: heeft gerelateerd item van plaats @nl
label: hely kapcsolódó példánya a következő: @hu
label: kohaga seotud eksemplar @et
label: kopyanın ilgili kopyası ile ilişkilidir @tr
label: paikkaan liittyvä kappale @fi
label: té com a ítem relacionat amb un lloc @ca
label: έχει σχετικό αντίτυπο (τόπος) @el
label: له مفردة مرتبطة بمكان @ar
label: 有地点的关联单件 @zh-hans
sub property of: has related RDA entity of place
sub property of: P00005
definition: Bir yeri, bir yerle bağlantılı olan bir kopyayla ilişkilendirir. @tr
definition: Correla un luogo a un item associato a un luogo. @it
definition: Hozzákapcsol egy helyet egy példányhoz, amelyet egy helyhez társítanak. @hu
definition: Liittää paikan kappaleeseen, johon paikka liittyy. @fi
definition: Liên kết địa điểm với bản liên quan tới địa điểm đang được mô tả. @vi
definition: Met un lieu en relation avec un item qui est associé à un lieu. @fr
definition: Relaciona un lloc amb un ítem que s’associa amb un lloc. @ca
definition: Relateert een plaats aan een item dat geassocieerd is met een plaats. @nl
definition: Relaterer et sted til et eksemplar som forbindes med et sted. @no
definition: Relaterer et sted til et eksemplar, som er knyttet til et sted. @da
definition: Relates a place to an item that is associated with a place.
definition: Sasaista vietu ar vienību, kas ir saistīta ar vietu. @lv
definition: Seostab koha kohaga seotud eksemplariga. @et
definition: Setzt ein Geografikum in Beziehung zu einem Exemplar, das mit einem Geografikum in Verbindung steht. @de
definition: Συνδέει έναν τόπο με ένα αντίτυπο που συνδέεται με έναν περιγραφόμενο τόπο. @el
definition: يربط بين مكان ومفردة مرتبطة بمكان. @ar
definition: 将一个地点与和一个地点有关的一个单件关联起来。 @zh-hans

has related agent of place
has element type: 1
toolkit definition: Agent que s’associa amb un lloc. @ca
toolkit definition: Agent qui est associé à un lieu. @fr
toolkit definition: Agent, som er knyttet til et sted. @da
toolkit definition: Agente associato a un luogo. @it
toolkit definition: An agent who is associated with a place.
toolkit definition: Aģents, kas saistīts ar vietu. @lv
toolkit definition: Bir yerle bağlantılı olan bir temsilci. @tr
toolkit definition: Een actor die geassocieerd is met een plaats. @nl
toolkit definition: Egy ágens, amelyet egy helyhez társítanak. @hu
toolkit definition: Ein Akteur, der mit einem Geografikum in Verbindung steht. @de
toolkit definition: En agent som forbindes med et sted. @no
toolkit definition: Kohaga seotud tegija. @et
toolkit definition: Toimija, johon paikka liittyy. @fi
toolkit definition: وكيل مرتبط بمكان. @ar
toolkit definition: 和一个地点有关的一个行为者 @zh-hans
toolkit label: Yerin ilişkili temsilcisi @tr
toolkit label: agent en relation avec un lieu @fr
toolkit label: agent relacionat amb un lloc @ca
toolkit label: agent relateret til sted @da
toolkit label: agent relatert til sted @no
toolkit label: agente correlato di luogo @it
toolkit label: ar vietu saistītais aģents @lv
toolkit label: gerelateerde actor van plaats @nl
toolkit label: hely kapcsolódó ágense: @hu
toolkit label: kohaga seotud tegija @et
toolkit label: mit Geografikum in Beziehung stehender Akteur @de
toolkit label: paikkaan liittyvä toimija @fi
toolkit label: related agent of place
toolkit label: وكيل مرتبط بمكان @ar
toolkit label: 地点的关联行为者 @zh-hans
has subproperty: has related collective agent of place
has subproperty: has related person of place
has subproperty: P70008
lexical alias: relatedAgentOfPlace.en
status: Published
type: Property
domain: C10009
label: a pour agent en relation avec un lieu @fr
label: ar vietu saistītais aģents @lv
label: có tác nhân có liên quan (địa điểm) @vi
label: ha come agente correlato di luogo @it
label: har agent relateret til sted @da
label: har agent relatert til sted @no
label: hat mit Geografikum in Beziehung stehenden Akteur @de
label: heeft gerelateerde actor van plaats @nl
label: hely kapcsolódó ágense a következő: @hu
label: kohaga seotud tegija @et
label: paikkaan liittyvä toimija @fi
label: té com a agent relacionat amb un lloc @ca
label: yerin ilgili temsilcisi ile ilişkilidir @tr
label: έχει σχετικό φορέα (τόπος) @el
label: له وكيل مرتبط بمكان @ar
label: 有地点的关联行为者 @zh-hans
sub property of: has related RDA entity of place
sub property of: P00006
definition: Bir yeri, bir yerle bağlantılı olan bir temsilciyle ilişkilendirir. @tr
definition: Correla un luogo a un agente associato a un luogo. @it
definition: Hozzákapcsol egy helyet egy ágenshez, amelyet egy helyhez társítanak. @hu
definition: Liittää paikan toimijaan, johon paikka liittyy. @fi
definition: Liên kết địa điểm với tác nhân liên quan tới địa điểm đang được mô tả. @vi
definition: Met un lieu en relation avec un agent qui est associé à un lieu. @fr
definition: Relaciona un lloc amb un agent que s’associa amb un lloc. @ca
definition: Relateert een plaats aan een actor die geassocieerd is met een plaats. @nl
definition: Relaterer et sted til en agent som forbindes med et sted. @no
definition: Relaterer et sted til en agent, som er knyttet til et sted. @da
definition: Relates a place to an agent who is associated with a place.
definition: Sasaista vietu ar aģentu, kas saistīts ar vietu. @lv
definition: Seostab koha kohaga seotud tegijaga. @et
definition: Setzt ein Geografikum in Beziehung zu einem Akteur, der mit einem Geografikum in Verbindung steht. @de
definition: Συνδέει έναν τόπο με έναν φορέα που συνδέεται με έναν περιγραφόμενο τόπο. @el
definition: يربط بين مكان ووكيل مرتبط بمكان. @ar
definition: 将一个地点与和一个地点有关的一个行为者关联起来。 @zh-hans

has related collective agent of place
has element type: 1
toolkit definition: A collective agent who is associated with a place.
toolkit definition: Agent collectif qui est associé à un lieu. @fr
toolkit definition: Agent col·lectiu que s’associa amb un lloc. @ca
toolkit definition: Agente collettivo associato a un luogo. @it
toolkit definition: Bir yerle ilişkilendirilen kolektif bir temsilci. @tr
toolkit definition: Een collectieve actor die geassocieerd is met een plaats. @nl
toolkit definition: Egy kollektív ágens, amelyet egy helyhez társítanak. @hu
toolkit definition: Ein gemeinschaftlicher Akteur, der mit einem Geografikum in Verbindung steht. @de
toolkit definition: En kollektiv agent som forbindes med et sted. @no
toolkit definition: Grupa, kas saistīta ar vietu. @lv
toolkit definition: Kohaga seotud kollektiiv. @et
toolkit definition: Kollektiv agent, som er knyttet til et sted. @da
toolkit definition: Yhteistoimija, johon kuvailun kohteena oleva paikka liittyy. @fi
toolkit definition: وكيل جماعي مرتبط بمكان. @ar
toolkit definition: 和一个地点有关的一个集体行为者 @zh-hans
toolkit label: Yerin kolektif temsilciyle ilişkisi @tr
toolkit label: agent collectif en relation avec un lieu @fr
toolkit label: agent col·lectiu relacionat amb un lloc @ca
toolkit label: agente collettivo correlato di luogo @it
toolkit label: ar vietu saistītā grupa @lv
toolkit label: gerelateerde collectieve actor van plaats @nl
toolkit label: hely kapcsolódó kollektív ágense: @hu
toolkit label: kohaga seotud kollektiiv @et
toolkit label: kollektiv agent relateret til sted @da
toolkit label: kollektiv agent relatert til sted @no
toolkit label: mit Geografikum in Beziehung stehender gemeinschaftlicher Akteur @de
toolkit label: paikkaan liittyvä yhteistoimija @fi
toolkit label: related collective agent of place
toolkit label: وكيل جماعي مرتبط بمكان @ar
toolkit label: 地点的关联集体行为者 @zh-hans
has subproperty: has related family of place
has subproperty: has related corporate body of place
has subproperty: P70009
lexical alias: relatedCollectiveAgentOfPlace.en
status: Published
type: Property
domain: C10009
label: a pour agent collectif en relation avec un lieu @fr
label: ar vietu saistītā grupa @lv
label: có tác nhân tập thể có liên quan (địa điểm) @vi
label: ha come agente collettivo correlato di luogo @it
label: har kollektiv agent relateret til sted @da
label: har kollektiv agent relatert til sted @no
label: hat mit Geografikum in Beziehung stehenden gemeinschaftlichen Akteur @de
label: heeft gerelateerde collectieve actor van plaats @nl
label: hely kapcsolódó kollektív ágense a következő: @hu
label: kohaga seotud kollektiiv @et
label: paikkaan liittyvä yhteistoimija @fi
label: té com a agent col·lectiu relacionat amb un lloc @ca
label: yerin ilgili kolektif temsilcisi ile ilişkilidir @tr
label: έχει σχετικό συλλογικό φορέα (τόπος) @el
label: له وكيل جماعي مرتبط بمكان @ar
label: 有地点的关联集体行为者 @zh-hans
sub property of: has related agent of place
sub property of: P00012
definition: Bir yeri, bir yerle ibağlantılı olan kolektif bir temsilciyle ilişkilendirir. @tr
definition: Correla un luogo a un agente collettivo associato a un luogo. @it
definition: Hozzákapcsol egy helyet egy kollektív ágenshez, amelyet egy helyhez társítanak. @hu
definition: Liittää paikan yhteistoimijaan, johon kuvailun kohteena oleva paikka liittyy. @fi
definition: Liên kết địa điểm với tác nhân tập thể liên quan tới địa điểm đang được mô tả. @vi
definition: Met un lieu en relation avec un agent collectif qui est associé à un lieu. @fr
definition: Relaciona un lloc amb un agent col·lectiu que s’associa amb un lloc. @ca
definition: Relateert een plaats aan een collectieve actor die geassocieerd is met een plaats. @nl
definition: Relaterer et sted til en kollektiv agent som forbindes med et sted. @no
definition: Relaterer et sted til en kollektiv agent, som er knyttet til et sted. @da
definition: Relates a place to a collective agent who is associated with a place.
definition: Sasaista vietu ar grupu, kas saistīta ar vietu. @lv
definition: Seostab koha kohaga seotud kollektiiviga. @et
definition: Setzt ein Geografikum in Beziehung zu einem gemeinschaftlichen Akteur, der mit einem Geografikum in Verbindung steht. @de
definition: Συνδέει έναν τόπο με έναν συλλογικό φορέα που συνδέεται με έναν περιγραφόμενο τόπο. @el
definition: يربط بين مكان ووكيل جماعي مرتبط بمكان. @ar
definition: 将一个地点与和一个地点有关的一个集体行为者关联起来。 @zh-hans

has related place of place
has element type: 1
toolkit definition: A place that is associated with a place.
toolkit definition: Bir yerle bağlantılı olan bir yer. @tr
toolkit definition: Een plaats die geassocieerd is met een plaats. @nl
toolkit definition: Egy hely, amelyet egy helyhez társítanak. @hu
toolkit definition: Ein Geografikum, das mit einem Geografikum in Verbindung steht. @de
toolkit definition: Et sted som forbindes med et sted. @no
toolkit definition: Kohaga seotud koht. @et
toolkit definition: Lieu qui est associé à un lieu. @fr
toolkit definition: Lloc que s’associa amb un lloc. @ca
toolkit definition: Luogo associato a un luogo. @it
toolkit definition: Paikka, johon paikka liittyy. @fi
toolkit definition: Sted, som er knyttet til et sted. @da
toolkit definition: Vieta, kas saistīta ar vietu. @lv
toolkit definition: مكان مرتبط بمكان. @ar
toolkit definition: 和一个地点有关的一个地点 @zh-hans
toolkit label: Yerle ilişkili yer @tr
toolkit label: ar vietu saistītā vieta @lv
toolkit label: gerelateerde plaats van plaats @nl
toolkit label: hely kapcsolódó helye: @hu
toolkit label: kohaga seotud koht @et
toolkit label: lieu en relation avec un lieu @fr
toolkit label: lloc relacionat amb un lloc @ca
toolkit label: luogo correlato di luogo @it
toolkit label: mit Geografikum in Beziehung stehendes Geografikum @de
toolkit label: paikkaan liittyvä paikka @fi
toolkit label: related place of place
toolkit label: sted relateret til sted @da
toolkit label: sted relatert til sted @no
toolkit label: مكان مرتبط بمكان @ar
toolkit label: 地点的关联地点 @zh-hans
has subproperty: is part of place
has subproperty: has part place
has subproperty: P70010
lexical alias: relatedPlaceOfPlace.en
status: Published
type: Property
domain: C10009
label: a pour lieu en relation avec un lieu @fr
label: ar vietu saistītā vieta @lv
label: có địa điểm có liên quan (địa điểm) @vi
label: ha come luogo correlato di luogo @it
label: har sted relateret til sted @da
label: har sted relatert til sted @no
label: hat mit Geografikum in Beziehung stehendes Geografikum @de
label: heeft gerelateerde plaats van plaats @nl
label: hely kapcsolódó helye a következő: @hu
label: kohaga seotud koht @et
label: paikkaan liittyvä paikka @fi
label: té com a lloc relacionat amb un lloc @ca
label: yerin ilgili yeri ile ilişkilidir @tr
label: έχει σχετικό τόπο (τόπος) @el
label: له مكان مرتبط بمكان @ar
label: 有地点的关联地点 @zh-hans
sub property of: has related RDA entity of place
sub property of: P00010
definition: Bir yeri, bir yerle ilişkili bir yerle ilişkilendirir. @tr
definition: Correla un luogo a un luogo associato a un luogo. @it
definition: Hozzákapcsol egy helyet egy helyhez, amelyet egy helyhez társítanak. @hu
definition: Liittää paikan paikkaan, johon paikka liittyy. @fi
definition: Liên kết địa điểm với địa điểm liên quan tới địa điểm đang được mô tả. @vi
definition: Met un lieu en relation avec un lieu qui est associé à un lieu. @fr
definition: Relaciona un lloc amb un lloc que s’associa amb un lloc. @ca
definition: Relateert een plaats aan een plaats die geassocieerd is met een plaats. @nl
definition: Relaterer et sted til et sted som forbindes med et sted. @no
definition: Relaterer et sted til et sted, som er knyttet til et sted. @da
definition: Relates a place to a place that is associated with a place.
definition: Sasaista vietu ar vietu, kas saistīta ar vietu. @lv
definition: Seostab koha kohaga seotud kohaga. @et
definition: Setzt ein Geografikum in Beziehung zu einem Geografikum, das mit einem Geografikum in Verbindung steht. @de
definition: Συνδέει έναν τόπο με έναν τόπο που συνδέεται με έναν περιγραφόμενο τόπο. @el
definition: يربط بين مكان ومكان مرتبط بمكان. @ar
definition: 将一个地点与和一个地点有关的一个地点关联起来。 @zh-hans

has related timespan of place
has element type: 1
toolkit definition: A timespan that is associated with a place.
toolkit definition: Ajankohta, johon paikka liittyy. @fi
toolkit definition: Arco di tempo associato a un luogo. @it
toolkit definition: Bir yerle bağlantılı olan bir zaman aralığı. @tr
toolkit definition: Een tijdspanne die geassocieerd is met een plaats. @nl
toolkit definition: Egy időtartam, amelyet egy helyhez társítanak. @hu
toolkit definition: Ein Zeitraum, der mit einem Geografikum in Verbindung steht. @de
toolkit definition: Et tidsrom som forbindes med et sted. @no
toolkit definition: Interval de temps que s’associa amb un lloc. @ca
toolkit definition: Kohaga seotud ajavahemik. @et
toolkit definition: Laikposms, kas saistīts ar vietu. @lv
toolkit definition: Laps de temps qui est associé à un lieu. @fr
toolkit definition: Tidsperiode, som er knyttet til et sted. @da
toolkit definition: فترة زمنية مرتبطة بمكان. @ar
toolkit definition: 和一个地点有关的一个时间段 @zh-hans
toolkit label: Yerin zaman aralığıyla ilişkisi @tr
toolkit label: ar vietu saistītais laikposms @lv
toolkit label: arco di tempo correlato di luogo @it
toolkit label: gerelateerde tijdspanne van plaats @nl
toolkit label: hely kapcsolódó időtartama: @hu
toolkit label: interval de temps relacionat amb un lloc @ca
toolkit label: kohaga seotud ajavahemik @et
toolkit label: laps de temps en relation avec un lieu @fr
toolkit label: mit Geografikum in Beziehung stehender Zeitraum @de
toolkit label: paikkaan liittyvä ajankohta @fi
toolkit label: related timespan of place
toolkit label: tidsperiode relateret til sted @da
toolkit label: tidsrom relatert til sted @no
toolkit label: فترة زمنية مرتبطة بمكان @ar
toolkit label: 地点的关联时间段 @zh-hans
has subproperty: P70011
lexical alias: relatedTimespanOfPlace.en
status: Published
type: Property
domain: C10009
label: a pour laps de temps en relation avec un lieu @fr
label: ar vietu saistītais laikposms @lv
label: có khung thời gian có liên quan (địa điểm) @vi
label: ha come arco di tempo correlato di luogo @it
label: har tidsperiode relateret til sted @da
label: har tidsrom relatert til sted @no
label: hat mit Geografikum in Beziehung stehenden Zeitraum @de
label: heeft gerelateerde tijdspanne van plaats @nl
label: hely kapcsolódó időtartama a következő: @hu
label: kohaga seotud ajavahemik @et
label: paikkaan liittyvä ajankohta @fi
label: té com a interval de temps relacionat amb un lloc @ca
label: yerin ilgili zaman aralığı ile ilişkilidir @tr
label: έχει σχετικό χρονικό διάστημα (τόπος) @el
label: له فترة زمنية مرتبطة بمكان @ar
label: 有地点的关联时间段 @zh-hans
sub property of: has related RDA entity of place
sub property of: P00011
definition: Bir yeri, bir yerle bağlantılı olan bir zaman aralığıyla ilişkilendirir. @tr
definition: Correla un luogo a un arco di tempo associato a un luogo. @it
definition: Hozzákapcsol egy helyet egy időtartamhoz, amelyet egy helyhez társítanak. @hu
definition: Liittää paikan ajankohtaan, johon paikka liittyy. @fi
definition: Liên kết địa điểm với khung thời gian liên quan tới địa điểm đang được mô tả. @vi
definition: Met un lieu en relation avec un laps de temps qui est associé à un lieu. @fr
definition: Relaciona un lloc amb un interval de temps que s’associa amb un lloc. @ca
definition: Relateert een plaats aan een tijdspanne die geassocieerd is met een plaats. @nl
definition: Relaterer et sted til en tidsperiode, som er knyttet til et sted. @da
definition: Relaterer et sted til et tidsrom som forbindes med et sted. @no
definition: Relates a place to a timespan that is associated with a place.
definition: Sasaista vietu ar laikposmu, kas saistīts ar vietu. @lv
definition: Seostab koha kohaga seotud ajavahemikuga. @et
definition: Setzt ein Geografikum in Beziehung zu einem Zeitraum, der mit einem Geografikum in Verbindung steht. @de
definition: Συνδέει έναν τόπο με ένα χρονικό διάστημα που συνδέεται με έναν περιγραφόμενο τόπο. @el
definition: يربط بين مكان وفترة زمنية مرتبطة بمكان. @ar
definition: 将一个地点与和一个地点有关的一个时间段关联起来。 @zh-hans

has related nomen of place
has element type: 1
toolkit definition: A nomen that is associated with a place.
toolkit definition: Bir yerle bağlantılı olan bir isim. @tr
toolkit definition: Een nomen dat geassocieerd is met een plaats. @nl
toolkit definition: Egy nomen, amelyet egy helyhez társítanak. @hu
toolkit definition: Ein Nomen, das mit einem Geografikum in Verbindung steht. @de
toolkit definition: Et nomen som forbindes med et sted. @no
toolkit definition: Kohaga seotud nomen. @et
toolkit definition: Nomen associato a un luogo. @it
toolkit definition: Nomen que s’associa amb un lloc. @ca
toolkit definition: Nomen qui est associé à un lieu. @fr
toolkit definition: Nomen, johon paikka liittyy. @fi
toolkit definition: Nomen, som er knyttet til et sted. @da
toolkit definition: Nomens, kas saistīts ar vietu. @lv
toolkit definition: تسمية مرتبطة بمكان. @ar
toolkit definition: 和一个地点有关的一个命名 @zh-hans
toolkit label: Yerin ilişkili ismi @tr
toolkit label: ar vietu saistītais nomens @lv
toolkit label: gerelateerde nomen van plaats @nl
toolkit label: hely kapcsolódó nomenje: @hu
toolkit label: kohaga seotud nomen @et
toolkit label: mit Geografikum in Beziehung stehendes Nomen @de
toolkit label: nomen correlato di luogo @it
toolkit label: nomen en relation avec un lieu @fr
toolkit label: nomen relacionat amb un lloc @ca
toolkit label: nomen relateret til sted @da
toolkit label: nomen relatert til sted @no
toolkit label: paikkaan liittyvä nomen @fi
toolkit label: related nomen of place
toolkit label: تسمية مرتبطة بمكان @ar
toolkit label: 地点的关联命名 @zh-hans
has subproperty: has appellation of place
has subproperty: P70012
lexical alias: relatedNomenOfPlace.en
status: Published
type: Property
domain: C10009
label: a pour nomen en relation avec un lieu @fr
label: ar vietu saistītais nomens @lv
label: có danh pháp có liên quan (địa điểm) @vi
label: ha come nomen correlato di luogo @it
label: har nomen relateret til sted @da
label: har nomen relatert til sted @no
label: hat mit Geografikum in Beziehung stehendes Nomen @de
label: heeft gerelateerde nomen van plaats @nl
label: hely kapcsolódó nomenje a következő: @hu
label: kohaga seotud nomen @et
label: paikkaan liittyvä nomen @fi
label: té com a nomen relacionat amb un lloc @ca
label: yerin ilgili ismi ile ilişkilidir @tr
label: έχει σχετικό όνομα (τόπος) @el
label: له تسمية مرتبطة بمكان @ar
label: 有地点的关联命名 @zh-hans
sub property of: has related RDA entity of place
sub property of: P00013
definition: Bir yeri, bir yerle bağlantılı olan bir isim ile ilişkilendirir. @tr
definition: Correla un luogo a un nomen associato a un luogo. @it
definition: Hozzákapcsol egy helyet egy nomenhez, amelyet egy helyhez társítanak. @hu
definition: Liittää paikan nomeniin, johon paikka liittyy. @fi
definition: Liên kết địa điểm với danh pháp liên quan tới địa điểm đang được mô tả. @vi
definition: Met un lieu en relation avec un nomen qui est associé à un lieu. @fr
definition: Relaciona un lloc amb un nomen que s’associa amb un lloc. @ca
definition: Relateert een plaats aan een nomen dat geassocieerd is met een plaats. @nl
definition: Relaterer et sted til et nomen som forbindes med et sted. @no
definition: Relaterer et sted til et nomen, som er knyttet til et sted. @da
definition: Relates a place to a nomen that is associated with a place.
definition: Sasaista vietu ar nomenu, kas saistīts ar vietu. @lv
definition: Seostab koha kohaga seotud nomen'iga. @et
definition: Setzt ein Geografikum in Beziehung zu einem Nomen, das mit einem Geografikum in Verbindung steht. @de
definition: Συνδέει έναν τόπο με ένα όνομα που συνδέεται με έναν περιγραφόμενο τόπο. @el
definition: يربط بين مكان وتسمية مرتبطة بمكان. @ar
definition: 将一个地点与和一个地点有关的一个命名关联起来。 @zh-hans

has related RDA entity of place
has element type: 1
toolkit definition: An RDA entity that is associated with a place.
toolkit definition: Bir yerle bağlantılı olan bir RDA varlığı. @tr
toolkit definition: Een RDA-entiteit die geassocieerd is met een plaats. @nl
toolkit definition: Egy RDA-entitás, amelyet egy helyhez társítanak. @hu
toolkit definition: Eine RDA-Entität, die mit einem Geografikum in Verbindung steht. @de
toolkit definition: En RDA-entitet som forbindes med et sted. @no
toolkit definition: Entitat RDA que s’associa amb un lloc. @ca
toolkit definition: Entità RDA associata a un luogo. @it
toolkit definition: Entité RDA qui est associée à un lieu. @fr
toolkit definition: Kohaga seotud RDA olem. @et
toolkit definition: RDA entīte, kas saistīta ar vietu. @lv
toolkit definition: RDA-entiteetti, johon paikka liittyy. @fi
toolkit definition: RDA-entitet, som er knyttet til et sted. @da
toolkit definition: كيان "وام" مرتبط بمكان. @ar
toolkit definition: 和一个地点有关的一个RDA实体 @zh-hans
toolkit label: RDA-entitet relateret til sted @da
toolkit label: RDA-entitet relatert til sted @no
toolkit label: Yerin RDA varlığıyla ilişkisi @tr
toolkit label: ar vietu saistītā RDA entīte @lv
toolkit label: entitat RDA relacionada amb un lloc @ca
toolkit label: entità RDA correlata di luogo @it
toolkit label: entité RDA en relation avec un lieu @fr
toolkit label: gerelateerde RDA-entiteit van plaats @nl
toolkit label: hely kapcsolódó RDA-entitása a következő: @hu
toolkit label: kohaga seotud RDA olem @et
toolkit label: mit Geografikum in Beziehung stehende RDA-Entität @de
toolkit label: paikkaan liittyvä RDA-entiteetti @fi
toolkit label: related RDA entity of place
toolkit label: كيان "وام" مرتبط بمكان @ar
toolkit label: 地点的关联RDA实体 @zh-hans
has subproperty: has related work of place
has subproperty: has related expression of place
has subproperty: has related manifestation of place
has subproperty: has related item of place
has subproperty: has related agent of place
has subproperty: has related place of place
has subproperty: has related timespan of place
has subproperty: has related nomen of place
has subproperty: P70013
lexical alias: relatedRDAEntityOfPlace.en
status: Published
type: Property
domain: C10009
label: a pour entité RDA en relation avec un lieu @fr
label: ar vietu saistītā RDA entīte @lv
label: có thực thể có liên quan (địa điểm) @vi
label: ha come entità RDA correlata di luogo @it
label: har RDA-entitet relateret til sted @da
label: har RDA-entitet relatert til sted @no
label: hat mit Geografikum in Beziehung stehende RDA-Entität @de
label: heeft gerelateerde RDA-entiteit van plaats @nl
label: hely kapcsolódó RDA-entitása a következő: @hu
label: kohaga seotud RDA olem @et
label: paikkaan liittyvä RDA-entiteetti @fi
label: té com a entitat RDA relacionada amb un lloc @ca
label: yerin ilgili RDA varlığı ile ilişkilidir @tr
label: έχει σχετική οντότητα (τόπος) @el
label: له كيان "وام" مرتبط بمكان @ar
label: 有地点的关联RDA实体 @zh-hans
sub property of: has related entity of place
sub property of: P00001
definition: Bir yeri, bir yerle bağlantılı olan bir RDA varlığıyla ilişkilendirir. @tr
definition: Correla un luogo a un'entità RDA associata a un luogo. @it
definition: Hozzákapcsol egy helyet egy RDA-entitáshoz, amelyet egy helyhez társítanak. @hu
definition: Liittää paikan RDA-entiteettiin, johon paikka liittyy. @fi
definition: Liên kết địa điểm với thực thể liên quan tới địa điểm đang được mô tả. @vi
definition: Met un lieu en relation avec une entité RDA qui est associée à un lieu. @fr
definition: Relaciona un lloc amb una entitat RDA que s’associa amb un lloc. @ca
definition: Relateert een plaats aan een RDA-entiteit die geassocieerd is met een plaats. @nl
definition: Relaterer et sted til en RDA-entitet som forbindes med et sted. @no
definition: Relaterer et sted til en RDA-entitet, som er knyttet til et sted. @da
definition: Relates a place to an RDA entity that is associated with a place.
definition: Sasaista vietu ar RDA entīti, kas saistīta ar vietu. @lv
definition: Seostab koha kohaga seotud RDA olemiga. @et
definition: Setzt ein Geografikum in Beziehung zu einer RDA-Entität, die mit einem Geografikum in Verbindung steht. @de
definition: Συνδέει έναν τόπο με μια οντότητα που συνδέεται με έναν περιγραφόμενο τόπο. @el
definition: يربط بين مكان وكيان "وام" مرتبط بمكان. @ar
definition: 将一个地点与和一个地点有关的一个RDA实体关联起来。 @zh-hans

has related person of place
has element type: 1
toolkit definition: A person who is associated with a place.
toolkit definition: Bir yerle bağlantılı olan bir kişi. @tr
toolkit definition: Een persoon die geassocieerd is met een plaats. @nl
toolkit definition: Egy személy, akit egy helyhez társítanak. @hu
toolkit definition: Eine Person, die mit einem Geografikum in Verbindung steht. @de
toolkit definition: En person som forbindes med et sted. @no
toolkit definition: Henkilö, johon paikka liittyy. @fi
toolkit definition: Kohaga seotud isik. @et
toolkit definition: Person, som er knyttet til et sted. @da
toolkit definition: Persona associata a un luogo. @it
toolkit definition: Persona que s’associa amb un lloc. @ca
toolkit definition: Persona, kura saistīta ar vietu. @lv
toolkit definition: Personne qui est associée à un lieu. @fr
toolkit definition: شخص مرتبط بمكان. @ar
toolkit definition: 和一个地点有关的一个个人 @zh-hans
toolkit label: Yerle ilişkili kişi @tr
toolkit label: ar vietu saistītā persona @lv
toolkit label: gerelateerde persoon van plaats @nl
toolkit label: hely kapcsolódó személye @hu
toolkit label: kohaga seotud isik @et
toolkit label: mit Geografikum in Beziehung stehende Person @de
toolkit label: paikkaan liittyvä henkilö @fi
toolkit label: person relateret til sted @da
toolkit label: person relatert til sted @no
toolkit label: persona correlata di luogo @it
toolkit label: persona relacionada amb un lloc @ca
toolkit label: personne en relation avec un lieu @fr
toolkit label: related person of place
toolkit label: شخص مرتبط بمكان @ar
toolkit label: 地点的关联个人 @zh-hans
has subproperty: is country associated with person of
has subproperty: is place of birth of
has subproperty: is place of death of
has subproperty: is place of residence of
has subproperty: P70014
lexical alias: relatedPersonOfPlace.en
status: Published
type: Property
domain: C10009
label: a pour personne en relation avec un lieu @fr
label: ar vietu saistītā persona @lv
label: có cá nhân có liên quan (địa điểm) @vi
label: ha come persona correlata di luogo @it
label: har person relateret til sted @da
label: har person relatert til sted @no
label: hat mit Geografikum in Beziehung stehende Person @de
label: heeft gerelateerde persoon van plaats @nl
label: hely kapcsolódó személye a következő: @hu
label: kohaga seotud isik @et
label: paikkaan liittyvä henkilö @fi
label: té com a persona relacionada amb un lloc @ca
label: yerin ilgili kişisi ile ilişkilidir @tr
label: έχει σχετικό φυσικό πρόσωπο (τόπος) @el
label: له شخص مرتبط بمكان @ar
label: 有地点的关联个人 @zh-hans
sub property of: has related agent of place
sub property of: P00007
definition: Bir yeri, bir yerle bağlantılı olan bir kişiyle ilişkilendirir. @tr
definition: Correla un luogo a una persona associata a un luogo. @it
definition: Hozzákapcsol egy helyet egy személyhez, akit egy helyhez társítanak. @hu
definition: Liittää paikan henkilöön, johon paikka liittyy. @fi
definition: Liên kết địa điểm với cá nhân liên quan tới địa điểm đang được mô tả. @vi
definition: Met un lieu en relation avec une personne qui est associée à un lieu. @fr
definition: Relaciona un lloc amb una persona que s’associa amb un lloc. @ca
definition: Relateert een plaats aan een persoon die geassocieerd is met een plaats. @nl
definition: Relaterer et sted til en person som forbindes med et sted. @no
definition: Relaterer et sted til en person, som er knyttet til et sted. @da
definition: Relates a place to a person who is associated with a place.
definition: Sasaista vietu ar personu, kura saistīta ar vietu. @lv
definition: Seostab koha kohaga seotud isikuga. @et
definition: Setzt ein Geografikum in Beziehung zu einer Person, die mit einem Geografikum in Verbindung steht. @de
definition: Συνδέει έναν τόπο με ένα φυσικό πρόσωπο που συνδέεται με έναν περιγραφόμενο τόπο. @el
definition: يربط بين مكان وشخص مرتبط بمكان. @ar
definition: 将一个地点与和一个地点有关的一个个人关联起来。 @zh-hans

has related family of place
has element type: 1
toolkit definition: A family who is associated with a place.
toolkit definition: Bir yerle bağlantılı olan bir aile. @tr
toolkit definition: Dzimta/ģimene, kas saistīta ar vietu. @lv
toolkit definition: Een familie die geassocieerd is met een plaats. @nl
toolkit definition: Egy család, amelyet egy helyhez társítanak. @hu
toolkit definition: Eine Familie, die mit einem Geografikum in Verbindung steht. @de
toolkit definition: En familie som forbindes med et sted. @no
toolkit definition: Famiglia associata a un luogo. @it
toolkit definition: Familie, som er knyttet til et sted. @da
toolkit definition: Famille qui est associée à un lieu. @fr
toolkit definition: Família que s’associa amb un lloc. @ca
toolkit definition: Kohaga seotud perekond. @et
toolkit definition: Suku, johon paikka liittyy. @fi
toolkit definition: عائلة مرتبطة بمكان. @ar
toolkit definition: 和一个地点有关的一个家族 @zh-hans
toolkit label: Yerle ilişkili aile @tr
toolkit label: ar vietu saistītā dzimta/ģimene @lv
toolkit label: famiglia correlata di luogo @it
toolkit label: familie relateret til sted @da
toolkit label: familie relatert til sted @no
toolkit label: famille en relation avec un lieu @fr
toolkit label: família relacionada amb un lloc @ca
toolkit label: gerelateerde familie van plaats @nl
toolkit label: hely kapcsolódó családja: @hu
toolkit label: kohaga seotud perekond @et
toolkit label: mit Geografikum in Beziehung stehende Familie @de
toolkit label: paikkaan liittyvä suku @fi
toolkit label: related family of place
toolkit label: عائلة مرتبطة بمكان @ar
toolkit label: 地点的关联家族 @zh-hans
has subproperty: P70015
lexical alias: relatedFamilyOfPlace.en
status: Published
type: Property
domain: C10009
label: a pour famille en relation avec un lieu @fr
label: ar vietu saistītā dzimta/ģimene @lv
label: có gia đình có liên quan (địa điểm) @vi
label: ha come famiglia correlata di luogo @it
label: har familie relateret til sted @da
label: har familie relatert til sted @no
label: hat mit Geografikum in Beziehung stehende Familie @de
label: heeft gerelateerde familie van plaats @nl
label: hely kapcsolódó családja a következő: @hu
label: kohaga seotud perekond @et
label: paikkaan liittyvä suku @fi
label: té com a família relacionada amb un lloc @ca
label: yerin ilgili ailesi ile ilişkilidir @tr
label: έχει σχετική οικογένεια (τόπος) @el
label: له عائلة مرتبطة بمكان @ar
label: 有地点的关联家族 @zh-hans
sub property of: has related collective agent of place
sub property of: P00008
alternative label: Ailesi ile ilgili yer @tr
alternative label: a következő családhoz társított hely: @hu
alternative label: lieu associé à une famille de @fr
alternative label: lloc associat amb una família de @ca
alternative label: luogo associato a famiglia di @it
alternative label: place associated with family of
alternative label: sted forbundet med familie for @no
alternative label: sted, som er knyttet til familie af @da
alternative label: مكان مرتبط بعائلة لـ @ar
alternative label: 和……的家族有关的地点 @zh-hans
definition: Bir yeri, bir yerle bağlantılı olan bir aileyle ilişkilendirir. @tr
definition: Correla un luogo a una famiglia associata a un luogo. @it
definition: Hozzákapcsol egy helyet egy családhoz, amelyet egy helyhez társítanak. @hu
definition: Liittää paikan sukuun, johon paikka liittyy. @fi
definition: Liên kết địa điểm với gia đình liên quan tới địa điểm đang được mô tả. @vi
definition: Met un lieu en relation avec une famille qui est associée à un lieu. @fr
definition: Relaciona un lloc amb una família que s’associa amb un lloc. @ca
definition: Relateert een plaats aan een familie die geassocieerd is met een plaats. @nl
definition: Relaterer et sted til en familie som forbindes med et sted. @no
definition: Relaterer et sted til en familie, som er knyttet til et sted. @da
definition: Relates a place to a family who is associated with a place.
definition: Sasaista vietu ar dzimtu/ģimeni, kas saistīta ar vietu. @lv
definition: Seostab koha kohaga seotud perekonnaga. @et
definition: Setzt ein Geografikum in Beziehung zu einer Familie, die mit einem Geografikum in Verbindung steht. @de
definition: Συνδέει έναν τόπο με μια οικογένεια που συνδέεται με έναν περιγραφόμενο τόπο. @el
definition: يربط بين مكان وعائلة مرتبطة بمكان. @ar

has related corporate body of place
has element type: 1
toolkit definition: A corporate body who is associated with a place.
toolkit definition: Bir yerle ilişkilendirilen bir tüzel kişi. @tr
toolkit definition: Collectivité qui est associée à un lieu. @fr
toolkit definition: Een corporatie die geassocieerd is met een plaats. @nl
toolkit definition: Egy testület, amelyeyt egy helyhez társítanak. @hu
toolkit definition: Eine Körperschaft, die mit einem Geografikum in Verbindung steht. @de
toolkit definition: En korporasjon som forbindes med et sted. @no
toolkit definition: Ente associato a un luogo. @it
toolkit definition: Entitat corporativa que s’associa amb un lloc. @ca
toolkit definition: Institūcija, kas saistīta ar vietu. @lv
toolkit definition: Kohaga seotud asutus. @et
toolkit definition: Korporation, som er knyttet til et sted. @da
toolkit definition: Yhteisö, johon paikka liittyy. @fi
toolkit definition: هيئة مرتبطة بمكان. @ar
toolkit definition: 和一个地点有关的一个团体 @zh-hans
toolkit label: Yerin tüzel kişiyle ilişkisi @tr
toolkit label: ar vietu saistītā institūcija @lv
toolkit label: collectivité en relation avec un lieu @fr
toolkit label: ente correlato di luogo @it
toolkit label: entitat corporativa relacionada amb un lloc @ca
toolkit label: gerelateerde corporatie van plaats @nl
toolkit label: hely kapcsolódó testülete: @hu
toolkit label: kohaga seotud asutus @et
toolkit label: korporasjon relatert til sted @no
toolkit label: korporation relateret til sted @da
toolkit label: mit Geografikum in Beziehung stehende Körperschaft @de
toolkit label: paikkaan liittyvä yhteisö @fi
toolkit label: related corporate body of place
toolkit label: هيئة مرتبطة بمكان @ar
toolkit label: 地点的关联团体 @zh-hans
has subproperty: is place of conference of
has subproperty: is place governed by
has subproperty: P70016
lexical alias: relatedCorporateBodyOfPlace.en
status: Published
type: Property
domain: C10009
label: a pour collectivité en relation avec un lieu @fr
label: ar vietu saistītā institūcija @lv
label: có tập thể có liên quan (địa điểm) @vi
label: ha come ente correlato di luogo @it
label: har korporasjon relatert til sted @no
label: har korporation relateret til sted @da
label: hat mit Geografikum in Beziehung stehende Körperschaft @de
label: heeft gerelateerde corporatie van plaats @nl
label: hely kapcsolódó testülete a következő: @hu
label: kohaga seotud asutus @et
label: paikkaan liittyvä yhteisö @fi
label: té com a entitat corporativa relacionada amb un lloc @ca
label: yerin ilgili tüzel kişisi ile ilişkilidir @tr
label: έχει σχετικό συλλογικό όργανο (τόπος) @el
label: له هيئة مرتبطة بمكان @ar
label: 有地点的关联团体 @zh-hans
sub property of: has related collective agent of place
sub property of: P00009
alternative label: Tüzel kişilik ile ilişkili yer @tr
alternative label: a testülethez társított hely @hu
alternative label: lieu associé à une collectivité de @fr
alternative label: lloc associat amb una entitat corporativa de @ca
alternative label: luogo associato a ente di @it
alternative label: place associated with corporate body of
alternative label: sted forbundet med korporasjon for @no
alternative label: sted, som er knyttet til korporation af @da
alternative label: مكان مرتبط باسم هيئة لـ @ar
alternative label: 和……的团体有关的地点 @zh-hans
definition: Bir yeri, bir yerle bağlantılı olan bir tüzel kişilikle ilişkilendirir. @tr
definition: Correla un luogo a un ente associato a un luogo. @it
definition: Hozzákapcsol egy helyet egy testülethez, amelyet egy helyhez társítanak. @hu
definition: Liittää paikan yhteisöön, johon paikka liittyy. @fi
definition: Liên kết địa điểm với tập thể liên quan tới địa điểm đang được mô tả. @vi
definition: Met un lieu en relation avec une collectivité qui est associée à un lieu. @fr
definition: Relaciona un lloc amb una entitat corporativa que s’associa amb un lloc. @ca
definition: Relateert een plaats aan een corporatie die geassocieerd is met een plaats. @nl
definition: Relaterer et sted til en korporasjon som forbindes med et sted. @no
definition: Relaterer et sted til en korporation, som er knyttet til et sted. @da
definition: Relates a place to a corporate body who is associated with a place.
definition: Sasaista vietu ar institūciju, kas saistīta ar vietu. @lv
definition: Seostab koha kohaga seotud asutusega. @et

is subject place of
has element type: 2
toolkit definition: A work that is about a place.
toolkit definition: Bir yer hakkındaki bir eser. @tr
toolkit definition: Darbs, kura temats ir vieta. @lv
toolkit definition: Een werk dat over een plaats gaat. @nl
toolkit definition: Egy mű, amelyet egy helyhez társítanak. @hu
toolkit definition: Ein Werk, das von einem Geografikum handelt. @de
toolkit definition: Et verk som handler om et sted. @no
toolkit definition: Obra que tracta sobre un lloc. @ca
toolkit definition: Teos, jonka aiheena paikka on. @fi
toolkit definition: Teos, mis on koha kohta. @et
toolkit definition: Værk, som handler om et sted. @da
toolkit definition: opera che è su un luogo. @it
toolkit definition: Œuvre qui traite d’un lieu. @fr
toolkit definition: عمل عن مكان @ar
toolkit definition: 关于一个地点的一种作品 @zh-hans
toolkit label: Geografikum als Thema von @de
toolkit label: hely mint tárgya: @hu
toolkit label: ir temats (vieta) @lv
toolkit label: konu akınan yer @tr
toolkit label: lieu sujet de @fr
toolkit label: lloc de matèria de @ca
toolkit label: luogo soggetto di @it
toolkit label: onderwerp-plaats van @nl
toolkit label: paikka aiheena teoksessa @fi
toolkit label: sted som emne for @no
toolkit label: sted, som er subjekt af @da
toolkit label: subject place of
toolkit label: teema (koht) teoses @et
toolkit label: مكان موضوع لـ @ar
toolkit label: ……的主题地点 @zh-hans
has subproperty: is place described by
has subproperty: P70017
lexical alias: subjecfPlaceOf.en
status: Published
type: Property
domain: C10009
label: Konu yeridir @tr
label: er sted som emne for @no
label: er sted, som er subjekt af @da
label: est un lieu sujet de @fr
label: hely tárgya a következőnek: @hu
label: ir temats (vieta) @lv
label: is onderwerp-plaats van @nl
label: ist Geografikum als Thema von @de
label: là chủ đề của (địa điểm) @vi
label: paikka aiheena teoksessa @fi
label: teema (koht) teoses @et
label: è luogo soggetto di @it
label: és lloc de matèria de @ca
label: είναι θέμα του (τόπος) @el
label: هو مكان موضوع لـ @ar
label: 是……的主题地点 @zh-hans
sub property of: has related work of place
sub property of: P00014
alternative label: (yerin) konusu @tr
alternative label: emne for (sted) @no
alternative label: matèria de (lloc) @ca
alternative label: soggetto di (luogo) @it
alternative label: subject of (place)
alternative label: subjekt af (sted) @da
alternative label: sujet de (lieu) @fr
alternative label: tárgya a következőnek (hely): @hu
alternative label: موضوع عن (مكان) @ar
alternative label: ……的主题（地点） @zh-hans
definition: Bir yeri, bir yerle ilgili bir eserle ilişkilendirir. @tr
definition: Correla un luogo a un'opera che è su un luogo. @it
definition: Hozzákapcsol egy helyet egy műhöz, amelyet egy helyhez társítanak. @hu
definition: Liittää paikan teokseen, jonka aiheena paikka on. @fi
definition: Liên kết địa điểm với tác phẩm về địa điểm. @vi
definition: Met un lieu en relation avec une œuvre qui traite d’un lieu. @fr
definition: Relaciona un lloc amb una obra que tracta sobre un lloc. @ca
definition: Relateert een plaats aan een werk dat over een plaats gaat. @nl
definition: Relaterer et sted til et verk som handler om et sted. @no
definition: Relaterer et sted til et værk, som handler om et sted. @da
definition: Relates a place to a work that is about a place.
definition: Sasaista vietu ar darbu, kura temats ir vieta. @lv
definition: Seostab koha teosega, mis on koha kohta. @et
definition: Setzt ein Geografikum in Beziehung zu einem Werk, das von einem Geografikum handelt. @de
definition: Συνδέει έναν τόπο με ένα έργο που αναφέρεται σε έναν τόπο. @el

has access point for place
has element type: 3
toolkit definition: A nomen that is an appellation of place in natural language that is taken from a vocabulary encoding scheme or is constructed using a string encoding scheme.
toolkit definition: Benævnelse på sted på normalsprog, som er taget fra et vokabularkodningsskema eller er konstrueret ved hjælp af et strengkodningsskema. @da
toolkit definition: Bir kelime kodlama şemasından alınan veya bir dizi kodlama şeması kullanılarak oluşturulan, doğal dilde bir yer unvanı olan bir isim. @tr
toolkit definition: Designazione di luogo nel linguaggio naturale che è tratta da uno schema di codifica di vocabolario o è costruita usando uno schema di codifica di stringa. @it
toolkit definition: Een nomen dat is een benaming van plaats in natuurlijke taal dat ontleend is aan een vocabulair coderingsschema of gevormd is volgens een string coderingsschema. @nl
toolkit definition: Egy nomen, amely egy hely szótárkódolási sémából vett vagy karakterlánc-kódolási séma felhasználásával konstruált természetes nyelvi megnevezése. @hu
toolkit definition: Eine Bezeichnung für ein Geografikum in natürlicher Sprache, die einem Vocabulary Encoding Scheme entnommen oder mit einem String Encoding Scheme konstruiert wird. @de
toolkit definition: En betegnelse for sted på et naturlig språk som er hentet fra et kodeskjema for vokabular eller er laget ved hjelp av et kodeskjema for syntaks. @no
toolkit definition: Koha nimetus loomulikus keeles, mis on võetud leksikaalsest märkimissüsteemist või moodustatud stringilise märkimissüsteemi alusel. @et
toolkit definition: Nomen que és una apel·lació de lloc en llenguatge natural que s’obté d’un esquema de codificació de vocabulari o s’elabora usant un esquema de codificació de cadenes. @ca
toolkit definition: Nomen qui est une appellation de lieu en langage naturel provenant d’un schéma d’encodage de vocabulaire ou construite à l’aide d’un schéma d’encodage de chaînes. @fr
toolkit definition: Nomen, joka on luonnollisen kielen mukainen paikan nimitys, joka on otettu sanaston merkintäjärjestelmästä tai muodostettu merkkijonon merkintäjärjestelmää käyttäen. @fi
toolkit definition: Vietas vārds/nosaukums dabiskā valodā, kas ņemts no shēmas kontrolētu vārdnīcu kodēšanai vai tiek konstruēts, izmantojot virknes kodēšanas shēmu. @lv
toolkit definition: تسمية عبارة عن اسم تعريفي لمكان باللغة الطبيعية مأخوذ من خطة ترميز مفردات أو بُني باستخدام خطة ترميز سلسلة تمثيلات. @ar
toolkit definition: 作为一个地点的称谓、取自一个词表编码体系或者用一个串编码体系构建、用自然语言的一个命名 @zh-hans
toolkit label: Sucheinstieg für ein Geografikum @de
toolkit label: Yer için erişim noktası @tr
toolkit label: access point for place
toolkit label: hozzáférési pontja helyhez a következő: @hu
toolkit label: ingang voor plaats @nl
toolkit label: koha otsielement @et
toolkit label: paikan hakutieto @fi
toolkit label: point d’accès d’un lieu @fr
toolkit label: punt d’accés de lloc @ca
toolkit label: punto di accesso per luogo @it
toolkit label: søgeindgang for sted @da
toolkit label: søkeinngang for sted @no
toolkit label: vietas pamatforma @lv
toolkit label: نقطة وصول لمكان @ar
toolkit label: 地点的检索点 @zh-hans
has subproperty: has authorized access point for place
has subproperty: has variant access point for place
has subproperty: P70018
lexical alias: accessPointForPlace.en
status: Published
type: Property
domain: C10009
label: a pour point d’accès d’un lieu @fr
label: ha come punto di accesso per luogo @it
label: har søgeindgang for sted @da
label: har søkeinngang for sted @no
label: hat Sucheinstieg für ein Geografikum @de
label: heeft ingang voor plaats @nl
label: hozzáférési pontja helyhez a következő: @hu
label: koha otsielement @et
label: paikan hakutieto @fi
label: té com a punt d’accés de lloc @ca
label: vietas pamatforma @lv
label: yer için erişim noktası ile ilişkilidir @tr
label: له نقطة وصول لمكان @ar
label: 有地点的检索点 @zh-hans
sub property of: has appellation of place
sub property of: P00016
definition: Bir yeri, bir kelime kodlama şemasından alınan veya bir dizi kodlama şeması kullanılarak oluşturulmuş, doğal dilde bir yer unvanı olan bir isim ile ilişkilendirir. @tr
definition: Correla un luogo a una designazione di luogo nel linguaggio naturale che è tratta da uno schema di codifica di vocabolario o è costruita usando uno schema di codifica di stringa. @it
definition: Hozzákapcsol egy helyet egy nomenhez, amely egy hely szótárkódolási sémából vett vagy karakterlánc-kódolási séma felhasználásával konstruált természetes nyelvi megnevezése. @hu
definition: Liittää paikan nomeniin, joka on luonnollisen kielen mukainen paikan nimitys, joka on otettu sanaston merkintäjärjestelmästä tai muodostettu merkkijonon merkintäjärjestelmää käyttäen. @fi
definition: Met un lieu en relation avec un nomen qui est une appellation de lieu en langage naturel provenant d’un schéma d’encodage de vocabulaire ou construite à l’aide d’un schéma d’encodage de chaînes. @fr
definition: Relaciona un lloc amb un nomen que és una apel·lació de lloc en llenguatge natural que s’obté d’un esquema de codificació de vocabulari o s’elabora usant un esquema de codificació de cadenes. @ca
definition: Relateert een plaats aan een nomen dat is een benaming van plaats in natuurlijke taal dat ontleend is aan een vocabulair coderingsschema of gevormd is volgens een string coderingsschema. @nl
definition: Relaterer et sted til en benævnelse på sted på normalsprog, som er taget fra et vokabularkodningsskema eller er konstrueret ved hjælp af et strengkodningsskema. @da
definition: Relaterer et sted til en betegnelse for sted på et naturlig språk som er hentet fra et kodeskjema for vokabular eller er laget ved hjelp av et kodeskjema for syntaks. @no
definition: Relates a place to a nomen that is an appellation of place in natural language that is taken from a vocabulary encoding scheme or is constructed using a string encoding scheme.
definition: Sasaista vietu ar nomenu, kas ir vietas vārds/nosaukums dabiskā valodā, kas ņemts no shēmas kontrolētu vārdnīcu kodēšanai vai tiek konstruēts, izmantojot virknes kodēšanas shēmu. @lv
definition: Seostab koha koha nimetusega loomulikus keeles, mis on võetud leksikaalsest märkimissüsteemist või moodustatud stringilise märkimissüsteemi alusel. @et
definition: Setzt ein Geografikum in Beziehung zu einer Bezeichnung für ein Geografikum in natürlicher Sprache, die einem Vocabulary Encoding Scheme entnommen oder mit einem String Encoding Scheme konstruiert wird. @de
definition: يربط بين مكان وتسمية عبارة عن اسم تعريفي لمكان باللغة الطبيعية مأخوذ من خطة ترميز مفردات أو بُني باستخدام خطة ترميز سلسلة تمثيلات. @ar
definition: 将一个地点与作为一个地点的称谓、取自一个词表编码体系或者用一个串编码体系构建、用自然语言的一个命名关联起来。 @zh-hans

has appellation of place
has element type: 3
toolkit definition: A nomen that is used within a given scheme or context to refer to a place.
toolkit definition: Belirli bir şema veya bağlam içinde bir yere atıfta bulunmak için kullanılan bir isim. @tr
toolkit definition: Een nomen dat is gebruikt binnen een bepaald schema of context om te verwijzen naar een plaats. @nl
toolkit definition: Egy nomen, amelyet egy adott sémán vagy kontextuson belül használnak egy helyre való hivatkozásra. @hu
toolkit definition: Ein Nomen, das in einem bestimmten Schema oder Kontext verwendet wird, um eine Familie zu referenzieren. @de
toolkit definition: Et nomen som er brukt i et bestemt skjema eller kontekst for å referere til et sted. @no
toolkit definition: Nomen qui est utilisé à l’intérieur d’un schéma ou d’un contexte donnés pour désigner un lieu. @fr
toolkit definition: Nomen usat en un esquema o context determinat per referir-se a un lloc. @ca
toolkit definition: Nomen usato in un dato schema o contesto per riferirsi a un luogo. @it
toolkit definition: Nomen, jota käytetään viitattaessa paikkaan tietyssä järjestelmässä tai kontekstissä. @fi
toolkit definition: Nomen, mida antud süsteemis või kontekstis kasutatakse kohale viitamiseks. @et
toolkit definition: Nomen, som anvendes inden for et givet skema eller kontekst for at henvise til et sted. @da
toolkit definition: Nomens, ko lieto konkrētajā sistēmā vai kontekstā, lai norādītu uz vietu @lv
toolkit definition: تسمية مستخدمة ضمن خطة بعينها أو سياق بعينه يشير إلى مكان. @ar
toolkit definition: 在一个给定的体系或语境中指称一个地点所用的一个命名 @zh-hans
toolkit label: Bezeichnung für ein Geografikum @de
toolkit label: apel·lació de lloc @ca
toolkit label: appellation de lieu @fr
toolkit label: appellation of place
toolkit label: benaming van plaats @nl
toolkit label: benævnelse på sted @da
toolkit label: betegnelse for sted @no
toolkit label: denominazione di luogo @it
toolkit label: hely megnevezése: @hu
toolkit label: koha nimetus @et
toolkit label: paikan nimitys @fi
toolkit label: vietas apzīmējums @lv
toolkit label: yerin unvanı @tr
toolkit label: اسم تعريفي لمكان @ar
toolkit label: 地点的称谓 @zh-hans
has subproperty: has name of place
has subproperty: has access point for place
has subproperty: has identifier for place
has subproperty: P70019
lexical alias: appellationOfPlace.en
status: Published
type: Property
domain: C10009
label: a pour appellation de lieu @fr
label: ha come denominazione di luogo @it
label: har benævnelse på sted @da
label: har betegnelse for sted @no
label: hat Bezeichnung für ein Geografikum @de
label: heeft benaming van plaats @nl
label: hely megnevezése a következő: @hu
label: koha nimetus @et
label: paikan nimitys @fi
label: té com a apel·lació de lloc @ca
label: vietas apzīmējums @lv
label: yerin unvanı ile ilişkilidir @tr
label: له اسم تعريفي لمكان @ar
label: 有地点的称谓 @zh-hans
sub property of: has related nomen of place
sub property of: P00017
definition: Bir yeri, belirli bir şema veya bağlamda bir yere atıfta bulunmak için kullanılan bir isim ile ilişkilendirir. @tr
definition: Correla un luogo a un nomen usato in un dato schema o contesto per riferirsi a un luogo. @it
definition: Hozzákapcsol egy helyet egy nomenhez, amelyet egy adott sémán vagy kontextuson belül használnak egy helyre való hivatkozásra. @hu
definition: Liittää paikan nomeniin, jota käytetään viitattaessa paikkaan tietyssä järjestelmässä tai kontekstissä. @fi
definition: Met un lieu en relation avec un nomen qui est utilisé à l’intérieur d’un schéma ou d’un contexte donnés pour désigner un lieu. @fr
definition: Relaciona un lloc amb un nomen usat en un esquema o context determinat per referir-se a un lloc. @ca
definition: Relateert een plaats aan een nomen dat is gebruikt binnen een bepaald schema of context om te verwijzen naar een plaats. @nl
definition: Relaterer et sted til et nomen som er brukt i et bestemt skjema eller kontekst for å referere til et sted. @no
definition: Relaterer et sted til et nomen, som anvendes inden for et givet skema eller kontekst for at henvise til et sted. @da
definition: Relates a place to a nomen that is used within a given scheme or context to refer to a place.
definition: Sasaista vietu ar nomenu, ko lieto konkrētajā sistēmā vai kontekstā, lai norādītu uz vietu. @lv
definition: Seostab koha nomen'iga, mida antud süsteemis või kontekstis kasutatakse kohale viitamiseks. @et
definition: Setzt ein Geografikum in Beziehung zu einem Nomen, das in einem bestimmten Schema oder Kontext verwendet wird, um ein Geografikum zu referenzieren. @de
definition: يربط بين مكان وتسمية مستخدم ضمن خطة بعينها أو سياق بعينه يشير إلى مكان. @ar
definition: 将一个地点与在一个给定的体系或语境中指称一个地点所用的一个命名关联起来。 @zh-hans

has identifier for place
has element type: 3
instruction number: 16.3
toolkit definition: A nomen that is an appellation of place that consists of a code, number, or other string, usually independent of natural language and social naming conventions, used to identify a place.
toolkit definition: Benævnelse på sted, som består af en kode, nummer eller anden streng, ofte uafhængig af normalsprog og navngivningskonventioner, brugt til at identificere et sted. @da
toolkit definition: Bir yeri tanımlamak için kullanılan, genellikle doğal dilden ve sosyal adlandırma kurallarından bağımsız, bir kod, sayı veya başka bir dizeden oluşan bir yer unvanı olan bir isim. @tr
toolkit definition: Designazione di luogo che è costituita da un codice, numero, o altra stringa, di solito indipendente dal linguaggio naturale e dalle convenzioni sociali di denominazione, usata per identificare un luogo. @it
toolkit definition: Een nomen dat is een benaming van plaats die bestaat uit een code, nummer of andere tekenreeks, meestal onafhankelijk van natuurlijke taal of sociale naamgeving, gebruikt om een plaats te identificeren. @nl
toolkit definition: Egy nomen, egy hely megnevezése, amely egy kód-, szám-, vagy más típusú karakterláncból áll, amely általában független a természetes nyelvektől és társadalmi névkonvencióktól, és egy hely azonosítására használják. @hu
toolkit definition: Eine Bezeichnung für ein Geografikum, die aus einem Code, einer Nummer oder einer anderen Zeichenkette besteht, der/die normalerweise nicht in natürlicher Sprache und unabhängig von den sozialen Benennungskonventionen ist und zur Identifizierung eines Geografikums verwendet wird. @de
toolkit definition: En betegnelse for sted som består av en kode, et nummer eller en annen streng, vanligvis uavhengig av et naturlig språk og sosiale navnekonvensjoner, brukt for å identifisere et sted. @no
toolkit definition: Koha nimetus, mis koosneb kohta identifitseerivast koodist, numbrist või muust loomulikust keelest ja üldtuntud nimetamistavadest sõltumatust stringist. @et
toolkit definition: Nomen que és una apel·lació de lloc que consisteix en un codi, un número o una altra cadena, normalment independent del llenguatge natural i de les convencions de denominació social, usat per identificar un lloc. @ca
toolkit definition: Nomen qui est une appellation de lieu consistant en un code, un nombre ou une autre chaîne, généralement indépendante du langage naturel et des conventions sociales de dénomination, utilisée pour identifier un lieu. @fr
toolkit definition: Nomen, joka on paikan nimitys, joka koostuu koodista, numerosta tai muusta merkkijonosta ja joka yleensä on luonnollisesta kielestä ja kielen sosiaalisista konventioista riippumaton paikan tunnistamiskeino. @fi
toolkit definition: Vietas apzīmējums, kas sastāv no koda, skaitļa vai citas virknes, kas parasti ir neatkarīgs no dabiskas valodas vai sabiedrībā pieņemtām nosaukšanas tradīcijām, ko izmanto, lai identificētu vietu. @lv
toolkit definition: تسمية عبارة عن اسم تعريفي لمكان يتكون من رمز، أو رقم، أو سلسلة تمثيلات أخرى، مستقلة عادة عن اللغة الطبيعية وعن التسميات المتعارف عليها اجتماعيا، وتستخدم لتحديد مكان. @ar
toolkit definition: 作为一个由代码、数字、或其他字符串构成、通常独立于自然语言和社会命名惯例、用以标识一个地点的一个地点称谓的命名 @zh-hans
toolkit label: Identifikator für ein Geografikum @de
toolkit label: azonosító helyhez: @hu
toolkit label: identifiant de lieu @fr
toolkit label: identificador de lloc @ca
toolkit label: identificatie voor plaats @nl
toolkit label: identificatore per luogo @it
toolkit label: identifier for place
toolkit label: identifikator for sted @da
toolkit label: koha identifikaator @et
toolkit label: paikan tunniste @fi
toolkit label: vietas identifikators @lv
toolkit label: yerin tanımlayıcısı ile ilişkilidir @tr
toolkit label: معرف لمكان @ar
toolkit label: 地点的标识符 @zh-hans
has subproperty: P70020
lexical alias: identifierForPlace.en
status: Published
type: Property
domain: C10009
label: a pour identifiant de lieu @fr
label: azonosító helyhez a következő: @hu
label: ha come identificatore per luogo @it
label: har identifikator for sted @da
label: hat Identifikator für ein Geografikum @de
label: heeft identificatie voor plaats @nl
label: koha identifikaator @et
label: paikan tunniste @fi
label: té com a identificador de lloc @ca
label: vietas identifikators @lv
label: yerin tanımlayıcısı ile ilişkilidir @tr
label: له معرف لمكان @ar
label: 有地点的标识符 @zh-hans
sub property of: has appellation of place
sub property of: P00018
definition: Bir yeri, bir yeri tanımlamak için kullanılan, genellikle doğal dilden ve sosyal adlandırma kurallarından bağımsız olarak, bir kod, sayı veya başka bir dizgiden oluşan yer adı olan bir isim ile ilişkilendirir. @tr
definition: Correla un luogo a una designazione di luogo che è costituita da un codice, numero, o altra stringa, di solito indipendente dal linguaggio naturale e dalle convenzioni sociali di denominazione, usata per identificare un luogo. @it
definition: Hozzákapcsol egy helyet egy nomenhez, egy hely megnevezéséhez, amely egy kód-, szám-, vagy más típusú karakterláncból áll, amely általában független a természetes nyelvektől és társadalmi névkonvencióktól, és egy hely azonosítására használják. @hu
definition: Liittää paikan nomeniin, joka on paikan nimitys, joka koostuu koodista, numerosta tai muusta merkkijonosta ja joka yleensä on luonnollisesta kielestä ja kielen sosiaalisista konventioista riippumaton paikan tunnistamiskeino. @fi
definition: Met un lieu en relation avec un nomen qui est une appellation de lieu consistant en un code, un nombre ou une autre chaîne, généralement indépendante du langage naturel et des conventions sociales de dénomination, utilisée pour identifier un lieu. @fr
definition: Relaciona un lloc amb un nomen que és una apel·lació de lloc que consisteix en un codi, un número o una altra cadena, normalment independent del llenguatge natural i de les convencions de denominació social, usat per identificar un lloc. @ca
definition: Relateert een plaats aan een nomen dat is een benaming van plaats die bestaat uit een code, nummer of andere tekenreeks, meestal onafhankelijk van natuurlijke taal of sociale naamgeving, gebruikt om een plaats te identificeren. @nl
definition: Relaterer et sted til en benævnelse på sted, som består af en kode, nummer eller anden streng, ofte uafhængig af normalsprog og navngivningskonventioner, brugt til at identificere et sted. @da
definition: Relaterer et sted til en betegnelse for sted som består av en kode, et nummer eller en annen streng, vanligvis uavhengig av et naturlig språk og sosiale navnekonvensjoner, brukt for å identifisere et sted. @no
definition: Relates a place to a nomen that is an appellation of place that consists of a code, number, or other string, usually independent of natural language and social naming conventions, used to identify a place.
definition: Sasaista vietu ar nomenu, kas ir vietas apzīmējums, kas sastāv no koda, skaitļa vai citas virknes, kas parasti ir neatkarīgs no dabiskas valodas vai sabiedrībā pieņemtām nosaukšanas tradīcijām, ko izmanto, lai identificētu vietu. @lv
definition: Seostab koha koha nimetusega, mis koosneb kohta identifitseerivast koodist, numbrist või muust loomulikust keelest ja üldtuntud nimetamistavadest sõltumatust stringist. @et
definition: Setzt ein Geografikum in Beziehung zu einer Bezeichnung für ein Geografikum, die aus einem Code, einer Nummer oder einer anderen Zeichenkette besteht, der/die normalerweise nicht in natürlicher Sprache und unabhängig von den sozialen Benennungskonventionen ist und zur Identifizierung eines Geografikums verwendet wird. @de
definition: يربط بين مكان وتسمية عبارة عن اسم تعريفي لمكان يتكون من رمز، أو رقم، أو سلسلة تمثيلات أخرى، مستقلة عادة عن اللغة الطبيعية والتسميات المتعارف عليها اجتماعيا المستخدمة لتعريف مكان. @ar
definition: 将一个地点与作为一个由代码、数字、或其他字符串构成、通常独立于自然语言和社会命名惯例、用以标识一个地点的一个地点称谓的命名关联起来。 @zh-hans

is place of manifestation of
has element type: 2
toolkit definition: A manifestation that is a published manifestation that is distributed, printed, duplicated, cast, published, released, or issued, etc., or an unpublished manifestation that is inscribed, fabricated, constructed, etc., in a place.
toolkit definition: Bir yerde dağıtılan, basılan, çoğaltılan,dökülen, yayınlanan, piyasaya sürülen veya çıkarılan vb. yayınlanmış bir gösterim olan veya bir yerde kaydedilen, üretilen, yapılandırılan vb. yayınlanmamış bir gösterim olan bir gösterim. @tr
toolkit definition: Een manifestatie die een gepubliceerde manifestatie is, die is gedistribueerd, gedrukt, gedupliceerd, gegoten, gepubliceerd, uitgebracht of uitgevaardigd etc. of een ongepubliceerde manifestatie die is afgeschreven, gefabriceerd, geconstrueerd etc. in een plaats. @nl
toolkit definition: Egy kiadott megjelenési forma, amelyet terjesztenek, nyomtatnak, sokszorosítanak, öntenek, kiadnak, kibocsájtanak vagy megjelentetnek stb. vagy egy kiadatlan megjelenési forma, amelyet bejegyeznek, gyártanak, összeállítanak stb. egy helyen. @hu
toolkit definition: Eine veröffentlichte Manifestation, die an einem Geografikum vertrieben, gedruckt, vervielfältigt, gegossen, veröffentlicht, freigegeben oder herausgegeben und so weiter wird oder eine unveröffentlichte Manifestation, die an einem Geografikum beschriftet, fabriziert, konstruiert und so weiter wird. @de
toolkit definition: En manifestasjon som er en publisert manifestasjon som er distribuert, trykt, mangfoldiggjort, støpt, publisert, tilgjengeliggjort eller utstedt etc., eller en upublisert manifestasjon som er inskribert, fabrikert, konstruert, etc., på et sted. @no
toolkit definition: Julkaistu manifestaatio, joka on jaettu, painettu, monistettu, valattu kirjasintin osalta, kustannettu, julkaistu, ilmestynyt tms. paikassa. Julkaisematon manifestaatio, joka on kaiverrettu, valmistettu, koottu tms. paikassa. @fi
toolkit definition: Kehastus, mis on selles kohas levitatud, trükitud, paljundatud, valatud, avaldatud, välja lastud, välja antud vms (avaldatud kehastus), või inskribeeritud, toodetud, ehitatud vms (avaldamata kehastus). @et
toolkit definition: Manifestació que és una manifestació publicada que es distribueix, s’imprimeix, es reprodueix, es modela, es publica, es posa en circulació, s’emet, etc., o una manifestació no publicada que s’inscriu, es fabrica, es construeix, etc., en un lloc. @ca
toolkit definition: Manifestation publiée qui est diffusée ou distribuée, imprimée, reproduite, moulée, publiée, mise à disposition ou éditée, etc., ou une manifestation non publiée qui est écrite à la main, fabriquée, construite, etc. dans un lieu. @fr
toolkit definition: Manifestation, som er en publiceret manifestation, som et givet sted er distribueret, trykt, duplikeret, støbt, publiceret, frigivet eller udgivet ect., eller en upubliceret manifestation, som et givet sted er indskrevet, fremstillet, konstrueret ect. @da
toolkit definition: Manifestazione che è pubblicata, rilasciata, edita, stampata, duplicata, lanciata, distribuita, etc. in forma pubblicata o è incisa, fabbricata, costruita, etc. in forma non pubblicata in un luogo. @it
toolkit definition: Manifestācija, kas ir publicēta manifestācija, kas ir izplatīta, iespiesta, pavairota, iesieta, publicēta, izlaista vai izdota u.tml. noteiktā vietā, vai kas ir nepublicēta manifestācija, kas uzrakstīta, izgatavota, radīta u.tml. noteiktā vietā. @lv
toolkit definition: تجسيدة منشورة وُزعت، أو طُبعت، أو نُسخت، أو بُثت، أو نُشرت، أو أُصدرت، إلخ، أو تجسيدة غير منشورة دُونت، ووُضعت، وأُنشئت، إلخ، في مكان. @ar
toolkit definition: 作为一种出版载体表现在一个地点被发行、印刷、复制、铸造、出版、发布或经销等、或者一种非出版载体表现在一个地点被镌刻、制造、构造等的一种载体表现 @zh-hans
toolkit label: Geografikum einer Manifestation von @de
toolkit label: Hozzákapcsol egy helyet egy kiadott megjelenési formához, amelyet terjesztenek, nyomtatnak, sokszorosítanak, öntenek, kiadnak, kibocsájtanak vagy megjelentetnek stb. vagy egy kiadatlan megjelenési formához, amelyet bejegyeznek, gyártanak, összeállítanak stb. egy helyen. @hu
toolkit label: gösterim yeri @tr
toolkit label: ir manifestācijas vieta @lv
toolkit label: kehastuse koht kehastuses @et
toolkit label: lieu d’une manifestation de @fr
toolkit label: lloc d’una manifestació de @ca
toolkit label: luogo di manifestazione di @it
toolkit label: paikka manifestaatiolle @fi
toolkit label: plaats van manifestatie van @nl
toolkit label: place of manifestation of
toolkit label: sted for manifestasjon av @no
toolkit label: sted for manifestation af @da
toolkit label: مكان لتجسيدة لـ @ar
toolkit label: ……的载体表现的地点 @zh-hans
has subproperty: is place of distribution of
has subproperty: is place of manufacture of
has subproperty: is place of production of
has subproperty: is place of publication of
has subproperty: P70021
lexical alias: placeOfManifestationOf.en
status: Published
type: Property
domain: C10009
label: er sted for manifestasjon av @no
label: er sted for manifestation af @da
label: est un lieu d’une manifestation de @fr
label: gösterim yeridir @tr
label: helye a következő megjelenési formának: @hu
label: ir manifestācijas vieta @lv
label: is plaats van manifestatie van @nl
label: ist Geografikum einer Manifestation von @de
label: kehastuse koht kehastuses @et
label: paikka manifestaatiolle @fi
label: è luogo di manifestazione di @it
label: és lloc d’una manifestació de @ca
label: هو مكان لتجسيدة لـ @ar
label: 是……的载体表现的地点 @zh-hans
sub property of: has related manifestation of place
definition: Bir yeri, bir yerde dağıtılan, basılan, çoğaltılan, biçim verilen, yayınlanan, piyasaya sürülen veya yayınlanan vb. yayınlanmış bir gösterim olan veya bir yere kaydedilen, üretilen, düzenlenen vb. yayınlanmamış bir gösterim olan bir gösterim ile ilişkilendirir. @tr
definition: Correla un luogo a una manifestazione che è pubblicata, rilasciata, edita, stampata, duplicata, lanciata, distribuita, etc. in forma pubblicata o è incisa, fabbricata, costruita, etc. in forma non pubblicata in un luogo. @it
definition: Liittää paikan julkaistuun manifestaatioon, joka on jaettu, painettu, monistettu, valattu kirjasintin osalta, kustannettu, julkaistu, ilmestynyt tms. paikassa. Liittää paikan julkaisemattomaan manifestaatioon, joka on kaiverrettu, valmistettu, koottu tms. paikassa. @fi
definition: Met un lieu en relation avec une manifestation publiée qui est diffusée ou distribuée, imprimée, reproduite, moulée, publiée, mise à disposition ou éditée, etc., ou une manifestation non publiée qui est écrite à la main, fabriquée, construite, etc. dans un lieu. @fr
definition: Relaciona un lloc amb una manifestació que és una manifestació publicada que es distribueix, s’imprimeix, es reprodueix, es modela, es publica, es posa en circulació, s’emet, etc., o una manifestació no publicada que s’inscriu, es fabrica, es construeix, etc., en un lloc. @ca
definition: Relateert een plaats aan een manifestatie die een gepubliceerde manifestatie is, die is gedistribueerd, gedrukt, gedupliceerd, gegoten, gepubliceerd, uitgebracht of uitgevaardigd etc. of een ongepubliceerde manifestatie die is afgeschreven, gefabriceerd, geconstrueerd etc. in een plaats. @nl
definition: Relaterer et sted til en manifestasjon som er en publisert manifestasjon som er distribuert, trykt, mangfoldiggjort, støpt, publisert, tilgjengeliggjort eller utstedt etc., eller en upublisert manifestasjon som er inskribert, fabrikert, konstruert, etc., på et sted. @no
definition: Relaterer et sted til en manifestation, som er en publiceret manifestation, som et givet sted er distribueret, trykt, duplikeret, støbt, publiceret, frigivet eller udgivet ect., eller en upubliceret manifestation, som et givet sted er indskrevet, fremstillet, konstrueret ect. @da
definition: Relates a place to a manifestation that is a published manifestation that is distributed, printed, duplicated, cast, published, released, or issued, etc., or an unpublished manifestation that is inscribed, fabricated, constructed, etc., in a place.
definition: Sasaista vietu ar manifestāciju, kas ir publicēta manifestācija, kas ir izplatīta, iespiesta, pavairota, iesieta, publicēta, izlaista vai izdota u.tml. noteiktā vietā, vai kas ir nepublicēta manifestācija, kas uzrakstīta, izgatavota, radīta u.tml. noteiktā vietā. @lv
definition: Seostab koha kehastusega, mis on selles kohas levitatud, trükitud, paljundatud, valatud, avaldatud, välja lastud, välja antud vms (avaldatud kehastus), või inskribeeritud, toodetud, ehitatud vms (avaldamata kehastus). @et
definition: Setzt ein Geografikum in Beziehung zu einer veröffentlichten Manifestation, die an einem Geografikum vertrieben, gedruckt, vervielfältigt, gegossen, veröffentlicht, freigegeben oder herausgegeben und so weiter wird oder zu einer unveröffentlichte Manifestation, die an einem Geografikum beschriftet, fabriziert, konstruiert und so weiter wird. @de
definition: megjelenésiforma-helye: @hu
definition: يربط بين مكان وتجسيدة منشورة وُزعت، أو طُبعت، أو نُسخت، أو بُثت، أو نُشرت، أو أُصدرت، إلخ، أو تجسيدة غير منشورة دُونت، ووُضعت، وأُنشئت، إلخ، في مكان. @ar
definition: 将一个地点与作为一种出版载体表现在一个地点被发行、印刷、复制、铸造、出版、发布或经销等、或者一种非出版载体表现在一个地点被镌刻、制造、构造等的一种载体表现关联起来。 @zh-hans

has note on place
has element type: 6
toolkit definition: A broad unstructured description of one or more attributes of a place.
toolkit definition: Bir yerin bir veya daha fazla niteliğinin yapılandırılmamış geniş tanımı. @tr
toolkit definition: Descripció no estructurada àmplia d’un o més atributs d’un lloc. @ca
toolkit definition: Description non structurée générale d’un ou plusieurs attributs d’un lieu. @fr
toolkit definition: Descrizione non strutturata più ampia di uno o più attributi di un luogo. @it
toolkit definition: Een algemene ongestructureerde beschrijving van één of meer attributen van een plaats. @nl
toolkit definition: Egy hely egy vagy több ismérvének szabad szöveges, strukturálatlan leírása. @hu
toolkit definition: Eine umfassende, unstrukturierte Beschreibung eines Merkmals oder mehrerer Merkmale eines Geografikums. @de
toolkit definition: En bred ustrukturert beskrivelse av ett eller flere attributter for et sted. @no
toolkit definition: Plašs nestrukturēts vietas viena vai vairāku atribūtu apraksts. @lv
toolkit definition: Relaterer et sted til en bred, ustruktureret beskrivelse af en eller flere af et steds attributter. @da
toolkit definition: Yleisluonteinen rakenteistamaton kuvailu, joka sisältää paikan yhden tai useamman attribuutin. @fi
toolkit definition: Üldine struktureerimata kirjeldus, mis iseloomustab üht või mitut koha omadust. @et
toolkit definition: وصف واسع وغير مُهيكل لخاصية واحدة أو أكثر من خصائص مكان. @ar
toolkit definition: 关于一个地点的一个或多个属性的宽泛的非结构化的描述 @zh-hans
toolkit label: Anmerkung zum Geografikum @de
toolkit label: Yer hakkında not @tr
toolkit label: helyre vonatkozó megjegyzése: @hu
toolkit label: huomautus paikasta @fi
toolkit label: märkus koha kohta @et
toolkit label: noot bij plaats @nl
toolkit label: nota sobre un lloc @ca
toolkit label: nota su luogo @it
toolkit label: note for sted @no
toolkit label: note om sted @da
toolkit label: note on place
toolkit label: note sur un lieu @fr
toolkit label: piezīme par vietu @lv
toolkit label: تبصرة على مكان @ar
toolkit label: 关于地点的附注 @zh-hans
has subproperty: P70022
lexical alias: noteOnPlace.en
status: Published
type: Property
domain: C10009
label: a pour note sur un lieu @fr
label: ha come nota su luogo @it
label: har note for sted @no
label: har note om sted @da
label: hat Anmerkung zum Geografikum @de
label: heeft noot bij plaats @nl
label: helyre vonatkozó megjegyzése a következő: @hu
label: huomautus paikasta @fi
label: märkus koha kohta @et
label: piezīme par vietu @lv
label: té com a nota sobre un lloc @ca
label: yer hakkında not ile ilişkilidir @tr
label: له تبصرة على مكان @ar
label: 有关于地点的附注 @zh-hans
sub property of: P00015
definition: Bir yeri, bir yerin bir veya daha fazla özelliğinin yapılandırılmamış geniş açıklamasıyla ilişkilendirir. @tr
definition: Correla un luogo a una descrizione non strutturata generale di uno o più attributi di un luogo. @it
definition: Hozzákapcsol egy helyet egy hely egy vagy több ismérvének szabad szöveges, strukturálatlan leírásához. @hu
definition: Liittää paikan yleisluonteiseen rakenteistamattomaan kuvailuun, joka sisältää paikan yhden tai useamman attribuutin. @fi
definition: Met un lieu en relation avec une description non structurée générale d’un ou plusieurs attributs d’un lieu. @fr
definition: Relaciona un lloc amb una descripció no estructurada àmplia d’un o més atributs d’un lloc. @ca
definition: Relateert een plaats aan een algemene ongestructureerde beschrijving van één of meer attributen van een plaats. @nl
definition: Relaterer et sted til en bred ustrukturert beskrivelse av ett eller flere attributter for et sted. @no
definition: Relaterer et sted til en bred, ustruktureret beskrivelse af en eller flere af et steds attributter. @da
definition: Relates a place to a broad unstructured description of one or more attributes of a place.
definition: Sasaista vietu ar plašu nestrukturētu vietas viena vai vairāku atribūtu aprakstu. @lv
definition: Seostab koha üldise struktureerimata kirjeldusega, mis iseloomustab üht või mitut koha omadust. @et
definition: Setzt ein Geografikum in Beziehung zu einer umfassenden, unstrukturierten Beschreibung eines Merkmals oder mehrerer Merkmale eines Geografikums. @de
definition: يربط بين مكان ووصف واسع وغير مُهيكل لخاصية واحدة أو أكثر من خصائص مكان. @ar
definition: 将一个地点与关于一个地点的一个或多个属性的宽泛的非结构化的描述关联起来。 @zh-hans

is coordinates of cartographic content of
has element type: 2
toolkit definition: A work that is a cartographic work that has an area of coverage that is described using a mathematical system to identify its boundaries or location.
toolkit definition: Een werk dat is een cartografisch werk dat een bestreken gebied heeft dat is beschreven met gebruikmaking van een wiskundig systeem om de grenzen of locatie te identificeren. @nl
toolkit definition: Egy kartográfiai mű, amely az általa lefedett területet matematikai módszert használva ír le, hogy meghatározza a határát vagy a helyzetét. @hu
toolkit definition: Ein kartografisches Werk, dessen Abdeckungsbereich mit Hilfe eines mathematischen Systems beschrieben wird, um seine Grenzen oder Lage zu identifizieren. @de
toolkit definition: Et verk som er kartografisk som lokaliserer et område ved bruk av et matematisk system. @no
toolkit definition: Kartograafiline teos, mis hõlmab ala, mida selle piiride ja asukoha tuvastamiseks on kirjeldatud matemaatilise süsteemi abil. @et
toolkit definition: Kartogrāfisks darbs, kas nosaka teritoriju, izmantojot matemātisko sistēmu. @lv
toolkit definition: Obra que és una obra cartogràfica que té una àrea de cobertura que es descriu usant un sistema matemàtic per identificar els seus límits o la seva localització. @ca
toolkit definition: Opera cartografica che localizza un'area utilizzando un sistema matematico. @it
toolkit definition: Sınırlarını veya konumunu belirlemek için matematiksel bir sistem kullanılarak tanımlanan bir kapsama alanına sahip kartografik çalışma olan bir eser. @tr
toolkit definition: Teos, joka on kartografinen teos, jonka kattama alue on kuvailtu käyttäen matemaattista järjestelmää rajojen ja sijainnin identifioimiseksi. @fi
toolkit definition: Værk, som er kartografisk, som lokaliserer et område ved at bruge et matematisk system. @da
toolkit definition: Œuvre cartographique qui possède une zone de couverture décrite à l’aide d’un système mathématique permettant d'identifier ses limites ou son emplacement. @fr
toolkit definition: عمل عبارة عن مادة خرائطية لها نطاق تغطية موصوف باستخدام نظام رياضي لتحديد حدوده أو موقعه. @ar
toolkit definition: 作为一种地图作品、有覆盖范围、并被使用一个数学体系描述以标识其边界或位置的一种作品 @zh-hans
toolkit label: Koordinaten von kartografischem Inhalt von @de
toolkit label: coordenades d’un contingut cartogràfic de @ca
toolkit label: coordinate di contenuto cartografico di @it
toolkit label: coordinates of cartographic content of
toolkit label: coordonnées d’un contenu cartographique de @fr
toolkit label: coördinaten van cartografische content van @nl
toolkit label: ir koordinātas kartogrāfiskā saturā @lv
toolkit label: kartograafilise sisu koordinaadid teoses @et
toolkit label: kartografik içeriğin koordinatları @tr
toolkit label: kartografisen sisällön koordinaatit teokselle @fi
toolkit label: kartográfiai tartalom koordinátái: @hu
toolkit label: koordinater for kartografisk indhold af @da
toolkit label: koordinater for kartografisk innhold av @no
toolkit label: إحداثيات لمحتوى خرائطي لـ @ar
toolkit label: ……的地图内容的坐标 @zh-hans
has subproperty: is longitude and latitude of
has subproperty: is right ascension and declination of
has subproperty: is strings of coordinate pairs of
has subproperty: P70023
lexical alias: coordinatesOfCartographicContentOf.en
status: Published
type: Property
domain: C10009
label: consiste en coordonnées d’un contenu cartographique de @fr
label: er koordinater for kartografisk indhold af @da
label: har koordinater for kartografisk innhold av @no
label: ir koordinātas kartogrāfiskā saturā @lv
label: is coördinaten van cartografische content van @nl
label: kartograafilise sisu koordinaadid teoses @et
label: kartografik içeriğinin koordinatlarıdır @tr
label: kartografisen sisällön koordinaatit teokselle @fi
label: kartográfiai tartalom koordinátái a következőnek: @hu
label: sind Koordinaten von kartografischem Inhalt von @de
label: è coordinate di contenuto cartografico di @it
label: és coordenades d’un contingut cartogràfic de @ca
label: هو إحداثيات لمحتوى خرائطي لـ @ar
label: 是……的地图内容的坐标 @zh-hans
sub property of: has related work of place
definition: Bir yeri, sınırlarını veya konumunu belirlemek için matematiksel bir sistem kullanılarak tanımlanan bir kapsama alanına sahip kartografik bir eser olan bir eser ile ilişkilendirir. @tr
definition: Correla un luogo a un'opera cartografica che localizza un'area utilizzando un sistema matematico. @it
definition: Hozzákapcsol egy helyet egy kartográfiai műhöz, amely az általa lefedett területet matematikai módszert használva ír le, hogy meghatározza a határát vagy a helyzetét. @hu
definition: Liittää paikan teokseen, joka on kartografinen teos, jonka kattama alue on kuvailtu käyttäen matemaattista järjestelmää rajojen ja sijainnin identifioimiseksi. @fi
definition: Met un lieu en relation avec une œuvre cartographique qui possède une zone de couverture décrite à l’aide d’un système mathématique permettant d'identifier ses limites ou son emplacement. @fr
definition: Relaciona un lloc amb una obra que és una obra cartogràfica que té una àrea de cobertura que es descriu usant un sistema matemàtic per identificar els seus límits o la seva localització. @ca
definition: Relateert een plaats aan een werk dat is een cartografisch werk dat een bestreken gebied heeft dat is beschreven met gebruikmaking van een wiskundig systeem om de grenzen of locatie te identificeren. @nl
definition: Relaterer et sted til et verk som er kartografisk som lokaliserer et område ved bruk av et matematisk system. @no
definition: Relaterer et sted til et værk, som er kartografisk, som lokaliserer et område ved at bruge et matematisk system. @da
definition: Relates a place to a work that is a cartographic work that has an area of coverage that is described using a mathematical system to identify its boundaries or location.
definition: Sasaista vietu ar darbu, kas ir kartogrāfisks darbs, kas nosaka teritoriju, izmantojot matemātisko sistēmu. @lv
definition: Seostab koha kartograafilise teosega, mis hõlmab ala, mida selle piiride ja asukoha tuvastamiseks on kirjeldatud matemaatilise süsteemi abil. @et
definition: Setzt ein Gebiet in Beziehung zu einem kartografischen Werk, dessen Abdeckungsbereich mit Hilfe eines mathematischen Systems beschrieben wird, um seine Grenzen oder Lage zu identifizieren. @de
definition: يربط بين مكان وعمل عبارة عن مادة خرائطية لها نطاق تغطية موصوف باستخدام نظام رياضي لتحديد حدوده أو موقعه. @ar
definition: 将一个地点与作为一种地图作品、有覆盖范围、并被使用一个数学体系描述以标识其边界或位置的一种作品关联起来。 @zh-hans

is country associated with person of
has element type: 2
toolkit definition: A person who is identified with a country.
toolkit definition: Bir ülke ile özdeşleşmiş kişi. @tr
toolkit definition: Een persoon die geïdentificeerd wordt met een land. @nl
toolkit definition: Egy személy, akit egy országhoz társítanak. @hu
toolkit definition: Eine Person, die mit einem Land identifiziert wird. @de
toolkit definition: En person som er identifisert med et land. @no
toolkit definition: Henkilö, joka identifioidaan maan avulla. @fi
toolkit definition: Isik, kes on maaga lahutamatult seotud. @et
toolkit definition: Person, som er forbundet med et land. @da
toolkit definition: Persona che è identificata con un paese. @it
toolkit definition: Persona que s’identifica amb un país. @ca
toolkit definition: Persona, ar kuru saistīta valsts. @lv
toolkit definition: Personne qui est associée à un pays. @fr
toolkit definition: شخص معرف بدولة @ar
toolkit definition: 被一个国家标识的一个个人 @zh-hans
toolkit label: Land, das mit einer Person in Verbindung steht von @de
toolkit label: ar valsti saistītā persona @lv
toolkit label: country associated with person of
toolkit label: kişiyle bağlantılı ülke @tr
toolkit label: land forbundet med person for @no
toolkit label: land geassocieerd met persoon van @nl
toolkit label: land knyttet til person af @da
toolkit label: maa liittyy henkilöön @fi
toolkit label: maaga seotud isik @et
toolkit label: paese associato a persona di @it
toolkit label: pays associé à une personne de @fr
toolkit label: país associat amb una persona de @ca
toolkit label: személyhez köthető országa: @hu
toolkit label: دولة مرتبطة بشخص لـ @ar
toolkit label: 和……的个人有关的国家 @zh-hans
has subproperty: P70024
lexical alias: countryAssociatedWithPersonOf.en
status: Published
type: Property
domain: C10009
label: er land forbundet med person for @no
label: er land knyttet til person af @da
label: est un pays associé à une personne de @fr
label: ir ar valsti saistītā persona @lv
label: is land geassocieerd met persoon van @nl
label: ist Land, das mit einer Person in Verbindung steht von @de
label: kişisinin ülkesi ile ilişkilidir @tr
label: maa liittyy henkilöön @fi
label: maaga seotud isik @et
label: személlyel kapcsolatos országa a következőnek: @hu
label: è paese associato a persona di @it
label: és país associat amb una persona de @ca
label: هو دولة مرتبطة بشخص لـ @ar
label: 是和……的个人有关的国家 @zh-hans
sub property of: has related person of place
definition: Bir yeri, bir ülke ile özdeşleşmiş bir kişi ile ilişkilendirir. @tr
definition: Correla un luogo con una persona che è identificata con un paese. @it
definition: Hozzákapcsol egy helyet egy személyhez, akit egy országhoz társítanak. @hu
definition: Liittää paikan henkilöön, joka tunnistetaan maan avulla. @fi
definition: Met un lieu en relation avec une personne qui est associée à un pays. @fr
definition: Relaciona un lloc amb una persona que s’identifica amb un país. @ca
definition: Relateert een plaats aan een persoon die geïdentificeerd wordt met een land. @nl
definition: Relaterer et sted til en person som er identifisert med et land. @no
definition: Relaterer et sted til en person, som er forbundet med et land. @da
definition: Relates a place to a person who is identified with a country.
definition: Sasaista vietu ar personu, ar kuru saistīta valsts. @lv
definition: Seostab koha isikuga, kes on maaga lahutamatult seotud. @et
definition: Setzt ein Geografikum in Beziehung zu einer Person, die mit einem Land identifiziert wird. @de
definition: يربط بين مكان وشخص مُعرف بدولة. @ar
definition: 将一个地点与被一个国家标识的一个个人关联起来。 @zh-hans

is place of birth of
has element type: 2
toolkit definition: A person who was born in a place.
toolkit definition: Bir yerde doğmuş bir kişi. @tr
toolkit definition: Een persoon die geboren werd in een plaats. @nl
toolkit definition: Egy személy, aki azon a helyen született. @hu
toolkit definition: Eine Person, die an einem Ort geboren wurde. @de
toolkit definition: En person som ble født på et sted. @no
toolkit definition: Henkilö, joka syntyi paikassa. @fi
toolkit definition: Isik, kes sündis selles kohas. @et
toolkit definition: Person, som blev født et sted. @da
toolkit definition: Persona che è nata in un luogo. @it
toolkit definition: Persona que va néixer en un lloc. @ca
toolkit definition: Persona, kura dzimusi norādītajā vietā. @lv
toolkit definition: Personne qui est née dans un lieu. @fr
toolkit definition: شخص كان مولودا في مكان. @ar
toolkit definition: 在一个地点出生的一个个人 @zh-hans
toolkit label: Geburtsort von @de
toolkit label: doğum yeri @tr
toolkit label: fødested af @da
toolkit label: fødested for @no
toolkit label: geboorteplaats van @nl
toolkit label: ir dzimšanas vieta @lv
toolkit label: lieu de naissance de @fr
toolkit label: lloc de naixement de @ca
toolkit label: luogo di nascita di @it
toolkit label: place of birth of
toolkit label: syntymäpaikka henkilölle @fi
toolkit label: születési helye: @hu
toolkit label: sünnikoht isikule @et
toolkit label: مكان الميلاد لـ @ar
toolkit label: ……的出生地点 @zh-hans
has subproperty: P70025
lexical alias: placeOfBirthOf.en
status: Published
type: Property
domain: C10009
label: doğum yeridir @tr
label: er fødested af @da
label: er fødested for @no
label: est un lieu de naissance de @fr
label: ir dzimšanas vieta @lv
label: is geboorteplaats van @nl
label: ist Geburtsort von @de
label: syntymäpaikka henkilölle @fi
label: születési helye a következőnek: @hu
label: sünnikoht isikule @et
label: è luogo di nascita di @it
label: és lloc de naixement de @ca
label: هو مكان الميلاد لـ @ar
label: 是……的出生地点 @zh-hans
sub property of: has related person of place
definition: Bir yeri, bir yerde doğmuş olan bir kişi ile ilişkilendirir. @tr
definition: Correla un luogo con una persona che è nata in un luogo. @it
definition: Hozzákapcsol egy helyet egy személyhez, aki azon a helyen született. @hu
definition: Liittää paikan henkilöön, joka syntyi paikassa. @fi
definition: Met un lieu en relation avec une personne qui est née dans un lieu. @fr
definition: Relaciona un lloc amb una persona que va néixer en un lloc. @ca
definition: Relateert een plaats aan een persoon die geboren werd in een plaats. @nl
definition: Relaterer et sted til en person som ble født på et sted. @no
definition: Relaterer et sted til en person, som blev født et sted. @da
definition: Relates a place to a person who was born in a place.
definition: Sasaista vietu ar personu, kura dzimusi norādītajā vietā. @lv
definition: Seostab koha isikuga, kes sündis selles kohas. @et
definition: Setzt ein Geografikum in Beziehung zu einer Person, die an einem Ort geboren wurde. @de
definition: يربط بين مكان وشخص وُلد في مكان. @ar
definition: 将一个地点与在一个地点出生的一个个人关联起来。 @zh-hans

is place of death of
has element type: 2
toolkit definition: A person who died in a place.
toolkit definition: Bir yerde ölen bir kişi. @tr
toolkit definition: Een persoon die stierf in een plaats. @nl
toolkit definition: Egy személy, aki azon a helyen halt meg. @hu
toolkit definition: Eine Person, die an einem Ort gestorben ist. @de
toolkit definition: En person som døde på et sted. @no
toolkit definition: Henkilö, joka kuoli paikassa. @fi
toolkit definition: Isik, kes suri selles kohas. @et
toolkit definition: Person, som døde et sted. @da
toolkit definition: Persona che è morta in un luogo. @it
toolkit definition: Persona que va morir en un lloc. @ca
toolkit definition: Persona, kura mirusi norādītajā vietā. @lv
toolkit definition: Personne qui est morte dans un lieu. @fr
toolkit definition: شخص توفي في مكان. @ar
toolkit definition: 在一个地点去世的一个个人 @zh-hans
toolkit label: Sterbeort von @de
toolkit label: dødssted af @da
toolkit label: dødssted for @no
toolkit label: halálozási helye: @hu
toolkit label: ir miršanas vieta @lv
toolkit label: kuolinpaikka henkilölle @fi
toolkit label: lieu de décès de @fr
toolkit label: lloc de defunció de @ca
toolkit label: luogo di morte di @it
toolkit label: place of death of
toolkit label: sterfplaats van @nl
toolkit label: surmakoht isikule @et
toolkit label: ölüm yeri @tr
toolkit label: مكان الوفاة لـ @ar
toolkit label: ……的去世地点 @zh-hans
has subproperty: P70026
lexical alias: placeOfDeathOf.en
status: Published
type: Property
domain: C10009
label: er dødssted af @da
label: er dødssted for @no
label: est un lieu de décès de @fr
label: halálozási helye a következőnek: @hu
label: ir miršanas vieta @lv
label: is sterfplaats van @nl
label: ist Sterbeort von @de
label: kuolinpaikka henkilölle @fi
label: surmakoht isikule @et
label: è luogo di morte di @it
label: és lloc de defunció de @ca
label: ölüm yeridir @tr
label: هو مكان الوفاة لـ @ar
label: 是……的去世地点 @zh-hans
sub property of: has related person of place
definition: Bir yeri, bir yerde ölmüş olan bir kişi ile ilişkilendirir. @tr
definition: Correla un luogo con una persona che è morta in un luogo. @it
definition: Hozzákapcsol egy helyet egy személyhez, aki azon a helyen halt meg. @hu
definition: Liittää paikan henkilöön, joka kuoli paikassa. @fi
definition: Met un lieu en relation avec une personne qui est morte dans un lieu. @fr
definition: Relaciona un lloc amb una persona que va morir en un lloc. @ca
definition: Relateert een plaats aan een persoon die stierf in een plaats. @nl
definition: Relaterer et sted til en person som døde på et sted. @no
definition: Relaterer et sted til en person, som døde et sted. @da
definition: Relates a place to a person who died in a place.
definition: Sasaista vietu ar personu, kura mirusi norādītajā vietā. @lv
definition: Seostab koha isikuga, kes suri selles kohas. @et
definition: Setzt ein Geografikum in Beziehung zu einer Person, die an einem Ort gestorben ist. @de
definition: يربط بين مكان وشخص توفي في مكان. @ar
definition: 将一个地点与在一个地点去世的一个个人关联起来。 @zh-hans

is place of residence of
has element type: 2
toolkit definition: A person who resides or has resided in a place.
toolkit definition: Bir yerde ikamet eden veya ikamet etmiş bir kişi. @tr
toolkit definition: Een persoon die verblijft of heeft verbleven in een plaats. @nl
toolkit definition: Egy személy, aki egy bizonyos helyen lakik vagy tartózkodik. @hu
toolkit definition: Eine Person, die an einem Ort wohnt oder gewohnt hat. @de
toolkit definition: En person som bor eller har bodd på et sted. @no
toolkit definition: Henkilö, joka asui tai on asunut paikassa. @fi
toolkit definition: Isik, kes elab või elas selles kohas. @et
toolkit definition: Person, som bor eller har boet et sted. @da
toolkit definition: Persona che è risiede o aveva risieduto in un luogo. @it
toolkit definition: Persona que resideix o ha residit en un lloc. @ca
toolkit definition: Persona, kura dzīvo vai ir uzturējusies kādā vietā. @lv
toolkit definition: Personne qui réside ou a résidé dans un lieu. @fr
toolkit definition: شخص يقيم أو أقام في مكان. @ar
toolkit definition: 在一个地点居住或居住过的一个个人 @zh-hans
toolkit label: Wohnort von @de
toolkit label: asuinpaikka henkilölle @fi
toolkit label: bosted for @no
toolkit label: elukoht isikule @et
toolkit label: ikamet yeri @tr
toolkit label: ir uzturēšanās vieta @lv
toolkit label: lakóhelye: @hu
toolkit label: lieu de résidence de @fr
toolkit label: lloc de residència de @ca
toolkit label: luogo di residenza di @it
toolkit label: opholdssted af @da
toolkit label: place of residence of
toolkit label: verblijfplaats van @nl
toolkit label: مكان الإقامة لـ @ar
toolkit label: ……的居住地点 @zh-hans
has subproperty: P70027
lexical alias: placeOfResidenceOf.en
status: Published
type: Property
domain: C10009
label: asuinpaikka henkilölle @fi
label: elukoht isikule @et
label: er bosted for @no
label: er opholdssted af @da
label: est un lieu de résidence de @fr
label: ikamet yeridir @tr
label: ir uzturēšanās vieta @lv
label: is verblijfplaats van @nl
label: ist Wohnort von @de
label: lakóhelye a következőnek: @hu
label: è luogo di residenza di @it
label: és lloc de residència de @ca
label: هو مكان الإقامة لـ @ar
label: 是……的居住地点 @zh-hans
sub property of: has related person of place
definition: Bir yeri, bir yerde ikamet eden veya ikamet etmiş olan bir kişi ile ilişkilendirir. @tr
definition: Correla un luogo con una persona che è risiede o aveva risieduto in un luogo. @it
definition: Egy helyet hozzákapcsol egy személyhez, aki azona helyen lakik vagy tartózkodik. @hu
definition: Liittää paikan henkilöön, joka asui tai on asunut paikassa. @fi
definition: Met un lieu en relation avec une personne qui réside ou a résidé dans un lieu. @fr
definition: Relaciona un lloc amb una persona que resideix o ha residit en un lloc. @ca
definition: Relateert een plaats aan een persoon die verblijft of heeft verbleven in een plaats. @nl
definition: Relaterer et sted til en person som bor eller har bodd på et sted. @no
definition: Relaterer et sted til en person, som bor eller har boet et sted. @da
definition: Relates a place to a person who resides or has resided in a place.
definition: Sasaista vietu ar personu, kura dzīvo vai ir uzturējusies kādā vietā. @lv
definition: Seostab koha isikuga, kes elab või elas selles kohas. @et
definition: Setzt ein Geografikum in Beziehung zu einer Person, die an einem Ort wohnt oder gewohnt hat. @de
definition: يربط بين مكان وشخص يقيم أو أقام في مكان. @ar
definition: 将一个地点与在一个地点居住或居住过的一个个人关联起来。 @zh-hans

is place of conference of
has element type: 2
toolkit definition: A corporate body who is a conference, exhibition, or other formally named and convened event that gives rise to a work and that is held in a place.
toolkit definition: Bir yerde düzenlenen ve bir çalışmaya yol açan bir konferans, sergi veya diğer resmi olarak adlandırılmış ve toplanmış bir etkinlik olan bir tüzel kişilik. @tr
toolkit definition: Collectivité qui consiste en un congrès, une exposition ou un autre événement formellement nommé et convoqué qui donne lieu à la création d’une œuvre et qui se tient dans un lieu. @fr
toolkit definition: Conferenza, mostra, o altro evento formalmente nominato o convocato che dà origine a un'opera. @it
toolkit definition: Een corporatie die is een conferentie, tentoonstelling of ander formeel benoemde en samengekomen gebeurtenis die aanleiding geeft tot een werk en die is gehouden in een plaats. @nl
toolkit definition: Egy testület, egy konferencia, kiállítás, vagy más hivatalos névvel rendelkező és szervezett esemény, amely egy mű létrejöttét eredményezi és egy helyen tartanak. @hu
toolkit definition: Eine Körperschaft, bei der es sich um eine Konferenz, eine Ausstellung oder eine andere formal benannte und einberufene Veranstaltung handelt, die an einem Ort stattgefunden hat und aus der ein Werk hervorgeht. @de
toolkit definition: En konferanse, utstilling eller annen formelt navngitt og avholdt arrangement som gir opphav til et verk. @no
toolkit definition: Entitat corporativa que és un congrés, una exposició o qualsevol altre esdeveniment formalment mencionat i convocat que dona origen a una obra i que se celebra en un lloc. @ca
toolkit definition: Konference, izstāde vai cits formāli nosaukts un organizēts pasākums. @lv
toolkit definition: Konference, udstilling eller anden formelt navngivet og indkaldt begivenhed, som giver anledning til et værk. @da
toolkit definition: Konverents, näitus või muu vormiliselt nimetatud ja kokku kutsutud üritus, mis paneb aluse teosele. @et
toolkit definition: Yhteisö, joka on konferenssi, näyttely tai muu muodollisesti nimetty ja kokoonkutsuttu tilaisuus, joka saa aikaan teoksen ja joka järjestetään jossakin paikassa. @fi
toolkit definition: هيئة عبارة عن مؤتمر، أو معرض، أو حدث آخر سُميَ وعقد رسميًا وأسفر عن عمل أقيم في مكان. @ar
toolkit definition: 作为一个导致一种作品产生并在一个地点举行的会议、展览或其他正式命名并举办的活动的一个团体 @zh-hans
toolkit label: Ort einer Konferenz von @de
toolkit label: ir pasākuma norises vieta @lv
toolkit label: konferans yeri @tr
toolkit label: konferansested for @no
toolkit label: konferenciahelyszíne: @hu
toolkit label: lieu d’un congrès de @fr
toolkit label: lloc de congrés de @ca
toolkit label: luogo di conferenza @it
toolkit label: paikka konferenssille @fi
toolkit label: plaats van conferentie van @nl
toolkit label: place of conference of
toolkit label: sted for konference af @da
toolkit label: toimumiskoht konverentsile @et
toolkit label: مكان لمؤتمر لـ @ar
toolkit label: ……的会议的地点 @zh-hans
has subproperty: P70028
lexical alias: placeOfConferenceOf.en
status: Published
type: Property
domain: C10009
label: er konferansested for @no
label: est un lieu d’un congrès de @fr
label: har sted for konference af @da
label: ir pasākuma norises vieta @lv
label: is plaats van conferentie van @nl
label: ist Ort einer Konferenz von @de
label: konferansının yeridir @tr
label: konferenciahelyszíne a következőnek: @hu
label: paikka konferenssille @fi
label: toimumiskoht konverentsile @et
label: è luogo di conferenza @it
label: és lloc de congrés de @ca
label: هو مكان لمؤتمر لـ @ar
label: 是……的会议的地点 @zh-hans
sub property of: has related corporate body of place
alternative label: Ort einer Konferenz usw. von @de
alternative label: asukoht konverentsile vms @et
alternative label: emplacement d’un congrès, etc. de @fr
alternative label: konferansın konumu vs. @tr
alternative label: konferenciahelyszíne, stb.: @hu
alternative label: localització de congrés, etc. de @ca
alternative label: location of conference, etc. of
alternative label: lokation for konference etc. af @da
alternative label: paikka konferenssille tms. @fi
alternative label: موقع لمؤتمر، إلخ لـ @ar
alternative label: ……的会议等的位置 @zh-hans
definition: Bir yeri, bir yerde düzenlenen ve bir çalışmaya yol açan bir konferans, sergi veya diğer resmi olarak adlandırılmış ve toplanmış bir olay olan bir tüzel kişiliğe ilişkindir. @tr
definition: Correla un luogo a una conferenza, mostra, o altro evento formalmente nominato o convocato che dà origine a un'opera. @it
definition: Hozzákapcsol egy helyet egy testülethez, egy konferenciához, kiállításhoz, vagy más hivatalos névvel rendelkező és szervezett eseményhez, amely egy mű létrejöttét eredményezi és egy helyen tartanak. @hu
definition: Liittää paikan yhteisöön, joka on konferenssi, näyttely tai muu muodollisesti nimetty ja kokoonkutsuttu tilaisuus, joka saa aikaan teoksen ja joka järjestetään jossakin paikassa. @fi
definition: Met un lieu en relation avec une collectivité qui consiste en un congrès, une exposition ou un autre événement formellement nommé et convoqué qui donne lieu à la création d’une œuvre et qui se tient dans un lieu. @fr
definition: Relaciona un lloc amb una entitat corporativa que és un congrés, una exposició o qualsevol altre esdeveniment formalment mencionat i convocat que dona origen a una obra i que se celebra en un lloc. @ca
definition: Relateert een plaats aan een corporatie die is een conferentie, tentoonstelling of ander formeel benoemde en samengekomen gebeurtenis die aanleiding geeft tot een werk en die is gehouden in een plaats. @nl
definition: Relaterer et sted til en konferanse, utstilling eller annen formelt navngitt og avholdt arrangement som gir opphav til et verk. @no
definition: Relaterer et sted til en konference, udstilling eller anden formelt navngivet og indkaldt begivenhed, som giver anledning til et værk. @da
definition: Relates a place to a corporate body who is a conference, exhibition, or other formally named and convened event that gives rise to a work and that is held in a place.
definition: Sasaista vietu ar institūciju, kas ir konference, izstāde vai cits formāli nosaukts un organizēts pasākums. @lv
definition: Seostab koha konverentsi, näituse või muu vormiliselt nimetatud ja kokku kutsutud üritusega, mis paneb aluse teosele. @et
definition: Setzt ein Geografikum in Beziehung zu einer Körperschaft, bei der es sich um eine Konferenz, eine Ausstellung oder eine andere formal benannte und einberufene Veranstaltung handelt, die an einem Ort stattgefunden hat und aus der ein Werk hervorgeht. @de
definition: يربط بين مكان وهيئة عبارة عن مؤتمر، أو معرض، أو حدث آخر سُميَ وعقد رسميًا وأسفر عن عمل أقيم في مكان. @ar
definition: 将一个地点与作为一个导致一种作品产生并在一个地点举行的会议、展览或其他正式命名并举办的活动的一个团体关联起来。 @zh-hans

is other place associated with corporate body of (Deprecated)
has element type: 3
has subproperty: P70029
status: Deprecated
type: Property

is place associated with corporate body of (Deprecated)
has element type: 2
has subproperty: P70030
status: Deprecated
type: Property

is place associated with family of (Deprecated)
has element type: 2
has subproperty: P70031
status: Deprecated
type: Property

is part of place
has element type: 2
toolkit definition: A place that encompasses another place.
toolkit definition: Başka bir yeri kapsayan bir yer. @tr
toolkit definition: Een plaats die een andere plaats omvat. @nl
toolkit definition: Egy hely, amely magában foglal egy másik helyet. @hu
toolkit definition: Ein Geografikum, das ein anderes Geografikum umschließt. @de
toolkit definition: Et sted som omfatter et annet sted. @no
toolkit definition: Koht, mis hõlmab teist kohta. @et
toolkit definition: Lieu qui comprend un autre lieu. @fr
toolkit definition: Lloc que comprèn un altre lloc. @ca
toolkit definition: Luogo che comprende un altro luogo. @it
toolkit definition: Paikka, joka sisältää toisen paikan. @fi
toolkit definition: Sted, som omfatter et andet sted. @da
toolkit definition: Vieta, kas ietver citu vietu. @lv
toolkit definition: مكان يشتمل على مكان آخر. @ar
toolkit definition: 包含另一个地点的一个地点 @zh-hans
toolkit label: Teil von Geografikum @de
toolkit label: daļa vietā @lv
toolkit label: deel van plaats @nl
toolkit label: del af sted @da
toolkit label: del av sted @no
toolkit label: osa kohast @et
toolkit label: osa paikkaa @fi
toolkit label: part d’un lloc @ca
toolkit label: part of place
toolkit label: parte di luogo @it
toolkit label: partie de lieu de @fr
toolkit label: része a következő helynek: @hu
toolkit label: yerin bölümü @tr
toolkit label: جزء من مكان @ar
toolkit label: 地点的部分 @zh-hans
has subproperty: P70032
lexical alias: partOfPlace.en
status: Published
type: Property
domain: C10009
label: er del af sted @da
label: er del av sted @no
label: est une partie de lieu de @fr
label: ir daļa vietā @lv
label: is deel van plaats @nl
label: ist Teil von Geografikum @de
label: osa kohast @et
label: osa paikkaa @fi
label: része a következő helynek: @hu
label: yerin bir bileşenidir @tr
label: è parte di luogo @it
label: és part d’un lloc @ca
label: هو جزء من مكان @ar
label: 是地点的部分 @zh-hans
sub property of: has related place of place
definition: Bir yeri başka bir yeri kapsayan bir yer ile ilişkilendirir. @tr
definition: Correla un luogo a un luogo che comprende un altro luogo. @it
definition: Hozzákapcsol egy helyet egy olyan helyhez, amely magában foglal egy másik helyet. @hu
definition: Liittää paikan paikkaan, joka sisältää toisen paikan. @fi
definition: Met un lieu en relation avec un lieu qui comprend un autre lieu. @fr
definition: Relaciona un lloc amb un lloc que comprèn un altre lloc. @ca
definition: Relateert een plaats aan een plaats die een andere plaats omvat. @nl
definition: Relaterer et sted til et sted som omfatter et annet sted. @no
definition: Relaterer et sted til et sted, som omfatter et andet sted. @da
definition: Relates a place to a place that encompasses another place.
definition: Sasaista vietu ar vietu, kas ietver citu vietu. @lv
definition: Seostab koha kohaga, mis hõlmab teist kohta. @et
definition: Setzt ein Geografikum in Beziehung zu einem Geografikum, das ein anderes Geografikum umschließt. @de
definition: يربط بين مكان ومكان يشتمل على مكان آخر. @ar
definition: 将一个地点与包含另一个地点的一个地点关联起来。 @zh-hans

has part place
has element type: 2
toolkit definition: A place that is located within another place.
toolkit definition: Başka bir yerin içinde bulunan bir yer. @tr
toolkit definition: Een plaats die gelegen is binnen een andere plaats. @nl
toolkit definition: Egy hely, amely egy másik helyen belül található. @hu
toolkit definition: Ein Geografikum, das von einem anderen Geografikum umschlossen ist. @de
toolkit definition: Et sted som er lokalisert innenfor et annet sted. @no
toolkit definition: Koht, mis paikneb teise koha sees. @et
toolkit definition: Lieu qui est situé à l’intérieur d’un autre lieu. @fr
toolkit definition: Lloc situat dins un altre lloc. @ca
toolkit definition: Luogo che è localizzato in un altro luogo. @it
toolkit definition: Paikka, joka sijaitsee toisen paikan sisällä. @fi
toolkit definition: Sted, som er lokaliseret inden for et andet sted. @da
toolkit definition: Vieta, kas atrodas citā vietā. @lv
toolkit definition: مكان يقع داخل مكان آخر. @ar
toolkit definition: 位于另一个地点内部的一个地点 @zh-hans
toolkit label: Teil-Geografikum @de
toolkit label: deel plaats @nl
toolkit label: del af sted @da
toolkit label: del av sted @no
toolkit label: koha osa @et
toolkit label: lloc de part @ca
toolkit label: luogo come parte @it
toolkit label: paikan osa @fi
toolkit label: part place
toolkit label: partie de lieu @fr
toolkit label: részhelye: @hu
toolkit label: vieta: daļa @lv
toolkit label: yer bölümü @tr
toolkit label: جزء من مكان @ar
toolkit label: 部分地点 @zh-hans
has subproperty: P70033
lexical alias: partPlace.en
status: Published
type: Property
domain: C10009
label: a pour partie de lieu @fr
label: ha come luogo parte @it
label: har del af sted @da
label: har del av sted @no
label: hat Teil-Geografikum @de
label: heeft deel plaats @nl
label: koha osa @et
label: paikan osa @fi
label: részhelye a következő: @hu
label: té com a lloc de part @ca
label: vieta: daļa @lv
label: yer bileşeni ile ilişkilidir @tr
label: له جزء من مكان @ar
label: 有部分地点 @zh-hans
sub property of: has related place of place
definition: Bir yeri, başka bir yerin içinde bulunan bir yerle ilişkilendirir. @tr
definition: Correla un luogo a un luogo che è localizzato in un altro luogo. @it
definition: Hozzákapcsol egy helyet egy helyhez, amely egy másik helyen belül található. @hu
definition: Liittää paikan paikkaan, joka sijaitsee toisen paikan sisällä. @fi
definition: Met un lieu en relation avec un lieu qui est situé à l’intérieur d’un autre lieu. @fr
definition: Relaciona un lloc amb un lloc situat dins un altre lloc. @ca
definition: Relateert een plaats aan een plaats die gelegen is binnen een andere plaats. @nl
definition: Relaterer et sted til et sted som er lokalisert innenfor et annet sted. @no
definition: Relaterer et sted til et sted, som er lokaliseret inden for et andet sted. @da
definition: Relates a place to a place that is located within another place.
definition: Sasaista vietu ar vietu, kas atrodas citā vietā. @lv
definition: Seostab koha kohaga, mis paikneb teise koha sees. @et
definition: Setzt ein Geografikum in Beziehung zu einem Geografikum, das von einem anderen Geografikum umschlossen ist. @de
definition: يربط بين مكان ومكان يقع داخل مكان آخر. @ar
definition: 将一个地点与位于另一个地点内部的一个地点关联起来。 @zh-hans

is longitude and latitude of
has element type: 2
toolkit definition: A work that is a cartographic work that has an area of coverage that is identified using longitude of the westernmost and easternmost boundaries and latitude of the northernmost and southernmost boundaries.
toolkit definition: Een werk dat is een cartografisch werk dat een bestreken gebied heeft dat geïdentificeerd wordt met gebruikmaking van de lengtegraad van de meest westelijke en meest oostelijke grenzen en de breedtegraad van de meest noordelijke en meest zuidelijke grenzen. @nl
toolkit definition: Egy kartográfiai mű, amely egy terület elhelyezkedésének meghatározásához legnyugatibb és legkeletibb határainak hosszúsági, valamint a legészakibb és legdélibb határainak szélességi fokát használja. @hu
toolkit definition: Ein kartografisches Werk, dessen Abdeckungsbereich anhand des Längengrads der westlichsten und östlichsten Grenze sowie des Breitengrads der nördlichsten und südlichsten Grenze identifiziert wird. @de
toolkit definition: En batı ve en doğu sınırlarının boylamı ve en kuzey ve en güney sınırlarının enlemi kullanılarak tanımlanan bir kapsama alanına sahip kartografik çalışma olan bir eser. @tr
toolkit definition: Et verk som er kartografisk som lokaliserer et område ved bruk av lengdegrader for vestligste og østligste grense og breddegrader for nordligste og sørligste grense. @no
toolkit definition: Kartograafiline teos, mis hõlmab ala, mis on tuvastatud läänepoolseima ja idapoolseima piirjoone pikkuskraadi ning põhjapoolseima ja lõunapoolseima piirjoone laiuskraadi abil. @et
toolkit definition: Kartogrāfisks darbs un kurā norāda teritoriju, kurā atrodas izmantojot ģeogrāfiskā garuma tālākās rietumu un austrumu robežas un ģeogrāfiskā platuma tālākās ziemeļu un dienvidu robežas. @lv
toolkit definition: Obra que és una obra cartogràfica que té una àrea de cobertura que s’identifica usant la longitud dels límits oest i est i la latitud dels límits nord i sud. @ca
toolkit definition: Opera cartografica che localizza un'area usando la longitudine dei confini più occidentali e orientali e la latitudine dei confini più settentrionali e meridionali. @it
toolkit definition: Teos, joka on kartografinen teos, jonka kattama alue indentifioidaan käyttämällä läntisimmän ja itäisimmän rajan pituusastetta sekä pohjoisimman ja eteläisimmän rajan leveysastetta. @fi
toolkit definition: Værk, som er kartografisk, som lokaliserer et område ved brug af længdegrader for den vestligste og østligste grænse og breddegrader for den nordligste og sydligste grænse. @da
toolkit definition: Œuvre cartographique qui possède une zone de couverture identifiée à l’aide de la longitude des limites ouest et est et de la latitude des limites nord et sud. @fr
toolkit definition: عمل عبارة عن مادة خرائطية لها نطاق تغطية محدد باستخدام خط الطول لأقصى الحدود الغربية والشرقية وخط العرض لأقصى الحدود الشمالية والجنوبية. @ar
toolkit definition: 作为地图作品、有覆盖范围、用最西和最东边界的经度以及最北和最南边界的纬度标识的一种作品 @zh-hans
toolkit label: Längengrad und Breitengrad von @de
toolkit label: boylam ve enlem @tr
toolkit label: hosszúsági és szélességi foka: @hu
toolkit label: ir ģeogrāfiskais garums un platums @lv
toolkit label: lengdegrad og breddegrad for @no
toolkit label: lengtegraad en breedtegraad van @nl
toolkit label: longitud i latitud de @ca
toolkit label: longitude and latitude of
toolkit label: longitude et latitude de @fr
toolkit label: longitudine e latitudine di @it
toolkit label: længdegrad og breddegrad for @da
toolkit label: pikkuskraad ja laiuskraad teoses @et
toolkit label: pituus- ja leveysasteet teokselle @fi
toolkit label: خط الطول وخط العرض لـ @ar
toolkit label: ……的经度和纬度 @zh-hans
has subproperty: P70034
lexical alias: longitudeAndLatitudeOf.en
status: Published
type: Property
domain: C10009
label: enlemi ve boylamıdır @tr
label: er lengdegrad og breddegrad for @no
label: er længdegrad og breddegrad for @da
label: est une longitude et une latitude de @fr
label: hosszúsági és szélességi foka a következőnek: @hu
label: ir ģeogrāfiskais garums un platums @lv
label: is lengtegraad en breedtegraad van @nl
label: ist Längengrad und Breitengrad von @de
label: pikkuskraad ja laiuskraad teoses @et
label: pituus- ja leveysasteet teokselle @fi
label: è longitudine e latitudine di @it
label: és longitud i latitud de @ca
label: هو خط الطول وخط العرض لـ @ar
label: 是……的经度和纬度 @zh-hans
sub property of: is coordinates of cartographic content of
definition: Bir yeri, en batı ve en doğu sınırlarının boylamı ve en kuzey ve en güney sınırlarının enlemi kullanılarak tanımlanan bir kapsama alanına sahip kartografik bir çalışma olan bir eserle ilişkilendirir. @tr
definition: Correla un luogo a un'opera cartografica che localizza un'area usando la longitudine dei confini più occidentali e orientali e la latitudine dei confini più settentrionali e meridionali. @it
definition: Hozzákapcsol egy helyet egy kartográfiai műhöz, amely egy terület elhelyezkedésének meghatározásához legnyugatibb és legkeletibb határainak hosszúsági, valamint a legészakibb és legdélibb határainak szélességi fokát használja. @hu
definition: Liittää paikan teokseen, joka on kartografinen teos, jonka kattama alue indentifioidaan käyttämällä läntisimmän ja itäisimmän rajan pituusastetta sekä pohjoisimman ja eteläisimmän rajan leveysastetta. @fi
definition: Met un lieu en relation avec une œuvre cartographique qui possède une zone de couverture identifiée à l’aide de la longitude des limites ouest et est et de la latitude des limites nord et sud. @fr
definition: Relaciona un lloc amb una obra que és una obra cartogràfica que té una àrea de cobertura que s’identifica usant la longitud dels límits oest i est i la latitud dels límits nord i sud. @ca
definition: Relateert een plaats aan een werk dat is een cartografisch werk dat een bestreken gebied heeft dat geïdentificeerd wordt met gebruikmaking van de lengtegraad van de meest westelijke en meest oostelijke grenzen en de breedtegraad van de meest noordelijke en meest zuidelijke grenzen. @nl
definition: Relaterer et sted til et verk som er kartografisk som lokaliserer et område ved bruk av lengdegrader for vestligste og østligste grense og breddegrader for nordligste og sørligste grense. @no
definition: Relaterer et sted til et værk, som er kartografisk, som lokaliserer et område ved brug af længdegrader for den vestligste og østligste grænse og breddegrader for den nordligste og sydligste grænse. @da
definition: Relates a place to a work that is a cartographic work that has an area of coverage that is identified using longitude of the westernmost and easternmost boundaries and latitude of the northernmost and southernmost boundaries.
definition: Sasaista vietu ar darbu, kas ir kartogrāfisks darbs un kurā norāda teritoriju, kurā atrodas izmantojot ģeogrāfiskā garuma tālākās rietumu un austrumu robežas un ģeogrāfiskā platuma tālākās ziemeļu un dienvidu robežas. @lv
definition: Seostab koha kartograafilise teosega, mis hõlmab ala, mis on tuvastatud läänepoolseima ja idapoolseima piirjoone pikkuskraadi ning põhjapoolseima ja lõunapoolseima piirjoone laiuskraadi abil. @et
definition: Setzt ein Gebiet in Beziehung zu einem kartografischen Werk, dessen Abdeckungsbereich anhand des Längengrads der westlichsten und östlichsten Grenze sowie des Breitengrads der nördlichsten und südlichsten Grenze identifiziert wird. @de
definition: يربط بين مكان وعمل عبارة عن مادة خرائطية لها نطاق تغطية محدد باستخدام خط الطول لأقصى الحدود الغربية والشرقية وخط العرض لأقصى الحدود الشمالية والجنوبية. @ar
definition: 将一个地点与作为地图作品、有覆盖范围、用最西和最东边界的经度以及最北和最南边界的纬度标识的一种作品关联起来。 @zh-hans

is place of origin of work of
has element type: 2
toolkit definition: A work that originated in a place.
toolkit definition: Bir yerde ortaya çıkan bir eser. @tr
toolkit definition: Darbs, kas radīts vietā. @lv
toolkit definition: Een werk dat ontstaan is in een plaats. @nl
toolkit definition: Egy mű, amely arról a helyről származik. @hu
toolkit definition: Ein Werk, das in einem Geografikum entstanden ist. @de
toolkit definition: Et verk som har sitt opphav fra et sted. @no
toolkit definition: Obra que s’originà en un lloc. @ca
toolkit definition: Opera che ha avuto origine da un luogo. @it
toolkit definition: Teos, joka on saanut alkunsa paikassa. @fi
toolkit definition: Teos, mis pärineb sellest kohast. @et
toolkit definition: Værk, som stammer fra et sted. @da
toolkit definition: Œuvre qui est originaire d’un lieu. @fr
toolkit definition: عمل نشأ من مكان. @ar
toolkit definition: 起源于一个地点的一种作品 @zh-hans
toolkit label: Eserin menşei yeri @tr
toolkit label: Ursprungsort eines Werks von @de
toolkit label: alkuperään liittyvä paikka teokselle @fi
toolkit label: ir darba izcelsmes vieta @lv
toolkit label: lieu d’origine d’une œuvre de @fr
toolkit label: lloc d’origen d’una obra de @ca
toolkit label: luogo di origine dell'opera di @it
toolkit label: opprinnelsessted for verk for @no
toolkit label: oprindelsessted for værk af @da
toolkit label: plaats van herkomst van werk van @nl
toolkit label: place of origin of work of
toolkit label: származási helye a következő műnek: @hu
toolkit label: teose päritoluga seotud koht teoses @et
toolkit label: مكان لمنشأ عمل لـ @ar
toolkit label: ……的作品的原地点 @zh-hans
has subproperty: P70035
lexical alias: placeOfOriginOfWorkOf.en
status: Published
type: Property
domain: C10009
label: alkuperään liittyvä paikka teokselle @fi
label: er opprinnelsessted for verk for @no
label: er oprindelsessted for værk af @da
label: eserinin menşei yeridir @tr
label: est un lieu d’origine d’une œuvre de @fr
label: ir darba izcelsmes vieta @lv
label: is plaats van herkomst van werk van @nl
label: ist Ursprungsort eines Werks von @de
label: származási helye a következő műnek: @hu
label: teose päritoluga seotud koht teoses @et
label: è luogo di origine dell'opera di @it
label: és lloc d’origen d’una obra de @ca
label: هو مكان لمنشأ عمل لـ @ar
label: 是……的作品的原地点 @zh-hans
sub property of: has related work of place
definition: Bir yeri, bir yerde ortaya çıkan bir eserle ilişkilendirir. @tr
definition: Correla un luogo a un'opera che ha avuto origine da un luogo. @it
definition: Hozzákapcsol egy helyet egy műhöz, amely arról a helyről származik. @hu
definition: Liittää paikan teokseen, joka on saanut alkunsa paikassa. @fi
definition: Met un lieu en relation avec une œuvre qui est originaire d’un lieu. @fr
definition: Relaciona un lloc amb una obra que s’originà en un lloc. @ca
definition: Relateert een plaats aan een werk dat ontstaan is in een plaats. @nl
definition: Relaterer et sted til et verk som har sitt opphav fra et sted. @no
definition: Relaterer et sted til et værk, som stammer fra et sted. @da
definition: Relates a place to a work that originated in a place.
definition: Sasaista vietu ar darbu, kas radīts vietā. @lv
definition: Seostab koha teosega, mis pärineb sellest kohast. @et
definition: Setzt ein Geografikum in Beziehung zu einem Werk, das in einem Geografikum entstanden ist. @de
definition: يربط بين مكان وعمل نشأ من مكان. @ar
definition: 将一个地点与起源于一个地点的一种作品关联起来。 @zh-hans

is right ascension and declination of
has element type: 2
toolkit definition: A work that is a cartographic work that locates a celestial body that is the coverage of the work and is identified using the angles of right ascension and declination.
toolkit definition: Bir gök cisminin konumunu belirleyen ve kapsamı bu gök cismi olan, dik yükselme ve sapma açıları kullanılarak tanımlanan kartografik çalışma olan bir eser. @tr
toolkit definition: Een werk dat is een cartografisch werk dat een hemellichaam lokaliseert dat de dekking van het werk is en is geïdentificeerd met gebruikmaking van de hoeken van rechte klimming en declinatie. @nl
toolkit definition: Egy kartográfiai mű, amely rektaszcenzió és deklináció szögei segítségével határozza meg az égitestek helyzetét az égbolton. @hu
toolkit definition: Ein kartografisches Werk, das einen Himmelskörpers verortet, der Gegenstand des Werks ist und anhand der Winkel der Rektaszension und der Deklination identifiziert wird. @de
toolkit definition: Et verk som er kartografisk som lokaliserer et himmellegeme ved hjelp av vinklene for rektascensjon og deklinasjon. @no
toolkit definition: Kartograafiline teos, mis hõlmab taevakeha, mille asukoht on tuvastatud, kasutades otsetõusu ja käände nurgamõõte. @et
toolkit definition: Kartogrāfisks darbs, kas nosaka objekta vietu debesīs, izmantojot rektascensijas un deklinācijas leņķus. @lv
toolkit definition: Obra que és una obra cartogràfica que localitza un cos celeste que és la cobertura de l’obra i s’identifica usant els angles d’ascensió recta i de declinació. @ca
toolkit definition: Opera cartografica che localizza un oggetto celeste nel cielo usando gli angoli di ascensione retta e declinazione. @it
toolkit definition: Teos, joka on kartografinen teos, joka määrittää taivaankappaleen sijainnin ja teoksen sisällöllisen kattavuuden käyttämällä rektaskension ja deklinaation kulmamittoja. @fi
toolkit definition: Værk, som er kartografisk, som lokaliserer et himmellegeme ved hjælp af vinklene for rektascension og deklination. @da
toolkit definition: Œuvre cartographique qui situe un corps céleste constituant la couverture de l'œuvre et identifié à l’aide des angles d’ascension droite et de déclinaison. @fr
toolkit definition: عمل عبارة عن مادة خرائطية تحدد موقع جسم سماوي عبارة عن تغطية لعمل ومحدد باستخدام زوايا الصعود المستقيم والانحراف. @ar
toolkit definition: 作为地图作品、定位作为作品覆盖范围并用赤经和赤纬的角度标识的天体的一种作品 @zh-hans
toolkit label: Rektaszension und Deklination von @de
toolkit label: ascension droite et déclinaison de @fr
toolkit label: ascensione retta e declinazione di @it
toolkit label: ascensió recta i declinació de @ca
toolkit label: ir rektascensija un deklinācija @lv
toolkit label: otsetõus ja kääne teoses @et
toolkit label: rechte klimming en declinatie van @nl
toolkit label: rektascension og deklination for @da
toolkit label: rektascensjon og deklinasjon for @no
toolkit label: rektaskensio ja deklinaatio teokselle @fi
toolkit label: rektaszcenziója és deklinációja: @hu
toolkit label: right ascension and declination of
toolkit label: yükseliş ve sapma @tr
toolkit label: صعود مستقيم وانحراف لـ @ar
toolkit label: ……的赤经和赤纬 @zh-hans
has subproperty: P70036
lexical alias: rightAscensionAndDeclinationOf.en
status: Published
type: Property
domain: C10009
label: Rektaszension und Deklination von @de
label: er rektascension og deklination for @da
label: er rektascensjon og deklinasjon for @no
label: est une ascension droite et une déclinaison de @fr
label: ir rektascensija un deklinācija @lv
label: is rechte klimming en declinatie van @nl
label: otsetõus ja kääne teoses @et
label: rektaskensio ja deklinaatio teokselle @fi
label: rektaszcenziója és deklinációja a következőnek: @hu
label: yükseliş ve düşüş @tr
label: è ascensione retta e declinazione di @it
label: és ascensió recta i declinació de @ca
label: هو صعود مستقيم وانحراف لـ @ar
label: 是……的赤经和赤纬 @zh-hans
sub property of: is coordinates of cartographic content of
definition: Bir yeri, işin kapsamı olan bir gök cisminin yerini tespit eden ve sağa yükselme ve sapma açıları kullanılarak tanımlanan kartografik bir eser olan bir eserle ilişkilendirir. @tr
definition: Correla un luogo a un'opera cartografica che localizza un oggetto celeste nel cielo usando gli angoli di ascensione retta e declinazione. @it
definition: Hozzákapcsol egy helyet egy kartográfiai műhöz, amely rektaszcenzió és deklináció szögei segítségével határozza meg az égitestek helyzetét az égbolton. @hu
definition: Liittää paikan teokseen, joka on kartografinen teos, joka määrittää taivaankappaleen sijainnin ja teoksen sisällöllisen kattavuuden käyttämällä rektaskension ja deklinaation kulmamittoja. @fi
definition: Met un lieu en relation avec une œuvre cartographique qui situe un corps céleste constituant la couverture de l'œuvre et identifié à l’aide des angles d’ascension droite et de déclinaison. @fr
definition: Relaciona un lloc amb una obra que és una obra cartogràfica que localitza un cos celeste que és la cobertura de l’obra i s’identifica usant els angles d’ascensió recta i de declinació. @ca
definition: Relateert een plaats aan een werk dat is een cartografisch werk dat een hemellichaam lokaliseert dat de dekking van het werk is en is geïdentificeerd met gebruikmaking van de hoeken van rechte klimming en declinatie. @nl
definition: Relaterer et sted til et verk som er kartografisk som lokaliserer et himmellegeme ved hjelp av vinklene for rektascensjon og deklinasjon. @no
definition: Relaterer et sted til et værk, som er kartografisk, som lokaliserer et himmellegeme ved hjælp af vinklene for rektascension og deklination. @da
definition: Relates a place to a work that is a cartographic work that locates a celestial body that is the coverage of the work and is identified using the angles of right ascension and declination.
definition: Sasaista vietu ar darbu, kas ir kartogrāfisks darbs, kas nosaka objekta vietu debesīs, izmantojot rektascensijas un deklinācijas leņķus. @lv
definition: Seostab koha kartograafilise teosega, mis hõlmab taevakeha, mille asukoht on tuvastatud, kasutades otsetõusu ja käände nurgamõõte. @et
definition: Setzt einen Ort in Beziehung zu einem kartografischen Werk, das einen Himmelskörpers verortet, der Gegenstand des Werks ist und anhand der Winkel der Rektaszension und der Deklination identifiziert wird. @de
definition: يربط بين مكان وعمل عبارة عن مادة خرائطية تحدد موقع جسم سماوي عبارة عن تغطية لعمل ومحدد باستخدام زوايا الصعود المستقيم والانحراف. @ar
definition: 将一个地点与作为地图作品、定位作为作品覆盖范围并用赤经和赤纬的角度标识的天体的一种作品关联起来。 @zh-hans

is strings of coordinate pairs of
has element type: 2
toolkit definition: A work that is a cartographic work that has an area of coverage that is identified by a polygon using coordinates for each vertex.
toolkit definition: Een werk dat is een cartografisch werk dat een bestreken gebied heeft dat geïdentificeerd is door een polygoon met gebruikmaking van coördinaten voor elk toppunt. @nl
toolkit definition: Egy kartográfiai mű, amely egy pontos terület azonosításához a poligon csúcsainak koordinátáit használja. @hu
toolkit definition: Ein kartografisches Werk, dessen Abdeckungsbereich durch ein Vieleck mit Koordinaten für jeden Eckpunkt identifiziert wird. @de
toolkit definition: Et verk som er kartografisk lokaliserer et presist område ved hjelp av koordinater for hvert hjørne av et polygon. @no
toolkit definition: Her köşe için koordinatlar kullanılarak bir çokgen tarafından tanımlanan bir kapsama alanına sahip kartografik çalışma olan bir eser. @tr
toolkit definition: Kartograafiline teos, mis hõlmab ala, mis on tuvastatud, kasutades hulknurga iga tipu koordinaate. @et
toolkit definition: Kartogrāfisks darbs, kas nosaka precīzu teritoriju, izmantojot katras daudzstūra virsotnes koordinātas. @lv
toolkit definition: Obra que és una obra cartogràfica que té una àrea de cobertura que s’identifica per un polígon mitjançant les coordenades de cada vèrtex. @ca
toolkit definition: Opera cartografica che localizza un'area precisa usando le coordinate per ciascun vertice di un poligono. @it
toolkit definition: Teos, joka on kartografinen teos, jonka kattama alue identifioidaan polygonein käyttämällä monikulmion jokaisen kärjen koordinaatteja. @fi
toolkit definition: Værk, som er kartografisk, som lokaliserer et præcist område ved hjælp af koordinater for hvert hjørne af et polygon. @da
toolkit definition: Œuvre cartographique qui possède une zone de couverture identifiée par un polygone à l’aide des coordonnées de chaque sommet. @fr
toolkit definition: عمل عبارة عن مادة خرائطية لها نطاق تغطية يحدد بدقة من خلال مضلع باستخدام إحداثيات لكل قمة مضلع. @ar
toolkit definition: 作为地图作品、有通过使用每个角的坐标表示的多边形标识的覆盖范围的一种作品 @zh-hans
toolkit label: Reihen von Koordinatenpaaren von @de
toolkit label: cadenes de parells de coordenades de @ca
toolkit label: chaînes de paires de coordonnées de @fr
toolkit label: ir koordinātu pāru virknes @lv
toolkit label: koordinaatide paaride rida teoses @et
toolkit label: koordinaattiparit teoksella @fi
toolkit label: koordinat çiftleri dizgesi @tr
toolkit label: koordinátapár-láncai: @hu
toolkit label: strenge med koordinatpar for @da
toolkit label: stringhe di coppie di coordinate @it
toolkit label: strings of coordinate pairs of
toolkit label: tekenreeksen van coördinatenparen van @nl
toolkit label: خطوط إحداثيات مزدوجة لـ @ar
toolkit label: ……的坐标对串 @zh-hans
has subproperty: P70037
lexical alias: stringsOfCoordinatePairsOf.en
status: Published
type: Property
domain: C10009
label: er strenge med koordinatpar for @da
label: er strenger med koordinatpar for @no
label: est une chaînes de paires de coordonnées de @fr
label: ir koordinātu pāru virknes @lv
label: is tekenreeksen van coördinatenparen van @nl
label: koordinaatide paaride rida teoses @et
label: koordinaattiparit teoksella @fi
label: koordinat çiftlerinin dizileridir @tr
label: koordinátapár-láncai a következőnek: @hu
label: sind Reihen von Koordinatenpaaren von @de
label: è stringhe di coppie di coordinate @it
label: és cadenes de parells de coordenades de @ca
label: هو خطوط إحداثيات مزدوجة لـ @ar
label: 是……的坐标对串 @zh-hans
sub property of: is coordinates of cartographic content of
definition: Bir yeri, her tepe noktası için koordinatlar kullanan bir çokgen tarafından tanımlanan bir kapsama alanına sahip kartografik bir çalışma olan bir eserle ilişkilendirir. @tr
definition: Correla un luogo a un'opera cartografica che localizza un'area precisa usando le coordinate per ciascun vertice di un poligono. @it
definition: Hozzákapcsol egy helyet egy kartográfiai műhöz, amely egy pontos terület azonosításához a poligon csúcsainak koordinátáit használja. @hu
definition: Liittää paikan teokseen, joka on kartografinen teos, jonka kattama alue identifioidaan polygonein käyttämällä monikulmion jokaisen kärjen koordinaatteja. @fi
definition: Met un lieu en relation avec une œuvre cartographique qui possède une zone de couverture identifiée par un polygone à l’aide des coordonnées de chaque sommet. @fr
definition: Relaciona un lloc amb una obra que és una obra cartogràfica que té una àrea de cobertura que s’identifica per un polígon mitjançant les coordenades de cada vèrtex. @ca
definition: Relateert een plaats aan een werk dat is een cartografisch werk dat een bestreken gebied heeft dat geïdentificeerd is door een polygoon met gebruikmaking van coördinaten voor elk toppunt. @nl
definition: Relaterer et sted til et verk som er kartografisk lokaliserer et presist område ved hjelp av koordinater for hvert hjørne av et polygon. @no
definition: Relaterer et sted til et værk, som er kartografisk, som lokaliserer et præcist område ved hjælp af koordinater for hvert hjørne af et polygon. @da
definition: Relates a place to a work that is a cartographic work that has an area of coverage that is identified by a polygon using coordinates for each vertex.
definition: Sasaista vietu ar darbu, kas ir kartogrāfisks darbs, kas nosaka precīzu teritoriju, izmantojot katras daudzstūra virsotnes koordinātas. @lv
definition: Seostab koha kartograafilise teosega, mis hõlmab ala, mis on tuvastatud, kasutades hulknurga iga tipu koordinaate. @et
definition: Setzt ein Gebiet in Beziehung zu einem kartografischen Werk, dessen Abdeckungsbereich durch ein Vieleck mit Koordinaten für jeden Eckpunkt identifiziert wird. @de
definition: يربط بين مكان وعمل عبارة عن مادة خرائطية لها نطاق تغطية يحدد بدقة من خلال مضلع باستخدام إحداثيات لكل قمة مضلع. @ar
definition: 将一个地点与作为地图作品、有通过使用每个角的坐标表示的多边形标识的覆盖范围的一种作品关联起来。 @zh-hans

is place of capture of
has element type: 2
toolkit definition: An expression that has content that is recorded, filmed, etc., in a place.
toolkit definition: Bir yerde kaydedilmiş, filme alınmış vb. içeriğe sahip bir anlatım. @tr
toolkit definition: Een expressie die content heeft die is opgenomen, gefilmd etc. in een plaats. @nl
toolkit definition: Egy kifejezési forma, amelynek tartalmát egy bizonyos helyen rögzítették, filmezték stb. @hu
toolkit definition: Eine Expression, deren Inhalt an einem Ort aufgenommen, gefilmt und so weiter wird. @de
toolkit definition: Ekspressio, jonka sisältö on äänitetty, kuvauttu tms. paikassa. @fi
toolkit definition: Espressione che ha il contenuto che è stato registrato, filmato, etc. in un luogo. @it
toolkit definition: Et uttrykk som har innhold som er tatt opp, filmet etc. på et sted. @no
toolkit definition: Expression qui possède un contenu qui est enregistré, filmé, etc. dans un lieu. @fr
toolkit definition: Expressió que té contingut que s’enregistra, filma, etc. en un lloc. @ca
toolkit definition: Izteiksme, kam ir satura ierakstīšanas, filmēšanas vieta. @lv
toolkit definition: Udtryk, som har indhold, som er indspillet, filmet, etc. et sted. @da
toolkit definition: Väljendus, mille sisu on salvestatud, filmitud vms selles kohas. @et
toolkit definition: تعبيرة لها محتوى مسجل، أو مصور، إلخ في مكان. @ar
toolkit definition: 有在一个地点录制、摄影等的内容的一种内容表达 @zh-hans
toolkit label: Aufzeichnungsort von @de
toolkit label: innspillingssted for @no
toolkit label: ir tveršanas vieta @lv
toolkit label: jäädvustamiskoht väljenduses @et
toolkit label: lieu de captation de @fr
toolkit label: lloc de captura de @ca
toolkit label: luogo di cattura @it
toolkit label: plaats van vastleggen van @nl
toolkit label: place of capture of
toolkit label: rögzítési helye: @hu
toolkit label: sted for indspilning af @da
toolkit label: tallennuspaikka teokselle @fi
toolkit label: çekim yapılan yer @tr
toolkit label: مكان التقاط لـ @ar
toolkit label: ……的摄录的地点 @zh-hans
has subproperty: P70038
lexical alias: placeOfCaptureOf.en
status: Published
type: Property
domain: C10009
label: er innspillingssted for @no
label: er sted for indspilning af @da
label: est un lieu de captation de @fr
label: ir tveršanas vieta @lv
label: is plaats van vastleggen van @nl
label: ist Aufzeichnungsort von @de
label: jäädvustamiskoht väljenduses @et
label: kayıt yeridir @tr
label: rögzítési helye a következőnek: @hu
label: tallennuspaikka teokselle @fi
label: è luogo di cattura @it
label: és lloc de captura de @ca
label: هو مكان التقاط لـ @ar
label: 是……的摄录的地点 @zh-hans
sub property of: has related expression of place
definition: Bir yeri, bir yerde kaydedilmiş, filme alınmış vb. içeriğe sahip bir anlatımla ilişkilendirir. @tr
definition: Correla un luogo a un'espressione che ha il contenuto che è stato registrato, filmato, etc. in un luogo. @it
definition: Hozzákapcsol egy helyet egy kifejezési formához, amelynek tartalmát egy bizonyos helyen rögzítették, filmezték stb. @hu
definition: Liittää paikan ekspressioon, jonka sisältö on äänitetty, kuvauttu tms. paikassa. @fi
definition: Met un lieu en relation avec une expression qui possède un contenu qui est enregistré, filmé, etc. dans un lieu. @fr
definition: Relaciona un lloc amb una expressió que té contingut que s’enregistra, filma, etc. en un lloc. @ca
definition: Relateert een plaats aan een expressie die content heeft die is opgenomen, gefilmd etc. in een plaats. @nl
definition: Relaterer et sted til et udtryk, som har indhold, som er indspillet, filmet, etc. et sted. @da
definition: Relaterer et sted til et uttrykk som har innhold som er tatt opp, filmet etc. på et sted. @no
definition: Relates a place to an expression that has content that is recorded, filmed, etc., in a place.
definition: Sasaista vietu ar izteiksmi, kam ir satura ierakstīšanas, filmēšanas vieta. @lv
definition: Seostab koha väljendusega, mille sisu on salvestatud, filmitud vms selles kohas. @et
definition: Setzt ein Geografikum in Beziehung zu einer Expression, deren Inhalt an einem Ort aufgenommen, gefilmt und so weiter wird. @de
definition: يربط بين مكان وتعبيرة لها محتوى مسجل، أو مصور، إلخ في مكان. @ar
definition: 将一个地点与有在一个地点录制、摄影等的内容的一种内容表达关联起来。 @zh-hans

is place of distribution of
has element type: 2
toolkit definition: A manifestation that is a published manifestation that is distributed from a place.
toolkit definition: Avaldatud kehastus, mida sellest kohast levitatakse. @et
toolkit definition: Bir yerden dağıtılan yayınlanmış bir gösterim olan bir gösterim. @tr
toolkit definition: Een manifestatie die een gepubliceerde manifestatie is die gedistribueerd is vanuit een plaats. @nl
toolkit definition: Egy kiadott megjelenési formához, amelyet egy bizonyos helyen terjesztenek. @hu
toolkit definition: Eine veröffentlichte Manifestation, die an einem Ort vertrieben wird. @de
toolkit definition: En manifestasjon som er en publisert manifestasjon som er distribuert fra et sted. @no
toolkit definition: Julkaistu manifestaatio, jota jaellaan paikasta käsin. @fi
toolkit definition: Manifestació que és una manifestació publicada que es distribueix des d’un lloc. @ca
toolkit definition: Manifestation publiée qui est diffusée ou distribuée à partir d’un lieu. @fr
toolkit definition: Manifestation, som er en publiceret manifestation, som er distribueret fra et sted. @da
toolkit definition: Manifestazione pubblicata che è distribuita da un luogo. @it
toolkit definition: Manifestācija, kas ir publicēta manifestācija, kas ir izplatīta no norādītās paralēlās vietas. @lv
toolkit definition: تجسيدة منشورة وُزعت من مكان. @ar
toolkit definition: 作为一种出版载体表现从一个地点发行的一种载体表现 @zh-hans
toolkit label: Vertriebsort von @de
toolkit label: dağıtım yeri @tr
toolkit label: distribusjonssted for @no
toolkit label: ir paralēlā izplatīšanas vieta @lv
toolkit label: jakelupaikka manifestaatiolle @fi
toolkit label: levitamiskoht kehastuses @et
toolkit label: lieu de diffusion ou de distribution de @fr
toolkit label: lloc de distribució de @ca
toolkit label: luogo di distribuzione di @it
toolkit label: plaats van distributie van @nl
toolkit label: place of distribution of
toolkit label: sted for distribution af @da
toolkit label: terjesztési helye: @hu
toolkit label: مكان توزيع لـ @ar
toolkit label: ……的发行的地点 @zh-hans
has subproperty: is parallel place of distribution of
has subproperty: P70039
lexical alias: placeOfDistributionOf.en
status: Published
type: Property
domain: C10009
label: dağıtım yeridir @tr
label: er distribusjonssted for @no
label: er sted for distribution af @da
label: est un lieu de diffusion ou de distribution de @fr
label: ir paralēlā izplatīšanas vieta @lv
label: is plaats van distributie van @nl
label: ist Vertriebsort von @de
label: jakelupaikka manifestaatiolle @fi
label: levitamiskoht kehastuses @et
label: terjesztési helye a következőnek: @hu
label: è luogo di distribuzione di @it
label: és lloc de distribució de @ca
label: هو مكان توزيع لـ @ar
label: 是……的发行的地点 @zh-hans
sub property of: is place of manifestation of
definition: Bir yeri, bir yerden dağıtılan yayınlanmış bir gösterim olan bir gösterim ile ilişkilendirir. @tr
definition: Correla un luogo a una manifestazione pubblicata che è distribuita da un luogo. @it
definition: Hozzákapcsol egy helyet egy kiadott megjelenési formához, amelyet egy bizonyos helyen terjesztenek. @hu
definition: Liittää paikan julkaistuun manifestaatioon, jota jaellaan paikasta käsin. @fi
definition: Met un lieu en relation avec une manifestation publiée qui est diffusée ou distribuée à partir d’un lieu. @fr
definition: Relaciona un lloc amb una manifestació que és una manifestació publicada que es distribueix des d’un lloc. @ca
definition: Relateert een plaats aan een manifestatie die een gepubliceerde manifestatie is die gedistribueerd is vanuit een plaats. @nl
definition: Relaterer et sted til en manifestasjon som er en publisert manifestasjon som er distribuert fra et sted. @no
definition: Relaterer et sted til en manifestation, som er en publiceret manifestation, som er distribueret fra et sted. @da
definition: Relates a place to a manifestation that is a published manifestation that is distributed from a place.
definition: Sasaista vietu ar manifestāciju, kas ir publicēta manifestācija, kas ir izplatīta no norādītās paralēlās vietas. @lv
definition: Seostab koha avaldatud kehastusega, mida sellest kohast levitatakse. @et
definition: Setzt ein Geografikum in Beziehung zu einer veröffentlichten Manifestation, die an einem Ort vertrieben wird. @de
definition: يربط بين مكان وتجسيدة منشورة وُزعت من مكان. @ar
definition: 将一个地点与作为一种出版载体表现从一个地点发行的一种载体表现关联起来。 @zh-hans

is place of manufacture of
has element type: 2
toolkit definition: A manifestation that is a published manifestation that is printed, duplicated, cast, etc., in a place.
toolkit definition: Avaldatud kehastus, mis on selles kohas trükitud, paljundatud, valatud vms. @et
toolkit definition: Bir yerde basılan çoğaltılan biçim verilmiş vb. yayınlanmış bir gösterim olan bir gösterim. @tr
toolkit definition: Een manifestatie die een gepubliceerde manifestatie is die is gedrukt, gedupliceerd, gegoten etc. in een plaats. @nl
toolkit definition: Egy kiadott megjelenési forma, amelyet egy bizonyos helyen nyomtattak, sokszoroztak, öntöttek stb. @hu
toolkit definition: Eine veröffentlichte Manifestation, die an einem Ort gedruckt, vervielfältigt, gegossen und so weiter wird. @de
toolkit definition: En manifestasjon som er en publisert manifestasjon som er trykt, mangfoldiggjort, støpt etc. på et sted. @no
toolkit definition: Julkaistu manifestaatio, joka on painettu, monistettu, valettu kirjainten osalta tms. paikassa. @fi
toolkit definition: Manifestació que és una manifestació publicada que s’imprimeix, es reprodueix, es modela, etc., en un lloc. @ca
toolkit definition: Manifestation publiée qui est imprimée, reproduite, moulée, etc. dans un lieu. @fr
toolkit definition: Manifestation, som er en publiceret manifestation, som er trykt, duplikeret, støbt ect. et sted. @da
toolkit definition: Manifestazione pubblicata che è stampata, duplicata, lanciata, etc. in un luogo. @it
toolkit definition: Manifestācija, kas ir publicēta manifestācija, kas ir iespiesta, pavairota, iesieta norādītā vietā. @lv
toolkit definition: تجسيدة منشورة طُبعت، ونُسخت، وبُثت، إلخ، في مكان. @ar
toolkit definition: 作为一种出版载体表现在一个地点印刷、复制、铸造等的一种载体表现 @zh-hans
toolkit label: Herstellungsort von @de
toolkit label: framstillingssted for @no
toolkit label: gyártási helye: @hu
toolkit label: ir ražošanas vieta @lv
toolkit label: lieu de fabrication de @fr
toolkit label: lloc de fabricació de @ca
toolkit label: luogo di manifattura di @it
toolkit label: plaats van vervaardiging van @nl
toolkit label: place of manufacture of
toolkit label: sted for fremstilling af @da
toolkit label: valmistamiskoht kehastuses @et
toolkit label: valmistuspaikka manifestaatiolle @fi
toolkit label: Üretim yeri @tr
toolkit label: مكان تصنيع لـ @ar
toolkit label: ……的生产的地点 @zh-hans
has subproperty: is parallel place of manufacture of
has subproperty: P70040
lexical alias: placeOfManufactureOf.en
status: Published
type: Property
domain: C10009
label: er framstillingssted for @no
label: er sted for fremstilling af @da
label: est un lieu de fabrication de @fr
label: gyártási helye a következőnek: @hu
label: ir ražošanas vieta @lv
label: is plaats van vervaardiging van @nl
label: ist Herstellungsort von @de
label: valmistamiskoht kehastuses @et
label: valmistuspaikka manifestaatiolle @fi
label: è luogo di manifattura di @it
label: és lloc de fabricació de @ca
label: üretim yeridir @tr
label: مكان تصنيع موازي لـ @ar
label: 是……的生产的地点 @zh-hans
sub property of: is place of manifestation of
definition: Bir yeri, bir yerde basılmış, çoğaltılmış, biçim verilmiş vb. yayınlanmış bir gösterim olan bir gösterim ile ilişkilendirir. @tr
definition: Correla un luogo a una manifestazione pubblicata che è stampata, duplicata, lanciata, etc. in un luogo. @it
definition: Hozzákapcsol egy helyet egy kiadott megjelenési formához, amelyet egy bizonyos helyen nyomtattak, sokszoroztak, öntöttek stb. @hu
definition: Liittää paikan julkaistuun manifestaatioon, joka on painettu, monistettu, valettu kirjainten osalta tms. paikassa. @fi
definition: Met un lieu en relation avec une manifestation publiée qui est imprimée, reproduite, moulée, etc. dans un lieu. @fr
definition: Relaciona un lloc amb una manifestació que és una manifestació publicada que s’imprimeix, es reprodueix, es modela, etc., en un lloc. @ca
definition: Relateert een plaats aan een manifestatie die een gepubliceerde manifestatie is die is gedrukt, gedupliceerd, gegoten etc. in een plaats. @nl
definition: Relaterer et sted til en manifestasjon som er en publisert manifestasjon som er trykt, mangfoldiggjort, støpt etc. på et sted. @no
definition: Relaterer et sted til en manifestation, som er en publiceret manifestation, som er trykt, duplikeret, støbt ect. et sted. @da
definition: Relates a place to a manifestation that is a published manifestation that is printed, duplicated, cast, etc., in a place.
definition: Sasaista vietu ar manifestāciju, kas ir publicēta manifestācija, kas ir iespiesta, pavairota, iesieta norādītā vietā. @lv
definition: Seostab koha avaldatud kehastusega, mis on selles kohas trükitud, paljundatud, valatud vms. @et
definition: Setzt ein Geografikum in Beziehung zu einer veröffentlichten Manifestation, die an einem Ort gedruckt, vervielfältigt, gegossen und so weiter wird. @de
definition: يربط بين مكان وتجسيدة منشورة طُبعت، ونُسخت، وبُثت، إلخ، في مكان. @ar
definition: 将一个地点与作为一种出版载体表现在一个地点印刷、复制、铸造等的一种载体表现关联起来。 @zh-hans

is place of production of
has element type: 2
toolkit definition: A manifestation that is an unpublished manifestation that is inscribed, fabricated, constructed, etc., in a place.
toolkit definition: Avaldamata kehastus, mis on selles kohas inskribeeritud, toodetud, ehitatud vms. @et
toolkit definition: Bir yerde yazılan, üretilen, yapılandırılan, vb. yayınlanmamış bir gösterim olan bir gösterim. @tr
toolkit definition: Een manifestatie die een ongepubliceerde manifestatie is die is afgeschreven, gefabriceerd, geconstrueerd etc. in een plaats. @nl
toolkit definition: Egy kiadatlan megjelenési forma, amelyet egy bizonyos helyen írnak, készítenek, szerkesztenek stb. @hu
toolkit definition: Eine unveröffentlichte Manifestation, die an einem Ort beschriftet, fabriziert, konstruiert und so weiter wird. @de
toolkit definition: En manifestasjon som er en upublisert manifestasjon som er inskribert, fabrikert, konstruert etc. på et sted. @no
toolkit definition: Julkaisematon manifestaatio, joka on kaiverrettu, valmistettu, koottu tms. paikassa. @fi
toolkit definition: Manifestació que és una manifestació no publicada que s’inscriu, es fabrica, es construeix, etc., en un lloc. @ca
toolkit definition: Manifestation non publiée qui est écrite à la main, fabriquée, construite, etc. dans un lieu. @fr
toolkit definition: Manifestation, som er en upubliceret manifestation, som er indskrevet, fremstillet, konstrueret ect. et sted. @da
toolkit definition: Manifestazione non pubblicata che è incisa, fabbricata, costruita, etc. in un luogo. @it
toolkit definition: Manifestācija, kas ir publicēta manifestācija, kas ir uzrakstīta, izgatavota, radīta u.tml. norādītā vietā. @lv
toolkit definition: تجسيدة غير منشورة دُونت، ووُضعت، وأُنشئت، إلخ، في مكان. @ar
toolkit definition: 作为一种非出版载体表现在一个地点镌刻、制造、构建等的一种载体表现 @zh-hans
toolkit label: Entstehungsort von @de
toolkit label: előállítási helye: @hu
toolkit label: ir izgatavošanas vieta @lv
toolkit label: lieu de production de @fr
toolkit label: lloc de producció de @ca
toolkit label: luogo di produzione di @it
toolkit label: plaats van productie van @nl
toolkit label: place of production of
toolkit label: produksjonssted for @no
toolkit label: sted for produktion af @da
toolkit label: tootmiskoht kehastuses @et
toolkit label: tuotantopaikka manifestaatiolle @fi
toolkit label: üretim yeri @tr
toolkit label: مكان إنتاج لـ @ar
toolkit label: 作为一种出版载体表现在一个地点印刷、复制、铸造等的一种载体表现 @zh-hans
has subproperty: is parallel place of production of
has subproperty: P70041
lexical alias: placeOfProductionOf.en
status: Published
type: Property
domain: C10009
label: előállítási helye a következőnek: @hu
label: er produksjonssted for @no
label: er sted for produktion af @da
label: est un lieu de production de @fr
label: ir izgatavošanas vieta @lv
label: is plaats van productie van @nl
label: ist Entstehungsort von @de
label: tootmiskoht kehastuses @et
label: tuotantopaikka manifestaatiolle @fi
label: yapım yeridir @tr
label: è luogo di produzione di @it
label: és lloc de producció de @ca
label: هو مكان إنتاج لـ @ar
label: 是……的制作的地点 @zh-hans
sub property of: is place of manifestation of
definition: Bir yeri, bir yere kaydedilen, üretilen, düzenlenen vb. yayınlanmamış bir gösterim olan bir gösterim ile ilişkilendirir. @tr
definition: Correla un luogo a una manifestazione non pubblicata che è incisa, fabbricata, costruita, etc. in un luogo. @it
definition: Hozzákapcsol egy helyet egy kiadatlan megjelenési formához, amelyet egy bizonyos helyen írnak, készítenek, szerkesztenek stb. @hu
definition: Liittää paikan julkaisemattomaan manifestaatioon, joka on kaiverrettu, valmistettu, koottu tms. paikassa. @fi
definition: Met un lieu en relation avec une manifestation non publiée qui est écrite à la main, fabriquée, construite, etc. dans un lieu. @fr
definition: Relaciona un lloc amb una manifestació que és una manifestació no publicada que s’inscriu, es fabrica, es construeix, etc., en un lloc. @ca
definition: Relateert een plaats aan een manifestatie die een ongepubliceerde manifestatie is die is afgeschreven, gefabriceerd, geconstrueerd etc. in een plaats. @nl
definition: Relaterer et sted til en manifestasjon som er en upublisert manifestasjon som er inskribert, fabrikert, konstruert etc. på et sted. @no
definition: Relaterer et sted til en manifestation, som er en upubliceret manifestation, som er indskrevet, fremstillet, konstrueret ect. et sted. @da
definition: Relates a place to a manifestation that is an unpublished manifestation that is inscribed, fabricated, constructed, etc., in a place.
definition: Sasaista vietu ar manifestāciju, kas ir publicēta manifestācija, kas ir uzrakstīta, izgatavota, radīta u.tml. norādītā vietā. @lv
definition: Seostab koha avaldamata kehastusega, mis on selles kohas inskribeeritud, toodetud, ehitatud vms. @et
definition: Setzt ein Geografikum in Beziehung zu einer unveröffentlichten Manifestation, die an einem Ort beschriftet, fabriziert, konstruiert und so weiter wird. @de
definition: يربط بين مكان وتجسيدة غير منشورة دُونت، ووُضعت، وأُنشئت، إلخ، في مكان. @ar
definition: 将一个地点与作为一种非出版载体表现在一个地点镌刻、制造、构建等的一种载体表现关联起来。 @zh-hans

is place of publication of
has element type: 2
toolkit definition: A manifestation that is a published manifestation that is published, released, or issued in a place.
toolkit definition: Avaldatud kehastus, mis on selles kohas avaldatud, välja lastud või välja antud. @et
toolkit definition: Bir yerde yayınlanan, piyasaya sürülen vb. yayınlanmış bir gösterim olan bir gösterim. @tr
toolkit definition: Een manifestatie die een gepubliceerde manifestatie is die gepubliceerd, uitgebracht of uitgevaardigd is in een plaats. @nl
toolkit definition: Egy kiadott megjelenési forma, amelyet egy bizonyos helyen adnak ki, bocsájtanak ki vagy jelentetnek meg. @hu
toolkit definition: Eine veröffentlichte Manifestation, die an einem Ort veröffentlicht, freigegeben oder herausgegeben wird. @de
toolkit definition: En manifestasjon som er en publisert manifestasjon som er publisert, tilgjengeliggjort eller utgitt på et sted. @no
toolkit definition: Julkaistu manifestaatio, joka on kustannettu, julkaistu, ilmestynyt tms. paikassa. @fi
toolkit definition: Manifestació que és una manifestació publicada que es publica, es posa en circulació o s’emet en un lloc. @ca
toolkit definition: Manifestation publiée qui est publiée, mise à disposition ou éditée dans un lieu. @fr
toolkit definition: Manifestation, som er en upubliceret manifestation, som er indskrevet, fremstillet, konstrueret ect. et sted. @da
toolkit definition: Manifestazione che è pubblicata, rilasciata o edita in forma pubblicata in un luogo. @it
toolkit definition: Manifestācija, kas ir publicēta manifestācija, kas ir publicēta, izlaista, izdota norādītā paralēlā vietā. @lv
toolkit definition: تجسيدة منشورة نُشرت، أو أُصدرت في مكان. @ar
toolkit definition: 作为一种出版载体表现在一个地点出版、发布或发行等的一种载体表现 @zh-hans
toolkit label: Erscheinungsort von @de
toolkit label: ilmumiskoht kehastuses @et
toolkit label: ir paralēlā publicēšanas vieta @lv
toolkit label: kiadási helye: @hu
toolkit label: kustannuspaikka manifestaatiolle @fi
toolkit label: lieu de publication de @fr
toolkit label: lloc de publicació de @ca
toolkit label: luogo di pubblicazione di @it
toolkit label: plaats van uitgave van @nl
toolkit label: place of publication of
toolkit label: sted for udgivelse af @da
toolkit label: utgivelsessted for @no
toolkit label: yayın yeri @tr
toolkit label: مكان النشر لـ @ar
toolkit label: ……的出版的地点 @zh-hans
has subproperty: is parallel place of publication of
has subproperty: P70042
lexical alias: placeOfPublicationOf.en
status: Published
type: Property
domain: C10009
label: er sted for udgivelse af @da
label: er utgivelsessted for @no
label: est un lieu de publication de @fr
label: ilmumiskoht kehastuses @et
label: ir paralēlā publicēšanas vieta @lv
label: is plaats van publicatie van @nl
label: ist Erscheinungsort von @de
label: kustannuspaikka manifestaatiolle @fi
label: közzétételi helye a következőnek: @hu
label: yayın yeridir @tr
label: è luogo di pubblicazione di @it
label: és lloc de publicació de @ca
label: هو مكان النشر لـ @ar
label: 是……的出版的地点 @zh-hans
sub property of: is place of manifestation of
definition: Bir yeri, bir yerde yayınlanan, piyasaya sürülen veya yayınlanan bir gösterim olan bir gösterim ile ilişkilendirir. @tr
definition: Correla un luogo a una manifestazione che è pubblicata, rilasciata o edita in forma pubblicata in un luogo. @it
definition: Hozzákapcsol egy helyet egy kiadott megjelenési formához, amelyet egy bizonyos helyen adnak ki, bocsájtanak ki vagy jelentetnek meg. @hu
definition: Liittää paikan julkaistuun manifestaatioon, joka on kustannettu, julkaistu, ilmestynyt tms. paikassa. @fi
definition: Met un lieu en relation avec une manifestation publiée qui est publiée, mise à disposition ou éditée dans un lieu. @fr
definition: Relaciona un lloc amb una manifestació que és una manifestació publicada que es publica o es posa en circulació, s’emet en un lloc. @ca
definition: Relateert een plaats aan een manifestatie die een gepubliceerde manifestatie is die gepubliceerd, uitgebracht of uitgevaardigd is in een plaats. @nl
definition: Relaterer et sted til en manifestasjon som er en publisert manifestasjon som er publisert, tilgjengeliggjort eller utgitt på et sted. @no
definition: Relaterer et sted til en manifestation, som er en publiceret manifestation, som er publiceret, frigivet eller udgivet et sted. @da
definition: Relates a place to a manifestation that is a published manifestation that is published, released, or issued in a place.
definition: Sasaista vietu ar manifestāciju, kas ir publicēta manifestācija, kas ir publicēta, izlaista, izdota norādītā paralēlā vietā. @lv
definition: Seostab koha avaldatud kehastusega, mis on selles kohas avaldatud, välja lastud või välja antud. @et
definition: Setzt ein Geografikum in Beziehung zu einer veröffentlichten Manifestation, die an einem Ort veröffentlicht, freigegeben oder herausgegeben wird. @de
definition: يربط بين مكان وتجسيدة منشورة نُشرت، أو أُصدرت في مكان. @ar
definition: 将一个地点与作为一种出版载体表现在一个地点出版、发布或发行等的一种载体表现关联起来。 @zh-hans

has location
has element type: 6
toolkit definition: A delimitation of the physical territory of a place.
toolkit definition: Afgrænsning af et steds fysiske område. @da
toolkit definition: Bir yerin fiziksel bölgesinin sınırlandırılması. @tr
toolkit definition: Delimitació del territori físic d’un lloc. @ca
toolkit definition: Delimitazione del territorio fisico del luogo. @it
toolkit definition: Délimitation du territoire physique d’un lieu. @fr
toolkit definition: Een afbakening van het fysieke gebied van een plaats. @nl
toolkit definition: Egy hely fizikai területének lehatárolása. @hu
toolkit definition: Eine Abgrenzung des physischen Gebiets eines Geografikums. @de
toolkit definition: En avgrensning av det fysiske området for et sted. @no
toolkit definition: Koha füüsilise territooriumi piiritlus. @et
toolkit definition: Paikan fyysisen alueen rajaus. @fi
toolkit definition: Vietas fiziskas teritorijas norobežojums. @lv
toolkit definition: ترسيم حدود الأراضي الطبيعية لمكان. @ar
toolkit definition: 一个地点的物理区域的界定 @zh-hans
toolkit label: Standort @de
toolkit label: asukoht @et
toolkit label: atrašanās vieta @lv
toolkit label: elhelyezkedése: @hu
toolkit label: emplacement @fr
toolkit label: konum @tr
toolkit label: localització @ca
toolkit label: locatie @nl
toolkit label: location
toolkit label: lokalisering @no
toolkit label: lokation @da
toolkit label: sijainti @fi
toolkit label: ubicazione @it
toolkit label: موقع @ar
toolkit label: 位置 @zh-hans
has subproperty: P70043
lexical alias: location.en
status: Published
type: Property
domain: C10009
label: a pour emplacement @fr
label: asukoht @et
label: atrašanās vieta @lv
label: elhelyezkedése a következő: @hu
label: ha come ubicazione @it
label: har lokalisering @no
label: har lokation @da
label: hat Standort @de
label: heeft locatie @nl
label: konum ile ilişkilidir @tr
label: sijainti @fi
label: té com a localització @ca
label: له موقع @ar
label: 有位置 @zh-hans
definition: Bir yeri, o yerin fiziksel bölgesinin sınırlandırılmasıyla ilişkilendirir. @tr
definition: Correla un luogo a una delimitazione del territorio fisico del luogo. @it
definition: Hozzákapcsol egy helyet a hely fizikai területének lehatárolásához. @hu
definition: Liittää paikan paikan fyysisen alueen rajaukseen. @fi
definition: Met un lieu en relation avec une délimitation du territoire physique d’un lieu. @fr
definition: Relaciona un lloc amb una delimitació del territori físic d’un lloc. @ca
definition: Relateert een plaats aan een afbakening van het fysieke gebied van een plaats. @nl
definition: Relaterer et sted til en afgrænsning af et steds fysiske område. @da
definition: Relaterer et sted til en avgrensning av det fysiske området for et sted. @no
definition: Relates a place to a delimitation of the physical territory of the place.
definition: Sasaista vietu ar vietas fiziskas teritorijas norobežojumu. @lv
definition: Seostab koha koha füüsilise territooriumi piiritlusega. @et
definition: Setzt ein Geografikum in Beziehung zu einer Abgrenzung des physischen Gebiets eines Geografikums. @de
definition: يربط بين مكان وترسيم حدود الأراضي الطبيعية لمكان. @ar
definition: 将一个地点与一个地点的物理区域的界定关联起来。 @zh-hans

has category of place
has element type: 5
toolkit definition: A type to which a place belongs.
toolkit definition: Bir yerin ait olduğu bir tür. @tr
toolkit definition: Een type waartoe een plaats behoort. @nl
toolkit definition: Egy típus, amelyhez egy hely tartozik. @hu
toolkit definition: Eine Art, zu der ein Geografikum gehört. @de
toolkit definition: En type som et sted tilhører. @no
toolkit definition: Tipo a cui il luogo appartiene. @it
toolkit definition: Tipus al qual pertany un lloc. @ca
toolkit definition: Type auquel un lieu appartient. @fr
toolkit definition: Type, som et sted tilhører. @da
toolkit definition: Tyyppi, johon paikka kuuluu. @fi
toolkit definition: Tüüp, millesse koht kuulub. @et
toolkit definition: Vietas veids. @lv
toolkit definition: نوع ينتمي إليه مكان. @ar
toolkit definition: 一个地点所属于的一个类型 @zh-hans
toolkit label: Kategorie eines Geografikums @de
toolkit label: categoria de lloc @ca
toolkit label: categoria di luogo @it
toolkit label: categorie van plaats @nl
toolkit label: category of place
toolkit label: catégorie de lieu @fr
toolkit label: hely kategóriája @hu
toolkit label: kategori af sted @da
toolkit label: kategori av sted @no
toolkit label: koha kategooria @et
toolkit label: paikan kategoria @fi
toolkit label: vietas kategorija @lv
toolkit label: yer kategorisi @tr
toolkit label: فئة لمكان @ar
toolkit label: 地点的类别 @zh-hans
has subproperty: P70044
lexical alias: categoryOfPlace.en
status: Published
type: Property
domain: C10009
label: a pour catégorie de lieu @fr
label: ha come categoria di luogo @it
label: har kategori af sted @da
label: har kategori av sted @no
label: hat Kategorie eines Geografikums @de
label: heeft categorie van plaats @nl
label: hely kategóriája a következő: @hu
label: koha kategooria @et
label: paikan kategoria @fi
label: té com a categoria de lloc @ca
label: vietas kategorija @lv
label: yerin kategorisi ile ilişkilidir @tr
label: له فئة لمكان @ar
label: 有地点的类别 @zh-hans
sub property of: P00029
alternative label: Art eines Geografikums @de
alternative label: hely típusa: @hu
alternative label: koha tüüp @et
alternative label: paikan tyyppi @fi
alternative label: plaatstype @nl
alternative label: tipo di luogo @it
alternative label: tipus de lloc @ca
alternative label: type af sted @da
alternative label: type de lieu @fr
alternative label: type of place
alternative label: type sted @no
alternative label: yerin türü @tr
alternative label: نوع مكان @ar
alternative label: 地点的类型 @zh-hans
definition: Bir yeri, ait olduğu bir tür ile ilişkilendirir. @tr
definition: Correla un luogo al tipo a cui il luogo appartiene. @it
definition: Hozzákapcsol egy helyet ahhoz a típushoz, amelyhez a hely tartozik. @hu
definition: Liittää paikan tyyppiin, johon paikka kuuluu. @fi
definition: Met un lieu en relation avec un type auquel un lieu appartient. @fr
definition: Relaciona un lloc amb un tipus al qual pertany un lloc. @ca
definition: Relateert een plaats aan een type waartoe een plaats behoort. @nl
definition: Relaterer et sted til en type som et sted tilhører. @no
definition: Relaterer et sted til en type, som et sted tilhører. @da
definition: Relates a place to a type to which a place belongs.
definition: Sasaista vietu ar vietas veidu. @lv
definition: Seostab koha tüübiga, millesse koht kuulub. @et
definition: Setzt ein Geografikum in Beziehung zu einer Art, zu der ein Geografikum gehört. @de
definition: يربط بين مكان ونوع ينتمي إليه مكان. @ar
definition: 将一个地点与一个地点所属于的一个类型关联起来。 @zh-hans

has authorized access point for place
has element type: 3
toolkit definition: A nomen that is an access point of place that is selected for preference in a specific vocabulary encoding scheme.
toolkit definition: Belirli bir kelime kodlama şemasında tercih için seçilen bir yerin erişim noktası olan bir isim @tr
toolkit definition: Een nomen dat is een ingang van plaats die als voorkeursterm geselecteerd is in een specifiek vocabulair coderingssysteem. @nl
toolkit definition: Egy nomen, amely egy előnyben részesített hozzáférési pont a helyhez, amelyet egy speciális szótárkódolási sémából választanak ki. @hu
toolkit definition: Ein Sucheinstieg für ein Geografikum, der in einem bestimmten Vocabulary Encoding Scheme als Vorzugsform bestimmt wird. @de
toolkit definition: En søkeinngang for sted som er valgt som preferanse i et bestemt kodeskjema for vokabular. @no
toolkit definition: Koha otsielement, mis on valitud eelistatuks vastavas leksikaalses märkimissüsteemis. @et
toolkit definition: Nomen que és un punt d’accés de lloc que se selecciona com a preferent en un esquema de codificació de vocabulari específic. @ca
toolkit definition: Nomen qui est un point d’accès d’un lieu faisant l’objet d’un choix privilégié dans un schéma d’encodage de vocabulaire spécifique. @fr
toolkit definition: Nomen, joka on paikan hakutieto, joka on valittu ensisijaiseksi tietyssä sanaston merkintäjärjestelmässä. @fi
toolkit definition: Punto d'accesso per un luogo che è stato selezionato come preferito in uno specifico schema di codifica di vocabolario. @it
toolkit definition: Søgeindgang for sted, som er valgt som præference i et specifikt vokabularkodningsskema. @da
toolkit definition: Vietas pamatforma, kas ir izvēle no konkrētas vārdnīcas. @lv
toolkit definition: تسمية عبارة عن نقطة وصول لمكان تم اختيارها بتفضيل استخدامها في خطة ترميز مفردات محددة. @ar
toolkit definition: 作为一个地点的检索点并在一个特定的词表编码体系中被首选的一个命名 @zh-hans
toolkit label: Normierter Sucheinstieg für ein Geografikum @de
toolkit label: authorized access point for place
toolkit label: autoriseret søgeindgang for sted @da
toolkit label: autorisert søkeinngang for sted @no
toolkit label: autorizált hozzáférési pont helyhez a következő: @hu
toolkit label: geautoriseerde ingang voor plaats @nl
toolkit label: koha normitud otsielement @et
toolkit label: paikan auktorisoitu hakutieto @fi
toolkit label: point d’accès autorisé d’un lieu @fr
toolkit label: punt d’accés autoritzat de lloc @ca
toolkit label: punto d'accesso autorizzato per luogo @it
toolkit label: vietas autoritatīvā pamatforma @lv
toolkit label: yer için yetkili erişim noktası @tr
toolkit label: نقطة وصول مقننة لمكان @ar
toolkit label: 地点的规范检索点 @zh-hans
has subproperty: P70045
lexical alias: authorizedAccessPointForPlace.en
status: Published
type: Property
domain: C10009
label: a pour point d’accès autorisé d’un lieu @fr
label: autorizált hozzáférési pont helyhez a következő: @hu
label: ha come punto d'accesso autorizzato per luogo @it
label: har autoriseret søgeindgang for sted @da
label: har autorisert søkeinngang for sted @no
label: hat normierten Sucheinstieg für ein Geografikum @de
label: heeft geautoriseerde ingang voor plaats @nl
label: koha normitud otsielement @et
label: paikan auktorisoitu hakutieto @fi
label: té com a punt d’accés autoritzat de lloc @ca
label: vietas autoritatīvā pamatforma @lv
label: yer için yetkili erişim noktası ile ilişkilidir @tr
label: له نقطة وصول مقننة لمكان @ar
label: 有地点的规范检索点 @zh-hans
sub property of: has access point for place
sub property of: P00020
definition: Bir yeri, belirli bir kelime kodlama şemasında tercih için seçilen bir yerin erişim noktası olan bir isim ile ilişkilendirir. @tr
definition: Correla un luogo a un punto d'accesso per un luogo che è stato selezionato come preferito in uno specifico schema di codifica di vocabolario. @it
definition: Hozzákapcsol egy helyet egy nomenhez, amely egy előnyben részesített hozzáférési pont a helyhez, amelyet egy speciális szótárkódolási sémából választanak ki. @hu
definition: Liittää paikan nomeniin, joka on paikan hakutieto, joka on valittu ensisijaiseksi tietyssä sanaston merkintäjärjestelmässä. @fi
definition: Met un lieu en relation avec un nomen qui est un point d’accès d’un lieu faisant l’objet d’un choix privilégié dans un schéma d’encodage de vocabulaire spécifique. @fr
definition: Relaciona un lloc amb un nomen que és un punt d’accés de lloc que se selecciona com a preferent en un esquema de codificació de vocabulari específic. @ca
definition: Relateert een plaats aan een nomen dat is een ingang van plaats die als voorkeursterm geselecteerd is in een specifiek vocabulair coderingssysteem. @nl
definition: Relaterer et sted til en søgeindgang for sted, som er valgt som præference i et specifikt vokabularkodningsskema. @da
definition: Relaterer et sted til en søkeinngang for sted som er valgt som preferanse i et bestemt kodeskjema for vokabular. @no
definition: Relates a place to a nomen that is an access point of place that is selected for preference in a specific vocabulary encoding scheme.
definition: Sasaista vietu ar nomenu, kas ir vietas pamatforma, kas ir izvēle no konkrētas vārdnīcas. @lv
definition: Seostab koha koha otsielemendiga, mis on valitud eelistatuks vastavas leksikaalses märkimissüsteemis. @et
definition: Setzt ein Geografikum in Beziehung zu einem Sucheinstieg für ein Geografikum, der in einem bestimmten Vocabulary Encoding Scheme als Vorzugsform bestimmt wird. @de
definition: يربط بين مكان وتسمية عبارة عن نقطة وصول لمكان تم اختيارها بتفضيل استخدامها في خطة ترميز مفردات محددة. @ar
definition: 将一个地点与作为一个地点的检索点并在一个特定的词表编码体系中被首选的一个命名关联起来。 @zh-hans

has variant access point for place
has element type: 3
toolkit definition: A nomen that is an access point of place that is not selected for preference in a specific vocabulary encoding scheme.
toolkit definition: Belirli bir kelime kodlama şemasında tercih için seçilmemiş bir yerin erişim noktası olan bir isim. @tr
toolkit definition: Een nomen dat is een ingang van plaats die niet als voorkeursterm geselecteerd is in een specifiek vocabulair coderingssysteem. @nl
toolkit definition: Egy nomen, amely egy olyan hozzáférési pont a helyhez, amely egy bizonyos szótárkódolási sémában nem részesül előnyben. @hu
toolkit definition: Ein Sucheinstieg für ein Geografikum, der in einem bestimmten Vocabulary Encoding Scheme nicht als Vorzugsform bestimmt wird. @de
toolkit definition: En søkeinngang for sted som ikke er valgt som preferanse i et bestemt kodeskjema for vokabular. @no
toolkit definition: Koha otsielement, mis ei ole valitud eelistatuks vastavas leksikaalses märkimissüsteemis. @et
toolkit definition: Nomen que és un punt d’accés de lloc que no se selecciona com a preferent en un esquema de codificació de vocabulari específic. @ca
toolkit definition: Nomen qui est un point d’accès d’un lieu ne faisant pas l’objet d’un choix privilégié dans un schéma d’encodage de vocabulaire spécifique. @fr
toolkit definition: Nomen, joka on paikan hakutieto, jota ei ole valittu ensisijaiseksi tietyssä sanaston merkintäjärjestelmässä. @fi
toolkit definition: Piekļuves punkts vietai, kas nav izvēlēta kā prioritāra noteiktai kontrolētas vārdnīcas shēmai. @lv
toolkit definition: Punto d'accesso per un luogo che non è stato selezionato come preferito in uno specifico schema di codifica di vocabolario. @it
toolkit definition: Søgeindgang for sted, som ikke er valgt som præference i et specifikt vokabularkodningsskema. @da
toolkit definition: تسمية عبارة عن نقطة وصول لمكان لم يتم اختيارها بتفضيل استخدامها في خطة ترميز مفردات محددة. @ar
toolkit definition: 作为一个地点的检索点并在一个特定的词表编码体系中未被首选的一个命名 @zh-hans
toolkit label: Zusätzlicher Sucheinstieg für ein Geografikum @de
toolkit label: alternativ søkeinngang for sted @no
toolkit label: hozzáférésipont-változat helyhez a következő: @hu
toolkit label: koha otsielemendi variant @et
toolkit label: paikan varianttihakutieto @fi
toolkit label: punto d'accesso variante per luogo @it
toolkit label: variant access point for place
toolkit label: variant af søgeindgang for sted @da
toolkit label: variant de punt d’accés de lloc @ca
toolkit label: variant ingang voor plaats @nl
toolkit label: variante de point d’accès d’un lieu @fr
toolkit label: vietas papildforma @lv
toolkit label: yer için alternatif erişim noktası @tr
toolkit label: نقطة وصول مختلفة لمكان @ar
toolkit label: 地点的变异检索点 @zh-hans
has subproperty: P70046
lexical alias: variantAccessPointForPlace.en
status: Published
type: Property
domain: C10009
label: a pour variante de point d’accès d’un lieu @fr
label: ha come punto d'accesso variante per luogo @it
label: har alternativ søkeinngang for sted @no
label: har variant af søgeindgang for sted @da
label: hat zusätzlichen Sucheinstieg für ein Geografikum @de
label: heeft variant ingang voor plaats @nl
label: hozzáférésipont-változat helyhez a következő: @hu
label: koha otsielemendi variant @et
label: paikan varianttihakutieto @fi
label: té com a variant de punt d’accés de lloc @ca
label: vietas papildforma @lv
label: yer için alternatif erişim noktası ile ilişkilidir @tr
label: له نقطة وصول مختلفة لمكان @ar
label: 有地点的变异检索点 @zh-hans
sub property of: has access point for place
sub property of: P00022
definition: Bir yeri, belirli bir kelime kodlama şemasında tercih için seçilmemiş bir yerin erişim noktası olan bir isim ile ilişkilendirir. @tr
definition: Correla un luogo a un punto d'accesso per un luogo che non è stato selezionato come preferito in uno specifico schema di codifica di vocabolario. @it
definition: Hozzákapcsol egy helyet egy nomenhez, amely egy olyan hozzáférési pont a helyhez, amely egy bizonyos szótárkódolási sémában nem részesül előnyben. @hu
definition: Liittää paikan nomeniin, joka on paikan hakutieto, jota ei ole valittu ensisijaiseksi tietyssä sanaston merkintäjärjestelmässä. @fi
definition: Met un lieu en relation avec un nomen qui est un point d’accès d’un lieu ne faisant pas l’objet d’un choix privilégié dans un schéma d’encodage de vocabulaire spécifique. @fr
definition: Relaciona un lloc amb un nomen que és un punt d’accés de lloc que no se selecciona com a preferent en un esquema de codificació de vocabulari específic. @ca
definition: Relateert een plaats aan een nomen dat is een ingang van plaats die niet als voorkeursterm geselecteerd is in een specifiek vocabulair coderingssysteem. @nl
definition: Relaterer et sted til en søgeindgang for sted, som ikke er valgt som præference i et specifikt vokabularkodningsskema. @da
definition: Relaterer et sted til en søkeinngang for sted som ikke er valgt som preferanse i et bestemt kodeskjema for vokabular. @no
definition: Relates a place to a nomen that is an access point of place that is not selected for preference in a specific vocabulary encoding scheme.
definition: Sasaista vietu ar nomenu, kas ir piekļuves punkts vietai, kas nav izvēlēta kā prioritāra noteiktai kontrolētas vārdnīcas shēmai. @lv
definition: Seostab koha koha otsielemendiga, mis ei ole valitud eelistatuks vastavas leksikaalses märkimissüsteemis. @et
definition: Setzt ein Geografikum in Beziehung zu einem Sucheinstieg für ein Geografikum, der in einem bestimmten Vocabulary Encoding Scheme nicht als Vorzugsform bestimmt wird. @de
definition: يربط بين مكان وتسمية عبارة عن نقطة وصول لمكان لم يتم اختيارها بتفضيل استخدامها في خطة ترميز مفردات محددة. @ar
definition: 将一个地点与作为一个地点的检索点并在一个特定的词表编码体系中未被首选的一个命名关联起来。 @zh-hans

is parallel place of distribution of
has element type: 2
toolkit definition: A manifestation that is a published manifestation that is distributed from a place.
toolkit definition: Avaldatud kehastus, mida sellest kohast levitatakse. @et
toolkit definition: Bir yerden dağıtılan yayınlanmış bir gösterim olan bir gösterim. @tr
toolkit definition: Een manifestatie die een gepubliceerde manifestatie is die gedistribueerd is vanuit een plaats. @nl
toolkit definition: Egy kiadott megjelenési forma, amelyet egy bizonyos helyen terjesztenek. @hu
toolkit definition: Eine veröffentlichte Manifestation, die an einem Ort vertrieben wird. @de
toolkit definition: En manifestasjon som er en publisert manifestasjon som er distribuert fra et sted. @no
toolkit definition: Julkaistu manifestaatio, jota jaellaan paikasta käsin. @fi
toolkit definition: Manifestació que és una manifestació publicada que es distribueix des d’un lloc. @ca
toolkit definition: Manifestation publiée qui est diffusée ou distribuée à partir d’un lieu. @fr
toolkit definition: Manifestation, som er en publiceret manifestation, som er distribueret fra et sted. @da
toolkit definition: Manifestazione pubblicata che è distribuita da un luogo. @it
toolkit definition: Manifestācija, kas ir publicēta manifestācija, kas ir izplatīta no norādītās vietas. @lv
toolkit definition: تجسيدة منشورة وُزعت من مكان. @ar
toolkit definition: 作为一种出版载体表现并从一个地点发行的一种载体表现 @zh-hans
toolkit label: Paralleler Vertriebsort von @de
toolkit label: forme parallèle d’un lieu de diffusion ou de distribution de @fr
toolkit label: ir izplatīšanas vieta @lv
toolkit label: levitamiskoha rööpandmed kehastuses @et
toolkit label: lloc paral·lel de distribució de @ca
toolkit label: luogo parallelo di distribuzione di @it
toolkit label: paralel dağıtım yeri @tr
toolkit label: parallel place of distribution of
toolkit label: parallel-plaats van distributie van @nl
toolkit label: parallelt distribusjonssted for @no
toolkit label: parallelt sted for distribution af @da
toolkit label: párhuzamos terjesztési helye a következő: @hu
toolkit label: rinnakkainen jakelupaikka manifestaatiolle @fi
toolkit label: مكان توزيع موازي لـ @ar
toolkit label: ……的发行的并列地点 @zh-hans
has subproperty: P70047
lexical alias: parallelPlaceOfDistributionOf.en
status: Published
type: Property
domain: C10009
label: dağıtımının paralel yeridir @tr
label: er parallelt distribusjonssted for @no
label: er parallelt sted for distribution af @da
label: est une forme parallèle d’un lieu de diffusion ou de distribution de @fr
label: ir izplatīšanas vieta @lv
label: is parallelle plaats van distributie van @nl
label: ist paralleler Vertriebsort von @de
label: levitamiskoha rööpandmed kehastuses @et
label: párhuzamos terjesztési helye a következő: @hu
label: rinnakkainen jakelupaikka manifestaatiolle @fi
label: è luogo parallelo di distribuzione di @it
label: és lloc paral·lel de distribució de @ca
label: هو مكان توزيع موازي لـ @ar
label: 是……的发行的并列地点 @zh-hans
sub property of: is place of distribution of
definition: Bir yeri, bir yerden dağıtılan yayınlanmış bir gösterim olan bir gösterim ile ilişkilendirir. @tr
definition: Correla un luogo a una manifestazione che è una manifestazione pubblicata che è distribuita da un luogo. @it
definition: Hozzákapcsol egy helyet egy kiadott megjelenési formához, amelyet egy bizonyos helyen terjesztenek. @hu
definition: Liittää paikan julkaistuun manifestaatioon, jota jaellaan paikasta käsin. @fi
definition: Met un lieu en relation avec une manifestation publiée qui est diffusée ou distribuée à partir d’un lieu. @fr
definition: Relaciona un lloc amb una manifestació que és una manifestació publicada que es distribueix des d’un lloc. @ca
definition: Relateert een plaats aan een manifestatie die een gepubliceerde manifestatie is die gedistribueerd is vanuit een plaats. @nl
definition: Relaterer et sted til en manifestasjon som er en publisert manifestasjon som er distribuert fra et sted. @no
definition: Relaterer et sted til en manifestation, som er en publiceret manifestation, som er distribueret fra et sted. @da
definition: Relates a place to a manifestation that is a published manifestation that is distributed from a place.
definition: Sasaista vietu ar manifestāciju, kas ir publicēta manifestācija, kas ir izplatīta no norādītās vietas. @lv
definition: Seostab koha avaldatud kehastusega, mida sellest kohast levitatakse. @et
definition: Setzt ein Geografikum in Beziehung zu einer veröffentlichten Manifestation, die an einem Ort vertrieben wird. @de
definition: يربط بين مكان وتجسيدة منشورة وُزعت من مكان. @ar
definition: 将一个地点与作为一种出版载体表现并从一个地点发行的一种载体表现关联起来。 @zh-hans

is parallel place of manufacture of
has element type: 2
toolkit definition: A manifestation that is a published manifestation that is printed, duplicated, cast, etc., in a place.
toolkit definition: Avaldatud kehastus, mis on selles kohas trükitud, paljundatud, valatud vms. @et
toolkit definition: Bir yerde basılan çoğaltılan biçim verilmiş vb. yayınlanmış bir gösterim olan bir gösterim. @tr
toolkit definition: Een manifestatie die een gepubliceerde manifestatie is die is gedrukt, gedupliceerd, gegoten etc. in een plaats. @nl
toolkit definition: Egy kiadott megjelenési forma, amelyet egy bizonyos helyen nyomtattak, sokszoroztak, öntöttek stb. @hu
toolkit definition: Eine veröffentlichte Manifestation, die an einem Ort gedruckt, vervielfältigt, gegossen und so weiter wird. @de
toolkit definition: En manifestasjon som er en publisert manifestasjon som er trykt, mangfoldiggjort, støpt etc. på et sted. @no
toolkit definition: Julkaistu manifestaatio, joka on painettu, monistettu, valettu kirjainten osalta tms. paikassa. @fi
toolkit definition: Manifestació que és una manifestació publicada que s’imprimeix, es reprodueix, es modela, etc., en un lloc. @ca
toolkit definition: Manifestation publiée qui est imprimée, reproduite, moulée, etc. dans un lieu. @fr
toolkit definition: Manifestation, som er en publiceret manifestation, som er trykt, duplikeret, støbt ect. et sted. @da
toolkit definition: Manifestione pubblicata che è stampata, duplicata, lanciata, etc. in un luogo. @it
toolkit definition: Manifestācija, kas ir publicēta manifestācija, kas ir iespiesta, pavairota, iesieta norādītā paralēlā vietā. @lv
toolkit definition: تجسيدة منشورة طُبعت، ونُسخت، وبُثت، إلخ، في مكان. @ar
toolkit definition: 作为一种出版载体表现并从一个地点印刷、复制、铸造等的一种载体表现 @zh-hans
toolkit label: Paralleler Herstellungsort von @de
toolkit label: forme parallèle d’un lieu de fabrication de @fr
toolkit label: ir paralēlā ražošanas vieta @lv
toolkit label: lloc paral·lel de fabricació de @ca
toolkit label: luogo parallelo di manifattura di @it
toolkit label: paralel üretim yeri @tr
toolkit label: parallel place of manufacture of
toolkit label: parallel-plaats van vervaardiging van @nl
toolkit label: parallelt framstillingssted for @no
toolkit label: parallelt sted for fremstilling af @da
toolkit label: párhuzamos gyártási helye a következő: @hu
toolkit label: rinnakkainen valmistuspaikka manifestaatiolle @fi
toolkit label: valmistamiskoha rööpandmed kehastuses @et
toolkit label: مكان تصنيع موازي لـ @ar
toolkit label: ……的生产的并列地点 @zh-hans
has subproperty: P70048
lexical alias: parallelPlaceOfManufactureOf.en
status: Published
type: Property
domain: C10009
label: er parallelt framstillingssted for @no
label: er parallelt sted for fremstilling af @da
label: est une forme parallèle d’un lieu de fabrication de @fr
label: ir paralēlā ražošanas vieta @lv
label: is parallelle plaats van vervaardiging van @nl
label: ist paralleler Herstellungsort von @de
label: párhuzamos gyártási helye a következő: @hu
label: rinnakkainen valmistuspaikka manifestaatiolle @fi
label: valmistamiskoha rööpandmed kehastuses @et
label: è luogo parallelo di manifattura di @it
label: és lloc paral·lel de fabricació de @ca
label: üretiminin paralel yeridir @tr
label: هو مكان تصنيع موازي لـ @ar
label: 是……的生产的并列地点 @zh-hans
sub property of: is place of manufacture of
definition: Bir yeri, bir yerde basılan, çoğaltılan, biçimlendirilen, vb. yayınlanmış bir gösterim olan bir gösteriyle ilişkilendirir @tr
definition: Correla un luogo a una manifestione è che una manifestazione pubblicata che è stampata, duplicata, lanciata, etc. in un luogo. @it
definition: Hozzákapcsol egy helyet egy kiadott megjelenési formához, amelyet egy bizonyos helyen nyomtattak, sokszoroztak, öntöttek stb. @hu
definition: Liittää paikan julkaistuun manifestaatioon, joka on painettu, monistettu, valettu kirjainten osalta tms. paikassa. @fi
definition: Met un lieu en relation avec une manifestation publiée qui est imprimée, reproduite, moulée, etc. dans un lieu. @fr
definition: Relaciona un lloc amb una manifestació que és una manifestació publicada que s’imprimeix, es reprodueix, es modela, etc., en un lloc. @ca
definition: Relateert een plaats aan een manifestatie die een gepubliceerde manifestatie is die is gedrukt, gedupliceerd, gegoten etc. in een plaats. @nl
definition: Relaterer et sted til en manifestasjon som er en publisert manifestasjon som er trykt, mangfoldiggjort, støpt etc. på et sted. @no
definition: Relaterer et sted til en manifestation, som er en publiceret manifestation, som er trykt, duplikeret, støbt ect. et sted. @da
definition: Relates a place to a manifestation that is a published manifestation that is printed, duplicated, cast, etc., in a place.
definition: Sasaista vietu ar manifestāciju, kas ir publicēta manifestācija, kas ir iespiesta, pavairota, iesieta norādītā paralēlā vietā. @lv
definition: Seostab koha avaldatud kehastusega, mis on selles kohas trükitud, paljundatud, valatud vms. @et
definition: Setzt ein Geografikum in Beziehung zu einer veröffentlichten Manifestation, die an einem Ort gedruckt, vervielfältigt, gegossen und so weiter wird. @de
definition: يربط بين مكان وتجسيدة منشورة طُبعت، ونُسخت، وبُثت، إلخ، في مكان. @ar
definition: 将一个地点与作为一种出版载体表现并从一个地点印刷、复制、铸造等的一种载体表现关联起来。 @zh-hans

is parallel place of production of
has element type: 2
toolkit definition: A manifestation that is an unpublished manifestation that is inscribed, fabricated, constructed, etc., in a place.
toolkit definition: Avaldamata kehastus, mis on selles kohas inskribeeritud, toodetud, ehitatud vms. @et
toolkit definition: Bir yerde yazılan, üretilen, yapılandırılan, vb. yayınlanmamış bir gösterim olan bir gösterim. @tr
toolkit definition: Een manifestatie die een ongepubliceerde manifestatie is die is afgeschreven, gefabriceerd, geconstrueerd etc. in een plaats. @nl
toolkit definition: Egy kiadatlan megjelenési forma, amelyet egy bizonyos helyen írnak, készítenek, szerkesztenek stb. @hu
toolkit definition: Eine unveröffentlichte Manifestation, die an einem Ort beschriftet, fabriziert, konstruiert und so weiter wird. @de
toolkit definition: En manifestasjon som er en upublisert manifestasjon som er inskribert, fabrikert, konstruert etc. på et sted. @no
toolkit definition: Julkaisematon manifestaatio, joka on kaiverrettu, valmistettu, koottu tms. paikassa. @fi
toolkit definition: Manifestació que és una manifestació no publicada que s’inscriu, es fabrica, es construeix, etc., en un lloc. @ca
toolkit definition: Manifestation non publiée qui est écrite à la main, fabriquée, construite, etc. dans un lieu. @fr
toolkit definition: Manifestation, som er en upubliceret manifestation, som er indskrevet, fremstillet, konstrueret ect. et sted. @da
toolkit definition: Manifestazione non pubblicata che è incisa, fabbricata, costruita, etc. in un luogo. @it
toolkit definition: Manifestācija, kas ir publicēta manifestācija, kas ir uzrakstīta, izgatavota, radīta u.tml. norādītā paralēlā vietā. @lv
toolkit definition: تجسيدة غير منشورة دُونت، ووُضعت، وأُنشئت، إلخ، في مكان. @ar
toolkit definition: 作为一种非出版载体表现在一个地点镌刻、制造、构建等的一种载体表现 @zh-hans
toolkit label: Paralleler Entstehungsort von @de
toolkit label: forme parallèle d’un lieu de production de @fr
toolkit label: gyártás párhuzamos helye a következő: @hu
toolkit label: ir paralēlā izgatavošanas vieta @lv
toolkit label: lloc paral·lel de producció de @ca
toolkit label: luogo parallelo di produzione di @it
toolkit label: paralel üretim yeri @tr
toolkit label: parallel place of production of
toolkit label: parallel-plaats van productie van @nl
toolkit label: parallelt produksjonssted for @no
toolkit label: parallelt sted for produktion af @da
toolkit label: rinnakkainen tuotantopaikka manifestaatiolle @fi
toolkit label: tootmiskoha rööpandmed kehastuses @et
toolkit label: مكان إنتاج موازي لـ @ar
toolkit label: ……的制作的并列地点 @zh-hans
has subproperty: P70049
lexical alias: parallelPlaceOfProductionOf.en
status: Published
type: Property
domain: C10009
label: er parallelt produksjonssted for @no
label: er parallelt sted for produktion af @da
label: est une forme parallèle d’un lieu de production de @fr
label: gyártás párhuzamos helye a következő: @hu
label: ir paralēlā izgatavošanas vieta @lv
label: is parallelle plaats van productie van @nl
label: ist paralleler Entstehungsort von @de
label: rinnakkainen tuotantopaikka manifestaatiolle @fi
label: tootmiskoha rööpandmed kehastuses @et
label: yapımının paralel yeridir @tr
label: è luogo parallelo di produzione di @it
label: és lloc paral·lel de producció de @ca
label: هو مكان إنتاج موازي لـ @ar
label: 是……的制作的并列地点 @zh-hans
sub property of: is place of production of
definition: Bir yeri, bir yerde yazılı olan, imal edilen, inşa edilen, vb. yayınlanmamış bir gösterimle ilişkilendirir. @tr
definition: Correla un luogo a una manifestazione è che una manifestazione non pubblicata che è incisa, fabbricata, costruita, etc. in un luogo. @it
definition: Hozzákapcsol egy helyet egy kiadatlan megjelenési formához, amelyet egy bizonyos helyen írnak, készítenek, szerkesztenek stb. @hu
definition: Liittää paikan julkaisemattomaan manifestaatioon, joka on kaiverrettu, valmistettu, koottu tms. paikassa. @fi
definition: Met un lieu en relation avec une manifestation non publiée qui est écrite à la main, fabriquée, construite, etc. dans un lieu. @fr
definition: Relaciona un lloc amb una manifestació que és una manifestació no publicada que s’inscriu, es fabrica, es construeix, etc., en un lloc. @ca
definition: Relateert een plaats aan een manifestatie die een ongepubliceerde manifestatie is die is afgeschreven, gefabriceerd, geconstrueerd etc. in een plaats. @nl
definition: Relaterer et sted til en manifestasjon som er en upublisert manifestasjon som er inskribert, fabrikert, konstruert etc. på et sted. @no
definition: Relaterer et sted til en manifestation, som er en upubliceret manifestation, som er indskrevet, fremstillet, konstrueret ect. et sted. @da
definition: Relates a place to a manifestation that is an unpublished manifestation that is inscribed, fabricated, constructed, etc., in a place.
definition: Sasaista vietu ar manifestāciju, kas ir publicēta manifestācija, kas ir uzrakstīta, izgatavota, radīta u.tml. norādītā paralēlā vietā. @lv
definition: Seostab koha avaldamata kehastusega, mis on selles kohas inskribeeritud, toodetud, ehitatud vms. @et
definition: Setzt ein Geografikum in Beziehung zu einer unveröffentlichten Manifestation, die an einem Ort beschriftet, fabriziert, konstruiert und so weiter wird. @de
definition: يربط بين مكان وتجسيدة غير منشورة دُونت، ووُضعت، وأُنشئت، إلخ، في مكان. @ar
definition: 将一个地点与作为一种非出版载体表现在一个地点镌刻、制造、构建等的一种载体表现关联起来。 @zh-hans

is parallel place of publication of
has element type: 2
toolkit definition: A manifestation that is a published manifestation that is published, released, or issued in a place.
toolkit definition: Avaldatud kehastus, mis on selles kohas avaldatud, välja lastud või välja antud. @et
toolkit definition: Bir yerde yayınlanan, piyasaya sürülen vb. yayınlanmış bir gösterim olan bir gösterim. @tr
toolkit definition: Een manifestatie die een gepubliceerde manifestatie is die gepubliceerd, uitgebracht of uitgevaardigd is in een plaats. @nl
toolkit definition: Egy kiadott megjelenési forma, amelyet egy bizonyos helyen adnak ki, bocsájtanak ki vagy jelentetnek meg. @hu
toolkit definition: Eine veröffentlichte Manifestation, die an einem Ort veröffentlicht, freigegeben oder herausgegeben wird. @de
toolkit definition: En manifestasjon som er en publisert manifestasjon som er publisert, tilgjengeliggjort eller utgitt på et sted. @no
toolkit definition: Julkaistu manifestaatio, joka on kustannettu, julkaistu, ilmestynyt tms. paikassa. @fi
toolkit definition: Manifestació que és una manifestació publicada que es publica, es posa en circulació o s’emet en un lloc. @ca
toolkit definition: Manifestation publiée qui est publiée, mise à disposition ou éditée dans un lieu. @fr
toolkit definition: Manifestation, som er en publiceret manifestation, som er publiceret, frigivet eller udgivet et sted. @da
toolkit definition: Manifestazione non pubblicata che è incisa, fabbricata, costruita, etc. in un luogo. @it
toolkit definition: Manifestācija, kas ir publicēta manifestācija, kas ir publicēta, izlaista, izdota norādītā vietā. @lv
toolkit definition: تجسيدة منشورة نُشرت، أو أُصدرت في مكان. @ar
toolkit definition: 作为一种出版载体表现并在一个地点出版、发布、发行的一种载体表现 @zh-hans
toolkit label: Paralleler Erscheinungsort von @de
toolkit label: forme parallèle d’un lieu de publication de @fr
toolkit label: ilmumiskoha rööpandmed kehastuses @et
toolkit label: ir izdošanas vieta @lv
toolkit label: közzététel párhuzamos helye a következő: @hu
toolkit label: lloc paral·lel de publicació de @ca
toolkit label: luogo parallelo di pubblicazione di @it
toolkit label: paralel yayın yeri @tr
toolkit label: parallel place of publication of
toolkit label: parallel-plaats van uitgave van @nl
toolkit label: parallelt sted for udgivelse af @da
toolkit label: parallelt utgivelsessted for @no
toolkit label: rinnakkainen kustannuspaikka manifestaatiolle @fi
toolkit label: مكان نشر موازي لـ @ar
toolkit label: ……的出版的并列地点 @zh-hans
has subproperty: P70050
lexical alias: parallelPlaceOfPublicationOf.en
status: Published
type: Property
domain: C10009
label: er parallelt sted for udgivelse af @da
label: er parallelt utgivelsessted for @no
label: est une forme parallèle d’un lieu de publication de @fr
label: ilmumiskoha rööpandmed kehastuses @et
label: ir izdošanas vieta @lv
label: is parallelle plaats van publicatie van @nl
label: ist paralleler Erscheinungsort von @de
label: közzététel párhuzamos helye a következő: @hu
label: rinnakkainen kustannuspaikka manifestaatiolle @fi
label: yayınının paralel yeridir @tr
label: è luogo parallelo di pubblicazione di @it
label: és lloc paral·lel de publicació de @ca
label: هو مكان نشر موازي لـ @ar
label: 是……的出版的并列地点 @zh-hans
sub property of: is place of publication of
definition: Bir yeri, bir yerde yayınlanan, piyasaya sürülen veya yayınlanan yayınlanmış bir gösterim olan bir gösterimle ilişkilendirir. @tr
definition: Correla un luogo a una manifestazione è che una manifestazione non pubblicata che è incisa, fabbricata, costruita, etc. in un luogo. @it
definition: Hozzákapcsol egy helyet egy kiadott megjelenési formához, amelyet egy bizonyos helyen adnak ki, bocsájtanak ki vagy jelentetnek meg. @hu
definition: Liittää paikan julkaistuun manifestaatioon, joka on kustannettu, julkaistu, ilmestynyt tms. paikassa. @fi
definition: Met un lieu en relation avec une manifestation publiée qui est publiée, mise à disposition ou éditée dans un lieu. @fr
definition: Relaciona un lloc amb una manifestació que és una manifestació publicada que es publica, es posa en circulació o s’emet en un lloc. @ca
definition: Relateert een plaats aan een manifestatie die een gepubliceerde manifestatie is die gepubliceerd, uitgebracht of uitgevaardigd is in een plaats. @nl
definition: Relaterer et sted til en manifestasjon som er en publisert manifestasjon som er publisert, tilgjengeliggjort eller utgitt på et sted. @no
definition: Relaterer et sted til en manifestation, som er en publiceret manifestation, som er publiceret, frigivet eller udgivet et sted. @da
definition: Relates a place to a manifestation that is a published manifestation that is published, released, or issued in a place.
definition: Sasaista vietu ar manifestāciju, kas ir publicēta manifestācija, kas ir publicēta, izlaista, izdota norādītā vietā. @lv
definition: Seostab koha avaldatud kehastusega, mis on selles kohas avaldatud, välja lastud või välja antud. @et
definition: Setzt ein Geografikum in Beziehung zu einer veröffentlichten Manifestation, die an einem Ort veröffentlicht, freigegeben oder herausgegeben wird. @de
definition: يربط بين مكان وتجسيدة منشورة نُشرت، أو أُصدرت في مكان. @ar
definition: 将一个地点与作为一种出版载体表现并在一个地点出版、发布、发行的一种载体表现关联起来。 @zh-hans

is place governed by
has element type: 2
toolkit definition: A corporate body who is a government of a place.
toolkit definition: Başka bir hükümet tarafından çıkarılan bir yasa, yönetmelik vb. tarafından yönetilen bir yargı yetkisinin hükümeti olan bir tüzel kişilik. @tr
toolkit definition: Collectivité qui constitue un gouvernement d’un lieu. @fr
toolkit definition: Een corporatie die een overheid is van een jurisdictie geregeerd door een wet, regel etc. die uitgevaardigd was door een andere overheid. @nl
toolkit definition: Egy igazgatási szerv testület, amely egy másik igazgatási szerv által hozott törvény, rendelet stb. hatálya alá tartozik. @hu
toolkit definition: Eine Körperschaft, bei der es sich um die Regierung einer Gebietskörperschaft handelt, die durch ein Gesetz, eine Verordnung und so weiter geregelt wird, das/die von einer anderen Regierung erlassen wurde. @de
toolkit definition: En korporasjon som er en myndighet for en jurisdiksjon som styres av en lov, vedtekt etc. som ble vedtatt av en annen myndighet. @no
toolkit definition: Ente che è una giurisdizione di un ente che è il governo di una giurisdizione governata da una legge, regolamenti, etc, che è stata promulgata da un altro governo. @it
toolkit definition: Entitat corporativa que és un govern d’un lloc. @ca
toolkit definition: Institūcija, kas pārvalda noteiktu teritoriju, balstoties likumos, noteikumos u.tml., kurus pieņēmusi cita jurisdikcija. @lv
toolkit definition: Korporation, som er en jurisdiktions myndighed, og som styres af en lov, forordning, etc., som blev vedtaget af en anden myndighed. @da
toolkit definition: Võimkonda valitsev asutus, mis valitseb seaduste, määruste vms alusel, mille on kehtestanud teine valitsus. @et
toolkit definition: Yhteisö, joka on hallintoalueen julkishallinnollinen yhteisö, jota toisen julkishallinnollisen yhteisön säätämät lait, asetukset tms. ohjaavat. @fi
toolkit definition: هيئة عبارة عن حكومة ولاية قضائية تخضع لقانون، أو لائحة، إلخ، سنتها حكومة أخرى. @ar
toolkit definition: 作为根据另一个政府所颁布的法律、法规等管理的一个辖区的一个政府的一个团体 @zh-hans
toolkit label: Geregelte Gebietskörperschaft von @de
toolkit label: giurisdizione governata da @it
toolkit label: joghatósága: @hu
toolkit label: jurisdictie geregeerd door @nl
toolkit label: jurisdikcijas pārvaldītājs @lv
toolkit label: jurisdiksjon som styres for @no
toolkit label: jurisdiktion underlagt af @da
toolkit label: lieu régi par @fr
toolkit label: lloc regit per @ca
toolkit label: place governed by
toolkit label: soveltava lainkäyttöalue yhteisölle @fi
toolkit label: võimkond valitsevale asutusele @et
toolkit label: yargı yetkisine @tr
toolkit label: ولاية قضائية خاضعة لـ @ar
toolkit label: ……所管理的辖区 @zh-hans
has subproperty: P70051
lexical alias: placeGovernedBy.en
status: Published
type: Property
domain: C10009
label: er jurisdiksjon som styres for @no
label: er jurisdiktion underlagt af @da
label: est un lieu régi par @fr
label: ir jurisdikcijas pārvaldītājs @lv
label: is jurisdictie geregeerd door @nl
label: ist geregelte Gebietskörperschaft von @de
label: joghatósága a következőnek: @hu
label: soveltava lainkäyttöalue yhteisölle @fi
label: võimkond valitsevale asutusele @et
label: yönetilen yargı alanıdır @tr
label: è giurisdizione governata da @it
label: és lloc regit per @ca
label: هو نطاق جغرافي خاضع لـ @ar
label: 是……所管理的辖区 @zh-hans
sub property of: has related corporate body of place
alternative label: juridiction régie de @fr
alternative label: jurisdicció regida de @ca
alternative label: jurisdiction governed of
definition: Bir yeri, başka bir hükümet tarafından çıkarılan bir yasa, yönetmelik vb. tarafından yönetilen bir yargı yetkisine sahip bir hükümeti olan bir tüzel kişiyle ilişkilendirir. @tr
definition: Correla un luogo che è una giurisdizione di un ente che è il governo di una giurisdizione governata da una legge, regolamenti, etc, che è stata promulgata da un altro governo. @it
definition: Hozzákapcsol egy helyet egy igazgatási szerv testülethez, amely egy másik igazgatási szerv által hozott törvény, rendelet stb. hatálya alá tartozik. @hu
definition: Liittää paikan yhteisöön, joka on hallintoalueen julkishallinnollinen yhteisö, jota toisen julkishallinnollisen yhteisön säätämät lait, asetukset tms. ohjaavat. @fi
definition: Met un lieu en relation avec une collectivité qui constitue un gouvernement d’un lieu. @fr
definition: Relaciona un lloc amb una entitat corporativa que és un govern d’un lloc. @ca
definition: Relateert een plaats die een jurisdictie is aan een corporatie die een overheid is van een jurisdictie geregeerd door een wet, regel etc. die uitgevaardigd was door een andere overheid. @nl
definition: Relaterer et sted til en korporasjon som er en myndighet for en jurisdiksjon som styres av en lov, vedtekt etc. som ble vedtatt av en annen myndighet. @no
definition: Relaterer et sted, som er en jurisdiktion, til en korporation, som er en jurisdiktions myndighed, og som styres af en lov, forordning, etc., som blev vedtaget af en anden myndighed. @da
definition: Relates a place to a corporate body who is a government of a place.
definition: Sasaista vietu ar institūciju, kas pārvalda noteiktu teritoriju, balstoties likumos, noteikumos u.tml., kurus pieņēmusi cita jurisdikcija. @lv
definition: Seostab võimkonnaks oleva koha võimkonda valitseva asutusega, mis valitseb seaduste, määruste vms alusel, mille on kehtestanud teine valitsus. @et
definition: Setzt eine Gebietskörperschaft in Beziehung zu einer Körperschaft, bei der es sich um die Regierung einer Gebietskörperschaft handelt, die durch ein Gesetz, eine Verordnung und so weiter geregelt wird, das/die von einer anderen Regierung erlassen wurde. @de
definition: يربط بين مكان وهيئة عبارة عن حكومة ولاية قضائية تخضع لقانون، أو لائحة، إلخ، سنتها حكومة أخرى. @ar
definition: 将一个地点与作为根据另一个政府所颁布的法律、法规等管理的一个辖区的一个政府的一个团体关联起来。 @zh-hans

is place of capture of representative expression of
has element type: 2
toolkit definition: A work that has content of a representative expression that is recorded, filmed, etc., in a place.
toolkit definition: Bir yerde kaydedilmiş, filme alınmış vb. temsili anlatım içeriğine sahip eser. @tr
toolkit definition: Darbs, kam ir reprezentatīvās izteiksmes satura ierakstīšanas, filmēšanas u.tml. vieta. @lv
toolkit definition: Een werk dat content heeft van een representatieve expressie die is opgenomen, gefilmd etc. in een plaats. @nl
toolkit definition: Egy mű, amely reprezentatív kifejezési formájának tartalmát egy bizonyos helyen rögzítették, filmezték stb. @hu
toolkit definition: Ein Werk mit dem Inhalt einer repräsentativen Expression, der an einem Ort aufgenommen, gefilmt und so weiter wird. @de
toolkit definition: Et verk som har innhold av et representativt uttrykk som er tatt opp, filmet etc. på et sted. @no
toolkit definition: Obra que té el contingut d’una expressió representativa que s’enregistra, es filma, etc. en un lloc. @ca
toolkit definition: Opera che ha il contenuto di un'espressione rappresentativa che è stata registrata, filmata, etc. in un luogo. @it
toolkit definition: Teos, johon sisältyvän edustavan ekspression sisältö on äänitetty, kuvauttu tms. paikassa. @fi
toolkit definition: Teos, mille sisu esindav iseloomulik väljendus on selles kohas salvestatud, filmitud vms. @et
toolkit definition: Værk, som har et repræsentativt udtryks indhold, som er indspillet, filmet, etc. et sted. @da
toolkit definition: Œuvre qui possède un contenu d’une expression représentative qui est enregistré, filmé, etc. dans un lieu. @fr
toolkit definition: عمل له محتوى تعبيرة ممثِلة سُجلت، وصُورت، إلخ، في مكان. @ar
toolkit definition: 有代表性内容表达并在一个地点录制、拍摄等的一种作品 @zh-hans
toolkit label: Aufzeichnungsort einer repräsentativen Expression von @de
toolkit label: Hozzákapcsol egy helyet egy műhöz, amely reprezentatív kifejezési formájának tartalmát egy bizonyos helyen rögzítették, filmezték stb. @hu
toolkit label: innspillingssted for representativt uttrykk av @no
toolkit label: ir tveršanas vieta reprezentatīvajai izteiksmei @lv
toolkit label: iseloomuliku väljenduse jäädvustamise koht teoses @et
toolkit label: lieu de captation d’une expression représentative de @fr
toolkit label: lloc de captura d’una expressió representativa de @ca
toolkit label: luogo di cattura dell'espressione rappresentativa di @it
toolkit label: plaats van vastleggen van representatieve expressie van @nl
toolkit label: place of capture of representative expression of
toolkit label: sted for indspilning af repræsentativt udtryk af @da
toolkit label: tallennuspaikka edustavalle ekspressiolle @fi
toolkit label: temsili anlatımın çekime alındığı yer @tr
toolkit label: مكان لالتقاط تعبيرة ممثِلة لـ @ar
toolkit label: ……的代表性内容表达的摄录的地点 @zh-hans
has subproperty: P70052
lexical alias: placeOfCaptureOfRepresentativeExpressionOf.en
status: Published
type: Property
domain: C10009
label: er innspillingssted for representativt uttrykk av @no
label: er sted for indspilning af repræsentativt udtryk af @da
label: est un lieu de captation d’une expression représentative de @fr
label: ir tveršanas vieta reprezentatīvajai izteiksmei @lv
label: is plaats van vastleggen van representatieve expressie van @nl
label: iseloomuliku väljenduse jäädvustamise koht teoses @et
label: ist Aufzeichnungsort einer repräsentativer Expression von @de
label: reprezentatív kifejezési formájának rögzítési helye a következő: @hu
label: tallennuspaikka edustavalle ekspressiolle @fi
label: temsili anlatımın kayıt yeridir @tr
label: è luogo di cattura dell'espressione rappresentativa di @it
label: és lloc de captura d’una expressió representativa de @ca
label: هو مكان لالتقاط تعبيرة ممثِلة لـ @ar
label: 是……的代表性内容表达的摄录的地点 @zh-hans
sub property of: has related work of place
definition: Bir yeri, bir yerde kaydedilmiş, filme alınmış vb. temsili bir ifade içeriğine sahip bir eserle ilişkilendirir. @tr
definition: Correla un luogo a un'opera che ha il contenuto di un'espressione rappresentativa che è stata registrata, filmata, etc. in un luogo. @it
definition: Liittää paikan teokseen, johon sisältyvän edustavan ekspression sisältö on äänitetty, kuvauttu tms. paikassa. @fi
definition: Met un lieu en relation avec une œuvre qui possède un contenu d’une expression représentative qui est enregistré, filmé, etc. dans un lieu. @fr
definition: Relaciona un lloc amb una obra que té el contingut d’una expressió representativa que s’enregistra, es filma, etc. en un lloc. @ca
definition: Relateert een plaats aan een werk dat content heeft van een representatieve expressie die is opgenomen, gefilmd etc. in een plaats. @nl
definition: Relaterer et sted til et verk som har innhold av et representativt uttrykk som er tatt opp, filmet etc. på et sted. @no
definition: Relaterer et sted til et værk, som har et repræsentativt udtryks indhold, som er indspillet, filmet, etc. et sted. @da
definition: Relates a place to a work that has content of a representative expression that is recorded, filmed, etc., in a place.
definition: Sasaista vietu ar darbu, kam ir reprezentatīvās izteiksmes satura ierakstīšanas, filmēšanas u.tml. vieta. @lv
definition: Seostab koha teosega, mille sisu esindav iseloomulik väljendus on selles kohas salvestatud, filmitud vms. @et
definition: Setzt ein Geografikum in Beziehung zu einem Werk mit dem Inhalt einer repräsentativen Expression, der an einem Ort aufgenommen, gefilmt und so weiter wird. @de
definition: reprezentatív kifejezési forma rögzítési helye a következő: @hu
definition: يربط بين مكان وعمل له محتوى تعبيرة ممثِلة سُجلت، وصُورت، إلخ، في مكان. @ar
definition: 将一个地点与有代表性内容表达并在一个地点录制、拍摄等的一种作品关联起来。 @zh-hans

has related entity of place
has element type: 1
toolkit definition: An entity that is associated with a place.
toolkit definition: Bir yerle bağlantılı olan bir varlık. @tr
toolkit definition: Een entiteit die geassocieerd is met een plaats. @nl
toolkit definition: Egy entitás, amelyet egy helyhez társítanak. @hu
toolkit definition: Eine Entität, die mit einem Geografikum in Verbindung steht. @de
toolkit definition: En entitet som forbindes med et sted. @no
toolkit definition: Entitat que s’associa amb un lloc. @ca
toolkit definition: Entiteetti, johon paikka liittyy. @fi
toolkit definition: Entitet, som er knyttet til et sted. @da
toolkit definition: Entità associata a un luogo. @it
toolkit definition: Entité qui est associée à un lieu. @fr
toolkit definition: Entīte, kas saistīta ar vietu. @lv
toolkit definition: Kohaga seotud olem. @et
toolkit definition: كيان مرتبط بمكان. @ar
toolkit definition: 和一个地点有关的一个实体 @zh-hans
toolkit label: Yerin ilişkili olduğu varlık @tr
toolkit label: ar vietu saistītā entīte @lv
toolkit label: entitat relacionada amb un lloc @ca
toolkit label: entitet relateret til sted @da
toolkit label: entità correlata di luogo @it
toolkit label: entité en relation avec un lieu @fr
toolkit label: gerelateerde entiteit van plaats @nl
toolkit label: hely kapcsolódó entitása: @hu
toolkit label: kohaga seotud olem @et
toolkit label: mit Geografikum in Beziehung stehende Entität @de
toolkit label: paikkaan liittyvä entiteetti @fi
toolkit label: related entity of place
toolkit label: relatert entitet for sted @no
toolkit label: له كيان مرتبط بمكان @ar
toolkit label: 地点的相关实体 @zh-hans
has subproperty: has related RDA entity of place
has subproperty: P70053
lexical alias: relatedEntityOfPlace.en
status: Published
type: Property
domain: C10009
label: a pour entité en relation avec un lieu @fr
label: ar vietu saistītā entīte @lv
label: ha come entità correlata di luogo @it
label: har entitet relateret til sted @da
label: har relatert entitet for sted @no
label: hat mit Geografikum in Beziehung stehende Entität @de
label: heeft gerelateerde entiteit van plaats @nl
label: hely kapcsolódó entitása a következő: @hu
label: kohaga seotud olem @et
label: paikkaan liittyvä entiteetti @fi
label: té com a entitat relacionada amb un lloc @ca
label: yerin ilgili varlığı ile ilişkilidir @tr
label: له كيان مرتبط بمكان @ar
label: 有地点的相关实体 @zh-hans
sub property of: P00028
definition: Bir yeri, bir yerle bağlantılı olan bir varlıkla ilişkilendirir. @tr
definition: Correla un luogo con un'entità associata a un luogo. @it
definition: Hozzákapcsol egy helyet egy entitáshoz, amelyet egy helyhez társítanak. @hu
definition: Liittää paikan entiteettiin, johon paikka liittyy. @fi
definition: Met un lieu en relation avec une entité qui est associée à un lieu. @fr
definition: Relaciona un lloc amb una entitat que s’associa amb un lloc. @ca
definition: Relateert een plaats aan een entiteit die geassocieerd is met een plaats. @nl
definition: Relaterer et sted til en entitet som forbindes med et sted. @no
definition: Relaterer et sted til en entitet, som er knyttet til et sted. @da
definition: Relates a place to an entity that is associated with a place.
definition: Sasaista vietu ar entīti, kas saistīta ar vietu. @lv
definition: Seostab koha kohaga seotud olemiga. @et
definition: Setzt ein Geografikum in Beziehung zu einer Entität, die mit einem Geografikum in Verbindung steht. @de
definition: يربط بين مكان وكيان مرتبط بمكان. @ar
definition: 将一个地点与和一个地点有关的一个实体关联起来。 @zh-hans

is place described by
has element type: 2
toolkit definition: A work that is a description of a place.
toolkit definition: Bir yerin tanımı olan bir eser @tr
toolkit definition: Darbs, kurā aprakstīta konkrētā vieta. @lv
toolkit definition: Een werk dat een plaats beschrijft. @nl
toolkit definition: Egy mű, amely egy helyet ír le. @hu
toolkit definition: Ein Werk, das ein Geografikum beschreibt. @de
toolkit definition: Et verk som beskriver et sted. @no
toolkit definition: Obra que és una descripció d’un lloc. @ca
toolkit definition: Opera che descrive un luogo. @it
toolkit definition: Teos, joka kuvaa paikkaa. @fi
toolkit definition: Teos, milles kirjeldatakse kohta. @et
toolkit definition: Værk, som beskriver et sted. @da
toolkit definition: Œuvre qui consiste en une description d’un lieu. @fr
toolkit definition: عمل يصف مكان. @ar
toolkit definition: 作为一个地点之描述的一种作品 @zh-hans
toolkit label: Geografikum beschrieben in @de
toolkit label: hely leírva a következőben: @hu
toolkit label: koha kirjeldus @et
toolkit label: lieu décrit par @fr
toolkit label: lloc descrit per @ca
toolkit label: luogo descritto in @it
toolkit label: paikkaa kuvaava teos @fi
toolkit label: plaats beschreven in @nl
toolkit label: place described by
toolkit label: sted beskrevet i @da
toolkit label: sted beskrevet i @no
toolkit label: tarafından tanımlanan yer @tr
toolkit label: vietas apraksts @lv
toolkit label: مكان موصوف في @ar
toolkit label: 被……描述的一个地点 @zh-hans
has subproperty: is place described with metadata by
has subproperty: P70054
lexical alias: placeDescribedBy.en
status: Published
type: Property
domain: C10009
label: er sted beskrevet i @da
label: est un lieu décrit par @fr
label: hely leírva a következőben: @hu
label: ir vietas apraksts @lv
label: is plaats beschreven in @nl
label: ist Geografikum beschrieben in @de
label: koha kirjeldus @et
label: paikkaa kuvaava teos @fi
label: tarafından tanımlanmış yerdir @tr
label: è luogo descritto in @it
label: és lloc descrit per @ca
label: هو مكان موصوف في @ar
label: 是被……描述的一个地点 @zh-hans
sub property of: is subject place of
alternative label: Tanımlanan yer @tr
alternative label: lieu décrit dans @fr
alternative label: lloc descrit en @ca
alternative label: paikkaa kuvattu teoksessa @fi
alternative label: place described in
alternative label: 被描述于……的地点 @zh-hans
definition: Bir yeri, bir yerin tanımı olan bir eserle ilişkilendirir. @tr
definition: Correla un luogo con un'opera che descrive un luogo. @it
definition: Hozzákapcsol egy helyet egy műhöz, amely egy helyet ír le. @hu
definition: Liittää paikan teokseen, joka kuvaa paikkaa. @fi
definition: Met un lieu en relation avec une œuvre qui consiste en une description d’un lieu. @fr
definition: Relaciona un lloc amb una obra que és una descripció d’un lloc. @ca
definition: Relateert een plaats aan een werk dat een plaats beschrijft. @nl
definition: Relaterer et sted til et verk som beskriver et sted. @no
definition: Relaterer et sted til et værk, som beskriver et sted. @da
definition: Relates a place to a work that is a description of a place.
definition: Sasaista vietu ar darbu, kurā aprakstīta konkrētā vieta. @lv
definition: Seostab koha teosega, milles kirjeldatakse kohta. @et
definition: Setzt ein Geografikum in Beziehung zu einem Werk, das ein Geografikum beschreibt. @de
definition: يربط بين مكان وعمل يصف مكان. @ar
definition: 将一个地点与作为一个地点之描述的一种作品关联起来。 @zh-hans

is location of collection of
has element type: 2
toolkit definition: A manifestation of a collection work that is stored in a place.
toolkit definition: Bir yerde saklanan bir koleksiyon eserinin gösterimi @tr
toolkit definition: Kokoelmateoksen manifestaatio, jota säilytetään paikassa. @fi
toolkit definition: Manifestació d’una obra de col·lecció de recursos que s’emmagatzema en un lloc. @ca
toolkit definition: Manifestation d’une collection de ressources qui est conservée dans un lieu. @fr
toolkit definition: 在一个地点储存的一种收藏作品的一种载体表现 @zh-hans
toolkit label: emplacement d’une collection de ressources de @fr
toolkit label: koleksiyon konumu @tr
toolkit label: localització de col·lecció de recursos de @ca
toolkit label: location of collection of
toolkit label: sijainti kokoelmalle @fi
toolkit label: ……的收藏的位置 @zh-hans
has subproperty: P70055
lexical alias: locationOfCollectionOf.en
status: Published
type: Property
domain: C10009
label: est un emplacement d’une collection de ressources de @fr
label: koleksiyonunun konumudur @tr
label: sijainti kokoelmalle @fi
label: és localització de col·lecció de recursos de @ca
label: 是……的收藏的位置 @zh-hans
sub property of: has related manifestation of place
definition: Bir yeri, bir yerde saklanan bir koleksiyon eserinin gösterimiyle ilişkilendirir. @tr
definition: Liittää paikan kokoelmateoksen manifestaatioon, jota säilytetään paikassa. @fi
definition: Met un lieu en relation avec une manifestation d’une collection de ressources qui est conservée dans un lieu. @fr
definition: Relaciona un lloc amb una manifestació d’una obra de col·lecció de recursos que s’emmagatzema en un lloc. @ca
definition: Relates a place to a manifestation of a collection work that is stored in a place.
definition: 将一个地点与在一个地点储存的一种收藏作品的一种载体表现关联起来。 @zh-hans

is location of item of
has element type: 2
toolkit definition: An item that is held, stored, or made available for access in a place.
toolkit definition: Bir yerde tutulan, depolanan veya erişime açık hale getirilen bir kopya. @tr
toolkit definition: Item qui est conservé, entreposé ou rendu accessible dans un lieu. @fr
toolkit definition: Kappale, joka säilytetään tai asetetaan saataville paikassa. @fi
toolkit definition: Ítem que es aplegat, emmagatzemat o és fet disponible per a l’accés en un lloc. @ca
toolkit definition: 在一个地点收藏、储存或提供获取的一个单件 @zh-hans
toolkit label: emplacement d’un item de @fr
toolkit label: kopyanın konumu @tr
toolkit label: localització d’ítem de @ca
toolkit label: location of item of
toolkit label: sijainti kappaleelle @fi
toolkit label: ……的单件的位置 @zh-hans
has subproperty: P70056
lexical alias: locationOfItemOf.en
status: Published
type: Property
domain: C10009
label: est un emplacement d’un item de @fr
label: kopyasının konumudur @tr
label: sijainti kappaleelle @fi
label: és localització d’ítem de @ca
label: 是……的单件的位置 @zh-hans
sub property of: has related item of place
definition: Bir yeri, bir yerde tutulan, depolanan veya erişime açık hale getirilen bir kopyayla ilişkilendirir. @tr
definition: Liittää paikan kappaleeseen, joka säilytetään tai asetetaan saataville paikassa. @fi
definition: Met un lieu en relation avec un tem qui est conservé, entreposé ou rendu accessible dans un lieu. @fr
definition: Relaciona un lloc amb un ítem que es aplegat, emmagatzemat o és fet disponible per a l’accés en un lloc. @ca
definition: Relates a place to an item that is held, stored, or made available for access in a place.
definition: 将一个地点与在一个地点收藏、储存或提供获取的一个单件关联起来。 @zh-hans

is place described with metadata by
has element type: 2
toolkit definition: A work that is a metadata work for a place.
toolkit definition: Bir yer için üstveri çalışması olan bir eser. @tr
toolkit definition: Obra que és una obra de metadades per a un lloc. @ca
toolkit definition: Teos, joka on paikan metatietoteos. @fi
toolkit definition: Œuvre qui consiste en une œuvre de métadonnées pour un lieu. @fr
toolkit definition: 作为一个地点之元数据描述的一种作品 @zh-hans
toolkit label: lieu décrit avec des métadonnées par @fr
toolkit label: lloc descrit amb metadades per @ca
toolkit label: paikkaa metatiedoilla kuvaileva teos @fi
toolkit label: place described with metadata by
toolkit label: tarafından metadatalarla tanımlanan yer @tr
toolkit label: 被……用元数据描述的地点 @zh-hans
has subproperty: P70057
lexical alias: placeDescribedWithMetadataBy.en
status: Published
type: Property
domain: C10009
label: est un lieu décrit avec des métadonnées par @fr
label: paikkaa metatiedoilla kuvaileva teos @fi
label: tarafından üstveri ile tanımlanmış yerdir @tr
label: és lloc descrit amb metadades per @ca
label: 是被……用元数据描述的地点 @zh-hans
sub property of: is place described by
definition: Bir yeri, bir yer için üst veri çalışması olan bir eserle ilişkilendirir. @tr
definition: Liittää paikan teokseen, joka on paikan metatietoteos. @fi
definition: Met un lieu en relation avec une œuvre qui consiste en une œuvre de métadonnées pour un lieu. @fr
definition: Relaciona un lloc amb una obra que és una obra de metadades per a un lloc. @ca
definition: Relates a place to a work that is a metadata work for a place.
definition: 将一个地点与作为一个地点之元数据描述的一种作品关联起来。 @zh-hans