Timespan properties
type: Ontology
description: Properties that represent the attribute and relationship elements of the RDA Timespan entity.
preferred namespace prefix: rdat
rights: Copyright © 2020 American Library Association, Canadian Federation of Library Associations, and CILIP: Chartered Institute of Library and Information Professionals
licence: deed.en US
creator: RDA Steering Committee
contributor: RSC Technical Working Group
publisher: ALA Digital Reference
type: http://rdaregistry.info/termList/RDALinkedDataWork/1003
issued: 2016-12-18
title: RDA:n ajanjakson ominaisuudet @fi
description: RDA-elementeistä johdetut ominaisuudet RDA:n ajanjakson määrittelyjoukossa. @fi
version info: v5.4.4
modified: 2025-06-18

has access point for timespan
status: Published
type: Property
lexical alias: accessPointForTimespan.en
definition: Relates a timespan to a nomen that is an appellation of timespan in natural language that is taken from a vocabulary encoding scheme or is constructed using a string encoding scheme.
domain: C10010
toolkit label: access point for timespan
toolkit definition: A nomen that is an appellation of timespan in natural language that is taken from a vocabulary encoding scheme or is constructed using a string encoding scheme.
sub property of: has appellation of timespan
has element type: 3
sub property of: P00016
label: ajanjakson hakutieto @fi
definition: Liittää ajanjakson nomeniin, joka on luonnollisen kielen mukainen ajanjakson nimitys, joka on otettu sanaston merkintäjärjestelmästä tai muodostettu merkkijonon merkintäjärjestelmää käyttäen. @fi
toolkit label: ajanjakson hakutieto @fi
toolkit definition: Nomen, joka on luonnollisen kielen mukainen ajanjakson nimitys, joka on otettu sanaston merkintäjärjestelmästä tai muodostettu merkkijonon merkintäjärjestelmää käyttäen. @fi
label: har søkeinngang for tidsrom @no
definition: Relaterer et tidsrom til en betegnelse for tidsrom på et naturlig språk som er hentet fra et kodeskjema for vokabular eller er laget ved hjelp av et kodeskjema for syntaks. @no
toolkit label: søkeinngang for tidsrom @no
toolkit definition: En betegnelse for tidsrom på et naturlig språk som er hentet fra et kodeskjema for vokabular eller er laget ved hjelp av et kodeskjema for syntaks. @no
label: a pour point d’accès d’un laps de temps @fr
definition: Met un laps de temps en relation avec un nomen qui est une appellation de laps de temps en langage naturel provenant d’un schéma d’encodage de vocabulaire ou construite à l’aide d’un schéma d’encodage de chaînes. @fr
toolkit label: point d’accès d’un laps de temps @fr
toolkit definition: Nomen qui est une appellation de laps de temps en langage naturel provenant d’un schéma d’encodage de vocabulaire ou construite à l’aide d’un schéma d’encodage de chaînes. @fr
label: heeft ingang voor tijdspanne @nl
definition: Relateert een tijdspanne aan een nomen dat is een benaming van tijdspanne in natuurlijke taal die ontleend is aan een vocabulair coderingsschema of gevormd is volgens een string coderingsschema. @nl
toolkit label: ingang voor tijdspanne @nl
toolkit definition: Een nomen dat is een benaming van tijdspanne in natuurlijke taal die ontleend is aan een vocabulair coderingsschema of gevormd is volgens een string coderingsschema. @nl
label: لها نقطة وصول لفترة زمنية @ar
definition: تربط بين فترة زمنية واسم تعريفي فترة زمنية في لغة طبيعية مأخوذة من خطة ترميز مفردات أو مبنية باستخدام خطة ترميز سلسلة تمثيلات. @ar
toolkit label: نقطة وصول لفترة زمنية @ar
toolkit definition: تسمية عبارة عن اسم تعريفي لفترة زمنية في لغة طبيعية مأخوذة من خطة ترميز مصطلحات أو مهيكلة باستخدام خطة ترميز سلسلة تمثيلات. @ar
label: té com a punt d’accés d’interval de temps @ca
definition: Relaciona un interval de temps amb un nomen que és una apel·lació d’interval de temps en llenguatge natural que s’obté d’un esquema de codificació de vocabulari o s’elabora usant un esquema de codificació de cadenes. @ca
toolkit label: punt d’accés d’interval de temps @ca
toolkit definition: Nomen que és una apel·lació d’interval de temps en llenguatge natural que s’obté d’un esquema de codificació de vocabulari o s’elabora usant un esquema de codificació de cadenes. @ca
label: har søgeindgang for tidsperiode @da
definition: Relaterer en tidsperiode til en benævnelse på tidsperiode på normalsprog, som er taget fra et vokabularkodningsskema eller er konstrueret ved hjælp af et strengkodningsskema. @da
toolkit label: søgeindgang for tidsperiode @da
toolkit definition: Benævnelse på tidsperiode på normalsprog, som er taget fra et vokabularkodningsskema eller er konstrueret ved hjælp af et strengkodningsskema. @da
label: ajavahemiku otsielement @et
definition: Seostab ajavahemiku ajavahemiku nimetusega loomulikus keeles, mis on võetud leksikaalsest märkimissüsteemist või moodustatud stringilise märkimissüsteemi alusel. @et
toolkit label: ajavahemiku otsielement @et
toolkit definition: Ajavahemiku nimetus loomulikus keeles, mis on võetud leksikaalsest märkimissüsteemist või moodustatud stringilise märkimissüsteemi alusel. @et
label: hat Sucheinstieg für einen Zeitraum @de
definition: Setzt einen Zeitraum in Beziehung zu einer Bezeichnung für einen Zeitraum in natürlicher Sprache, die einem Vocabulary Encoding Scheme entnommen oder mit einem String Encoding Scheme konstruiert wird. @de
toolkit label: Sucheinstieg für einen Zeitraum @de
toolkit definition: Eine Bezeichnung für einen Zeitraum in natürlicher Sprache, die einem Vocabulary Encoding Scheme entnommen oder mit einem String Encoding Scheme konstruiert wird. @de
label: hozzáférési pontja időtartamhoz a következő: @hu
definition: Hozzákapcsol egy időtartamot egy időtartam szótárkódolási sémából vett vagy karakterlánc-kódolási séma felhasználásával konstruált természetes nyelvi megnevezéshez. @hu
toolkit label: időtartam szerinti hozzáférési pontja @hu
toolkit definition: Egy nomen, amely egy időtartam szótárkódolási sémából vett vagy karakterlánc-kódolási séma felhasználásával konstruált természetes nyelvi megnevezés. @hu
label: ha come punto d'accesso per arco di tempo @it
definition: Correla un arco di tempo che ha una denominazione di arco di tempo nel linguaggio naturale che è tratta da uno schema di codifica di vocabolario o è costruita usando uno schema di codifica di stringa. @it
toolkit label: punto d'accesso per arco di tempo @it
toolkit definition: Denominazione di arco di tempo nel linguaggio naturale che è tratta da uno schema di codifica di vocabolario o è costruita usando uno schema di codifica di stringa. @it
label: laikposma pamatforma @lv
definition: Sasaista laikposmu ar laikposma vārdu/nosaukumu dabiskā valodā, kas ņemts no shēmas kontrolētu vārdnīcu kodēšanai vai tiek konstruēts, izmantojot virknes kodēšanas shēmu. @lv
toolkit label: laikposma pamatforma @lv
toolkit definition: Laikposma vārds/nosaukums dabiskā valodā, kas ņemts no shēmas kontrolētu vārdnīcu kodēšanai vai tiek konstruēts, izmantojot virknes kodēšanas shēmu. @lv
label: 有时间段的检索点 @zh-hans
definition: 将一个时间段与取自一个词表编码体系或者用一个串编码体系构建的一个时间段用自然语言的称谓关联起来。 @zh-hans
toolkit label: 时间段的检索点 @zh-hans
toolkit definition: 作为取自一个词表编码体系或者用一个串编码体系构建的一个时间段用自然语言的称谓的一个命名 @zh-hans
has subproperty: has authorized access point for timespan
has subproperty: has variant access point for timespan
has subproperty: P70015
label: zaman aralığı için erişim noktası ile ilişkilidir @tr
definition: Bir zaman aralığını, bir kelime kodlama şemasından alınan veya bir dizi kodlama şeması kullanılarak oluşturulan doğal dildeki bir zaman aralığının unvanıyla ilişkilendirir. @tr
toolkit label: Zaman aralığı erişim noktası @tr
toolkit definition: Bir kelime kodlama şemasından alınan veya bir dizi kodlama şeması kullanılarak oluşturulan, doğal dilde zaman aralığının bir unvanı olan isim. @tr

has appellation of timespan
status: Published
type: Property
lexical alias: appellationOfTimespan.en
definition: Relates a timespan to a nomen that is used within a given scheme or context to refer to a timespan.
domain: C10010
toolkit label: appellation of timespan
toolkit definition: A nomen that is used within a given scheme or context to refer to a timespan.
sub property of: has related nomen of timespan
has element type: 3
sub property of: P00017
label: ajanjakson nimitys @fi
definition: Liittää ajanjakson nomeniin, jota käytetään viitattaessa ajanjaksoon tietyssä järjestelmässä tai kontekstissä. @fi
toolkit label: ajanjakson nimitys @fi
toolkit definition: Nomen, jota käytetään viitattaessa ajanjaksoon tietyssä järjestelmässä tai kontekstissä. @fi
label: har betegnelse for tidsrom @no
definition: Relaterer et tidsrom til et nomen fra et bestemt skjema eller kontekst som brukes til referere til et tidsrom. @no
toolkit label: betegnelse for tidsrom @no
toolkit definition: Et nomen fra et bestemt skjema eller kontekst som brukes til referere til et tidsrom. @no
label: a pour appellation de laps de temps @fr
definition: Met un laps de temps en relation avec un nomen qui est utilisé à l’intérieur d’un schéma ou d’un contexte donnés pour désigner un laps de temps. @fr
toolkit label: appellation de laps de temps @fr
toolkit definition: Nomen qui est utilisé à l’intérieur d’un schéma ou d’un contexte donnés pour désigner un laps de temps. @fr
label: heeft benaming voor tijdspanne @nl
definition: Relateert een tijdspanne aan een nomen dat gebruikt is binnen een bepaald schema of context om te verwijzen naar een tijdspanne. @nl
toolkit label: benaming voor tijdspanne @nl
toolkit definition: Een nomen dat is gebruikt binnen een bepaald schema of context om te verwijzen naar een tijdspanne. @nl
label: لها اسم تعريفي لفترة زمنية @ar
definition: تربط بين فترة زمنية وتسمية مستخدمة ضمن خطة بعينها أو سياق بعينه للإشارة الى فترة زمنية. @ar
toolkit label: اسم تعريفي لفترة زمنية @ar
toolkit definition: تسمية مستخدمة ضمن خطة بعينها أو سياق بعينه للإشارة إلى فترة زمنية. @ar
label: té com a apel·lació d’interval de temps @ca
definition: Relaciona un interval de temps amb un nomen que s’usa en un esquema o un context determinat per referir-se a un interval de temps. @ca
toolkit label: apel·lació d’interval de temps @ca
toolkit definition: Nomen que s’usa en un esquema o un context determinat per referir-se a un interval de temps. @ca
label: har benævnelse på tidsperiode @da
definition: Relaterer en tidsperiode til et nomen, som anvendes inden for et givet skema eller kontekst for at henvise til en tidsperiode. @da
toolkit label: benævnelse på tidsperiode @da
toolkit definition: Nomen, som anvendes inden for et givet skema eller kontekst for at henvise til en tidsperiode. @da
label: ajavahemiku nimetus @et
definition: Seostab ajavahemiku nomen'iga, mida antud süsteemis või kontekstis kasutatakse ajavahemikule viitamiseks. @et
toolkit label: ajavahemiku nimetus @et
toolkit definition: Nomen, mida antud süsteemis või kontekstis kasutatakse ajavahemikule viitamiseks. @et
label: hat Bezeichnung für einen Zeitraum @de
definition: Setzt einen Zeitraum in Beziehung zu einem Nomen, das in einem bestimmten Schema oder Kontext verwendet wird, um einen Zeitraum zu referenzieren. @de
toolkit label: Bezeichnung für einen Zeitraum @de
toolkit definition: Ein Nomen, das in einem bestimmten Schema oder Kontext verwendet wird, um eine Familie zu referenzieren. @de
label: időtartam megnevezése a következő: @hu
definition: Hozzákapcsol egy időtartamot egy nomenhez, amelyet egy adott sémán vagy kontextuson belül használnak egy entitásra való hivatkozásra. @hu
toolkit label: időtartam megnevezése: @hu
toolkit definition: Egy nomen, amelyet egy adott sémán vagy kontextuson belül használnak egy entitásra való hivatkozásra. @hu
label: ha come denominazione di arco di tempo @it
definition: Correla un arco di tempo a un nomen usato in un dato schema o contesto per riferirsi a un arco di tempo. @it
toolkit label: denominazione di arco di tempo @it
toolkit definition: Nomen usato in un dato schema o contesto per riferirsi a un arco di tempo. @it
label: laikposma apzīmējums @lv
definition: Sasaista laikposmu ar nomenu, ko lieto konkrētajā sistēmā vai kontekstā, lai norādītu uz laikposmu. @lv
toolkit label: laikposma apzīmējums @lv
toolkit definition: Nomens, ko lieto konkrētajā sistēmā vai kontekstā, lai norādītu uz laikposmu. @lv
label: 有时间段的称谓 @zh-hans
definition: 将一个时间段与在一个指定的体系或语境中用于指称一个时间段的一个命名关联起来。 @zh-hans
toolkit label: 时间段的称谓 @zh-hans
toolkit definition: 在一个指定的体系或语境中用于指称一个时间段的一个命名 @zh-hans
has subproperty: has access point for timespan
has subproperty: has identifier for timespan
has subproperty: has name of timespan
has subproperty: P70016
label: zaman aralığının unvanı ile ilişkilidir @tr
definition: Bir zaman aralığını, belirli bir şema veya bağlam içindeki bir zaman aralığına atıfta bulunmak için kullanılan bir isimle ilişkilendirir. @tr
toolkit label: zaman aralığının unvanı @tr
toolkit definition: Belirli bir şema veya bağlam içinde bir zaman aralığına atıfta bulunmak için kullanılan bir isim. @tr

has authorized access point for timespan
status: Published
type: Property
lexical alias: authorizedAccessPointForTimespan.en
domain: C10010
toolkit label: authorized access point for timespan
sub property of: has access point for timespan
definition: Relates a timespan to a nomen that is an access point for timespan that is selected for preference in a specific vocabulary encoding scheme.
toolkit definition: A nomen that is an access point for timespan that is selected for preference in a specific vocabulary encoding scheme.
has element type: 3
sub property of: P00020
label: ajanjakson auktorisoitu hakutieto @fi
definition: Liittää ajanjakson nomeniin, joka on ajanjakson auktorisoitu hakutieto, joka on valittu ensisijaiseksi tietyssä sanaston merkintäjärjestelmässä. @fi
toolkit label: ajanjakson auktorisoitu hakutieto @fi
toolkit definition: Nomen, joka on ajanjakson auktorisoitu hakutieto, joka on valittu ensisijaiseksi tietyssä sanaston merkintäjärjestelmässä. @fi
label: har autorisert søkeinngang for tidsrom @no
definition: Relaterer et tidsrom til en søkeinngang for tidsrom som er valgt som preferanse i et bestemt kodeskjema for vokabular. @no
toolkit label: autorisert søkeinngang for tidsrom @no
toolkit definition: En søkeinngang for tidsrom som er valgt som preferanse i et bestemt kodeskjema for vokabular. @no
label: a pour point d’accès autorisé d’un laps de temps @fr
definition: Met un laps de temps en relation avec un nomen qui est un point d’accès d’un laps de temps faisant l’objet d’un choix privilégié dans un schéma d’encodage de vocabulaire spécifique. @fr
toolkit label: point d’accès autorisé d’un laps de temps @fr
toolkit definition: Nomen qui est un point d’accès d’un laps de temps faisant l’objet d’un choix privilégié dans un schéma d’encodage de vocabulaire spécifique. @fr
label: heeft geautoriseerde ingang voor tijdspanne @nl
definition: Relateert een tijdspanne aan een nomen dat is een ingang voor tijdspanne die als voorkeursterm geselecteerd is in een specifiek vocabulair coderingssysteem. @nl
toolkit label: geautoriseerde ingang voor tijdspanne @nl
toolkit definition: Een nomen dat is een ingang voor tijdspanne die als voorkeursterm geselecteerd is in een specifiek vocabulair coderingssysteem. @nl
label: لها نقطة وصول مقننة لفترة زمنية @ar
definition: تربط بين فترة زمنية وتسمية عبارة عن نقطة وصول لفترة زمنية مختارة للتفضيل في خطة ترميز مفردات محددة. @ar
toolkit label: نقطة وصول مقننة لفترة زمنية @ar
toolkit definition: تسمية عبارة عن نقطة وصول لفترة زمنية مختارة للتفضيل في خطة ترميز مفردات محددة. @ar
label: té com a punt d’accés autoritzat d’interval de temps @ca
definition: Relaciona un interval de temps amb un nomen que és un punt d’accés d’interval de temps que se selecciona com a preferent en un esquema de codificació de vocabulari específic. @ca
toolkit label: punt d’accés autoritzat d’interval de temps @ca
toolkit definition: Nomen que és un punt d’accés d’interval de temps que se selecciona com a preferent en un esquema de codificació de vocabulari específic. @ca
label: har autoriseret søgeindgang for tidsperiode @da
definition: Relaterer en tidsperiode til en søgeindgang for tidsperiode, som er valgt som præference i et specifikt vokabularkodningsskema. @da
toolkit label: autoriseret søgeindgang for tidsperiode @da
toolkit definition: Søgeindgang for tidsperiode, som er valgt som præference i et specifikt vokabularkodningsskema. @da
label: ajavahemiku normitud otsielement @et
definition: Seostab ajavahemiku ajavahemiku otsielemendiga, mis on valitud eelistatuks vastavas leksikaalses märkimissüsteemis. @et
toolkit label: ajavahemiku normitud otsielement @et
toolkit definition: Ajavahemiku otsielement, mis on valitud eelistatuks vastavas leksikaalses märkimissüsteemis. @et
label: hat normierten Sucheinstieg für einen Zeitraum @de
definition: Setzt einen Zeitraum in Beziehung zu einem Sucheinstieg für einen Zeitraum, der in einem bestimmten Vocabulary Encoding Scheme als Vorzugsform bestimmt wird. @de
toolkit label: Normierter Sucheinstieg für einen Zeitraum @de
toolkit definition: Ein Sucheinstieg für einen Zeitraum, der in einem bestimmten Vocabulary Encoding Scheme als Vorzugsform bestimmt wird. @de
label: autorizált hozzáférési pont időtartamhoz a következő: @hu
definition: Hozzákapcsol egy időtartamot egy nomenhez, amely egy előnyben részesített hozzáférési pont az időtartamhoz, amelyet egy adott szótárkódolási sémából választanak ki. @hu
toolkit label: autorizált hozzáférési pont időtartamhoz a következő: @hu
toolkit definition: Egy nomen, amely egy előnyben részesített hozzáférési pont az időtartamhoz, amelyet egy adott szótárkódolási sémából választanak ki. @hu
label: ha come punto d'accesso autorizzato per arco di tempo @it
definition: Correla un arco di tempo a un punto d'accesso per un arco di tempo selezionato come preferito in uno specifico schema di codifica di vocabolario. @it
toolkit label: punto d'accesso autorizzato per arco di tempo @it
toolkit definition: Punto d'accesso per un arco di tempo che è stato selezionato come preferito in uno specifico schema di codifica di vocabolario. @it
label: laikposma autoritatīvā pamatforma @lv
toolkit label: laikposma autoritatīvā pamatforma @lv
definition: Sasaista laikposmu ar nomenu, kas ir laikposma pamatforma, kas ir izvēle no konkrētas vārdnīcas. @lv
toolkit definition: Laikposma pamatforma, kas ir izvēle no konkrētas vārdnīcas. @lv
label: 有时间段的规范检索点 @zh-hans
toolkit label: 时间段的规范检索点 @zh-hans
definition: 将一个时间段与作为一个时间段的检索点、并在一个特定的词表编码体系中被首选的一个命名关联起来。 @zh-hans
toolkit definition: 作为一个时间段的检索点、并在一个特定的词表编码体系中被首选的一个命名 @zh-hans
has subproperty: P70047
label: zaman aralığı için yetkili erişim noktası ile ilişkilidir @tr
toolkit label: zaman aralığı için yetkili erişim noktası @tr
definition: Bir zaman aralığını, belirli bir kelime kodlama şemasında tercih için seçilen bir zaman aralığı için erişim noktası olan bir isimle ilişkilendirir. @tr
toolkit definition: Belirli bir kelime kodlama şemasında tercih için seçilen bir zaman aralığının erişim noktası olan bir isim. @tr

has beginning
status: Published
type: Property
lexical alias: beginning.en
definition: Relates a timespan to a timespan that is the time at which a timespan starts.
domain: C10010
toolkit label: beginning
toolkit definition: A timespan that is the time at which a timespan starts.
has element type: 3
scope note: A time may be represented at different levels of granularity by a calendrical timespan.
label: ajanjakson alku @fi
definition: Liittää ajanjakson ajanjaksoon, joka on aika, jolloin ajanjakso alkaa. @fi
toolkit label: ajanjakson alku @fi
toolkit definition: Ajankohta, joka on aika, jolloin ajanjakso alkaa. @fi
label: har begynnelse @no
definition: Relaterer et tidsrom til tidspunktet når tidsrommet starter. @no
toolkit label: begynnelse @no
toolkit definition: Tidspunktet når tidsrommet starter. @no
sub property of: has part timespan
label: a pour début @fr
definition: Met un laps de temps en relation avec un laps de temps qui constitue le moment auquel un laps de temps commence. @fr
scope note: Un moment peut être représenté à différents niveaux de granularité par un laps de temps calendaire. @fr
toolkit label: début @fr
toolkit definition: Laps de temps qui constitue le moment auquel un laps de temps commence. @fr
label: heeft begin @nl
definition: Relateert een tijdspanne aan een tijdspanne die is het tijdstip waarop een tijdspanne begint. @nl
toolkit label: begin @nl
toolkit definition: Een tijdspanne die is het tijdstip waarop een tijdspanne begint. @nl
label: لها بداية @ar
definition: تربط بين فترة زمنية وفترة زمنية عبارة عن زمن تبدأ فيه فترة زمنية. @ar
toolkit label: بداية @ar
toolkit definition: فترة زمنية عبارة عن زمن تبدأ فيه فترة زمنية. @ar
label: té com a inici @ca
definition: Relaciona un interval de temps amb un interval de temps que és el moment en què comença un interval de temps. @ca
toolkit label: inici @ca
toolkit definition: Interval de temps que és el moment en què comença un interval de temps. @ca
label: har begyndelse @da
definition: Relaterer et tidsforløb til det tidspunkt, hvor tidsforløbet starter. @da
toolkit label: begyndelse @da
toolkit definition: Tidspunkt, hvor tidsforløbet starter. @da
label: ajavahemiku algus @et
definition: Seostab ajavahemiku ajaga, millest ajavahemik algab. @et
scope note: Aega võib esitada kalendriajas eri täpsusega. @et
toolkit label: ajavahemiku algus @et
toolkit definition: Aeg, millest ajavahemik algab. @et
label: hat Anfang @de
definition: Setzt einen Zeitraum in Beziehung zu einem Zeitraum, bei dem es sich um den Zeitpunkt handelt, an dem ein Zeitraum beginnt. @de
toolkit label: Anfang @de
toolkit definition: Ein Zeitraum, bei dem es sich um den Zeitpunkt handelt, an dem ein Zeitraum beginnt. @de
label: kezdete a következő: @hu
definition: Hozzákapcsol egy időtartamot ahhoz az időponthoz, amikor az időtartam kezdődik. @hu
toolkit label: kezdete: @hu
toolkit definition: Az az időpont, amikor az időtartam kezdődik. @hu
label: ha come inizio @it
definition: Correla un arco di tempo al momento in cui l'arco di tempo inizia. @it
toolkit label: inizio @it
toolkit definition: Momento in cui l'arco di tempo inizia. @it
scope note: Een tijdstip kan vertegenwoordigd worden op diverse niveaus van granulariteit door een tijdspanne gebaseerd op een kalender. @nl
label: sākums @lv
definition: Sasaista laikposmu ar laikposmu, kas ir sākuma laiks. @lv
toolkit label: sākums @lv
toolkit definition: Sākuma laiks. @lv
scope note: Laiku var attēlot dažādos līmeņos, izmantojot kalendāra laika periodu. @lv
scope note: Aika voidaan esittää kalenterin ajanjakson hienojakoisuuden eri tasoilla. @fi
scope note: زمن يمكن تمثيله على مستويات تقسيم مختلفة من خلال فترة زمنية تقويمية. @ar
scope note: Tidspunkt kan repræsenteres på forskellige granularitetsniveauer ved et kalendrisk tidsrum. @da
scope note: Ein Zeitpunkt kann durch einen kalendarischen Zeitraum auf verschiedenen Ebenen der Granularität dargestellt werden. @de
scope note: Un temps es pot representar a diferents nivells de granularitat mitjançant un interval de temps del calendari. @ca
label: 有开始 @zh-hans
definition: 将一个时间段与作为一个时间段开始时间的一个时间段关联起来。 @zh-hans
toolkit label: 开始 @zh-hans
toolkit definition: 作为一个时间段开始时间的一个时间段 @zh-hans
scope note: 一个时间可以用日历时间段的不同颗粒度层级表示。 @zh-hans
has subproperty: P70039
scope note: Különböző szintű részletességgel, naptári időtartammal ábrázolt idő. @hu
label: başlangıç ile ilişkilidir @tr
definition: Bir zaman aralığını, zaman aralığının başladığı zaman olan bir zaman aralığıyla ilişkilendirir. @tr
toolkit label: başlangıç @tr
toolkit definition: Zaman aralığının başladığı an olan bir zaman aralığı. @tr
scope note: Zaman, takvimsel bir zaman aralığı ile farklı ayrıntı düzeylerinde temsil edilebilir. @tr

has category of timespan
status: Published
lexical alias: categoryOfTimespan.en
definition: Relates a timespan to a type to which a timespan belongs.
toolkit label: category of timespan
toolkit definition: A type to which a timespan belongs.
type: Property
domain: C10010
sub property of: P00029
has element type: 5
label: ajanjakson kategoria @fi
definition: Liitää ajanjakson tyyppiin, johon ajanjakso kuuluu. @fi
toolkit label: ajanjakson kategoria @fi
toolkit definition: Tyyppi, johon ajanjakso kuuluu. @fi
label: har kategori av tidsrom @no
definition: Relaterer et tidsrom til en type som et tidsrom tilhører. @no
toolkit label: kategori av tidsrom @no
toolkit definition: En type som et tidsrom tilhører. @no
label: a pour catégorie de laps de temps @fr
definition: Met un laps de temps en relation avec un type auquel un laps de temps appartient. @fr
toolkit label: catégorie de laps de temps @fr
toolkit definition: Type auquel un laps de temps appartient. @fr
label: heeft categorie van tijdspanne @nl
definition: Relateert een tijdspanne aan een type waartoe een tijdspanne behoort. @nl
toolkit label: categorie van tijdspanne @nl
toolkit definition: Een type waartoe een tijdspanne behoort. @nl
label: لها فئة لفترة زمنية @ar
definition: تربط بين فترة زمنية وفئة تنتمي إليها فترة زمنية. @ar
toolkit label: فئة لفترة زمنية @ar
toolkit definition: فئة تنتمي إليها فترة زمنية. @ar
label: té com a categoria d’interval de temps @ca
definition: Relaciona un interval de temps amb un tipus al qual pertany un interval de temps. @ca
toolkit label: categoria d’interval de temps @ca
toolkit definition: Tipus al qual pertany un interval de temps. @ca
label: har kategori af tidsperiode @da
definition: Relaterer en tidsperiode til en type, som en tidsperiode tilhører. @da
toolkit label: kategori af tidsperiode @da
toolkit definition: Type, som en tidsperiode tilhører. @da
label: ajavahemiku kategooria @et
definition: Seostab ajavahemiku tüübiga, millesse ajavahemik kuulub. @et
toolkit label: ajavahemiku kategooria @et
toolkit definition: Tüüp, millesse ajavahemik kuulub. @et
label: hat Kategorie eines Zeitraums @de
definition: Setzt einen Zeitraum in Beziehung zu einer Art, zu der ein Zeitraum gehört. @de
toolkit label: Kategorie eines Zeitraums @de
toolkit definition: Eine Art, zu der ein Zeitraum gehört. @de
label: időtartamkategóriája a következő: @hu
definition: Hozzákapcsol egy időtartamot ahhoz a típushoz, amelyhez az időtartam tartozik. @hu
toolkit label: időtartam kategóriája @hu
toolkit definition: Egy típus, amelyhez egy időtartam tartozik. @hu
label: ha come categoria di arco di tempo @it
definition: Correla un arco di tempo a un tipo a cui l'arco di tempo appartiene. @it
toolkit label: categoria di arco di tempo @it
toolkit definition: Tipo a cui l'arco di tempo appartiene. @it
label: laikposma kategorija @lv
definition: Sasaista laikposmu ar veidu, pie kura pieder laikposms. @lv
toolkit label: laikposma kategorija @lv
toolkit definition: Veids, pie kura pieder laikposms. @lv
label: 有时间段的类别 @zh-hans
definition: 将一个时间段与一个时间段所属于的一个类型关联起来。 @zh-hans
toolkit label: 时间段的类别 @zh-hans
toolkit definition: 一个时间段所属于的一个类型 @zh-hans
has subproperty: P70059
label: zaman aralığının kategorisi ile ilişkilidir @tr
definition: Bir zaman aralığını, zaman aralığının ait olduğu bir türle ilişkilendirir. @tr
toolkit label: zaman aralığı kategorisi @tr
toolkit definition: Bir zaman aralığının ait olduğu tür. @tr

is copyright date of
status: Published
type: Property
lexical alias: copyrightDateOf.en
domain: C10010
toolkit label: copyright date of
sub property of: is date of manifestation of
has element type: 2
definition: Relates a timespan to a manifestation that is associated with a claim of protection under copyright or a similar regime during a timespan.
toolkit definition: A manifestation that is associated with a claim of protection under copyright or a similar regime during a timespan.
label: copyright-vuosi manifestaatiolle @fi
definition: Liittää ajanjakson manifestaatioon, johon liittyy copyright-säädösten tai vastaavien säädösten alainen copyright-suojaus ajanjakson aikana. @fi
toolkit label: copyright-vuosi manifestaatiolle @fi
toolkit definition: Manifestaation, johon liittyy copyright-säädösten tai vastaavien säädösten alainen copyright-suojaus ajanjakson aikana. @fi
label: er copyrightdato for @no
definition: Relaterer et tidsrom til en manifestasjon som forbindes med et krav om beskyttelse under copyright eller et lignende regime i løpet av et tidsrom. @no
toolkit label: copyrightdato for @no
toolkit definition: En manifestasjon som forbindes med et krav om beskyttelse under copyright eller et lignende regime i løpet av et tidsrom. @no
label: est une date de copyright de @fr
definition: Met un laps de temps en relation avec une manifestation qui est associée à une revendication de protection en vertu du copyright ou d’un régime similaire durant un laps de temps. @fr
toolkit label: date de copyright de @fr
toolkit definition: Manifestation qui est associée à une revendication de protection en vertu du copyright ou d’un régime similaire durant un laps de temps. @fr
label: is copyrightdatum van @nl
definition: Relateert een tijdspanne aan een manifestatie die geassocieerd is met een claim van bescherming onder copyright of soortgelijk stelsel gedurende een tijdspanne. @nl
toolkit label: copyrightdatum van @nl
toolkit definition: Een manifestatie die geassocieerd is met een claim van bescherming onder copyright of soortgelijk stelsel gedurende een tijdspanne. @nl
label: هي تاريخ حقوق نشر لـ @ar
definition: تربط بين فترة زمنية وتجسيدة مرتبطة بطلب حماية تحت حقوق نشر أو نظام مشابه خلال فترة زمنية. @ar
toolkit label: تاريخ حقوق نشر لـ @ar
toolkit definition: تجسيدة مرتبطة بطلب حماية تحت حقوق نشر أو نظام مشابه خلال فترة زمنية. @ar
label: és data de copyright de @ca
definition: Relaciona un interval de temps amb una manifestació que s’associa amb una declaració de protecció en virtut del copyright o d’un règim similar durant un interval de temps. @ca
toolkit label: data de copyright de @ca
toolkit definition: Manifestació que s’associa amb una declaració de protecció en virtut del copyright o d’un règim similar durant un interval de temps. @ca
label: er copyrightdato af @da
definition: Relaterer en tidsperiode til en manifestation, som i løbet af en tidsperiode er knyttet til et beskyttelseskrav under copyright eller et lignende system. @da
toolkit label: copyrightdato af @da
toolkit definition: Manifestation, som i løbet af en tidsperiode er knyttet til et beskyttelseskrav under copyright eller et lignende system. @da
label: copyright'i aasta kehastuses @et
definition: Seostab ajavahemiku kehastusega, mis on sel ajavahemikul seotud autoriõiguse vms õigusrežiimi kaitsega. @et
toolkit label: copyright'i aasta kehastuses @et
toolkit definition: Kehastus, mis on sel ajavahemikul seotud autoriõiguse vms õigusrežiimi kaitsega. @et
label: ist Copyright-Datum von @de
definition: Setzt einen Zeitraum in Beziehung zu einer Manifestation, die mit einem Schutzanspruch nach dem Urheberrecht oder einem ähnlichen Regelwerk während eines Zeitraums in Verbindung steht. @de
toolkit label: Copyright-Datum von @de
toolkit definition: Eine Manifestation, die mit einem Schutzanspruch nach dem Urheberrecht oder einem ähnlichen Regelwerk während eines Zeitraums in Verbindung steht. @de
label: copyright éve a következőnek: @hu
definition: Hozzákapcsol egy időtartamot egy megjelenési formához, amelyet a szerzői jog vagy egy hasonló szabályrendszer alapján egy időtartam alatt támasztott védettségi követeléshez társítanak. @hu
toolkit label: copyright éve: @hu
toolkit definition: Egy megjelenési forma, amelyet a szerzői jog vagy egy hasonló szabályrendszer alapján egy időtartam alatt támasztott védettségi követeléshez társítanak. @hu
label: è data di copyright di @it
definition: Correla un arco di tempo a una manifestazione che è associata con una dichiarazione di protezione sotto copyright o regime simile durante un arco di tempo. @it
toolkit label: data di copyright di @it
toolkit definition: Manifestazione che è associata con una dichiarazione di protezione sotto copyright o regime simile durante un arco di tempo. @it
label: ir autortiesību datējums @lv
toolkit label: ir autortiesību datējums @lv
definition: Sasaista laikposmu ar manifestāciju, kas ir saistīta ar prasību par autortiesību aizsardzību vai līdzīgiem nosacījumiem laikposmā. @lv
toolkit definition: Manifestācija, kas ir saistīta ar prasību par autortiesību aizsardzību vai līdzīgiem nosacījumiem laikposmā. @lv
label: 是……的版权日期 @zh-hans
toolkit label: ……的版权日期 @zh-hans
definition: 将一个时间段与和在一个时间段中根据版权或类似管理制度的保护声明有关的一种载体表现关联起来。 @zh-hans
toolkit definition: 和在一个时间段中根据版权或类似管理制度的保护声明有关的一种载体表现 @zh-hans
has subproperty: P70019
label: telif tarihidir @tr
toolkit label: telif hakkı tarihi @tr
definition: Bir zaman aralığını, zaman aralığı boyunca telif hakkı veya benzer bir sistem kapsamında koruma talebiyle bağlantılı olan bir gösterimle ilişkilendirir. @tr
toolkit definition: Bir zaman aralığı boyunca telif hakkı veya benzer bir sistem kapsamında koruma talebiyle bağlantılı olan bir gösterim. @tr

is date associated with corporate body of (Deprecated)
status: Deprecated
type: Property
has element type: 2
has subproperty: P70036

is date associated with family of (Deprecated)
status: Deprecated
type: Property
has element type: 2
has subproperty: P70037

is date associated with person of (Deprecated)
status: Deprecated
type: Property
lexical alias: dateAssociatedWithPersonOf.en
definition: Relates a timespan to a person who has a significant association with a timespan. (Deprecated)
domain: C10010
toolkit label: date associated with person of (Deprecated)
toolkit definition: A person who has a significant association with a timespan. (Deprecated)
sub property of: has related person of timespan
has element type: 2
has subproperty: P70038

is date of birth of
status: Published
type: Property
lexical alias: dateOfBirthOf.en
definition: Relates a timespan to a person who was born during a timespan.
domain: C10010
toolkit label: date of birth of
toolkit definition: A person who was born during a timespan.
sub property of: has related person of timespan
has element type: 2
label: syntymäaika henkilölle @fi
definition: Liittää ajanjakson henkilöön, joka syntyi ajanjakson aikana. @fi
toolkit label: syntymäaika henkilölle @fi
toolkit definition: Henkilö, joka syntyi ajanjakson aikana. @fi
label: er fødselsdato for @no
definition: Relaterer et tidsrom til en person som ble født i løpet av et tidsrom. @no
toolkit label: fødselsdato for @no
toolkit definition: En person som ble født i løpet av et tidsrom. @no
label: est une date de naissance de @fr
definition: Met un laps de temps en relation avec une personne qui est née durant un laps de temps. @fr
toolkit label: date de naissance de @fr
toolkit definition: Personne qui est née durant un laps de temps. @fr
label: is geboortedatum van @nl
definition: Relateert een tijdspanne aan een persoon die geboren werd gedurende een tijdspanne. @nl
toolkit label: geboortedatum van @nl
toolkit definition: Een persoon die geboren werd gedurende een tijdspanne. @nl
label: هي تاريخ ميلاد لـ @ar
definition: تربط بين فترة زمنية وشخص وُلد خلال فترة زمنية. @ar
toolkit label: تاريخ ميلاد لـ @ar
toolkit definition: شخص وُلد خلال فترة زمنية. @ar
label: és data de naixement de @ca
definition: Relaciona un interval de temps amb una persona que va néixer durant un interval de temps. @ca
toolkit label: data de naixement de @ca
toolkit definition: Persona que va néixer durant un interval de temps. @ca
label: er fødselsdato af @da
definition: Relaterer en tidsperiode til en person, som blev født i løbet af en tidsperiode. @da
toolkit label: fødselsdato af @da
toolkit definition: Person, som blev født i løbet af en tidsperiode. @da
label: sünnidaatum isikule @et
definition: Seostab ajavahemiku isikuga, kes on sündinud sel ajavahemikul. @et
toolkit label: sünnidaatum isikule @et
toolkit definition: Isik, kes on sündinud sel ajavahemikul. @et
label: ist Geburtsdatum von @de
definition: Setzt einen Zeitraum in Beziehung zu einer Person, die in einem Zeitraum geboren wurde. @de
toolkit label: Geburtsdatum von @de
toolkit definition: Eine Person, die in einem Zeitraum geboren wurde. @de
label: születési időpontja a következőnek: @hu
definition: Hozzákapcsol egy időtartamot egy személyhez, aki egy időtartam alatt született. @hu
toolkit label: születési időpontja: @hu
toolkit definition: Egy személy, aki egy időtartam alatt született. @hu
label: è data di nascita di @it
definition: Correla un arco di tempo a una persona che è nata durante un arco di tempo. @it
toolkit label: data di nascita di @it
toolkit definition: Persona che è nata durante un arco di tempo. @it
label: ir dzimis @lv
definition: Sasaista laikposmu ar personu, kura dzimusi laikposmā. @lv
toolkit label: ir dzimis @lv
toolkit definition: Persona, kura dzimusi laikposmā. @lv
label: 是……的出生日期 @zh-hans
definition: 将一个时间段与在一个时间段出生的一个个人关联起来。 @zh-hans
toolkit label: ……的出生日期 @zh-hans
toolkit definition: 在一个时间段出生的一个个人 @zh-hans
has subproperty: P70029
label: doğum tarihidir @tr
definition: Bir zaman aralığını, zaman aralığında doğan bir kişiyle ilişkilendirir. @tr
toolkit label: doğum tarihi @tr
toolkit definition: Zaman aralığında doğan kişi. @tr

is date of capture of
status: Published
type: Property
lexical alias: dateOfCaptureOf.en
domain: C10010
toolkit label: date of capture of
sub property of: is date of expression of
has element type: 2
definition: Relates a timespan to an expression that is recorded, filmed, etc., during a timespan.
toolkit definition: An expression that is recorded, filmed, etc., during a timespan.
label: tallennusajankohta ekspressiolle @fi
definition: Liittää ajanjakson ekspressioon, joka on äänitetty, filmattu tms. ajanjakson aikana. @fi
toolkit label: tallennusajankohta ekspressiolle @fi
toolkit definition: Ekspressio, joka on äänitetty, filmattu tms. ajanjakson aikana. @fi
label: er dato for innspilling av @no
definition: Relaterer et tidsrom til et uttrykk som er tatt opp, filmet etc. i løpet av et tidsrom. @no
toolkit label: dato for innspilling av @no
toolkit definition: Et uttrykk som er tatt opp, filmet etc. i løpet av et tidsrom. @no
label: est une date de captation de @fr
definition: Met un laps de temps en relation avec une expression qui est enregistrée, filmée, etc. durant un laps de temps. @fr
toolkit label: date de captation de @fr
toolkit definition: Expression qui est enregistrée, filmée, etc. durant un laps de temps. @fr
label: is datum van vastleggen van @nl
definition: Relateert een tijdspanne aan een expressie die is opgenomen, gefilmd etc. gedurende een tijdspanne. @nl
toolkit label: datum van vastleggen van @nl
toolkit definition: Een expressie die is opgenomen, gefilmd etc. gedurende een tijdspanne. @nl
label: هو تاريخ التقاط لـ @ar
definition: تربط بين فترة زمنية وتعبيرة سجلت، أو صورت، إلخ. خلال فترة زمنية. @ar
toolkit label: تاريخ التقاط لـ @ar
toolkit definition: تعبيرة سجلت، أو صورت، إلخ. خلال فترة زمنية. @ar
label: és data de captura de @ca
definition: Relaciona un interval de temps amb una expressió que s’enregistra, es filma, etc., durant un interval de temps. @ca
toolkit label: data de captura de @ca
toolkit definition: Expressió que s’enregistra, es filma, etc., durant un interval de temps. @ca
label: er dato for indspilning af @da
definition: Relaterer en tidsperiode til et udtryk, som i løbet af en tidsperiode er indspillet, filmet, etc. @da
toolkit label: dato for indspilning af @da
toolkit definition: Udtryk, som i løbet af en tidsperiode er indspillet, filmet, etc. @da
label: jäädvustamise daatum väljenduses @et
definition: Seostab ajavahemiku väljendusega, mis on sel ajavahemikul salvestatud, filmitud vms. @et
toolkit label: jäädvustamise daatum väljenduses @et
toolkit definition: Väljendus, mis on sel ajavahemikul salvestatud, filmitud vms. @et
label: ist Aufzeichnungsdatum von @de
definition: Setzt einen Zeitraum in Beziehung zu einer Expression, die in einem Zeitraum aufgenommen, verfilmt und so weiter wird. @de
toolkit label: Aufzeichnungsdatum von @de
toolkit definition: Eine Expression, die in einem Zeitraum aufgenommen, verfilmt und so weiter wird. @de
label: rögzítési időpontja a következőnek: @hu
definition: Hozzákapcsol egy időtartamot egy kifejezési formához, amelyet egy időtartam alatt rögzítettek, vettek filmre, stb. @hu
toolkit label: rögzítési időpontja: @hu
toolkit definition: Egy kifejezési forma, amelyet egy időtartam alatt rögzítettek, vettek filmre, stb. @hu
label: è data di registrazione di @it
definition: Correla un arco di tempo a un'espressione che è registrata, filmata, etc. durante un arco di tempo. @it
toolkit label: data di registrazione di @it
toolkit definition: Espressione che è registrata, filmata, etc. durante un arco di tempo. @it
label: ir tveršanas datējums @lv
toolkit label: ir tveršanas datējums @lv
definition: Sasaista laikposmu ar izteiksmi, kas tikusi ierakstīta, filmēta u. tml. konkrētajā laikposmā. @lv
toolkit definition: Izteiksme, kas tikusi ierakstīta, filmēta u. tml. konkrētajā laikposmā. @lv
label: 是……的摄录日期 @zh-hans
toolkit label: ……的摄录日期 @zh-hans
definition: 将一个时间段与在一个时间段录制、摄影等的一种内容表达关联起来。 @zh-hans
toolkit definition: 在一个时间段录制、摄影等的一种内容表达 @zh-hans
has subproperty: P70023
label: kaydının tarihidir @tr
toolkit label: kayıt tarihi @tr
definition: Bir zaman aralığını, zaman aralığı boyunca kaydedilen, filme alınan vb. anlatımla ilişkilendirir. @tr
toolkit definition: Bir zaman aralığı boyunca kaydedilen, filme alınan vb. bir anlatım. @tr

is date of capture of representative expression of
status: Published
type: Property
lexical alias: dateOfCaptureOfRepresentativeExpressionOf.en
domain: C10010
has element type: 2
definition: Relates a timespan to a work that is associated with a representative expression that is recorded, filmed, etc., during a timespan.
toolkit label: date of capture of representative expression of
toolkit definition: A work that is associated with a representative expression that is recorded, filmed, etc., during a timespan.
sub property of: has related work of timespan
label: tallennusajankohta edustavalle ekspressiolle @fi
definition: Liittää ajanjakson teokseen, joka liittyy edustavan ekspression äänitykseen, filmaukseen tms. ajanjakson aikana. @fi
toolkit label: tallennusajankohta edustavalle ekspressiolle @fi
toolkit definition: Teos, joka liittyy edustavan ekspression äänitykseen, filmaukseen tms. ajanjakson aikana. @fi
label: er tidspunkt for opptak av representativt uttrykk for @no
definition: Relaterer et tidsrom til et verk som forbindes med et representativt uttrykk so, er tatt opp, filmet etc. i løpet av et tidsrom. @no
toolkit label: tidspunkt for opptak av representativt uttrykk for @no
toolkit definition: Et verk som forbindes med et representativt uttrykk so, er tatt opp, filmet etc. i løpet av et tidsrom. @no
label: est une date de captation d’une expression représentative de @fr
definition: Met un laps de temps en relation avec une œuvre qui est associée à une expression représentative qui est enregistrée, filmée, etc. durant un laps de temps. @fr
toolkit label: date de captation d’une expression représentative de @fr
toolkit definition: Œuvre qui est associée à une expression représentative qui est enregistrée, filmée, etc. durant un laps de temps. @fr
label: is datum van vastleggen van representatieve expressie van @nl
definition: Relateert een tijdspanne aan een werk dat is geassocieerd met een representatieve expressie die is opgenomen, gefilmd etc. gedurende een tijdspanne. @nl
toolkit label: datum van vastleggen van representatieve expressie van @nl
toolkit definition: Een werk dat is geassocieerd met een representatieve expressie die is opgenomen, gefilmd etc. gedurende een tijdspanne. @nl
label: هي تاريخ التقاط تعبيرة ممثلة لـ @ar
definition: تربط بين فترة زمنية وعمل مرتبط بتعبيرة ممثلة سجلت، وصورت، إلخ. خلال فترة زمنية. @ar
toolkit label: تاريخ التقاط تعبيرة ممثلة لـ @ar
toolkit definition: عمل مرتبط بتعبيرة ممثلة سجلت، وصورت، إلخ. خلال فترة زمنية. @ar
label: és data de captura d’una expressió representativa de @ca
definition: Relaciona un interval de temps amb una obra que s’associa amb una expressió representativa que s’enregistra, es filma, etc., durant un interval de temps. @ca
toolkit label: data de captura d’una expressió representativa de @ca
toolkit definition: Obra que s’associa amb una expressió representativa que s’enregistra, es filma, etc., durant un interval de temps. @ca
label: er dato for indspilning af repræsentativt udtryk af @da
definition: Relaterer en tidsperiode til et værk, som er knyttet til et repræsentativt udtryk, som i løbet af en tidsperiode er indspillet, filmet, etc. @da
toolkit label: dato for indspilning af repræsentativt udtryk af @da
toolkit definition: Værk, som er knyttet til et repræsentativt udtryk, som i løbet af en tidsperiode er indspillet, filmet, etc. @da
label: iseloomuliku väljenduse jäädvustamise daatum teoses @et
definition: Seostab ajavahemiku teosega, millega seotud iseloomulik väljendus on salvestatud, filmitud vms sel ajavahemikul. @et
toolkit label: iseloomuliku väljenduse jäädvustamise daatum teoses @et
toolkit definition: Teos, millega seotud iseloomulik väljendus on salvestatud, filmitud vms sel ajavahemikul. @et
label: ist Aufzeichnungsdatum einer repräsentativen Expression von @de
definition: Setzt einen Zeitraum in Beziehung zu einem Werk, das mit einer repräsentativen Expression in Verbindung steht, die in einem Zeitraum aufgenommen, verfilmt und so weiter wird. @de
toolkit label: Aufzeichnungsdatum einer repräsentativen Expression von @de
toolkit definition: Ein Werk, das mit einer repräsentativen Expression in Verbindung steht, die in einem Zeitraum aufgenommen, verfilmt und so weiter wird. @de
label: a következő reprezentatív kifejezési forma felvételének ideje: @hu
definition: Hozzákapcsol egy időtartamot egy műhöz, amely reprezentatív kifejezési formáját egy időtartam alatt rögzítettek, vettek filmre, stb. @hu
toolkit label: reprezentatív kifejezési forma felvételének ideje @hu
toolkit definition: Egy mű, amely reprezentatív kifejezési formáját egy időtartam alatt rögzítettek, vettek filmre, stb. @hu
label: è data di registrazione dell'espressione rappresentativa @it
definition: Correla un arco di tempo a un'opera associata con un'espressione rappresentativa che è registrata, filmata, etc. durante un arco di tempo. @it
toolkit label: data di registrazione dell'espressione rappresentativa @it
toolkit definition: Opera associata con un'espressione rappresentativa che è registrata, filmata, etc. durante un arco di tempo. @it
label: ir reprezentatīvās izteiksmes tveršanas datējums @lv
definition: Sasaista laikposmu ar darbu, kas saistīts ar reprezentatīvo izteiksmi, kas tikusi ierakstīta, filmēta u.tml. konkrētajā laikposmā. @lv
toolkit label: ir reprezentatīvās izteiksmes tveršanas datējums @lv
toolkit definition: Darbs, kas saistīts ar reprezentatīvo izteiksmi, kas tikusi ierakstīta, filmēta u.tml. konkrētajā laikposmā. @lv
label: 是……的代表性内容表达的摄录日期 @zh-hans
definition: 将一个时间段与和一种在一个时间段录制、拍摄等的代表性内容表达有关的一种作品关联起来。 @zh-hans
toolkit label: ……的代表性内容表达的摄录日期 @zh-hans
toolkit definition: 和一种在一个时间段录制、拍摄等的代表性内容表达有关的一种作品 @zh-hans
has subproperty: P70054
label: temsili anlatımının kayıt tarihidir @tr
definition: Bir zaman aralığını, bir zaman aralığı boyunca kaydedilen, filme alınan vb. temsili bir anlatımla bağlantılı olan bir eserle ilişkilendirir. @tr
toolkit label: temsili anlatımın kaydedilme tarihi @tr
toolkit definition: Bir zaman aralığında kaydedilen, filme alınan vb. temsili bir anlatımla bağlantılı olan bir çalışma. @tr

is date of conference of
status: Published
type: Property
lexical alias: dateOfConferenceOf.en
definition: Relates a timespan to a corporate body who is a conference, exhibition, or other formally named and convened event that is held during a timespan.
domain: C10010
toolkit label: date of conference of
toolkit definition: A corporate body who is a conference, exhibition, or other formally named and convened event that is held during a timespan.
sub property of: has related corporate body of timespan
has element type: 2
label: ajankohta konferenssille @fi
definition: Liittää ajanjakson yhteisöön, joka on ajanjakson aikana järjestetty konferenssi, näyttely tai muu tilaisuus. @fi
toolkit label: ajankohta konferenssille @fi
toolkit definition: Yhteisö, joka on ajanjakson aikana järjestetty konferenssi, näyttely tai muu tilaisuus. @fi
label: er konferansedato for @no
definition: Relaterer et tidsrom til en konferanse, utstilling eller annet arrangement som gir opphav til et verk som blir avholdt i løpet av et tidsrom. @no
toolkit label: konferansedato for @no
toolkit definition: En konferanse, utstilling eller annet arrangement som gir opphav til et verk som blir avholdt i løpet av et tidsrom. @no
label: est une date de congrès de @fr
definition: Met un laps de temps en relation avec une collectivité qui consiste en un congrès, une exposition ou un autre événement formellement nommé et convoqué qui se tient durant un laps de temps. @fr
toolkit label: date de congrès de @fr
toolkit definition: Collectivité qui consiste en un congrès, une exposition ou un autre événement formellement nommé et convoqué qui se tient durant un laps de temps. @fr
label: is datum van conferentie van @nl
definition: Relateert een tijdspanne aan een corporatie die is een conferentie, tentoonstelling of ander formeel benoemde en samengekomen gebeurtenis die gehouden is gedurende een tijdspanne. @nl
toolkit label: datum van conferentie van @nl
toolkit definition: Een corporatie die is een conferentie, tentoonstelling of ander formeel benoemde en samengekomen gebeurtenis die gehouden is gedurende een tijdspanne. @nl
label: هي تاريخ مؤتمر لـ @ar
definition: تربط بين فترة زمنية وهيئة عبارة عن مؤتمر، أو معرض، أو حدث آخر سمي وعقد رسميا خلال فترة زمنية. @ar
toolkit label: تاريخ مؤتمر لـ @ar
toolkit definition: هيئة عبارة عن مؤتمر، أو معرض، أو حدث آخر سمي وعقد خلال فترة زمنية. @ar
label: és data de congrés de @ca
definition: Relaciona un interval de temps amb una entitat corporativa que és un congrés, una exposició o qualsevol altre esdeveniment formalment esmentat i convocat i que té lloc durant un interval de temps. @ca
toolkit label: data de congrés de @ca
toolkit definition: Entitat corporativa que és un congrés, una exposició o qualsevol altre esdeveniment formalment esmentat i convocat i que té lloc durant un interval de temps. @ca
label: er dato for konference af @da
definition: Relaterer en tidsperiode til en konference, udstilling eller anden begivenhed, som afholdes i løbet af en tidsperiode og som giver anledning til et værk. @da
toolkit label: dato for konference af @da
toolkit definition: Konference, udstilling eller anden begivenhed, som afholdes i løbet af en tidsperiode og som giver anledning til et værk. @da
label: toimumisaeg konverentsile @et
definition: Seostab ajavahemiku sel ajavahemikul peetud konverentsi, näituse vm üritusega, mis paneb aluse teosele. @et
toolkit label: toimumisaeg konverentsile @et
toolkit definition: Sel ajavahemikul peetud konverents, näitus vm üritus, mis paneb aluse teosele. @et
label: ist Datum einer Konferenz von @de
definition: Setzt einen Zeitraum in Beziehung zu einer Körperschaft, bei der es sich um eine Konferenz, Ausstellung oder andere formal benannte und einberufene Veranstaltung handelt, die während eines Zeitraums stattfindet. @de
toolkit label: Datum einer Konferenz von @de
toolkit definition: Eine Körperschaft, bei der es sich um eine Konferenz, Ausstellung oder andere formal benannte und einberufene Veranstaltung handelt, die während eines Zeitraums stattfindet. @de
label: időpontja a következő konferenciának: @hu
definition: Egy időtartamot hozzákapcsol egy testülethez, amely egy konferencia, egy kiállítás vagy egyéb formálisan megnevezett és szervezett esemény, amelyet egy időtartam alatt tartottak. @hu
toolkit label: időpontja a következő konferenciának: @hu
toolkit definition: Egy testület, amely egy konferencia, egy kiállítás vagy egyéb formálisan megnevezett és szervezett esemény, amelyet egy időtartam alatt tartottak. @hu
label: è data di conferenza di @it
definition: Correla un arco di tempo a un conferenza, mostra, o altro evento che dà luogo a un'opera che è tenuto durante un arco di tempo. @it
toolkit label: data di conferenza di @it
toolkit definition: Conferenza, mostra, o altro evento che dà luogo a un'opera che è tenuto durante un arco di tempo. @it
label: ir datējums pasākumam @lv
definition: Sasaista laikposmu ar institūciju, kas ir konference, izstāde vai cits pasākums konkrētajā laikposmā. @lv
toolkit label: ir datējums pasākumam @lv
toolkit definition: Konference, izstāde vai cits pasākums konkrētajā laikposmā. @lv
label: 是……的会议的日期 @zh-hans
definition: 将一个时间段与作为在一个时间段中举行的会议、展览或其他正式命名并举办的活动的一个团体关联起来。 @zh-hans
toolkit label: ……的会议的日期 @zh-hans
toolkit definition: 作为在一个时间段中举行的会议、展览或其他正式命名并举办的活动的一个团体 @zh-hans
has subproperty: P70031
label: konferansının tarihidir @tr
definition: Bir zaman aralığını, bir zaman aralığında düzenlenen bir konferans, fuar veya resmi olarak adlandırılmış ve düzenlenmiş başka bir faaliyet olan tüzel kişi ile ilişkilendirir. @tr
toolkit label: konferans tarihi @tr
toolkit definition: Bir zaman aralığında düzenlenen bir konferans, fuar veya resmi olarak adlandırılmış ve düzenlenmiş başka bir faaliyet olan tüzel kişilik. @tr

is date of death of
status: Published
type: Property
lexical alias: dateOfDeathOf.en
definition: Relates a timespan to a person who died during a timespan.
domain: C10010
toolkit label: date of death of
toolkit definition: A person who died during a timespan.
sub property of: has related person of timespan
has element type: 2
label: kuolinaika henkilölle @fi
definition: Liittää ajanjakson henkilöön, joka kuoli ajanjakson aikana. @fi
toolkit label: kuolinaika henkilölle @fi
toolkit definition: Henkilö, joka kuoli ajanjakson aikana. @fi
label: er dødsdato for @no
definition: Relaterer et tidsrom til en person som døde i løpet av et tidsrom. @no
toolkit label: dødsdato for @no
toolkit definition: En person som døde i løpet av et tidsrom. @no
label: est une date de décès de @fr
definition: Met un laps de temps en relation avec une personne qui est morte durant un laps de temps. @fr
toolkit label: date de décès de @fr
toolkit definition: Personne qui est morte durant un laps de temps. @fr
label: is sterfdatum van @nl
definition: Relateert een tijdspanne aan een persoon die stierf gedurende een tijdspanne. @nl
toolkit label: sterfdatum van @nl
toolkit definition: Een persoon die stierf gedurende een tijdspanne. @nl
label: هي تاريخ وفاة لـ @ar
definition: تربط بين فترة زمنية وشخص توفي خلال فترة زمنية. @ar
toolkit label: تاريخ وفاة لـ @ar
toolkit definition: شخص توفي خلال فترة زمنية. @ar
label: és data de defunció de @ca
definition: Relaciona un interval de temps amb una persona que va morir durant un interval de temps. @ca
toolkit label: data de defunció de @ca
toolkit definition: Persona que va morir durant un interval de temps. @ca
label: er dødsdato af @da
definition: Relaterer en tidsperiode til en person, som døde i løbet af en tidsperiode. @da
toolkit label: dødsdato af @da
toolkit definition: Person, som døde i løbet af en tidsperiode. @da
label: surmadaatum isikule @et
definition: Seostab ajavahemiku isikuga, kes on surnud sel ajavahemikul. @et
toolkit label: surmadaatum isikule @et
toolkit definition: Isik, kes on surnud sel ajavahemikul. @et
label: ist Sterbedatum von @de
definition: Setzt einen Zeitraum in Beziehung zu einer Person, die in einem Zeitraum gestorben ist. @de
toolkit label: Sterbedatum von @de
toolkit definition: Eine Person, die in einem Zeitraum gestorben ist. @de
label: halálozási időpontja a következőnek: @hu
definition: Hozzákapcsol egy időtartamot egy személyhez, aki egy időtartam alatt hunyt el. @hu
toolkit label: halálozási időpontja: @hu
toolkit definition: Egy személy, aki egy időtartam alatt hunyt el. @hu
label: è data di morte di @it
definition: Correla un arco di tempo a una persona che è morta durante un arco di tempo. @it
toolkit label: data di morte di @it
toolkit definition: persona che è morta durante un arco di tempo. @it
label: ir miris @lv
definition: Sasaista laikposmu ar personu, kura mirusi konkrētajā laikposmā. @lv
toolkit label: ir miris @lv
toolkit definition: Persona, kura mirusi konkrētajā laikposmā. @lv
label: 是……的死亡日期 @zh-hans
definition: 将一个时间段与在一个时间段死亡的一个个人关联起来。 @zh-hans
toolkit label: ……的死亡日期 @zh-hans
toolkit definition: 在一个时间段死亡的一个个人 @zh-hans
has subproperty: P70030
label: ölüm tarihidir @tr
definition: Bir zaman aralığını, zaman aralığında ölen bir kişiyle ilişkilendirir. @tr
toolkit label: ölüm tarihi @tr
toolkit definition: Zaman aralığında ölen kişi. @tr

is date of distribution of
status: Published
type: Property
lexical alias: dateOfDistributionOf.en
definition: Relates a timespan to a manifestation that is a published manifestation that is distributed during a timespan.
domain: C10010
toolkit label: date of distribution of
toolkit definition: A manifestation that is a published manifestation that is distributed during a timespan.
sub property of: is date of manifestation of
has element type: 2
label: jakeluaika manifestaatiolle @fi
definition: Liittää ajankohdan julkaistuun manifestaatioon, jota on jaettu ajanjakson aikana. @fi
toolkit label: jakeluaika manifestaatiolle @fi
toolkit definition: Julkaistu manifestaatio, jota on jaettu ajanjakson aikana. @fi
label: er dato for distribusjon av @no
definition: Relaterer et tidsrom til en manifestasjon som er en publisert manifestasjon som er distribuert i løpet av et tidsrom. @no
toolkit label: dato for distribusjon av @no
toolkit definition: En manifestasjon som er en publisert manifestasjon som er distribuert i løpet av et tidsrom. @no
label: est une date de diffusion ou de distribution de @fr
definition: Met un laps de temps en relation avec une manifestation publiée qui est diffusée ou distribuée durant un laps de temps. @fr
toolkit label: date de diffusion ou de distribution de @fr
toolkit definition: Manifestation publiée qui est diffusée ou distribuée durant un laps de temps. @fr
label: is datum van distributie van @nl
definition: Relateert een tijdspanne aan een manifestatie die een gepubliceerde manifestatie is, die is gedistribueerd gedurende een tijdspanne. @nl
toolkit label: datum van distributie van @nl
toolkit definition: Een manifestatie die een gepubliceerde manifestatie is, die is gedistribueerd gedurende een tijdspanne. @nl
label: هي تاريخ توزيع لـ @ar
definition: تربط بين فترة زمنية وتجسيدة منشورة وزعت خلال فترة زمنية. @ar
toolkit label: تاريخ توزيع لـ @ar
toolkit definition: تجسيدة منشورة وزعت خلال فترة زمنية. @ar
label: és data de distribució de @ca
definition: Relaciona un interval de temps amb una manifestació que és una manifestació publicada que es distribueix durant un interval de temps. @ca
toolkit label: data de distribució de @ca
toolkit definition: Manifestació que és una manifestació publicada que es distribueix durant un interval de temps. @ca
label: er dato for distribution af @da
definition: Relaterer en tidsperiode til en manifestation, som er en publiceret manifestation, som er distribueret i løbet af en tidsperiode. @da
toolkit label: dato for distribution af @da
toolkit definition: Manifestation, som er en publiceret manifestation, som er distribueret i løbet af en tidsperiode. @da
label: levitamisaeg kehastuses @et
definition: Seostab ajavahemiku avaldatud kehastusega, mida on sel ajavahemikul levitatud. @et
toolkit label: levitamisaeg kehastuses @et
toolkit definition: Avaldatud kehastus, mida on sel ajavahemikul levitatud. @et
label: ist Vertriebsdatum von @de
definition: Setzt einen Zeitraum in Beziehung zu einer veröffentlichten Manifestation, die in einem Zeitraum vertrieben wird. @de
toolkit label: Vertriebsdatum von @de
toolkit definition: Eine veröffentlichte Manifestation, die in einem Zeitraum vertrieben wird. @de
label: terjesztési időpontja a következőnek: @hu
definition: Hozzákapcsol egy időtartamot egy kiadott megjelenési formához, amelyet egy időtartam alatt terjesztenek. @hu
toolkit label: terjesztési időpontja: @hu
toolkit definition: Egy megjelenési forma, amelyet egy időtartam alatt terjesztenek. @hu
label: è data di distribuzione di @it
definition: Correla un arco di tempo a una manifestazione pubblicata che è distribuita durante un arco di tempo. @it
toolkit label: data di distribuzione di @it
toolkit definition: Manifestazione pubblicata che è distribuita durante un arco di tempo. @it
label: ir izplatīšanas datējums @lv
definition: Sasaista laikposmu ar manifestāciju, kas ir publicēta manifestācija, kas ir izplatīta laikposmā. @lv
toolkit label: ir izplatīšanas datējums @lv
toolkit definition: Manifestācija, kas ir publicēta manifestācija, kas ir izplatīta laikposmā. @lv
label: 是……的发行的日期 @zh-hans
definition: 将一个时间段与作为一种出版载体表现在一个时间段内被发行的一种载体表现关联起来。 @zh-hans
toolkit label: ……的发行的日期 @zh-hans
toolkit definition: 作为一种出版载体表现在一个时间段内被发行的一种载体表现 @zh-hans
has subproperty: P70025
label: dağıtım tarihidir @tr
definition: Bir zaman aralığını, zaman aralığı boyunca dağıtılan yayınlanmış bir gösterim olan bir gösterimle ilişkilendirir. @tr
toolkit label: dağıtım tarihi @tr
toolkit definition: Bir zaman aralığı boyunca dağıtılan yayınlanmış bir gösterim olan bir gösterim. @tr

is date of establishment of
status: Published
type: Property
lexical alias: dateOfEstablishmentOf.en
definition: Relates a timespan to a corporate body who is established or founded during a timespan.
domain: C10010
toolkit label: date of establishment of
toolkit definition: A corporate body who is established or founded during a timespan.
sub property of: has related corporate body of timespan
has element type: 2
label: perustamisaika yhteisölle @fi
definition: Liittää ajanjakson yhteisöön, joka on perustettu ajanjakson aikana. @fi
toolkit label: perustamisaika yhteisölle @fi
toolkit definition: Yhteisö, joka on perustettu ajanjakson aikana. @fi
label: er dato for etablering av @no
definition: Relaterer et tidsrom til en korporasjon som blir etablert eller grunnlagt i et tidsrom. @no
toolkit label: dato for etablering av @no
toolkit definition: En korporasjon som blir etablert eller grunnlagt i et tidsrom. @no
label: est une date de fondation de @fr
definition: Met un laps de temps en relation avec une collectivité qui est établie ou fondée durant un laps de temps. @fr
toolkit label: date de fondation de @fr
toolkit definition: Collectivité qui est établie ou fondée durant un laps de temps. @fr
label: is datum van oprichting van @nl
definition: Relateert een tijdspanne aan een corporatie die gevestigd of opgericht is gedurende een tijdspanne. @nl
toolkit label: datum van oprichting van @nl
toolkit definition: Een corporatie die gevestigd of opgericht is gedurende een tijdspanne. @nl
label: هي تاريخ إنشاء لـ @ar
definition: تربط بين فترة زمنية وهيئة أُنشئت أو أسست خلال فترة زمنية. @ar
toolkit label: تاريخ إنشاء لـ @ar
toolkit definition: هيئة أُنشئت أو أسست خلال فترة زمنية. @ar
label: és data de creació de @ca
definition: Relaciona un interval de temps amb una entitat corporativa que es crea o funda durant un interval de temps. @ca
toolkit label: data de creació de @ca
toolkit definition: Entitat corporativa que es crea o funda durant un interval de temps. @ca
label: er dato for etablering af @da
definition: Relaterer en tidsperiode til en korporation, som i løbet af en tidsperiode er etableret eller grundlagt. @da
toolkit label: dato for etablering af @da
toolkit definition: Korporation, som i løbet af en tidsperiode er etableret eller grundlagt. @da
label: asutamisaeg asutusele @et
definition: Seostab ajavahemiku asutusega, mis on asutatud sel ajavahemikul. @et
toolkit label: asutamisaeg asutusele @et
toolkit definition: Asutus, mis on asutatud sel ajavahemikul. @et
label: ist Gründungsdatum von @de
definition: Setzt einen Zeitraum in Beziehung zu einer Körperschaft, die in einem Zeitraum eingeführt oder gegründet wurde. @de
toolkit label: Gründungsdatum von @de
toolkit definition: Eine Körperschaft, die in einem Zeitraum eingeführt oder gegründet wurde. @de
label: alapítási időpontja a következőnek: @hu
definition: Hozzákapcsol egy időtartamot egy testülethez, amelyet egy időtartam alatt alapítottak vagy létesítettek. @hu
toolkit label: alapítási időpontja: @hu
toolkit definition: Egy testület, amelyet egy időtartam alatt alapítottak vagy létesítettek. @hu
label: è data di istituzione di @it
definition: Correla un arco di tempo a un ente che è istituito o fondato durante un arco di tempo. @it
toolkit label: data di istituzione di @it
toolkit definition: Ente che è istituito o fondato durante un arco di tempo. @it
label: ir nodibināšanas datējums @lv
definition: Sasaista laikposmu ar institūciju, kas tiek nodibināta vai dibināta konkrētā laikposmā. @lv
toolkit label: ir nodibināšanas datējums @lv
toolkit definition: Laikposms, kurā tiek nodibināta vai dibināta institūcija. @lv
label: 是……的成立的日期 @zh-hans
definition: 将一个时间段与在一个时间段中成立或创办的一个团体关联起来。 @zh-hans
toolkit label: ……的成立的日期 @zh-hans
toolkit definition: 在一个时间段中成立或创办的一个团体 @zh-hans
has subproperty: P70032
label: kuruluşunun tarihidir @tr
definition: Bir zaman aralığını, zaman aralığı sırasında tesis edilen veya kurulan bir tüzel kişi ile ilişkilendirir. @tr
toolkit label: kuruluş tarihi @tr
toolkit definition: Zaman aralığı sırasında kurulan tüzel kişilik. @tr

is date of expression of
status: Published
type: Property
lexical alias: dateOfExpressionOf.en
definition: Relates a timespan to an expression that is associated with the earliest timespan.
domain: C10010
toolkit label: date of expression of
toolkit definition: An expression that is associated with the earliest timespan.
sub property of: has related expression of timespan
has element type: 2
label: ajankohta ekspressiolle @fi
definition: Liittää ajankohdan ekspressioon, johon liittyy varhaisin ajanjakso. @fi
toolkit label: ajankohta ekspressiolle @fi
toolkit definition: Ekspressio, johon liittyy varhaisin ajanjakso. @fi
label: er dato for uttrykk av @no
definition: Relaterer et tidsrom til et uttrykk som forbindes med det tidligste tidsrommet. @no
toolkit label: dato for uttrykk av @no
toolkit definition: Et uttrykk som forbindes med det tidligste tidsrommet. @no
label: est une date d’une expression de @fr
definition: Met un laps de temps en relation avec une expression qui est associée au laps de temps le plus ancien. @fr
toolkit label: date d’une expression de @fr
toolkit definition: Expression qui est associée au laps de temps le plus ancien. @fr
label: is datum van expressie van @nl
definition: Relateert een tijdspanne aan een expressie die geassocieerd is met de vroegste tijdspanne. @nl
toolkit label: datum van expressie van @nl
toolkit definition: Een expressie die geassocieerd is met de vroegste tijdspanne. @nl
label: تاريخ تعبيرة لـ @ar
definition: تربط بين فترة زمنية وتعبيرة مرتبطة بفترة زمنية مبكرة. @ar
toolkit label: تاريخ تعبيرة @ar
toolkit definition: تعبيرة مرتبطة بفترة زمنية مبكرة. @ar
label: és data d’expressió de @ca
definition: Relaciona un interval de temps amb una expressió que s’associa amb l’interval de temps més antic. @ca
toolkit label: data d’expressió de @ca
toolkit definition: Expressió que s’associa amb l’interval de temps més antic. @ca
label: er dato for udtryk af @da
definition: Relaterer en tidsperiode til et udtryk, som er knyttet til den tidligste tidsperiode. @da
toolkit label: dato for udtryk af @da
toolkit definition: Udtryk, som er knyttet til den tidligste tidsperiode. @da
label: väljenduse daatum väljenduses @et
definition: Seostab ajavahemiku väljendusega, millega seotud varaseim daatum on see ajavahemik. @et
toolkit label: väljenduse daatum väljenduses @et
toolkit definition: Väljendus, millega seotud varaseim daatum on see ajavahemik. @et
label: ist Datum einer Expression von @de
definition: Setzt einen Zeitraum in Beziehung zu einer Expression, die mit dem frühesten Zeitraum in Verbindung steht. @de
toolkit label: Datum einer Expression von @de
toolkit definition: Eine Expression, die mit dem frühesten Zeitraum in Verbindung steht. @de
label: a következő kifejezési forma dátuma: @hu
definition: Hozzákapcsol egy időtartamot egy kifejezési formához, amely kapcsolódik egy legkorábbi időtartamhoz. @hu
toolkit label: kifejezési forma dátuma @hu
toolkit definition: Egy kifejezési forma, amely kapcsolódik egy legkorábbi időtartamhoz. @hu
label: è data di espressione di @it
definition: Correla un arco di tempo a un'espressione che è associata con un arco di tempo precedente di un'espressione. @it
toolkit label: data di espressione di @it
toolkit definition: Espressione che è associata con un arco di tempo precedente di un'espressione. @it
label: ir datējums izteiksmei @lv
definition: Sasaista laikposmu ar izteiksmi, kas ir saistīta ar agrāko laikposmu. @lv
toolkit label: ir datējums izteiksmei @lv
toolkit definition: Izteiksme, kas ir saistīta ar agrāko laikposmu. @lv
label: 是……的内容表达的日期 @zh-hans
definition: 将一个时间段与和最早时间段有关的一种内容表达关联起来。 @zh-hans
toolkit label: ……的内容表达的日期 @zh-hans
toolkit definition: 和最早时间段有关的一种内容表达 @zh-hans
has subproperty: is date of capture of
has subproperty: P70024
label: anlatım tarihidir @tr
definition: Bir zaman aralığını, en erken zaman aralığıyla bağlantılı olan bir anlatımla ilişkilendirir. @tr
toolkit label: anlatım tarihi @tr
toolkit definition: En erken zaman aralığıyla bağlantılı olan bir anlatım. @tr

is date of manifestation of
status: Published
type: Property
lexical alias: dateOfManifestationOf.en
definition: Relates a timespan to a manifestation that is published, released, issued, printed, duplicated, cast, distributed, etc., in a published form or is inscribed, fabricated, constructed, etc., in a unpublished form during a timespan.
domain: C10010
toolkit label: date of manifestation of
toolkit definition: A manifestation that is a published manifestation that is published, released, issued, printed, duplicated, cast, distributed, etc., or an unpublished manifestation that is inscribed, fabricated, constructed, etc., during a timespan.
sub property of: has related manifestation of timespan
has element type: 2
label: ajankohta manifestaatiolle @fi
definition: Liittää ajanjakson julkaistuun manifestaatioon, joka on kustannettu, julkaistu, ilmestynyt, painettu, monistettu, valettu kirjasintin osalta, jaettu tms ajanjakson aikana. Liittää ajanjakson julkaisemattomaan manifestaatioon, joka on kaiverrettu, valmistettu, koottu tms. ajanjakson aikana. @fi
toolkit label: ajankohta manifestaatiolle @fi
toolkit definition: Julkaistu manifestaatio, joka on kustannettu, julkaistu, ilmestynyt, painettu, monistettu, valattu kirjasintin osalta, jaettu tms ajanjakson aikana. Julkaisematon manifestaatio, joka on kaiverrettu, valmistettu, koottu tms. ajanjakson aikana. @fi
label: er dato for manifestasjon av @no
definition: Relaterer et tidsrom til en manifestasjon som er en publisert manifestasjon som er publisert, tilgjengeliggjort, utstedt, mangfoldiggjort, kastet, distribuert etc., eller en upublisert manifestasjon som er inskribert, fabrikert, konstruert etc., i løpet av et tidsrom. @no
toolkit label: dato for manifestasjon av @no
toolkit definition: En manifestasjon som er en publisert manifestasjon som er publisert, tilgjengeliggjort, utstedt, mangfoldiggjort, kastet, distribuert etc., eller en upublisert manifestasjon som er inskribert, fabrikert, konstruert etc., i løpet av et tidsrom. @no
label: est une date d’une manifestation de @fr
definition: Met un laps de temps en relation avec une manifestation publiée qui est publiée, mise à disposition, éditée, imprimée, reproduite, moulée, diffusée ou distribuée, etc., ou manifestation non publiée écrite à la main, fabriquée, construite, etc. durant un laps de temps. @fr
toolkit label: date d’une manifestation de @fr
toolkit definition: Manifestation publiée qui est publiée, mise à disposition, éditée, imprimée, reproduite, moulée, diffusée ou distribuée, etc., ou manifestation non publiée écrite à la main, fabriquée, construite, etc. durant un laps de temps. @fr
label: is datum van manifestatie van @nl
definition: Relateert een tijdspanne aan een manifestatie die een gepubliceerde manifestatie is, die is gepubliceerd, uitgebracht, uitgevaardigd, gedrukt, gedupliceerd, gegoten etc. of een ongepubliceerde manifestatie die is afgeschreven, gefabriceerd, geconstrueerd etc. gedurende een tijdspanne. @nl
toolkit label: datum van manifestatie van @nl
toolkit definition: Een manifestatie die een gepubliceerde manifestatie is, die is gepubliceerd, uitgebracht, uitgevaardigd, gedrukt, gedupliceerd, gegoten etc. of een ongepubliceerde manifestatie die is afgeschreven, gefabriceerd, geconstrueerd etc. gedurende een tijdspanne. @nl
label: هي تاريخ تجسيدة لـ @ar
definition: تربط بين فترة زمنية وتجسيدة نشرت، أو أطلقت، أو طبعت، أو بثت، أو وزعت، إلخ. في شكل منشور أو دونت، أو صنعت، أو أنشئت، إلخ. في شكل غير منشور خلال فترة زمنية. @ar
toolkit label: تاريخ تجسيدة لـ @ar
toolkit definition: تجسيدة نشرت، أو أطلقت، أو طبعت، أو بثت، أو وزعت، إلخ. في شكل منشور أو دونت، أو صنعت، أو أنشئت، إلخ. في شكل غير منشور خلال فترة زمنية. @ar
label: és data de manifestació de @ca
definition: Relaciona un interval de temps amb una manifestació que és una manifestació publicada que es publica, es posa en circulació, s’emet, s’imprimeix, es reprodueix, es modela, es distribueix, etc., o una manifestació no publicada que s’inscriu, es fabrica, es construeix, etc., durant un interval de temps. @ca
toolkit label: data de manifestació de @ca
toolkit definition: Manifestació que és una manifestació publicada que es publica, es posa en circulació, s’emet, s’imprimeix, es reprodueix, es modela, es distribueix, etc., o una manifestació no publicada que s’inscriu, es fabrica, es construeix, etc., durant un interval de temps. @ca
label: er dato for manifestation af @da
definition: Relaterer en tidsperiode til en manifestation, som i løbet af en tidsperiode er publiceret, frigivet, udgivet, trykt, duplikeret, støbt, distribueret ect. i en publiceret form, eller er indskrevet, fremstillet, konstrueret ect. i en upubliceret form. @da
toolkit label: dato for manifestation af @da
toolkit definition: Manifestation, som i løbet af en tidsperiode er publiceret, frigivet, udgivet, trykt, duplikeret, støbt, distribueret ect. i en publiceret form, eller er indskrevet, fremstillet, konstrueret ect. i en upubliceret form. @da
label: kehastuse daatum kehastuses @et
definition: Seostab ajavahemiku kehastusega, mis on sel ajavahemikul avaldatud, välja lastud, välja antud, trükitud, paljundatud, valatud, levitatud vms (avaldatud kehastus) või inskribeeritud, toodetud, ehitatud vms (avaldamata kehastus). @et
toolkit label: kehastuse daatum kehastuses @et
toolkit definition: Kehastus, mis on sel ajavahemikul avaldatud, välja lastud, välja antud, trükitud, paljundatud, valatud, levitatud vms (avaldatud kehastus) või inskribeeritud, toodetud, ehitatud vms (avaldamata kehastus). @et
label: ist Datum einer Manifestation von @de
definition: Setzt einen Zeitraum in Beziehung zu einer veröffentlichten Manifestation, die in einem Zeitraum veröffentlicht, freigegeben, herausgegeben, gedruckt, vervielfältigt, gegossen, vertrieben und so weiter wird oder in dem eine unveröffentlichte Manifestation beschriftet, hergestellt, konstruiert und so weiter wird. @de
toolkit label: Datum einer Manifestation von @de
toolkit definition: Eine veröffentlichte Manifestation, die in einem Zeitraum veröffentlicht, freigegeben, herausgegeben, gedruckt, vervielfältigt, gegossen, vertrieben und so weiter wird oder in dem eine unveröffentlichte Manifestation beschriftet, hergestellt, konstruiert und so weiter wird. @de
label: a következő megjelenési forma dátuma: @hu
definition: Hozzákapcsol egy időtartamot egy megjelenési formához, amelyet egy időtartam alatt publikált formában publikáltak, megjelentettek, kiadtak, kinyomtattak, sokszoroztak, különlenyomatot készítettek róla, terjesztettek stb., vagy egy időtartam alatt nem publikált formában kézzel leírtak, legyártottak, megkonstruáltak stb. @hu
toolkit label: megjelenési forma dátuma @hu
toolkit definition: Egy megjelenési forma, amely egy publikált megjelenési forma, amelyet egy időtartam alatt publikáltak, megjelentettek, kiadtak, kinyomtattak, sokszoroztak, különlenyomatot készítettek róla, terjesztettek stb., vagy egy nem publikált megjelenési forma, amelyet egy időtartam alatt kézzel leírtak, legyártottak, megkonstruáltak stb. @hu
label: è data di manifestazione di @it
definition: Correla un arco di tempo a una manifestazione che è pubblicata, rilasciata, edita, stampata, duplicata, lanciata, distribuita, etc. in forma pubblicata o è incisa, fabbricata, costruita, etc. in forma non pubblicata durante un arco di tempo. @it
toolkit label: data di manifestazione di @it
toolkit definition: Manifestazione che è pubblicata, rilasciata, edita, stampata, duplicata, lanciata, distribuita, etc. in forma pubblicata o è incisa, fabbricata, costruita, etc. in forma non pubblicata durante un arco di tempo. @it
label: ir manifestācijas datējums @lv
definition: Sasaista laikposmu ar manifestāciju, kas ir publicēta manifestācija, kas ir izdota, drukāta, pavairota, izplatīta u.tml. noteiktā laikposmā, vai kas ir nepublicēta manifestācija, kas ir ierakstīta, izgatavota, izveidota u.tml. noteiktā laikposmā. @lv
toolkit label: ir manifestācijas datējums @lv
toolkit definition: Manifestācija, kas ir publicēta manifestācija, kas ir izdota, drukāta, pavairota, izplatīta u.tml. noteiktā laikposmā, vai kas ir nepublicēta manifestācija, kas ir ierakstīta, izgatavota, izveidota u.tml. noteiktā laikposmā. @lv
label: 是……的载体表现的日期 @zh-hans
definition: 将一个时间段与作为一种出版载体表现在一个时间段被出版、发布、印刷、复制、铸造、发行、经销等、或者一种非出版载体表现在一个时间段被镌刻、制造、构造等的一种载体表现关联起来。 @zh-hans
toolkit label: ……的载体表现的日期 @zh-hans
toolkit definition: 作为一种出版载体表现在一个时间段被出版、发布、印刷、复制、铸造、发行、经销等、或者一种非出版载体表现在一个时间段被镌刻、制造、构造等的一种载体表现 @zh-hans
has subproperty: is copyright date of
has subproperty: is date of distribution of
has subproperty: is date of manufacture of
has subproperty: is date of production of
has subproperty: is date of publication of
has subproperty: P70020
label: gösteriminin tarihidir @tr
definition: Bir zaman aralığını, zaman aralığı boyunca yayınlanmış bir biçimde yayınlanan, piyasaya sürülen ve çıkarılan, basılan, çoğaltılan, dağıtılan vb. veya bir zaman aralığı boyunca yayınlanmamış biçimde yazılmış, üretilmiş, yapılmış, vb. olan gösterim ile ilişkilendirir. @tr
toolkit label: gösterim tarihi @tr
toolkit definition: Bir zaman aralığında dağıtılan, basılan, çoğaltılan,dökülen, yayınlanan, piyasaya sürülen veya çıkarılan vb. yayınlanmış bir gösterim olan veya bir yerde kaydedilen, üretilen, yapılandırılan vb. yayınlanmamış bir gösterim olan bir gösterim. @tr

is date of manufacture of
status: Published
type: Property
lexical alias: dateOfManufactureOf.en
definition: Relates a timespan to a manifestation that is a published manifestation that is printed, duplicated, cast, etc., during a timespan.
domain: C10010
toolkit label: date of manufacture of
toolkit definition: A manifestation that is a published manifestation that is printed, duplicated, cast, etc., during a timespan.
sub property of: is date of manifestation of
has element type: 2
label: valmistusaika manifestaatiolle @fi
definition: Liittää ajankohdan julkaistuun manifestaatioon, joka on painettu, monistettu, valettu kirjasinten osalta tms. ajanjakson aikana. @fi
toolkit label: valmistusaika manifestaatiolle @fi
toolkit definition: Julkaistu manifestaatio, joka on painettu, monistettu, valettu kirjasinten osalta tms. ajanjakson aikana. @fi
label: er dato for framstilling av @no
definition: Relaterer et tidsrom til en manifestasjon som er en publisert manifestasjon som er trykt, mangfoldiggjort, kastet etc. i løpet av et tidsrom. @no
toolkit label: dato for framstilling av @no
toolkit definition: En manifestasjon som er en publisert manifestasjon som er trykt, mangfoldiggjort, kastet etc. i løpet av et tidsrom. @no
label: est une date de fabrication de @fr
definition: Met un laps de temps en relation avec une manifestation publiée qui est imprimée, reproduite, moulée, etc. durant un laps de temps. @fr
toolkit label: date de fabrication de @fr
toolkit definition: Manifestation publiée qui est imprimée, reproduite, moulée, etc. durant un laps de temps. @fr
label: is datum van vervaardiging van @nl
definition: Relateert een tijdspanne aan een manifestatie die een gepubliceerde manifestatie is, die is gedrukt, gedupliceerd, gegoten etc. gedurende een tijdspanne. @nl
toolkit label: datum van vervaardiging van @nl
toolkit definition: Een manifestatie die een gepubliceerde manifestatie is, die is gedrukt, gedupliceerd, gegoten etc. gedurende een tijdspanne. @nl
label: هي تاريخ تصنيع لـ @ar
definition: تربط بين فترة زمنية وتجسيدة منشورة طبعت، ونسخت، وبثت، إلخ. خلال فترة زمنية. @ar
toolkit label: تاريخ تصنيع لـ @ar
toolkit definition: تجسيدة منشورة طبعت، ونسخت، وبثت، إلخ. خلال فترة زمنية. @ar
label: és data de fabricació de @ca
definition: Relaciona un interval de temps amb una manifestació que és una manifestació publicada que s’imprimeix, es reprodueix, es modela, etc., durant un interval de temps. @ca
toolkit label: data de fabricació de @ca
toolkit definition: Manifestació que és una manifestació publicada que s’imprimeix, es reprodueix, es modela, etc., durant un interval de temps. @ca
label: er dato for fremstilling af @da
definition: Relaterer en tidsperiode til en manifestation, som er en publiceret manifestation, som i løbet af en tidsperiode er trykt, duplikeret, støbt ect. @da
toolkit label: dato for fremstilling af @da
toolkit definition: Manifestation, som er en publiceret manifestation, som i løbet af en tidsperiode er trykt, duplikeret, støbt ect. @da
label: valmistamisaeg kehastuses @et
definition: Seostab ajavahemiku avaldatud kehastusega, mis on sel ajavahemikul trükitud, paljundatud, valatud vms. @et
toolkit label: valmistamisaeg kehastuses @et
toolkit definition: Avaldatud kehastus, mis on sel ajavahemikul trükitud, paljundatud, valatud vms. @et
label: ist Herstellungsdatum von @de
definition: Setzt einen Zeitraum in Beziehung zu einer veröffentlichten Manifestation, die in einem Zeitraum gedruckt, vervielfältigt, gegossen und so weiter wird. @de
toolkit label: Herstellungsdatum von @de
toolkit definition: Eine veröffentlichte Manifestation, die in einem Zeitraum gedruckt, vervielfältigt, gegossen und so weiter wird. @de
label: gyártási időpontja a következőnek: @hu
definition: Hozzákapcsol egy időtartamot egy kiadott megjelenési formához, amelyet egy időtartam alatt nyomtattak, sokszorosítottak, öntöttek stb. @hu
toolkit label: gyártási időpontja: @hu
toolkit definition: Egy kiadott megjelenési forma, amelyet egy időtartam alatt nyomtattak, sokszorosítottak, öntöttek stb. @hu
label: è data di manifattura di @it
definition: Correla un arco di tempo a una manifestazione pubblicata che è stampata, duplicata, lanciata, etc. durante un arco di tempo. @it
toolkit label: data di manifattura di @it
toolkit definition: Manifestazione pubblicata che è stampata, duplicata, lanciata, etc. durante un arco di tempo. @it
label: ir ražošanas datējums @lv
definition: Sasaista laikposmu ar manifestāciju, kas ir publicēta manifestācija, kas ir iespiesta, pavairota u.tml. noteiktā laikposmā. @lv
toolkit label: ir ražošanas datējums @lv
toolkit definition: Manifestācija, kas ir publicēta manifestācija, kas ir iespiesta, pavairota u.tml. noteiktā laikposmā. @lv
label: 是……的生产日期 @zh-hans
definition: 将一个时间段与作为一种出版载体表现并在一个时间段被印刷、复制、铸造等的一种载体表现关联起来。 @zh-hans
toolkit label: ……的生产日期 @zh-hans
toolkit definition: 作为一种出版载体表现并在一个时间段被印刷、复制、铸造等的一种载体表现 @zh-hans
has subproperty: P70026
label: üretim tarihidir @tr
definition: Bir zaman aralığını, zaman aralığı boyunca basılan, çoğaltılan, yayınlanan, vb. yayınlanmış bir gösterim olan gösterimle ilişkilendirir. @tr
toolkit label: üretim tarihi @tr
toolkit definition: Bir zaman aralığı boyunca basılan, çoğaltılan vb. yayınlanmış bir gösterim olan bir gösterim. @tr

is date of production of
status: Published
type: Property
lexical alias: dateOfProductionOf.en
definition: Relates a timespan to a manifestation that is an unpublished manifestation that is inscribed, fabricated, constructed, etc., during a timespan.
domain: C10010
toolkit label: date of production of
toolkit definition: A manifestation that is an unpublished manifestation that is inscribed, fabricated, constructed, etc., during a timespan.
sub property of: is date of manifestation of
has element type: 2
label: tuotantoaika manifestaatiolle @fi
definition: Liittää ajanjakson julkaisemattomaan manifestaatioon, joka on kaiverrettu, valmistettu, koottu tms. ajanjakson aikana. @fi
toolkit label: tuotantoaika manifestaatiolle @fi
toolkit definition: Julkaisematon manifestaatio, joka on kaiverrettu, valmistettu, koottu tms. ajanjakson aikana. @fi
label: er dato for produksjon av @no
definition: Relaterer et tidsrom til en manifestasjon som er en upublisert manifestasjon som er inskribert, fabrikert, konstruert etc. i løpet av et tidsrom. @no
toolkit label: dato for produksjon av @no
toolkit definition: En manifestasjon som er en upublisert manifestasjon som er inskribert, fabrikert, konstruert etc. i løpet av et tidsrom. @no
label: est une date de production de @fr
definition: Met un laps de temps en relation avec une manifestation non publiée qui est écrite à la main, fabriquée, construite, etc. durant un laps de temps. @fr
toolkit label: date de production de @fr
toolkit definition: Manifestation non publiée qui est écrite à la main, fabriquée, construite, etc. durant un laps de temps. @fr
label: is datum van productie van @nl
definition: Relateert een tijdspanne aan een manifestatie die een ongepubliceerde manifestatie is die is afgeschreven, gefabriceerd, geconstrueerd etc. gedurende een tijdspanne. @nl
toolkit label: datum van productie van @nl
toolkit definition: Een manifestatie die een ongepubliceerde manifestatie is die is afgeschreven, gefabriceerd, geconstrueerd etc. gedurende een tijdspanne. @nl
label: هي تاريخ إنتاج لـ @ar
definition: تربط بين فترة زمنية وتجسيدة دونت، أو صنعت، أو أنشئت، إلخ. في شكل غير منشور خلال فترة زمنية. @ar
toolkit label: تاريخ إنتاج لـ @ar
toolkit definition: تجسيدة دونت، أو صنعت، أو أنشئت، إلخ. في شكل غير منشور خلال فترة زمنية. @ar
label: és data de producció de @ca
definition: Relaciona un interval de temps amb una manifestació que és una manifestació no publicada que s’inscriu, es fabrica, es construeix, etc., durant un interval de temps. @ca
toolkit label: data de producció de @ca
toolkit definition: Manifestació que és una manifestació no publicada que s’inscriu, es fabrica, es construeix, etc., durant un interval de temps. @ca
label: er dato for produktion af @da
definition: Relaterer en tidsperiode til en manifestation, som er en upubliceret manifestation, som i løbet af en tidsperiode er indskrevet, fremstillet, konstrueret ect. @da
toolkit label: dato for produktion af @da
toolkit definition: Manifestation, som er en upubliceret manifestation, som i løbet af en tidsperiode er indskrevet, fremstillet, konstrueret ect. @da
label: tootmisaeg kehastuses @et
definition: Seostab ajavahemiku avaldamata kehastusega, mis on sel ajavahemikul inskribeeritud, toodetud, ehitatud vms. @et
toolkit label: tootmisaeg kehastuses @et
toolkit definition: Avaldamata kehastus, mis on sel ajavahemikul inskribeeritud, toodetud, ehitatud vms. @et
label: ist Entstehungsdatum von @de
definition: Setzt einen Zeitraum in Beziehung zu einer unveröffentlichten Manifestation, die in einem Zeitraum beschriftet, fabriziert, konstruiert und so weiter wird. @de
toolkit label: Entstehungsdatum von @de
toolkit definition: Eine unveröffentlichte Manifestation, die in einem Zeitraum beschriftet, fabriziert, konstruiert und so weiter wird. @de
label: létrehozási időpontja a következőnek: @hu
definition: Hozzákapcsol egy időtartamot egy kiadatlan megjelenési formához, amelyet egy időtartam alatt írtak, készítettek, szerkesztettek stb. @hu
toolkit label: létrehozási időpontja: @hu
toolkit definition: Egy kiadatlan megjelenési forma, amelyet egy időtartam alatt írtak, készítettek, szerkesztettek stb. @hu
label: è data di produzione di @it
definition: Correla un arco di tempo a una manifestazione non pubblicata che è incisa, fabbricata, costruita, etc. durante un arco di tempo. @it
toolkit label: data di produzione di @it
toolkit definition: Manifestazione non pubblicata che è incisa, fabbricata, costruita, etc. durante un arco di tempo. @it
label: ir izgatavošanas datējums @lv
definition: Sasaista laikposmu ar manifestāciju, kas ir nepublicētā manifestācija, kas laikposmā tiek uzrakstīta, izgatavota u.tml. @lv
toolkit label: ir izgatavošanas datējums @lv
toolkit definition: Nepublicētā manifestācija, kas laikposmā tiek uzrakstīta, izgatavota u.tml. @lv
label: 是……的制作日期 @zh-hans
definition: 将一个时间段与作为一种非出版载体表现并在一个时间段镌刻、制造、构建等的一种载体表现关联起来。 @zh-hans
toolkit label: ……的制作日期 @zh-hans
toolkit definition: 作为一种非出版载体表现并在一个时间段镌刻、制造、构建等的一种载体表现 @zh-hans
has subproperty: P70027
label: yapım tarihidir @tr
definition: Bir zaman aralığını, zaman aralığı boyunca tescil edilen, imal edilen, yapılandırılan yayınlanmamış bir gösterim olan bir gösterimle ilişkilendirir. @tr
toolkit label: imalat tarihi @tr
toolkit definition: Bir zaman aralığı boyunca yazılan, üretilen, yapılandırılan, vb. yayınlanmamış bir gösterim olan bir gösterim. @tr

is date of publication of
status: Published
type: Property
lexical alias: dateOfPublicationOf.en
definition: Relates a timespan to a manifestation that is published, released, or issued in a published form during a timespan.
domain: C10010
toolkit label: date of publication of
toolkit definition: A manifestation that is published, released, or issued in a published form during a timespan.
sub property of: is date of manifestation of
has element type: 2
label: julkaisuaika manifestaatiolle @fi
definition: Liittää ajanjakson julkaistuun manifestaatioon, joka on kustannettu, julkaistu, ilmestynyt tms. ajanjakson aikana. @fi
toolkit label: julkaisuaika manifestaatiolle @fi
toolkit definition: Julkaistu manifestaatio, joka on kustannettu, julkaistu, ilmestynyt tms. ajanjakson aikana. @fi
label: er dato for publisering av @no
definition: Relaterer et tidsrom til en manifestasjon som er en publisert, tilgjengeliggjort eller utstedt i en publisert form i løpet av et tidsrom. @no
toolkit label: dato for publisering av @no
toolkit definition: En manifestasjon som er en publisert, tilgjengeliggjort eller utstedt i en publisert form i løpet av et tidsrom. @no
label: est une date de publication de @fr
definition: Met un laps de temps en relation avec une manifestation qui est publiée, mise à disposition ou éditée durant un laps de temps. @fr
toolkit label: date de publication de @fr
toolkit definition: Manifestation qui est publiée, mise à disposition ou éditée durant un laps de temps. @fr
label: is datum van publicatie van @nl
definition: Relateert een tijdspanne aan een manifestatie die gepubliceerd, uitgebracht of uitgevaardigd is in een gepubliceerde vorm gedurende een tijdspanne. @nl
toolkit label: datum van publicatie van @nl
toolkit definition: Een manifestatie die gepubliceerd, uitgebracht of uitgevaardigd is in een gepubliceerde vorm gedurende een tijdspanne. @nl
label: هي تاريخ نشر لـ @ar
definition: تربط بين فترة زمنية وتجسيدة نشرت، أو أطلقت، أو طبعت، أو بثت، أو وزعت، إلخ. في شكل منشور خلال فترة زمنية. @ar
toolkit label: تاريخ نشر لـ @ar
toolkit definition: تجسيدة نشرت، أو أطلقت، أو طبعت، أو بثت، أو وزعت، إلخ. في شكل منشور خلال فترة زمنية. @ar
label: és data de publicació de @ca
definition: Relaciona un interval de temps amb una manifestació que es publica, es posa en circulació, o s’emet en una forma publicada durant un interval de temps. @ca
toolkit label: data de publicació de @ca
toolkit definition: Manifestació que es publica, es posa en circulació o s’emet en una forma publicada durant un interval de temps. @ca
label: er dato for udgivelse af @da
definition: Relaterer en tidsperiode til en manifestation, som i løbet af en tidsperiode er publiceret, frigivet eller udgivet i en publiceret form. @da
toolkit label: dato for udgivelse af @da
toolkit definition: Manifestation, som i løbet af en tidsperiode er publiceret, frigivet eller udgivet i en publiceret form. @da
label: ilmumisaasta kehastuses @et
definition: Seostab ajavahemiku kehastusega, mis on sel ajavahemikul avaldatud, välja lastud või välja antud. @et
toolkit label: ilmumisaasta kehastuses @et
toolkit definition: Kehastus, mis on sel ajavahemikul avaldatud, välja lastud või välja antud. @et
label: ist Erscheinungsdatum von @de
definition: Setzt einen Zeitraum in Beziehung zu einer Manifestation, die in einem Zeitraum in veröffentlichter Form veröffentlicht, freigeschaltet oder herausgegeben wird. @de
toolkit label: Erscheinungsdatum von @de
toolkit definition: Eine Manifestation, die in einem Zeitraum in veröffentlichter Form veröffentlicht, freigeschaltet oder herausgegeben wird. @de
label: kiadási időpontja a következőnek: @hu
definition: Hozzákapcsol egy időtartamot egy kiadott megjelenési formához, amelyet egy időtartam alatt publikált formában kiadtak, kibocsájtottak vagy megjelentettek. @hu
toolkit label: kiadási időpontja: @hu
toolkit definition: Egy megjelenési forma, amelyet egy időtartam alatt publikált formában kiadtak, kibocsájtottak vagy megjelentettek. @hu
label: è data di pubblicazione di @it
definition: Correla un arco di tempo a una manifestazione pubblicata, rilasciata o edita in forma pubblicata durante un arco di tempo. @it
toolkit label: data di pubblicazione di @it
toolkit definition: Manifestazione pubblicata, rilasciata o edita in forma pubblicata durante un arco di tempo. @it
label: ir izdošanas datējums manifestācijai @lv
definition: Sasaista laikposmu ar manifestāciju, kas ir publicēta, izlaista vai izdota noteiktā laikposmā. @lv
toolkit label: ir izdošanas datējums manifestācijai @lv
toolkit definition: Manifestācija, kas ir publicēta, izlaista vai izdota noteiktā laikposmā. @lv
label: 是……的出版日期 @zh-hans
definition: 将一个时间段与在一个时间段以出版形式被出版、发布或发行的一种载体表现关联起来。 @zh-hans
toolkit label: ……的出版日期 @zh-hans
toolkit definition: 在一个时间段以出版形式被出版、发布或发行的一种载体表现 @zh-hans
has subproperty: P70028
label: yayınlanma tarihidir @tr
definition: Bir zaman aralığını, zaman aralığında yayınlanan, piyasaya sürülen veya yayınlanmış bir biçimde piyasaya çıkarılan gösterimle ilişkilendirir. @tr
toolkit label: yayınlanma tarihi @tr
toolkit definition: Bir zaman aralığında yayımlanan, piyasaya sürülen veya yayınlanmış bir biçimde sunulan bir gösterim. @tr

is date of representative expression of
status: Published
lexical alias: dateOfRepresentativeExpressionOf.en
definition: Relates a timespan to a work that is associated with the earliest timespan of a representative expression.
toolkit label: date of representative expression of
toolkit definition: A work that is associated with the earliest timespan of a representative expression.
type: Property
domain: C10010
sub property of: has related work of timespan
has element type: 2
label: ajankohta edustavalle ekspressiolle @fi
definition: Liittää ajanjakson teokseen, johon liittyy edustavan ekspression varhaisin ajanjakso. @fi
toolkit label: ajankohta edustavalle ekspressiolle @fi
toolkit definition: Teos, johon liittyy edustavan ekspression varhaisin ajanjakso. @fi
label: er dato for representativt uttrykk for @no
definition: Relaterer et tidsrom til et verk som forbindes med det tidligste tidsrommet for et representativt uttrykk. @no
toolkit label: dato for representativt uttrykk for @no
toolkit definition: Et verk som forbindes med det tidligste tidsrommet for et representativt uttrykk. @no
label: est une date d’une expression représentative de @fr
definition: Met un laps de temps en relation avec une œuvre qui est associée au laps de temps le plus ancien d’une expression représentative. @fr
toolkit label: date d’une expression représentative de @fr
toolkit definition: Œuvre qui est associée au laps de temps le plus ancien d’une expression représentative. @fr
label: is datum van representatieve expressie van @nl
definition: Relateert een tijdspanne aan een werk dat geassocieerd is met de vroegste tijdspanne van een representatieve expressie. @nl
toolkit label: datum van representatieve expressie van @nl
toolkit definition: Een werk dat geassocieerd is met de vroegste tijdspanne van een representatieve expressie. @nl
label: هي تاريخ تعبيرة ممثلة لـ @ar
definition: تربط بين فترة زمنية وعمل مرتبط بفترة زمنية سابقة لتعبيرة ممثلة. @ar
toolkit label: تاريخ استخدام لتعبيرة ممثلة لـ @ar
toolkit definition: عمل مرتبط بفترة زمنية مبكرة لتعبيرة ممثلة. @ar
label: és data d’expressió representativa de @ca
definition: Relaciona un interval de temps amb una obra que s’associa amb l’interval de temps més antic d’una expressió representativa. @ca
toolkit label: data d’expressió representativa de @ca
toolkit definition: Obra que s’associa amb l’interval de temps més antic d’una expressió representativa. @ca
label: er dato for repræsentativt udtryk af @da
definition: Relaterer en tidsperiode til et værk, som er knyttet til et repræsentativt udtryks tidligste tidsperiode. @da
toolkit label: dato for repræsentativt udtryk af @da
toolkit definition: Værk, som er knyttet til et repræsentativt udtryks tidligste tidsperiode. @da
label: iseloomuliku väljenduse daatum teoses @et
definition: Seostab ajavahemiku teosega, mis on seotud iseloomuliku väljenduse varaseima ajavahemikuga. @et
toolkit label: iseloomuliku väljenduse daatum teoses @et
toolkit definition: Teos, mis on seotud iseloomuliku väljenduse varaseima ajavahemikuga. @et
label: ist Datum einer repräsentativen Expression von @de
definition: Setzt einen Zeitraum in Beziehung zu einem Werk, das mit dem frühesten Zeitraum einer repräsentativen Expression in Verbindung steht. @de
toolkit label: Datum einer repräsentativen Expression von @de
toolkit definition: Ein Werk, das mit dem frühesten Zeitraum einer repräsentativen Expression in Verbindung steht. @de
label: a következő reprezentatív kifejezési forma dátuma: @hu
definition: Egy időtartamot hozzákapcsol egy műhöz, amely kapcsolódik egy reprezentatív kifejezési forma egy legkorábbi időtartamához. @hu
toolkit label: reprezentatív kifejezési forma dátuma @hu
toolkit definition: Egy mű, amely kapcsolódik egy reprezentatív kifejezési forma egy legkorábbi időtartamához. @hu
label: è data dell'espressione rappresentativa @it
definition: Correla un arco di tempo a un'opera che è associata con un arco di tempo precedente di un'espressione rappresentativa. @it
toolkit label: data dell'espressione rappresentativa @it
toolkit definition: Opera che è associata con un arco di tempo precedente di un'espressione rappresentativa. @it
label: ir reprezentatīvās izteiksmes datējums @lv
definition: Sasaista laikposmu ar darbu, kas saistīts ar reprezentatīvās izteiksmes agrāko laikposmu. @lv
toolkit label: ir reprezentatīvās izteiksmes datējums @lv
toolkit definition: Darbs, kas saistīts ar reprezentatīvās izteiksmes agrāko laikposmu. @lv
label: 是……的代表性内容表达的日期 @zh-hans
definition: 将一个时间段与和一种代表性内容表达的最早时间段有关的一种作品关联起来。 @zh-hans
toolkit label: ……的代表性内容表达的日期 @zh-hans
toolkit definition: 和一种代表性内容表达的最早时间段有关的一种作品 @zh-hans
has subproperty: P70057
label: temsili anlatımı tarihidir @tr
definition: Bir zaman aralığını, temsili bir anlatımın en erken zaman aralığı ile bağlantılı olan bir eserle ilişkilendirir. @tr
toolkit label: temsili anlatımın tarihi @tr
toolkit definition: Temsili bir anlatımın en erken zaman aralığı ile bağlantılı olan bir çalışma. @tr

is date of termination of
status: Published
type: Property
lexical alias: dateOfTerminationOf.en
definition: Relates a timespan to a corporate body who is terminated or dissolved during a timespan.
domain: C10010
toolkit label: date of termination of
toolkit definition: A corporate body who is terminated or dissolved during a timespan.
sub property of: has related corporate body of timespan
has element type: 2
label: lakkauttamisaika yhteisölle @fi
definition: Liittää ajanjakson yhteisöön, joka on lakkautettu tai hajotettu ajanjakson aikana. @fi
toolkit label: lakkauttamisaika yhteisölle @fi
toolkit definition: Yhteisö, joka on lakkautettu tai hajotettu ajanjakson aikana. @fi
label: er dato for avvikling @no
definition: Relaterer et tidsrom til en korporasjon som blir avviklet eller oppløst i løpet av et tidsrom. @no
toolkit label: dato for avvikling @no
toolkit definition: En korporasjon som blir avviklet eller oppløst i løpet av et tidsrom. @no
label: est une date de cessation de @fr
definition: Met un laps de temps en relation avec une collectivité qui cesse son activité ou est dissoute durant un laps de temps. @fr
toolkit label: date de cessation de @fr
toolkit definition: Collectivité qui cesse son activité ou est dissoute durant un laps de temps. @fr
label: is datum van opheffing van @nl
definition: Relateert een tijdspanne aan een corporatie die beëindigd of ontbonden is gedurende een tijdspanne. @nl
toolkit label: datum van opheffing van @nl
toolkit definition: Een corporatie die beëindigd of ontbonden is gedurende een tijdspanne. @nl
label: هي تاريخ توقف لـ @ar
definition: تربط بين فترة زمنية وهيئة توقفت أو حُلَّت خلال فترة زمنية. @ar
toolkit label: تاريخ توقف لـ @ar
toolkit definition: هيئة توقفت أو حُلَّت خلال فترة زمنية. @ar
label: és data de cessament de @ca
definition: Relaciona un interval de temps amb una entitat corporativa que cessa o es dissol durant un interval de temps. @ca
toolkit label: data de cessament de @ca
toolkit definition: Entitat corporativa que cessa o es dissol durant un interval de temps. @ca
label: er dato for ophør af @da
definition: Relaterer et tidsforløb til en korporation, som i løbet af en tidsperiode er ophørt eller opløst. @da
toolkit label: dato for ophør af @da
toolkit definition: Korporation, som i løbet af et tidsforløb er ophørt eller opløst. @da
label: tegevuse lõpetamise aeg asutusele @et
definition: Seostab ajavahemiku asutusega, mille tegevus on lõpetatud sel ajavahemikul. @et
toolkit label: tegevuse lõpetamise aeg asutusele @et
toolkit definition: Asutus, mille tegevus on lõpetatud sel ajavahemikul. @et
label: ist Auflösungsdatum von @de
definition: Setzt einen Zeitraum in Beziehung zu einer Körperschaft, die in einem Zeitraum aufgehoben oder aufgelöst wurde. @de
toolkit label: Auflösungsdatum von @de
toolkit definition: Eine Körperschaft, die in einem Zeitraum aufgehoben oder aufgelöst wurde. @de
label: megszűnési időpontja a következőnek: @hu
definition: Hozzákapcsol egy időtartamot egy testülethez, amelyet egy időtartam alatt szüntettek meg vagy oszlattak fel. @hu
toolkit label: megszűnési időpontja: @hu
toolkit definition: Egy testület, amelyet egy időtartam alatt szüntettek meg vagy oszlattak fel. @hu
label: è data di fine di @it
definition: Correla un arco di tempo a un ente che è finito o si è sciolto durante un arco di tempo. @it
toolkit label: data di fine di @it
toolkit definition: Ente che è finito o si è sciolto durante un arco di tempo. @it
label: ir beidzis pastāvēt @lv
definition: Sasaista laikposmu ar institūciju, kas beidz pastāvēt vai likvidēta laikposmā. @lv
toolkit label: ir beidzis pastāvēt @lv
toolkit definition: Institūcija, kas beidz pastāvēt vai likvidēta laikposmā. @lv
label: 是……的终止的日期 @zh-hans
definition: 将一个时间段与在一个时间段中终止或解散的一个团体关联起来。 @zh-hans
toolkit label: ……的终止的日期 @zh-hans
toolkit definition: 在一个时间段中终止或解散的一个团体 @zh-hans
has subproperty: P70033
label: sonlanma tarihidir @tr
definition: Bir zaman aralığını, zaman aralığı sırasında sonlandırılan veya feshedilen bir tüzel kişi ile ilişkilendirir. @tr
toolkit label: sonlandırma tarihi @tr
toolkit definition: Bir zaman aralığı sırasında sonlandırılan veya feshedilen bir tüzel kişilik. @tr

is date of usage of
status: Published
lexical alias: dateOfUsageOf.en
definition: Relates a timespan to a nomen that is used during a timespan.
toolkit label: date of usage of
toolkit definition: A nomen that is used during a timespan.
type: Property
domain: C10010
has element type: 3
sub property of: has related nomen of timespan
label: käyttöajankohta RDA-entiteetin nimitykselle @fi
definition: Liittää ajanjakson nomeniin, joka on RDA-entiteetin nimitys, jota käytetään ajanjakson aikana. @fi
toolkit label: käyttöajankohta RDA-entiteetin nimitykselle @fi
toolkit definition: Nomen, joka on RDA-entiteetin nimitys, jota käytetään ajanjakson aikana. @fi
label: er dato for bruk for @no
definition: Relaterer et tidsrom til en betegnelse for en RDA-entitet som brukes i løpet av et tidsrom. @no
toolkit label: dato for bruk for @no
toolkit definition: En betegnelse for en RDA-entitet som brukes i løpet av et tidsrom. @no
label: est une date d’utilisation de @fr
definition: Met un laps de temps en relation avec un nomen qui est utilisé durant un laps de temps. @fr
toolkit label: date d’utilisation de @fr
toolkit definition: Nomen qui est utilisé durant un laps de temps. @fr
label: is datum van gebruik van @nl
definition: Relateert een tijdspanne aan een benaming van een RDA-entiteit die gebruikt is gedurende een tijdspanne. @nl
toolkit label: datum van gebruik van @nl
toolkit definition: Een nomen dat is een benaming van een RDA-entiteit die gebruikt is gedurende een tijdspanne. @nl
label: هي تاريخ استخدام لـ @ar
definition: تربط بين فترة زمنية واسم تعريفي لكيان "وام" استخدم خلال فترة زمنية. @ar
toolkit label: تاريخ استخدام لـ @ar
toolkit definition: تسمية عبارة عن اسم تعريفي لكيان "وام" استخدم خلال فترة زمنية. @ar
label: és data d’ús de @ca
definition: Relaciona un interval de temps amb un nomen que s’usa durant un interval de temps. @ca
toolkit label: data d’ús de @ca
toolkit definition: Nomen que s’usa durant un interval de temps. @ca
label: er dato for brug af @da
definition: Relaterer en tidsperiode til en benævnelse på en RDA-entitet, som bruges i løbet af en tidsperiode. @da
toolkit label: dato for brug af @da
toolkit definition: Benævnelse på en RDA-entitet, som bruges i løbet af en tidsperiode. @da
label: kasutusaeg RDA olemi nimetusele @et
definition: Seostab ajavahemiku RDA olemi nimetusega, mis on sel ajavahemikul kasutuses. @et
toolkit label: kasutusaeg RDA olemi nimetusele @et
toolkit definition: RDA olemi nimetus, mis on sel ajavahemikul kasutuses. @et
label: ist Verwendungsdatum von @de
definition: Setzt einen Zeitraum in Beziehung zu einer Bezeichnung für eine RDA-Entität, die in einem Zeitraum verwendet wird. @de
toolkit label: Verwendungsdatum von @de
toolkit definition: Eine Bezeichnung für eine RDA-Entität, die in einem Zeitraum verwendet wird. @de
label: használati időpontja a következőnek: @hu
definition: Hozzákapcsol egy időtartamot egy időtartam alatt használt RDA-entitás megnevezéséhez. @hu
toolkit label: használati időpontja: @hu
toolkit definition: Egy nomen, amely egy időtartam alatt használt RDA-entitás megnevezése. @hu
label: è data d'uso di @it
definition: Correla un arco di tempo a una designazione di un'entità RDA che è usata durante un arco di tempo. @it
toolkit label: data d'uso di @it
toolkit definition: Designazione di un'entità RDA che è usata durante un arco di tempo. @it
label: ir lietojuma datējums @lv
definition: Sasaista laikposmu ar RDA entītes apzīmējumu, ko izmanto laikposmā. @lv
toolkit label: ir lietojuma datējums @lv
toolkit definition: RDA entītes apzīmējums, ko izmanto laikposmā. @lv
label: 是……的使用日期 @zh-hans
definition: 将一个时间段与用于一个时间段的一个命名关联起来。 @zh-hans
toolkit label: ……的使用日期 @zh-hans
toolkit definition: 用于一个时间段的一个命名 @zh-hans
has subproperty: P70056
label: kullanım tarihidir @tr
definition: Bir zaman aralığını, zaman aralığı boyunca kullanılan bir isimle ilişkilendirir. @tr
toolkit label: kullanım tarihi @tr
toolkit definition: Bir zaman aralığı boyunca kullanılan bir isim. @tr

is date of work of
status: Published
type: Property
lexical alias: dateOfWorkOf.en
domain: C10010
toolkit label: date of work of
sub property of: has related work of timespan
has element type: 2
definition: Relates a timespan to a work that is associated with the earliest timespan.
toolkit definition: A work that is associated with the earliest timespan.
label: ajankohta teokselle @fi
definition: Liittää ajankohdan teokseen, johon liittyy varhaisin ajanjakso. @fi
toolkit label: ajankohta teokselle @fi
toolkit definition: Teos, johon liittyy varhaisin ajanjakso. @fi
label: er dato for verk for @no
definition: Relaterer et tidsrom til et verk som forbindes med det tidligste tidrommet for et verk. @no
toolkit label: dato for verk for @no
toolkit definition: Et verk som forbindes med det tidligste tidrommet for et verk. @no
label: est une date d’une œuvre de @fr
definition: Met un laps de temps en relation avec une œuvre qui est associée au laps de temps le plus ancien. @fr
toolkit label: date d’une œuvre de @fr
toolkit definition: Œuvre qui est associée au laps de temps le plus ancien. @fr
label: is datum van werk van @nl
definition: Relateert een tijdspanne aan een werk dat geassocieerd is met de vroegste tijdspanne. @nl
toolkit label: datum van werk van @nl
toolkit definition: Een werk dat geassocieerd is met de vroegste tijdspanne. @nl
label: هي تاريخ عمل لـ @ar
definition: تربط بين فترة زمنية وعمل مرتبط بفترة زمنية مبكرة لعمل. @ar
toolkit label: تاريخ عمل لـ @ar
toolkit definition: عمل مرتبط بفترة زمنية مبكرة لعمل. @ar
label: és data d’obra de @ca
definition: Relaciona un interval de temps amb una obra que s’associa amb l’interval de temps més antic. @ca
toolkit label: data d’obra de @ca
toolkit definition: Obra que s’associa amb l’interval de temps més antic. @ca
label: er dato for værk af @da
definition: Relaterer en tidsperiode til et værk, som er knyttet til et værks tidligste tidsperiode. @da
toolkit label: dato for værk af @da
toolkit definition: Værk, som er knyttet til et værks tidligste tidsperiode. @da
label: teose daatum teoses @et
definition: Seostab ajavahemiku teosega, millega seotud varaseim daatum on see ajavahemik. @et
toolkit label: teose daatum teoses @et
toolkit definition: Teos, millega seotud varaseim daatum on see ajavahemik. @et
label: ist Datum eines Werks von @de
definition: Setzt einen Zeitraum in Beziehung zu einem Werk, das mit dem frühesten Zeitraum in Verbindung steht. @de
toolkit label: Datum eines Werks von @de
toolkit definition: Ein Werk, das mit dem frühesten Zeitraum in Verbindung steht. @de
label: a következő mű dátuma: @hu
definition: Hozzákapcsol egy időtartamot egy műhöz, amelyet egy időtartamhoz társítanak. @hu
toolkit label: mű dátuma @hu
toolkit definition: Egy mű, amelyet egy időtartamhoz társítanak. @hu
label: è data di opera di @it
definition: Correla un arco di tempo a un'opera che è associata con un arco di tempo precedente di un'opera. @it
toolkit label: data di opera di @it
toolkit definition: Opera che è associata con un arco di tempo precedente di un'opera. @it
label: ir darba datējums @lv
toolkit label: ir darba datējums @lv
definition: Sasaista laikposmu ar darbu, kas saistīts ar agrākā darba laikposmu. @lv
toolkit definition: Darbs, kas saistīts ar agrākā darba laikposmu. @lv
label: 是……的作品的日期 @zh-hans
toolkit label: ……的作品的日期 @zh-hans
definition: 将一个时间段与和最早时间段有关的一种作品关联起来。 @zh-hans
toolkit definition: 和最早时间段有关的一种作品 @zh-hans
has subproperty: is year degree granted of
has subproperty: P70022
label: eserinin tarihidir @tr
toolkit label: eserin tarihi @tr
definition: Bir zaman aralığını, en eski zaman aralığıyla bağlantılı olanbir eserle ilişkilendirir. @tr
toolkit definition: En eski zaman aralığıyla bağlantılı olan bir çalışma. @tr

is duration of (Deprecated)
type: Property
lexical alias: durationOf.en
definition: Relates a timespan to an expression that has an extent of expression that is a playing time, performance time, running time, or other timespan. (Deprecated)
domain: C10010
toolkit label: duration of (Deprecated)
toolkit definition: An expression that has an extent of expression that is a playing time, performance time, running time, or other timespan. (Deprecated)
sub property of: has related expression of timespan
has element type: 3
label: kesto ekspressiolle @fi
definition: Liittää ajanjakson ekspressioon, jonka kesto on soittoaika, esitysaika, toistoaika tai muu ajanjakso. @fi
toolkit label: kesto ekspressiolle @fi
toolkit definition: Ekspressio, jonka kesto on soittoaika, esitysaika, toistoaika tai muu ajanjakso. @fi
label: er varighet for @no
definition: Relaterer et tidsrom til et uttrykk som har et omfang for uttrykk som er en spilletid, framføringstid, avspillingstid eller annet tidsrom. @no
toolkit label: varighet for @no
toolkit definition: Et uttrykk som har et omfang for uttrykk som er en spilletid, framføringstid, avspillingstid eller annet tidsrom. @no
status: Deprecated
label: est une durée de @fr
definition: Met un laps de temps en relation avec une expression qui possède une étendue d’une expression consistant en une durée de lecture, d’exécution, de projection, etc. ou en un autre laps de temps. @fr
toolkit label: durée de @fr
toolkit definition: Expression qui possède une étendue d’une expression consistant en une durée de lecture, d’exécution, de projection, etc. ou en un autre laps de temps. @fr
label: is duur van @nl
definition: Relateert een tijdspanne aan een expressie die een omvang van expressie heeft die een speelduur, uitvoeringsduur, looptijd of andere tijdspanne is. @nl
toolkit label: duur van @nl
toolkit definition: Een expressie die een omvang van expressie heeft die een speelduur, uitvoeringsduur, looptijd of andere tijdspanne is. @nl
label: هي فترة لـ @ar
definition: تربط بين فترة زمنية وتعبيرة لها امتداد لتعبيرة هو زمن التشغيل، أو زمن الأداء، أو زمن الدوران، أو أي فترة زمنية أخرى. @ar
toolkit label: فترة لـ @ar
toolkit definition: تعبيرة لها امتداد لتعبيرة هو زمن التشغيل، أو زمن الأداء، أو زمن الدوران، أو أي فترة زمنية أخرى. @ar
label: és durada de @ca
definition: Relaciona un interval de temps amb una expressió que té una extensió d’expressió que és un temps de reproducció, de projecció, d’execució o qualsevol altre interval de temps. @ca
toolkit label: durada de @ca
toolkit definition: Expressió que té una extensió d’expressió que és un temps de reproducció, de projecció, d’execució o qualsevol altre interval de temps. @ca
label: er spilletid for @da
definition: Relaterer en tidsperiode til et udtryk, som har et omfang af et udtryk, som er en varighed, opførelsestid, spilletid etc. eller anden tidsperiode. @da
toolkit label: spilletid for @da
toolkit definition: Udtryk, som har et omfang af et udtryk, som er en varighed, opførelsestid, spilletid etc. eller anden tidsperiode. @da
label: kestus väljenduses @et
definition: Seostab ajavahemiku väljendusega, millel on väljenduse maht, milleks on mängimisaeg, esituse aeg, töötamisaeg või muu ajavahemik. @et
toolkit label: kestus väljenduses @et
toolkit definition: Väljendus, millel on väljenduse maht, milleks on mängimisaeg, esituse aeg, töötamisaeg või muu ajavahemik. @et
label: ist Dauer von @de
definition: Setzt einen Zeitraum in Beziehung zu einer Expression, die über einen Umfang einer Expression verfügt, bei dem es sich um eine Wiedergabezeit, eine Aufführungszeit, eine Laufzeit oder einen anderen Zeitraum handelt. @de
toolkit label: Dauer von @de
toolkit definition: Expression, die über einen Umfang einer Expression verfügt, bei dem es sich um eine Wiedergabezeit, eine Aufführungszeit, eine Laufzeit oder einen anderen Zeitraum handelt. @de
label: a következő tartama: @hu
definition: Egy időtartamot hozzákapcsol egy kifejezési formához, amely rendelkezik egy kifejezésiforma-terjedelemmel, ami egy lejátszási idő, futási idő vagy egyéb időtartam. @hu
toolkit label: tartama @hu
toolkit definition: Egy kifejezési forma, amely rendelkezik egy kifejezésiforma-terjedelemmel, ami egy lejátszási idő, futási idő vagy egyéb időtartam. @hu
label: è durata di @it
definition: Correla un arco di tempo a un'espressione che ha una estensione di espressione che è un tempo di gioco, tempo di interpretazione, durata o altro arco di tempo. @it
toolkit label: durata di @it
toolkit definition: Espressione che ha una estensione di espressione che è un tempo di gioco, tempo di interpretazione, durata o altro arco di tempo. @it
has subproperty: P70041

is duration of representative expression of (Deprecated)
type: Property
lexical alias: durationOfRepresentativeExpressionOf.en
domain: C10010
has element type: 2
definition: Relates a timespan to a work that has an extent of expression of a representative expression that is a playing time, performance time, running time, or other timespan. (Deprecated)
toolkit label: duration of representative expression of (Deprecated)
toolkit definition: A work that has an extent of expression of a representative expression that is a playing time, performance time, running time, or other timespan. (Deprecated)
sub property of: has related work of timespan
label: kesto edustavalle ekspressiolle @fi
definition: Liittää ajanjakson teokseen, jonka edustavan ekspression kesto on soittoaika, esitysaika, toistoaika tai muu ajanjakso. @fi
toolkit label: kesto edustavalle ekspressiolle @fi
toolkit definition: Teos, jonka edustavan ekspression kesto on soittoaika, esitysaika, toistoaika tai muu ajanjakso. @fi
label: er varighet for representativt uttrykk for @no
definition: Relaterer et tidsrom til et verk som har et omfang for uttrykk av et representativt uttrykk som er en spilletid, framføringstid, avspillingstid eller annet tidsrom. @no
toolkit label: varighet for representativt uttrykk for @no
toolkit definition: Et verk som har et omfang for uttrykk av et representativt uttrykk som er en spilletid, framføringstid, avspillingstid eller annet tidsrom. @no
status: Deprecated
label: est une durée d’une expression représentative de @fr
definition: Met un laps de temps en relation avec une œuvre qui possède une étendue d’une expression représentative consistant en une durée de lecture, d’exécution, de projection, etc. ou en un autre laps de temps. @fr
toolkit label: durée d’une expression représentative de @fr
toolkit definition: Œuvre qui possède une étendue d’une expression représentative consistant en une durée de lecture, d’exécution, de projection, etc. ou en un autre laps de temps. @fr
label: is duur van representatieve expressie van @nl
definition: Relateert een tijdspanne aan een werk dat een omvang van expressie heeft van een representatieve expressie die een speelduur, uitvoeringsduur, looptijd of andere tijdspanne is. @nl
toolkit label: duur van representatieve expressie van @nl
toolkit definition: Een werk dat een omvang van expressie heeft van een representatieve expressie die een speelduur, uitvoeringsduur, looptijd of andere tijdspanne is. @nl
label: هي فترة لتعبيرة ممثلة لـ @ar
definition: تربط بين فترة زمنية وعمل له امتداد لتعبيرة ممثلة هو وقت تشغيل، أو وقت أداء، أو وقت دوران، أو أي فترة زمنية أخرى. @ar
toolkit label: فترة لتعبيرة ممثلة لـ @ar
toolkit definition: عمل له امتداد لتعبيرة ممثلة هو وقت تشغيل، أو وقت أداء، أو وقت دوران، أو أي فترة زمنية أخرى. @ar
label: és durada d’una expressió representativa de @ca
definition: Relaciona un interval de temps amb una obra que té una extensió d’expressió d’una expressió representativa que és un temps de reproducció, de projecció, d’execució o qualsevol altre interval de temps. @ca
toolkit label: durada d’una expressió representativa de @ca
toolkit definition: Obra que té una extensió d’expressió d’una expressió representativa que és un temps de reproducció, de projecció, d’execució o qualsevol altre interval de temps. @ca
label: er spilletid for repræsentativt udtryk af @da
definition: Relaterer en tidsperiode til et værk, som har et omfang af et udtryk, som er en varighed, opførelsestid, spilletid etc. eller anden tidsperiode. @da
toolkit label: spilletid for repræsentativt udtryk af @da
toolkit definition: Værk, som har et omfang af et udtryk, som er en varighed, opførelsestid, spilletid etc. eller anden tidsperiode. @da
label: iseloomuliku väljenduse kestus teoses @et
definition: Seostab ajavahemiku teosega, mille iseloomulikul väljendusel on väljenduse maht, milleks on mängimisaeg, esituse aeg, töötamisaeg või muu ajavahemik. @et
toolkit label: iseloomuliku väljenduse kestus teoses @et
toolkit definition: Teos, mille iseloomulikul väljendusel on väljenduse maht, milleks on mängimisaeg, esituse aeg, töötamisaeg või muu ajavahemik. @et
label: ist Dauer einer repräsentativen Expression von @de
definition: Setzt einen Zeitraum in Beziehung zu einem Werk, das über einen Umfang einer repräsentativen Expression verfügt, bei dem es sich um eine Wiedergabezeit, eine Aufführungszeit, eine Laufzeit oder einen anderen Zeitraum handelt. @de
toolkit label: Dauer einer repräsentativen Expression von @de
toolkit definition: Ein Werk, das über einen Umfang einer repräsentativen Expression verfügt, bei dem es sich um eine Wiedergabezeit, eine Aufführungszeit, eine Laufzeit oder einen anderen Zeitraum handelt. @de
label: a következő reprezentatív kifejezési forma tartama: @hu
definition: Egy időtartamot hozzákapcsol egy műhöz, amely rendelkezik egy reprezentatív kifejezési formára jellemző kifejezésiforma-terjedelemmel, ami egy lejátszási idő, futási idő vagy egyéb időtartam. @hu
toolkit label: reprezentatív kifejezési forma tartama @hu
toolkit definition: Egy mű, amely rendelkezik egy reprezentatív kifejezési formára jellemző kifejezésiforma-terjedelemmel, ami egy lejátszási idő, futási idő vagy egyéb időtartam. @hu
label: è durata dell'espressione rappresentativa @it
definition: Correla un arco di tempo a un'opera che ha una estensione dell'espressione di un'espressione rappresentativa che è un tempo di gioco, tempo di gioco, tempo di interpretazione, durata o altro arco di tempo. @it
toolkit label: durata dell'espressione rappresentativa @it
toolkit definition: Opera che ha una estensione dell'espressione di una espressione rappresentativa che è un tempo di gioco, tempo di gioco, tempo di interpretazione, durata o altro arco di tempo. @it
has subproperty: P70055

has ending
status: Published
type: Property
lexical alias: ending.en
definition: Relates a timespan to a timespan that is the time at which a timespan finishes.
domain: C10010
toolkit label: ending
toolkit definition: A timespan that is the time at which a timespan finishes.
scope note: A time may be represented at different levels of granularity by a calendrical timespan.
has element type: 3
label: ajanjakson loppu @fi
definition: Liittää ajanjakson ajanjaksoon, joka on aika, jolloin ajanjakso loppuu. @fi
scope note: Ajankohta voidaan esittää kalenteriajan eri tarkkuustasoilla. @fi
toolkit label: ajanjakson loppu @fi
toolkit definition: Ajanjakso, joka on aika, jolloin ajanjakso loppuu. @fi
label: har slutt @no
definition: Relaterer et tidsrom til tidspunktet når tidsrommet slutter. @no
scope note: Et tidspunkt kan representeres ved ulike detaljeringsnivå etter et kalendarisk tidsrom. @no
toolkit label: slutt @no
toolkit definition: Tidspunktet når tidsrommet slutter. @no
sub property of: has part timespan
label: a pour fin @fr
definition: Met un laps de temps en relation avec un laps de temps qui constitue le moment auquel un laps de temps se termine. @fr
scope note: Un moment peut être représenté à différents niveaux de granularité par un laps de temps calendaire. @fr
toolkit label: fin @fr
toolkit definition: Laps de temps qui constitue le moment auquel un laps de temps se termine. @fr
label: heeft einde @nl
definition: Relateert een tijdspanne aan een tijdspanne die is het tijdstip waarop de tijdspanne eindigt. @nl
scope note: Een tijdstip kan vertegenwoordigd worden op diverse niveaus van granulariteit door een tijdspanne gebaseerd op een kalender. @nl
toolkit label: einde @nl
toolkit definition: Een tijdspanne die is het tijdstip waarop de tijdspanne eindigt. @nl
label: té com a final @ca
definition: Relaciona un interval de temps amb un interval de temps que és el moment en què finalitza un interval de temps. @ca
scope note: Un temps es pot representar a diferents nivells de granularitat mitjançant un interval de temps del calendari. @ca
toolkit label: final @ca
toolkit definition: Interval de temps que és el moment en què finalitza un interval de temps. @ca
label: har slutning @da
definition: Relaterer en tidsperiode til det tidspunkt, hvor tidsperioden slutter. @da
scope note: Et tidspunkt kan være med forskellige detaljeringsniveauer for en kalendarisk tidsperiode. @da
toolkit label: slutning @da
toolkit definition: Tidspunkt, hvor tidsperioden slutter. @da
label: ajavahemiku lõpp @et
definition: Seostab ajavahemiku ajaga, millal ajavahemik lõpeb. @et
scope note: Aega võib esitada kalendriajas eri täpsusega. @et
toolkit label: ajavahemiku lõpp @et
toolkit definition: Aeg, millal ajavahemik lõpeb. @et
label: hat Ende @de
definition: Setzt einen Zeitraum in Beziehung zu einem Zeitraum, bei dem es sich um den Zeitpunkt handelt, an dem ein Zeitraum endet. @de
scope note: Ein Zeitpunkt kann durch einen kalendarischen Zeitraum auf verschiedenen Ebenen der Granularität dargestellt werden. @de
toolkit label: Ende @de
toolkit definition: Ein Zeitraum, bei dem es sich um den Zeitpunkt handelt, an dem ein Zeitraum endet. @de
label: befejezése a következő: @hu
definition: Hozzákapcsol egy időpontot egy időponthoz, amikor az időtartam befejeződik. @hu
toolkit label: befejezése: @hu
toolkit definition: Egy időpont, amikor az időtartam befejeződik. @hu
label: ha come fine @it
definition: Correla un arco di tempo al momento in cui l'arco di tempo finisce. @it
scope note: Un momento può essere rappresentato a diversi livelli di granularità da un arco di tempo calendaristico @it
toolkit label: fine @it
toolkit definition: Momento in cui l'arco di tempo finisce. @it
label: beigas @lv
definition: Sasaista laikposmu ar laikposmu, kas ir beigu laiks. @lv
toolkit label: beigas @lv
toolkit definition: Brīdis, kurā beidzas laikposms. @lv
scope note: Laiku var attēlot dažādās detalizācijas pakāpēs, izmantojot kalendāro laika skaitīšanu. @lv
label: لها نهاية @ar
definition: تربط بين فترة زمنية وفترة زمنية عبارة عن زمن تنتهي فيه فترة زمنية. @ar
toolkit label: نهاية @ar
toolkit definition: فترة زمنية عبارة عن زمن تنتهي فيه فترة زمنية. @ar
scope note: زمن يمكن تمثيله على مستويات تقسيم مختلفة من خلال فترة زمنية تقويمية. @ar
label: 有结束 @zh-hans
definition: 将一个时间段与作为一个时间段结束时间的一个时间段关联起来。 @zh-hans
toolkit label: 结束 @zh-hans
toolkit definition: 作为一个时间段结束时间的一个时间段 @zh-hans
scope note: 一个时间可以用日历时间段的不同颗粒度层级表示。 @zh-hans
has subproperty: P70040
scope note: Különböző szintű részletességgel, naptári időtartammal ábrázolt idő. @hu
label: bitiş ile ilişkilidir @tr
definition: Bir zaman aralığını, zaman aralığının bittiği zaman olan bir zaman aralığıyla ilişkilendirir. @tr
toolkit label: son @tr

is epoch of
status: Published
type: Property
lexical alias: epochOf.en
domain: C10010
toolkit label: epoch of
sub property of: has related work of timespan
has element type: 2
definition: Relates a timespan to a work that refers to measurements of position for a body or orientation for an orbit.
toolkit definition: A work that refers to measurements of position for a body or orientation for an orbit.
label: epookki teokselle @fi
definition: Liittää ajanjakson teokseen, joka viittaa tähtitaivaan kohteiden sijaintien ja ratojen suuntien mittajärjestelmään. @fi
toolkit label: epookki teokselle @fi
toolkit definition: Teos, joka viittaa tähtitaivaan kohteiden sijaintien ja ratojen suuntien mittajärjestelmään. @fi
label: er epoke for @no
definition: Relaterer et tidsrom til et verk som viser til målinger av posisjon for et legeme eller orientasjon for en bane. @no
toolkit label: epoke for @no
toolkit definition: Et verk som viser til målinger av posisjon for et legeme eller orientasjon for en bane. @no
label: est une époque de @fr
definition: Met un laps de temps en relation avec une œuvre qui fait référence à des mesures de position d’un corps céleste ou à l’orientation d’une orbite. @fr
toolkit label: époque de @fr
toolkit definition: Œuvre qui fait référence à des mesures de position d’un corps céleste ou à l’orientation d’une orbite. @fr
label: is tijdperk van @nl
definition: Relateert een tijdspanne aan een werk dat verwijst naar metingen van positie van een lichaam of oriëntatie voor een baan. @nl
toolkit label: tijdperk van @nl
toolkit definition: Een werk dat verwijst naar metingen van positie van een lichaam of oriëntatie voor een baan. @nl
label: هي مدة زمنية لـ @ar
definition: تربط بين فترة زمنية وعمل يشير إلى قياسات لوضع لجسم أو لاتجاه لمدار. @ar
toolkit label: مدة زمنية لـ @ar
toolkit definition: عمل يشير إلى قياسات لوضع لجسم أو لاتجاه لمدار. @ar
label: és època de @ca
definition: Relaciona un interval de temps amb una obra que fa referència a les mesures de posició d’un cos celeste o l’orientació d’una òrbita. @ca
toolkit label: època de @ca
toolkit definition: Obra que fa referència a les mesures de posició d’un cos celeste o l’orientació d’una òrbita. @ca
definition: Relaterer en tidsperiode til et værk, som henviser til målinger af position for et legeme eller retning for en bane. @da
toolkit definition: Værk, som henviser til målinger af position for et legeme eller retning for en bane. @da
label: epohh teoses @et
definition: Seostab ajavahemiku teosega, milles viidatakse ajale, mille kohta on määratud taevakeha asukoht või orbiidi orientatsioon. @et
toolkit label: epohh teoses @et
toolkit definition: Teos, milles viidatakse ajale, mille kohta on määratud taevakeha asukoht või orbiidi orientatsioon. @et
label: ist Epoche von @de
definition: Setzt einen Zeitraum in Beziehung zu einem Werk, das Positionsmessungen für einen Körper oder eine Orientierung für eine Umlaufbahn referenziert. @de
toolkit label: Epoche von @de
toolkit definition: Ein Werk, das Positionsmessungen für einen Körper oder eine Orientierung für eine Umlaufbahn referenziert. @de
label: korszaka a következőnek: @hu
definition: Hozzákapcsol egy időtartamot egy műhöz, amely egy test mérési pozíciójára vagy egy keringési pálya orientációjára utal. @hu
toolkit label: korszaka: @hu
toolkit definition: Egy mű, amely egy test mérési pozíciójára vagy egy keringési pálya orientációjára utal. @hu
label: è epoca di @it
definition: Correla un arco di tempo a un'opera che si riferisce alla misurazione della posizione per un corpo o all'orientamento per un'orbita. @it
toolkit label: epoca di @it
toolkit definition: Opera che si riferisce alla misurazione della posizione per un corpo o all'orientamento per un'orbita. @it
label: ir epoha @lv
toolkit label: ir epoha @lv
definition: Sasaista laikposmu ar darbu, kas atsaucas uz debess ķermeņa stāvokļa mērījumiem vai orbītas virzienu. @lv
toolkit definition: Darbs, kas atsaucas uz debess ķermeņa stāvokļa mērījumiem vai orbītas virzienu. @lv
label: 是……的历元 @zh-hans
toolkit label: ……的历元 @zh-hans
definition: 将一个时间段与提及物体位置或运行轨道方位之测量的一种作品关联起来。 @zh-hans
toolkit definition: 提及物体位置或运行轨道方位之测量的一种作品 @zh-hans
has subproperty: P70021
label: epoğudur @tr
toolkit label: dönem @tr
definition: Bir zaman aralığını, bir cisim için konum veya bir yörünge için yönelim ölçümlerini ifade eden bir eserle ilişkilendirir. @tr
toolkit definition: Bir kütle için konum veya bir yörünge için yönelineme ilişkin ölçümleri ifade eden bir çalışma. @tr

is equinox of
status: Published
type: Property
lexical alias: equinoxOf.en
domain: C10010
toolkit label: equinox of
sub property of: has related work of timespan
has element type: 2
definition: Relates a timespan to a work that uses a point of intersection of the ecliptic and the celestial equator, occupied by the sun when its declination is 0°.
toolkit definition: A work that uses a point of intersection of the ecliptic and the celestial equator, occupied by the sun when its declination is 0°.
label: tasauspiste teokselle @fi
definition: Liittää ajanjakson teokseen, joka käyttää ekliptikan ja taivaanekvaattorin leikkauspistettä, jossa aurinko on, kun sen deklinaatio on 0°. @fi
toolkit label: tasauspiste teokselle @fi
toolkit definition: Teos, joka käyttää ekliptikan ja taivaanekvaattorin leikkauspistettä, jossa aurinko on, kun sen deklinaatio on 0°. @fi
label: er jevndøgn for @no
definition: Relaterer et tidsrom til et verk som bruker et skjæringspunkt mellom solbanen og himmelekvator, der solen befinner seg når deklinasjonen dens er 0°. @no
toolkit label: jevndøgn for @no
toolkit definition: Et verk som bruker et skjæringspunkt mellom solbanen og himmelekvator, der solen befinner seg når deklinasjonen dens er 0°. @no
label: est une équinoxe de @fr
definition: Met un laps de temps en relation avec une œuvre qui utilise un point d’intersection de l’écliptique et de l’équateur céleste, occupé par le soleil quand sa déclinaison est de 0°. @fr
toolkit label: équinoxe de @fr
toolkit definition: Œuvre qui utilise un point d’intersection de l’écliptique et de l’équateur céleste, occupé par le soleil quand sa déclinaison est de 0°. @fr
label: is equinox van @nl
definition: Relateert een tijdspanne aan een werk dat een snijpunt gebruikt van de evenaar en de hemelevenaar ingenomen door de zon als zijn declinatie 0° is. @nl
alternative label: dag- en nachtvermelding @nl
toolkit label: equinox van @nl
toolkit definition: Een werk dat een snijpunt gebruikt van de evenaar en de hemelevenaar ingenomen door de zon als zijn declinatie 0° is. @nl
label: هي اعتدال لـ @ar
definition: تربط بين فترة زمنية وعمل يستخدم نقطة تقاطع مسار الشمس مع خط الاستواء السماوي، عندما يكون انحراف الشمس عند صفر 0°. @ar
toolkit label: اعتدال لـ @ar
toolkit definition: عمل يستخدم نقطة تقاطع مسار الشمس مع خط الاستواء السماوي، عندما يكون انحراف الشمس عند صفر 0°. @ar
label: és equinocci de @ca
definition: Relaciona un interval de temps amb una obra que usa un punt d’intersecció de l’eclíptica i de l’equador celeste, ocupat pel sol quan la seva declinació és de 0º. @ca
toolkit label: equinocci de @ca
toolkit definition: Obra que usa un punt d’intersecció de l’eclíptica i de l’equador celeste, ocupat pel sol quan la seva declinació és de 0º. @ca
label: er jævndøgn for @da
definition: Relaterer en tidsperiode til et værk, som bruger et skæringspunkt mellem ekliptika og himlens ækvator, hvor solen befinder sig, når dens deklination er 0°. @da
toolkit label: jævndøgn for @da
toolkit definition: Værk, som bruger et skæringspunkt mellem ekliptika og himlens ækvator, hvor solen befinder sig, når dens deklination er 0°. @da
label: võrdpäevsus teoses @et
definition: Seostab ajavahemiku teosega, milles kasutatakse aega, millal Päike läbib ekliptika ja taevaekvaatori lõikepunkti, kui Päikese kääne on 0° @et
toolkit label: võrdpäevsus teoses @et
toolkit definition: Teos, milles kasutatakse aega, millal Päike läbib ekliptika ja taevaekvaatori lõikepunkti, kui Päikese kääne on 0° @et
label: ist Äquinoktium von @de
definition: Setzt einen Zeitraum in Beziehung zu einem Werk, das einen von zwei Kreuzungspunkten der Sonnenbahn und des Himmelsäquators verwendet, die von der Sonne überquert werden, wenn ihre Deklination 0° beträgt. @de
toolkit label: Äquinoktium von @de
toolkit definition: Ein Werk, das einen von zwei Kreuzungspunkten der Sonnenbahn und des Himmelsäquators verwendet, die von der Sonne überquert werden, wenn ihre Deklination 0° beträgt. @de
label: napéjegyenlősége a következőnek: @hu
definition: Hozzákapcsol egy időtartamot egy műhöz, amely a nappálya és az egyenlítő metszéspontját használja, amit a nap akkor foglal el, amikor a deklinációja 0°. @hu
toolkit label: napéjegyenlősége: @hu
toolkit definition: Egy mű, amely a nappálya és az egyenlítő metszéspontját használja, amit a nap akkor foglal el, amikor a deklinációja 0°. @hu
label: è equinozio di @it
definition: Correla un arco di tempo a un'opera che usa un punto di intersezione dell'eclittica e dell'equatore celeste, occupato dal sole quanto la sua declinazione è 0°. @it
toolkit label: equinozio di @it
toolkit definition: Opera che usa un punto di intersezione dell'eclittica e dell'equatore celeste, occupato dal sole quanto la sua declinazione è 0°. @it
label: ir ekvinokcija @lv
toolkit label: ir ekvinokcija @lv
definition: Sasaista laikposmu ar darbu, kurā tiek izmantots ekliptikas un debess ekvatora krustošanās punkts, kad tā novirze ir 0 °. @lv
toolkit definition: Darbs, kurā tiek izmantots ekliptikas un debess ekvatora krustošanās punkts, kad tā novirze ir 0 °. @lv
label: 是……的二分点 @zh-hans
toolkit label: ……的二分点 @zh-hans
definition: 将一个时间段与使用当太阳的赤纬角度为0时其所占黄道和天赤道的一个交叉点的一种作品关联起来。 @zh-hans
toolkit definition: 当太阳的赤纬角度为0时其所占黄道和天赤道的一个交叉点 @zh-hans
has subproperty: P70042
label: ekinoksudur @tr
toolkit label: eknikoks @tr
definition: Bir zaman aralığını, güneşin sapmasının 0° olduğu anda ekliptik ve gök ekvatorunun kesişme noktasını kullanan bir eserle ilişkilendirir. @tr
toolkit definition: Güneş'in 0° deklinasyonda bulunduğu, ekliptik ile gök ekvatorunun kesişim noktasını kullanan bir eser @tr

has identifier for timespan
status: Published
type: Property
lexical alias: identifierForTimespan.en
definition: Relates a timespan to a nomen that is an appellation of timespan that consists of a code, number, or other string, usually independent of natural language and social naming conventions, used to identify a timespan.
domain: C10010
toolkit label: identifier for timespan
toolkit definition: A nomen that is an appellation of timespan that consists of a code, number, or other string, usually independent of natural language and social naming conventions, used to identify a timespan.
sub property of: has appellation of timespan
has element type: 3
sub property of: P00018
label: ajanjakson tunniste @fi
definition: Liittää ajanjakson nomeniin, joka on ajanjakson nimitys, joka koostuu koodista, numerosta tai muusta merkkijonosta ja joka yleensä on luonnollisesta kielestä ja kielen sosiaalisista konventioista riippumaton ajanjakson tunnistamiskeino. @fi
toolkit label: ajanjakson tunniste @fi
toolkit definition: Nomeniin, joka on ajanjakson nimitys, joka koostuu koodista, numerosta tai muusta merkkijonosta ja joka yleensä on luonnollisesta kielestä ja kielen sosiaalisista konventioista riippumaton ajanjakson tunnistamiskeino. @fi
label: har identifikator for tidsrom @no
definition: Relaterer et tidsrom til en betegnelse for tidsrom som består av en kode, nummer eller annen streng, vanligvis uavhengig av naturlig språk og sosiale navnekonvensjoner, brukt til å identifisere et tidsrom. @no
toolkit label: identifikator for tidsrom @no
toolkit definition: En betegnelse for tidsrom som består av en kode, nummer eller annen streng, vanligvis uavhengig av naturlig språk og sosiale navnekonvensjoner, brukt til å identifisere et tidsrom. @no
label: a pour identifiant de laps de temps @fr
definition: Met un laps de temps en relation avec un nomen qui est une appellation de laps de temps consistant en un code, un nombre ou une autre chaîne, généralement indépendante du langage naturel et des conventions sociales de dénomination, utilisée pour identifier un laps de temps. @fr
toolkit label: identifiant de laps de temps @fr
toolkit definition: Nomen qui est une appellation de laps de temps consistant en un code, un nombre ou une autre chaîne, généralement indépendante du langage naturel et des conventions sociales de dénomination, utilisée pour identifier un laps de temps. @fr
label: heeft identificatie voor tijdspanne @nl
definition: Relateert een tijdspanne aan een benaming van tijdspanne die bestaat uit een code, nummer of andere tekenreeks, meestal onafhankelijk van natuurlijk taal of sociale naamgeving, gebruikt om een tijdspanne te identificeren. @nl
toolkit label: identificatie voor tijdspanne @nl
toolkit definition: Een nomen dat is een benaming van tijdspanne die bestaat uit een code, nummer of andere tekenreeks, meestal onafhankelijk van natuurlijk taal of sociale naamgeving, gebruikt om een tijdspanne te identificeren. @nl
label: لها محدد لفترة زمنية @ar
definition: تربط بين فترة زمنية واسم تعريفي لفترة زمنية يتضمن رمز، أو رقم، أو سلسلة تمثيلات أخرى مستقلة عادة عن اللغة الطبيعية والتسميات المتعارف عليها اجتماعيا، وتستخدم لتحديد فترة زمنية. @ar
toolkit label: محدد لفترة زمنية @ar
toolkit definition: تسمية عبارة عن اسم تعريفي لفترة زمنية يتضمن رمز، أو رقم، أو سلسلة تمثيلات أخرى مستقلة عادة عن اللغة الطبيعية والتسميات المتعارف عليها اجتماعيا، وتستخدم لتحديد فترة زمنية. @ar
label: té com a identificador d’interval de temps @ca
definition: Relaciona un interval de temps amb un nomen que és una apel·lació d’interval de temps que consisteix en un codi, un número o qualsevol altra cadena, normalment independent del llenguatge natural i de les convencions socials de denominació, usada per identificar un interval de temps. @ca
toolkit label: identificador d’interval de temps @ca
toolkit definition: Nomen que és una apel·lació d’interval de temps que consisteix en un codi, un número o qualsevol altra cadena, normalment independent del llenguatge natural i de les convencions socials de denominació, usada per identificar un interval de temps. @ca
label: har identifikator for tidsperiode @da
definition: Relaterer en tidsperiode til en benævnelse på tidsperiode, som består af en kode, nummer eller anden streng, ofte uafhængig af normalsprog og navngivningskonventioner, brugt til at identificere en tidsperiode. @da
toolkit label: identifikator for tidsperiode @da
toolkit definition: Benævnelse på tidsperiode, som består af en kode, nummer eller anden streng, ofte uafhængig af normalsprog og navngivningskonventioner, brugt til at identificere en tidsperiode. @da
label: ajavahemiku identifikaator @et
definition: Seostab ajavahemiku ajavahemiku nimetusega, mis koosneb ajavahemikku identifitseerivast koodist, numbrist või muust loomulikust keelest ja üldtuntud nimetamistavadest sõltumatust stringist. @et
toolkit label: ajavahemiku identifikaator @et
toolkit definition: Ajavahemiku nimetus, mis koosneb ajavahemikku identifitseerivast koodist, numbrist või muust loomulikust keelest ja üldtuntud nimetamistavadest sõltumatust stringist. @et
label: hat Identifikator für einen Zeitraum @de
definition: Setzt einen Zeitraum in Beziehung zu einer Bezeichnung für einen Zeitraum, die aus einem Code, einer Nummer oder einer anderen Zeichenkette besteht, der/die normalerweise nicht in natürlicher Sprache und unabhängig von den sozialen Benennungskonventionen ist und zur Identifizierung eines Zeitraums verwendet wird. @de
toolkit label: Identifikator für einen Zeitraum @de
toolkit definition: Eine Bezeichnung für einen Zeitraum, die aus einem Code, einer Nummer oder einer anderen Zeichenkette besteht, der/die normalerweise nicht in natürlicher Sprache und unabhängig von den sozialen Benennungskonventionen ist und zur Identifizierung eines Zeitraums verwendet wird. @de
label: azonosító időtartamhoz a következő: @hu
definition: Hozzákapcsol egy időtartamot egy időtartam megnevezéséhez, amely kódból, számból vagy egyéb karakterláncból áll, általában a természetes nyelvtől és társadalmi elnevezési konvencióktól független, egy időtartam azonosítására használják. @hu
toolkit label: azonosítója a következő időtartamnak: @hu
toolkit definition: Egy nomen, amely egy időtartam megnevezése, amely kódból, számból vagy egyéb karakterláncból áll, általában a természetes nyelvtől és társadalmi elnevezési konvencióktól független, egy időtartam azonosítására használják. @hu
label: ha come identificatore per arco di tempo @it
definition: Correla un arco di tempo a una designazione di arco di tempo che è costituita da un codice, numero, o altra stringa, di solito indipendente dal linguaggio naturale e dalle convenzioni sociali di denominazione, usata per identificare un arco di tempo. @it
toolkit label: identificatore per arco di tempo @it
toolkit definition: Designazione di arco di tempo che è costituita da un codice, numero, o altra stringa, di solito indipendente dal linguaggio naturale e dalle convenzioni sociali di denominazione, usata per identificare un arco di tempo. @it
label: laikposma identifikators @lv
definition: Sasaista laikposmu ar laikposma apzīmējumu, kas sastāv no koda, skaitļa vai citas virknes, kas parasti ir neatkarīgs no dabiskas valodas vai sabiedrībā pieņemtām nosaukšanas tradīcijām, ko izmanto, lai identificētu laikposmu. @lv
toolkit label: laikposma identifikators @lv
toolkit definition: Laikposma apzīmējums, kas sastāv no koda, skaitļa vai citas virknes, kas parasti ir neatkarīgs no dabiskas valodas vai sabiedrībā pieņemtām nosaukšanas tradīcijām, ko izmanto, lai identificētu laikposmu. @lv
label: 有时间段的标识符 @zh-hans
definition: 将一个时间段与由代码、数字或其他串组成、通常独立于自然语言和社会命名惯例、用于标识一个时间段的一个时间段称谓关联起来。 @zh-hans
toolkit label: 时间段的标识符 @zh-hans
toolkit definition: 作为由代码、数字或其他串组成、通常独立于自然语言和社会命名惯例、用于标识一个时间段的一个时间段称谓的命名 @zh-hans
has subproperty: P70018
label: zaman aralığının tanımlayıcısı ile ilişkilidir @tr
definition: Bir zaman aralığını, bir zaman aralığını tanımlamak için kullanılan, genellikle doğal dil ve sosyal adlandırma kurallarından bağımsız olarak bir kod, sayı veya başka bir dizeden oluşan bir zaman aralığı unvanıyla ilişkilendirir. @tr
toolkit label: zaman aralığının tanımlayıcısı ile ilişkilidir @tr
toolkit definition: Bir zaman aralığını tanımlamak için kullanılan, genellikle doğal dilden ve sosyal adlandırma kurallarından bağımsız bir kod, sayı veya başka bir dizeden oluşan bir zaman aralığı unvanı olan bir isim. @tr

has name of timespan
status: Published
type: Property
lexical alias: nameOfTimespan.en
definition: Relates a timespan to a nomen that is an appellation of timespan in natural language and phrasing used in common discourse.
domain: C10010
toolkit label: name of timespan
toolkit definition: A nomen that is an appellation of timespan in natural language and phrasing used in common discourse.
sub property of: has appellation of timespan
has element type: 3
sub property of: P00019
label: ajanjakson nimi @fi
definition: Liittää ajanjakson nomeniin, joka on luonnollisen kielen ja sanamuodon mukainen ajanjakson nimitys, jota käytetään yleisessä diskurssissa. @fi
toolkit label: ajanjakson nimi @fi
toolkit definition: Nomen, joka on luonnollisen kielen ja sanamuodon mukainen ajanjakson nimitys, jota käytetään yleisessä diskurssissa. @fi
label: har navn på tidsrom @no
definition: Relaterer et tidsrom til en betegnelse for tidsrom på et naturlig språk og med frasering brukt i alminnelig diskurs. @no
toolkit label: navn på tidsrom @no
toolkit definition: En betegnelse for tidsrom på et naturlig språk og med frasering brukt i alminnelig diskurs. @no
label: a pour nom de laps de temps @fr
definition: Met un laps de temps en relation avec un nomen qui est une appellation de laps de temps exprimée dans un langage et une formulation naturels et utilisée dans le langage courant. @fr
toolkit label: nom de laps de temps @fr
toolkit definition: Nomen qui est une appellation de laps de temps exprimée dans un langage et une formulation naturels et utilisée dans le langage courant. @fr
label: heeft naam van tijdspanne @nl
definition: Relateert een tijdspanne aan een benaming van tijdspanne in natuurlijke taal en terminologie in gebruikelijke bewoording. @nl
toolkit label: naam van tijdspanne @nl
toolkit definition: Een nomen dat is een benaming van tijdspanne in natuurlijke taal en terminologie in gebruikelijke bewoording. @nl
label: لها اسم لفترة زمنية @ar
definition: تربط بين فترة زمنية واسم تعريفي فترة زمنية في لغة طبيعية مستخدمة في حوار عام. @ar
toolkit label: اسم لفترة زمنية @ar
toolkit definition: تسمية عبارة عن اسم تعريفي لفترة زمنية في لغة طبيعية مستخدمة في حوار عام. @ar
label: té com a nom d’interval de temps @ca
definition: Relaciona un interval de temps amb un nomen que és una apel·lació d’interval de temps en llenguatge i frases naturals usada en el discurs comú. @ca
toolkit label: nom d’interval de temps @ca
toolkit definition: Nomen que és una apel·lació d’interval de temps en llenguatge i frases naturals usada en el discurs comú. @ca
label: har navn på tidsperiode @da
definition: Relaterer en tidsperiode til en benævnelse på tidsperiode på normalsprog og med formuleringer, som bruges alment. @da
toolkit label: navn på tidsperiode @da
toolkit definition: Benævnelse på tidsperiode på normalsprog og med formuleringer, som bruges alment. @da
label: ajavahemiku nimi @et
definition: Seostab ajavahemiku ajavahemiku nimetusega loomulikus keeles ja sõnastuses, mida kasutatakse ühises diskursuses. @et
toolkit label: ajavahemiku nimi @et
toolkit definition: Ajavahemiku nimetus loomulikus keeles ja sõnastuses, mida kasutatakse ühises diskursuses. @et
label: hat Namen eines Zeitraums @de
definition: Setzt einen Zeitraum in Beziehung zu einer Bezeichnung für einen Zeitraum in natürlicher Sprache und Ausdrucksweise, die beim normalen Sprechen und Schreiben verwendet wird. @de
toolkit label: Name eines Zeitraums @de
toolkit definition: Eine Bezeichnung für einen Zeitraum in natürlicher Sprache und Ausdrucksweise, die beim normalen Sprechen und Schreiben verwendet wird. @de
label: időtartamneve a következő: @hu
definition: Hozzákapcsol egy időtartamot egy időtartam természetes nyelvi megnevezéséhez és a közbeszéd során használt megfogalmazásához. @hu
toolkit label: időtartamneve: @hu
toolkit definition: Egy nomen, amely egy időtartam természetes nyelvi, a közbeszéd során használt megnevezéséhez és megfogalmazása. @hu
label: ha come nome di arco di tempo @it
definition: Correla un arco di tempo a una designazione di arco di tempo in linguaggio e frasi naturali usati nel discorso comune. @it
toolkit label: nome di arco di tempo @it
toolkit definition: Designazione di arco di tempo in linguaggio e frasi naturali usati nel discorso comune. @it
label: laikposma nosaukums @lv
definition: Sasaista laikposmu ar laikposma apzīmējumu dabiskā valodā un teicienos, ko izmanto sarunvalodā. @lv
toolkit label: laikposma nosaukums @lv
toolkit definition: Nomens, kas ir laikposma apzīmējums dabiskā valodā un teicienos, ko izmanto sarunvalodā. @lv
label: 有时间段的名称 @zh-hans
definition: 将一个时间段与用自然语言和普通话语措词表达的时间段的称谓关联起来。 @zh-hans
toolkit label: 时间段的名称 @zh-hans
toolkit definition: 作为用自然语言和普通话语措词表达的时间段的称谓的一个命名 @zh-hans
has subproperty: has preferred name of timespan
has subproperty: has variant name of timespan
has subproperty: P70017
label: zaman aralığının adı ile ilişkilidir @tr
definition: Bir zaman aralığını, doğal dilde ve ortak söylemde kullanılan ifadelerdeki bir zaman aralığı unvanıyla ilişkilendirir. @tr
toolkit label: zaman aralığının adı @tr
toolkit definition: Doğal dilde ve ortak söylemde kullanılan ifadelerde bir zaman aralığının unvanı olan bir isim. @tr

has note on timespan
status: Published
type: Property
lexical alias: noteOnTimespan.en
definition: Relates a timespan to a broad unstructured description of one or more attributes of a timespan.
domain: C10010
toolkit label: note on timespan
toolkit definition: A broad unstructured description of one or more attributes of a timespan.
has element type: 6
sub property of: P00015
label: huomautus ajanjaksosta @fi
definition: Liittää ajanjankson yleisluonteiseen rakenteistamattomaan kuvailuun, joka sisältää ajanjakson yhden tai useamman attribuutin. @fi
toolkit label: huomautus ajanjaksosta @fi
toolkit definition: Yleisluonteinen rakenteistamaton kuvailu, joka sisältää ajanjakson yhden tai useamman attribuutin. @fi
label: har note om tidsrom @no
definition: Relaterer et tidsrom til en bred, utstrukturert beskrivelse av ett eller flere attributter for et tidsrom. @no
toolkit label: note om tidsrom @no
toolkit definition: En bred, utstrukturert beskrivelse av ett eller flere attributter for et tidsrom. @no
label: a pour note sur un laps de temps @fr
definition: Met un laps de temps en relation avec une description non structurée générale d’un ou plusieurs attributs d’un laps de temps. @fr
toolkit label: note sur un laps de temps @fr
toolkit definition: Description non structurée générale d’un ou plusieurs attributs d’un laps de temps. @fr
label: heeft noot bij tijdspanne @nl
definition: Relateert een tijdspanne aan een algemene ongestructureerde beschrijving van één of meer attributen van een tijdspanne. @nl
toolkit label: noot bij tijdspanne @nl
toolkit definition: Een algemene ongestructureerde beschrijving van één of meer attributen van een tijdspanne. @nl
label: لها تبصرة على فترة زمنية @ar
definition: تربط بين فترة زمنية ووصف عام غير محدد لخاصية واحدة أو أكثر من خصائص فترة زمنية. @ar
toolkit label: تبصرة على فترة زمنية @ar
toolkit definition: وصف عام غير محدد لخاصية واحدة أو أكثر من خصائص فترة زمنية. @ar
label: té com a nota sobre un interval de temps @ca
definition: Relaciona un interval de temps amb una descripció no estructurada àmplia d’un o més atributs d’un interval de temps. @ca
toolkit label: nota sobre un interval de temps @ca
toolkit definition: Descripció no estructurada àmplia d’un o més atributs d’un interval de temps. @ca
label: har note om tidsperiode @da
definition: Relaterer en tidsperiode til en bred, ustruktureret beskrivelse af en eller flere af en tidsperiodes attributter. @da
toolkit label: note om tidsperiode @da
toolkit definition: Bred, ustruktureret beskrivelse af en eller flere af en tidsperiodes attributter. @da
label: märkus ajavahemiku kohta @et
definition: Seostab ajavahemiku üldise struktureerimata kirjeldusega, mis iseloomustab üht või mitut ajavahemiku omadust. @et
toolkit label: märkus ajavahemiku kohta @et
toolkit definition: Üldine struktureerimata kirjeldus, mis iseloomustab üht või mitut ajavahemiku omadust. @et
label: hat Anmerkung zum Zeitraum @de
definition: Setzt einen Zeitraum in Beziehung zu einer umfassenden, unstrukturierten Beschreibung eines Merkmals oder mehrerer Merkmale eines Zeitraums. @de
toolkit label: Anmerkung zum Zeitraum @de
toolkit definition: Eine umfassende, unstrukturierte Beschreibung eines Merkmals oder mehrerer Merkmale eines Zeitraums. @de
label: időtartamra vonatkozó megjegyzése a következő: @hu
definition: időtartamra vonatkozó megjegyzése: @hu
toolkit label: Hozzákapcsol egy időtartamot egy időtartam egy vagy több ismérvének szabad szöveges, strukturálatlan leírásához. @hu
toolkit definition: Egy időtartam egy vagy több ismérvének szabad szöveges, strukturálatlan leírásához. @hu
label: ha come nota su arco di tempo @it
definition: Correla un arco di tempo a una descrizione non strutturata generale di uno o più attributi di un arco di tempo. @it
toolkit label: nota su arco di tempo @it
toolkit definition: Descrizione non strutturata generale di uno o più attributi di un arco di tempo. @it
label: piezīme par laikposmu @lv
definition: Sasaista laikposmu ar plašu nestrukturētu laikposma viena vai vairāku atribūtu aprakstu. @lv
toolkit label: piezīme par laikposmu @lv
toolkit definition: Plašs nestrukturēts laikposma viena vai vairāku atribūtu apraksts. @lv
label: 有关于时间段的附注 @zh-hans
definition: 将一个时间段与关于一个时间段的一个或多个属性的宽泛的非结构化描述关联起来。 @zh-hans
toolkit label: 关于时间段的附注 @zh-hans
toolkit definition: 关于一个时间段的一个或多个属性的宽泛的非结构化描述 @zh-hans
has subproperty: P70045
label: zaman aralığı hakkında not ile ilişkilidir @tr
definition: Bir zaman aralığını, bir zaman aralığının bir veya daha fazla özelliğinin yapılandırılmadığı geniş bir tanımıyla ilişkilendirir. @tr
toolkit label: zaman aralığı hakkında not @tr
toolkit definition: Bir zaman aralığının bir veya daha fazla niteliğinin yapılandırılmamış geniş tanımı. @tr

is part of timespan
status: Published
type: Property
lexical alias: partOfTimespan.en
definition: Relates a timespan to a timespan that has another timespan as a discrete component.
domain: C10010
toolkit label: part of timespan
toolkit definition: A timespan that has another timespan as a discrete component.
sub property of: has related timespan of timespan
has element type: 2
label: osa ajanjaksosta @fi
definition: Liittää ajanjakson ajanjaksoon, jonka itsenäisenä osana on toinen ajanjakso. @fi
toolkit label: osa ajanjaksosta @fi
toolkit definition: Ajanjakso, jonka itsenäisenä osana on toinen ajanjakso. @fi
label: er del av tidsrom @no
definition: Relaterer et tidsrom til et tidsrom som har et annet tidsrom som en avgrenset del. @no
toolkit label: del av tidsrom @no
toolkit definition: Et tidsrom som har et annet tidsrom som en avgrenset del. @no
label: est une partie de laps de temps de @fr
definition: Met un laps de temps en relation avec un laps de temps qui a pour composante distincte un autre laps de temps. @fr
toolkit label: partie de laps de temps de @fr
toolkit definition: Laps de temps qui a pour composante distincte un autre laps de temps. @fr
label: is deel van tijdspanne @nl
definition: Relateert een tijdspanne aan een tijdspanne die een andere tijdspanne heeft als een afzonderlijk deel. @nl
toolkit label: deel van tijdspanne @nl
toolkit definition: Een tijdspanne die een andere tijdspanne heeft als een afzonderlijk deel. @nl
label: هي جزء من فترة زمنية @ar
definition: تربط بين فترة زمنية وفترة زمنية لها فترة زمنية أخرى كعنصر منفصل. @ar
toolkit label: جزء من فترة زمنية @ar
toolkit definition: فترة زمنية لها فترة زمنية أخرى كعنصر منفصل. @ar
label: és part d’un interval de temps @ca
definition: Relaciona un interval de temps amb un interval de temps que té un altre interval de temps com a component discret. @ca
toolkit label: part d’un interval de temps @ca
toolkit definition: Interval de temps que té un altre interval de temps com a component discret. @ca
label: er del af tidsforløb @da
definition: Relaterer et tidsforløb til et tidsforløb, som har et andet tidsforløb som en adskilt komponent. @da
toolkit label: del af tidsforløb @da
toolkit definition: Tidsforløb, som har et andet tidsforløb som en adskilt komponent. @da
label: osa ajavahemikust @et
definition: Seostab ajavahemiku ajavahemikuga, mille eraldi osaks on teine ajavahemik. @et
toolkit label: osa ajavahemikust @et
toolkit definition: Ajavahemik, mille eraldi osaks on teine ajavahemik. @et
label: ist Teil von (Zeitraum) @de
definition: Setzt einen Zeitraum in Beziehung zu einem Zeitraum, der einen anderen Zeitraum als einzelnen Bestandteil enthält. @de
toolkit label: Teil von (Zeitraum) @de
toolkit definition: Ein Zeitraum, der einen anderen Zeitraum als einzelnen Bestandteil enthält. @de
label: része a következő időtartamnak: @hu
definition: Hozzákapcsol egy időtartamot egy időtartamhoz, amelynek egy másik időtartam elkülöníthető alkotóelemként a része. @hu
toolkit label: része a következő időtartamnak: @hu
toolkit definition: Egy időtartam, amelynek egy másik időtartam elkülöníthető alkotóelemként a része. @hu
label: è parte di arco di tempo @it
definition: Correla un arco di tempo a un arco di tempo che ha un altro arco di tempo come componente separata. @it
toolkit label: parte di arco di tempo @it
toolkit definition: Arco di tempo che ha un altro arco di tempo come componente distinta. @it
label: ir daļa laikposmā @lv
definition: Sasaista laikposmu ar laikposmu, kuram ir cits laikposms kā atsevišķa sastāvdaļa. @lv
toolkit label: daļa laikposmā @lv
toolkit definition: Laikposms, kuram ir cits laikposms kā atsevišķa sastāvdaļa. @lv
label: 是时间段的部分 @zh-hans
definition: 将一个时间段与有另一个时间段作为其独立组成部分的一个时间段关联起来。 @zh-hans
toolkit label: 时间段的部分 @zh-hans
toolkit definition: 有另一个时间段作为其独立组成部分的一个时间段 @zh-hans
has subproperty: is beginning of
has subproperty: is ending of
has subproperty: P70034
label: zaman aralığının bir bileşenidir @tr
definition: Bir zaman aralığını, ayrık bileşen olarak başka bir zaman aralığına sahip olan bir zaman aralığıyla ilişkilendirir. @tr
toolkit label: zaman aralığının bölümü @tr
toolkit definition: Ayrık bir bileşen olarak başka bir zaman aralığına sahip olan zaman aralığı. @tr

has part timespan
status: Published
type: Property
lexical alias: partTimespan.en
definition: Relates a timespan to a timespan that is a discrete component of another timespan.
domain: C10010
toolkit label: part timespan
toolkit definition: A timespan that is a discrete component of another timespan.
sub property of: has related timespan of timespan
has element type: 2
label: ajanjakson osa @fi
definition: Liittää ajanjakson ajanjaksoon, joka on toisen ajanjakson itsenäinen osa. @fi
toolkit label: ajanjakson osa @fi
toolkit definition: Ajanjakso, joka on toisen ajanjakson itsenäinen osa. @fi
label: har del av tidsrom @no
definition: Relaterer et tidsrom til et tidsrom som er en avgrenset del av et annet tidsrom. @no
toolkit label: del av tidsrom @no
toolkit definition: Et tidsrom som er en avgrenset del av et annet tidsrom. @no
label: a pour partie de laps de temps @fr
definition: Met un laps de temps en relation avec un laps de temps qui constitue une composante distincte d’un autre laps de temps. @fr
toolkit label: partie de laps de temps @fr
toolkit definition: Laps de temps qui constitue une composante distincte d’un autre laps de temps. @fr
label: heeft deel tijdspanne @nl
definition: Relateert een tijdspanne aan een tijdspanne die een afzonderlijk deel is van een andere tijdspanne. @nl
toolkit label: deel tijdspanne @nl
toolkit definition: Een tijdspanne die een afzonderlijk deel is van een andere tijdspanne. @nl
label: لها فترة زمنية جزئية @ar
definition: تربط بين فترة زمنية وفترة زمنية عبارة عن عنصر منفصل عن فترة زمنية أخرى. @ar
toolkit label: فترة زمنية جزئية @ar
toolkit definition: فترة زمنية عبارة عن عنصر منفصل عن فترة زمنية أخرى. @ar
label: té com a interval de temps de part @ca
definition: Relaciona un interval de temps amb un interval de temps que és un component discret d’un altre interval de temps. @ca
toolkit label: interval de temps de part @ca
toolkit definition: Interval de temps que és un component discret d’un altre interval de temps. @ca
label: har del af tidsperiode @da
definition: Relaterer et tidsforløb til en tidsperiode, som er en adskilt komponent af et andet tidsforløb. @da
toolkit label: del af tidforløb @da
toolkit definition: Tidsforløb, som er en adskilt komponent af et andet tidsforløb. @da
label: ajavahemiku osa @et
definition: Seostab ajavahemiku ajavahemikuga, mis on teise ajavahemiku eraldi osa. @et
toolkit label: ajavahemiku osa @et
toolkit definition: Ajavahemik, mis on teise ajavahemiku eraldi osa. @et
label: hat Teil-Zeitraum @de
definition: Setzt einen Zeitraum in Beziehung zu einem Zeitraum, der ein eigenständiger Bestandteil von einem anderen Zeitraum ist. @de
toolkit label: Teil-Zeitraum @de
toolkit definition: Ein Zeitraum , der ein eigenständiger Bestandteil von einem anderen Zeitraum ist. @de
label: időtartamrésze a következő: @hu
definition: Hozzákapcsol egy időtartamot egy időtartamhoz, amely egy másik időtartam elkülöníthető alkotóeleme. @hu
toolkit label: időtartamrésze: @hu
toolkit definition: Egy időtartam, amely egy másik időtartam elkülöníthető alkotóeleme. @hu
label: ha come parte arco di tempo @it
definition: Correla un arco di tempo a un arco di tempo che è una componente distinta di un altro arco di tempo. @it
toolkit label: parte di un arco di tempo @it
toolkit definition: Arco di tempo che è una componente distinta di un altro arco di tempo. @it
label: laikposms: daļa @lv
definition: Sasaista laikposmu ar laikposmu, kas ir cita laikposma atsevišķa sastāvdaļa. @lv
toolkit label: laikposms: daļa @lv
toolkit definition: Laikposms, kas ir cita laikposma atsevišķa sastāvdaļa. @lv
label: 有部分时间段 @zh-hans
definition: 将一个时间段与作为另一个时间段的独立组成部分的一个时间段关联起来。 @zh-hans
toolkit label: 部分时间段 @zh-hans
toolkit definition: 作为另一个时间段的独立组成部分的一个时间段 @zh-hans
has subproperty: has beginning
has subproperty: has ending
has subproperty: P70035
label: zaman aralığı bileşeni ile ilişkilidir @tr
definition: Bir zaman aralığını, başka bir zaman aralığının ayrık bileşeni olan bir zaman aralığıyla ilişkilendirir.. @tr
toolkit label: Zaman aralığının bölümü @tr
toolkit definition: Başka bir zaman aralığının ayrık bir bileşeni olan bir zaman aralığı. @tr

is period of activity of agent of
status: Published
type: Property
lexical alias: periodOfActivityOfAgentOf.en
definition: Relates a timespan to an agent who is active in its primary field of endeavor during a timespan.
domain: C10010
toolkit label: period of activity of agent of
toolkit definition: An agent who is active in its primary field of endeavor during a timespan.
has element type: 2
sub property of: has related agent of timespan
label: toiminta-aika toimijalle @fi
definition: Liittää ajanjakson toimijaan, joka on aktiivinen ensisijaisella toiminta-alallaan ajanjakson aikana. @fi
toolkit label: toiminta-aika toimijalle @fi
toolkit definition: Toimija, joka on aktiivinen ensisijaisella toiminta-alallaan ajanjakson aikana. @fi
label: er periode en agent var aktiv for @no
definition: Relaterer et tidsrom til en agent som er aktiv innenfor sitt hovedvirke i løpet av et tidsrom. @no
toolkit label: periode en agent var aktiv for @no
toolkit definition: En agent som er aktiv innenfor sitt hovedvirke i løpet av et tidsrom. @no
label: est une période d’activité d’un agent de @fr
definition: Met un laps de temps en relation avec un agent qui est actif dans son principal champ d’activité durant un laps de temps. @fr
toolkit label: période d’activité d’un agent de @fr
toolkit definition: Agent qui est actif dans son principal champ d’activité durant un laps de temps. @fr
label: is actieve periode van actor van @nl
definition: Relateert een tijdspanne aan een actor die actief is in diens belangrijkste bezigheid gedurende een tijdspanne. @nl
toolkit label: actieve periode van actor van @nl
toolkit definition: Een actor die actief is in diens belangrijkste bezigheid gedurende een tijdspanne. @nl
label: هي فترة نشاط لوكيل لـ @ar
definition: تربط بين فترة زمنية ووكيل نشط في مجال عمله الأساسي خلال فترة زمنية. @ar
toolkit label: فترة نشاط لوكيل لـ @ar
toolkit definition: وكيل نشط في مجال عمله الأساسي خلال فترة زمنية. @ar
label: és període d’activitat d’un agent de @ca
definition: Relaciona un interval de temps amb un agent que està actiu en el seu camp principal d’activitat durant un interval de temps. @ca
toolkit label: període d’activitat d’un agent de @ca
toolkit definition: Agent que està actiu en el seu camp principal d’activitat durant un interval de temps. @ca
label: er aktivitetsperiode for agent af @da
definition: Relaterer en tidsperiode til en agent, som i løbet af en given tidsperiode er aktiv i sit primære virkefelt. @da
toolkit label: aktivitetsperiode for agent af @da
toolkit definition: Agent, som i løbet af en given tidsperiode er aktiv i sit primære virkefelt. @da
label: tegija tegutsemisaeg tegijale @et
definition: Seostab ajavahemiku tegijaga, kes on olnud oma peamisel tegevusalal sel ajavahemikul aktiivne. @et
toolkit label: tegija tegutsemisaeg tegijale @et
toolkit definition: Tegija, kes on olnud oma peamisel tegevusalal sel ajavahemikul aktiivne. @et
label: ist Wirkungszeitraum eines Akteurs von @de
definition: Setzt einen Zeitraum in Beziehung zu einem Akteur, der in einem Zeitraum in seinem primären Tätigkeitsfeld aktiv ist. @de
toolkit label: Wirkungszeitraum eines Akteurs von @de
toolkit definition: Ein Akteur, der in einem Zeitraum in seinem primären Tätigkeitsfeld aktiv ist. @de
label: tevékenységi időszaka a következő ágensnek: @hu
definition: Hozzákapcsol egy időtartamot egy ágenshez, amely fő működési területén egy időtartam alatt aktív. @hu
toolkit label: tevékenységi időszaka a következő ágensnek: @hu
toolkit definition: Egy ágens, amely fő működési területén egy időtartam alatt aktív. @hu
label: è periodo di attività di agente di @it
definition: Correla un arco di tempo a un agente che è attivo nel suo campo principale di azione durante un arco di tempo. @it
toolkit label: periodo di attività di agente di @it
toolkit definition: Agente che è attivo nel suo campo principale di azione durante un arco di tempo. @it
label: ir aģenta darbības periods @lv
definition: Sasaista laikposmu ar aģentu, kas norādītajā laikposmā ir aktīvs savā galvenajā darbības jomā. @lv
toolkit label: ir aģenta darbības periods @lv
toolkit definition: Aģents, kas norādītajā laikposmā ir aktīvs savā galvenajā darbības jomā. @lv
label: 是……的行为者的活跃期 @zh-hans
definition: 将一个时间段与在一个时间段中活跃于其主要努力领域的一个行为者关联起来。 @zh-hans
toolkit label: ……的行为者的活跃期 @zh-hans
toolkit definition: 在一个时间段中活跃于其主要努力领域的一个行为者 @zh-hans
has subproperty: is period of activity of collective agent of
has subproperty: is period of activity of person of
has subproperty: P70051
label: temsilcisinin faaliyet sdönemidir @tr
definition: Bir zaman aralığını, bir zaman aralığı boyunca birincil çalışma alanında aktif olan bir temsilciyle ilişkilendirir. @tr
toolkit label: temsilcisinin faaliyet süresi @tr
toolkit definition: Bir zaman aralığı boyunca birincil çalışma alanında aktif olan bir temsilci. @tr

is period of activity of collective agent of
status: Published
type: Property
lexical alias: periodOfActivityOfCollectiveAgentOf.en
definition: Relates a timespan to a collective agent who is active in its primary field of endeavor during a timespan.
domain: C10010
toolkit label: period of activity of collective agent of
toolkit definition: A collective agent who is active in its primary field of endeavor during a timespan.
has element type: 2
sub property of: has related collective agent of timespan
sub property of: is period of activity of agent of
label: toiminta-aika yhteistoimijalle @fi
definition: Liittää ajanjakson yhteistoimijaan, joka on aktiivinen ensisijaisella toiminta-alallaan ajanjakson aikana. @fi
toolkit label: toiminta-aika yhteistoimijalle @fi
toolkit definition: Yhteistoimija, joka on aktiivinen ensisijaisella toiminta-alallaan ajanjakson aikana. @fi
label: er periode en kollektiv agent var aktiv for @no
definition: Relaterer et tidsrom til en kollektiv agent som er aktiv innenfor sitt hovedvirke i løpet av et tidsrom. @no
toolkit label: periode en kollektiv agent var aktiv for @no
toolkit definition: En kollektiv agent som er aktiv innenfor sitt hovedvirke i løpet av et tidsrom. @no
label: est une période d’activité d’un agent collectif de @fr
definition: Met un laps de temps en relation avec un agent collectif qui est actif dans son principal champ d’activité durant un laps de temps. @fr
toolkit label: période d’activité d’un agent collectif de @fr
toolkit definition: Agent collectif qui est actif dans son principal champ d’activité durant un laps de temps. @fr
label: is actieve periode van collectieve actor van @nl
definition: Relateert een tijdspanne aan een collectieve actor die actief is in diens belangrijkste bezigheid gedurende een tijdspanne. @nl
toolkit label: actieve periode van collectieve actor van @nl
toolkit definition: Een collectieve actor die actief is in diens belangrijkste bezigheid gedurende een tijdspanne. @nl
label: هي فترة لنشاط وكيل جماعي لـ @ar
definition: تربط بين فترة زمنية ووكيل جماعي نشط في مجال عمله الأساسي خلال فترة زمنية. @ar
toolkit label: فترة نشاط لوكيل جماعي لـ @ar
toolkit definition: وكيل جماعي نشط في مجال عمله الأساسي خلال فترة زمنية. @ar
label: és període d’activitat d’un agent col·lectiu de @ca
definition: Relaciona un interval de temps amb un agent col·lectiu que està actiu en el seu camp principal d’activitat durant un interval de temps. @ca
toolkit label: període d’activitat d’un agent col·lectiu de @ca
toolkit definition: Agent col·lectiu que està actiu en el seu camp principal d’activitat durant un interval de temps. @ca
label: er aktivitetsperiode for kollektiv agent af @da
definition: Relaterer en tidsperiode til en kollektiv agent, som i løbet af en given tidsperiode er aktiv i sit primære virkefelt. @da
toolkit label: aktivitetsperiode for kollektiv agent af @da
toolkit definition: Kollektiv agent, som i løbet af en given tidsperiode er aktiv i sit primære virkefelt. @da
label: kollektiivi tegutsemisaeg kollektiivile @et
definition: Seostab ajavahemiku kollektiiviga, kes on olnud oma peamisel tegevusalal sel ajavahemikul aktiivne. @et
toolkit label: kollektiivi tegutsemisaeg kollektiivile @et
toolkit definition: Kollektiiv, kes on olnud oma peamisel tegevusalal sel ajavahemikul aktiivne. @et
label: ist Wirkungszeitraum eines gemeinschaftlichen Akteurs von @de
definition: Setzt einen Zeitraum in Beziehung zu einem gemeinschaftlichen Akteur, der in einem Zeitraum in seinem primären Tätigkeitsfeld aktiv ist. @de
toolkit label: Wirkungszeitraum eines gemeinschaftlichen Akteurs von @de
toolkit definition: Ein gemeinschaftlicher Akteur, der in einem Zeitraum in seinem primären Tätigkeitsfeld aktiv ist. @de
label: működési ideje a következő kollektív ágensnek: @hu
definition: Hozzákapcsol egy időtartamot egy kollektív ágenshez, amely fő működési területén egy időtartam alatt aktív. @hu
toolkit label: kollektív ágens működési ideje: @hu
toolkit definition: Egy kollektív ágens, amely fő működési területén egy időtartam alatt aktív. @hu
label: è periodo di attività di agente collettivo di @it
definition: Correla un arco di tempo a un agente collettivo che è attivo nel suo campo principale di azione durante un arco di tempo. @it
toolkit label: periodo di attività di agente collettivo di @it
toolkit definition: Agente collettivo che è attivo nel suo campo principale di azione durante un arco di tempo. @it
label: ir grupas darbības periods @lv
definition: Sasaista laikposmu ar grupu, kas norādītajā laikposmā ir aktīva savā galvenajā darbības jomā. @lv
toolkit label: ir grupas darbības periods @lv
toolkit definition: Grupa, kas norādītajā laikposmā ir aktīva savā galvenajā darbības jomā. @lv
label: 是……的集体行为者的活跃期 @zh-hans
definition: 将一个时间段与在一个时间段中活跃于其主要努力领域的一个集体行为者关联起来。 @zh-hans
toolkit label: ……的集体行为者的活跃期 @zh-hans
toolkit definition: 在一个时间段中活跃于其主要努力领域的一个集体行为者 @zh-hans
has subproperty: is period of activity of corporate body of
has subproperty: is period of activity of family of
has subproperty: P70052
label: kolektif temsilcisinin faaliyet dönemidir @tr
definition: Bir zaman aralığını, bir zaman aralığı boyunca birincil çalışma alanında aktif olan bir kolektif temsilci ile ilişkilendirir. @tr
toolkit label: kolektif temsilcisinin faaliyet süresi @tr
toolkit definition: Bir zaman dilimi boyunca birincil çalışma alanında aktif olan kolektif bir temsilci. @tr

is period of activity of corporate body of
status: Published
type: Property
lexical alias: periodOfActivityOfCorporateBodyOf.en
domain: C10010
toolkit label: period of activity of corporate body of
sub property of: has related corporate body of timespan
definition: Relates a timespan to a corporate body who is active in its primary field of endeavor during a timespan.
toolkit definition: A corporate body who is active in its primary field of endeavor during a timespan.
has element type: 2
sub property of: is period of activity of collective agent of
label: toiminta-aika yhteisölle @fi
definition: Liittää ajanjakson yhteisöön, joka on ollut aktiivinen ensisijaisella toiminta-alallaan ajanjakson aikana. @fi
toolkit label: toiminta-aika yhteisölle @fi
toolkit definition: Yhteisö, joka on ollut aktiivinen ensisijaisella toiminta-alallaan ajanjakson aikana. @fi
label: er periode en korporasjon var aktiv for @no
definition: Relaterer et tidsrom til en korporasjon som er aktiv innenfor sitt hovedvirke i løpet av et tidsrom. @no
toolkit label: periode en korporasjon var aktiv for @no
toolkit definition: En korporasjon som er aktiv innenfor sitt hovedvirke i løpet av et tidsrom. @no
label: est une période d’activité d’une collectivité de @fr
definition: Met un laps de temps en relation avec une collectivité qui est active dans son principal champ d’activité durant un laps de temps. @fr
toolkit label: période d’activité d’une collectivité de @fr
toolkit definition: Collectivité qui est active dans son principal champ d’activité durant un laps de temps. @fr
label: is actieve periode van corporatie van @nl
definition: Relateert een tijdspanne aan een corporatie die actief is in diens belangrijkste bezigheid gedurende een tijdspanne. @nl
toolkit label: actieve periode van corporatie van @nl
toolkit definition: Een corporatie die actief is in diens belangrijkste bezigheid gedurende een tijdspanne. @nl
label: هي فترة نشاط لهيئة لـ @ar
definition: تربط بين فترة زمنية وهيئة تكون نشطة في مجال عملها الأساسي خلال فترة زمنية. @ar
toolkit label: فترة نشاط لهيئة لـ @ar
toolkit definition: هيئة تكون نشطة في مجال عملها الأساسي خلال فترة زمنية. @ar
label: és període d’activitat d’una entitat corporativa de @ca
definition: Relaciona un interval de temps amb una entitat corporativa que està activa en el seu camp principal d’activitat durant un interval de temps. @ca
toolkit label: període d’activitat d’una entitat corporativa de @ca
toolkit definition: Entitat corporativa que està activa en el seu camp principal d’activitat durant un interval de temps. @ca
label: er aktivitetsperiode for korporation af @da
definition: Relaterer en tidsperiode til en korporation, som i løbet af en given tidsperiode er aktiv i sit primære virkefelt. @da
toolkit label: aktivitetsperiode for korporation af @da
toolkit definition: Korporation, som i løbet af en given tidsperiode er aktiv i sit primære virkefelt. @da
label: asutuse tegutsemisaeg asutusele @et
definition: Seostab ajavahemiku asutusega, kes on olnud oma peamisel tegevusalal sel ajavahemikul aktiivne. @et
toolkit label: asutuse tegutsemisaeg asutusele @et
toolkit definition: Asutus, kes on olnud oma peamisel tegevusalal sel ajavahemikul aktiivne. @et
label: ist Wirkungszeitraum einer Körperschaft von @de
definition: Setzt einen Zeitraum in Beziehung zu einer Körperschaft, die in einem Zeitraum in ihrem primären Tätigkeitsfeld aktiv ist. @de
toolkit label: Wirkungszeitraum einer Körperschaft von @de
toolkit definition: Eine Körperschaft, die in einem Zeitraum in ihrem primären Tätigkeitsfeld aktiv ist. @de
label: a következő testület működési ideje: @hu
definition: Hozzákapcsol egy időtartamot egy testülethez, amely fő működési területén egy időtartam alatt aktív. @hu
toolkit label: testület működési ideje @hu
toolkit definition: Egy testület, amely fő működési területén egy időtartam alatt aktív. @hu
label: è periodo di attività di ente di @it
definition: Correla un arco di tempo a un ente che è attivo nel suo campo principale di azione durante un arco di tempo. @it
toolkit label: periodo di attività di ente di @it
toolkit definition: Ente che è attivo nel suo campo principale di azione durante un arco di tempo. @it
label: ir darbības periods institūcijai @lv
toolkit label: ir darbības periods institūcijai @lv
definition: Sasaista laikposmu ar institūciju, kas norādītajā laikposmā ir aktīva savā galvenajā darbības jomā. @lv
toolkit definition: Institūcija, kas norādītajā laikposmā ir aktīva savā galvenajā darbības jomā. @lv
label: 是……的团体的活跃期 @zh-hans
toolkit label: ……的团体的活跃期 @zh-hans
definition: 将一个时间段与在一个时间段中活跃于其主要努力领域的一个团体关联起来。 @zh-hans
toolkit definition: 在一个时间段中活跃于其主要努力领域的一个团体 @zh-hans
has subproperty: P70043
label: tüzel kişisinin faaliyet dönemidir @tr
toolkit label: tüzel kişiliğinin faaliyet süresi @tr
definition: Bir zaman aralığını, birincil çalışma alanında belirli bir zaman diliminde etkin olan bir tüzel kişi ile ilişkilendirir. @tr
toolkit definition: Ana faaliyet alanında belirli bir zaman diliminde etkin olan tüzel kişilik. @tr

is period of activity of family of
status: Published
type: Property
lexical alias: periodOfActivityOfFamilyOf.en
definition: Relates a timespan to a family who is active in its primary field of endeavor during a timespan.
domain: C10010
toolkit label: period of activity of family of
toolkit definition: A family who is active in its primary field of endeavor during a timespan.
has element type: 2
sub property of: has related family of timespan
sub property of: is period of activity of collective agent of
label: toiminta-aika suvulle @fi
definition: Liittää ajanjakson sukuun, joka on aktiivinen ensisijaisella toiminta-alallaan ajanjakson aikana. @fi
toolkit label: toiminta-aika suvulle @fi
toolkit definition: Suku, joka on aktiivinen ensisijaisella toiminta-alallaan ajanjakson aikana. @fi
label: er periode en familie var aktiv for @no
definition: Relaterer et tidsrom til en familie som er aktiv innenfor sitt hovedvirke i løpet av et tidsrom. @no
toolkit label: periode en familie var aktiv for @no
toolkit definition: En familie som er aktiv innenfor sitt hovedvirke i løpet av et tidsrom. @no
label: est une période d’activité d’une famille de @fr
definition: Met un laps de temps en relation avec une famille qui est active dans son principal champ d’activité durant un laps de temps. @fr
toolkit label: période d’activité d’une famille de @fr
toolkit definition: Famille qui est active dans son principal champ d’activité durant un laps de temps. @fr
label: is actieve periode van familie van @nl
definition: Relateert een tijdspanne aan een familie die actief is in diens belangrijkste bezigheid gedurende een tijdspanne. @nl
toolkit label: actieve periode van familie van @nl
toolkit definition: Een familie die actief is in diens belangrijkste bezigheid gedurende een tijdspanne. @nl
label: هي فترة نشاط لعائلة لـ @ar
definition: تربط بين فترة زمنية وعائلة نشطة في مجال عملها الأساسي خلال فترة زمنية. @ar
toolkit label: فترة نشاط لعائلة لـ @ar
toolkit definition: عائلة نشطة في مجال عملها الأساسي خلال فترة زمنية. @ar
label: és període d’activitat d’una família de @ca
definition: Relaciona un interval de temps amb una família que està activa en el seu camp principal d’activitat durant un interval de temps. @ca
toolkit label: període d’activitat d’una família de @ca
toolkit definition: Família que està activa en el seu camp principal d’activitat durant un interval de temps. @ca
label: er aktivitetsperiode for familie af @da
definition: Relaterer en tidsperiode til en familie, som i løbet af en given tidsperiode er aktiv i sit primære virkefelt. @da
toolkit label: aktivitetsperiode for familie af @da
toolkit definition: Familie, som i løbet af en given tidsperiode er aktiv i sit primære virkefelt. @da
label: perekonna tegutsemisaeg perekonnale @et
definition: Seostab ajavahemiku perekonnaga, kes on olnud oma peamisel tegevusalal sel ajavahemikul aktiivne. @et
toolkit label: perekonna tegutsemisaeg perekonnale @et
toolkit definition: Perekond, kes on olnud oma peamisel tegevusalal sel ajavahemikul aktiivne. @et
label: ist Wirkungszeitraum einer Familie von @de
definition: Setzt einen Zeitraum in Beziehung zu einer Familie, die in einem Zeitraum in ihrem primären Tätigkeitsfeld aktiv ist. @de
toolkit label: Wirkungszeitraum einer Familie von @de
toolkit definition: Eine Familie, die in einem Zeitraum in ihrem primären Tätigkeitsfeld aktiv ist. @de
label: működési ideje a következő családnak: @hu
definition: Hozzákapcsol egy időtartamot egy családhoz, amely fő működési területén egy időtartam alatt aktív. @hu
toolkit label: család működési ideje: @hu
toolkit definition: Egy család, amely fő működési területén egy időtartam alatt aktív. @hu
label: è periodo di attività di famiglia di @it
definition: Correla un arco di tempo a una famiglia che è attiva nel suo campo principale di azione durante un arco di tempo. @it
toolkit label: periodo di attività di famiglia di @it
toolkit definition: Famiglia che è attiva nel suo campo principale di azione durante un arco di tempo. @it
label: ir darbības periods dzimtai/ģimenei @lv
definition: Sasaista laikposmu ar dzimtu/ģimeni, kas norādītajā laikposmā ir aktīva savā galvenajā darbības jomā. @lv
toolkit label: ir darbības periods dzimtai/ģimenei @lv
toolkit definition: Dzimta/ģimene, kas norādītajā laikposmā ir aktīva savā galvenajā darbības jomā. @lv
label: 是……的家族的活跃期 @zh-hans
definition: 将一个时间段与在一个时间段中活跃于其主要努力领域的一个家族关联起来。 @zh-hans
toolkit label: ……的家族的活跃期 @zh-hans
toolkit definition: 在一个时间段中活跃于其主要努力领域的一个家族 @zh-hans
has subproperty: P70053
label: ailesinin faaliyet dönemidir @tr
definition: Bir zaman aralığını, zaman aralığı boyunca birincil çalışma alanında aktif olan bir aile ile ilişkilendirir. @tr
toolkit label: ailesinin faaliyet süresi @tr
toolkit definition: Bir zaman dilimi boyunca ana uğraş alanında aktif olan bir aile. @tr

is period of activity of person of
status: Published
type: Property
lexical alias: periodOfActivityOfPersonOf.en
domain: C10010
toolkit label: period of activity of person of
sub property of: has related person of timespan
definition: Relates a timespan to a person who is active in their primary field of endeavor during a timespan.
toolkit definition: A person who is active in their primary field of endeavor during a timespan.
has element type: 2
sub property of: is period of activity of agent of
label: toiminta-aika henkilölle @fi
definition: Liittää ajanjakson henkilöön, joka on aktiivinen ensisijaisella toiminta-alallaan ajanjakson aikana. @fi
toolkit label: toiminta-aika henkilölle @fi
toolkit definition: Henkilö, joka on aktiivinen ensisijaisella toiminta-alallaan ajanjakson aikana. @fi
label: er periode en person var aktiv for @no
definition: Relaterer et tidsrom til en person som er aktiv innenfor sitt hovedvirke i løpet av et tidsrom. @no
toolkit label: periode en person var aktiv for @no
toolkit definition: En person som er aktiv innenfor sitt hovedvirke i løpet av et tidsrom. @no
label: est une période d’activité d’une personne de @fr
definition: Met un laps de temps en relation avec une personne qui est active dans son principal champ d’activité durant un laps de temps. @fr
toolkit label: période d’activité d’une personne de @fr
toolkit definition: Personne qui est active dans son principal champ d’activité durant un laps de temps. @fr
label: is actieve periode van persoon van @nl
definition: Relateert een tijdspanne aan een persoon die actief is in diens belangrijkste bezigheid gedurende een tijdspanne. @nl
toolkit label: actieve periode van persoon van @nl
toolkit definition: Een persoon die actief is in diens belangrijkste bezigheid gedurende een tijdspanne. @nl
label: هي فترة نشاط لشخص لـ @ar
definition: تربط بين فترة زمنية وشخص نشط في مجال عمله خلال فترة زمنية. @ar
toolkit label: فترة نشاط لشخص لـ @ar
toolkit definition: شخص نشط في مجال عمله خلال فترة زمنية. @ar
label: és període d’activitat d’una persona de @ca
definition: Relaciona un interval de temps amb una persona que està activa en el seu camp principal d’activitat durant un interval de temps. @ca
toolkit label: període d’activitat d’una persona de @ca
toolkit definition: Persona que està activa en el seu camp principal d’activitat durant un interval de temps. @ca
label: er aktivitetsperiode for person af @da
definition: Relaterer en tidsperiode til en person, som i løbet af en given tidsperiode er aktiv i sit primære virkefelt. @da
toolkit label: aktivitetsperiode for person af @da
toolkit definition: Person, som i løbet af en given tidsperiode er aktiv i sit primære virkefelt. @da
label: isiku tegutsemisaeg isikule @et
definition: Seostab ajavahemiku isikuga, kes on olnud oma peamisel tegevusalal sel ajavahemikul aktiivne. @et
toolkit label: isiku tegutsemisaeg isikule @et
toolkit definition: Isik, kes on olnud oma peamisel tegevusalal sel ajavahemikul aktiivne. @et
label: ist Wirkungszeitraum einer Person von @de
definition: Setzt einen Zeitraum in Beziehung zu einer Person, die in einem Zeitraum in ihrem primären Tätigkeitsfeld aktiv ist. @de
toolkit label: Wirkungszeitraum einer Person von @de
toolkit definition: Eine Person, die in einem Zeitraum in ihrem primären Tätigkeitsfeld aktiv ist. @de
label: a következő személy működési ideje: @hu
definition: Hozzákapcsol egy időtartamot egy személyhez, amely fő működési területén egy időtartam alatt aktív. @hu
toolkit label: személy működési ideje @hu
toolkit definition: Egy személy, amely fő működési területén egy időtartam alatt aktív. @hu
label: è periodo di attività di persona di @it
definition: Correla un arco di tempo a una persona che è attiva nel suo campo principale di azione durante un arco di tempo. @it
toolkit label: periodo di attività di persona di @it
toolkit definition: Persona che è attiva nel suo campo principale di azione durante un arco di tempo. @it
label: ir darbības periods personai @lv
toolkit label: ir darbības periods personai @lv
definition: Sasaista laikposmu ar personu, kura norādītajā laikposmā ir aktīva savā galvenajā darbības jomā. @lv
toolkit definition: Persona, kura norādītajā laikposmā ir aktīva savā galvenajā darbības jomā. @lv
label: 是……的个人的活跃期 @zh-hans
toolkit label: ……的个人的活跃期 @zh-hans
definition: 将一个时间段与在一个时间段中活跃于其主要努力领域的一个个人关联起来。 @zh-hans
toolkit definition: 在一个时间段中活跃于其主要努力领域的一个个人 @zh-hans
has subproperty: P70044
label: kişisinin faaliyet dönemidir @tr
toolkit label: kişisinin faaliyet süresi @tr
definition: Bir zaman aralığını, bir zaman aralığı boyunca birincil çalışma alanında aktif olan bir kişiyle ilişkilendirir. @tr
toolkit definition: Belirli bir zaman diliminde kendi ana uğraş alanında etkin olan kişi. @tr

has preferred name of timespan
status: Published
type: Property
lexical alias: preferredNameOfTimespan.en
definition: Relates a timespan to a nomen that is a name of timespan that is selected for preference in a specific application or context.
domain: C10010
toolkit label: preferred name of timespan
toolkit definition: A nomen that is a name of timespan that is selected for preference in a specific application or context.
sub property of: has name of timespan
has element type: 3
sub property of: P00021
label: ajanjakson ensisijainen nimi @fi
definition: Liittää ajanjakson nomeniin, joka on ajanjakson nimi, joka on valittu ensisijaiseksi tietyssä sovelluksessa tai kontekstissa. @fi
toolkit label: ajanjakson ensisijainen nimi @fi
toolkit definition: Nomen, joka on ajanjakson nimi, joka on valittu ensisijaiseksi tietyssä sovelluksessa tai kontekstissa. @fi
label: har foretrukket navn for tidsrom @no
definition: Relaterer et tidsrom til et navn for tidsrom som er valgt som preferanse i en bestemt applikasjon eller kontekst. @no
toolkit label: foretrukket navn for tidsrom @no
toolkit definition: Et navn for tidsrom som er valgt som preferanse i en bestemt applikasjon eller kontekst. @no
label: a pour nom privilégié d’un laps de temps @fr
definition: Met un laps de temps en relation avec un nomen qui est un nom de laps de temps faisant l’objet d’un choix privilégié dans une application ou un contexte spécifiques. @fr
toolkit label: nom privilégié d’un laps de temps @fr
toolkit definition: Nomen qui est un nom de laps de temps faisant l’objet d’un choix privilégié dans une application ou un contexte spécifiques. @fr
label: heeft geprefereerde naam van tijdspanne @nl
definition: Relateert een tijdspanne aan een nomen dat is een naam van tijdspanne die als voorkeursterm geselecteerd is in een specifieke toepassing of context. @nl
toolkit label: geprefereerde naam van tijdspanne @nl
toolkit definition: Een nomen dat is een naam van tijdspanne die als voorkeursterm geselecteerd is in een specifieke toepassing of context. @nl
label: لها اسم مفضل لفترة زمنية @ar
definition: تربط بين فترة زمنية وتسمية عبارة عن اسم فترة زمنية مختارة للتفضيل ضمن تطبيق أو سياق محدد. @ar
toolkit label: اسم مفضل لفترة زمنية @ar
toolkit definition: تسمية عبارة عن اسم فترة زمنية مختارة للتفضيل ضمن تطبيق أو سياق محدد. @ar
label: té com a nom preferit d’interval de temps @ca
definition: Relaciona un interval de temps amb un nomen que és un nom d’interval de temps que se selecciona com a preferent en una aplicació o un context específic. @ca
toolkit label: nom preferit d’interval de temps @ca
toolkit definition: Nomen que és un nom d’interval de temps que se selecciona com a preferent en una aplicació o un context específic. @ca
label: har foretrukket navn på tidsperiode @da
definition: Relaterer en tidsperiode til et navn på tidsperiode, som er valgt som præference i en specifik anvendelse eller kontekst. @da
toolkit label: foretrukket navn på tidsperiode @da
toolkit definition: Navn på tidsperiode, som er valgt som præference i en specifik anvendelse eller kontekst. @da
label: ajavahemiku eelisnimi @et
definition: Seostab ajavahemiku ajavahemiku nimega, mis kindlas rakenduses või kontekstis on valitud eelistatuks. @et
toolkit label: ajavahemiku eelisnimi @et
toolkit definition: Ajavahemiku nimi, mis kindlas rakenduses või kontekstis on valitud eelistatuks. @et
label: hat bevorzugten Namen eines Zeitraums @de
definition: Setzt einen Zeitraum in Beziehung zu einem Namen eines Zeitraums, der in einer bestimmten Anwendung oder in einem bestimmten Kontext als Vorzugsform bestimmt wird. @de
toolkit label: Bevorzugter Name eines Zeitraums @de
toolkit definition: Ein Name eines Zeitraums, der in einer bestimmten Anwendung oder in einem bestimmten Kontext als Vorzugsform bestimmt wird. @de
label: időtartam előnyben részesített neve a következő: @hu
definition: Hozzákapcsol egy időtartamot egy nomenhez, amely egy olyan időtartamnév, amelyet egy adott alkalmazásban vagy kontextusban előnyben részesítenek. @hu
toolkit label: időtartam előnyben részesített neve: @hu
toolkit definition: Egy nomen, amely egy olyan időtartamnév, amelyet egy adott alkalmazásban vagy kontextusban előnyben részesítenek. @hu
label: ha come nome preferito di arco di tempo @it
definition: Correla un arco di tempo a un nome di arco di tempo selezionato come preferito in una specifica applicazione o contesto. @it
toolkit label: nome preferito di arco di tempo @it
toolkit definition: Nome di arco di tempo che è stato selezionato come preferito in una specifica applicazione o contesto. @it
label: laikposma prioritārais nosaukums @lv
definition: Sasaista laikposmu ar nomenu, kas ir laikposma nosaukums, kas ir izvēlēts noteiktam lietojumam vai noteiktā kontekstā. @lv
toolkit label: laikposma prioritārais nosaukums @lv
toolkit definition: Laikposma nosaukums, kas ir izvēlēts noteiktam lietojumam vai noteiktā kontekstā. @lv
label: 有时间段的首选名称 @zh-hans
definition: 将一个时间段与作为一个时间段的名称并在一个特定的应用或语境中被首选的一个命名关联起来。 @zh-hans
toolkit label: 时间段的首选名称 @zh-hans
toolkit definition: 作为一个时间段的名称并在一个特定的应用或语境中被首选的一个命名 @zh-hans
has subproperty: P70049
label: tercih edilen zaman aralığı adı ile ilişkilidir @tr
definition: Bir zaman aralığını, belirli bir uygulama veya bağlamda tercih için seçilen bir zaman aralığının ismiyle ilişkilendirir. @tr
toolkit label: zaman aralığının tercih edilen ismi @tr
toolkit definition: Belirli bir uygulama veya bağlamda tercih için seçilen bir zaman aralığı adı olan bir isim. @tr

has related agent of timespan
status: Published
type: Property
lexical alias: relatedAgentOfTimespan.en
definition: Relates a timespan to an agent who is associated with a timespan.
domain: C10010
sub property of: has related RDA entity of timespan
toolkit label: related agent of timespan
toolkit definition: An agent who is associated with a timespan.
has element type: 1
sub property of: P00006
label: ajanjaksoon liittyvä toimija @fi
definition: Liittää ajanjakson toimijaan, joka liittyy ajanjaksoon. @fi
toolkit label: ajanjaksoon liittyvä toimija @fi
toolkit definition: Toimija, joka liittyy ajanjaksoon. @fi
label: har agent relatert til tidsrom @no
definition: Relaterer et tidsrom til en agent som forbindes med et tidsrom. @no
toolkit label: agent relatert til tidsrom @no
toolkit definition: En agent som forbindes med et tidsrom. @no
label: a pour agent en relation avec un laps de temps @fr
definition: Met un laps de temps en relation avec un agent qui est associé à un laps de temps. @fr
toolkit label: agent en relation avec un laps de temps @fr
toolkit definition: Agent qui est associé à un laps de temps. @fr
label: heeft gerelateerde actor van tijdspanne @nl
definition: Relateert een tijdspanne aan een actor die geassocieerd is met een tijdspanne. @nl
toolkit label: gerelateerde actor van tijdspanne @nl
toolkit definition: Een actor die geassocieerd is met een tijdspanne. @nl
label: لها وكيل مرتبط بفترة زمنية @ar
definition: تربط بين فترة زمنية ووكيل مرتبط بفترة زمنية. @ar
toolkit label: وكيل مرتبط بفترة زمنية @ar
toolkit definition: وكيل مرتبط بفترة زمنية. @ar
label: té com a agent relacionat amb un interval de temps @ca
definition: Relaciona un interval de temps amb un agent que s’associa amb un interval de temps. @ca
toolkit label: agent relacionat amb un interval de temps @ca
toolkit definition: Agent que s’associa amb un interval de temps. @ca
label: har agent relateret til tidsperiode @da
definition: Relaterer en tidsperiode til en agent, som er knyttet til en tidsperiode. @da
toolkit label: agent relateret til tidsperiode @da
toolkit definition: Agent, som er knyttet til en tidsperiode. @da
label: ajavahemikuga seotud tegija @et
definition: Seostab ajavahemiku ajavahemikuga seotud tegijaga. @et
toolkit label: ajavahemikuga seotud tegija @et
toolkit definition: Ajavahemikuga seotud tegija. @et
label: hat mit Zeitraum in Beziehung stehenden Akteur @de
definition: Setzt einen Zeitraum in Beziehung zu einem Akteur, der mit einem Zeitraum in Verbindung steht. @de
toolkit label: mit Zeitraum in Beziehung stehender Akteur @de
toolkit definition: Ein Akteur, der mit einem Zeitraum in Verbindung steht. @de
label: időtartam kapcsolódó ágense a következő: @hu
definition: Hozzákapcsol egy időtartamot egy ágenshez, amelyet egy időtartamhoz társítanak. @hu
toolkit label: időtartam kapcsolódó ágense: @hu
toolkit definition: Egy ágens, amelyet egy időtartamhoz társítanak. @hu
label: ha come agente correlato di arco di tempo @it
definition: Correla un arco di tempo a un agente che è associato con un arco di tempo. @it
toolkit label: agente correlato di arco di tempo @it
toolkit definition: Agente che è associato con un arco di tempo. @it
definition: Sasaista laikposmu ar aģentu, kas saistīts ar laikposmu. @lv
label: ar laikposmu saistītais aģents @lv
toolkit label: ar laikposmu saistītais aģents @lv
toolkit definition: Aģents, kas saistīts ar laikposmu. @lv
definition: 将一个时间段与和一个时间段有关的一个行为者关联起来。 @zh-hans
label: 有时间段的关联行为者 @zh-hans
toolkit label: 时间段的关联行为者 @zh-hans
toolkit definition: 和一个时间段有关的一个行为者 @zh-hans
has subproperty: is period of activity of agent of
has subproperty: has related collective agent of timespan
has subproperty: has related person of timespan
has subproperty: P70005
definition: Bir zaman aralığını, zaman aralığıyla bağlantılı olan bir temsilciyle ilişkilendirir. @tr
label: zaman aralığının ilgili temsilcisi ile ilişkilidir @tr
toolkit label: zaman aralığıyla ilişkili temsilci @tr
toolkit definition: Bir zaman aralığıyla bağlantılı olan bir temsilci. @tr

has related collective agent of timespan
status: Published
type: Property
lexical alias: relatedCollectiveAgentOfTimespan.en
definition: Relates a timespan to a collective agent who is associated with a timespan.
domain: C10010
sub property of: has related agent of timespan
toolkit label: related collective agent of timespan
toolkit definition: A collective agent who is associated with a timespan.
has element type: 1
sub property of: P00012
label: ajanjaksoon liittyvä yhteistoimija @fi
definition: Liittää ajanjakson yhteistoimijaan, joka liittyy ajanjaksoon. @fi
toolkit label: ajanjaksoon liittyvä yhteistoimija @fi
toolkit definition: Yhteistoimija, joka liittyy ajanjaksoon. @fi
label: har kollektiv agent relatert til tidsrom @no
definition: Relaterer et tidsrom til en kollektiv agent som forbindes med et tidsrom. @no
toolkit label: kollektiv agent relatert til tidsrom @no
toolkit definition: En kollektiv agent som forbindes med et tidsrom. @no
label: a pour agent collectif en relation avec un laps de temps @fr
definition: Met un laps de temps en relation avec un agent collectif qui est associé à un laps de temps. @fr
toolkit label: agent collectif en relation avec un laps de temps @fr
toolkit definition: Agent collectif qui est associé à un laps de temps. @fr
label: heeft gerelateerde collectieve actor van tijdspanne @nl
definition: Relateert een tijdspanne aan een collectieve actor die geassocieerd is met een tijdspanne. @nl
toolkit label: gerelateerde collectieve actor van tijdspanne @nl
toolkit definition: Een collectieve actor die geassocieerd is met een tijdspanne. @nl
label: لها وكيل جماعي مرتبط بفترة زمنية @ar
definition: تربط بين فترة زمنية ووكيل جماعي مرتبط بفترة زمنية. @ar
toolkit label: وكيل جماعي مرتبط بفترة زمنية @ar
toolkit definition: وكيل جماعي مرتبط بفترة زمنية. @ar
label: té com a agent col·lectiu relacionat amb un interval de temps @ca
definition: Relaciona un interval de temps amb un agent col·lectiu que s’associa amb un interval de temps. @ca
toolkit label: agent col·lectiu relacionat amb un interval de temps @ca
toolkit definition: Agent col·lectiu que s’associa amb un interval de temps. @ca
label: har kollektiv agent relateret til tidsperiode @da
definition: Relaterer en tidsperiode til en kollektiv agent, som er knyttet til en tidsperiode. @da
toolkit label: kollektiv agent relateret til tidsperiode @da
toolkit definition: Kollektiv agent, som er knyttet til en tidsperiode. @da
label: ajavahemikuga seotud kollektiiv @et
definition: Seostab ajavahemiku ajavahemikuga seotud kollektiiviga. @et
toolkit label: ajavahemikuga seotud kollektiiv @et
toolkit definition: Ajavahemikuga seotud kollektiiv. @et
label: hat mit Zeitraum in Beziehung stehenden gemeinschaftlichen Akteur @de
definition: Setzt einen Zeitraum in Beziehung zu einem gemeinschaftlichen Akteur, der mit einem Zeitraum in Verbindung steht. @de
toolkit label: mit Zeitraum in Beziehung stehender gemeinschaftlicher Akteur @de
toolkit definition: Ein gemeinschaftlicher Akteur, der mit einem Zeitraum in Verbindung steht. @de
label: időtartam kapcsolódó kollektív ágense a következő: @hu
definition: Hozzákapcsol egy időtartamot egy kollektív ágenshez, amelyet egy időtartamhoz társítanak. @hu
toolkit label: időtartam kapcsolódó kollektív ágense: @hu
toolkit definition: Egy kollektív ágens, amelyet egy időtartamhoz társítanak. @hu
label: ha come agente collettivo correlato di arco di tempo @it
definition: Correla un arco di tempo a un agente collettivo che è associato con un arco di tempo. @it
toolkit label: agente collettivo correlato di arco di tempo @it
toolkit definition: Agente collettivo che è associato con un arco di tempo. @it
definition: Sasaista laikposmu ar grupu, kas saistīta ar laikposmu. @lv
label: ar laikposmu saistītā grupa @lv
toolkit label: ar laikposmu saistītā grupa @lv
toolkit definition: Grupa, kas saistīta ar laikposmu. @lv
definition: 将一个时间段与和一个时间段有关的一个集体行为者关联起来。 @zh-hans
label: 有时间段的关联集体行为者 @zh-hans
toolkit label: 时间段的关联集体行为者 @zh-hans
toolkit definition: 和一个时间段有关的一个集体行为者 @zh-hans
has subproperty: is period of activity of collective agent of
has subproperty: has related corporate body of timespan
has subproperty: has related family of timespan
has subproperty: P70006
definition: Bir zaman aralığını, zaman aralığıyla ilgili bir kollektif temsilciyle ilişkilendirir. @tr
label: zaman aralığının ilgili kolektif temsilcisi ile ilişkilidir @tr
toolkit label: zaman aralığının kollektif temsilciyle ilişkisi @tr
toolkit definition: Bir zaman aralığıyla ilişkilendirilen bir kollektif temsilci. @tr

has related corporate body of timespan
status: Published
type: Property
lexical alias: relatedCorporateBodyOfTimespan.en
definition: Relates a timespan to a corporate body who is associated with a timespan.
domain: C10010
sub property of: has related collective agent of timespan
toolkit label: related corporate body of timespan
toolkit definition: A corporate body who is associated with a timespan.
has element type: 1
sub property of: P00009
alternative label: date associated with corporate body of
label: ajanjaksoon liittyvä yhteisö @fi
definition: Liittää ajanjakson yhteisöön, joka liittyy ajanjaksoon. @fi
toolkit label: ajanjaksoon liittyvä yhteisö @fi
toolkit definition: Yhteisö, joka liittyy ajanjaksoon. @fi
label: har korporasjon relatert til tidsrom @no
definition: Relaterer et tidsrom til en korporasjon som forbindes med et tidsrom. @no
alternative label: dato som forbindes med korporasjon for @no
toolkit label: korporasjon relatert til tidsrom @no
toolkit definition: En korporasjon som forbindes med et tidsrom. @no
label: a pour collectivité en relation avec un laps de temps @fr
definition: Met un laps de temps en relation avec une collectivité qui est associée à un laps de temps. @fr
alternative label: date associée à une collectivité de @fr
toolkit label: collectivité en relation avec un laps de temps @fr
toolkit definition: Collectivité qui est associée à un laps de temps. @fr
label: heeft gerelateerde corporatie van tijdspanne @nl
definition: Relateert een tijdspanne aan een corporatie die geassocieerd is met een tijdspanne. @nl
toolkit label: gerelateerde corporatie van tijdspanne @nl
toolkit definition: Een corporatie die geassocieerd is met een tijdspanne. @nl
label: لها هيئة مرتبطة بفترة زمنية @ar
definition: تربط بين فترة زمنية وهيئة مرتبطة بفترة زمنية. @ar
alternative label: تاريخ مرتبط بهيئة لـ @ar
toolkit label: هيئة مرتبطة بفترة زمنية @ar
toolkit definition: هيئة مرتبطة بفترة زمنية. @ar
label: té com a entitat corporativa relacionada amb un interval de temps @ca
definition: Relaciona un interval de temps amb una entitat corporativa que s’associa amb un interval de temps. @ca
alternative label: data associada amb una entitat corporativa de @ca
toolkit label: entitat corporativa relacionada amb un interval de temps @ca
toolkit definition: Entitat corporativa que s’associa amb un interval de temps. @ca
label: har korporation relateret til tidsperiode @da
definition: Relaterer en tidsperiode til en korporation, som er knyttet til en tidsperiode. @da
alternative label: dato, som er knyttet til korporation af @da
toolkit label: korporation relateret til tidsperiode @da
toolkit definition: Korporation, som er knyttet til en tidsperiode. @da
label: ajavahemikuga seotud asutus @et
definition: Seostab ajavahemiku ajavahemikuga seotud asutusega. @et
alternative label: daatumiga seotud asutus @et
toolkit label: ajavahemikuga seotud asutus @et
toolkit definition: Ajavahemikuga seotud asutus. @et
label: hat mit Zeitraum in Beziehung stehende Körperschaft @de
definition: Setzt einen Zeitraum in Beziehung zu einer Körperschaft, die mit einem Zeitraum in Verbindung steht. @de
toolkit label: mit Zeitraum in Beziehung stehende Körperschaft @de
toolkit definition: Eine Körperschaft, die mit einem Zeitraum in Verbindung steht. @de
label: testülethez kapcsolódó időpontja: @hu
definition: Hozzákapcsol egy időtartamot egy testülethez, amelyet egy időtartamhoz társítanak. @hu
toolkit label: időtartamra vonatkozó testület @hu
toolkit definition: Egy testület, amelyet egy időtartamhoz társítanak. @hu
label: ha come ente correlato di arco di tempo @it
definition: Correla un arco di tempo a un ente che è associato con un arco di tempo. @it
alternative label: date associate con ente di @it
toolkit label: ente correlato di arco di tempo @it
toolkit definition: Ente che è associato con un arco di tempo. @it
definition: Sasaista laikposmu ar institūciju, kas saistīta ar laikposmu. @lv
label: ar laikposmu saistītā institūcija @lv
toolkit label: ar laikposmu saistītā institūcija @lv
toolkit definition: Institūcija, kas saistīta ar laikposmu. @lv
alternative label: ajankohtaan liittyvä yhteisö @fi
alternative label: Datum, das mit einer Körperschaft in Verbindung steht @de
alternative label: 和……的团体有关的日期 @zh-hans
definition: 将一个时间段与和一个时间段有关的一个团体关联起来。 @zh-hans
label: 有时间段的关联团体 @zh-hans
toolkit label: 时间段的关联团体 @zh-hans
toolkit definition: 和一个时间段有关的一个团体 @zh-hans
has subproperty: is date of conference of
has subproperty: is date of establishment of
has subproperty: is date of termination of
has subproperty: is period of activity of corporate body of
has subproperty: P70013
alternative label: tüzel kişilikle bağlantılı olan tarih @tr

has related entity of timespan
status: Published
lexical alias: relatedEntityOfTimespan.en
definition: Relates a timespan to an entity that is associated with a timespan.
toolkit label: related entity of timespan
toolkit definition: An entity that is associated with a timespan.
type: Property
domain: C10010
has element type: 1
sub property of: P00028
label: ajanjaksoon liittyvä entiteetti @fi
definition: Liittää ajanjakson entiteettiin, joka liittyy ajanjaksoon. @fi
toolkit label: ajanjaksoon liittyvä entiteetti @fi
toolkit definition: Entiteetti, joka liittyy ajanjaksoon. @fi
label: har entitet relatert til tidsrom @no
definition: Relaterer et tidsrom til en entitet som forbindes med et tidsrom. @no
toolkit label: entitet relatert til tidsrom @no
toolkit definition: En entitet som forbindes med et tidsrom. @no
label: a pour entité en relation avec un laps de temps @fr
definition: Met un laps de temps en relation avec une entité qui est associée à un laps de temps. @fr
toolkit label: entité en relation avec un laps de temps @fr
toolkit definition: Entité qui est associée à un laps de temps. @fr
label: heeft gerelateerde entiteit van tijdspanne @nl
definition: Relateert een tijdspanne aan een entiteit die geassocieerd is met een tijdspanne. @nl
toolkit label: gerelateerde entiteit van tijdspanne @nl
toolkit definition: Een entiteit die geassocieerd is met een tijdspanne. @nl
label: لها كيان مرتبط بفترة زمنية @ar
definition: تربط بين فترة زمنية وكيان مرتبط بفترة زمنية. @ar
toolkit label: كيان مرتبط بفترة زمنية @ar
toolkit definition: كيان مرتبط بفترة زمنية. @ar
label: té com a entitat relacionada amb un interval de temps @ca
definition: Relaciona un interval de temps amb una entitat que s’associa amb un interval de temps. @ca
toolkit label: entitat relacionada amb un interval de temps @ca
toolkit definition: Entitat que s’associa amb un interval de temps. @ca
label: har entitet relateret til tidsperiode @da
definition: Relaterer en tidsperiode til en entitet, som er knyttet til en tidsperiode. @da
toolkit label: entitet relateret til tidsperiode @da
toolkit definition: Entitet, som er knyttet til en tidsperiode. @da
label: ajavahemikuga seotud olem @et
definition: Seostab ajavahemiku ajavahemikuga seotud olemiga. @et
toolkit label: ajavahemikuga seotud olem @et
toolkit definition: Ajavahemikuga seotud olem. @et
label: hat mit Zeitraum in Beziehung stehende Entität @de
definition: Setzt einen Zeitraum in Beziehung zu einer Entität, die mit einem Zeitraum in Verbindung steht. @de
toolkit label: mit Zeitraum in Beziehung stehende Entität @de
toolkit definition: Eine Entität, die mit einem Zeitraum in Verbindung steht. @de
label: időtartam kapcsolódó entitása a következő: @hu
definition: Hozzákapcsol egy időtartamot egy entitáshoz, amelyet egy időtartamhoz társítanak. @hu
toolkit label: időtartam kapcsolódó entitása: @hu
toolkit definition: Egy entitás, amelyet egy időtartamhoz társítanak. @hu
label: ha come entità correlata di arco di tempo @it
definition: Correla un arco di tempo a un'entità che è associata con un arco di tempo. @it
toolkit label: entità correlata di arco di tempo @it
toolkit definition: Entità che è associata con un arco di tempo. @it
label: ar laikposmu saistītā entīte @lv
definition: Sasaista laikposmu ar entīti, kas saistīta ar laikposmu. @lv
toolkit label: ar laikposmu saistītā entīte @lv
toolkit definition: Entīte, kas saistīta ar laikposmu. @lv
label: 有时间段的关联实体 @zh-hans
definition: 将一个时间段与和一个时间段有关的一个实体关联起来。 @zh-hans
toolkit label: 时间段的关联实体 @zh-hans
toolkit definition: 和一个时间段有关的一个实体 @zh-hans
has subproperty: has related RDA entity of timespan
has subproperty: P70058
label: zaman aralığının ilgili varlığı ile ilişkilidir @tr
definition: Bir zaman aralığını, bir zaman aralığıyla bağlantılı olan bir varlıkla ilişkilendirir. @tr
toolkit label: zaman aralığının ilişkili olduğu varlık @tr
toolkit definition: Bir zaman aralığı ile bağlantılı olan bir varlık. @tr

has related expression of timespan
status: Published
type: Property
lexical alias: relatedExpressionOfTimespan.en
definition: Relates a timespan to an expression that is associated with a timespan.
domain: C10010
sub property of: has related RDA entity of timespan
toolkit label: related expression of timespan
toolkit definition: An expression that is associated with a timespan.
has element type: 1
sub property of: P00003
label: ajanjaksoon liittyvä ekspressio @fi
definition: Liittää ajanjakson ekspressioon, joka liittyy ajanjaksoon. @fi
toolkit label: ajanjaksoon liittyvä ekspressio @fi
toolkit definition: Ekspressio, joka liittyy ajanjaksoon. @fi
label: har uttrykk relatert til tidsrom @no
definition: Relaterer et tidsrom til et uttrykk som forbindes med et tidsrom. @no
toolkit label: uttrykk relatert til tidsrom @no
toolkit definition: Et uttrykk som forbindes med et tidsrom. @no
label: a pour expression en relation avec un laps de temps @fr
definition: Met un laps de temps en relation avec une expression qui est associée à un laps de temps. @fr
toolkit label: expression en relation avec un laps de temps @fr
toolkit definition: Expression qui est associée à un laps de temps. @fr
label: heeft gerelateerde expressie van tijdspanne @nl
definition: Relateert een tijdspanne aan een expressie die geassocieerd is met een tijdspanne. @nl
toolkit label: gerelateerde expressie van tijdspanne @nl
toolkit definition: Een expressie die geassocieerd is met een tijdspanne. @nl
label: لها تعبيرة مرتبطة بفترة زمنية @ar
definition: تربط بين فترة زمنية وتعبيرة مرتبطة بفترة زمنية. @ar
toolkit label: تعبيرة مرتبطة بفترة زمنية @ar
toolkit definition: تعبيرة مرتبطة بفترة زمنية. @ar
label: té com a expressió relacionada amb un interval de temps @ca
definition: Relaciona un interval de temps amb una expressió que s’associa amb un interval de temps. @ca
toolkit label: expressió relacionada amb un interval de temps @ca
toolkit definition: Expressió que s’associa amb un interval de temps. @ca
label: har udtryk relateret til tidsperiode @da
definition: Relaterer en tidsperiode til et udtryk, som er knyttet til en tidsperiode. @da
toolkit label: udtryk relateret til tidsperiode @da
toolkit definition: Udtryk, som er knyttet til en tidsperiode. @da
label: ajavahemikuga seotud väljendus @et
definition: Seostab ajavahemiku ajavahemikuga seotud väljendusega. @et
toolkit label: ajavahemikuga seotud väljendus @et
toolkit definition: Ajavahemikuga seotud väljendus. @et
label: hat mit Zeitraum in Beziehung stehende Expression @de
definition: Setzt einen Zeitraum in Beziehung zu einer Expression, die mit einem Zeitraum in Verbindung steht. @de
toolkit label: mit Zeitraum in Beziehung stehende Expression @de
toolkit definition: Eine Expression, die mit einem Zeitraum in Verbindung steht. @de
label: időtartam kapcsolódó kifejezési formája a következő: @hu
definition: Hozzákapcsol egy időtartamot egy kifejezési formához, amelyet egy időtartamhoz társítanak. @hu
toolkit label: időtartamra vonatkozó kifejezési forma @hu
toolkit definition: Egy kifejezési forma, amelyet egy időtartamhoz társítanak. @hu
label: ha come espressione correlata di arco di tempo @it
definition: Correla un arco di tempo a un'espressione che è associata con un arco di tempo. @it
toolkit label: espressione correlata di arco di tempo @it
toolkit definition: Espressione che è associata con un arco di tempo. @it
definition: Sasaista laikposmu ar izteiksmi, kas ir saistīta ar laikposmu. @lv
label: ar laikposmu saistītā izteiksme @lv
toolkit label: ar laikposmu saistītā izteiksme @lv
toolkit definition: Izteiksme, kas ir saistīta ar laikposmu. @lv
definition: 将一个时间段与和一个时间段有关的一种内容表达关联起来。 @zh-hans
label: 有时间段的关联内容表达 @zh-hans
toolkit label: 时间段的关联内容表达 @zh-hans
toolkit definition: 和一个时间段有关的一种内容表达 @zh-hans
has subproperty: is date of expression of
has subproperty: is duration of (Deprecated)
has subproperty: P70002
definition: Bir zaman aralığını, bir zaman aralığıyla bağlantılı olan bir anlatımla ilişkilendirir. @tr
label: zaman aralığının ilgili anlatımı ile ilişkilidir @tr
toolkit label: zaman aralığının ilişkili anlatımı @tr
toolkit definition: Bir zaman aralığıyla bağlantılı olan bir anlatım. @tr

has related family of timespan
status: Published
type: Property
lexical alias: relatedFamilyOfTimespan.en
definition: Relates a timespan to a family who is associated with a timespan.
domain: C10010
sub property of: has related collective agent of timespan
toolkit label: related family of timespan
toolkit definition: A family who is associated with a timespan.
has element type: 1
sub property of: P00008
alternative label: date associated with family of
label: ajanjaksoon liittyvä suku @fi
definition: Liittää ajanjakson sukuun, joka liittyy ajanjaksoon. @fi
toolkit label: ajanjaksoon liittyvä suku @fi
toolkit definition: Suku, joka liittyy ajanjaksoon. @fi
label: har familie relatert til tidsrom @no
definition: Relaterer et tidsrom til en familie som forbindes med et tidsrom. @no
alternative label: dato som forbindes med familie for @no
toolkit label: familie relatert til tidsrom @no
toolkit definition: En familie som forbindes med et tidsrom. @no
label: a pour famille en relation avec un laps de temps @fr
definition: Met un laps de temps en relation avec une famille qui est associée à un laps de temps. @fr
alternative label: date associée à une famille de @fr
toolkit label: famille en relation avec un laps de temps @fr
toolkit definition: Famille qui est associée à un laps de temps. @fr
label: heeft gerelateerde familie van tijdspanne @nl
definition: Relateert een tijdspanne aan een familie die geassocieerd is met een tijdspanne. @nl
toolkit label: gerelateerde familie van tijdspanne @nl
toolkit definition: Een familie die geassocieerd is met een tijdspanne. @nl
label: لها عائلة مرتبطة بفترة زمنية @ar
definition: تربط بين فترة زمنية وعائلة مرتبطة بفترة زمنية. @ar
alternative label: تاريخ مرتبط بعائلة لـ @ar
toolkit label: عائلة مرتبطة بفترة زمنية @ar
toolkit definition: عائلة مرتبطة بفترة زمنية. @ar
label: té com a família relacionada amb un interval de temps @ca
definition: Relaciona un interval de temps amb una família que s’associa amb un interval de temps. @ca
alternative label: data associada amb una família de @ca
toolkit label: família relacionada amb un interval de temps @ca
toolkit definition: Família que s’associa amb un interval de temps. @ca
label: har familie relateret til tidsperiode @da
definition: Relaterer en tidsperiode til en familie, som er knyttet til en tidsperiode. @da
alternative label: dato, som er knyttet til familie af @da
toolkit label: familie relateret til tidsperiode @da
toolkit definition: Familie, som er knyttet til en tidsperiode. @da
label: ajavahemikuga seotud perekond @et
definition: Seostab ajavahemiku ajavahemikuga seotud perekonnaga. @et
alternative label: daatumiga seotud perekond @et
toolkit label: ajavahemikuga seotud perekond @et
toolkit definition: Ajavahemikuga seotud perekond. @et
label: hat mit Zeitraum in Beziehung stehende Familie @de
definition: Setzt einen Zeitraum in Beziehung zu einer Familie, die mit einem Zeitraum in Verbindung steht. @de
toolkit label: mit Zeitraum in Beziehung stehende Familie @de
toolkit definition: Eine Familie, die mit einem Zeitraum in Verbindung steht. @de
label: időtartamhoz kapcsolódó család a következő: @hu
definition: Hozzákapcsol egy időtartamot egy családhoz, amelyet egy időtartamhoz társítanak. @hu
toolkit label: időtartamhoz kapcsolódó család a következő: @hu
toolkit definition: Egy család, amelyet egy időtartamhoz társítanak. @hu
label: ha come famiglia correlata di arco di tempo @it
definition: Correla un arco di tempo a una famiglia che è associata con un arco di tempo. @it
alternative label: date associate con famiglia di @it
toolkit label: famiglia correlata di arco di tempo @it
toolkit definition: Famiglia che è associata con un arco di tempo. @it
definition: Sasaista laikposmu ar dzimtu/ģimeni, kas saistīta ar laikposmu. @lv
label: ar laikposmu saistītā dzimta/ģimene @lv
toolkit label: ar laikposmu saistītā dzimta/ģimene @lv
toolkit definition: Dzimta/ģimene, kas saistīta ar laikposmu. @lv
alternative label: ajankohtaan liittyvä suku @fi
alternative label: Datum, das mit einer Familie in Verbindung steht von @de
alternative label: 和……的家族有关的日期 @zh-hans
definition: 将一个时间段与和一个时间段有关的一个家族关联起来。 @zh-hans
label: 有时间段的关联家族 @zh-hans
toolkit label: 时间段的关联家族 @zh-hans
toolkit definition: 和一个时间段有关的一个家族 @zh-hans
has subproperty: is period of activity of family of
has subproperty: P70012
alternative label: családhoz kapcsolódó időpontja a következő: @hu
alternative label: aileyle bağlantılı olan tarih @tr
definition: Bir zaman aralığını, zaman aralığıyla bağlantılı olan bir aileyle ilişkilendirir. @tr
toolkit label: zaman aralığıyla ilişkili aile @tr
toolkit definition: Bir zaman aralığıyla bağlantılı olan bir aile. @tr

has related item of timespan
status: Published
type: Property
lexical alias: relatedItemOfTimespan.en
definition: Relates a timespan to an item that is associated with a timespan.
domain: C10010
sub property of: has related RDA entity of timespan
toolkit label: related item of timespan
toolkit definition: An item that is associated with a timespan.
has element type: 1
sub property of: P00005
label: ajanjaksoon liittyvä kappale @fi
definition: Liittää ajanjakson kappaleeseen, joka liittyy ajanjaksoon. @fi
toolkit label: ajanjaksoon liittyvä kappale @fi
toolkit definition: Kappale, joka liittyy ajanjaksoon. @fi
label: har eksemplar relatert til tidsrom @no
definition: Relaterer et tidsrom til et eksemplar som forbindes med et tidsrom. @no
toolkit label: eksemplar relatert til tidsrom @no
toolkit definition: Et eksemplar som forbindes med et tidsrom. @no
label: a pour item en relation avec un laps de temps @fr
definition: Met un laps de temps en relation avec un item qui est associé à un laps de temps. @fr
toolkit label: item en relation avec un laps de temps @fr
toolkit definition: Item qui est associé à un laps de temps. @fr
label: heeft gerelateerd item van tijdspanne @nl
definition: Relateert een tijdspanne aan een item dat geassocieerd is met een tijdspanne. @nl
toolkit label: gerelateerd item van tijdspanne @nl
toolkit definition: Een item dat geassocieerd is met een tijdspanne. @nl
label: لها مفردة مرتبطة بفترة زمنية @ar
definition: تربط بين فترة زمنية ومفردة مرتبطة بفترة زمنية. @ar
toolkit label: مفردة مرتبطة بفترة زمنية @ar
toolkit definition: مفردة مرتبطة بفترة زمنية. @ar
label: té com a ítem relacionat amb un interval de temps @ca
definition: Relaciona un interval de temps amb un ítem que s’associa amb un interval de temps. @ca
toolkit label: ítem relacionat amb un interval de temps @ca
toolkit definition: Ítem que s’associa amb un interval de temps. @ca
label: har eksemplar relateret til tidsperiode @da
definition: Relaterer en tidsperiode til et eksemplar, som er knyttet til en tidsperiode. @da
toolkit label: eksemplar relateret til tidsperiode @da
toolkit definition: Eksemplar, som er knyttet til en tidsperiode. @da
label: ajavahemikuga seotud eksemplar @et
definition: Seostab ajavahemiku ajavahemikuga seotud eksemplariga. @et
toolkit label: ajavahemikuga seotud eksemplar @et
toolkit definition: Ajavahemikuga seotud eksemplar. @et
label: hat mit Zeitraum in Beziehung stehendes Exemplar @de
definition: Setzt einen Zeitraum in Beziehung zu einem Exemplar, das mit einem Zeitraum in Verbindung steht. @de
toolkit label: mit Zeitraum in Beziehung stehendes Exemplar @de
toolkit definition: Ein Exemplar, das mit einem Zeitraum in Verbindung steht. @de
label: időtartam kapcsolódó példánya a következő: @hu
definition: Hozzákapcsol egy időtartamot egy példányhoz, amelyet egy időtartamhoz társítanak. @hu
toolkit label: időtartamra vonatkozó példány @hu
toolkit definition: Egy példány, amelyet egy időtartamhoz társítanak. @hu
label: ha come item correlato di arco di tempo @it
definition: Correla un arco di tempo a un item che è associato con un arco di tempo. @it
toolkit label: item correlato di arco di tempo @it
toolkit definition: Item che è associato con un arco di tempo. @it
definition: Sasaista laikposmu ar vienību, kas ir saistīta ar laikposmu. @lv
label: ar laikposmu saistītā vienība @lv
toolkit label: ar laikposmu saistītā vienība @lv
toolkit definition: Vienība, kas ir saistīta ar laikposmu. @lv
definition: 将一个时间段与和一个时间段有关的一个单件关联起来。 @zh-hans
label: 有时间段的关联单件 @zh-hans
toolkit label: 时间段的关联单件 @zh-hans
toolkit definition: 和一个时间段有关的一个单件 @zh-hans
has subproperty: P70004
definition: Bir zaman aralığını, zaman aralığıyla bağlantılı olan bir kopya ile ilişkilendirir. @tr
label: zaman aralığının ilgili kopyası ile ilişkilidir @tr
toolkit label: zaman aralığıyla ilişkili kopya @tr
toolkit definition: Bir zaman aralığıyla bağlantılı olan bir kopya. @tr

has related manifestation of timespan
status: Published
type: Property
lexical alias: relatedManifestationOfTimespan.en
definition: Relates a timespan to a manifestation that is associated with a timespan.
domain: C10010
sub property of: has related RDA entity of timespan
toolkit label: related manifestation of timespan
toolkit definition: A manifestation that is associated with a timespan.
has element type: 1
sub property of: P00004
label: ajanjaksoon liittyvä manifestaatio @fi
definition: Liittää ajanjakson manifestaatioon, joka liittyy ajanjaksoon. @fi
toolkit label: ajanjaksoon liittyvä manifestaatio @fi
toolkit definition: Manifestaatio, joka liittyy ajanjaksoon. @fi
label: har manifestasjon relatert til tidsrom @no
definition: Relaterer et tidsrom til en manifestasjon som forbindes med et tidsrom. @no
toolkit label: manifestasjon relatert til tidsrom @no
toolkit definition: En manifestasjon som forbindes med et tidsrom. @no
label: a pour manifestation en relation avec un laps de temps @fr
definition: Met un laps de temps en relation avec une manifestation qui est associée à un laps de temps. @fr
toolkit label: manifestation en relation avec un laps de temps @fr
toolkit definition: Manifestation qui est associée à un laps de temps. @fr
label: heeft gerelateerde manifestatie van tijdspanne @nl
definition: Relateert een tijdspanne aan een manifestatie die geassocieerd is met een tijdspanne. @nl
toolkit label: gerelateerde manifestatie van tijdspanne @nl
toolkit definition: Een manifestatie die geassocieerd is met een tijdspanne. @nl
label: لها تجسيدة مرتبطة بفترة زمنية @ar
definition: تربط بين فترة زمنية وتجسيدة مرتبطة بفترة زمنية. @ar
toolkit label: تجسيدة مرتبطة بفترة زمنية @ar
toolkit definition: تجسيدة مرتبطة بفترة زمنية. @ar
label: té com a manifestació relacionada amb un interval de temps @ca
definition: Relaciona un interval de temps amb una manifestació que s’associa amb un interval de temps. @ca
toolkit label: manifestació relacionada amb un interval de temps @ca
toolkit definition: Manifestació que s’associa amb un interval de temps. @ca
label: har manifestation relateret til tidsperiode @da
definition: Relaterer en tidsperiode til en manifestation, som er knyttet til en tidsperiode. @da
toolkit label: manifestation relateret til tidsperiode @da
toolkit definition: Manifestation, som er knyttet til en tidsperiode. @da
label: ajavahemikuga seotud kehastus @et
definition: Seostab ajavahemiku ajavahemikuga seotud kehastusega. @et
toolkit label: ajavahemikuga seotud kehastus @et
toolkit definition: Ajavahemikuga seotud kehastus. @et
label: hat mit Zeitraum in Beziehung stehende Manifestation @de
definition: Setzt einen Zeitraum in Beziehung zu einer Manifestation, die mit einem Zeitraum in Verbindung steht. @de
toolkit label: mit Zeitraum in Beziehung stehende Manifestation @de
toolkit definition: Eine Manifestation, die mit einem Zeitraum in Verbindung steht. @de
label: időtartam kapcsolódó megjelenési formája a következő: @hu
definition: Hozzákapcsol egy időtartamot egy megjelenési formához, amelyet egy időtartamhoz társítanak. @hu
toolkit label: időtartamra vonatkozó megjelenési forma @hu
toolkit definition: Egy megjelenési forma, amelyet egy időtartamhoz társítanak. @hu
label: ha come manifestazione correlata di arco di tempo @it
definition: Correla un arco di tempo a una manifestazione che è associata con un arco di tempo. @it
toolkit label: manifestazione correlata di arco di tempo @it
toolkit definition: Manifestazione che è associata con un arco di tempo. @it
definition: Sasaista laikposmu ar manifestāciju, kas ir saistīta ar laikposmu. @lv
label: ar laikposmu saistītā manifestācija @lv
toolkit label: ar laikposmu saistītā manifestācija @lv
toolkit definition: Manifestācija, kas ir saistīta ar laikposmu. @lv
definition: 将一个时间段与和一个时间段有关的一种载体表现关联起来。 @zh-hans
label: 有时间段的关联载体表现 @zh-hans
toolkit label: 时间段的关联载体表现 @zh-hans
toolkit definition: 和一个时间段有关的一种载体表现 @zh-hans
has subproperty: is date of manifestation of
has subproperty: P70003
definition: Bir zaman aralığını, zaman aralığı ile bağlantılı olan bir gösterimle ilişkilendirir. @tr
label: zaman aralığının ilgili gösterimi ile ilişkilidir @tr
toolkit label: zaman aralığının ilişkili gösterimi @tr
toolkit definition: Bir zaman aralığıyla bağlantılı olan bir gösterim. @tr

has related nomen of timespan
status: Published
type: Property
lexical alias: relatedNomenOfTimespan.en
definition: Relates a timespan to a nomen that is associated with a timespan.
domain: C10010
sub property of: has related RDA entity of timespan
toolkit label: related nomen of timespan
toolkit definition: A nomen that is associated with a timespan.
has element type: 1
sub property of: P00013
label: ajanjaksoon liittyvä nomen @fi
definition: Liittää ajanjakson nomeniin, joka liittyy ajanjaksoon. @fi
toolkit label: ajanjaksoon liittyvä nomen @fi
toolkit definition: Nomen, joka liittyy ajanjaksoon. @fi
label: har nomen relatert til tidsrom @no
definition: Relaterer et tidsrom til et nomen som forbindes med et tidsrom. @no
toolkit label: nomen relatert til tidsrom @no
toolkit definition: Et nomen som forbindes med et tidsrom. @no
label: a pour nomen en relation avec un laps de temps @fr
definition: Met un laps de temps en relation avec un nomen qui est associé à un laps de temps. @fr
toolkit label: nomen en relation avec un laps de temps @fr
toolkit definition: Nomen qui est associé à un laps de temps. @fr
label: heeft gerelateerde nomen van tijdspanne @nl
definition: Relateert een tijdspanne aan een nomen dat geassocieerd is met een tijdspanne. @nl
toolkit label: gerelateerde nomen van tijdspanne @nl
toolkit definition: Een nomen dat geassocieerd is met een tijdspanne. @nl
label: لها تسمية مرتبطة بفترة زمنية @ar
definition: تربط بين فترة زمنية وتسمية مرتبطة بفترة زمنية. @ar
toolkit label: تسمية مرتبطة بفترة زمنية @ar
toolkit definition: تسمية مرتبطة بفترة زمنية. @ar
label: té com a nomen relacionat amb un interval de temps @ca
definition: Relaciona un interval de temps amb un nomen que s’associa amb un interval de temps. @ca
toolkit label: nomen relacionat amb un interval de temps @ca
toolkit definition: Nomen que s’associa amb un interval de temps. @ca
label: har nomen relateret til tidsperiode @da
definition: Relaterer en tidsperiode til et nomen, som er knyttet til en tidsperiode. @da
toolkit label: nomen relateret til tidsperiode @da
toolkit definition: Nomen, som er knyttet til en tidsperiode. @da
label: ajavahemikuga seotud nomen @et
definition: Seostab ajavahemiku ajavahemikuga seotud nomen'iga. @et
toolkit label: ajavahemikuga seotud nomen @et
toolkit definition: Ajavahemikuga seotud nomen. @et
label: hat mit Zeitraum in Beziehung stehendes Nomen @de
definition: Setzt einen Zeitraum in Beziehung zu einem Nomen, das mit einem Zeitraum in Verbindung steht. @de
toolkit label: mit Zeitraum in Beziehung stehendes Nomen @de
toolkit definition: Ein Nomen, das mit einem Zeitraum in Verbindung steht. @de
label: időtartam kapcsolódó nomenje a következő: @hu
definition: Hozzákapcsol egy időtartamot egy nomenhez, amelyet egy időtartamhoz társítanak. @hu
toolkit label: időtartam kapcsolódó nomenje: @hu
toolkit definition: Egy nomen, amelyet egy időtartamhoz társítanak. @hu
label: ha come nomen correlato di arco di tempo @it
definition: Correla un arco di tempo a un nomen che è associato con un arco di tempo. @it
toolkit label: nomen correlato di arco di tempo @it
toolkit definition: Nomen che è associato con un arco di tempo. @it
definition: Sasaista laikposmu ar nomenu, kas saistīts ar laikposmu. @lv
label: ar laikposmu saistītais nomens @lv
toolkit label: ar laikposmu saistītais nomens @lv
toolkit definition: Nomens, kas saistīts ar laikposmu. @lv
definition: 将一个时间段与和一个时间段有关的一个命名关联起来。 @zh-hans
label: 有时间段的关联命名 @zh-hans
toolkit label: 时间段的关联命名 @zh-hans
toolkit definition: 和一个时间段有关的一个命名 @zh-hans
has subproperty: has appellation of timespan
has subproperty: is date of usage of
has subproperty: P70009
definition: Bir zaman aralığını, zaman aralığıyla bağlantılı olan bir isimle ilişkilendirir. @tr
label: zaman aralığının ilgili ismi ile ilişkilidir @tr
toolkit label: zaman aralığının ilşkili ismi @tr
toolkit definition: Bir zaman aralığıyla bağlantılı olan bir isim. @tr

has related person of timespan
status: Published
type: Property
lexical alias: relatedPersonOfTimespan.en
definition: Relates a timespan to a person who is associated with a timespan.
domain: C10010
sub property of: has related agent of timespan
toolkit label: related person of timespan
toolkit definition: A person who is associated with a timespan.
has element type: 1
sub property of: P00007
alternative label: date associated with person of
label: ajanjaksoon liittyvä henkilö @fi
definition: Liittää ajanjakson henkilöön, joka liittyy ajanjaksoon. @fi
toolkit label: ajanjaksoon liittyvä henkilö @fi
toolkit definition: Henkilö, joka liittyy ajanjaksoon. @fi
label: har person relatert til tidsrom @no
definition: Relaterer et tidsrom til en person som forbindes med et tidsrom. @no
alternative label: dato som forbindes med person for @no
toolkit label: person relatert til tidsrom @no
toolkit definition: En person som forbindes med et tidsrom. @no
label: a pour personne en relation avec un laps de temps @fr
definition: Met un laps de temps en relation avec une personne qui est associée à un laps de temps. @fr
alternative label: date associée à une personne de @fr
toolkit label: personne en relation avec un laps de temps @fr
toolkit definition: Personne qui est associée à un laps de temps. @fr
label: heeft gerelateerde persoon van tijdspanne @nl
definition: Relateert een tijdspanne aan een persoon die geassocieerd is met een tijdspanne. @nl
toolkit label: gerelateerde persoon van tijdspanne @nl
toolkit definition: Een persoon die geassocieerd is met een tijdspanne. @nl
label: لها شخص مرتبط بفترة زمنية @ar
definition: تربط بين فترة زمنية وشخص مرتبط بفترة زمنية. @ar
alternative label: تاريخ مرتبط بشخص لـ @ar
toolkit label: شخص مرتبط بفترة زمنية @ar
toolkit definition: شخص مرتبط بفترة زمنية. @ar
label: té com a persona relacionada amb un interval de temps @ca
definition: Relaciona un interval de temps amb una persona que s’associa amb un interval de temps. @ca
alternative label: data associada amb una persona de @ca
toolkit label: persona relacionada amb un interval de temps @ca
toolkit definition: Persona que s’associa amb un interval de temps. @ca
label: har person relateret til tidsperiode @da
definition: Relaterer en tidsperiode til en person, som er knyttet til en tidsperiode. @da
alternative label: dato, som er knyttet til person af @da
toolkit label: person relateret til tidsperiode @da
toolkit definition: Person, som er knyttet til en tidsperiode. @da
label: ajavahemikuga seotud isik @et
definition: Seostab ajavahemiku ajavahemikuga seotud isikuga. @et
alternative label: daatumiga seotud isik @et
toolkit label: ajavahemikuga seotud isik @et
toolkit definition: Ajavahemikuga seotud isik. @et
label: hat mit Zeitraum in Beziehung stehende Person @de
definition: Setzt einen Zeitraum in Beziehung zu einer Person, die mit einem Zeitraum in Verbindung steht. @de
toolkit label: mit Zeitraum in Beziehung stehende Person @de
toolkit definition: Eine Person, die mit einem Zeitraum in Verbindung steht. @de
label: időtartam kapcsolódó személye a következő: @hu
definition: Hozzákapcsol egy időtartamot egy személyhez, amelyet egy időtartamhoz társítanak. @hu
toolkit label: időtartamra vonatkozó személy @hu
toolkit definition: Egy személy, amelyet egy időtartamhoz társítanak. @hu
label: ha come persona correlata di arco di tempo @it
definition: Correla un arco di tempo a una persona che è associata con un arco di tempo. @it
alternative label: date associate con persona di @it
toolkit label: persona correlata di arco di tempo @it
toolkit definition: Persona che è associata con un arco di tempo. @it
definition: Sasaista laikposmu ar personu, kura saistīta ar laikposmu. @lv
label: ar laikposmu saistītā persona @lv
toolkit label: ar laikposmu saistītā persona @lv
toolkit definition: Persona, kura saistīta ar laikposmu. @lv
alternative label: ajankohtaan liittyvä henkilö @fi
alternative label: Datum, das mit einer Person in Verbindung steht von @de
alternative label: 和……的个人有关的日期 @zh-hans
definition: 将一个时间段与和一个时间段有关的一个个人关联起来。 @zh-hans
label: 有时间段的关联个人 @zh-hans
toolkit label: 时间段的关联个人 @zh-hans
toolkit definition: 和一个时间段有关的一个个人 @zh-hans
has subproperty: is date associated with person of (Deprecated)
has subproperty: is date of birth of
has subproperty: is date of death of
has subproperty: is period of activity of person of
has subproperty: P70011
alternative label: a következő személyhez kapcsolódó időpont: @hu

has related place of timespan
status: Published
type: Property
lexical alias: relatedPlaceOfTimespan.en
definition: Relates a timespan to a place that is associated with a timespan.
domain: C10010
sub property of: has related RDA entity of timespan
toolkit label: related place of timespan
toolkit definition: A place that is associated with a timespan.
has element type: 1
sub property of: P00010
label: ajanjaksoon liittyvä paikka @fi
definition: Liittää ajanjakson paikkaan, joka liittyy ajanjaksoon. @fi
toolkit label: ajanjaksoon liittyvä paikka @fi
toolkit definition: Paikka, joka liittyy ajanjaksoon. @fi
label: har sted relatert til tidsrom @no
definition: Relaterer et tidsrom til et sted som forbindes med et tidsrom. @no
toolkit label: sted relatert til tidsrom @no
toolkit definition: Et sted som forbindes med et tidsrom. @no
label: a pour lieu en relation avec un laps de temps @fr
definition: Met un laps de temps en relation avec un lieu qui est associé à un laps de temps. @fr
toolkit label: lieu en relation avec un laps de temps @fr
toolkit definition: Lieu qui est associé à un laps de temps. @fr
label: heeft gerelateerde plaats van tijdspanne @nl
definition: Relateert een tijdspanne aan een plaats die geassocieerd is met een tijdspanne. @nl
toolkit label: gerelateerde plaats van tijdspanne @nl
toolkit definition: Een plaats die geassocieerd is met een tijdspanne. @nl
label: لها مكان مرتبط بفترة زمنية @ar
definition: تربط بين فترة زمنية ومكان مرتبط بفترة زمنية. @ar
toolkit label: مكان مرتبط بفترة زمنية @ar
toolkit definition: مكان مرتبط بفترة زمنية. @ar
label: té com a lloc relacionat amb un interval de temps @ca
definition: Relaciona un interval de temps amb un lloc que s’associa amb un interval de temps. @ca
toolkit label: lloc relacionat amb un interval de temps @ca
toolkit definition: Lloc que s’associa amb un interval de temps. @ca
label: har sted relateret til tidsperiode @da
definition: Relaterer en tidsperiode til et sted, som er knyttet til en tidsperiode. @da
toolkit label: sted relateret til tidsperiode @da
toolkit definition: Sted, som er knyttet til en tidsperiode. @da
label: ajavahemikuga seotud koht @et
definition: Seostab ajavahemiku ajavahemikuga seotud kohaga. @et
toolkit label: ajavahemikuga seotud koht @et
toolkit definition: Ajavahemikuga seotud koht. @et
label: hat mit Zeitraum in Beziehung stehendes Geografikum @de
definition: Setzt einen Zeitraum in Beziehung zu einem Geografikum, das mit einem Zeitraum in Verbindung steht. @de
toolkit label: mit Zeitraum in Beziehung stehendes Geografikum @de
toolkit definition: Ein Geografikum, das mit einem Zeitraum in Verbindung steht. @de
label: időtartam kapcsolódó helye a következő: @hu
definition: Hozákapcsol egy időtartamot egy helyhez, amelyet egy időtartamhoz társítanak. @hu
toolkit label: időtartam kapcsolódó helye: @hu
toolkit definition: Egy hely, amelyet egy időtartamhoz társítanak. @hu
label: ha come luogo correlato di arco di tempo @it
definition: Correla un arco di tempo a un luogo che è associato con un arco di tempo. @it
toolkit label: luogo correlato di arco di tempo @it
toolkit definition: Luogo che è associato con un arco di tempo. @it
definition: Sasaista laikposmu ar vietu, kas saistīta ar laikposmu. @lv
label: ar laikposmu saistītā vieta @lv
toolkit label: ar laikposmu saistītā vieta @lv
toolkit definition: Vieta, kas saistīta ar laikposmu. @lv
definition: 将一个时间段与和一个时间段有关的一个地点关联起来。 @zh-hans
label: 有时间段的关联地点 @zh-hans
toolkit label: 时间段的关联地点 @zh-hans
toolkit definition: 和一个时间段有关的一个地点 @zh-hans
has subproperty: P70007
definition: Bir zaman aralığını, zaman aralığıyla bağlantılı olan bir yerle ilişkilendirir. @tr
label: zaman aralığının ilgili yeri ile ilişkilidir @tr
toolkit label: zaman aralığıyla ilişkili yer @tr
toolkit definition: Bir zaman aralığıyla bağlantılı olan bir yer. @tr

has related RDA entity of timespan
status: Published
type: Property
lexical alias: relatedRDAEntityOfTimespan.en
definition: Relates a timespan to an RDA entity that is associated with a timespan.
domain: C10010
toolkit label: related RDA entity of timespan
toolkit definition: An RDA entity that is associated with a timespan.
has element type: 1
sub property of: has related entity of timespan
sub property of: P00001
label: ajanjaksoon liittyvä RDA-entiteetti @fi
definition: Liittää ajanjakson RDA-entiteettiin, joka liittyy ajanjaksoon. @fi
toolkit label: ajanjaksoon liittyvä RDA-entiteetti @fi
toolkit definition: RDA-entiteetti, joka liittyy ajanjaksoon. @fi
label: har RDA-entitet relatert til tidsrom @no
definition: Relaterer et tidsrom til en RDA-entitet som forbindes med et tidsrom. @no
toolkit label: RDA-entitet relatert til tidsrom @no
toolkit definition: En RDA-entitet som forbindes med et tidsrom. @no
label: a pour entité RDA en relation avec un laps de temps @fr
definition: Met un laps de temps en relation avec une entité RDA qui est associée à un laps de temps. @fr
toolkit label: entité RDA en relation avec un laps de temps @fr
toolkit definition: Entité RDA qui est associée à un laps de temps. @fr
label: heeft gerelateerde RDA-entiteit van tijdspanne @nl
definition: Relateert een tijdspanne aan een RDA-entiteit die geassocieerd is met een tijdspanne. @nl
toolkit label: gerelateerde RDA-entiteit van tijdspanne @nl
toolkit definition: Een RDA-entiteit die geassocieerd is met een tijdspanne. @nl
label: لها كيان "وام" مرتبط بفترة زمنية @ar
definition: تربط بين فترة زمنية وكيان "وام" مرتبط بفترة زمنية. @ar
toolkit label: كيان "وام" مرتبط بفترة زمنية @ar
toolkit definition: كيان "وام" مرتبط بفترة زمنية. @ar
label: té com a entitat RDA relacionada amb un interval de temps @ca
definition: Relaciona un interval de temps amb una entitat RDA que s’associa amb un interval de temps. @ca
toolkit label: entitat RDA relacionada amb un interval de temps @ca
toolkit definition: Entitat RDA que s’associa amb un interval de temps. @ca
label: har RDA-entitet relateret til tidsperiode @da
definition: Relaterer en tidsperiode til en RDA-entitet, som er knyttet til en tidsperiode. @da
toolkit label: RDA-entitet relateret til tidsperiode @da
toolkit definition: RDA-entitet, som er knyttet til en tidsperiode. @da
label: ajavahemikuga seotud RDA olem @et
definition: Seostab ajavahemiku ajavahemikuga seotud RDA olemiga. @et
toolkit label: ajavahemikuga seotud RDA olem @et
toolkit definition: Ajavahemikuga seotud RDA olem. @et
label: hat mit Zeitraum in Beziehung stehende RDA-Entität @de
definition: Setzt einen Zeitraum in Beziehung zu einer RDA-Entität, die mit einem Zeitraum in Verbindung steht. @de
toolkit label: mit Zeitraum in Beziehung stehende RDA-Entität @de
toolkit definition: Eine RDA-Entität, die mit einem Zeitraum in Verbindung steht. @de
label: időtartam kapcsolódó RDA-entitása a következő: @hu
definition: Hozzákapcsol egy időtartamot egy RDA-entitáshoz, amelyet egy időtartamhoz társítanak. @hu
toolkit label: időtartam kapcsolódó RDA-entitása a következő: @hu
toolkit definition: Egy RDA-entitás, amelyet egy időtartamhoz társítanak. @hu
label: ha come entità di RDA correlata di arco di tempo @it
definition: Correla un arco di tempo a un'entità RDA che è associata con un arco di tempo. @it
toolkit label: entità di RDA correlata di arco di tempo @it
toolkit definition: Entità RDA che è associata con un arco di tempo. @it
definition: Sasaista laikposmu ar RDA entīti, kas saistīta ar laikposmu. @lv
label: ar laikposmu saistītā RDA entīte @lv
toolkit label: ar laikposmu saistītā RDA entīte @lv
toolkit definition: RDA entīte, kas saistīta ar laikposmu. @lv
definition: 将一个时间段与和一个时间段有关的一个RDA实体关联起来。 @zh-hans
label: 有时间段的关联RDA实体 @zh-hans
toolkit label: 时间段的关联RDA实体 @zh-hans
toolkit definition: 和一个时间段有关的一个RDA实体 @zh-hans
has subproperty: has related agent of timespan
has subproperty: has related expression of timespan
has subproperty: has related item of timespan
has subproperty: has related manifestation of timespan
has subproperty: has related nomen of timespan
has subproperty: has related place of timespan
has subproperty: has related timespan of timespan
has subproperty: has related work of timespan
has subproperty: P70010
definition: Bir zaman aralığını, zaman aralığıyla bağlantılı olan bir RDA varlığıyla ilişkilendirir. @tr
label: zaman aralığının ilgili RDA varlığı ile ilişkilidir @tr
toolkit label: zaman aralığının RDA varlığıyla ilişkisi @tr
toolkit definition: Bir zaman aralığıyla bağlantılı olan bir RDA varlığı. @tr

has related timespan of timespan
status: Published
type: Property
lexical alias: relatedTimespanOfTimespan.en
definition: Relates a timespan to a timespan that is associated with a timespan.
domain: C10010
sub property of: has related RDA entity of timespan
toolkit label: related timespan of timespan
toolkit definition: A timespan that is associated with a timespan.
has element type: 1
sub property of: P00011
label: ajanjaksoon liittyvä ajanjakso @fi
definition: Liittää ajanjakson ajanjaksoon, joka liittyy ajanjaksoon. @fi
toolkit label: ajanjaksoon liittyvä ajanjakso @fi
toolkit definition: Ajanjakso, joka liittyy ajanjaksoon. @fi
label: har tidsrom relatert til tidsrom @no
definition: Relaterer et tidsrom til et tidsrom som forbindes med et tidsrom. @no
toolkit label: tidsrom relatert til tidsrom @no
toolkit definition: Et tidsrom som forbindes med et tidsrom. @no
label: a pour laps de temps en relation avec un laps de temps @fr
definition: Met un laps de temps en relation avec un laps de temps qui est associé à un laps de temps. @fr
toolkit label: laps de temps en relation avec un laps de temps @fr
toolkit definition: Laps de temps qui est associé à un laps de temps. @fr
label: heeft gerelateerde tijdspanne van tijdspanne @nl
definition: Relateert een tijdspanne aan een tijdspanne die geassocieerd is met een tijdspanne. @nl
toolkit label: gerelateerde tijdspanne van tijdspanne @nl
toolkit definition: Een tijdspanne die geassocieerd is met een tijdspanne. @nl
label: لها فترة زمنية مرتبطة بفترة زمنية @ar
definition: تربط بين فترة زمنية وفترة زمنية مرتبطة بفترة زمنية. @ar
toolkit label: فترة زمنية مرتبطة بفترة زمنية @ar
toolkit definition: فترة زمنية مرتبطة بفترة زمنية. @ar
label: té com a interval de temps relacionat amb un interval de temps @ca
definition: Relaciona un interval de temps amb un interval de temps que s’associa amb un interval de temps. @ca
toolkit label: interval de temps relacionat amb un interval de temps @ca
toolkit definition: Interval de temps que s’associa amb un interval de temps. @ca
label: har tidsperiode relateret til tidsperiode @da
definition: Relaterer en tidsperiode til en tidsperiode, som er knyttet til en tidsperiode. @da
toolkit label: tidsperiode relateret til tidsperiode @da
toolkit definition: Tidsperiode, som er knyttet til en tidsperiode. @da
label: ajavahemikuga seotud ajavahemik @et
definition: Seostab ajavahemiku ajavahemikuga seotud ajavahemikuga. @et
toolkit label: ajavahemikuga seotud ajavahemik @et
toolkit definition: Ajavahemikuga seotud ajavahemik. @et
label: hat mit Zeitraum in Beziehung stehenden Zeitraum @de
definition: Setzt einen Zeitraum in Beziehung mit einem Zeitraum, der mit einem Zeitraum in Verbindung steht. @de
toolkit label: mit Zeitraum in Beziehung stehender Zeitraum @de
toolkit definition: Ein Zeitraum, der mit einem Zeitraum in Verbindung steht. @de
label: időtartam kapcsolódó időtartama a következő: @hu
definition: Hozzákapcsol egy időtartamot egy időtartamhoz, amelyet egy időtartamhoz társítanak. @hu
toolkit label: időtartam kapcsolódó időtartama: @hu
toolkit definition: Egy időtartam, amelyet egy időtartamhoz társítanak. @hu
label: ha come arco di tempo correlato di arco di tempo @it
definition: Correla un arco di tempo a un arco di tempo che è associato con un arco di tempo. @it
toolkit label: arco di tempo correlato di arco di tempo @it
toolkit definition: Arco di tempo che è associato con un arco di tempo. @it
definition: Sasaista laikposmu ar laikposmu, kas saistīts ar laikposmu. @lv
label: ar laikposmu saistītais laikposms @lv
toolkit label: ar laikposmu saistītais laikposms @lv
toolkit definition: Laikposms, kas saistīts ar laikposmu. @lv
definition: 将一个时间段与和一个时间段有关的一个时间段关联起来。 @zh-hans
label: 有时间段的关联时间段 @zh-hans
toolkit label: 时间段的关联时间段 @zh-hans
toolkit definition: 和一个时间段有关的一个时间段 @zh-hans
has subproperty: is part of timespan
has subproperty: has part timespan
has subproperty: P70008
definition: Bir zaman aralığını, zaman aralığıyla bağlantılı olan bir zaman aralığıyla ilişkilendirir. @tr
label: zaman aralığının ilgili zaman aralığı ile ilişkilidir @tr
toolkit label: zaman aralığının zaman aralığıyla ilişkisi @tr
toolkit definition: Bir zaman aralığıyla bağlantılı olan bir zaman aralığı. @tr

has related work of timespan
status: Published
type: Property
lexical alias: relatedWorkOfTimespan.en
definition: Relates a timespan to a work that is associated with a timespan.
domain: C10010
sub property of: has related RDA entity of timespan
toolkit label: related work of timespan
toolkit definition: A work that is associated with a timespan.
has element type: 1
sub property of: P00002
label: ajanjaksoon liittyvä teos @fi
definition: Liittää ajanjakson teokseen, joka liittyy ajanjaksoon. @fi
toolkit label: ajanjaksoon liittyvä teos @fi
toolkit definition: Teos, joka liittyy ajanjaksoon. @fi
label: har verk relatert til tidsrom @no
definition: Relaterer et tidsrom til et verk som forbindes med et tidsrom. @no
toolkit label: verk relatert til tidsrom @no
toolkit definition: Et verk som forbindes med et tidsrom. @no
label: a pour œuvre en relation avec un laps de temps @fr
definition: Met un laps de temps en relation avec une œuvre qui est associée à un laps de temps. @fr
toolkit label: œuvre en relation avec un laps de temps @fr
toolkit definition: Œuvre qui est associée à un laps de temps. @fr
label: heeft gerelateerd werk van tijdspanne @nl
definition: Relateert een tijdspanne aan een werk dat geassocieerd is met een tijdspanne. @nl
toolkit label: gerelateerd werk van tijdspanne @nl
toolkit definition: Een werk dat geassocieerd is met een tijdspanne. @nl
label: لها عمل مرتبط بفترة زمنية @ar
definition: تربط بين فترة زمنية وعمل مرتبط بفترة زمنية. @ar
toolkit label: عمل مرتبط بفترة زمنية @ar
toolkit definition: عمل مرتبط بفترة زمنية. @ar
label: té com a obra relacionada amb un interval de temps @ca
definition: Relaciona un interval de temps amb una obra que s’associa amb un interval de temps. @ca
toolkit label: obra relacionada amb un interval de temps @ca
toolkit definition: Obra que s’associa amb un interval de temps. @ca
label: har værk relateret til tidsperiode @da
definition: Relaterer en tidsperiode til et værk, som er knyttet til en tidsperiode. @da
toolkit label: værk relateret til tidsperiode @da
toolkit definition: Værk, som er knyttet til en tidsperiode. @da
label: ajavahemikuga seotud teos @et
definition: Seostab ajavahemiku ajavahemikuga seotud teosega. @et
toolkit label: ajavahemikuga seotud teos @et
toolkit definition: Ajavahemikuga seotud teos. @et
label: hat mit Zeitraum in Beziehung stehendes Werk @de
definition: Setzt einen Zeitraum in Beziehung zu einem Werk, das mit einem Zeitraum in Verbindung steht. @de
toolkit label: mit Zeitraum in Beziehung stehendes Werk @de
toolkit definition: Ein Werk, das mit einem Zeitraum in Verbindung steht. @de
label: időtartam kapcsolódó műve a következő: @hu
definition: Hozzákapcsol egy időtartamot egy műhöz, amelyet egy időtartamhoz társítanak. @hu
toolkit label: időtartamra vonatkozó mű @hu
toolkit definition: Egy mű, amelyet egy időtartamhoz társítanak. @hu
label: ha come opera correlata di arco di tempo @it
definition: Correla un arco di tempo a un'opera che è associata con un arco di tempo. @it
toolkit label: opera correlata di arco di tempo @it
toolkit definition: Opera che è associata con un arco di tempo. @it
definition: Sasaista laikposmu ar darbu, kas saistīts ar laikposmu. @lv
label: ar laikposmu saistītais darbs @lv
toolkit label: ar laikposmu saistītais darbs @lv
toolkit definition: Darbs, kas saistīts ar laikposmu. @lv
definition: 将一个时间段与和一个时间段有关的一种作品关联起来。 @zh-hans
label: 有时间段的关联作品 @zh-hans
toolkit label: 时间段的关联作品 @zh-hans
toolkit definition: 和一个时间段有关的一种作品 @zh-hans
has subproperty: is date of capture of representative expression of
has subproperty: is date of representative expression of
has subproperty: is date of work of
has subproperty: is duration of representative expression of (Deprecated)
has subproperty: is epoch of
has subproperty: is equinox of
has subproperty: is subject timespan of
has subproperty: P70001
definition: Bir zaman aralığını, zaman aralığı ile bağlantılı olan bir eserle ilişkilendirir. @tr
label: zaman aralığının ilgili eseri ile ilişkilidir @tr
toolkit label: zaman aralığıyla ilişkili eser @tr
toolkit definition: Bir zaman aralığı ile bağlantılı olan bir eser. @tr

is subject timespan of
status: Published
type: Property
lexical alias: subjectTimespanOf.en
domain: C10010
definition: Relates a timespan to a work that is about a timespan.
sub property of: has related work of timespan
toolkit label: subject timespan of
toolkit definition: A work that is about a timespan.
has element type: 2
sub property of: P00014
label: ajanjakso aiheena teoksessa @fi
definition: Liittää ajanjakson teokseen, jonka aiheena ajanjakso on. @fi
toolkit label: ajanjakso aiheena teoksessa @fi
toolkit definition: Teos, jonka aiheena ajanjakso on. @fi
label: er tidsrom som emne for @no
definition: Relaterer et tidsrom til et verk som handler om et tidsrom. @no
toolkit label: tidsrom som emne for @no
toolkit definition: Et verk som handler om et tidsrom. @no
label: est un laps de temps sujet de @fr
definition: Met un laps de temps en relation avec une œuvre qui traite d’un laps de temps. @fr
toolkit label: laps de temps sujet de @fr
toolkit definition: Œuvre qui traite d’un laps de temps. @fr
label: is onderwerp-tijdspanne van @nl
definition: Relateert een tijdspanne aan een werk dat over een tijdspanne gaat. @nl
toolkit label: onderwerp-tijdspanne van @nl
toolkit definition: Een werk dat over een tijdspanne gaat. @nl
label: هي موضوع فترة زمنية لـ @ar
definition: تربط بين فترة زمنية وعمل عن فترة زمنية. @ar
toolkit label: فترة زمنية لموضوع لـ @ar
toolkit definition: عمل عن فترة زمنية. @ar
label: és interval de temps de matèria de @ca
definition: Relaciona un interval de temps amb una obra que tracta sobre un interval de temps. @ca
toolkit label: interval de temps de matèria de @ca
toolkit definition: Obra que tracta sobre un interval de temps. @ca
label: er tidsperiode, som er subjekt af @da
definition: Relaterer en tidsperiode til et værk, som handler om en tidsperiode. @da
toolkit label: tidsperiode, som er subjekt af @da
toolkit definition: Værk, som handler om en tidsperiode. @da
label: teema (ajavahemik) teoses @et
definition: Seostab ajavahemiku teosega, mis on ajavahemiku kohta. @et
toolkit label: teema (ajavahemik) teoses @et
toolkit definition: Teos, mis on ajavahemiku kohta. @et
label: ist Zeitraum als Thema von @de
definition: Setzt einen Zeitraum in Beziehung zu einem Werk, das von einem Zeitraum handelt. @de
toolkit label: Zeitraum als Thema von @de
toolkit definition: Ein Werk, das von einem Zeitraum handelt. @de
label: időtartamtémája a következőnek: @hu
definition: Hozzákapcsol egy időtartamot egy műhöz, amelyet egy időtartamhoz társítanak. @hu
toolkit label: időtartamtémája @hu
toolkit definition: Egy mű, amelyet egy időtartamhoz társítanak. @hu
label: è arco di tempo soggetto di @it
definition: Correla un arco di tempo a un'opera che è su un arco di tempo. @it
toolkit label: arco di tempo soggetto di @it
toolkit definition: Opera che è su un arco di tempo. @it
definition: Sasaista laikposmu ar darbu, kura temats ir laikposms. @lv
label: ir temats (laikposms) @lv
toolkit label: ir temats (laikposms) @lv
toolkit definition: Darbs, kura temats ir laikposms. @lv
definition: 将一个时间段与关于一个时间段的一种作品关联起来。 @zh-hans
label: 是……的时间段主题 @zh-hans
toolkit label: ……的时间段主题 @zh-hans
toolkit definition: 关于一个时间段的一种作品 @zh-hans
has subproperty: is timespan described by
has subproperty: P70014
definition: Bir zaman aralığını, zaman aralığıyla hakkındaki bir eserle ilişkilendirir. @tr
label: zaman aralığının konusudur @tr
toolkit label: konu alınan zaman aralığı @tr
toolkit definition: Bir zaman aralığıyla ilgili bir eser. @tr

is timespan described by
status: Published
definition: Relates a timespan to a work that is a description of a timespan.
toolkit label: timespan described by
toolkit definition: A work that is a description of a timespan.
type: Property
domain: C10010
sub property of: is subject timespan of
has element type: 2
label: ajanjaksoa kuvaava teos @fi
definition: Liittää ajanjakson teokseen, joka kuvaa ajanjaksoa. @fi
toolkit label: ajanjaksoa kuvaava teos @fi
toolkit definition: Teos, joka kuvaa ajanjaksoa. @fi
label: er tidsrom beskrevet i @no
definition: Relaterer et tidsrom til et verk som beskriver et tidsrom. @no
toolkit label: tidsrom beskrevet i @no
toolkit definition: Et verk som beskriver et tidsrom. @no
label: est un laps de temps décrit par @fr
definition: Met un laps de temps en relation avec une œuvre qui consiste en une description d’un laps de temps. @fr
toolkit label: laps de temps décrit par @fr
toolkit definition: Œuvre qui consiste en une description d’un laps de temps. @fr
label: is tijdspanne beschreven in @nl
definition: Relateert een tijdspanne aan een werk dat een tijdspanne beschrijft. @nl
toolkit label: tijdspanne beschreven in @nl
toolkit definition: Een werk dat een tijdspanne beschrijft. @nl
label: هي فترة زمنية موصوفة في @ar
definition: تربط بين فترة زمنية وعمل يصف فترة زمنية. @ar
toolkit label: فترة زمنية موصوفة في @ar
toolkit definition: عمل يصف فترة زمنية. @ar
label: és interval de temps descrit per @ca
definition: Relaciona un interval de temps amb una obra que és una descripció d’un interval de temps. @ca
toolkit label: interval de temps descrit per @ca
toolkit definition: Obra que és una descripció d’un interval de temps. @ca
label: er tidsperiode beskrevet i @da
definition: Relaterer en tidsperiode til et værk, som beskriver en tidsperiode. @da
toolkit label: tidsperiode beskrevet i @da
toolkit definition: Værk, som beskriver en tidsperiode. @da
label: ajavahemiku kirjeldus @et
definition: Seostab ajavahemiku teosega, milles kirjeldatakse ajavahemikku. @et
toolkit label: ajavahemiku kirjeldus @et
toolkit definition: Teos, milles kirjeldatakse ajavahemikku. @et
label: ist Zeitraum beschrieben in @de
definition: Setzt einen Zeitraum in Beziehung zu einem Werk, das einen Zeitraum beschreibt. @de
toolkit label: Zeitraum beschrieben in @de
toolkit definition: Ein Werk, das einen Zeitraum beschreibt. @de
label: időtartam leírva a következőben: @hu
definition: Hozzákapcsol egy időtartamot egy műhöz, amely egy időtartamot ír le. @hu
toolkit label: időtartam leírva a következőben: @hu
toolkit definition: Egy mű, amely egy időtartamot ír le. @hu
label: è arco di tempo descritto in @it
definition: Correla un arco di tempo a un'opera che descrive un arco di tempo. @it
toolkit label: arco di tempo descritto in @it
toolkit definition: Opera che descrive un arco di tempo. @it
alternative label: timespan described in
lexical alias: timespanDescribedBy.en
label: ir laikposms aprakstīts darbā @lv
definition: Sasaista laikposmu ar darbu, kurā aprakstīts konkrētais laikposms. @lv
toolkit label: laikposms aprakstīts darbā @lv
toolkit definition: Darbs, kurā aprakstīts konkrētais laikposms. @lv
alternative label: ajanjaksoa kuvattu teoksessa @fi
alternative label: 被描述于……的时间段 @zh-hans
label: 是被……描述的时间段 @zh-hans
definition: 将一个时间段与作为一个时间段之描述的一种作品关联起来。 @zh-hans
toolkit label: 被……描述的时间段 @zh-hans
toolkit definition: 作为一个时间段之描述的一种作品 @zh-hans
has subproperty: is timespan described with metadata by
has subproperty: P70060
alternative label: interval de temps descrit en @ca
alternative label: laps de temps décrit dans @fr
alternative label: tanımlanan zaman aralığı @tr
label: tarafından tanımlanan zaman aralığıdır. @tr
definition: Bir zaman aralığını, bir zaman aralığının açıklaması olan bir eserle ilişkilendirir. @tr
toolkit label: tarafından tanımlanan zaman aralığı @tr
toolkit definition: Bir zaman aralığının tanımı olan bir eser @tr

has variant access point for timespan
status: Published
type: Property
lexical alias: variantAccessPointForTimespan.en
domain: C10010
toolkit label: variant access point for timespan
sub property of: has access point for timespan
definition: Relates a timespan to a nomen that is an access point for timespan that is not selected for preference in a specific vocabulary encoding scheme.
toolkit definition: A nomen that is an access point for timespan that is not selected for preference in a specific vocabulary encoding scheme.
has element type: 3
sub property of: P00022
label: ajanjakson varianttihakutieto @fi
definition: Liittää ajanjakson nomeniin, joka on ajanjakson varianttihakutieto, jota ei ole valittu ensisijaiseksi tietyssä sanaston merkintäjärjestelmässä. @fi
toolkit label: ajanjakson varianttihakutieto @fi
toolkit definition: Nomen, joka on ajanjakson varianttihakutieto, jota ei ole valittu ensisijaiseksi tietyssä sanaston merkintäjärjestelmässä. @fi
label: har alternativ søkeinngang for tidsrom @no
definition: Relaterer et tidsrom til en søkeinngang for tidsrom som ikke er valgt som preferanse i et bestemt kodeskjema for vokabular. @no
toolkit label: alternativ søkeinngang for tidsrom @no
toolkit definition: En søkeinngang for tidsrom som ikke er valgt som preferanse i et bestemt kodeskjema for vokabular. @no
label: a pour variante de point d’accès d’un laps de temps @fr
definition: Met un laps de temps en relation avec un nomen qui est un point d’accès d’un laps de temps ne faisant pas l’objet d’un choix privilégié dans un schéma d’encodage de vocabulaire spécifique. @fr
toolkit label: variante de point d’accès d’un laps de temps @fr
toolkit definition: Nomen qui est un point d’accès d’un laps de temps ne faisant pas l’objet d’un choix privilégié dans un schéma d’encodage de vocabulaire spécifique. @fr
label: heeft variant ingang voor tijdspanne @nl
definition: Relateert een tijdspanne aan een nomen dat is een ingang voor tijdspanne die niet als voorkeursterm geselecteerd is in een specifiek vocabulair coderingssysteem. @nl
toolkit label: variant ingang voor tijdspanne @nl
toolkit definition: Een nomen dat is een ingang voor tijdspanne die niet als voorkeursterm geselecteerd is in een specifiek vocabulair coderingssysteem. @nl
label: لها نقطة وصول مختلفة لفترة زمنية @ar
definition: تربط بين فترة زمنية وتسمية عبارة عن نقطة وصول لفترة زمنية لم يتم اختيارها للتفضيل في خطة ترميز مفردات محددة. @ar
toolkit label: نقطة وصول مختلفة لفترة زمنية @ar
toolkit definition: تسمية عبارة عن نقطة وصول لفترة زمنية لم يتم اختيارها للتفضيل في خطة ترميز مفردات محددة. @ar
label: té com a variant de punt d’accés d’interval de temps @ca
definition: Relaciona un interval de temps amb un nomen que és un punt d’accés d’interval de temps que no se selecciona com a preferent en un esquema de codificació de vocabulari específic. @ca
toolkit label: variant de punt d’accés d’interval de temps @ca
toolkit definition: Nomen que és un punt d’accés d’interval de temps que no se selecciona com a preferent en un esquema de codificació de vocabulari específic. @ca
label: har variant af søgeindgang for tidsperiode @da
definition: Relaterer en tidsperiode til en søgeindgang for tidsperiode, som ikke er valgt som præference i et specifikt vokabularkodningsskema. @da
toolkit label: variant af søgeindgang for tidsperiode @da
toolkit definition: Søgeindgang for tidsperiode, som ikke er valgt som præference i et specifikt vokabularkodningsskema. @da
label: ajavahemiku otsielemendi variant @et
definition: Seostab ajavahemiku ajavahemiku otsielemendiga, mis ei ole valitud eelistatuks vastavas leksikaalses märkimissüsteemis. @et
toolkit label: ajavahemiku otsielemendi variant @et
toolkit definition: Ajavahemiku otsielement, mis ei ole valitud eelistatuks vastavas leksikaalses märkimissüsteemis. @et
label: hat zusätzlichen Sucheinstieg für einen Zeitraum @de
definition: Setzt einen Zeitraum in Beziehung zu einem Sucheinstieg für einen Zeitraum, der in einem bestimmten Vocabulary Encoding Scheme nicht als Vorzugsform bestimmt wird. @de
toolkit label: Zusätzlicher Sucheinstieg für einen Zeitraum @de
toolkit definition: Ein Sucheinstieg für einen Zeitraum, der in einem bestimmten Vocabulary Encoding Scheme nicht als Vorzugsform bestimmt wird. @de
label: hozzáférésipont-változat időtartamhoz a következő: @hu
definition: Hozzákapcsol egy időtartamot egy nomenhez, amely egy olyan hozzáférési pont az időtartamhoz, amelyet egy adott szótárkódolási sémában nem részesítenek előnyben. @hu
toolkit label: hozzáférésipont-változat időtartamhoz: @hu
toolkit definition: Egy nomen, amely egy olyan hozzáférési pont az időtartamhoz, amelyet egy adott szótárkódolási sémában nem részesítenek előnyben. @hu
label: ha come punto d'accesso variante per arco di tempo @it
definition: Correla un arco di tempo a un punto di accesso di arco di tempo non selezionato come preferito in una specifica applicazione o contesto. @it
toolkit label: punto d'accesso variante per arco di tempo @it
toolkit definition: Punto di accesso di arco di tempo che non è stato selezionato come preferito in una specifica applicazione o contesto. @it
label: laikposma papildforma @lv
toolkit label: laikposma papildforma @lv
definition: Sasaista laikposmu ar nomenu, kas ir piekļuves punkts laikposmam, kas nav izvēlēts kā prioritārs noteiktai kontrolētas vārdnīcas shēmai. @lv
toolkit definition: Piekļuves punkts laikposmam, kas nav izvēlēts kā prioritārs noteiktai kontrolētas vārdnīcas shēmai. @lv
label: 有时间段的变异检索点 @zh-hans
toolkit label: 时间段的变异检索点 @zh-hans
definition: 将一个时间段与作为一个时间段的检索点、并未在一个特定的词表编码体系中被首选的一个命名关联起来。 @zh-hans
toolkit definition: 作为一个时间段的检索点、并未在一个特定的词表编码体系中被首选的一个命名 @zh-hans
has subproperty: P70048
label: zaman aralığı için alternatif erişim noktası ile ilişkilidir @tr
toolkit label: zaman aralığı için alternatif erişim noktası @tr
definition: Bir zaman aralığını, belirli bir kelime kodlama şemasında tercih için seçilmeyen bir zaman aralığı için erişim noktası olan bir isimle ilişkilendirir. @tr
toolkit definition: Belirli bir kelime kodlama şemasında tercih için seçilmeyen bir zaman aralığının erişim noktası olan bir isim. @tr

has variant name of timespan
status: Published
type: Property
lexical alias: variantNameOfTimespan.en
definition: Relates a timespan to a nomen that is a name of timespan that is not selected for preference in a specific application or context.
domain: C10010
toolkit label: variant name of timespan
toolkit definition: A nomen that is a name of timespan that is not selected for preference in a specific application or context.
sub property of: has name of timespan
has element type: 3
sub property of: P00023
label: ajanjakson varianttinimi @fi
definition: Liittää ajanjakson nomeniin, joka on ajanjakson nimi, jota ei ole valittu ensisijaiseksi tietyssä sovelluksessa tai kontekstissa. @fi
toolkit label: ajanjakson varianttinimi @fi
toolkit definition: Nomen, joka on ajanjakson nimi, jota ei ole valittu ensisijaiseksi tietyssä sovelluksessa tai kontekstissa. @fi
label: har alternativt navn for tidsrom @no
definition: Relaterer et tidsrom til et navn for tidsrom som ikke er valgt som preferasne i en bestemt applikasjon eller kontekst. @no
toolkit label: alternativt navn for tidsrom @no
toolkit definition: Et navn for tidsrom som ikke er valgt som preferasne i en bestemt applikasjon eller kontekst. @no
label: a pour variante de nom de laps de temps @fr
definition: Met un laps de temps en relation avec un nomen qui est un nom de laps de temps ne faisant pas l’objet d’un choix privilégié dans une application ou un contexte spécifiques. @fr
toolkit label: variante de nom de laps de temps @fr
toolkit definition: Nomen qui est un nom de laps de temps ne faisant pas l’objet d’un choix privilégié dans une application ou un contexte spécifiques. @fr
label: heeft variant naam van tijdspanne @nl
definition: Relateert een tijdspanne aan een nomen dat is een naam van tijdspanne die niet als voorkeursterm geselecteerd is in een specifieke toepassing of context. @nl
toolkit label: variant naam van tijdspanne @nl
toolkit definition: Een nomen dat is een naam van tijdspanne die niet als voorkeursterm geselecteerd is in een specifieke toepassing of context. @nl
label: لها اسم مختلف لفترة زمنية @ar
definition: تربط بين فترة زمنية وتسمية عبارة عن اسم فترة زمنية لم يتم اختيارها للتفضيل ضمن تطبيق أو سياق محدد. @ar
toolkit label: اسم مختلف لفترة زمنية @ar
toolkit definition: تسمية عبارة عن اسم فترة زمنية لم يتم اختيارها للتفضيل ضمن تطبيق أو سياق محدد. @ar
label: té com a variant de nom d’interval de temps @ca
definition: Relaciona un interval de temps amb un nomen que és un nom d’interval de temps que no se selecciona com a preferent en una aplicació o un context específic. @ca
toolkit label: variant de nom d’interval de temps @ca
toolkit definition: Nomen que és un nom d’interval de temps que no se selecciona com a preferent en una aplicació o un context específic. @ca
label: har variant af navn på tidsperiode @da
definition: Relaterer en tidsperiode til et navn på tidsperiode, som ikke er valgt som præference i en specifik anvendelse eller kontekst. @da
toolkit label: variant af navn på tidsperiode @da
toolkit definition: Navn på tidsperiode, som ikke er valgt som præference i en specifik anvendelse eller kontekst. @da
label: ajavahemiku variantnimi @et
definition: Seostab ajavahemiku ajavahemiku nimega, mis kindlas rakenduses või kontekstis ei ole valitud eelistatuks. @et
toolkit label: ajavahemiku variantnimi @et
toolkit definition: Ajavahemiku nimi, mis kindlas rakenduses või kontekstis ei ole valitud eelistatuks. @et
label: hat abweichenden Namen eines Zeitraums @de
definition: Setzt einen Zeitraum in Beziehung zu einem Namen eines Zeitraums, der in einer bestimmten Anwendung oder in einem bestimmten Kontext nicht als Vorzugsform bestimmt wird. @de
toolkit label: Abweichender Name eines Zeitraums @de
toolkit definition: Ein Name eines Zeitraums, der in einer bestimmten Anwendung oder in einem bestimmten Kontext nicht als Vorzugsform bestimmt wird. @de
label: időtartam névváltozata a következő: @hu
definition: Hozzákapcsol egy időtartamot egy nomenhez, amely egy időtartamnév, amelyet egy adott alkalmazásban vagy kontextusban nem részesítenek előnyben. @hu
toolkit label: időtartam névváltozata: @hu
toolkit definition: Egy nomen, amely egy időtartamnév, amelyet egy adott alkalmazásban vagy kontextusban nem részesítenek előnyben. @hu
label: ha come nome variante di arco di tempo @it
definition: Correla un arco di tempo a un nome di arco di tempo non selezionato come preferito in una specifica applicazione o contesto. @it
toolkit label: nome variante di arco di tempo @it
toolkit definition: Nome di arco di tempo che non è stato selezionato come preferito in una specifica applicazione o contesto. @it
label: laikposma cits nosaukums @lv
definition: Sasaista laikposmu ar nomenu, kas ir laikposma nosaukums, kas nav izvēlēts kā prioritārs noteiktā lietojumprogrammā vai kontekstā. @lv
toolkit label: laikposma cits nosaukums @lv
toolkit definition: Laikposma nosaukums, kas nav izvēlēts kā prioritārs noteiktā lietojumprogrammā vai kontekstā. @lv
label: 有时间段的变异名称 @zh-hans
definition: 将一个时间段与作为一个时间段的名称并未在一个特定的应用或语境中被首选的一个命名关联起来。 @zh-hans
toolkit label: 时间段的变异名称 @zh-hans
toolkit definition: 作为一个时间段的名称并未在一个特定的应用或语境中被首选的一个命名 @zh-hans
has subproperty: P70050
label: zaman aralığının alternatif ismi ile ilişkilidir @tr
definition: Bir zaman aralığını, belirli bir uygulama veya bağlamda tercih için seçilmeyen bir zaman aralığının ismiyle ilişkilendirir. @tr
toolkit label: zaman aralığının alternatif ismi @tr
toolkit definition: Belirli bir uygulama veya bağlamda tercih için seçilmemiş bir zaman aralığı adı olan bir isim. @tr

is year degree granted of
status: Published
type: Property
lexical alias: yearDegreeGrantedOf.en
domain: C10010
toolkit label: year degree granted of
sub property of: is date of work of
has element type: 2
definition: Relates a timespan to a work that is a thesis associated with an academic degree that is conferred by a granting institution or faculty during a timespan.
toolkit definition: A work that is a thesis associated with an academic degree that is conferred by a granting institution or faculty during a timespan.
label: oppiarvon myöntämisvuosi teokselle @fi
definition: Liittää ajanjakson teokseen, joka on opinnäyte, joka liittyy laitoksen tai tiedekunnan ajanjakson aikana myöntämään akateemiseen oppiarvoon. @fi
toolkit label: oppiarvon myöntämisvuosi teokselle @fi
toolkit definition: Teos, joka on opinnäyte, joka liittyy laitoksen tai tiedekunnan ajanjakson aikana myöntämään akateemiseen oppiarvoon. @fi
label: er årstall for tildeling av grad for @no
definition: Relaterer et tidsrom til et verk som er en akademisk grad tildelt av en tildelende institusjon eller et fakultet i løpet av et tidsrom. @no
toolkit label: årstall for tildeling av grad for @no
toolkit definition: Et verk som er en akademisk grad tildelt av en tildelende institusjon eller et fakultet i løpet av et tidsrom. @no
label: est une année d’obtention de grade universitaire de @fr
definition: Met un laps de temps en relation avec une œuvre qui consiste en une thèse associée à un grade universitaire décerné durant un laps de temps par une institution ou une faculté conférant un grade universitaire. @fr
toolkit label: année d’obtention de grade universitaire de @fr
toolkit definition: Œuvre qui consiste en une thèse associée à un grade universitaire décerné durant un laps de temps par une institution ou une faculté conférant un grade universitaire. @fr
label: is jaar graad toegekend van @nl
definition: Relateert een tijdspanne aan een werk dat is een these geassocieerd met een academische graad die is verleend door een verstrekkende instelling of faculteit gedurende een tijdspanne. @nl
toolkit label: jaar graad toegekend van @nl
toolkit definition: Een werk dat is een these geassocieerd met een academische graad die is verleend door een verstrekkende instelling of faculteit gedurende een tijdspanne. @nl
label: هي عام منح درجة لـ @ar
definition: تربط بين فترة زمنية وعمل عبارة عن درجة أكاديمية منحها معهد أو كلية مانحة خلال فترة زمنية. @ar
toolkit label: عام منح درجة لـ @ar
toolkit definition: عمل عبارة عن درجة أكاديمية منحها معهد أو كلية مانحة خلال فترة زمنية. @ar
label: és any d’obtenció d’un títol acadèmic de @ca
definition: Relaciona un interval de temps amb una obra que és una tesi associada amb un títol acadèmic concedit per una institució o una facultat durant un interval de temps. @ca
toolkit label: any d’obtenció d’un títol acadèmic de @ca
toolkit definition: Obra que és una tesi associada amb un títol acadèmic concedit per una institució o una facultat durant un interval de temps. @ca
label: er årstal for tildeling af grad for @da
definition: Relaterer en tidsperiode til et værk, som er en akademisk grad tildelt i løbet af en tidsperiode af en tildelende institution eller fakultet. @da
toolkit label: årstal for tildeling af grad for @da
toolkit definition: Værk, som er en akademisk grad tildelt i løbet af en tidsperiode af en tildelende institution eller fakultet. @da
label: kraadi kinnitamise aasta teoses @et
definition: Seostab ajavahemiku teosega, mis on kraadi andva asutuse või teaduskonna kinnitatud akadeemilise kraadi aluseks. @et
toolkit label: kraadi kinnitamise aasta teoses @et
toolkit definition: Teos, mis on kraadi andva asutuse või teaduskonna kinnitatud akadeemilise kraadi aluseks. @et
label: ist Jahr, in dem ein akademischer Grad verliehen wird von @de
definition: Setzt einen Zeitraum in Beziehung zu einer Hochschulschrift (Werk), für die in einem Zeitraum ein akademischer Grad von einer Institution oder Fakultät verliehen wird. @de
toolkit label: Jahr, in dem ein akademischer Grad verliehen wird von @de
toolkit definition: Eine Hochschulschrift (Werk), für die in einem Zeitraum ein akademischer Grad von einer Institution oder Fakultät verliehen wird. @de
label: évben fokozatott kapott a következő: @hu
definition: Hozzákapcsol egy időtartamot egy műhöz, amely ahhoz a tudományos fokozathoz kapcsolódik, amelyet egy időtartam alatt egy adományozó intézmény vagy kar adott. @hu
toolkit label: évben fokozatott kapott a következő: @hu
toolkit definition: Egy mű, amely ahhoz a tudományos fokozathoz kapcsolódik, amelyet egy időtartam alatt egy adományozó intézmény vagy kar adott. @hu
label: è anno di titolo accademico di @it
definition: Correla un arco di tempo a un'opera che è un titolo accademico conferito da una istituzione o facoltà abilitata durante un arco di tempo. @it
toolkit label: anno di laurea di @it
toolkit definition: Opera che è un titolo accademico conferito da una istituzione abilitata o facoltà durante un arco di tempo. @it
label: ir grāda piešķiršanas gads @lv
toolkit label: ir grāda piešķiršanas gads @lv
definition: Sasaista laikposmu ar darbu, kas ir zinātniskais/akadēmiskais darbs, par kuru institūcija vai fakultāte laikposmā piešķīrusi grādu. @lv
toolkit definition: Zinātniskais/akadēmiskais darbs, par kuru institūcija vai fakultāte laikposmā piešķīrusi grādu. @lv
label: 是……的学位授予年 @zh-hans
toolkit label: ……的学位授予年 @zh-hans
definition: 将一个时间段与作为一种和在一个时间段内由授予机构或授予院系授予之学位有关的学位论文的一种作品关联起来。 @zh-hans
toolkit definition: 作为一种和在一个时间段内由授予机构或授予院系授予之学位有关的学位论文的一种作品 @zh-hans
has subproperty: P70046
label: derecesinin verildiği yıldır @tr
toolkit label: mezuniyet derecesinin verildiği yıl @tr
definition: Bir zaman aralığını, zaman aralığı boyunca derece veren bir kurum veya fakülte tarafından verilen bir akademik derece ile bağlantılı olan bir tez olan bir eserle ilişkilendirir. @tr
toolkit definition: Bir zaman aralığında enstitü veya fakülte tarafından verilen akademik derece ile bağlantılı bir tez çalıması olan bir çalışma. @tr

Published
type: Concept

Deprecated
type: Concept

is beginning of
status: Published
definition: Relates a timespan to a timespan that starts at the time that is a timespan.
type: Property
domain: C10010
lexical alias: beginningOf.en
has element type: 3
toolkit label: beginning of
toolkit definition: A timespan that starts at the time that is a timespan.
sub property of: is part of timespan
label: alku ajanjaksossa @fi
definition: Liittää ajanjakson ajanjakson ajankohtaan, josta ajanjakso alkaa. @fi
toolkit label: alku ajanjaksossa @fi
toolkit definition: Ajanjakson ajankohta, josta ajanjakso alkaa. @fi
toolkit definition: Een tijdspanne die begint op het tijdstip dat is een tijdspanne. @nl
toolkit label: begin van @nl
label: is begin van @nl
definition: Relateert een tijdspanne aan een tijdspanne die begint op het tijdstip dat is een tijdspanne. @nl
label: ir sākums @lv
definition: Sasaista laikposmu ar laikposmu, kad tas sākas. @lv
toolkit label: sākums @lv
toolkit definition: Laikposms, kad tas sākas. @lv
label: est le début de @fr
definition: Met un laps de temps en relation avec un laps de temps qui commence au moment qui constitue un laps de temps. @fr
toolkit label: début de @fr
toolkit definition: Laps de temps qui commence au moment qui constitue un laps de temps. @fr
label: هي بداية لـ @ar
definition: تربط بين فترة زمنية وفترة زمنية عبارة عن زمن تبدأ فيه فترة زمنية. @ar
toolkit label: بداية لـ @ar
toolkit definition: فترة زمنية عبارة عن زمن تبدأ فيه فترة زمنية. @ar
label: er begyndelse på @da
definition: Relaterer et tidsforløb til et tidsforløb der starter ved det tidspunkt som er et tidsforløb @da
toolkit label: begyndelse på @da
toolkit definition: Tidsforløb der starter ved det tidspunkt som er et tidsforløb @da
label: ist Anfang von @de
definition: Setzt einen Zeitraum in Beziehung zu einem Zeitraum, der zu diesem Zeitpunkt beginnt. Auch dieser wird als Zeitraum bezeichnet. @de
toolkit label: Anfang von @de
toolkit definition: Ein Zeitraum, der zu diesem Zeitpunkt beginnt. Auch dieser wird als Zeitraum bezeichnet. @de
label: és inici de @ca
definition: Relaciona un interval de temps amb un interval de temps que comença en el moment que és un interval de temps. @ca
toolkit label: inici de @ca
toolkit definition: Interval de temps que comença en el moment en que és un interval de temps. @ca
label: 是—…的开始 @zh-hans
definition: 将一个时间段与开始于作为一个时间段的时间的一个时间段关联起来。 @zh-hans
toolkit label: ……的开始 @zh-hans
toolkit definition: 开始于作为一个时间段的时间的一个时间段 @zh-hans
has subproperty: P70061
label: kezdete a következőnek: @hu
definition: Hozzákapcsol egy időtartamot egy időtartamhoz, amely akkor keződik, amikor az egy időtartam. @hu
toolkit label: kezdete: @hu
toolkit definition: Egy időtartam, amelynek a kezdete is időtartam. @hu
label: başlangıcıdır @tr
definition: Bir zaman aralığını, zaman aralığı olan zamanda başlayan bir zaman aralığı ile ilişkilendirir. @tr
toolkit label: başlangıcı @tr
toolkit definition: Bir zaman aralığı olan anda başlayan bir zaman aralığı. @tr

is ending of
status: Published
definition: Relates a timespan to a timespan that finishes at the time that is a timespan.
type: Property
domain: C10010
lexical alias: endingOf.en
has element type: 3
toolkit label: ending of
toolkit definition: A timespan that finishes at the time that is a timespan.
sub property of: is part of timespan
label: loppu ajanjaksossa @fi
definition: Liittää ajanjakson ajanjakson ajankohtaan, johon ajanjakso loppuu. @fi
toolkit label: loppu ajanjaksossa @fi
toolkit definition: Ajanjakson ajankohta, johon ajanjakso loppuu. @fi
toolkit definition: Een tijdspanne die eindigt op het tijdstip dat is een tijdspanne. @nl
toolkit label: einde van @nl
label: is einde van @nl
definition: Relateert een tijdspanne aan een tijdspanne die eindigt op het tijdstip dat is een tijdspanne. @nl
label: ir beigas @lv
definition: Sasaista laikposmu ar laikposmu, kad tas beidzas. @lv
toolkit label: beigas @lv
toolkit definition: Laikposms, kad tas beidzas. @lv
label: est la fin de @fr
definition: Met un laps de temps en relation avec un laps de temps qui se termine au moment qui constitue un laps de temps. @fr
toolkit label: fin de @fr
toolkit definition: Laps de temps qui se termine au moment qui constitue un laps de temps. @fr
label: هي نهاية لـ @ar
definition: تربط بين فترة زمنية وفترة زمنية عبارة عن زمن تنتهي فيه فترة زمنية. @ar
toolkit label: نهاية لـ @ar
toolkit definition: فترة زمنية عبارة عن زمن تنتهي فيه فترة زمنية. @ar
label: er slutning på @da
definition: Relaterer et tidsforløb til et tidsforløb der slutter ved det tidspunkt som er et tidsforløb @da
toolkit label: slutning på @da
toolkit definition: Tidsforløb der slutter ved det tidspunkt som er et tidsforløb @da
label: ist Ende von @de
definition: Setzt einen Zeitraum in Beziehung zu einem Zeitraum, der zu diesem Zeitpunkt endet. Auch dieser wird als Zeitraum bezeichnet. @de
toolkit label: Ende von @de
toolkit definition: Ein Zeitraum, der zu diesem Zeitpunkt endet. Auch dieser wird als Zeitraum bezeichnet. @de
label: és final de @ca
definition: Relaciona un interval de temps amb un interval de temps que finalitza en el moment en que és un interval de temps. @ca
toolkit label: final de @ca
toolkit definition: Interval de temps que finalitza en el moment en que és un interval de temps. @ca
label: 是……的结束 @zh-hans
definition: 将一个时间段与结束于作为一个时间段的时间的一个时间段关联起来。 @zh-hans
toolkit label: ……的结束 @zh-hans
toolkit definition: 结束于作为一个时间段的时间的一个时间段 @zh-hans
has subproperty: P70062
label: vége a következőnek: @hu
definition: Hozzákapcsol egy időtartamot egy időtartamhoz, amely akkor végződik, amikor az egy időtartam. @hu
toolkit label: vége: @hu
toolkit definition: Egy időtartam, amelynek a vége is időtartam. @hu
label: bitişidir @tr
definition: Bir zaman aralığını, zaman aralığı olan zamanda biten bir zaman aralığı ile ilişkilendirir. @tr
toolkit label: son @tr
toolkit definition: Bir zaman aralığı olarak kabul edilen bir zamanda sona eren bir zaman aralığı @tr

is timespan described with metadata by
status: Published
definition: Relates a timespan to a work that is a metadata work for a timespan.
type: Property
domain: C10010
lexical alias: timespanDescribedWithMetadataBy.en
has element type: 2
toolkit label: timespan described with metadata by
toolkit definition: A work that is a metadata work for a timespan.
sub property of: is timespan described by
toolkit definition: Teos, joka on ajanjakson metatietoteos. @fi
toolkit label: ajanjaksoa metatiedoilla kuvaileva teos @fi
definition: Liittää ajanjakson teokseen, joka on ajanjakson metatietoteos. @fi
label: ajanjaksoa metatiedoilla kuvaileva teos @fi
label: 是被……用元数据描述的时间段 @zh-hans
definition: 将一个时间段与作为一个时间段之元数据作品的一种作品关联起来。 @zh-hans
toolkit label: 被……用元数据描述的时间段 @zh-hans
toolkit definition: 作为一个时间段之元数据作品的一种作品 @zh-hans
has subproperty: P70063
label: és interval de temps descrit amb metadades per @ca
definition: Relaciona un interval de temps amb una obra que és una obra de metadades per a un interval de temps. @ca
toolkit label: interval de temps descrit amb metadades per @ca
toolkit definition: Obra que és una obra de metadades per a un interval de temps. @ca
label: est un laps de temps décrit avec des métadonnées par @fr
definition: Met un laps de temps en relation avec une œuvre qui consiste en une œuvre de métadonnées pour un laps de temps. @fr
toolkit label: laps de temps décrit avec des métadonnées par @fr
toolkit definition: Œuvre qui consiste en une œuvre de métadonnées pour un laps de temps. @fr
label: tarafından meta verilerle tanımlanan zaman aralığıdır. @tr
definition: Bir zaman aralığını, bir zaman aralığı için üstveri çalışması olan bir eserle ilişkilendirir. @tr
toolkit label: tarafından üstverilerle tanımlanan zaman aralığı @tr
toolkit definition: Bir zaman aralığı için üstveri çalışması olan bir eser. @tr