Published
type: Concept

Deprecated
type: Concept

Timespan properties
licence: deed.en US
contributor: RSC Technical Working Group
creator: RDA Steering Committee
description: Properties that represent the attribute and relationship elements of the RDA Timespan entity.
description: RDA-elementeistä johdetut ominaisuudet RDA:n ajanjakson määrittelyjoukossa. @fi
issued: 2016-12-18
modified: 2025-06-18
publisher: ALA Digital Reference
rights: Copyright © 2020 American Library Association, Canadian Federation of Library Associations, and CILIP: Chartered Institute of Library and Information Professionals
title: RDA:n ajanjakson ominaisuudet @fi
type: http://rdaregistry.info/termList/RDALinkedDataWork/1003
preferred namespace prefix: rdat
type: Ontology
version info: v5.4.4

has related work of timespan
has element type: 1
toolkit definition: A work that is associated with a timespan.
toolkit definition: Ajavahemikuga seotud teos. @et
toolkit definition: Bir zaman aralığı ile bağlantılı olan bir eser. @tr
toolkit definition: Darbs, kas saistīts ar laikposmu. @lv
toolkit definition: Een werk dat geassocieerd is met een tijdspanne. @nl
toolkit definition: Egy mű, amelyet egy időtartamhoz társítanak. @hu
toolkit definition: Ein Werk, das mit einem Zeitraum in Verbindung steht. @de
toolkit definition: Et verk som forbindes med et tidsrom. @no
toolkit definition: Obra que s’associa amb un interval de temps. @ca
toolkit definition: Opera che è associata con un arco di tempo. @it
toolkit definition: Teos, joka liittyy ajanjaksoon. @fi
toolkit definition: Værk, som er knyttet til en tidsperiode. @da
toolkit definition: Œuvre qui est associée à un laps de temps. @fr
toolkit definition: عمل مرتبط بفترة زمنية. @ar
toolkit definition: 和一个时间段有关的一种作品 @zh-hans
toolkit label: ajanjaksoon liittyvä teos @fi
toolkit label: ajavahemikuga seotud teos @et
toolkit label: ar laikposmu saistītais darbs @lv
toolkit label: gerelateerd werk van tijdspanne @nl
toolkit label: időtartamra vonatkozó mű @hu
toolkit label: mit Zeitraum in Beziehung stehendes Werk @de
toolkit label: obra relacionada amb un interval de temps @ca
toolkit label: opera correlata di arco di tempo @it
toolkit label: related work of timespan
toolkit label: verk relatert til tidsrom @no
toolkit label: værk relateret til tidsperiode @da
toolkit label: zaman aralığıyla ilişkili eser @tr
toolkit label: œuvre en relation avec un laps de temps @fr
toolkit label: عمل مرتبط بفترة زمنية @ar
toolkit label: 时间段的关联作品 @zh-hans
has subproperty: is subject timespan of
has subproperty: is epoch of
has subproperty: is date of work of
has subproperty: is equinox of
has subproperty: is date of capture of representative expression of
has subproperty: is duration of representative expression of (Deprecated)
has subproperty: is date of representative expression of
has subproperty: P70001
lexical alias: relatedWorkOfTimespan.en
status: Published
type: Property
domain: C10010
label: a pour œuvre en relation avec un laps de temps @fr
label: ajanjaksoon liittyvä teos @fi
label: ajavahemikuga seotud teos @et
label: ar laikposmu saistītais darbs @lv
label: ha come opera correlata di arco di tempo @it
label: har verk relatert til tidsrom @no
label: har værk relateret til tidsperiode @da
label: hat mit Zeitraum in Beziehung stehendes Werk @de
label: heeft gerelateerd werk van tijdspanne @nl
label: időtartam kapcsolódó műve a következő: @hu
label: té com a obra relacionada amb un interval de temps @ca
label: zaman aralığının ilgili eseri ile ilişkilidir @tr
label: لها عمل مرتبط بفترة زمنية @ar
label: 有时间段的关联作品 @zh-hans
sub property of: has related RDA entity of timespan
sub property of: P00002
definition: Bir zaman aralığını, zaman aralığı ile bağlantılı olan bir eserle ilişkilendirir. @tr
definition: Correla un arco di tempo a un'opera che è associata con un arco di tempo. @it
definition: Hozzákapcsol egy időtartamot egy műhöz, amelyet egy időtartamhoz társítanak. @hu
definition: Liittää ajanjakson teokseen, joka liittyy ajanjaksoon. @fi
definition: Met un laps de temps en relation avec une œuvre qui est associée à un laps de temps. @fr
definition: Relaciona un interval de temps amb una obra que s’associa amb un interval de temps. @ca
definition: Relateert een tijdspanne aan een werk dat geassocieerd is met een tijdspanne. @nl
definition: Relaterer en tidsperiode til et værk, som er knyttet til en tidsperiode. @da
definition: Relaterer et tidsrom til et verk som forbindes med et tidsrom. @no
definition: Relates a timespan to a work that is associated with a timespan.
definition: Sasaista laikposmu ar darbu, kas saistīts ar laikposmu. @lv
definition: Seostab ajavahemiku ajavahemikuga seotud teosega. @et
definition: Setzt einen Zeitraum in Beziehung zu einem Werk, das mit einem Zeitraum in Verbindung steht. @de
definition: تربط بين فترة زمنية وعمل مرتبط بفترة زمنية. @ar
definition: 将一个时间段与和一个时间段有关的一种作品关联起来。 @zh-hans

has related expression of timespan
has element type: 1
toolkit definition: Ajavahemikuga seotud väljendus. @et
toolkit definition: An expression that is associated with a timespan.
toolkit definition: Bir zaman aralığıyla bağlantılı olan bir anlatım. @tr
toolkit definition: Een expressie die geassocieerd is met een tijdspanne. @nl
toolkit definition: Egy kifejezési forma, amelyet egy időtartamhoz társítanak. @hu
toolkit definition: Eine Expression, die mit einem Zeitraum in Verbindung steht. @de
toolkit definition: Ekspressio, joka liittyy ajanjaksoon. @fi
toolkit definition: Espressione che è associata con un arco di tempo. @it
toolkit definition: Et uttrykk som forbindes med et tidsrom. @no
toolkit definition: Expression qui est associée à un laps de temps. @fr
toolkit definition: Expressió que s’associa amb un interval de temps. @ca
toolkit definition: Izteiksme, kas ir saistīta ar laikposmu. @lv
toolkit definition: Udtryk, som er knyttet til en tidsperiode. @da
toolkit definition: تعبيرة مرتبطة بفترة زمنية. @ar
toolkit definition: 和一个时间段有关的一种内容表达 @zh-hans
toolkit label: ajanjaksoon liittyvä ekspressio @fi
toolkit label: ajavahemikuga seotud väljendus @et
toolkit label: ar laikposmu saistītā izteiksme @lv
toolkit label: espressione correlata di arco di tempo @it
toolkit label: expression en relation avec un laps de temps @fr
toolkit label: expressió relacionada amb un interval de temps @ca
toolkit label: gerelateerde expressie van tijdspanne @nl
toolkit label: időtartamra vonatkozó kifejezési forma @hu
toolkit label: mit Zeitraum in Beziehung stehende Expression @de
toolkit label: related expression of timespan
toolkit label: udtryk relateret til tidsperiode @da
toolkit label: uttrykk relatert til tidsrom @no
toolkit label: zaman aralığının ilişkili anlatımı @tr
toolkit label: تعبيرة مرتبطة بفترة زمنية @ar
toolkit label: 时间段的关联内容表达 @zh-hans
has subproperty: is date of expression of
has subproperty: is duration of (Deprecated)
has subproperty: P70002
lexical alias: relatedExpressionOfTimespan.en
status: Published
type: Property
domain: C10010
label: a pour expression en relation avec un laps de temps @fr
label: ajanjaksoon liittyvä ekspressio @fi
label: ajavahemikuga seotud väljendus @et
label: ar laikposmu saistītā izteiksme @lv
label: ha come espressione correlata di arco di tempo @it
label: har udtryk relateret til tidsperiode @da
label: har uttrykk relatert til tidsrom @no
label: hat mit Zeitraum in Beziehung stehende Expression @de
label: heeft gerelateerde expressie van tijdspanne @nl
label: időtartam kapcsolódó kifejezési formája a következő: @hu
label: té com a expressió relacionada amb un interval de temps @ca
label: zaman aralığının ilgili anlatımı ile ilişkilidir @tr
label: لها تعبيرة مرتبطة بفترة زمنية @ar
label: 有时间段的关联内容表达 @zh-hans
sub property of: has related RDA entity of timespan
sub property of: P00003
definition: Bir zaman aralığını, bir zaman aralığıyla bağlantılı olan bir anlatımla ilişkilendirir. @tr
definition: Correla un arco di tempo a un'espressione che è associata con un arco di tempo. @it
definition: Hozzákapcsol egy időtartamot egy kifejezési formához, amelyet egy időtartamhoz társítanak. @hu
definition: Liittää ajanjakson ekspressioon, joka liittyy ajanjaksoon. @fi
definition: Met un laps de temps en relation avec une expression qui est associée à un laps de temps. @fr
definition: Relaciona un interval de temps amb una expressió que s’associa amb un interval de temps. @ca
definition: Relateert een tijdspanne aan een expressie die geassocieerd is met een tijdspanne. @nl
definition: Relaterer en tidsperiode til et udtryk, som er knyttet til en tidsperiode. @da
definition: Relaterer et tidsrom til et uttrykk som forbindes med et tidsrom. @no
definition: Relates a timespan to an expression that is associated with a timespan.
definition: Sasaista laikposmu ar izteiksmi, kas ir saistīta ar laikposmu. @lv
definition: Seostab ajavahemiku ajavahemikuga seotud väljendusega. @et
definition: Setzt einen Zeitraum in Beziehung zu einer Expression, die mit einem Zeitraum in Verbindung steht. @de
definition: تربط بين فترة زمنية وتعبيرة مرتبطة بفترة زمنية. @ar
definition: 将一个时间段与和一个时间段有关的一种内容表达关联起来。 @zh-hans

has related manifestation of timespan
has element type: 1
toolkit definition: A manifestation that is associated with a timespan.
toolkit definition: Ajavahemikuga seotud kehastus. @et
toolkit definition: Bir zaman aralığıyla bağlantılı olan bir gösterim. @tr
toolkit definition: Een manifestatie die geassocieerd is met een tijdspanne. @nl
toolkit definition: Egy megjelenési forma, amelyet egy időtartamhoz társítanak. @hu
toolkit definition: Eine Manifestation, die mit einem Zeitraum in Verbindung steht. @de
toolkit definition: En manifestasjon som forbindes med et tidsrom. @no
toolkit definition: Manifestaatio, joka liittyy ajanjaksoon. @fi
toolkit definition: Manifestació que s’associa amb un interval de temps. @ca
toolkit definition: Manifestation qui est associée à un laps de temps. @fr
toolkit definition: Manifestation, som er knyttet til en tidsperiode. @da
toolkit definition: Manifestazione che è associata con un arco di tempo. @it
toolkit definition: Manifestācija, kas ir saistīta ar laikposmu. @lv
toolkit definition: تجسيدة مرتبطة بفترة زمنية. @ar
toolkit definition: 和一个时间段有关的一种载体表现 @zh-hans
toolkit label: ajanjaksoon liittyvä manifestaatio @fi
toolkit label: ajavahemikuga seotud kehastus @et
toolkit label: ar laikposmu saistītā manifestācija @lv
toolkit label: gerelateerde manifestatie van tijdspanne @nl
toolkit label: időtartamra vonatkozó megjelenési forma @hu
toolkit label: manifestació relacionada amb un interval de temps @ca
toolkit label: manifestasjon relatert til tidsrom @no
toolkit label: manifestation en relation avec un laps de temps @fr
toolkit label: manifestation relateret til tidsperiode @da
toolkit label: manifestazione correlata di arco di tempo @it
toolkit label: mit Zeitraum in Beziehung stehende Manifestation @de
toolkit label: related manifestation of timespan
toolkit label: zaman aralığının ilişkili gösterimi @tr
toolkit label: تجسيدة مرتبطة بفترة زمنية @ar
toolkit label: 时间段的关联载体表现 @zh-hans
has subproperty: is date of manifestation of
has subproperty: P70003
lexical alias: relatedManifestationOfTimespan.en
status: Published
type: Property
domain: C10010
label: a pour manifestation en relation avec un laps de temps @fr
label: ajanjaksoon liittyvä manifestaatio @fi
label: ajavahemikuga seotud kehastus @et
label: ar laikposmu saistītā manifestācija @lv
label: ha come manifestazione correlata di arco di tempo @it
label: har manifestasjon relatert til tidsrom @no
label: har manifestation relateret til tidsperiode @da
label: hat mit Zeitraum in Beziehung stehende Manifestation @de
label: heeft gerelateerde manifestatie van tijdspanne @nl
label: időtartam kapcsolódó megjelenési formája a következő: @hu
label: té com a manifestació relacionada amb un interval de temps @ca
label: zaman aralığının ilgili gösterimi ile ilişkilidir @tr
label: لها تجسيدة مرتبطة بفترة زمنية @ar
label: 有时间段的关联载体表现 @zh-hans
sub property of: has related RDA entity of timespan
sub property of: P00004
definition: Bir zaman aralığını, zaman aralığı ile bağlantılı olan bir gösterimle ilişkilendirir. @tr
definition: Correla un arco di tempo a una manifestazione che è associata con un arco di tempo. @it
definition: Hozzákapcsol egy időtartamot egy megjelenési formához, amelyet egy időtartamhoz társítanak. @hu
definition: Liittää ajanjakson manifestaatioon, joka liittyy ajanjaksoon. @fi
definition: Met un laps de temps en relation avec une manifestation qui est associée à un laps de temps. @fr
definition: Relaciona un interval de temps amb una manifestació que s’associa amb un interval de temps. @ca
definition: Relateert een tijdspanne aan een manifestatie die geassocieerd is met een tijdspanne. @nl
definition: Relaterer en tidsperiode til en manifestation, som er knyttet til en tidsperiode. @da
definition: Relaterer et tidsrom til en manifestasjon som forbindes med et tidsrom. @no
definition: Relates a timespan to a manifestation that is associated with a timespan.
definition: Sasaista laikposmu ar manifestāciju, kas ir saistīta ar laikposmu. @lv
definition: Seostab ajavahemiku ajavahemikuga seotud kehastusega. @et
definition: Setzt einen Zeitraum in Beziehung zu einer Manifestation, die mit einem Zeitraum in Verbindung steht. @de
definition: تربط بين فترة زمنية وتجسيدة مرتبطة بفترة زمنية. @ar
definition: 将一个时间段与和一个时间段有关的一种载体表现关联起来。 @zh-hans

has related item of timespan
has element type: 1
toolkit definition: Ajavahemikuga seotud eksemplar. @et
toolkit definition: An item that is associated with a timespan.
toolkit definition: Bir zaman aralığıyla bağlantılı olan bir kopya. @tr
toolkit definition: Een item dat geassocieerd is met een tijdspanne. @nl
toolkit definition: Egy példány, amelyet egy időtartamhoz társítanak. @hu
toolkit definition: Ein Exemplar, das mit einem Zeitraum in Verbindung steht. @de
toolkit definition: Eksemplar, som er knyttet til en tidsperiode. @da
toolkit definition: Et eksemplar som forbindes med et tidsrom. @no
toolkit definition: Item che è associato con un arco di tempo. @it
toolkit definition: Item qui est associé à un laps de temps. @fr
toolkit definition: Kappale, joka liittyy ajanjaksoon. @fi
toolkit definition: Vienība, kas ir saistīta ar laikposmu. @lv
toolkit definition: Ítem que s’associa amb un interval de temps. @ca
toolkit definition: مفردة مرتبطة بفترة زمنية. @ar
toolkit definition: 和一个时间段有关的一个单件 @zh-hans
toolkit label: ajanjaksoon liittyvä kappale @fi
toolkit label: ajavahemikuga seotud eksemplar @et
toolkit label: ar laikposmu saistītā vienība @lv
toolkit label: eksemplar relateret til tidsperiode @da
toolkit label: eksemplar relatert til tidsrom @no
toolkit label: gerelateerd item van tijdspanne @nl
toolkit label: időtartamra vonatkozó példány @hu
toolkit label: item correlato di arco di tempo @it
toolkit label: item en relation avec un laps de temps @fr
toolkit label: mit Zeitraum in Beziehung stehendes Exemplar @de
toolkit label: related item of timespan
toolkit label: zaman aralığıyla ilişkili kopya @tr
toolkit label: ítem relacionat amb un interval de temps @ca
toolkit label: مفردة مرتبطة بفترة زمنية @ar
toolkit label: 时间段的关联单件 @zh-hans
has subproperty: P70004
lexical alias: relatedItemOfTimespan.en
status: Published
type: Property
domain: C10010
label: a pour item en relation avec un laps de temps @fr
label: ajanjaksoon liittyvä kappale @fi
label: ajavahemikuga seotud eksemplar @et
label: ar laikposmu saistītā vienība @lv
label: ha come item correlato di arco di tempo @it
label: har eksemplar relateret til tidsperiode @da
label: har eksemplar relatert til tidsrom @no
label: hat mit Zeitraum in Beziehung stehendes Exemplar @de
label: heeft gerelateerd item van tijdspanne @nl
label: időtartam kapcsolódó példánya a következő: @hu
label: té com a ítem relacionat amb un interval de temps @ca
label: zaman aralığının ilgili kopyası ile ilişkilidir @tr
label: لها مفردة مرتبطة بفترة زمنية @ar
label: 有时间段的关联单件 @zh-hans
sub property of: has related RDA entity of timespan
sub property of: P00005
definition: Bir zaman aralığını, zaman aralığıyla bağlantılı olan bir kopya ile ilişkilendirir. @tr
definition: Correla un arco di tempo a un item che è associato con un arco di tempo. @it
definition: Hozzákapcsol egy időtartamot egy példányhoz, amelyet egy időtartamhoz társítanak. @hu
definition: Liittää ajanjakson kappaleeseen, joka liittyy ajanjaksoon. @fi
definition: Met un laps de temps en relation avec un item qui est associé à un laps de temps. @fr
definition: Relaciona un interval de temps amb un ítem que s’associa amb un interval de temps. @ca
definition: Relateert een tijdspanne aan een item dat geassocieerd is met een tijdspanne. @nl
definition: Relaterer en tidsperiode til et eksemplar, som er knyttet til en tidsperiode. @da
definition: Relaterer et tidsrom til et eksemplar som forbindes med et tidsrom. @no
definition: Relates a timespan to an item that is associated with a timespan.
definition: Sasaista laikposmu ar vienību, kas ir saistīta ar laikposmu. @lv
definition: Seostab ajavahemiku ajavahemikuga seotud eksemplariga. @et
definition: Setzt einen Zeitraum in Beziehung zu einem Exemplar, das mit einem Zeitraum in Verbindung steht. @de
definition: تربط بين فترة زمنية ومفردة مرتبطة بفترة زمنية. @ar
definition: 将一个时间段与和一个时间段有关的一个单件关联起来。 @zh-hans

has related agent of timespan
has element type: 1
toolkit definition: Agent que s’associa amb un interval de temps. @ca
toolkit definition: Agent qui est associé à un laps de temps. @fr
toolkit definition: Agent, som er knyttet til en tidsperiode. @da
toolkit definition: Agente che è associato con un arco di tempo. @it
toolkit definition: Ajavahemikuga seotud tegija. @et
toolkit definition: An agent who is associated with a timespan.
toolkit definition: Aģents, kas saistīts ar laikposmu. @lv
toolkit definition: Bir zaman aralığıyla bağlantılı olan bir temsilci. @tr
toolkit definition: Een actor die geassocieerd is met een tijdspanne. @nl
toolkit definition: Egy ágens, amelyet egy időtartamhoz társítanak. @hu
toolkit definition: Ein Akteur, der mit einem Zeitraum in Verbindung steht. @de
toolkit definition: En agent som forbindes med et tidsrom. @no
toolkit definition: Toimija, joka liittyy ajanjaksoon. @fi
toolkit definition: وكيل مرتبط بفترة زمنية. @ar
toolkit definition: 和一个时间段有关的一个行为者 @zh-hans
toolkit label: agent en relation avec un laps de temps @fr
toolkit label: agent relacionat amb un interval de temps @ca
toolkit label: agent relateret til tidsperiode @da
toolkit label: agent relatert til tidsrom @no
toolkit label: agente correlato di arco di tempo @it
toolkit label: ajanjaksoon liittyvä toimija @fi
toolkit label: ajavahemikuga seotud tegija @et
toolkit label: ar laikposmu saistītais aģents @lv
toolkit label: gerelateerde actor van tijdspanne @nl
toolkit label: időtartam kapcsolódó ágense: @hu
toolkit label: mit Zeitraum in Beziehung stehender Akteur @de
toolkit label: related agent of timespan
toolkit label: zaman aralığıyla ilişkili temsilci @tr
toolkit label: وكيل مرتبط بفترة زمنية @ar
toolkit label: 时间段的关联行为者 @zh-hans
has subproperty: has related collective agent of timespan
has subproperty: has related person of timespan
has subproperty: is period of activity of agent of
has subproperty: P70005
lexical alias: relatedAgentOfTimespan.en
status: Published
type: Property
domain: C10010
label: a pour agent en relation avec un laps de temps @fr
label: ajanjaksoon liittyvä toimija @fi
label: ajavahemikuga seotud tegija @et
label: ar laikposmu saistītais aģents @lv
label: ha come agente correlato di arco di tempo @it
label: har agent relateret til tidsperiode @da
label: har agent relatert til tidsrom @no
label: hat mit Zeitraum in Beziehung stehenden Akteur @de
label: heeft gerelateerde actor van tijdspanne @nl
label: időtartam kapcsolódó ágense a következő: @hu
label: té com a agent relacionat amb un interval de temps @ca
label: zaman aralığının ilgili temsilcisi ile ilişkilidir @tr
label: لها وكيل مرتبط بفترة زمنية @ar
label: 有时间段的关联行为者 @zh-hans
sub property of: has related RDA entity of timespan
sub property of: P00006
definition: Bir zaman aralığını, zaman aralığıyla bağlantılı olan bir temsilciyle ilişkilendirir. @tr
definition: Correla un arco di tempo a un agente che è associato con un arco di tempo. @it
definition: Hozzákapcsol egy időtartamot egy ágenshez, amelyet egy időtartamhoz társítanak. @hu
definition: Liittää ajanjakson toimijaan, joka liittyy ajanjaksoon. @fi
definition: Met un laps de temps en relation avec un agent qui est associé à un laps de temps. @fr
definition: Relaciona un interval de temps amb un agent que s’associa amb un interval de temps. @ca
definition: Relateert een tijdspanne aan een actor die geassocieerd is met een tijdspanne. @nl
definition: Relaterer en tidsperiode til en agent, som er knyttet til en tidsperiode. @da
definition: Relaterer et tidsrom til en agent som forbindes med et tidsrom. @no
definition: Relates a timespan to an agent who is associated with a timespan.
definition: Sasaista laikposmu ar aģentu, kas saistīts ar laikposmu. @lv
definition: Seostab ajavahemiku ajavahemikuga seotud tegijaga. @et
definition: Setzt einen Zeitraum in Beziehung zu einem Akteur, der mit einem Zeitraum in Verbindung steht. @de
definition: تربط بين فترة زمنية ووكيل مرتبط بفترة زمنية. @ar
definition: 将一个时间段与和一个时间段有关的一个行为者关联起来。 @zh-hans

has related collective agent of timespan
has element type: 1
toolkit definition: A collective agent who is associated with a timespan.
toolkit definition: Agent collectif qui est associé à un laps de temps. @fr
toolkit definition: Agent col·lectiu que s’associa amb un interval de temps. @ca
toolkit definition: Agente collettivo che è associato con un arco di tempo. @it
toolkit definition: Ajavahemikuga seotud kollektiiv. @et
toolkit definition: Bir zaman aralığıyla ilişkilendirilen bir kollektif temsilci. @tr
toolkit definition: Een collectieve actor die geassocieerd is met een tijdspanne. @nl
toolkit definition: Egy kollektív ágens, amelyet egy időtartamhoz társítanak. @hu
toolkit definition: Ein gemeinschaftlicher Akteur, der mit einem Zeitraum in Verbindung steht. @de
toolkit definition: En kollektiv agent som forbindes med et tidsrom. @no
toolkit definition: Grupa, kas saistīta ar laikposmu. @lv
toolkit definition: Kollektiv agent, som er knyttet til en tidsperiode. @da
toolkit definition: Yhteistoimija, joka liittyy ajanjaksoon. @fi
toolkit definition: وكيل جماعي مرتبط بفترة زمنية. @ar
toolkit definition: 和一个时间段有关的一个集体行为者 @zh-hans
toolkit label: agent collectif en relation avec un laps de temps @fr
toolkit label: agent col·lectiu relacionat amb un interval de temps @ca
toolkit label: agente collettivo correlato di arco di tempo @it
toolkit label: ajanjaksoon liittyvä yhteistoimija @fi
toolkit label: ajavahemikuga seotud kollektiiv @et
toolkit label: ar laikposmu saistītā grupa @lv
toolkit label: gerelateerde collectieve actor van tijdspanne @nl
toolkit label: időtartam kapcsolódó kollektív ágense: @hu
toolkit label: kollektiv agent relateret til tidsperiode @da
toolkit label: kollektiv agent relatert til tidsrom @no
toolkit label: mit Zeitraum in Beziehung stehender gemeinschaftlicher Akteur @de
toolkit label: related collective agent of timespan
toolkit label: zaman aralığının kollektif temsilciyle ilişkisi @tr
toolkit label: وكيل جماعي مرتبط بفترة زمنية @ar
toolkit label: 时间段的关联集体行为者 @zh-hans
has subproperty: has related family of timespan
has subproperty: has related corporate body of timespan
has subproperty: is period of activity of collective agent of
has subproperty: P70006
lexical alias: relatedCollectiveAgentOfTimespan.en
status: Published
type: Property
domain: C10010
label: a pour agent collectif en relation avec un laps de temps @fr
label: ajanjaksoon liittyvä yhteistoimija @fi
label: ajavahemikuga seotud kollektiiv @et
label: ar laikposmu saistītā grupa @lv
label: ha come agente collettivo correlato di arco di tempo @it
label: har kollektiv agent relateret til tidsperiode @da
label: har kollektiv agent relatert til tidsrom @no
label: hat mit Zeitraum in Beziehung stehenden gemeinschaftlichen Akteur @de
label: heeft gerelateerde collectieve actor van tijdspanne @nl
label: időtartam kapcsolódó kollektív ágense a következő: @hu
label: té com a agent col·lectiu relacionat amb un interval de temps @ca
label: zaman aralığının ilgili kolektif temsilcisi ile ilişkilidir @tr
label: لها وكيل جماعي مرتبط بفترة زمنية @ar
label: 有时间段的关联集体行为者 @zh-hans
sub property of: has related agent of timespan
sub property of: P00012
definition: Bir zaman aralığını, zaman aralığıyla ilgili bir kollektif temsilciyle ilişkilendirir. @tr
definition: Correla un arco di tempo a un agente collettivo che è associato con un arco di tempo. @it
definition: Hozzákapcsol egy időtartamot egy kollektív ágenshez, amelyet egy időtartamhoz társítanak. @hu
definition: Liittää ajanjakson yhteistoimijaan, joka liittyy ajanjaksoon. @fi
definition: Met un laps de temps en relation avec un agent collectif qui est associé à un laps de temps. @fr
definition: Relaciona un interval de temps amb un agent col·lectiu que s’associa amb un interval de temps. @ca
definition: Relateert een tijdspanne aan een collectieve actor die geassocieerd is met een tijdspanne. @nl
definition: Relaterer en tidsperiode til en kollektiv agent, som er knyttet til en tidsperiode. @da
definition: Relaterer et tidsrom til en kollektiv agent som forbindes med et tidsrom. @no
definition: Relates a timespan to a collective agent who is associated with a timespan.
definition: Sasaista laikposmu ar grupu, kas saistīta ar laikposmu. @lv
definition: Seostab ajavahemiku ajavahemikuga seotud kollektiiviga. @et
definition: Setzt einen Zeitraum in Beziehung zu einem gemeinschaftlichen Akteur, der mit einem Zeitraum in Verbindung steht. @de
definition: تربط بين فترة زمنية ووكيل جماعي مرتبط بفترة زمنية. @ar
definition: 将一个时间段与和一个时间段有关的一个集体行为者关联起来。 @zh-hans

has related place of timespan
has element type: 1
toolkit definition: A place that is associated with a timespan.
toolkit definition: Ajavahemikuga seotud koht. @et
toolkit definition: Bir zaman aralığıyla bağlantılı olan bir yer. @tr
toolkit definition: Een plaats die geassocieerd is met een tijdspanne. @nl
toolkit definition: Egy hely, amelyet egy időtartamhoz társítanak. @hu
toolkit definition: Ein Geografikum, das mit einem Zeitraum in Verbindung steht. @de
toolkit definition: Et sted som forbindes med et tidsrom. @no
toolkit definition: Lieu qui est associé à un laps de temps. @fr
toolkit definition: Lloc que s’associa amb un interval de temps. @ca
toolkit definition: Luogo che è associato con un arco di tempo. @it
toolkit definition: Paikka, joka liittyy ajanjaksoon. @fi
toolkit definition: Sted, som er knyttet til en tidsperiode. @da
toolkit definition: Vieta, kas saistīta ar laikposmu. @lv
toolkit definition: مكان مرتبط بفترة زمنية. @ar
toolkit definition: 和一个时间段有关的一个地点 @zh-hans
toolkit label: ajanjaksoon liittyvä paikka @fi
toolkit label: ajavahemikuga seotud koht @et
toolkit label: ar laikposmu saistītā vieta @lv
toolkit label: gerelateerde plaats van tijdspanne @nl
toolkit label: időtartam kapcsolódó helye: @hu
toolkit label: lieu en relation avec un laps de temps @fr
toolkit label: lloc relacionat amb un interval de temps @ca
toolkit label: luogo correlato di arco di tempo @it
toolkit label: mit Zeitraum in Beziehung stehendes Geografikum @de
toolkit label: related place of timespan
toolkit label: sted relateret til tidsperiode @da
toolkit label: sted relatert til tidsrom @no
toolkit label: zaman aralığıyla ilişkili yer @tr
toolkit label: مكان مرتبط بفترة زمنية @ar
toolkit label: 时间段的关联地点 @zh-hans
has subproperty: P70007
lexical alias: relatedPlaceOfTimespan.en
status: Published
type: Property
domain: C10010
label: a pour lieu en relation avec un laps de temps @fr
label: ajanjaksoon liittyvä paikka @fi
label: ajavahemikuga seotud koht @et
label: ar laikposmu saistītā vieta @lv
label: ha come luogo correlato di arco di tempo @it
label: har sted relateret til tidsperiode @da
label: har sted relatert til tidsrom @no
label: hat mit Zeitraum in Beziehung stehendes Geografikum @de
label: heeft gerelateerde plaats van tijdspanne @nl
label: időtartam kapcsolódó helye a következő: @hu
label: té com a lloc relacionat amb un interval de temps @ca
label: zaman aralığının ilgili yeri ile ilişkilidir @tr
label: لها مكان مرتبط بفترة زمنية @ar
label: 有时间段的关联地点 @zh-hans
sub property of: has related RDA entity of timespan
sub property of: P00010
definition: Bir zaman aralığını, zaman aralığıyla bağlantılı olan bir yerle ilişkilendirir. @tr
definition: Correla un arco di tempo a un luogo che è associato con un arco di tempo. @it
definition: Hozákapcsol egy időtartamot egy helyhez, amelyet egy időtartamhoz társítanak. @hu
definition: Liittää ajanjakson paikkaan, joka liittyy ajanjaksoon. @fi
definition: Met un laps de temps en relation avec un lieu qui est associé à un laps de temps. @fr
definition: Relaciona un interval de temps amb un lloc que s’associa amb un interval de temps. @ca
definition: Relateert een tijdspanne aan een plaats die geassocieerd is met een tijdspanne. @nl
definition: Relaterer en tidsperiode til et sted, som er knyttet til en tidsperiode. @da
definition: Relaterer et tidsrom til et sted som forbindes med et tidsrom. @no
definition: Relates a timespan to a place that is associated with a timespan.
definition: Sasaista laikposmu ar vietu, kas saistīta ar laikposmu. @lv
definition: Seostab ajavahemiku ajavahemikuga seotud kohaga. @et
definition: Setzt einen Zeitraum in Beziehung zu einem Geografikum, das mit einem Zeitraum in Verbindung steht. @de
definition: تربط بين فترة زمنية ومكان مرتبط بفترة زمنية. @ar
definition: 将一个时间段与和一个时间段有关的一个地点关联起来。 @zh-hans

has related timespan of timespan
has element type: 1
toolkit definition: A timespan that is associated with a timespan.
toolkit definition: Ajanjakso, joka liittyy ajanjaksoon. @fi
toolkit definition: Ajavahemikuga seotud ajavahemik. @et
toolkit definition: Arco di tempo che è associato con un arco di tempo. @it
toolkit definition: Bir zaman aralığıyla bağlantılı olan bir zaman aralığı. @tr
toolkit definition: Een tijdspanne die geassocieerd is met een tijdspanne. @nl
toolkit definition: Egy időtartam, amelyet egy időtartamhoz társítanak. @hu
toolkit definition: Ein Zeitraum, der mit einem Zeitraum in Verbindung steht. @de
toolkit definition: Et tidsrom som forbindes med et tidsrom. @no
toolkit definition: Interval de temps que s’associa amb un interval de temps. @ca
toolkit definition: Laikposms, kas saistīts ar laikposmu. @lv
toolkit definition: Laps de temps qui est associé à un laps de temps. @fr
toolkit definition: Tidsperiode, som er knyttet til en tidsperiode. @da
toolkit definition: فترة زمنية مرتبطة بفترة زمنية. @ar
toolkit definition: 和一个时间段有关的一个时间段 @zh-hans
toolkit label: ajanjaksoon liittyvä ajanjakso @fi
toolkit label: ajavahemikuga seotud ajavahemik @et
toolkit label: ar laikposmu saistītais laikposms @lv
toolkit label: arco di tempo correlato di arco di tempo @it
toolkit label: gerelateerde tijdspanne van tijdspanne @nl
toolkit label: időtartam kapcsolódó időtartama: @hu
toolkit label: interval de temps relacionat amb un interval de temps @ca
toolkit label: laps de temps en relation avec un laps de temps @fr
toolkit label: mit Zeitraum in Beziehung stehender Zeitraum @de
toolkit label: related timespan of timespan
toolkit label: tidsperiode relateret til tidsperiode @da
toolkit label: tidsrom relatert til tidsrom @no
toolkit label: zaman aralığının zaman aralığıyla ilişkisi @tr
toolkit label: فترة زمنية مرتبطة بفترة زمنية @ar
toolkit label: 时间段的关联时间段 @zh-hans
has subproperty: is part of timespan
has subproperty: has part timespan
has subproperty: P70008
lexical alias: relatedTimespanOfTimespan.en
status: Published
type: Property
domain: C10010
label: a pour laps de temps en relation avec un laps de temps @fr
label: ajanjaksoon liittyvä ajanjakso @fi
label: ajavahemikuga seotud ajavahemik @et
label: ar laikposmu saistītais laikposms @lv
label: ha come arco di tempo correlato di arco di tempo @it
label: har tidsperiode relateret til tidsperiode @da
label: har tidsrom relatert til tidsrom @no
label: hat mit Zeitraum in Beziehung stehenden Zeitraum @de
label: heeft gerelateerde tijdspanne van tijdspanne @nl
label: időtartam kapcsolódó időtartama a következő: @hu
label: té com a interval de temps relacionat amb un interval de temps @ca
label: zaman aralığının ilgili zaman aralığı ile ilişkilidir @tr
label: لها فترة زمنية مرتبطة بفترة زمنية @ar
label: 有时间段的关联时间段 @zh-hans
sub property of: has related RDA entity of timespan
sub property of: P00011
definition: Bir zaman aralığını, zaman aralığıyla bağlantılı olan bir zaman aralığıyla ilişkilendirir. @tr
definition: Correla un arco di tempo a un arco di tempo che è associato con un arco di tempo. @it
definition: Hozzákapcsol egy időtartamot egy időtartamhoz, amelyet egy időtartamhoz társítanak. @hu
definition: Liittää ajanjakson ajanjaksoon, joka liittyy ajanjaksoon. @fi
definition: Met un laps de temps en relation avec un laps de temps qui est associé à un laps de temps. @fr
definition: Relaciona un interval de temps amb un interval de temps que s’associa amb un interval de temps. @ca
definition: Relateert een tijdspanne aan een tijdspanne die geassocieerd is met een tijdspanne. @nl
definition: Relaterer en tidsperiode til en tidsperiode, som er knyttet til en tidsperiode. @da
definition: Relaterer et tidsrom til et tidsrom som forbindes med et tidsrom. @no
definition: Relates a timespan to a timespan that is associated with a timespan.
definition: Sasaista laikposmu ar laikposmu, kas saistīts ar laikposmu. @lv
definition: Seostab ajavahemiku ajavahemikuga seotud ajavahemikuga. @et
definition: Setzt einen Zeitraum in Beziehung mit einem Zeitraum, der mit einem Zeitraum in Verbindung steht. @de
definition: تربط بين فترة زمنية وفترة زمنية مرتبطة بفترة زمنية. @ar
definition: 将一个时间段与和一个时间段有关的一个时间段关联起来。 @zh-hans

has related nomen of timespan
has element type: 1
toolkit definition: A nomen that is associated with a timespan.
toolkit definition: Ajavahemikuga seotud nomen. @et
toolkit definition: Bir zaman aralığıyla bağlantılı olan bir isim. @tr
toolkit definition: Een nomen dat geassocieerd is met een tijdspanne. @nl
toolkit definition: Egy nomen, amelyet egy időtartamhoz társítanak. @hu
toolkit definition: Ein Nomen, das mit einem Zeitraum in Verbindung steht. @de
toolkit definition: Et nomen som forbindes med et tidsrom. @no
toolkit definition: Nomen che è associato con un arco di tempo. @it
toolkit definition: Nomen que s’associa amb un interval de temps. @ca
toolkit definition: Nomen qui est associé à un laps de temps. @fr
toolkit definition: Nomen, joka liittyy ajanjaksoon. @fi
toolkit definition: Nomen, som er knyttet til en tidsperiode. @da
toolkit definition: Nomens, kas saistīts ar laikposmu. @lv
toolkit definition: تسمية مرتبطة بفترة زمنية. @ar
toolkit definition: 和一个时间段有关的一个命名 @zh-hans
toolkit label: ajanjaksoon liittyvä nomen @fi
toolkit label: ajavahemikuga seotud nomen @et
toolkit label: ar laikposmu saistītais nomens @lv
toolkit label: gerelateerde nomen van tijdspanne @nl
toolkit label: időtartam kapcsolódó nomenje: @hu
toolkit label: mit Zeitraum in Beziehung stehendes Nomen @de
toolkit label: nomen correlato di arco di tempo @it
toolkit label: nomen en relation avec un laps de temps @fr
toolkit label: nomen relacionat amb un interval de temps @ca
toolkit label: nomen relateret til tidsperiode @da
toolkit label: nomen relatert til tidsrom @no
toolkit label: related nomen of timespan
toolkit label: zaman aralığının ilşkili ismi @tr
toolkit label: تسمية مرتبطة بفترة زمنية @ar
toolkit label: 时间段的关联命名 @zh-hans
has subproperty: has appellation of timespan
has subproperty: is date of usage of
has subproperty: P70009
lexical alias: relatedNomenOfTimespan.en
status: Published
type: Property
domain: C10010
label: a pour nomen en relation avec un laps de temps @fr
label: ajanjaksoon liittyvä nomen @fi
label: ajavahemikuga seotud nomen @et
label: ar laikposmu saistītais nomens @lv
label: ha come nomen correlato di arco di tempo @it
label: har nomen relateret til tidsperiode @da
label: har nomen relatert til tidsrom @no
label: hat mit Zeitraum in Beziehung stehendes Nomen @de
label: heeft gerelateerde nomen van tijdspanne @nl
label: időtartam kapcsolódó nomenje a következő: @hu
label: té com a nomen relacionat amb un interval de temps @ca
label: zaman aralığının ilgili ismi ile ilişkilidir @tr
label: لها تسمية مرتبطة بفترة زمنية @ar
label: 有时间段的关联命名 @zh-hans
sub property of: has related RDA entity of timespan
sub property of: P00013
definition: Bir zaman aralığını, zaman aralığıyla bağlantılı olan bir isimle ilişkilendirir. @tr
definition: Correla un arco di tempo a un nomen che è associato con un arco di tempo. @it
definition: Hozzákapcsol egy időtartamot egy nomenhez, amelyet egy időtartamhoz társítanak. @hu
definition: Liittää ajanjakson nomeniin, joka liittyy ajanjaksoon. @fi
definition: Met un laps de temps en relation avec un nomen qui est associé à un laps de temps. @fr
definition: Relaciona un interval de temps amb un nomen que s’associa amb un interval de temps. @ca
definition: Relateert een tijdspanne aan een nomen dat geassocieerd is met een tijdspanne. @nl
definition: Relaterer en tidsperiode til et nomen, som er knyttet til en tidsperiode. @da
definition: Relaterer et tidsrom til et nomen som forbindes med et tidsrom. @no
definition: Relates a timespan to a nomen that is associated with a timespan.
definition: Sasaista laikposmu ar nomenu, kas saistīts ar laikposmu. @lv
definition: Seostab ajavahemiku ajavahemikuga seotud nomen'iga. @et
definition: Setzt einen Zeitraum in Beziehung zu einem Nomen, das mit einem Zeitraum in Verbindung steht. @de
definition: تربط بين فترة زمنية وتسمية مرتبطة بفترة زمنية. @ar
definition: 将一个时间段与和一个时间段有关的一个命名关联起来。 @zh-hans

has related RDA entity of timespan
has element type: 1
toolkit definition: Ajavahemikuga seotud RDA olem. @et
toolkit definition: An RDA entity that is associated with a timespan.
toolkit definition: Bir zaman aralığıyla bağlantılı olan bir RDA varlığı. @tr
toolkit definition: Een RDA-entiteit die geassocieerd is met een tijdspanne. @nl
toolkit definition: Egy RDA-entitás, amelyet egy időtartamhoz társítanak. @hu
toolkit definition: Eine RDA-Entität, die mit einem Zeitraum in Verbindung steht. @de
toolkit definition: En RDA-entitet som forbindes med et tidsrom. @no
toolkit definition: Entitat RDA que s’associa amb un interval de temps. @ca
toolkit definition: Entità RDA che è associata con un arco di tempo. @it
toolkit definition: Entité RDA qui est associée à un laps de temps. @fr
toolkit definition: RDA entīte, kas saistīta ar laikposmu. @lv
toolkit definition: RDA-entiteetti, joka liittyy ajanjaksoon. @fi
toolkit definition: RDA-entitet, som er knyttet til en tidsperiode. @da
toolkit definition: كيان "وام" مرتبط بفترة زمنية. @ar
toolkit definition: 和一个时间段有关的一个RDA实体 @zh-hans
toolkit label: RDA-entitet relateret til tidsperiode @da
toolkit label: RDA-entitet relatert til tidsrom @no
toolkit label: ajanjaksoon liittyvä RDA-entiteetti @fi
toolkit label: ajavahemikuga seotud RDA olem @et
toolkit label: ar laikposmu saistītā RDA entīte @lv
toolkit label: entitat RDA relacionada amb un interval de temps @ca
toolkit label: entità di RDA correlata di arco di tempo @it
toolkit label: entité RDA en relation avec un laps de temps @fr
toolkit label: gerelateerde RDA-entiteit van tijdspanne @nl
toolkit label: időtartam kapcsolódó RDA-entitása a következő: @hu
toolkit label: mit Zeitraum in Beziehung stehende RDA-Entität @de
toolkit label: related RDA entity of timespan
toolkit label: zaman aralığının RDA varlığıyla ilişkisi @tr
toolkit label: كيان "وام" مرتبط بفترة زمنية @ar
toolkit label: 时间段的关联RDA实体 @zh-hans
has subproperty: has related work of timespan
has subproperty: has related expression of timespan
has subproperty: has related manifestation of timespan
has subproperty: has related item of timespan
has subproperty: has related agent of timespan
has subproperty: has related place of timespan
has subproperty: has related timespan of timespan
has subproperty: has related nomen of timespan
has subproperty: P70010
lexical alias: relatedRDAEntityOfTimespan.en
status: Published
type: Property
domain: C10010
label: a pour entité RDA en relation avec un laps de temps @fr
label: ajanjaksoon liittyvä RDA-entiteetti @fi
label: ajavahemikuga seotud RDA olem @et
label: ar laikposmu saistītā RDA entīte @lv
label: ha come entità di RDA correlata di arco di tempo @it
label: har RDA-entitet relateret til tidsperiode @da
label: har RDA-entitet relatert til tidsrom @no
label: hat mit Zeitraum in Beziehung stehende RDA-Entität @de
label: heeft gerelateerde RDA-entiteit van tijdspanne @nl
label: időtartam kapcsolódó RDA-entitása a következő: @hu
label: té com a entitat RDA relacionada amb un interval de temps @ca
label: zaman aralığının ilgili RDA varlığı ile ilişkilidir @tr
label: لها كيان "وام" مرتبط بفترة زمنية @ar
label: 有时间段的关联RDA实体 @zh-hans
sub property of: has related entity of timespan
sub property of: P00001
definition: Bir zaman aralığını, zaman aralığıyla bağlantılı olan bir RDA varlığıyla ilişkilendirir. @tr
definition: Correla un arco di tempo a un'entità RDA che è associata con un arco di tempo. @it
definition: Hozzákapcsol egy időtartamot egy RDA-entitáshoz, amelyet egy időtartamhoz társítanak. @hu
definition: Liittää ajanjakson RDA-entiteettiin, joka liittyy ajanjaksoon. @fi
definition: Met un laps de temps en relation avec une entité RDA qui est associée à un laps de temps. @fr
definition: Relaciona un interval de temps amb una entitat RDA que s’associa amb un interval de temps. @ca
definition: Relateert een tijdspanne aan een RDA-entiteit die geassocieerd is met een tijdspanne. @nl
definition: Relaterer en tidsperiode til en RDA-entitet, som er knyttet til en tidsperiode. @da
definition: Relaterer et tidsrom til en RDA-entitet som forbindes med et tidsrom. @no
definition: Relates a timespan to an RDA entity that is associated with a timespan.
definition: Sasaista laikposmu ar RDA entīti, kas saistīta ar laikposmu. @lv
definition: Seostab ajavahemiku ajavahemikuga seotud RDA olemiga. @et
definition: Setzt einen Zeitraum in Beziehung zu einer RDA-Entität, die mit einem Zeitraum in Verbindung steht. @de
definition: تربط بين فترة زمنية وكيان "وام" مرتبط بفترة زمنية. @ar
definition: 将一个时间段与和一个时间段有关的一个RDA实体关联起来。 @zh-hans

has related person of timespan
has element type: 1
toolkit definition: A person who is associated with a timespan.
toolkit definition: Ajavahemikuga seotud isik. @et
toolkit definition: Bir zaman aralığıyla bağlantılı olan bir kişi. @tr
toolkit definition: Een persoon die geassocieerd is met een tijdspanne. @nl
toolkit definition: Egy személy, amelyet egy időtartamhoz társítanak. @hu
toolkit definition: Eine Person, die mit einem Zeitraum in Verbindung steht. @de
toolkit definition: En person som forbindes med et tidsrom. @no
toolkit definition: Henkilö, joka liittyy ajanjaksoon. @fi
toolkit definition: Person, som er knyttet til en tidsperiode. @da
toolkit definition: Persona che è associata con un arco di tempo. @it
toolkit definition: Persona que s’associa amb un interval de temps. @ca
toolkit definition: Persona, kura saistīta ar laikposmu. @lv
toolkit definition: Personne qui est associée à un laps de temps. @fr
toolkit definition: شخص مرتبط بفترة زمنية. @ar
toolkit definition: 和一个时间段有关的一个个人 @zh-hans
toolkit label: ajanjaksoon liittyvä henkilö @fi
toolkit label: ajavahemikuga seotud isik @et
toolkit label: ar laikposmu saistītā persona @lv
toolkit label: gerelateerde persoon van tijdspanne @nl
toolkit label: időtartamra vonatkozó személy @hu
toolkit label: mit Zeitraum in Beziehung stehende Person @de
toolkit label: person relateret til tidsperiode @da
toolkit label: person relatert til tidsrom @no
toolkit label: persona correlata di arco di tempo @it
toolkit label: persona relacionada amb un interval de temps @ca
toolkit label: personne en relation avec un laps de temps @fr
toolkit label: related person of timespan
toolkit label: zaman aralığıyla ilişkili kişi @tr
toolkit label: شخص مرتبط بفترة زمنية @ar
toolkit label: 时间段的关联个人 @zh-hans
has subproperty: is date of birth of
has subproperty: is date of death of
has subproperty: is date associated with person of (Deprecated)
has subproperty: is period of activity of person of
has subproperty: P70011
lexical alias: relatedPersonOfTimespan.en
status: Published
type: Property
domain: C10010
label: a pour personne en relation avec un laps de temps @fr
label: ajanjaksoon liittyvä henkilö @fi
label: ajavahemikuga seotud isik @et
label: ar laikposmu saistītā persona @lv
label: ha come persona correlata di arco di tempo @it
label: har person relateret til tidsperiode @da
label: har person relatert til tidsrom @no
label: hat mit Zeitraum in Beziehung stehende Person @de
label: heeft gerelateerde persoon van tijdspanne @nl
label: időtartam kapcsolódó személye a következő: @hu
label: té com a persona relacionada amb un interval de temps @ca
label: zaman aralığının ilgili kişisi ile ilişkilidir @tr
label: لها شخص مرتبط بفترة زمنية @ar
label: 有时间段的关联个人 @zh-hans
sub property of: has related agent of timespan
sub property of: P00007
alternative label: Datum, das mit einer Person in Verbindung steht von @de
alternative label: a következő személyhez kapcsolódó időpont: @hu
alternative label: ajankohtaan liittyvä henkilö @fi
alternative label: daatumiga seotud isik @et
alternative label: data associada amb una persona de @ca
alternative label: date associate con persona di @it
alternative label: date associated with person of
alternative label: date associée à une personne de @fr
alternative label: dato som forbindes med person for @no
alternative label: dato, som er knyttet til person af @da
alternative label: kişiyle bağlantılı olan tarih @tr
alternative label: تاريخ مرتبط بشخص لـ @ar
alternative label: 和……的个人有关的日期 @zh-hans
definition: Bir zaman aralığını, zaman aralığıyla bağlantılı olan bir kişiyle ilişkilendirir. @tr
definition: Correla un arco di tempo a una persona che è associata con un arco di tempo. @it
definition: Hozzákapcsol egy időtartamot egy személyhez, amelyet egy időtartamhoz társítanak. @hu
definition: Liittää ajanjakson henkilöön, joka liittyy ajanjaksoon. @fi
definition: Met un laps de temps en relation avec une personne qui est associée à un laps de temps. @fr
definition: Relaciona un interval de temps amb una persona que s’associa amb un interval de temps. @ca
definition: Relateert een tijdspanne aan een persoon die geassocieerd is met een tijdspanne. @nl
definition: Relaterer en tidsperiode til en person, som er knyttet til en tidsperiode. @da
definition: Relaterer et tidsrom til en person som forbindes med et tidsrom. @no
definition: Relates a timespan to a person who is associated with a timespan.

has related family of timespan
has element type: 1
toolkit definition: A family who is associated with a timespan.
toolkit definition: Ajavahemikuga seotud perekond. @et
toolkit definition: Bir zaman aralığıyla bağlantılı olan bir aile. @tr
toolkit definition: Dzimta/ģimene, kas saistīta ar laikposmu. @lv
toolkit definition: Een familie die geassocieerd is met een tijdspanne. @nl
toolkit definition: Egy család, amelyet egy időtartamhoz társítanak. @hu
toolkit definition: Eine Familie, die mit einem Zeitraum in Verbindung steht. @de
toolkit definition: En familie som forbindes med et tidsrom. @no
toolkit definition: Famiglia che è associata con un arco di tempo. @it
toolkit definition: Familie, som er knyttet til en tidsperiode. @da
toolkit definition: Famille qui est associée à un laps de temps. @fr
toolkit definition: Família que s’associa amb un interval de temps. @ca
toolkit definition: Suku, joka liittyy ajanjaksoon. @fi
toolkit definition: عائلة مرتبطة بفترة زمنية. @ar
toolkit definition: 和一个时间段有关的一个家族 @zh-hans
toolkit label: ajanjaksoon liittyvä suku @fi
toolkit label: ajavahemikuga seotud perekond @et
toolkit label: ar laikposmu saistītā dzimta/ģimene @lv
toolkit label: famiglia correlata di arco di tempo @it
toolkit label: familie relateret til tidsperiode @da
toolkit label: familie relatert til tidsrom @no
toolkit label: famille en relation avec un laps de temps @fr
toolkit label: família relacionada amb un interval de temps @ca
toolkit label: gerelateerde familie van tijdspanne @nl
toolkit label: időtartamhoz kapcsolódó család a következő: @hu
toolkit label: mit Zeitraum in Beziehung stehende Familie @de
toolkit label: related family of timespan
toolkit label: zaman aralığıyla ilişkili aile @tr
toolkit label: عائلة مرتبطة بفترة زمنية @ar
toolkit label: 时间段的关联家族 @zh-hans
has subproperty: is period of activity of family of
has subproperty: P70012
lexical alias: relatedFamilyOfTimespan.en
status: Published
type: Property
domain: C10010
label: a pour famille en relation avec un laps de temps @fr
label: ajanjaksoon liittyvä suku @fi
label: ajavahemikuga seotud perekond @et
label: ar laikposmu saistītā dzimta/ģimene @lv
label: ha come famiglia correlata di arco di tempo @it
label: har familie relateret til tidsperiode @da
label: har familie relatert til tidsrom @no
label: hat mit Zeitraum in Beziehung stehende Familie @de
label: heeft gerelateerde familie van tijdspanne @nl
label: időtartamhoz kapcsolódó család a következő: @hu
label: té com a família relacionada amb un interval de temps @ca
label: zaman aralığının ilgili ailesi ile ilişkilidir @tr
label: لها عائلة مرتبطة بفترة زمنية @ar
label: 有时间段的关联家族 @zh-hans
sub property of: has related collective agent of timespan
sub property of: P00008
alternative label: Datum, das mit einer Familie in Verbindung steht von @de
alternative label: aileyle bağlantılı olan tarih @tr
alternative label: ajankohtaan liittyvä suku @fi
alternative label: családhoz kapcsolódó időpontja a következő: @hu
alternative label: daatumiga seotud perekond @et
alternative label: data associada amb una família de @ca
alternative label: date associate con famiglia di @it
alternative label: date associated with family of
alternative label: date associée à une famille de @fr
alternative label: dato som forbindes med familie for @no
alternative label: dato, som er knyttet til familie af @da
alternative label: تاريخ مرتبط بعائلة لـ @ar
alternative label: 和……的家族有关的日期 @zh-hans
definition: Bir zaman aralığını, zaman aralığıyla bağlantılı olan bir aileyle ilişkilendirir. @tr
definition: Correla un arco di tempo a una famiglia che è associata con un arco di tempo. @it
definition: Hozzákapcsol egy időtartamot egy családhoz, amelyet egy időtartamhoz társítanak. @hu
definition: Liittää ajanjakson sukuun, joka liittyy ajanjaksoon. @fi
definition: Met un laps de temps en relation avec une famille qui est associée à un laps de temps. @fr
definition: Relaciona un interval de temps amb una família que s’associa amb un interval de temps. @ca
definition: Relateert een tijdspanne aan een familie die geassocieerd is met een tijdspanne. @nl
definition: Relaterer en tidsperiode til en familie, som er knyttet til en tidsperiode. @da
definition: Relaterer et tidsrom til en familie som forbindes med et tidsrom. @no
definition: Relates a timespan to a family who is associated with a timespan.
definition: Sasaista laikposmu ar dzimtu/ģimeni, kas saistīta ar laikposmu. @lv
definition: Seostab ajavahemiku ajavahemikuga seotud perekonnaga. @et
definition: Setzt einen Zeitraum in Beziehung zu einer Familie, die mit einem Zeitraum in Verbindung steht. @de
definition: تربط بين فترة زمنية وعائلة مرتبطة بفترة زمنية. @ar

has related corporate body of timespan
has element type: 1
toolkit definition: A corporate body who is associated with a timespan.
toolkit definition: Ajavahemikuga seotud asutus. @et
toolkit definition: Bir zaman aralığıyla ilgili bir tüzel kişi. @tr
toolkit definition: Collectivité qui est associée à un laps de temps. @fr
toolkit definition: Een corporatie die geassocieerd is met een tijdspanne. @nl
toolkit definition: Egy testület, amelyet egy időtartamhoz társítanak. @hu
toolkit definition: Eine Körperschaft, die mit einem Zeitraum in Verbindung steht. @de
toolkit definition: En korporasjon som forbindes med et tidsrom. @no
toolkit definition: Ente che è associato con un arco di tempo. @it
toolkit definition: Entitat corporativa que s’associa amb un interval de temps. @ca
toolkit definition: Institūcija, kas saistīta ar laikposmu. @lv
toolkit definition: Korporation, som er knyttet til en tidsperiode. @da
toolkit definition: Yhteisö, joka liittyy ajanjaksoon. @fi
toolkit definition: هيئة مرتبطة بفترة زمنية. @ar
toolkit definition: 和一个时间段有关的一个团体 @zh-hans
toolkit label: ajanjaksoon liittyvä yhteisö @fi
toolkit label: ajavahemikuga seotud asutus @et
toolkit label: ar laikposmu saistītā institūcija @lv
toolkit label: collectivité en relation avec un laps de temps @fr
toolkit label: ente correlato di arco di tempo @it
toolkit label: entitat corporativa relacionada amb un interval de temps @ca
toolkit label: gerelateerde corporatie van tijdspanne @nl
toolkit label: időtartamra vonatkozó testület @hu
toolkit label: korporasjon relatert til tidsrom @no
toolkit label: korporation relateret til tidsperiode @da
toolkit label: mit Zeitraum in Beziehung stehende Körperschaft @de
toolkit label: related corporate body of timespan
toolkit label: zaman aralığının tüzel kişiyle ilişkisi @tr
toolkit label: هيئة مرتبطة بفترة زمنية @ar
toolkit label: 时间段的关联团体 @zh-hans
has subproperty: is date of conference of
has subproperty: is date of establishment of
has subproperty: is date of termination of
has subproperty: is period of activity of corporate body of
has subproperty: P70013
lexical alias: relatedCorporateBodyOfTimespan.en
status: Published
type: Property
domain: C10010
label: a pour collectivité en relation avec un laps de temps @fr
label: ajanjaksoon liittyvä yhteisö @fi
label: ajavahemikuga seotud asutus @et
label: ar laikposmu saistītā institūcija @lv
label: ha come ente correlato di arco di tempo @it
label: har korporasjon relatert til tidsrom @no
label: har korporation relateret til tidsperiode @da
label: hat mit Zeitraum in Beziehung stehende Körperschaft @de
label: heeft gerelateerde corporatie van tijdspanne @nl
label: testülethez kapcsolódó időpontja: @hu
label: té com a entitat corporativa relacionada amb un interval de temps @ca
label: zaman aralığının ilgili tüzel kişisi ile ilişkilidir @tr
label: لها هيئة مرتبطة بفترة زمنية @ar
label: 有时间段的关联团体 @zh-hans
sub property of: has related collective agent of timespan
sub property of: P00009
alternative label: Datum, das mit einer Körperschaft in Verbindung steht @de
alternative label: ajankohtaan liittyvä yhteisö @fi
alternative label: daatumiga seotud asutus @et
alternative label: data associada amb una entitat corporativa de @ca
alternative label: date associate con ente di @it
alternative label: date associated with corporate body of
alternative label: date associée à une collectivité de @fr
alternative label: dato som forbindes med korporasjon for @no
alternative label: dato, som er knyttet til korporation af @da
alternative label: tüzel kişilikle bağlantılı olan tarih @tr
alternative label: تاريخ مرتبط بهيئة لـ @ar
alternative label: 和……的团体有关的日期 @zh-hans
definition: Bir zaman aralığını, zaman aralığıyla bağlantılı bir tüzel kişi ile ilişkilendirir. @tr
definition: Correla un arco di tempo a un ente che è associato con un arco di tempo. @it
definition: Hozzákapcsol egy időtartamot egy testülethez, amelyet egy időtartamhoz társítanak. @hu
definition: Liittää ajanjakson yhteisöön, joka liittyy ajanjaksoon. @fi
definition: Met un laps de temps en relation avec une collectivité qui est associée à un laps de temps. @fr
definition: Relaciona un interval de temps amb una entitat corporativa que s’associa amb un interval de temps. @ca
definition: Relateert een tijdspanne aan een corporatie die geassocieerd is met een tijdspanne. @nl
definition: Relaterer en tidsperiode til en korporation, som er knyttet til en tidsperiode. @da
definition: Relaterer et tidsrom til en korporasjon som forbindes med et tidsrom. @no
definition: Relates a timespan to a corporate body who is associated with a timespan.
definition: Sasaista laikposmu ar institūciju, kas saistīta ar laikposmu. @lv

is subject timespan of
has element type: 2
toolkit definition: A work that is about a timespan.
toolkit definition: Bir zaman aralığıyla ilgili bir eser. @tr
toolkit definition: Darbs, kura temats ir laikposms. @lv
toolkit definition: Een werk dat over een tijdspanne gaat. @nl
toolkit definition: Egy mű, amelyet egy időtartamhoz társítanak. @hu
toolkit definition: Ein Werk, das von einem Zeitraum handelt. @de
toolkit definition: Et verk som handler om et tidsrom. @no
toolkit definition: Obra que tracta sobre un interval de temps. @ca
toolkit definition: Opera che è su un arco di tempo. @it
toolkit definition: Teos, jonka aiheena ajanjakso on. @fi
toolkit definition: Teos, mis on ajavahemiku kohta. @et
toolkit definition: Værk, som handler om en tidsperiode. @da
toolkit definition: Œuvre qui traite d’un laps de temps. @fr
toolkit definition: عمل عن فترة زمنية. @ar
toolkit definition: 关于一个时间段的一种作品 @zh-hans
toolkit label: Zeitraum als Thema von @de
toolkit label: ajanjakso aiheena teoksessa @fi
toolkit label: arco di tempo soggetto di @it
toolkit label: időtartamtémája @hu
toolkit label: interval de temps de matèria de @ca
toolkit label: ir temats (laikposms) @lv
toolkit label: konu alınan zaman aralığı @tr
toolkit label: laps de temps sujet de @fr
toolkit label: onderwerp-tijdspanne van @nl
toolkit label: subject timespan of
toolkit label: teema (ajavahemik) teoses @et
toolkit label: tidsperiode, som er subjekt af @da
toolkit label: tidsrom som emne for @no
toolkit label: فترة زمنية لموضوع لـ @ar
toolkit label: ……的时间段主题 @zh-hans
has subproperty: is timespan described by
has subproperty: P70014
lexical alias: subjectTimespanOf.en
status: Published
type: Property
domain: C10010
label: ajanjakso aiheena teoksessa @fi
label: er tidsperiode, som er subjekt af @da
label: er tidsrom som emne for @no
label: est un laps de temps sujet de @fr
label: időtartamtémája a következőnek: @hu
label: ir temats (laikposms) @lv
label: is onderwerp-tijdspanne van @nl
label: ist Zeitraum als Thema von @de
label: teema (ajavahemik) teoses @et
label: zaman aralığının konusudur @tr
label: è arco di tempo soggetto di @it
label: és interval de temps de matèria de @ca
label: هي موضوع فترة زمنية لـ @ar
label: 是……的时间段主题 @zh-hans
sub property of: has related work of timespan
sub property of: P00014
definition: Bir zaman aralığını, zaman aralığıyla hakkındaki bir eserle ilişkilendirir. @tr
definition: Correla un arco di tempo a un'opera che è su un arco di tempo. @it
definition: Hozzákapcsol egy időtartamot egy műhöz, amelyet egy időtartamhoz társítanak. @hu
definition: Liittää ajanjakson teokseen, jonka aiheena ajanjakso on. @fi
definition: Met un laps de temps en relation avec une œuvre qui traite d’un laps de temps. @fr
definition: Relaciona un interval de temps amb una obra que tracta sobre un interval de temps. @ca
definition: Relateert een tijdspanne aan een werk dat over een tijdspanne gaat. @nl
definition: Relaterer en tidsperiode til et værk, som handler om en tidsperiode. @da
definition: Relaterer et tidsrom til et verk som handler om et tidsrom. @no
definition: Relates a timespan to a work that is about a timespan.
definition: Sasaista laikposmu ar darbu, kura temats ir laikposms. @lv
definition: Seostab ajavahemiku teosega, mis on ajavahemiku kohta. @et
definition: Setzt einen Zeitraum in Beziehung zu einem Werk, das von einem Zeitraum handelt. @de
definition: تربط بين فترة زمنية وعمل عن فترة زمنية. @ar
definition: 将一个时间段与关于一个时间段的一种作品关联起来。 @zh-hans

has access point for timespan
has element type: 3
toolkit definition: A nomen that is an appellation of timespan in natural language that is taken from a vocabulary encoding scheme or is constructed using a string encoding scheme.
toolkit definition: Ajavahemiku nimetus loomulikus keeles, mis on võetud leksikaalsest märkimissüsteemist või moodustatud stringilise märkimissüsteemi alusel. @et
toolkit definition: Benævnelse på tidsperiode på normalsprog, som er taget fra et vokabularkodningsskema eller er konstrueret ved hjælp af et strengkodningsskema. @da
toolkit definition: Bir kelime kodlama şemasından alınan veya bir dizi kodlama şeması kullanılarak oluşturulan, doğal dilde zaman aralığının bir unvanı olan isim. @tr
toolkit definition: Denominazione di arco di tempo nel linguaggio naturale che è tratta da uno schema di codifica di vocabolario o è costruita usando uno schema di codifica di stringa. @it
toolkit definition: Een nomen dat is een benaming van tijdspanne in natuurlijke taal die ontleend is aan een vocabulair coderingsschema of gevormd is volgens een string coderingsschema. @nl
toolkit definition: Egy nomen, amely egy időtartam szótárkódolási sémából vett vagy karakterlánc-kódolási séma felhasználásával konstruált természetes nyelvi megnevezés. @hu
toolkit definition: Eine Bezeichnung für einen Zeitraum in natürlicher Sprache, die einem Vocabulary Encoding Scheme entnommen oder mit einem String Encoding Scheme konstruiert wird. @de
toolkit definition: En betegnelse for tidsrom på et naturlig språk som er hentet fra et kodeskjema for vokabular eller er laget ved hjelp av et kodeskjema for syntaks. @no
toolkit definition: Laikposma vārds/nosaukums dabiskā valodā, kas ņemts no shēmas kontrolētu vārdnīcu kodēšanai vai tiek konstruēts, izmantojot virknes kodēšanas shēmu. @lv
toolkit definition: Nomen que és una apel·lació d’interval de temps en llenguatge natural que s’obté d’un esquema de codificació de vocabulari o s’elabora usant un esquema de codificació de cadenes. @ca
toolkit definition: Nomen qui est une appellation de laps de temps en langage naturel provenant d’un schéma d’encodage de vocabulaire ou construite à l’aide d’un schéma d’encodage de chaînes. @fr
toolkit definition: Nomen, joka on luonnollisen kielen mukainen ajanjakson nimitys, joka on otettu sanaston merkintäjärjestelmästä tai muodostettu merkkijonon merkintäjärjestelmää käyttäen. @fi
toolkit definition: تسمية عبارة عن اسم تعريفي لفترة زمنية في لغة طبيعية مأخوذة من خطة ترميز مصطلحات أو مهيكلة باستخدام خطة ترميز سلسلة تمثيلات. @ar
toolkit definition: 作为取自一个词表编码体系或者用一个串编码体系构建的一个时间段用自然语言的称谓的一个命名 @zh-hans
toolkit label: Sucheinstieg für einen Zeitraum @de
toolkit label: Zaman aralığı erişim noktası @tr
toolkit label: access point for timespan
toolkit label: ajanjakson hakutieto @fi
toolkit label: ajavahemiku otsielement @et
toolkit label: időtartam szerinti hozzáférési pontja @hu
toolkit label: ingang voor tijdspanne @nl
toolkit label: laikposma pamatforma @lv
toolkit label: point d’accès d’un laps de temps @fr
toolkit label: punt d’accés d’interval de temps @ca
toolkit label: punto d'accesso per arco di tempo @it
toolkit label: søgeindgang for tidsperiode @da
toolkit label: søkeinngang for tidsrom @no
toolkit label: نقطة وصول لفترة زمنية @ar
toolkit label: 时间段的检索点 @zh-hans
has subproperty: has authorized access point for timespan
has subproperty: has variant access point for timespan
has subproperty: P70015
lexical alias: accessPointForTimespan.en
status: Published
type: Property
domain: C10010
label: a pour point d’accès d’un laps de temps @fr
label: ajanjakson hakutieto @fi
label: ajavahemiku otsielement @et
label: ha come punto d'accesso per arco di tempo @it
label: har søgeindgang for tidsperiode @da
label: har søkeinngang for tidsrom @no
label: hat Sucheinstieg für einen Zeitraum @de
label: heeft ingang voor tijdspanne @nl
label: hozzáférési pontja időtartamhoz a következő: @hu
label: laikposma pamatforma @lv
label: té com a punt d’accés d’interval de temps @ca
label: zaman aralığı için erişim noktası ile ilişkilidir @tr
label: لها نقطة وصول لفترة زمنية @ar
label: 有时间段的检索点 @zh-hans
sub property of: has appellation of timespan
sub property of: P00016
definition: Bir zaman aralığını, bir kelime kodlama şemasından alınan veya bir dizi kodlama şeması kullanılarak oluşturulan doğal dildeki bir zaman aralığının unvanıyla ilişkilendirir. @tr
definition: Correla un arco di tempo che ha una denominazione di arco di tempo nel linguaggio naturale che è tratta da uno schema di codifica di vocabolario o è costruita usando uno schema di codifica di stringa. @it
definition: Hozzákapcsol egy időtartamot egy időtartam szótárkódolási sémából vett vagy karakterlánc-kódolási séma felhasználásával konstruált természetes nyelvi megnevezéshez. @hu
definition: Liittää ajanjakson nomeniin, joka on luonnollisen kielen mukainen ajanjakson nimitys, joka on otettu sanaston merkintäjärjestelmästä tai muodostettu merkkijonon merkintäjärjestelmää käyttäen. @fi
definition: Met un laps de temps en relation avec un nomen qui est une appellation de laps de temps en langage naturel provenant d’un schéma d’encodage de vocabulaire ou construite à l’aide d’un schéma d’encodage de chaînes. @fr
definition: Relaciona un interval de temps amb un nomen que és una apel·lació d’interval de temps en llenguatge natural que s’obté d’un esquema de codificació de vocabulari o s’elabora usant un esquema de codificació de cadenes. @ca
definition: Relateert een tijdspanne aan een nomen dat is een benaming van tijdspanne in natuurlijke taal die ontleend is aan een vocabulair coderingsschema of gevormd is volgens een string coderingsschema. @nl
definition: Relaterer en tidsperiode til en benævnelse på tidsperiode på normalsprog, som er taget fra et vokabularkodningsskema eller er konstrueret ved hjælp af et strengkodningsskema. @da
definition: Relaterer et tidsrom til en betegnelse for tidsrom på et naturlig språk som er hentet fra et kodeskjema for vokabular eller er laget ved hjelp av et kodeskjema for syntaks. @no
definition: Relates a timespan to a nomen that is an appellation of timespan in natural language that is taken from a vocabulary encoding scheme or is constructed using a string encoding scheme.
definition: Sasaista laikposmu ar laikposma vārdu/nosaukumu dabiskā valodā, kas ņemts no shēmas kontrolētu vārdnīcu kodēšanai vai tiek konstruēts, izmantojot virknes kodēšanas shēmu. @lv
definition: Seostab ajavahemiku ajavahemiku nimetusega loomulikus keeles, mis on võetud leksikaalsest märkimissüsteemist või moodustatud stringilise märkimissüsteemi alusel. @et
definition: Setzt einen Zeitraum in Beziehung zu einer Bezeichnung für einen Zeitraum in natürlicher Sprache, die einem Vocabulary Encoding Scheme entnommen oder mit einem String Encoding Scheme konstruiert wird. @de
definition: تربط بين فترة زمنية واسم تعريفي فترة زمنية في لغة طبيعية مأخوذة من خطة ترميز مفردات أو مبنية باستخدام خطة ترميز سلسلة تمثيلات. @ar
definition: 将一个时间段与取自一个词表编码体系或者用一个串编码体系构建的一个时间段用自然语言的称谓关联起来。 @zh-hans

has appellation of timespan
has element type: 3
toolkit definition: A nomen that is used within a given scheme or context to refer to a timespan.
toolkit definition: Belirli bir şema veya bağlam içinde bir zaman aralığına atıfta bulunmak için kullanılan bir isim. @tr
toolkit definition: Een nomen dat is gebruikt binnen een bepaald schema of context om te verwijzen naar een tijdspanne. @nl
toolkit definition: Egy nomen, amelyet egy adott sémán vagy kontextuson belül használnak egy entitásra való hivatkozásra. @hu
toolkit definition: Ein Nomen, das in einem bestimmten Schema oder Kontext verwendet wird, um eine Familie zu referenzieren. @de
toolkit definition: Et nomen fra et bestemt skjema eller kontekst som brukes til referere til et tidsrom. @no
toolkit definition: Nomen que s’usa en un esquema o un context determinat per referir-se a un interval de temps. @ca
toolkit definition: Nomen qui est utilisé à l’intérieur d’un schéma ou d’un contexte donnés pour désigner un laps de temps. @fr
toolkit definition: Nomen usato in un dato schema o contesto per riferirsi a un arco di tempo. @it
toolkit definition: Nomen, jota käytetään viitattaessa ajanjaksoon tietyssä järjestelmässä tai kontekstissä. @fi
toolkit definition: Nomen, mida antud süsteemis või kontekstis kasutatakse ajavahemikule viitamiseks. @et
toolkit definition: Nomen, som anvendes inden for et givet skema eller kontekst for at henvise til en tidsperiode. @da
toolkit definition: Nomens, ko lieto konkrētajā sistēmā vai kontekstā, lai norādītu uz laikposmu. @lv
toolkit definition: تسمية مستخدمة ضمن خطة بعينها أو سياق بعينه للإشارة إلى فترة زمنية. @ar
toolkit definition: 在一个指定的体系或语境中用于指称一个时间段的一个命名 @zh-hans
toolkit label: Bezeichnung für einen Zeitraum @de
toolkit label: ajanjakson nimitys @fi
toolkit label: ajavahemiku nimetus @et
toolkit label: apel·lació d’interval de temps @ca
toolkit label: appellation de laps de temps @fr
toolkit label: appellation of timespan
toolkit label: benaming voor tijdspanne @nl
toolkit label: benævnelse på tidsperiode @da
toolkit label: betegnelse for tidsrom @no
toolkit label: denominazione di arco di tempo @it
toolkit label: időtartam megnevezése: @hu
toolkit label: laikposma apzīmējums @lv
toolkit label: zaman aralığının unvanı @tr
toolkit label: اسم تعريفي لفترة زمنية @ar
toolkit label: 时间段的称谓 @zh-hans
has subproperty: has access point for timespan
has subproperty: has name of timespan
has subproperty: has identifier for timespan
has subproperty: P70016
lexical alias: appellationOfTimespan.en
status: Published
type: Property
domain: C10010
label: a pour appellation de laps de temps @fr
label: ajanjakson nimitys @fi
label: ajavahemiku nimetus @et
label: ha come denominazione di arco di tempo @it
label: har benævnelse på tidsperiode @da
label: har betegnelse for tidsrom @no
label: hat Bezeichnung für einen Zeitraum @de
label: heeft benaming voor tijdspanne @nl
label: időtartam megnevezése a következő: @hu
label: laikposma apzīmējums @lv
label: té com a apel·lació d’interval de temps @ca
label: zaman aralığının unvanı ile ilişkilidir @tr
label: لها اسم تعريفي لفترة زمنية @ar
label: 有时间段的称谓 @zh-hans
sub property of: has related nomen of timespan
sub property of: P00017
definition: Bir zaman aralığını, belirli bir şema veya bağlam içindeki bir zaman aralığına atıfta bulunmak için kullanılan bir isimle ilişkilendirir. @tr
definition: Correla un arco di tempo a un nomen usato in un dato schema o contesto per riferirsi a un arco di tempo. @it
definition: Hozzákapcsol egy időtartamot egy nomenhez, amelyet egy adott sémán vagy kontextuson belül használnak egy entitásra való hivatkozásra. @hu
definition: Liittää ajanjakson nomeniin, jota käytetään viitattaessa ajanjaksoon tietyssä järjestelmässä tai kontekstissä. @fi
definition: Met un laps de temps en relation avec un nomen qui est utilisé à l’intérieur d’un schéma ou d’un contexte donnés pour désigner un laps de temps. @fr
definition: Relaciona un interval de temps amb un nomen que s’usa en un esquema o un context determinat per referir-se a un interval de temps. @ca
definition: Relateert een tijdspanne aan een nomen dat gebruikt is binnen een bepaald schema of context om te verwijzen naar een tijdspanne. @nl
definition: Relaterer en tidsperiode til et nomen, som anvendes inden for et givet skema eller kontekst for at henvise til en tidsperiode. @da
definition: Relaterer et tidsrom til et nomen fra et bestemt skjema eller kontekst som brukes til referere til et tidsrom. @no
definition: Relates a timespan to a nomen that is used within a given scheme or context to refer to a timespan.
definition: Sasaista laikposmu ar nomenu, ko lieto konkrētajā sistēmā vai kontekstā, lai norādītu uz laikposmu. @lv
definition: Seostab ajavahemiku nomen'iga, mida antud süsteemis või kontekstis kasutatakse ajavahemikule viitamiseks. @et
definition: Setzt einen Zeitraum in Beziehung zu einem Nomen, das in einem bestimmten Schema oder Kontext verwendet wird, um einen Zeitraum zu referenzieren. @de
definition: تربط بين فترة زمنية وتسمية مستخدمة ضمن خطة بعينها أو سياق بعينه للإشارة الى فترة زمنية. @ar
definition: 将一个时间段与在一个指定的体系或语境中用于指称一个时间段的一个命名关联起来。 @zh-hans

has name of timespan
has element type: 3
toolkit definition: A nomen that is an appellation of timespan in natural language and phrasing used in common discourse.
toolkit definition: Ajavahemiku nimetus loomulikus keeles ja sõnastuses, mida kasutatakse ühises diskursuses. @et
toolkit definition: Benævnelse på tidsperiode på normalsprog og med formuleringer, som bruges alment. @da
toolkit definition: Designazione di arco di tempo in linguaggio e frasi naturali usati nel discorso comune. @it
toolkit definition: Doğal dilde ve ortak söylemde kullanılan ifadelerde bir zaman aralığının unvanı olan bir isim. @tr
toolkit definition: Een nomen dat is een benaming van tijdspanne in natuurlijke taal en terminologie in gebruikelijke bewoording. @nl
toolkit definition: Egy nomen, amely egy időtartam természetes nyelvi, a közbeszéd során használt megnevezéséhez és megfogalmazása. @hu
toolkit definition: Eine Bezeichnung für einen Zeitraum in natürlicher Sprache und Ausdrucksweise, die beim normalen Sprechen und Schreiben verwendet wird. @de
toolkit definition: En betegnelse for tidsrom på et naturlig språk og med frasering brukt i alminnelig diskurs. @no
toolkit definition: Nomen que és una apel·lació d’interval de temps en llenguatge i frases naturals usada en el discurs comú. @ca
toolkit definition: Nomen qui est une appellation de laps de temps exprimée dans un langage et une formulation naturels et utilisée dans le langage courant. @fr
toolkit definition: Nomen, joka on luonnollisen kielen ja sanamuodon mukainen ajanjakson nimitys, jota käytetään yleisessä diskurssissa. @fi
toolkit definition: Nomens, kas ir laikposma apzīmējums dabiskā valodā un teicienos, ko izmanto sarunvalodā. @lv
toolkit definition: تسمية عبارة عن اسم تعريفي لفترة زمنية في لغة طبيعية مستخدمة في حوار عام. @ar
toolkit definition: 作为用自然语言和普通话语措词表达的时间段的称谓的一个命名 @zh-hans
toolkit label: Name eines Zeitraums @de
toolkit label: ajanjakson nimi @fi
toolkit label: ajavahemiku nimi @et
toolkit label: időtartamneve: @hu
toolkit label: laikposma nosaukums @lv
toolkit label: naam van tijdspanne @nl
toolkit label: name of timespan
toolkit label: navn på tidsperiode @da
toolkit label: navn på tidsrom @no
toolkit label: nom de laps de temps @fr
toolkit label: nom d’interval de temps @ca
toolkit label: nome di arco di tempo @it
toolkit label: zaman aralığının adı @tr
toolkit label: اسم لفترة زمنية @ar
toolkit label: 时间段的名称 @zh-hans
has subproperty: has preferred name of timespan
has subproperty: has variant name of timespan
has subproperty: P70017
lexical alias: nameOfTimespan.en
status: Published
type: Property
domain: C10010
label: a pour nom de laps de temps @fr
label: ajanjakson nimi @fi
label: ajavahemiku nimi @et
label: ha come nome di arco di tempo @it
label: har navn på tidsperiode @da
label: har navn på tidsrom @no
label: hat Namen eines Zeitraums @de
label: heeft naam van tijdspanne @nl
label: időtartamneve a következő: @hu
label: laikposma nosaukums @lv
label: té com a nom d’interval de temps @ca
label: zaman aralığının adı ile ilişkilidir @tr
label: لها اسم لفترة زمنية @ar
label: 有时间段的名称 @zh-hans
sub property of: has appellation of timespan
sub property of: P00019
definition: Bir zaman aralığını, doğal dilde ve ortak söylemde kullanılan ifadelerdeki bir zaman aralığı unvanıyla ilişkilendirir. @tr
definition: Correla un arco di tempo a una designazione di arco di tempo in linguaggio e frasi naturali usati nel discorso comune. @it
definition: Hozzákapcsol egy időtartamot egy időtartam természetes nyelvi megnevezéséhez és a közbeszéd során használt megfogalmazásához. @hu
definition: Liittää ajanjakson nomeniin, joka on luonnollisen kielen ja sanamuodon mukainen ajanjakson nimitys, jota käytetään yleisessä diskurssissa. @fi
definition: Met un laps de temps en relation avec un nomen qui est une appellation de laps de temps exprimée dans un langage et une formulation naturels et utilisée dans le langage courant. @fr
definition: Relaciona un interval de temps amb un nomen que és una apel·lació d’interval de temps en llenguatge i frases naturals usada en el discurs comú. @ca
definition: Relateert een tijdspanne aan een benaming van tijdspanne in natuurlijke taal en terminologie in gebruikelijke bewoording. @nl
definition: Relaterer en tidsperiode til en benævnelse på tidsperiode på normalsprog og med formuleringer, som bruges alment. @da
definition: Relaterer et tidsrom til en betegnelse for tidsrom på et naturlig språk og med frasering brukt i alminnelig diskurs. @no
definition: Relates a timespan to a nomen that is an appellation of timespan in natural language and phrasing used in common discourse.
definition: Sasaista laikposmu ar laikposma apzīmējumu dabiskā valodā un teicienos, ko izmanto sarunvalodā. @lv
definition: Seostab ajavahemiku ajavahemiku nimetusega loomulikus keeles ja sõnastuses, mida kasutatakse ühises diskursuses. @et
definition: Setzt einen Zeitraum in Beziehung zu einer Bezeichnung für einen Zeitraum in natürlicher Sprache und Ausdrucksweise, die beim normalen Sprechen und Schreiben verwendet wird. @de
definition: تربط بين فترة زمنية واسم تعريفي فترة زمنية في لغة طبيعية مستخدمة في حوار عام. @ar
definition: 将一个时间段与用自然语言和普通话语措词表达的时间段的称谓关联起来。 @zh-hans

has identifier for timespan
has element type: 3
toolkit definition: A nomen that is an appellation of timespan that consists of a code, number, or other string, usually independent of natural language and social naming conventions, used to identify a timespan.
toolkit definition: Ajavahemiku nimetus, mis koosneb ajavahemikku identifitseerivast koodist, numbrist või muust loomulikust keelest ja üldtuntud nimetamistavadest sõltumatust stringist. @et
toolkit definition: Benævnelse på tidsperiode, som består af en kode, nummer eller anden streng, ofte uafhængig af normalsprog og navngivningskonventioner, brugt til at identificere en tidsperiode. @da
toolkit definition: Bir zaman aralığını tanımlamak için kullanılan, genellikle doğal dilden ve sosyal adlandırma kurallarından bağımsız bir kod, sayı veya başka bir dizeden oluşan bir zaman aralığı unvanı olan bir isim. @tr
toolkit definition: Designazione di arco di tempo che è costituita da un codice, numero, o altra stringa, di solito indipendente dal linguaggio naturale e dalle convenzioni sociali di denominazione, usata per identificare un arco di tempo. @it
toolkit definition: Een nomen dat is een benaming van tijdspanne die bestaat uit een code, nummer of andere tekenreeks, meestal onafhankelijk van natuurlijk taal of sociale naamgeving, gebruikt om een tijdspanne te identificeren. @nl
toolkit definition: Egy nomen, amely egy időtartam megnevezése, amely kódból, számból vagy egyéb karakterláncból áll, általában a természetes nyelvtől és társadalmi elnevezési konvencióktól független, egy időtartam azonosítására használják. @hu
toolkit definition: Eine Bezeichnung für einen Zeitraum, die aus einem Code, einer Nummer oder einer anderen Zeichenkette besteht, der/die normalerweise nicht in natürlicher Sprache und unabhängig von den sozialen Benennungskonventionen ist und zur Identifizierung eines Zeitraums verwendet wird. @de
toolkit definition: En betegnelse for tidsrom som består av en kode, nummer eller annen streng, vanligvis uavhengig av naturlig språk og sosiale navnekonvensjoner, brukt til å identifisere et tidsrom. @no
toolkit definition: Laikposma apzīmējums, kas sastāv no koda, skaitļa vai citas virknes, kas parasti ir neatkarīgs no dabiskas valodas vai sabiedrībā pieņemtām nosaukšanas tradīcijām, ko izmanto, lai identificētu laikposmu. @lv
toolkit definition: Nomen que és una apel·lació d’interval de temps que consisteix en un codi, un número o qualsevol altra cadena, normalment independent del llenguatge natural i de les convencions socials de denominació, usada per identificar un interval de temps. @ca
toolkit definition: Nomen qui est une appellation de laps de temps consistant en un code, un nombre ou une autre chaîne, généralement indépendante du langage naturel et des conventions sociales de dénomination, utilisée pour identifier un laps de temps. @fr
toolkit definition: Nomeniin, joka on ajanjakson nimitys, joka koostuu koodista, numerosta tai muusta merkkijonosta ja joka yleensä on luonnollisesta kielestä ja kielen sosiaalisista konventioista riippumaton ajanjakson tunnistamiskeino. @fi
toolkit definition: تسمية عبارة عن اسم تعريفي لفترة زمنية يتضمن رمز، أو رقم، أو سلسلة تمثيلات أخرى مستقلة عادة عن اللغة الطبيعية والتسميات المتعارف عليها اجتماعيا، وتستخدم لتحديد فترة زمنية. @ar
toolkit definition: 作为由代码、数字或其他串组成、通常独立于自然语言和社会命名惯例、用于标识一个时间段的一个时间段称谓的命名 @zh-hans
toolkit label: Identifikator für einen Zeitraum @de
toolkit label: ajanjakson tunniste @fi
toolkit label: ajavahemiku identifikaator @et
toolkit label: azonosítója a következő időtartamnak: @hu
toolkit label: identifiant de laps de temps @fr
toolkit label: identificador d’interval de temps @ca
toolkit label: identificatie voor tijdspanne @nl
toolkit label: identificatore per arco di tempo @it
toolkit label: identifier for timespan
toolkit label: identifikator for tidsperiode @da
toolkit label: identifikator for tidsrom @no
toolkit label: laikposma identifikators @lv
toolkit label: zaman aralığının tanımlayıcısı ile ilişkilidir @tr
toolkit label: محدد لفترة زمنية @ar
toolkit label: 时间段的标识符 @zh-hans
has subproperty: P70018
lexical alias: identifierForTimespan.en
status: Published
type: Property
domain: C10010
label: a pour identifiant de laps de temps @fr
label: ajanjakson tunniste @fi
label: ajavahemiku identifikaator @et
label: azonosító időtartamhoz a következő: @hu
label: ha come identificatore per arco di tempo @it
label: har identifikator for tidsperiode @da
label: har identifikator for tidsrom @no
label: hat Identifikator für einen Zeitraum @de
label: heeft identificatie voor tijdspanne @nl
label: laikposma identifikators @lv
label: té com a identificador d’interval de temps @ca
label: zaman aralığının tanımlayıcısı ile ilişkilidir @tr
label: لها محدد لفترة زمنية @ar
label: 有时间段的标识符 @zh-hans
sub property of: has appellation of timespan
sub property of: P00018
definition: Bir zaman aralığını, bir zaman aralığını tanımlamak için kullanılan, genellikle doğal dil ve sosyal adlandırma kurallarından bağımsız olarak bir kod, sayı veya başka bir dizeden oluşan bir zaman aralığı unvanıyla ilişkilendirir. @tr
definition: Correla un arco di tempo a una designazione di arco di tempo che è costituita da un codice, numero, o altra stringa, di solito indipendente dal linguaggio naturale e dalle convenzioni sociali di denominazione, usata per identificare un arco di tempo. @it
definition: Hozzákapcsol egy időtartamot egy időtartam megnevezéséhez, amely kódból, számból vagy egyéb karakterláncból áll, általában a természetes nyelvtől és társadalmi elnevezési konvencióktól független, egy időtartam azonosítására használják. @hu
definition: Liittää ajanjakson nomeniin, joka on ajanjakson nimitys, joka koostuu koodista, numerosta tai muusta merkkijonosta ja joka yleensä on luonnollisesta kielestä ja kielen sosiaalisista konventioista riippumaton ajanjakson tunnistamiskeino. @fi
definition: Met un laps de temps en relation avec un nomen qui est une appellation de laps de temps consistant en un code, un nombre ou une autre chaîne, généralement indépendante du langage naturel et des conventions sociales de dénomination, utilisée pour identifier un laps de temps. @fr
definition: Relaciona un interval de temps amb un nomen que és una apel·lació d’interval de temps que consisteix en un codi, un número o qualsevol altra cadena, normalment independent del llenguatge natural i de les convencions socials de denominació, usada per identificar un interval de temps. @ca
definition: Relateert een tijdspanne aan een benaming van tijdspanne die bestaat uit een code, nummer of andere tekenreeks, meestal onafhankelijk van natuurlijk taal of sociale naamgeving, gebruikt om een tijdspanne te identificeren. @nl
definition: Relaterer en tidsperiode til en benævnelse på tidsperiode, som består af en kode, nummer eller anden streng, ofte uafhængig af normalsprog og navngivningskonventioner, brugt til at identificere en tidsperiode. @da
definition: Relaterer et tidsrom til en betegnelse for tidsrom som består av en kode, nummer eller annen streng, vanligvis uavhengig av naturlig språk og sosiale navnekonvensjoner, brukt til å identifisere et tidsrom. @no
definition: Relates a timespan to a nomen that is an appellation of timespan that consists of a code, number, or other string, usually independent of natural language and social naming conventions, used to identify a timespan.
definition: Sasaista laikposmu ar laikposma apzīmējumu, kas sastāv no koda, skaitļa vai citas virknes, kas parasti ir neatkarīgs no dabiskas valodas vai sabiedrībā pieņemtām nosaukšanas tradīcijām, ko izmanto, lai identificētu laikposmu. @lv
definition: Seostab ajavahemiku ajavahemiku nimetusega, mis koosneb ajavahemikku identifitseerivast koodist, numbrist või muust loomulikust keelest ja üldtuntud nimetamistavadest sõltumatust stringist. @et
definition: Setzt einen Zeitraum in Beziehung zu einer Bezeichnung für einen Zeitraum, die aus einem Code, einer Nummer oder einer anderen Zeichenkette besteht, der/die normalerweise nicht in natürlicher Sprache und unabhängig von den sozialen Benennungskonventionen ist und zur Identifizierung eines Zeitraums verwendet wird. @de
definition: تربط بين فترة زمنية واسم تعريفي لفترة زمنية يتضمن رمز، أو رقم، أو سلسلة تمثيلات أخرى مستقلة عادة عن اللغة الطبيعية والتسميات المتعارف عليها اجتماعيا، وتستخدم لتحديد فترة زمنية. @ar
definition: 将一个时间段与由代码、数字或其他串组成、通常独立于自然语言和社会命名惯例、用于标识一个时间段的一个时间段称谓关联起来。 @zh-hans

is copyright date of
has element type: 2
toolkit definition: A manifestation that is associated with a claim of protection under copyright or a similar regime during a timespan.
toolkit definition: Bir zaman aralığı boyunca telif hakkı veya benzer bir sistem kapsamında koruma talebiyle bağlantılı olan bir gösterim. @tr
toolkit definition: Een manifestatie die geassocieerd is met een claim van bescherming onder copyright of soortgelijk stelsel gedurende een tijdspanne. @nl
toolkit definition: Egy megjelenési forma, amelyet a szerzői jog vagy egy hasonló szabályrendszer alapján egy időtartam alatt támasztott védettségi követeléshez társítanak. @hu
toolkit definition: Eine Manifestation, die mit einem Schutzanspruch nach dem Urheberrecht oder einem ähnlichen Regelwerk während eines Zeitraums in Verbindung steht. @de
toolkit definition: En manifestasjon som forbindes med et krav om beskyttelse under copyright eller et lignende regime i løpet av et tidsrom. @no
toolkit definition: Kehastus, mis on sel ajavahemikul seotud autoriõiguse vms õigusrežiimi kaitsega. @et
toolkit definition: Manifestaation, johon liittyy copyright-säädösten tai vastaavien säädösten alainen copyright-suojaus ajanjakson aikana. @fi
toolkit definition: Manifestació que s’associa amb una declaració de protecció en virtut del copyright o d’un règim similar durant un interval de temps. @ca
toolkit definition: Manifestation qui est associée à une revendication de protection en vertu du copyright ou d’un régime similaire durant un laps de temps. @fr
toolkit definition: Manifestation, som i løbet af en tidsperiode er knyttet til et beskyttelseskrav under copyright eller et lignende system. @da
toolkit definition: Manifestazione che è associata con una dichiarazione di protezione sotto copyright o regime simile durante un arco di tempo. @it
toolkit definition: Manifestācija, kas ir saistīta ar prasību par autortiesību aizsardzību vai līdzīgiem nosacījumiem laikposmā. @lv
toolkit definition: تجسيدة مرتبطة بطلب حماية تحت حقوق نشر أو نظام مشابه خلال فترة زمنية. @ar
toolkit definition: 和在一个时间段中根据版权或类似管理制度的保护声明有关的一种载体表现 @zh-hans
toolkit label: Copyright-Datum von @de
toolkit label: copyright date of
toolkit label: copyright éve: @hu
toolkit label: copyright'i aasta kehastuses @et
toolkit label: copyright-vuosi manifestaatiolle @fi
toolkit label: copyrightdato af @da
toolkit label: copyrightdato for @no
toolkit label: copyrightdatum van @nl
toolkit label: data de copyright de @ca
toolkit label: data di copyright di @it
toolkit label: date de copyright de @fr
toolkit label: ir autortiesību datējums @lv
toolkit label: telif hakkı tarihi @tr
toolkit label: تاريخ حقوق نشر لـ @ar
toolkit label: ……的版权日期 @zh-hans
has subproperty: P70019
lexical alias: copyrightDateOf.en
status: Published
type: Property
domain: C10010
label: copyright éve a következőnek: @hu
label: copyright'i aasta kehastuses @et
label: copyright-vuosi manifestaatiolle @fi
label: er copyrightdato af @da
label: er copyrightdato for @no
label: est une date de copyright de @fr
label: ir autortiesību datējums @lv
label: is copyrightdatum van @nl
label: ist Copyright-Datum von @de
label: telif tarihidir @tr
label: è data di copyright di @it
label: és data de copyright de @ca
label: هي تاريخ حقوق نشر لـ @ar
label: 是……的版权日期 @zh-hans
sub property of: is date of manifestation of
definition: Bir zaman aralığını, zaman aralığı boyunca telif hakkı veya benzer bir sistem kapsamında koruma talebiyle bağlantılı olan bir gösterimle ilişkilendirir. @tr
definition: Correla un arco di tempo a una manifestazione che è associata con una dichiarazione di protezione sotto copyright o regime simile durante un arco di tempo. @it
definition: Hozzákapcsol egy időtartamot egy megjelenési formához, amelyet a szerzői jog vagy egy hasonló szabályrendszer alapján egy időtartam alatt támasztott védettségi követeléshez társítanak. @hu
definition: Liittää ajanjakson manifestaatioon, johon liittyy copyright-säädösten tai vastaavien säädösten alainen copyright-suojaus ajanjakson aikana. @fi
definition: Met un laps de temps en relation avec une manifestation qui est associée à une revendication de protection en vertu du copyright ou d’un régime similaire durant un laps de temps. @fr
definition: Relaciona un interval de temps amb una manifestació que s’associa amb una declaració de protecció en virtut del copyright o d’un règim similar durant un interval de temps. @ca
definition: Relateert een tijdspanne aan een manifestatie die geassocieerd is met een claim van bescherming onder copyright of soortgelijk stelsel gedurende een tijdspanne. @nl
definition: Relaterer en tidsperiode til en manifestation, som i løbet af en tidsperiode er knyttet til et beskyttelseskrav under copyright eller et lignende system. @da
definition: Relaterer et tidsrom til en manifestasjon som forbindes med et krav om beskyttelse under copyright eller et lignende regime i løpet av et tidsrom. @no
definition: Relates a timespan to a manifestation that is associated with a claim of protection under copyright or a similar regime during a timespan.
definition: Sasaista laikposmu ar manifestāciju, kas ir saistīta ar prasību par autortiesību aizsardzību vai līdzīgiem nosacījumiem laikposmā. @lv
definition: Seostab ajavahemiku kehastusega, mis on sel ajavahemikul seotud autoriõiguse vms õigusrežiimi kaitsega. @et
definition: Setzt einen Zeitraum in Beziehung zu einer Manifestation, die mit einem Schutzanspruch nach dem Urheberrecht oder einem ähnlichen Regelwerk während eines Zeitraums in Verbindung steht. @de
definition: تربط بين فترة زمنية وتجسيدة مرتبطة بطلب حماية تحت حقوق نشر أو نظام مشابه خلال فترة زمنية. @ar
definition: 将一个时间段与和在一个时间段中根据版权或类似管理制度的保护声明有关的一种载体表现关联起来。 @zh-hans

is date of manifestation of
has element type: 2
toolkit definition: A manifestation that is a published manifestation that is published, released, issued, printed, duplicated, cast, distributed, etc., or an unpublished manifestation that is inscribed, fabricated, constructed, etc., during a timespan.
toolkit definition: Bir zaman aralığında dağıtılan, basılan, çoğaltılan,dökülen, yayınlanan, piyasaya sürülen veya çıkarılan vb. yayınlanmış bir gösterim olan veya bir yerde kaydedilen, üretilen, yapılandırılan vb. yayınlanmamış bir gösterim olan bir gösterim. @tr
toolkit definition: Een manifestatie die een gepubliceerde manifestatie is, die is gepubliceerd, uitgebracht, uitgevaardigd, gedrukt, gedupliceerd, gegoten etc. of een ongepubliceerde manifestatie die is afgeschreven, gefabriceerd, geconstrueerd etc. gedurende een tijdspanne. @nl
toolkit definition: Egy megjelenési forma, amely egy publikált megjelenési forma, amelyet egy időtartam alatt publikáltak, megjelentettek, kiadtak, kinyomtattak, sokszoroztak, különlenyomatot készítettek róla, terjesztettek stb., vagy egy nem publikált megjelenési forma, amelyet egy időtartam alatt kézzel leírtak, legyártottak, megkonstruáltak stb. @hu
toolkit definition: Eine veröffentlichte Manifestation, die in einem Zeitraum veröffentlicht, freigegeben, herausgegeben, gedruckt, vervielfältigt, gegossen, vertrieben und so weiter wird oder in dem eine unveröffentlichte Manifestation beschriftet, hergestellt, konstruiert und so weiter wird. @de
toolkit definition: En manifestasjon som er en publisert manifestasjon som er publisert, tilgjengeliggjort, utstedt, mangfoldiggjort, kastet, distribuert etc., eller en upublisert manifestasjon som er inskribert, fabrikert, konstruert etc., i løpet av et tidsrom. @no
toolkit definition: Julkaistu manifestaatio, joka on kustannettu, julkaistu, ilmestynyt, painettu, monistettu, valattu kirjasintin osalta, jaettu tms ajanjakson aikana. Julkaisematon manifestaatio, joka on kaiverrettu, valmistettu, koottu tms. ajanjakson aikana. @fi
toolkit definition: Kehastus, mis on sel ajavahemikul avaldatud, välja lastud, välja antud, trükitud, paljundatud, valatud, levitatud vms (avaldatud kehastus) või inskribeeritud, toodetud, ehitatud vms (avaldamata kehastus). @et
toolkit definition: Manifestació que és una manifestació publicada que es publica, es posa en circulació, s’emet, s’imprimeix, es reprodueix, es modela, es distribueix, etc., o una manifestació no publicada que s’inscriu, es fabrica, es construeix, etc., durant un interval de temps. @ca
toolkit definition: Manifestation publiée qui est publiée, mise à disposition, éditée, imprimée, reproduite, moulée, diffusée ou distribuée, etc., ou manifestation non publiée écrite à la main, fabriquée, construite, etc. durant un laps de temps. @fr
toolkit definition: Manifestation, som i løbet af en tidsperiode er publiceret, frigivet, udgivet, trykt, duplikeret, støbt, distribueret ect. i en publiceret form, eller er indskrevet, fremstillet, konstrueret ect. i en upubliceret form. @da
toolkit definition: Manifestazione che è pubblicata, rilasciata, edita, stampata, duplicata, lanciata, distribuita, etc. in forma pubblicata o è incisa, fabbricata, costruita, etc. in forma non pubblicata durante un arco di tempo. @it
toolkit definition: Manifestācija, kas ir publicēta manifestācija, kas ir izdota, drukāta, pavairota, izplatīta u.tml. noteiktā laikposmā, vai kas ir nepublicēta manifestācija, kas ir ierakstīta, izgatavota, izveidota u.tml. noteiktā laikposmā. @lv
toolkit definition: تجسيدة نشرت، أو أطلقت، أو طبعت، أو بثت، أو وزعت، إلخ. في شكل منشور أو دونت، أو صنعت، أو أنشئت، إلخ. في شكل غير منشور خلال فترة زمنية. @ar
toolkit definition: 作为一种出版载体表现在一个时间段被出版、发布、印刷、复制、铸造、发行、经销等、或者一种非出版载体表现在一个时间段被镌刻、制造、构造等的一种载体表现 @zh-hans
toolkit label: Datum einer Manifestation von @de
toolkit label: ajankohta manifestaatiolle @fi
toolkit label: data de manifestació de @ca
toolkit label: data di manifestazione di @it
toolkit label: date d’une manifestation de @fr
toolkit label: date of manifestation of
toolkit label: dato for manifestasjon av @no
toolkit label: dato for manifestation af @da
toolkit label: datum van manifestatie van @nl
toolkit label: gösterim tarihi @tr
toolkit label: ir manifestācijas datējums @lv
toolkit label: kehastuse daatum kehastuses @et
toolkit label: megjelenési forma dátuma @hu
toolkit label: تاريخ تجسيدة لـ @ar
toolkit label: ……的载体表现的日期 @zh-hans
has subproperty: is copyright date of
has subproperty: is date of distribution of
has subproperty: is date of manufacture of
has subproperty: is date of production of
has subproperty: is date of publication of
has subproperty: P70020
lexical alias: dateOfManifestationOf.en
status: Published
type: Property
domain: C10010
label: a következő megjelenési forma dátuma: @hu
label: ajankohta manifestaatiolle @fi
label: er dato for manifestasjon av @no
label: er dato for manifestation af @da
label: est une date d’une manifestation de @fr
label: gösteriminin tarihidir @tr
label: ir manifestācijas datējums @lv
label: is datum van manifestatie van @nl
label: ist Datum einer Manifestation von @de
label: kehastuse daatum kehastuses @et
label: è data di manifestazione di @it
label: és data de manifestació de @ca
label: هي تاريخ تجسيدة لـ @ar
label: 是……的载体表现的日期 @zh-hans
sub property of: has related manifestation of timespan
definition: Bir zaman aralığını, zaman aralığı boyunca yayınlanmış bir biçimde yayınlanan, piyasaya sürülen ve çıkarılan, basılan, çoğaltılan, dağıtılan vb. veya bir zaman aralığı boyunca yayınlanmamış biçimde yazılmış, üretilmiş, yapılmış, vb. olan gösterim ile ilişkilendirir. @tr
definition: Correla un arco di tempo a una manifestazione che è pubblicata, rilasciata, edita, stampata, duplicata, lanciata, distribuita, etc. in forma pubblicata o è incisa, fabbricata, costruita, etc. in forma non pubblicata durante un arco di tempo. @it
definition: Hozzákapcsol egy időtartamot egy megjelenési formához, amelyet egy időtartam alatt publikált formában publikáltak, megjelentettek, kiadtak, kinyomtattak, sokszoroztak, különlenyomatot készítettek róla, terjesztettek stb., vagy egy időtartam alatt nem publikált formában kézzel leírtak, legyártottak, megkonstruáltak stb. @hu
definition: Liittää ajanjakson julkaistuun manifestaatioon, joka on kustannettu, julkaistu, ilmestynyt, painettu, monistettu, valettu kirjasintin osalta, jaettu tms ajanjakson aikana. Liittää ajanjakson julkaisemattomaan manifestaatioon, joka on kaiverrettu, valmistettu, koottu tms. ajanjakson aikana. @fi
definition: Met un laps de temps en relation avec une manifestation publiée qui est publiée, mise à disposition, éditée, imprimée, reproduite, moulée, diffusée ou distribuée, etc., ou manifestation non publiée écrite à la main, fabriquée, construite, etc. durant un laps de temps. @fr
definition: Relaciona un interval de temps amb una manifestació que és una manifestació publicada que es publica, es posa en circulació, s’emet, s’imprimeix, es reprodueix, es modela, es distribueix, etc., o una manifestació no publicada que s’inscriu, es fabrica, es construeix, etc., durant un interval de temps. @ca
definition: Relateert een tijdspanne aan een manifestatie die een gepubliceerde manifestatie is, die is gepubliceerd, uitgebracht, uitgevaardigd, gedrukt, gedupliceerd, gegoten etc. of een ongepubliceerde manifestatie die is afgeschreven, gefabriceerd, geconstrueerd etc. gedurende een tijdspanne. @nl
definition: Relaterer en tidsperiode til en manifestation, som i løbet af en tidsperiode er publiceret, frigivet, udgivet, trykt, duplikeret, støbt, distribueret ect. i en publiceret form, eller er indskrevet, fremstillet, konstrueret ect. i en upubliceret form. @da
definition: Relaterer et tidsrom til en manifestasjon som er en publisert manifestasjon som er publisert, tilgjengeliggjort, utstedt, mangfoldiggjort, kastet, distribuert etc., eller en upublisert manifestasjon som er inskribert, fabrikert, konstruert etc., i løpet av et tidsrom. @no
definition: Relates a timespan to a manifestation that is published, released, issued, printed, duplicated, cast, distributed, etc., in a published form or is inscribed, fabricated, constructed, etc., in a unpublished form during a timespan.
definition: Sasaista laikposmu ar manifestāciju, kas ir publicēta manifestācija, kas ir izdota, drukāta, pavairota, izplatīta u.tml. noteiktā laikposmā, vai kas ir nepublicēta manifestācija, kas ir ierakstīta, izgatavota, izveidota u.tml. noteiktā laikposmā. @lv
definition: Seostab ajavahemiku kehastusega, mis on sel ajavahemikul avaldatud, välja lastud, välja antud, trükitud, paljundatud, valatud, levitatud vms (avaldatud kehastus) või inskribeeritud, toodetud, ehitatud vms (avaldamata kehastus). @et
definition: Setzt einen Zeitraum in Beziehung zu einer veröffentlichten Manifestation, die in einem Zeitraum veröffentlicht, freigegeben, herausgegeben, gedruckt, vervielfältigt, gegossen, vertrieben und so weiter wird oder in dem eine unveröffentlichte Manifestation beschriftet, hergestellt, konstruiert und so weiter wird. @de
definition: تربط بين فترة زمنية وتجسيدة نشرت، أو أطلقت، أو طبعت، أو بثت، أو وزعت، إلخ. في شكل منشور أو دونت، أو صنعت، أو أنشئت، إلخ. في شكل غير منشور خلال فترة زمنية. @ar
definition: 将一个时间段与作为一种出版载体表现在一个时间段被出版、发布、印刷、复制、铸造、发行、经销等、或者一种非出版载体表现在一个时间段被镌刻、制造、构造等的一种载体表现关联起来。 @zh-hans

is epoch of
has element type: 2
toolkit definition: A work that refers to measurements of position for a body or orientation for an orbit.
toolkit definition: Bir kütle için konum veya bir yörünge için yönelineme ilişkin ölçümleri ifade eden bir çalışma. @tr
toolkit definition: Darbs, kas atsaucas uz debess ķermeņa stāvokļa mērījumiem vai orbītas virzienu. @lv
toolkit definition: Een werk dat verwijst naar metingen van positie van een lichaam of oriëntatie voor een baan. @nl
toolkit definition: Egy mű, amely egy test mérési pozíciójára vagy egy keringési pálya orientációjára utal. @hu
toolkit definition: Ein Werk, das Positionsmessungen für einen Körper oder eine Orientierung für eine Umlaufbahn referenziert. @de
toolkit definition: Et verk som viser til målinger av posisjon for et legeme eller orientasjon for en bane. @no
toolkit definition: Obra que fa referència a les mesures de posició d’un cos celeste o l’orientació d’una òrbita. @ca
toolkit definition: Opera che si riferisce alla misurazione della posizione per un corpo o all'orientamento per un'orbita. @it
toolkit definition: Teos, joka viittaa tähtitaivaan kohteiden sijaintien ja ratojen suuntien mittajärjestelmään. @fi
toolkit definition: Teos, milles viidatakse ajale, mille kohta on määratud taevakeha asukoht või orbiidi orientatsioon. @et
toolkit definition: Værk, som henviser til målinger af position for et legeme eller retning for en bane. @da
toolkit definition: Œuvre qui fait référence à des mesures de position d’un corps céleste ou à l’orientation d’une orbite. @fr
toolkit definition: عمل يشير إلى قياسات لوضع لجسم أو لاتجاه لمدار. @ar
toolkit definition: 提及物体位置或运行轨道方位之测量的一种作品 @zh-hans
toolkit label: Epoche von @de
toolkit label: dönem @tr
toolkit label: epoca di @it
toolkit label: epoch of
toolkit label: epohh teoses @et
toolkit label: epoke for @da
toolkit label: epookki teokselle @fi
toolkit label: ir epoha @lv
toolkit label: korszaka: @hu
toolkit label: tijdperk van @nl
toolkit label: època de @ca
toolkit label: époque de @fr
toolkit label: مدة زمنية لـ @ar
toolkit label: ……的历元 @zh-hans
has subproperty: P70021
lexical alias: epochOf.en
status: Published
type: Property
domain: C10010
label: epohh teoses @et
label: epookki teokselle @fi
label: epoğudur @tr
label: er epoke for @da
label: est une époque de @fr
label: ir epoha @lv
label: is tijdperk van @nl
label: ist Epoche von @de
label: korszaka a következőnek: @hu
label: è epoca di @it
label: és època de @ca
label: هي مدة زمنية لـ @ar
label: 是……的历元 @zh-hans
sub property of: has related work of timespan
definition: Bir zaman aralığını, bir cisim için konum veya bir yörünge için yönelim ölçümlerini ifade eden bir eserle ilişkilendirir. @tr
definition: Correla un arco di tempo a un'opera che si riferisce alla misurazione della posizione per un corpo o all'orientamento per un'orbita. @it
definition: Hozzákapcsol egy időtartamot egy műhöz, amely egy test mérési pozíciójára vagy egy keringési pálya orientációjára utal. @hu
definition: Liittää ajanjakson teokseen, joka viittaa tähtitaivaan kohteiden sijaintien ja ratojen suuntien mittajärjestelmään. @fi
definition: Met un laps de temps en relation avec une œuvre qui fait référence à des mesures de position d’un corps céleste ou à l’orientation d’une orbite. @fr
definition: Relaciona un interval de temps amb una obra que fa referència a les mesures de posició d’un cos celeste o l’orientació d’una òrbita. @ca
definition: Relateert een tijdspanne aan een werk dat verwijst naar metingen van positie van een lichaam of oriëntatie voor een baan. @nl
definition: Relaterer en tidsperiode til et værk, som henviser til målinger af position for et legeme eller retning for en bane. @da
definition: Relaterer et tidsrom til et verk som viser til målinger av posisjon for et legeme eller orientasjon for en bane. @no
definition: Relates a timespan to a work that refers to measurements of position for a body or orientation for an orbit.
definition: Sasaista laikposmu ar darbu, kas atsaucas uz debess ķermeņa stāvokļa mērījumiem vai orbītas virzienu. @lv
definition: Seostab ajavahemiku teosega, milles viidatakse ajale, mille kohta on määratud taevakeha asukoht või orbiidi orientatsioon. @et
definition: Setzt einen Zeitraum in Beziehung zu einem Werk, das Positionsmessungen für einen Körper oder eine Orientierung für eine Umlaufbahn referenziert. @de
definition: تربط بين فترة زمنية وعمل يشير إلى قياسات لوضع لجسم أو لاتجاه لمدار. @ar
definition: 将一个时间段与提及物体位置或运行轨道方位之测量的一种作品关联起来。 @zh-hans

is date of work of
has element type: 2
toolkit definition: A work that is associated with the earliest timespan.
toolkit definition: Darbs, kas saistīts ar agrākā darba laikposmu. @lv
toolkit definition: Een werk dat geassocieerd is met de vroegste tijdspanne. @nl
toolkit definition: Egy mű, amelyet egy időtartamhoz társítanak. @hu
toolkit definition: Ein Werk, das mit dem frühesten Zeitraum in Verbindung steht. @de
toolkit definition: En eski zaman aralığıyla bağlantılı olan bir çalışma. @tr
toolkit definition: Et verk som forbindes med det tidligste tidrommet for et verk. @no
toolkit definition: Obra que s’associa amb l’interval de temps més antic. @ca
toolkit definition: Opera che è associata con un arco di tempo precedente di un'opera. @it
toolkit definition: Teos, johon liittyy varhaisin ajanjakso. @fi
toolkit definition: Teos, millega seotud varaseim daatum on see ajavahemik. @et
toolkit definition: Værk, som er knyttet til et værks tidligste tidsperiode. @da
toolkit definition: Œuvre qui est associée au laps de temps le plus ancien. @fr
toolkit definition: عمل مرتبط بفترة زمنية مبكرة لعمل. @ar
toolkit definition: 和最早时间段有关的一种作品 @zh-hans
toolkit label: Datum eines Werks von @de
toolkit label: ajankohta teokselle @fi
toolkit label: data di opera di @it
toolkit label: data d’obra de @ca
toolkit label: date d’une œuvre de @fr
toolkit label: date of work of
toolkit label: dato for verk for @no
toolkit label: dato for værk af @da
toolkit label: datum van werk van @nl
toolkit label: eserin tarihi @tr
toolkit label: ir darba datējums @lv
toolkit label: mű dátuma @hu
toolkit label: teose daatum teoses @et
toolkit label: تاريخ عمل لـ @ar
toolkit label: ……的作品的日期 @zh-hans
has subproperty: is year degree granted of
has subproperty: P70022
lexical alias: dateOfWorkOf.en
status: Published
type: Property
domain: C10010
label: a következő mű dátuma: @hu
label: ajankohta teokselle @fi
label: er dato for verk for @no
label: er dato for værk af @da
label: eserinin tarihidir @tr
label: est une date d’une œuvre de @fr
label: ir darba datējums @lv
label: is datum van werk van @nl
label: ist Datum eines Werks von @de
label: teose daatum teoses @et
label: è data di opera di @it
label: és data d’obra de @ca
label: هي تاريخ عمل لـ @ar
label: 是……的作品的日期 @zh-hans
sub property of: has related work of timespan
definition: Bir zaman aralığını, en eski zaman aralığıyla bağlantılı olanbir eserle ilişkilendirir. @tr
definition: Correla un arco di tempo a un'opera che è associata con un arco di tempo precedente di un'opera. @it
definition: Hozzákapcsol egy időtartamot egy műhöz, amelyet egy időtartamhoz társítanak. @hu
definition: Liittää ajankohdan teokseen, johon liittyy varhaisin ajanjakso. @fi
definition: Met un laps de temps en relation avec une œuvre qui est associée au laps de temps le plus ancien. @fr
definition: Relaciona un interval de temps amb una obra que s’associa amb l’interval de temps més antic. @ca
definition: Relateert een tijdspanne aan een werk dat geassocieerd is met de vroegste tijdspanne. @nl
definition: Relaterer en tidsperiode til et værk, som er knyttet til et værks tidligste tidsperiode. @da
definition: Relaterer et tidsrom til et verk som forbindes med det tidligste tidrommet for et verk. @no
definition: Relates a timespan to a work that is associated with the earliest timespan.
definition: Sasaista laikposmu ar darbu, kas saistīts ar agrākā darba laikposmu. @lv
definition: Seostab ajavahemiku teosega, millega seotud varaseim daatum on see ajavahemik. @et
definition: Setzt einen Zeitraum in Beziehung zu einem Werk, das mit dem frühesten Zeitraum in Verbindung steht. @de
definition: تربط بين فترة زمنية وعمل مرتبط بفترة زمنية مبكرة لعمل. @ar
definition: 将一个时间段与和最早时间段有关的一种作品关联起来。 @zh-hans

is date of capture of
has element type: 2
toolkit definition: An expression that is recorded, filmed, etc., during a timespan.
toolkit definition: Bir zaman aralığı boyunca kaydedilen, filme alınan vb. bir anlatım. @tr
toolkit definition: Een expressie die is opgenomen, gefilmd etc. gedurende een tijdspanne. @nl
toolkit definition: Egy kifejezési forma, amelyet egy időtartam alatt rögzítettek, vettek filmre, stb. @hu
toolkit definition: Eine Expression, die in einem Zeitraum aufgenommen, verfilmt und so weiter wird. @de
toolkit definition: Ekspressio, joka on äänitetty, filmattu tms. ajanjakson aikana. @fi
toolkit definition: Espressione che è registrata, filmata, etc. durante un arco di tempo. @it
toolkit definition: Et uttrykk som er tatt opp, filmet etc. i løpet av et tidsrom. @no
toolkit definition: Expression qui est enregistrée, filmée, etc. durant un laps de temps. @fr
toolkit definition: Expressió que s’enregistra, es filma, etc., durant un interval de temps. @ca
toolkit definition: Izteiksme, kas tikusi ierakstīta, filmēta u. tml. konkrētajā laikposmā. @lv
toolkit definition: Udtryk, som i løbet af en tidsperiode er indspillet, filmet, etc. @da
toolkit definition: Väljendus, mis on sel ajavahemikul salvestatud, filmitud vms. @et
toolkit definition: تعبيرة سجلت، أو صورت، إلخ. خلال فترة زمنية. @ar
toolkit definition: 在一个时间段录制、摄影等的一种内容表达 @zh-hans
toolkit label: Aufzeichnungsdatum von @de
toolkit label: data de captura de @ca
toolkit label: data di registrazione di @it
toolkit label: date de captation de @fr
toolkit label: date of capture of
toolkit label: dato for indspilning af @da
toolkit label: dato for innspilling av @no
toolkit label: datum van vastleggen van @nl
toolkit label: ir tveršanas datējums @lv
toolkit label: jäädvustamise daatum väljenduses @et
toolkit label: kayıt tarihi @tr
toolkit label: rögzítési időpontja: @hu
toolkit label: tallennusajankohta ekspressiolle @fi
toolkit label: تاريخ التقاط لـ @ar
toolkit label: ……的摄录日期 @zh-hans
has subproperty: P70023
lexical alias: dateOfCaptureOf.en
status: Published
type: Property
domain: C10010
label: er dato for indspilning af @da
label: er dato for innspilling av @no
label: est une date de captation de @fr
label: ir tveršanas datējums @lv
label: is datum van vastleggen van @nl
label: ist Aufzeichnungsdatum von @de
label: jäädvustamise daatum väljenduses @et
label: kaydının tarihidir @tr
label: rögzítési időpontja a következőnek: @hu
label: tallennusajankohta ekspressiolle @fi
label: è data di registrazione di @it
label: és data de captura de @ca
label: هو تاريخ التقاط لـ @ar
label: 是……的摄录日期 @zh-hans
sub property of: is date of expression of
definition: Bir zaman aralığını, zaman aralığı boyunca kaydedilen, filme alınan vb. anlatımla ilişkilendirir. @tr
definition: Correla un arco di tempo a un'espressione che è registrata, filmata, etc. durante un arco di tempo. @it
definition: Hozzákapcsol egy időtartamot egy kifejezési formához, amelyet egy időtartam alatt rögzítettek, vettek filmre, stb. @hu
definition: Liittää ajanjakson ekspressioon, joka on äänitetty, filmattu tms. ajanjakson aikana. @fi
definition: Met un laps de temps en relation avec une expression qui est enregistrée, filmée, etc. durant un laps de temps. @fr
definition: Relaciona un interval de temps amb una expressió que s’enregistra, es filma, etc., durant un interval de temps. @ca
definition: Relateert een tijdspanne aan een expressie die is opgenomen, gefilmd etc. gedurende een tijdspanne. @nl
definition: Relaterer en tidsperiode til et udtryk, som i løbet af en tidsperiode er indspillet, filmet, etc. @da
definition: Relaterer et tidsrom til et uttrykk som er tatt opp, filmet etc. i løpet av et tidsrom. @no
definition: Relates a timespan to an expression that is recorded, filmed, etc., during a timespan.
definition: Sasaista laikposmu ar izteiksmi, kas tikusi ierakstīta, filmēta u. tml. konkrētajā laikposmā. @lv
definition: Seostab ajavahemiku väljendusega, mis on sel ajavahemikul salvestatud, filmitud vms. @et
definition: Setzt einen Zeitraum in Beziehung zu einer Expression, die in einem Zeitraum aufgenommen, verfilmt und so weiter wird. @de
definition: تربط بين فترة زمنية وتعبيرة سجلت، أو صورت، إلخ. خلال فترة زمنية. @ar
definition: 将一个时间段与在一个时间段录制、摄影等的一种内容表达关联起来。 @zh-hans

is date of expression of
has element type: 2
toolkit definition: An expression that is associated with the earliest timespan.
toolkit definition: Een expressie die geassocieerd is met de vroegste tijdspanne. @nl
toolkit definition: Egy kifejezési forma, amely kapcsolódik egy legkorábbi időtartamhoz. @hu
toolkit definition: Eine Expression, die mit dem frühesten Zeitraum in Verbindung steht. @de
toolkit definition: Ekspressio, johon liittyy varhaisin ajanjakso. @fi
toolkit definition: En erken zaman aralığıyla bağlantılı olan bir anlatım. @tr
toolkit definition: Espressione che è associata con un arco di tempo precedente di un'espressione. @it
toolkit definition: Et uttrykk som forbindes med det tidligste tidsrommet. @no
toolkit definition: Expression qui est associée au laps de temps le plus ancien. @fr
toolkit definition: Expressió que s’associa amb l’interval de temps més antic. @ca
toolkit definition: Izteiksme, kas ir saistīta ar agrāko laikposmu. @lv
toolkit definition: Udtryk, som er knyttet til den tidligste tidsperiode. @da
toolkit definition: Väljendus, millega seotud varaseim daatum on see ajavahemik. @et
toolkit definition: تعبيرة مرتبطة بفترة زمنية مبكرة. @ar
toolkit definition: 和最早时间段有关的一种内容表达 @zh-hans
toolkit label: Datum einer Expression von @de
toolkit label: ajankohta ekspressiolle @fi
toolkit label: anlatım tarihi @tr
toolkit label: data di espressione di @it
toolkit label: data d’expressió de @ca
toolkit label: date d’une expression de @fr
toolkit label: date of expression of
toolkit label: dato for udtryk af @da
toolkit label: dato for uttrykk av @no
toolkit label: datum van expressie van @nl
toolkit label: ir datējums izteiksmei @lv
toolkit label: kifejezési forma dátuma @hu
toolkit label: väljenduse daatum väljenduses @et
toolkit label: تاريخ تعبيرة @ar
toolkit label: ……的内容表达的日期 @zh-hans
has subproperty: is date of capture of
has subproperty: P70024
lexical alias: dateOfExpressionOf.en
status: Published
type: Property
domain: C10010
label: a következő kifejezési forma dátuma: @hu
label: ajankohta ekspressiolle @fi
label: anlatım tarihidir @tr
label: er dato for udtryk af @da
label: er dato for uttrykk av @no
label: est une date d’une expression de @fr
label: ir datējums izteiksmei @lv
label: is datum van expressie van @nl
label: ist Datum einer Expression von @de
label: väljenduse daatum väljenduses @et
label: è data di espressione di @it
label: és data d’expressió de @ca
label: تاريخ تعبيرة لـ @ar
label: 是……的内容表达的日期 @zh-hans
sub property of: has related expression of timespan
definition: Bir zaman aralığını, en erken zaman aralığıyla bağlantılı olan bir anlatımla ilişkilendirir. @tr
definition: Correla un arco di tempo a un'espressione che è associata con un arco di tempo precedente di un'espressione. @it
definition: Hozzákapcsol egy időtartamot egy kifejezési formához, amely kapcsolódik egy legkorábbi időtartamhoz. @hu
definition: Liittää ajankohdan ekspressioon, johon liittyy varhaisin ajanjakso. @fi
definition: Met un laps de temps en relation avec une expression qui est associée au laps de temps le plus ancien. @fr
definition: Relaciona un interval de temps amb una expressió que s’associa amb l’interval de temps més antic. @ca
definition: Relateert een tijdspanne aan een expressie die geassocieerd is met de vroegste tijdspanne. @nl
definition: Relaterer en tidsperiode til et udtryk, som er knyttet til den tidligste tidsperiode. @da
definition: Relaterer et tidsrom til et uttrykk som forbindes med det tidligste tidsrommet. @no
definition: Relates a timespan to an expression that is associated with the earliest timespan.
definition: Sasaista laikposmu ar izteiksmi, kas ir saistīta ar agrāko laikposmu. @lv
definition: Seostab ajavahemiku väljendusega, millega seotud varaseim daatum on see ajavahemik. @et
definition: Setzt einen Zeitraum in Beziehung zu einer Expression, die mit dem frühesten Zeitraum in Verbindung steht. @de
definition: تربط بين فترة زمنية وتعبيرة مرتبطة بفترة زمنية مبكرة. @ar
definition: 将一个时间段与和最早时间段有关的一种内容表达关联起来。 @zh-hans

is date of distribution of
has element type: 2
toolkit definition: A manifestation that is a published manifestation that is distributed during a timespan.
toolkit definition: Avaldatud kehastus, mida on sel ajavahemikul levitatud. @et
toolkit definition: Bir zaman aralığı boyunca dağıtılan yayınlanmış bir gösterim olan bir gösterim. @tr
toolkit definition: Een manifestatie die een gepubliceerde manifestatie is, die is gedistribueerd gedurende een tijdspanne. @nl
toolkit definition: Egy megjelenési forma, amelyet egy időtartam alatt terjesztenek. @hu
toolkit definition: Eine veröffentlichte Manifestation, die in einem Zeitraum vertrieben wird. @de
toolkit definition: En manifestasjon som er en publisert manifestasjon som er distribuert i løpet av et tidsrom. @no
toolkit definition: Julkaistu manifestaatio, jota on jaettu ajanjakson aikana. @fi
toolkit definition: Manifestació que és una manifestació publicada que es distribueix durant un interval de temps. @ca
toolkit definition: Manifestation publiée qui est diffusée ou distribuée durant un laps de temps. @fr
toolkit definition: Manifestation, som er en publiceret manifestation, som er distribueret i løbet af en tidsperiode. @da
toolkit definition: Manifestazione pubblicata che è distribuita durante un arco di tempo. @it
toolkit definition: Manifestācija, kas ir publicēta manifestācija, kas ir izplatīta laikposmā. @lv
toolkit definition: تجسيدة منشورة وزعت خلال فترة زمنية. @ar
toolkit definition: 作为一种出版载体表现在一个时间段内被发行的一种载体表现 @zh-hans
toolkit label: Vertriebsdatum von @de
toolkit label: data de distribució de @ca
toolkit label: data di distribuzione di @it
toolkit label: date de diffusion ou de distribution de @fr
toolkit label: date of distribution of
toolkit label: dato for distribusjon av @no
toolkit label: dato for distribution af @da
toolkit label: datum van distributie van @nl
toolkit label: dağıtım tarihi @tr
toolkit label: ir izplatīšanas datējums @lv
toolkit label: jakeluaika manifestaatiolle @fi
toolkit label: levitamisaeg kehastuses @et
toolkit label: terjesztési időpontja: @hu
toolkit label: تاريخ توزيع لـ @ar
toolkit label: ……的发行的日期 @zh-hans
has subproperty: P70025
lexical alias: dateOfDistributionOf.en
status: Published
type: Property
domain: C10010
label: dağıtım tarihidir @tr
label: er dato for distribusjon av @no
label: er dato for distribution af @da
label: est une date de diffusion ou de distribution de @fr
label: ir izplatīšanas datējums @lv
label: is datum van distributie van @nl
label: ist Vertriebsdatum von @de
label: jakeluaika manifestaatiolle @fi
label: levitamisaeg kehastuses @et
label: terjesztési időpontja a következőnek: @hu
label: è data di distribuzione di @it
label: és data de distribució de @ca
label: هي تاريخ توزيع لـ @ar
label: 是……的发行的日期 @zh-hans
sub property of: is date of manifestation of
definition: Bir zaman aralığını, zaman aralığı boyunca dağıtılan yayınlanmış bir gösterim olan bir gösterimle ilişkilendirir. @tr
definition: Correla un arco di tempo a una manifestazione pubblicata che è distribuita durante un arco di tempo. @it
definition: Hozzákapcsol egy időtartamot egy kiadott megjelenési formához, amelyet egy időtartam alatt terjesztenek. @hu
definition: Liittää ajankohdan julkaistuun manifestaatioon, jota on jaettu ajanjakson aikana. @fi
definition: Met un laps de temps en relation avec une manifestation publiée qui est diffusée ou distribuée durant un laps de temps. @fr
definition: Relaciona un interval de temps amb una manifestació que és una manifestació publicada que es distribueix durant un interval de temps. @ca
definition: Relateert een tijdspanne aan een manifestatie die een gepubliceerde manifestatie is, die is gedistribueerd gedurende een tijdspanne. @nl
definition: Relaterer en tidsperiode til en manifestation, som er en publiceret manifestation, som er distribueret i løbet af en tidsperiode. @da
definition: Relaterer et tidsrom til en manifestasjon som er en publisert manifestasjon som er distribuert i løpet av et tidsrom. @no
definition: Relates a timespan to a manifestation that is a published manifestation that is distributed during a timespan.
definition: Sasaista laikposmu ar manifestāciju, kas ir publicēta manifestācija, kas ir izplatīta laikposmā. @lv
definition: Seostab ajavahemiku avaldatud kehastusega, mida on sel ajavahemikul levitatud. @et
definition: Setzt einen Zeitraum in Beziehung zu einer veröffentlichten Manifestation, die in einem Zeitraum vertrieben wird. @de
definition: تربط بين فترة زمنية وتجسيدة منشورة وزعت خلال فترة زمنية. @ar
definition: 将一个时间段与作为一种出版载体表现在一个时间段内被发行的一种载体表现关联起来。 @zh-hans

is date of manufacture of
has element type: 2
toolkit definition: A manifestation that is a published manifestation that is printed, duplicated, cast, etc., during a timespan.
toolkit definition: Avaldatud kehastus, mis on sel ajavahemikul trükitud, paljundatud, valatud vms. @et
toolkit definition: Bir zaman aralığı boyunca basılan, çoğaltılan vb. yayınlanmış bir gösterim olan bir gösterim. @tr
toolkit definition: Een manifestatie die een gepubliceerde manifestatie is, die is gedrukt, gedupliceerd, gegoten etc. gedurende een tijdspanne. @nl
toolkit definition: Egy kiadott megjelenési forma, amelyet egy időtartam alatt nyomtattak, sokszorosítottak, öntöttek stb. @hu
toolkit definition: Eine veröffentlichte Manifestation, die in einem Zeitraum gedruckt, vervielfältigt, gegossen und so weiter wird. @de
toolkit definition: En manifestasjon som er en publisert manifestasjon som er trykt, mangfoldiggjort, kastet etc. i løpet av et tidsrom. @no
toolkit definition: Julkaistu manifestaatio, joka on painettu, monistettu, valettu kirjasinten osalta tms. ajanjakson aikana. @fi
toolkit definition: Manifestació que és una manifestació publicada que s’imprimeix, es reprodueix, es modela, etc., durant un interval de temps. @ca
toolkit definition: Manifestation publiée qui est imprimée, reproduite, moulée, etc. durant un laps de temps. @fr
toolkit definition: Manifestation, som er en publiceret manifestation, som i løbet af en tidsperiode er trykt, duplikeret, støbt ect. @da
toolkit definition: Manifestazione pubblicata che è stampata, duplicata, lanciata, etc. durante un arco di tempo. @it
toolkit definition: Manifestācija, kas ir publicēta manifestācija, kas ir iespiesta, pavairota u.tml. noteiktā laikposmā. @lv
toolkit definition: تجسيدة منشورة طبعت، ونسخت، وبثت، إلخ. خلال فترة زمنية. @ar
toolkit definition: 作为一种出版载体表现并在一个时间段被印刷、复制、铸造等的一种载体表现 @zh-hans
toolkit label: Herstellungsdatum von @de
toolkit label: data de fabricació de @ca
toolkit label: data di manifattura di @it
toolkit label: date de fabrication de @fr
toolkit label: date of manufacture of
toolkit label: dato for framstilling av @no
toolkit label: dato for fremstilling af @da
toolkit label: datum van vervaardiging van @nl
toolkit label: gyártási időpontja: @hu
toolkit label: ir ražošanas datējums @lv
toolkit label: valmistamisaeg kehastuses @et
toolkit label: valmistusaika manifestaatiolle @fi
toolkit label: üretim tarihi @tr
toolkit label: تاريخ تصنيع لـ @ar
toolkit label: ……的生产日期 @zh-hans
has subproperty: P70026
lexical alias: dateOfManufactureOf.en
status: Published
type: Property
domain: C10010
label: er dato for framstilling av @no
label: er dato for fremstilling af @da
label: est une date de fabrication de @fr
label: gyártási időpontja a következőnek: @hu
label: ir ražošanas datējums @lv
label: is datum van vervaardiging van @nl
label: ist Herstellungsdatum von @de
label: valmistamisaeg kehastuses @et
label: valmistusaika manifestaatiolle @fi
label: è data di manifattura di @it
label: és data de fabricació de @ca
label: üretim tarihidir @tr
label: هي تاريخ تصنيع لـ @ar
label: 是……的生产日期 @zh-hans
sub property of: is date of manifestation of
definition: Bir zaman aralığını, zaman aralığı boyunca basılan, çoğaltılan, yayınlanan, vb. yayınlanmış bir gösterim olan gösterimle ilişkilendirir. @tr
definition: Correla un arco di tempo a una manifestazione pubblicata che è stampata, duplicata, lanciata, etc. durante un arco di tempo. @it
definition: Hozzákapcsol egy időtartamot egy kiadott megjelenési formához, amelyet egy időtartam alatt nyomtattak, sokszorosítottak, öntöttek stb. @hu
definition: Liittää ajankohdan julkaistuun manifestaatioon, joka on painettu, monistettu, valettu kirjasinten osalta tms. ajanjakson aikana. @fi
definition: Met un laps de temps en relation avec une manifestation publiée qui est imprimée, reproduite, moulée, etc. durant un laps de temps. @fr
definition: Relaciona un interval de temps amb una manifestació que és una manifestació publicada que s’imprimeix, es reprodueix, es modela, etc., durant un interval de temps. @ca
definition: Relateert een tijdspanne aan een manifestatie die een gepubliceerde manifestatie is, die is gedrukt, gedupliceerd, gegoten etc. gedurende een tijdspanne. @nl
definition: Relaterer en tidsperiode til en manifestation, som er en publiceret manifestation, som i løbet af en tidsperiode er trykt, duplikeret, støbt ect. @da
definition: Relaterer et tidsrom til en manifestasjon som er en publisert manifestasjon som er trykt, mangfoldiggjort, kastet etc. i løpet av et tidsrom. @no
definition: Relates a timespan to a manifestation that is a published manifestation that is printed, duplicated, cast, etc., during a timespan.
definition: Sasaista laikposmu ar manifestāciju, kas ir publicēta manifestācija, kas ir iespiesta, pavairota u.tml. noteiktā laikposmā. @lv
definition: Seostab ajavahemiku avaldatud kehastusega, mis on sel ajavahemikul trükitud, paljundatud, valatud vms. @et
definition: Setzt einen Zeitraum in Beziehung zu einer veröffentlichten Manifestation, die in einem Zeitraum gedruckt, vervielfältigt, gegossen und so weiter wird. @de
definition: تربط بين فترة زمنية وتجسيدة منشورة طبعت، ونسخت، وبثت، إلخ. خلال فترة زمنية. @ar
definition: 将一个时间段与作为一种出版载体表现并在一个时间段被印刷、复制、铸造等的一种载体表现关联起来。 @zh-hans

is date of production of
has element type: 2
toolkit definition: A manifestation that is an unpublished manifestation that is inscribed, fabricated, constructed, etc., during a timespan.
toolkit definition: Avaldamata kehastus, mis on sel ajavahemikul inskribeeritud, toodetud, ehitatud vms. @et
toolkit definition: Bir zaman aralığı boyunca yazılan, üretilen, yapılandırılan, vb. yayınlanmamış bir gösterim olan bir gösterim. @tr
toolkit definition: Een manifestatie die een ongepubliceerde manifestatie is die is afgeschreven, gefabriceerd, geconstrueerd etc. gedurende een tijdspanne. @nl
toolkit definition: Egy kiadatlan megjelenési forma, amelyet egy időtartam alatt írtak, készítettek, szerkesztettek stb. @hu
toolkit definition: Eine unveröffentlichte Manifestation, die in einem Zeitraum beschriftet, fabriziert, konstruiert und so weiter wird. @de
toolkit definition: En manifestasjon som er en upublisert manifestasjon som er inskribert, fabrikert, konstruert etc. i løpet av et tidsrom. @no
toolkit definition: Julkaisematon manifestaatio, joka on kaiverrettu, valmistettu, koottu tms. ajanjakson aikana. @fi
toolkit definition: Manifestació que és una manifestació no publicada que s’inscriu, es fabrica, es construeix, etc., durant un interval de temps. @ca
toolkit definition: Manifestation non publiée qui est écrite à la main, fabriquée, construite, etc. durant un laps de temps. @fr
toolkit definition: Manifestation, som er en upubliceret manifestation, som i løbet af en tidsperiode er indskrevet, fremstillet, konstrueret ect. @da
toolkit definition: Manifestazione non pubblicata che è incisa, fabbricata, costruita, etc. durante un arco di tempo. @it
toolkit definition: Nepublicētā manifestācija, kas laikposmā tiek uzrakstīta, izgatavota u.tml. @lv
toolkit definition: تجسيدة دونت، أو صنعت، أو أنشئت، إلخ. في شكل غير منشور خلال فترة زمنية. @ar
toolkit definition: 作为一种非出版载体表现并在一个时间段镌刻、制造、构建等的一种载体表现 @zh-hans
toolkit label: Entstehungsdatum von @de
toolkit label: data de producció de @ca
toolkit label: data di produzione di @it
toolkit label: date de production de @fr
toolkit label: date of production of
toolkit label: dato for produksjon av @no
toolkit label: dato for produktion af @da
toolkit label: datum van productie van @nl
toolkit label: imalat tarihi @tr
toolkit label: ir izgatavošanas datējums @lv
toolkit label: létrehozási időpontja: @hu
toolkit label: tootmisaeg kehastuses @et
toolkit label: tuotantoaika manifestaatiolle @fi
toolkit label: تاريخ إنتاج لـ @ar
toolkit label: ……的制作日期 @zh-hans
has subproperty: P70027
lexical alias: dateOfProductionOf.en
status: Published
type: Property
domain: C10010
label: er dato for produksjon av @no
label: er dato for produktion af @da
label: est une date de production de @fr
label: ir izgatavošanas datējums @lv
label: is datum van productie van @nl
label: ist Entstehungsdatum von @de
label: létrehozási időpontja a következőnek: @hu
label: tootmisaeg kehastuses @et
label: tuotantoaika manifestaatiolle @fi
label: yapım tarihidir @tr
label: è data di produzione di @it
label: és data de producció de @ca
label: هي تاريخ إنتاج لـ @ar
label: 是……的制作日期 @zh-hans
sub property of: is date of manifestation of
definition: Bir zaman aralığını, zaman aralığı boyunca tescil edilen, imal edilen, yapılandırılan yayınlanmamış bir gösterim olan bir gösterimle ilişkilendirir. @tr
definition: Correla un arco di tempo a una manifestazione non pubblicata che è incisa, fabbricata, costruita, etc. durante un arco di tempo. @it
definition: Hozzákapcsol egy időtartamot egy kiadatlan megjelenési formához, amelyet egy időtartam alatt írtak, készítettek, szerkesztettek stb. @hu
definition: Liittää ajanjakson julkaisemattomaan manifestaatioon, joka on kaiverrettu, valmistettu, koottu tms. ajanjakson aikana. @fi
definition: Met un laps de temps en relation avec une manifestation non publiée qui est écrite à la main, fabriquée, construite, etc. durant un laps de temps. @fr
definition: Relaciona un interval de temps amb una manifestació que és una manifestació no publicada que s’inscriu, es fabrica, es construeix, etc., durant un interval de temps. @ca
definition: Relateert een tijdspanne aan een manifestatie die een ongepubliceerde manifestatie is die is afgeschreven, gefabriceerd, geconstrueerd etc. gedurende een tijdspanne. @nl
definition: Relaterer en tidsperiode til en manifestation, som er en upubliceret manifestation, som i løbet af en tidsperiode er indskrevet, fremstillet, konstrueret ect. @da
definition: Relaterer et tidsrom til en manifestasjon som er en upublisert manifestasjon som er inskribert, fabrikert, konstruert etc. i løpet av et tidsrom. @no
definition: Relates a timespan to a manifestation that is an unpublished manifestation that is inscribed, fabricated, constructed, etc., during a timespan.
definition: Sasaista laikposmu ar manifestāciju, kas ir nepublicētā manifestācija, kas laikposmā tiek uzrakstīta, izgatavota u.tml. @lv
definition: Seostab ajavahemiku avaldamata kehastusega, mis on sel ajavahemikul inskribeeritud, toodetud, ehitatud vms. @et
definition: Setzt einen Zeitraum in Beziehung zu einer unveröffentlichten Manifestation, die in einem Zeitraum beschriftet, fabriziert, konstruiert und so weiter wird. @de
definition: تربط بين فترة زمنية وتجسيدة دونت، أو صنعت، أو أنشئت، إلخ. في شكل غير منشور خلال فترة زمنية. @ar
definition: 将一个时间段与作为一种非出版载体表现并在一个时间段镌刻、制造、构建等的一种载体表现关联起来。 @zh-hans

is date of publication of
has element type: 2
toolkit definition: A manifestation that is published, released, or issued in a published form during a timespan.
toolkit definition: Bir zaman aralığında yayımlanan, piyasaya sürülen veya yayınlanmış bir biçimde sunulan bir gösterim. @tr
toolkit definition: Een manifestatie die gepubliceerd, uitgebracht of uitgevaardigd is in een gepubliceerde vorm gedurende een tijdspanne. @nl
toolkit definition: Egy megjelenési forma, amelyet egy időtartam alatt publikált formában kiadtak, kibocsájtottak vagy megjelentettek. @hu
toolkit definition: Eine Manifestation, die in einem Zeitraum in veröffentlichter Form veröffentlicht, freigeschaltet oder herausgegeben wird. @de
toolkit definition: En manifestasjon som er en publisert, tilgjengeliggjort eller utstedt i en publisert form i løpet av et tidsrom. @no
toolkit definition: Julkaistu manifestaatio, joka on kustannettu, julkaistu, ilmestynyt tms. ajanjakson aikana. @fi
toolkit definition: Kehastus, mis on sel ajavahemikul avaldatud, välja lastud või välja antud. @et
toolkit definition: Manifestació que es publica, es posa en circulació o s’emet en una forma publicada durant un interval de temps. @ca
toolkit definition: Manifestation qui est publiée, mise à disposition ou éditée durant un laps de temps. @fr
toolkit definition: Manifestation, som i løbet af en tidsperiode er publiceret, frigivet eller udgivet i en publiceret form. @da
toolkit definition: Manifestazione pubblicata, rilasciata o edita in forma pubblicata durante un arco di tempo. @it
toolkit definition: Manifestācija, kas ir publicēta, izlaista vai izdota noteiktā laikposmā. @lv
toolkit definition: تجسيدة نشرت، أو أطلقت، أو طبعت، أو بثت، أو وزعت، إلخ. في شكل منشور خلال فترة زمنية. @ar
toolkit definition: 在一个时间段以出版形式被出版、发布或发行的一种载体表现 @zh-hans
toolkit label: Erscheinungsdatum von @de
toolkit label: data de publicació de @ca
toolkit label: data di pubblicazione di @it
toolkit label: date de publication de @fr
toolkit label: date of publication of
toolkit label: dato for publisering av @no
toolkit label: dato for udgivelse af @da
toolkit label: datum van publicatie van @nl
toolkit label: ilmumisaasta kehastuses @et
toolkit label: ir izdošanas datējums manifestācijai @lv
toolkit label: julkaisuaika manifestaatiolle @fi
toolkit label: kiadási időpontja: @hu
toolkit label: yayınlanma tarihi @tr
toolkit label: تاريخ نشر لـ @ar
toolkit label: ……的出版日期 @zh-hans
has subproperty: P70028
lexical alias: dateOfPublicationOf.en
status: Published
type: Property
domain: C10010
label: er dato for publisering av @no
label: er dato for udgivelse af @da
label: est une date de publication de @fr
label: ilmumisaasta kehastuses @et
label: ir izdošanas datējums manifestācijai @lv
label: is datum van publicatie van @nl
label: ist Erscheinungsdatum von @de
label: julkaisuaika manifestaatiolle @fi
label: kiadási időpontja a következőnek: @hu
label: yayınlanma tarihidir @tr
label: è data di pubblicazione di @it
label: és data de publicació de @ca
label: هي تاريخ نشر لـ @ar
label: 是……的出版日期 @zh-hans
sub property of: is date of manifestation of
definition: Bir zaman aralığını, zaman aralığında yayınlanan, piyasaya sürülen veya yayınlanmış bir biçimde piyasaya çıkarılan gösterimle ilişkilendirir. @tr
definition: Correla un arco di tempo a una manifestazione pubblicata, rilasciata o edita in forma pubblicata durante un arco di tempo. @it
definition: Hozzákapcsol egy időtartamot egy kiadott megjelenési formához, amelyet egy időtartam alatt publikált formában kiadtak, kibocsájtottak vagy megjelentettek. @hu
definition: Liittää ajanjakson julkaistuun manifestaatioon, joka on kustannettu, julkaistu, ilmestynyt tms. ajanjakson aikana. @fi
definition: Met un laps de temps en relation avec une manifestation qui est publiée, mise à disposition ou éditée durant un laps de temps. @fr
definition: Relaciona un interval de temps amb una manifestació que es publica, es posa en circulació, o s’emet en una forma publicada durant un interval de temps. @ca
definition: Relateert een tijdspanne aan een manifestatie die gepubliceerd, uitgebracht of uitgevaardigd is in een gepubliceerde vorm gedurende een tijdspanne. @nl
definition: Relaterer en tidsperiode til en manifestation, som i løbet af en tidsperiode er publiceret, frigivet eller udgivet i en publiceret form. @da
definition: Relaterer et tidsrom til en manifestasjon som er en publisert, tilgjengeliggjort eller utstedt i en publisert form i løpet av et tidsrom. @no
definition: Relates a timespan to a manifestation that is published, released, or issued in a published form during a timespan.
definition: Sasaista laikposmu ar manifestāciju, kas ir publicēta, izlaista vai izdota noteiktā laikposmā. @lv
definition: Seostab ajavahemiku kehastusega, mis on sel ajavahemikul avaldatud, välja lastud või välja antud. @et
definition: Setzt einen Zeitraum in Beziehung zu einer Manifestation, die in einem Zeitraum in veröffentlichter Form veröffentlicht, freigeschaltet oder herausgegeben wird. @de
definition: تربط بين فترة زمنية وتجسيدة نشرت، أو أطلقت، أو طبعت، أو بثت، أو وزعت، إلخ. في شكل منشور خلال فترة زمنية. @ar
definition: 将一个时间段与在一个时间段以出版形式被出版、发布或发行的一种载体表现关联起来。 @zh-hans

is date of birth of
has element type: 2
toolkit definition: A person who was born during a timespan.
toolkit definition: Een persoon die geboren werd gedurende een tijdspanne. @nl
toolkit definition: Egy személy, aki egy időtartam alatt született. @hu
toolkit definition: Eine Person, die in einem Zeitraum geboren wurde. @de
toolkit definition: En person som ble født i løpet av et tidsrom. @no
toolkit definition: Henkilö, joka syntyi ajanjakson aikana. @fi
toolkit definition: Isik, kes on sündinud sel ajavahemikul. @et
toolkit definition: Person, som blev født i løbet af en tidsperiode. @da
toolkit definition: Persona che è nata durante un arco di tempo. @it
toolkit definition: Persona que va néixer durant un interval de temps. @ca
toolkit definition: Persona, kura dzimusi laikposmā. @lv
toolkit definition: Personne qui est née durant un laps de temps. @fr
toolkit definition: Zaman aralığında doğan kişi. @tr
toolkit definition: شخص وُلد خلال فترة زمنية. @ar
toolkit definition: 在一个时间段出生的一个个人 @zh-hans
toolkit label: Geburtsdatum von @de
toolkit label: data de naixement de @ca
toolkit label: data di nascita di @it
toolkit label: date de naissance de @fr
toolkit label: date of birth of
toolkit label: doğum tarihi @tr
toolkit label: fødselsdato af @da
toolkit label: fødselsdato for @no
toolkit label: geboortedatum van @nl
toolkit label: ir dzimis @lv
toolkit label: syntymäaika henkilölle @fi
toolkit label: születési időpontja: @hu
toolkit label: sünnidaatum isikule @et
toolkit label: تاريخ ميلاد لـ @ar
toolkit label: ……的出生日期 @zh-hans
has subproperty: P70029
lexical alias: dateOfBirthOf.en
status: Published
type: Property
domain: C10010
label: doğum tarihidir @tr
label: er fødselsdato af @da
label: er fødselsdato for @no
label: est une date de naissance de @fr
label: ir dzimis @lv
label: is geboortedatum van @nl
label: ist Geburtsdatum von @de
label: syntymäaika henkilölle @fi
label: születési időpontja a következőnek: @hu
label: sünnidaatum isikule @et
label: è data di nascita di @it
label: és data de naixement de @ca
label: هي تاريخ ميلاد لـ @ar
label: 是……的出生日期 @zh-hans
sub property of: has related person of timespan
definition: Bir zaman aralığını, zaman aralığında doğan bir kişiyle ilişkilendirir. @tr
definition: Correla un arco di tempo a una persona che è nata durante un arco di tempo. @it
definition: Hozzákapcsol egy időtartamot egy személyhez, aki egy időtartam alatt született. @hu
definition: Liittää ajanjakson henkilöön, joka syntyi ajanjakson aikana. @fi
definition: Met un laps de temps en relation avec une personne qui est née durant un laps de temps. @fr
definition: Relaciona un interval de temps amb una persona que va néixer durant un interval de temps. @ca
definition: Relateert een tijdspanne aan een persoon die geboren werd gedurende een tijdspanne. @nl
definition: Relaterer en tidsperiode til en person, som blev født i løbet af en tidsperiode. @da
definition: Relaterer et tidsrom til en person som ble født i løpet av et tidsrom. @no
definition: Relates a timespan to a person who was born during a timespan.
definition: Sasaista laikposmu ar personu, kura dzimusi laikposmā. @lv
definition: Seostab ajavahemiku isikuga, kes on sündinud sel ajavahemikul. @et
definition: Setzt einen Zeitraum in Beziehung zu einer Person, die in einem Zeitraum geboren wurde. @de
definition: تربط بين فترة زمنية وشخص وُلد خلال فترة زمنية. @ar
definition: 将一个时间段与在一个时间段出生的一个个人关联起来。 @zh-hans

is date of death of
has element type: 2
toolkit definition: A person who died during a timespan.
toolkit definition: Een persoon die stierf gedurende een tijdspanne. @nl
toolkit definition: Egy személy, aki egy időtartam alatt hunyt el. @hu
toolkit definition: Eine Person, die in einem Zeitraum gestorben ist. @de
toolkit definition: En person som døde i løpet av et tidsrom. @no
toolkit definition: Henkilö, joka kuoli ajanjakson aikana. @fi
toolkit definition: Isik, kes on surnud sel ajavahemikul. @et
toolkit definition: Person, som døde i løbet af en tidsperiode. @da
toolkit definition: Persona que va morir durant un interval de temps. @ca
toolkit definition: Persona, kura mirusi konkrētajā laikposmā. @lv
toolkit definition: Personne qui est morte durant un laps de temps. @fr
toolkit definition: Zaman aralığında ölen kişi. @tr
toolkit definition: persona che è morta durante un arco di tempo. @it
toolkit definition: شخص توفي خلال فترة زمنية. @ar
toolkit definition: 在一个时间段死亡的一个个人 @zh-hans
toolkit label: Sterbedatum von @de
toolkit label: data de defunció de @ca
toolkit label: data di morte di @it
toolkit label: date de décès de @fr
toolkit label: date of death of
toolkit label: dødsdato af @da
toolkit label: dødsdato for @no
toolkit label: halálozási időpontja: @hu
toolkit label: ir miris @lv
toolkit label: kuolinaika henkilölle @fi
toolkit label: sterfdatum van @nl
toolkit label: surmadaatum isikule @et
toolkit label: ölüm tarihi @tr
toolkit label: تاريخ وفاة لـ @ar
toolkit label: ……的死亡日期 @zh-hans
has subproperty: P70030
lexical alias: dateOfDeathOf.en
status: Published
type: Property
domain: C10010
label: er dødsdato af @da
label: er dødsdato for @no
label: est une date de décès de @fr
label: halálozási időpontja a következőnek: @hu
label: ir miris @lv
label: is sterfdatum van @nl
label: ist Sterbedatum von @de
label: kuolinaika henkilölle @fi
label: surmadaatum isikule @et
label: è data di morte di @it
label: és data de defunció de @ca
label: ölüm tarihidir @tr
label: هي تاريخ وفاة لـ @ar
label: 是……的死亡日期 @zh-hans
sub property of: has related person of timespan
definition: Bir zaman aralığını, zaman aralığında ölen bir kişiyle ilişkilendirir. @tr
definition: Correla un arco di tempo a una persona che è morta durante un arco di tempo. @it
definition: Hozzákapcsol egy időtartamot egy személyhez, aki egy időtartam alatt hunyt el. @hu
definition: Liittää ajanjakson henkilöön, joka kuoli ajanjakson aikana. @fi
definition: Met un laps de temps en relation avec une personne qui est morte durant un laps de temps. @fr
definition: Relaciona un interval de temps amb una persona que va morir durant un interval de temps. @ca
definition: Relateert een tijdspanne aan een persoon die stierf gedurende een tijdspanne. @nl
definition: Relaterer en tidsperiode til en person, som døde i løbet af en tidsperiode. @da
definition: Relaterer et tidsrom til en person som døde i løpet av et tidsrom. @no
definition: Relates a timespan to a person who died during a timespan.
definition: Sasaista laikposmu ar personu, kura mirusi konkrētajā laikposmā. @lv
definition: Seostab ajavahemiku isikuga, kes on surnud sel ajavahemikul. @et
definition: Setzt einen Zeitraum in Beziehung zu einer Person, die in einem Zeitraum gestorben ist. @de
definition: تربط بين فترة زمنية وشخص توفي خلال فترة زمنية. @ar
definition: 将一个时间段与在一个时间段死亡的一个个人关联起来。 @zh-hans

is date of conference of
has element type: 2
toolkit definition: A corporate body who is a conference, exhibition, or other formally named and convened event that is held during a timespan.
toolkit definition: Bir zaman aralığında düzenlenen bir konferans, fuar veya resmi olarak adlandırılmış ve düzenlenmiş başka bir faaliyet olan tüzel kişilik. @tr
toolkit definition: Collectivité qui consiste en un congrès, une exposition ou un autre événement formellement nommé et convoqué qui se tient durant un laps de temps. @fr
toolkit definition: Conferenza, mostra, o altro evento che dà luogo a un'opera che è tenuto durante un arco di tempo. @it
toolkit definition: Een corporatie die is een conferentie, tentoonstelling of ander formeel benoemde en samengekomen gebeurtenis die gehouden is gedurende een tijdspanne. @nl
toolkit definition: Egy testület, amely egy konferencia, egy kiállítás vagy egyéb formálisan megnevezett és szervezett esemény, amelyet egy időtartam alatt tartottak. @hu
toolkit definition: Eine Körperschaft, bei der es sich um eine Konferenz, Ausstellung oder andere formal benannte und einberufene Veranstaltung handelt, die während eines Zeitraums stattfindet. @de
toolkit definition: En konferanse, utstilling eller annet arrangement som gir opphav til et verk som blir avholdt i løpet av et tidsrom. @no
toolkit definition: Entitat corporativa que és un congrés, una exposició o qualsevol altre esdeveniment formalment esmentat i convocat i que té lloc durant un interval de temps. @ca
toolkit definition: Konference, izstāde vai cits pasākums konkrētajā laikposmā. @lv
toolkit definition: Konference, udstilling eller anden begivenhed, som afholdes i løbet af en tidsperiode og som giver anledning til et værk. @da
toolkit definition: Sel ajavahemikul peetud konverents, näitus vm üritus, mis paneb aluse teosele. @et
toolkit definition: Yhteisö, joka on ajanjakson aikana järjestetty konferenssi, näyttely tai muu tilaisuus. @fi
toolkit definition: هيئة عبارة عن مؤتمر، أو معرض، أو حدث آخر سمي وعقد خلال فترة زمنية. @ar
toolkit definition: 作为在一个时间段中举行的会议、展览或其他正式命名并举办的活动的一个团体 @zh-hans
toolkit label: Datum einer Konferenz von @de
toolkit label: ajankohta konferenssille @fi
toolkit label: data de congrés de @ca
toolkit label: data di conferenza di @it
toolkit label: date de congrès de @fr
toolkit label: date of conference of
toolkit label: dato for konference af @da
toolkit label: datum van conferentie van @nl
toolkit label: időpontja a következő konferenciának: @hu
toolkit label: ir datējums pasākumam @lv
toolkit label: konferans tarihi @tr
toolkit label: konferansedato for @no
toolkit label: toimumisaeg konverentsile @et
toolkit label: تاريخ مؤتمر لـ @ar
toolkit label: ……的会议的日期 @zh-hans
has subproperty: P70031
lexical alias: dateOfConferenceOf.en
status: Published
type: Property
domain: C10010
label: ajankohta konferenssille @fi
label: er dato for konference af @da
label: er konferansedato for @no
label: est une date de congrès de @fr
label: időpontja a következő konferenciának: @hu
label: ir datējums pasākumam @lv
label: is datum van conferentie van @nl
label: ist Datum einer Konferenz von @de
label: konferansının tarihidir @tr
label: toimumisaeg konverentsile @et
label: è data di conferenza di @it
label: és data de congrés de @ca
label: هي تاريخ مؤتمر لـ @ar
label: 是……的会议的日期 @zh-hans
sub property of: has related corporate body of timespan
definition: Bir zaman aralığını, bir zaman aralığında düzenlenen bir konferans, fuar veya resmi olarak adlandırılmış ve düzenlenmiş başka bir faaliyet olan tüzel kişi ile ilişkilendirir. @tr
definition: Correla un arco di tempo a un conferenza, mostra, o altro evento che dà luogo a un'opera che è tenuto durante un arco di tempo. @it
definition: Egy időtartamot hozzákapcsol egy testülethez, amely egy konferencia, egy kiállítás vagy egyéb formálisan megnevezett és szervezett esemény, amelyet egy időtartam alatt tartottak. @hu
definition: Liittää ajanjakson yhteisöön, joka on ajanjakson aikana järjestetty konferenssi, näyttely tai muu tilaisuus. @fi
definition: Met un laps de temps en relation avec une collectivité qui consiste en un congrès, une exposition ou un autre événement formellement nommé et convoqué qui se tient durant un laps de temps. @fr
definition: Relaciona un interval de temps amb una entitat corporativa que és un congrés, una exposició o qualsevol altre esdeveniment formalment esmentat i convocat i que té lloc durant un interval de temps. @ca
definition: Relateert een tijdspanne aan een corporatie die is een conferentie, tentoonstelling of ander formeel benoemde en samengekomen gebeurtenis die gehouden is gedurende een tijdspanne. @nl
definition: Relaterer en tidsperiode til en konference, udstilling eller anden begivenhed, som afholdes i løbet af en tidsperiode og som giver anledning til et værk. @da
definition: Relaterer et tidsrom til en konferanse, utstilling eller annet arrangement som gir opphav til et verk som blir avholdt i løpet av et tidsrom. @no
definition: Relates a timespan to a corporate body who is a conference, exhibition, or other formally named and convened event that is held during a timespan.
definition: Sasaista laikposmu ar institūciju, kas ir konference, izstāde vai cits pasākums konkrētajā laikposmā. @lv
definition: Seostab ajavahemiku sel ajavahemikul peetud konverentsi, näituse vm üritusega, mis paneb aluse teosele. @et
definition: Setzt einen Zeitraum in Beziehung zu einer Körperschaft, bei der es sich um eine Konferenz, Ausstellung oder andere formal benannte und einberufene Veranstaltung handelt, die während eines Zeitraums stattfindet. @de
definition: تربط بين فترة زمنية وهيئة عبارة عن مؤتمر، أو معرض، أو حدث آخر سمي وعقد رسميا خلال فترة زمنية. @ar
definition: 将一个时间段与作为在一个时间段中举行的会议、展览或其他正式命名并举办的活动的一个团体关联起来。 @zh-hans

is date of establishment of
has element type: 2
toolkit definition: A corporate body who is established or founded during a timespan.
toolkit definition: Asutus, mis on asutatud sel ajavahemikul. @et
toolkit definition: Collectivité qui est établie ou fondée durant un laps de temps. @fr
toolkit definition: Een corporatie die gevestigd of opgericht is gedurende een tijdspanne. @nl
toolkit definition: Egy testület, amelyet egy időtartam alatt alapítottak vagy létesítettek. @hu
toolkit definition: Eine Körperschaft, die in einem Zeitraum eingeführt oder gegründet wurde. @de
toolkit definition: En korporasjon som blir etablert eller grunnlagt i et tidsrom. @no
toolkit definition: Ente che è istituito o fondato durante un arco di tempo. @it
toolkit definition: Entitat corporativa que es crea o funda durant un interval de temps. @ca
toolkit definition: Korporation, som i løbet af en tidsperiode er etableret eller grundlagt. @da
toolkit definition: Laikposms, kurā tiek nodibināta vai dibināta institūcija. @lv
toolkit definition: Yhteisö, joka on perustettu ajanjakson aikana. @fi
toolkit definition: Zaman aralığı sırasında kurulan tüzel kişilik. @tr
toolkit definition: هيئة أُنشئت أو أسست خلال فترة زمنية. @ar
toolkit definition: 在一个时间段中成立或创办的一个团体 @zh-hans
toolkit label: Gründungsdatum von @de
toolkit label: alapítási időpontja: @hu
toolkit label: asutamisaeg asutusele @et
toolkit label: data de creació de @ca
toolkit label: data di istituzione di @it
toolkit label: date de fondation de @fr
toolkit label: date of establishment of
toolkit label: dato for etablering af @da
toolkit label: dato for etablering av @no
toolkit label: datum van oprichting van @nl
toolkit label: ir nodibināšanas datējums @lv
toolkit label: kuruluş tarihi @tr
toolkit label: perustamisaika yhteisölle @fi
toolkit label: تاريخ إنشاء لـ @ar
toolkit label: ……的成立的日期 @zh-hans
has subproperty: P70032
lexical alias: dateOfEstablishmentOf.en
status: Published
type: Property
domain: C10010
label: alapítási időpontja a következőnek: @hu
label: asutamisaeg asutusele @et
label: er dato for etablering af @da
label: er dato for etablering av @no
label: est une date de fondation de @fr
label: ir nodibināšanas datējums @lv
label: is datum van oprichting van @nl
label: ist Gründungsdatum von @de
label: kuruluşunun tarihidir @tr
label: perustamisaika yhteisölle @fi
label: è data di istituzione di @it
label: és data de creació de @ca
label: هي تاريخ إنشاء لـ @ar
label: 是……的成立的日期 @zh-hans
sub property of: has related corporate body of timespan
definition: Bir zaman aralığını, zaman aralığı sırasında tesis edilen veya kurulan bir tüzel kişi ile ilişkilendirir. @tr
definition: Correla un arco di tempo a un ente che è istituito o fondato durante un arco di tempo. @it
definition: Hozzákapcsol egy időtartamot egy testülethez, amelyet egy időtartam alatt alapítottak vagy létesítettek. @hu
definition: Liittää ajanjakson yhteisöön, joka on perustettu ajanjakson aikana. @fi
definition: Met un laps de temps en relation avec une collectivité qui est établie ou fondée durant un laps de temps. @fr
definition: Relaciona un interval de temps amb una entitat corporativa que es crea o funda durant un interval de temps. @ca
definition: Relateert een tijdspanne aan een corporatie die gevestigd of opgericht is gedurende een tijdspanne. @nl
definition: Relaterer en tidsperiode til en korporation, som i løbet af en tidsperiode er etableret eller grundlagt. @da
definition: Relaterer et tidsrom til en korporasjon som blir etablert eller grunnlagt i et tidsrom. @no
definition: Relates a timespan to a corporate body who is established or founded during a timespan.
definition: Sasaista laikposmu ar institūciju, kas tiek nodibināta vai dibināta konkrētā laikposmā. @lv
definition: Seostab ajavahemiku asutusega, mis on asutatud sel ajavahemikul. @et
definition: Setzt einen Zeitraum in Beziehung zu einer Körperschaft, die in einem Zeitraum eingeführt oder gegründet wurde. @de
definition: تربط بين فترة زمنية وهيئة أُنشئت أو أسست خلال فترة زمنية. @ar
definition: 将一个时间段与在一个时间段中成立或创办的一个团体关联起来。 @zh-hans

is date of termination of
has element type: 2
toolkit definition: A corporate body who is terminated or dissolved during a timespan.
toolkit definition: Asutus, mille tegevus on lõpetatud sel ajavahemikul. @et
toolkit definition: Bir zaman aralığı sırasında sonlandırılan veya feshedilen bir tüzel kişilik. @tr
toolkit definition: Collectivité qui cesse son activité ou est dissoute durant un laps de temps. @fr
toolkit definition: Een corporatie die beëindigd of ontbonden is gedurende een tijdspanne. @nl
toolkit definition: Egy testület, amelyet egy időtartam alatt szüntettek meg vagy oszlattak fel. @hu
toolkit definition: Eine Körperschaft, die in einem Zeitraum aufgehoben oder aufgelöst wurde. @de
toolkit definition: En korporasjon som blir avviklet eller oppløst i løpet av et tidsrom. @no
toolkit definition: Ente che è finito o si è sciolto durante un arco di tempo. @it
toolkit definition: Entitat corporativa que cessa o es dissol durant un interval de temps. @ca
toolkit definition: Institūcija, kas beidz pastāvēt vai likvidēta laikposmā. @lv
toolkit definition: Korporation, som i løbet af et tidsforløb er ophørt eller opløst. @da
toolkit definition: Yhteisö, joka on lakkautettu tai hajotettu ajanjakson aikana. @fi
toolkit definition: هيئة توقفت أو حُلَّت خلال فترة زمنية. @ar
toolkit definition: 在一个时间段中终止或解散的一个团体 @zh-hans
toolkit label: Auflösungsdatum von @de
toolkit label: data de cessament de @ca
toolkit label: data di fine di @it
toolkit label: date de cessation de @fr
toolkit label: date of termination of
toolkit label: dato for avvikling @no
toolkit label: dato for ophør af @da
toolkit label: datum van opheffing van @nl
toolkit label: ir beidzis pastāvēt @lv
toolkit label: lakkauttamisaika yhteisölle @fi
toolkit label: megszűnési időpontja: @hu
toolkit label: sonlandırma tarihi @tr
toolkit label: tegevuse lõpetamise aeg asutusele @et
toolkit label: تاريخ توقف لـ @ar
toolkit label: ……的终止的日期 @zh-hans
has subproperty: P70033
lexical alias: dateOfTerminationOf.en
status: Published
type: Property
domain: C10010
label: er dato for avvikling @no
label: er dato for ophør af @da
label: est une date de cessation de @fr
label: ir beidzis pastāvēt @lv
label: is datum van opheffing van @nl
label: ist Auflösungsdatum von @de
label: lakkauttamisaika yhteisölle @fi
label: megszűnési időpontja a következőnek: @hu
label: sonlanma tarihidir @tr
label: tegevuse lõpetamise aeg asutusele @et
label: è data di fine di @it
label: és data de cessament de @ca
label: هي تاريخ توقف لـ @ar
label: 是……的终止的日期 @zh-hans
sub property of: has related corporate body of timespan
definition: Bir zaman aralığını, zaman aralığı sırasında sonlandırılan veya feshedilen bir tüzel kişi ile ilişkilendirir. @tr
definition: Correla un arco di tempo a un ente che è finito o si è sciolto durante un arco di tempo. @it
definition: Hozzákapcsol egy időtartamot egy testülethez, amelyet egy időtartam alatt szüntettek meg vagy oszlattak fel. @hu
definition: Liittää ajanjakson yhteisöön, joka on lakkautettu tai hajotettu ajanjakson aikana. @fi
definition: Met un laps de temps en relation avec une collectivité qui cesse son activité ou est dissoute durant un laps de temps. @fr
definition: Relaciona un interval de temps amb una entitat corporativa que cessa o es dissol durant un interval de temps. @ca
definition: Relateert een tijdspanne aan een corporatie die beëindigd of ontbonden is gedurende een tijdspanne. @nl
definition: Relaterer et tidsforløb til en korporation, som i løbet af en tidsperiode er ophørt eller opløst. @da
definition: Relaterer et tidsrom til en korporasjon som blir avviklet eller oppløst i løpet av et tidsrom. @no
definition: Relates a timespan to a corporate body who is terminated or dissolved during a timespan.
definition: Sasaista laikposmu ar institūciju, kas beidz pastāvēt vai likvidēta laikposmā. @lv
definition: Seostab ajavahemiku asutusega, mille tegevus on lõpetatud sel ajavahemikul. @et
definition: Setzt einen Zeitraum in Beziehung zu einer Körperschaft, die in einem Zeitraum aufgehoben oder aufgelöst wurde. @de
definition: تربط بين فترة زمنية وهيئة توقفت أو حُلَّت خلال فترة زمنية. @ar
definition: 将一个时间段与在一个时间段中终止或解散的一个团体关联起来。 @zh-hans

is part of timespan
has element type: 2
toolkit definition: A timespan that has another timespan as a discrete component.
toolkit definition: Ajanjakso, jonka itsenäisenä osana on toinen ajanjakso. @fi
toolkit definition: Ajavahemik, mille eraldi osaks on teine ajavahemik. @et
toolkit definition: Arco di tempo che ha un altro arco di tempo come componente distinta. @it
toolkit definition: Ayrık bir bileşen olarak başka bir zaman aralığına sahip olan zaman aralığı. @tr
toolkit definition: Een tijdspanne die een andere tijdspanne heeft als een afzonderlijk deel. @nl
toolkit definition: Egy időtartam, amelynek egy másik időtartam elkülöníthető alkotóelemként a része. @hu
toolkit definition: Ein Zeitraum, der einen anderen Zeitraum als einzelnen Bestandteil enthält. @de
toolkit definition: Et tidsrom som har et annet tidsrom som en avgrenset del. @no
toolkit definition: Interval de temps que té un altre interval de temps com a component discret. @ca
toolkit definition: Laikposms, kuram ir cits laikposms kā atsevišķa sastāvdaļa. @lv
toolkit definition: Laps de temps qui a pour composante distincte un autre laps de temps. @fr
toolkit definition: Tidsforløb, som har et andet tidsforløb som en adskilt komponent. @da
toolkit definition: فترة زمنية لها فترة زمنية أخرى كعنصر منفصل. @ar
toolkit definition: 有另一个时间段作为其独立组成部分的一个时间段 @zh-hans
toolkit label: Teil von (Zeitraum) @de
toolkit label: daļa laikposmā @lv
toolkit label: deel van tijdspanne @nl
toolkit label: del af tidsforløb @da
toolkit label: del av tidsrom @no
toolkit label: osa ajanjaksosta @fi
toolkit label: osa ajavahemikust @et
toolkit label: part d’un interval de temps @ca
toolkit label: part of timespan
toolkit label: parte di arco di tempo @it
toolkit label: partie de laps de temps de @fr
toolkit label: része a következő időtartamnak: @hu
toolkit label: zaman aralığının bölümü @tr
toolkit label: جزء من فترة زمنية @ar
toolkit label: 时间段的部分 @zh-hans
has subproperty: is beginning of
has subproperty: is ending of
has subproperty: P70034
lexical alias: partOfTimespan.en
status: Published
type: Property
domain: C10010
label: er del af tidsforløb @da
label: er del av tidsrom @no
label: est une partie de laps de temps de @fr
label: ir daļa laikposmā @lv
label: is deel van tijdspanne @nl
label: ist Teil von (Zeitraum) @de
label: osa ajanjaksosta @fi
label: osa ajavahemikust @et
label: része a következő időtartamnak: @hu
label: zaman aralığının bir bileşenidir @tr
label: è parte di arco di tempo @it
label: és part d’un interval de temps @ca
label: هي جزء من فترة زمنية @ar
label: 是时间段的部分 @zh-hans
sub property of: has related timespan of timespan
definition: Bir zaman aralığını, ayrık bileşen olarak başka bir zaman aralığına sahip olan bir zaman aralığıyla ilişkilendirir. @tr
definition: Correla un arco di tempo a un arco di tempo che ha un altro arco di tempo come componente separata. @it
definition: Hozzákapcsol egy időtartamot egy időtartamhoz, amelynek egy másik időtartam elkülöníthető alkotóelemként a része. @hu
definition: Liittää ajanjakson ajanjaksoon, jonka itsenäisenä osana on toinen ajanjakso. @fi
definition: Met un laps de temps en relation avec un laps de temps qui a pour composante distincte un autre laps de temps. @fr
definition: Relaciona un interval de temps amb un interval de temps que té un altre interval de temps com a component discret. @ca
definition: Relateert een tijdspanne aan een tijdspanne die een andere tijdspanne heeft als een afzonderlijk deel. @nl
definition: Relaterer et tidsforløb til et tidsforløb, som har et andet tidsforløb som en adskilt komponent. @da
definition: Relaterer et tidsrom til et tidsrom som har et annet tidsrom som en avgrenset del. @no
definition: Relates a timespan to a timespan that has another timespan as a discrete component.
definition: Sasaista laikposmu ar laikposmu, kuram ir cits laikposms kā atsevišķa sastāvdaļa. @lv
definition: Seostab ajavahemiku ajavahemikuga, mille eraldi osaks on teine ajavahemik. @et
definition: Setzt einen Zeitraum in Beziehung zu einem Zeitraum, der einen anderen Zeitraum als einzelnen Bestandteil enthält. @de
definition: تربط بين فترة زمنية وفترة زمنية لها فترة زمنية أخرى كعنصر منفصل. @ar
definition: 将一个时间段与有另一个时间段作为其独立组成部分的一个时间段关联起来。 @zh-hans

has part timespan
has element type: 2
toolkit definition: A timespan that is a discrete component of another timespan.
toolkit definition: Ajanjakso, joka on toisen ajanjakson itsenäinen osa. @fi
toolkit definition: Ajavahemik, mis on teise ajavahemiku eraldi osa. @et
toolkit definition: Arco di tempo che è una componente distinta di un altro arco di tempo. @it
toolkit definition: Başka bir zaman aralığının ayrık bir bileşeni olan bir zaman aralığı. @tr
toolkit definition: Een tijdspanne die een afzonderlijk deel is van een andere tijdspanne. @nl
toolkit definition: Egy időtartam, amely egy másik időtartam elkülöníthető alkotóeleme. @hu
toolkit definition: Ein Zeitraum , der ein eigenständiger Bestandteil von einem anderen Zeitraum ist. @de
toolkit definition: Et tidsrom som er en avgrenset del av et annet tidsrom. @no
toolkit definition: Interval de temps que és un component discret d’un altre interval de temps. @ca
toolkit definition: Laikposms, kas ir cita laikposma atsevišķa sastāvdaļa. @lv
toolkit definition: Laps de temps qui constitue une composante distincte d’un autre laps de temps. @fr
toolkit definition: Tidsforløb, som er en adskilt komponent af et andet tidsforløb. @da
toolkit definition: فترة زمنية عبارة عن عنصر منفصل عن فترة زمنية أخرى. @ar
toolkit definition: 作为另一个时间段的独立组成部分的一个时间段 @zh-hans
toolkit label: Teil-Zeitraum @de
toolkit label: Zaman aralığının bölümü @tr
toolkit label: ajanjakson osa @fi
toolkit label: ajavahemiku osa @et
toolkit label: deel tijdspanne @nl
toolkit label: del af tidforløb @da
toolkit label: del av tidsrom @no
toolkit label: időtartamrésze: @hu
toolkit label: interval de temps de part @ca
toolkit label: laikposms: daļa @lv
toolkit label: part timespan
toolkit label: parte di un arco di tempo @it
toolkit label: partie de laps de temps @fr
toolkit label: فترة زمنية جزئية @ar
toolkit label: 部分时间段 @zh-hans
has subproperty: has beginning
has subproperty: has ending
has subproperty: P70035
lexical alias: partTimespan.en
status: Published
type: Property
domain: C10010
label: a pour partie de laps de temps @fr
label: ajanjakson osa @fi
label: ajavahemiku osa @et
label: ha come parte arco di tempo @it
label: har del af tidsperiode @da
label: har del av tidsrom @no
label: hat Teil-Zeitraum @de
label: heeft deel tijdspanne @nl
label: időtartamrésze a következő: @hu
label: laikposms: daļa @lv
label: té com a interval de temps de part @ca
label: zaman aralığı bileşeni ile ilişkilidir @tr
label: لها فترة زمنية جزئية @ar
label: 有部分时间段 @zh-hans
sub property of: has related timespan of timespan
definition: Bir zaman aralığını, başka bir zaman aralığının ayrık bileşeni olan bir zaman aralığıyla ilişkilendirir.. @tr
definition: Correla un arco di tempo a un arco di tempo che è una componente distinta di un altro arco di tempo. @it
definition: Hozzákapcsol egy időtartamot egy időtartamhoz, amely egy másik időtartam elkülöníthető alkotóeleme. @hu
definition: Liittää ajanjakson ajanjaksoon, joka on toisen ajanjakson itsenäinen osa. @fi
definition: Met un laps de temps en relation avec un laps de temps qui constitue une composante distincte d’un autre laps de temps. @fr
definition: Relaciona un interval de temps amb un interval de temps que és un component discret d’un altre interval de temps. @ca
definition: Relateert een tijdspanne aan een tijdspanne die een afzonderlijk deel is van een andere tijdspanne. @nl
definition: Relaterer et tidsforløb til en tidsperiode, som er en adskilt komponent af et andet tidsforløb. @da
definition: Relaterer et tidsrom til et tidsrom som er en avgrenset del av et annet tidsrom. @no
definition: Relates a timespan to a timespan that is a discrete component of another timespan.
definition: Sasaista laikposmu ar laikposmu, kas ir cita laikposma atsevišķa sastāvdaļa. @lv
definition: Seostab ajavahemiku ajavahemikuga, mis on teise ajavahemiku eraldi osa. @et
definition: Setzt einen Zeitraum in Beziehung zu einem Zeitraum, der ein eigenständiger Bestandteil von einem anderen Zeitraum ist. @de
definition: تربط بين فترة زمنية وفترة زمنية عبارة عن عنصر منفصل عن فترة زمنية أخرى. @ar
definition: 将一个时间段与作为另一个时间段的独立组成部分的一个时间段关联起来。 @zh-hans

is date associated with corporate body of (Deprecated)
has element type: 2
has subproperty: P70036
status: Deprecated
type: Property

is date associated with family of (Deprecated)
has element type: 2
has subproperty: P70037
status: Deprecated
type: Property

is date associated with person of (Deprecated)
has element type: 2
toolkit definition: A person who has a significant association with a timespan. (Deprecated)
toolkit label: date associated with person of (Deprecated)
has subproperty: P70038
lexical alias: dateAssociatedWithPersonOf.en
status: Deprecated
type: Property
domain: C10010
sub property of: has related person of timespan
definition: Relates a timespan to a person who has a significant association with a timespan. (Deprecated)

has beginning
has element type: 3
toolkit definition: A timespan that is the time at which a timespan starts.
toolkit definition: Aeg, millest ajavahemik algab. @et
toolkit definition: Ajankohta, joka on aika, jolloin ajanjakso alkaa. @fi
toolkit definition: Az az időpont, amikor az időtartam kezdődik. @hu
toolkit definition: Een tijdspanne die is het tijdstip waarop een tijdspanne begint. @nl
toolkit definition: Ein Zeitraum, bei dem es sich um den Zeitpunkt handelt, an dem ein Zeitraum beginnt. @de
toolkit definition: Interval de temps que és el moment en què comença un interval de temps. @ca
toolkit definition: Laps de temps qui constitue le moment auquel un laps de temps commence. @fr
toolkit definition: Momento in cui l'arco di tempo inizia. @it
toolkit definition: Sākuma laiks. @lv
toolkit definition: Tidspunkt, hvor tidsforløbet starter. @da
toolkit definition: Tidspunktet når tidsrommet starter. @no
toolkit definition: Zaman aralığının başladığı an olan bir zaman aralığı. @tr
toolkit definition: فترة زمنية عبارة عن زمن تبدأ فيه فترة زمنية. @ar
toolkit definition: 作为一个时间段开始时间的一个时间段 @zh-hans
toolkit label: Anfang @de
toolkit label: ajanjakson alku @fi
toolkit label: ajavahemiku algus @et
toolkit label: başlangıç @tr
toolkit label: begin @nl
toolkit label: beginning
toolkit label: begyndelse @da
toolkit label: begynnelse @no
toolkit label: début @fr
toolkit label: inici @ca
toolkit label: inizio @it
toolkit label: kezdete: @hu
toolkit label: sākums @lv
toolkit label: بداية @ar
toolkit label: 开始 @zh-hans
has subproperty: P70039
lexical alias: beginning.en
status: Published
type: Property
domain: C10010
label: a pour début @fr
label: ajanjakson alku @fi
label: ajavahemiku algus @et
label: başlangıç ile ilişkilidir @tr
label: ha come inizio @it
label: har begyndelse @da
label: har begynnelse @no
label: hat Anfang @de
label: heeft begin @nl
label: kezdete a következő: @hu
label: sākums @lv
label: té com a inici @ca
label: لها بداية @ar
label: 有开始 @zh-hans
sub property of: has part timespan
definition: Bir zaman aralığını, zaman aralığının başladığı zaman olan bir zaman aralığıyla ilişkilendirir. @tr
definition: Correla un arco di tempo al momento in cui l'arco di tempo inizia. @it
definition: Hozzákapcsol egy időtartamot ahhoz az időponthoz, amikor az időtartam kezdődik. @hu
definition: Liittää ajanjakson ajanjaksoon, joka on aika, jolloin ajanjakso alkaa. @fi
definition: Met un laps de temps en relation avec un laps de temps qui constitue le moment auquel un laps de temps commence. @fr
definition: Relaciona un interval de temps amb un interval de temps que és el moment en què comença un interval de temps. @ca
definition: Relateert een tijdspanne aan een tijdspanne die is het tijdstip waarop een tijdspanne begint. @nl
definition: Relaterer et tidsforløb til det tidspunkt, hvor tidsforløbet starter. @da
definition: Relaterer et tidsrom til tidspunktet når tidsrommet starter. @no
definition: Relates a timespan to a timespan that is the time at which a timespan starts.
definition: Sasaista laikposmu ar laikposmu, kas ir sākuma laiks. @lv
definition: Seostab ajavahemiku ajaga, millest ajavahemik algab. @et
definition: Setzt einen Zeitraum in Beziehung zu einem Zeitraum, bei dem es sich um den Zeitpunkt handelt, an dem ein Zeitraum beginnt. @de
definition: تربط بين فترة زمنية وفترة زمنية عبارة عن زمن تبدأ فيه فترة زمنية. @ar
definition: 将一个时间段与作为一个时间段开始时间的一个时间段关联起来。 @zh-hans
scope note: A time may be represented at different levels of granularity by a calendrical timespan.
scope note: Aega võib esitada kalendriajas eri täpsusega. @et
scope note: Aika voidaan esittää kalenterin ajanjakson hienojakoisuuden eri tasoilla. @fi
scope note: Een tijdstip kan vertegenwoordigd worden op diverse niveaus van granulariteit door een tijdspanne gebaseerd op een kalender. @nl
scope note: Ein Zeitpunkt kann durch einen kalendarischen Zeitraum auf verschiedenen Ebenen der Granularität dargestellt werden. @de
scope note: Különböző szintű részletességgel, naptári időtartammal ábrázolt idő. @hu
scope note: Laiku var attēlot dažādos līmeņos, izmantojot kalendāra laika periodu. @lv
scope note: Tidspunkt kan repræsenteres på forskellige granularitetsniveauer ved et kalendrisk tidsrum. @da
scope note: Un moment peut être représenté à différents niveaux de granularité par un laps de temps calendaire. @fr
scope note: Un temps es pot representar a diferents nivells de granularitat mitjançant un interval de temps del calendari. @ca
scope note: Zaman, takvimsel bir zaman aralığı ile farklı ayrıntı düzeylerinde temsil edilebilir. @tr
scope note: زمن يمكن تمثيله على مستويات تقسيم مختلفة من خلال فترة زمنية تقويمية. @ar
scope note: 一个时间可以用日历时间段的不同颗粒度层级表示。 @zh-hans

has ending
has element type: 3
toolkit definition: A timespan that is the time at which a timespan finishes.
toolkit definition: Aeg, millal ajavahemik lõpeb. @et
toolkit definition: Ajanjakso, joka on aika, jolloin ajanjakso loppuu. @fi
toolkit definition: Brīdis, kurā beidzas laikposms. @lv
toolkit definition: Een tijdspanne die is het tijdstip waarop de tijdspanne eindigt. @nl
toolkit definition: Egy időpont, amikor az időtartam befejeződik. @hu
toolkit definition: Ein Zeitraum, bei dem es sich um den Zeitpunkt handelt, an dem ein Zeitraum endet. @de
toolkit definition: Interval de temps que és el moment en què finalitza un interval de temps. @ca
toolkit definition: Laps de temps qui constitue le moment auquel un laps de temps se termine. @fr
toolkit definition: Momento in cui l'arco di tempo finisce. @it
toolkit definition: Tidspunkt, hvor tidsperioden slutter. @da
toolkit definition: Tidspunktet når tidsrommet slutter. @no
toolkit definition: Zaman aralığının sonlandığı an olan bir zaman aralığı. @tr
toolkit definition: فترة زمنية عبارة عن زمن تنتهي فيه فترة زمنية. @ar
toolkit definition: 作为一个时间段结束时间的一个时间段 @zh-hans
toolkit label: Ende @de
toolkit label: ajanjakson loppu @fi
toolkit label: ajavahemiku lõpp @et
toolkit label: befejezése: @hu
toolkit label: beigas @lv
toolkit label: einde @nl
toolkit label: ending
toolkit label: fin @fr
toolkit label: final @ca
toolkit label: fine @it
toolkit label: slutning @da
toolkit label: slutt @no
toolkit label: son @tr
toolkit label: نهاية @ar
toolkit label: 结束 @zh-hans
has subproperty: P70040
lexical alias: ending.en
status: Published
type: Property
domain: C10010
label: a pour fin @fr
label: ajanjakson loppu @fi
label: ajavahemiku lõpp @et
label: befejezése a következő: @hu
label: beigas @lv
label: bitiş ile ilişkilidir @tr
label: ha come fine @it
label: har slutning @da
label: har slutt @no
label: hat Ende @de
label: heeft einde @nl
label: té com a final @ca
label: لها نهاية @ar
label: 有结束 @zh-hans
sub property of: has part timespan
definition: Bir zaman aralığını, zaman aralığının bittiği zaman olan bir zaman aralığıyla ilişkilendirir. @tr
definition: Correla un arco di tempo al momento in cui l'arco di tempo finisce. @it
definition: Hozzákapcsol egy időpontot egy időponthoz, amikor az időtartam befejeződik. @hu
definition: Liittää ajanjakson ajanjaksoon, joka on aika, jolloin ajanjakso loppuu. @fi
definition: Met un laps de temps en relation avec un laps de temps qui constitue le moment auquel un laps de temps se termine. @fr
definition: Relaciona un interval de temps amb un interval de temps que és el moment en què finalitza un interval de temps. @ca
definition: Relateert een tijdspanne aan een tijdspanne die is het tijdstip waarop de tijdspanne eindigt. @nl
definition: Relaterer en tidsperiode til det tidspunkt, hvor tidsperioden slutter. @da
definition: Relaterer et tidsrom til tidspunktet når tidsrommet slutter. @no
definition: Relates a timespan to a timespan that is the time at which a timespan finishes.
definition: Sasaista laikposmu ar laikposmu, kas ir beigu laiks. @lv
definition: Seostab ajavahemiku ajaga, millal ajavahemik lõpeb. @et
definition: Setzt einen Zeitraum in Beziehung zu einem Zeitraum, bei dem es sich um den Zeitpunkt handelt, an dem ein Zeitraum endet. @de
definition: تربط بين فترة زمنية وفترة زمنية عبارة عن زمن تنتهي فيه فترة زمنية. @ar
definition: 将一个时间段与作为一个时间段结束时间的一个时间段关联起来。 @zh-hans
scope note: A time may be represented at different levels of granularity by a calendrical timespan.
scope note: Aega võib esitada kalendriajas eri täpsusega. @et
scope note: Ajankohta voidaan esittää kalenteriajan eri tarkkuustasoilla. @fi
scope note: Een tijdstip kan vertegenwoordigd worden op diverse niveaus van granulariteit door een tijdspanne gebaseerd op een kalender. @nl
scope note: Ein Zeitpunkt kann durch einen kalendarischen Zeitraum auf verschiedenen Ebenen der Granularität dargestellt werden. @de
scope note: Et tidspunkt kan representeres ved ulike detaljeringsnivå etter et kalendarisk tidsrom. @no
scope note: Et tidspunkt kan være med forskellige detaljeringsniveauer for en kalendarisk tidsperiode. @da
scope note: Különböző szintű részletességgel, naptári időtartammal ábrázolt idő. @hu
scope note: Laiku var attēlot dažādās detalizācijas pakāpēs, izmantojot kalendāro laika skaitīšanu. @lv
scope note: Un moment peut être représenté à différents niveaux de granularité par un laps de temps calendaire. @fr
scope note: Un momento può essere rappresentato a diversi livelli di granularità da un arco di tempo calendaristico @it
scope note: Un temps es pot representar a diferents nivells de granularitat mitjançant un interval de temps del calendari. @ca
scope note: Zaman, takvimsel bir zaman aralığı ile farklı ayrıntı düzeylerinde temsil edilebilir. @tr

is duration of (Deprecated)
has element type: 3
toolkit definition: An expression that has an extent of expression that is a playing time, performance time, running time, or other timespan. (Deprecated)
toolkit definition: Een expressie die een omvang van expressie heeft die een speelduur, uitvoeringsduur, looptijd of andere tijdspanne is. @nl
toolkit definition: Egy kifejezési forma, amely rendelkezik egy kifejezésiforma-terjedelemmel, ami egy lejátszási idő, futási idő vagy egyéb időtartam. @hu
toolkit definition: Ekspressio, jonka kesto on soittoaika, esitysaika, toistoaika tai muu ajanjakso. @fi
toolkit definition: Espressione che ha una estensione di espressione che è un tempo di gioco, tempo di interpretazione, durata o altro arco di tempo. @it
toolkit definition: Et uttrykk som har et omfang for uttrykk som er en spilletid, framføringstid, avspillingstid eller annet tidsrom. @no
toolkit definition: Expression qui possède une étendue d’une expression consistant en une durée de lecture, d’exécution, de projection, etc. ou en un autre laps de temps. @fr
toolkit definition: Expression, die über einen Umfang einer Expression verfügt, bei dem es sich um eine Wiedergabezeit, eine Aufführungszeit, eine Laufzeit oder einen anderen Zeitraum handelt. @de
toolkit definition: Expressió que té una extensió d’expressió que és un temps de reproducció, de projecció, d’execució o qualsevol altre interval de temps. @ca
toolkit definition: Udtryk, som har et omfang af et udtryk, som er en varighed, opførelsestid, spilletid etc. eller anden tidsperiode. @da
toolkit definition: Väljendus, millel on väljenduse maht, milleks on mängimisaeg, esituse aeg, töötamisaeg või muu ajavahemik. @et
toolkit definition: تعبيرة لها امتداد لتعبيرة هو زمن التشغيل، أو زمن الأداء، أو زمن الدوران، أو أي فترة زمنية أخرى. @ar
toolkit label: Dauer von @de
toolkit label: durada de @ca
toolkit label: durata di @it
toolkit label: duration of (Deprecated)
toolkit label: durée de @fr
toolkit label: duur van @nl
toolkit label: kesto ekspressiolle @fi
toolkit label: kestus väljenduses @et
toolkit label: spilletid for @da
toolkit label: tartama @hu
toolkit label: varighet for @no
toolkit label: فترة لـ @ar
has subproperty: P70041
lexical alias: durationOf.en
status: Deprecated
type: Property
domain: C10010
label: a következő tartama: @hu
label: er spilletid for @da
label: er varighet for @no
label: est une durée de @fr
label: is duur van @nl
label: ist Dauer von @de
label: kesto ekspressiolle @fi
label: kestus väljenduses @et
label: è durata di @it
label: és durada de @ca
label: هي فترة لـ @ar
sub property of: has related expression of timespan
definition: Correla un arco di tempo a un'espressione che ha una estensione di espressione che è un tempo di gioco, tempo di interpretazione, durata o altro arco di tempo. @it
definition: Egy időtartamot hozzákapcsol egy kifejezési formához, amely rendelkezik egy kifejezésiforma-terjedelemmel, ami egy lejátszási idő, futási idő vagy egyéb időtartam. @hu
definition: Liittää ajanjakson ekspressioon, jonka kesto on soittoaika, esitysaika, toistoaika tai muu ajanjakso. @fi
definition: Met un laps de temps en relation avec une expression qui possède une étendue d’une expression consistant en une durée de lecture, d’exécution, de projection, etc. ou en un autre laps de temps. @fr
definition: Relaciona un interval de temps amb una expressió que té una extensió d’expressió que és un temps de reproducció, de projecció, d’execució o qualsevol altre interval de temps. @ca
definition: Relateert een tijdspanne aan een expressie die een omvang van expressie heeft die een speelduur, uitvoeringsduur, looptijd of andere tijdspanne is. @nl
definition: Relaterer en tidsperiode til et udtryk, som har et omfang af et udtryk, som er en varighed, opførelsestid, spilletid etc. eller anden tidsperiode. @da
definition: Relaterer et tidsrom til et uttrykk som har et omfang for uttrykk som er en spilletid, framføringstid, avspillingstid eller annet tidsrom. @no
definition: Relates a timespan to an expression that has an extent of expression that is a playing time, performance time, running time, or other timespan. (Deprecated)
definition: Seostab ajavahemiku väljendusega, millel on väljenduse maht, milleks on mängimisaeg, esituse aeg, töötamisaeg või muu ajavahemik. @et
definition: Setzt einen Zeitraum in Beziehung zu einer Expression, die über einen Umfang einer Expression verfügt, bei dem es sich um eine Wiedergabezeit, eine Aufführungszeit, eine Laufzeit oder einen anderen Zeitraum handelt. @de
definition: تربط بين فترة زمنية وتعبيرة لها امتداد لتعبيرة هو زمن التشغيل، أو زمن الأداء، أو زمن الدوران، أو أي فترة زمنية أخرى. @ar

is equinox of
has element type: 2
toolkit definition: A work that uses a point of intersection of the ecliptic and the celestial equator, occupied by the sun when its declination is 0°.
toolkit definition: Darbs, kurā tiek izmantots ekliptikas un debess ekvatora krustošanās punkts, kad tā novirze ir 0 °. @lv
toolkit definition: Een werk dat een snijpunt gebruikt van de evenaar en de hemelevenaar ingenomen door de zon als zijn declinatie 0° is. @nl
toolkit definition: Egy mű, amely a nappálya és az egyenlítő metszéspontját használja, amit a nap akkor foglal el, amikor a deklinációja 0°. @hu
toolkit definition: Ein Werk, das einen von zwei Kreuzungspunkten der Sonnenbahn und des Himmelsäquators verwendet, die von der Sonne überquert werden, wenn ihre Deklination 0° beträgt. @de
toolkit definition: Et verk som bruker et skjæringspunkt mellom solbanen og himmelekvator, der solen befinner seg når deklinasjonen dens er 0°. @no
toolkit definition: Güneş'in 0° deklinasyonda bulunduğu, ekliptik ile gök ekvatorunun kesişim noktasını kullanan bir eser @tr
toolkit definition: Obra que usa un punt d’intersecció de l’eclíptica i de l’equador celeste, ocupat pel sol quan la seva declinació és de 0º. @ca
toolkit definition: Opera che usa un punto di intersezione dell'eclittica e dell'equatore celeste, occupato dal sole quanto la sua declinazione è 0°. @it
toolkit definition: Teos, joka käyttää ekliptikan ja taivaanekvaattorin leikkauspistettä, jossa aurinko on, kun sen deklinaatio on 0°. @fi
toolkit definition: Teos, milles kasutatakse aega, millal Päike läbib ekliptika ja taevaekvaatori lõikepunkti, kui Päikese kääne on 0° @et
toolkit definition: Værk, som bruger et skæringspunkt mellem ekliptika og himlens ækvator, hvor solen befinder sig, når dens deklination er 0°. @da
toolkit definition: Œuvre qui utilise un point d’intersection de l’écliptique et de l’équateur céleste, occupé par le soleil quand sa déclinaison est de 0°. @fr
toolkit definition: عمل يستخدم نقطة تقاطع مسار الشمس مع خط الاستواء السماوي، عندما يكون انحراف الشمس عند صفر 0°. @ar
toolkit definition: 当太阳的赤纬角度为0时其所占黄道和天赤道的一个交叉点 @zh-hans
toolkit label: eknikoks @tr
toolkit label: equinocci de @ca
toolkit label: equinox of
toolkit label: equinox van @nl
toolkit label: equinozio di @it
toolkit label: ir ekvinokcija @lv
toolkit label: jevndøgn for @no
toolkit label: jævndøgn for @da
toolkit label: napéjegyenlősége: @hu
toolkit label: tasauspiste teokselle @fi
toolkit label: võrdpäevsus teoses @et
toolkit label: Äquinoktium von @de
toolkit label: équinoxe de @fr
toolkit label: اعتدال لـ @ar
toolkit label: ……的二分点 @zh-hans
has subproperty: P70042
lexical alias: equinoxOf.en
status: Published
type: Property
domain: C10010
label: ekinoksudur @tr
label: er jevndøgn for @no
label: er jævndøgn for @da
label: est une équinoxe de @fr
label: ir ekvinokcija @lv
label: is equinox van @nl
label: ist Äquinoktium von @de
label: napéjegyenlősége a következőnek: @hu
label: tasauspiste teokselle @fi
label: võrdpäevsus teoses @et
label: è equinozio di @it
label: és equinocci de @ca
label: هي اعتدال لـ @ar
label: 是……的二分点 @zh-hans
sub property of: has related work of timespan
alternative label: dag- en nachtvermelding @nl
definition: Bir zaman aralığını, güneşin sapmasının 0° olduğu anda ekliptik ve gök ekvatorunun kesişme noktasını kullanan bir eserle ilişkilendirir. @tr
definition: Correla un arco di tempo a un'opera che usa un punto di intersezione dell'eclittica e dell'equatore celeste, occupato dal sole quanto la sua declinazione è 0°. @it
definition: Hozzákapcsol egy időtartamot egy műhöz, amely a nappálya és az egyenlítő metszéspontját használja, amit a nap akkor foglal el, amikor a deklinációja 0°. @hu
definition: Liittää ajanjakson teokseen, joka käyttää ekliptikan ja taivaanekvaattorin leikkauspistettä, jossa aurinko on, kun sen deklinaatio on 0°. @fi
definition: Met un laps de temps en relation avec une œuvre qui utilise un point d’intersection de l’écliptique et de l’équateur céleste, occupé par le soleil quand sa déclinaison est de 0°. @fr
definition: Relaciona un interval de temps amb una obra que usa un punt d’intersecció de l’eclíptica i de l’equador celeste, ocupat pel sol quan la seva declinació és de 0º. @ca
definition: Relateert een tijdspanne aan een werk dat een snijpunt gebruikt van de evenaar en de hemelevenaar ingenomen door de zon als zijn declinatie 0° is. @nl
definition: Relaterer en tidsperiode til et værk, som bruger et skæringspunkt mellem ekliptika og himlens ækvator, hvor solen befinder sig, når dens deklination er 0°. @da
definition: Relaterer et tidsrom til et verk som bruker et skjæringspunkt mellom solbanen og himmelekvator, der solen befinner seg når deklinasjonen dens er 0°. @no
definition: Relates a timespan to a work that uses a point of intersection of the ecliptic and the celestial equator, occupied by the sun when its declination is 0°.
definition: Sasaista laikposmu ar darbu, kurā tiek izmantots ekliptikas un debess ekvatora krustošanās punkts, kad tā novirze ir 0 °. @lv
definition: Seostab ajavahemiku teosega, milles kasutatakse aega, millal Päike läbib ekliptika ja taevaekvaatori lõikepunkti, kui Päikese kääne on 0° @et
definition: Setzt einen Zeitraum in Beziehung zu einem Werk, das einen von zwei Kreuzungspunkten der Sonnenbahn und des Himmelsäquators verwendet, die von der Sonne überquert werden, wenn ihre Deklination 0° beträgt. @de
definition: تربط بين فترة زمنية وعمل يستخدم نقطة تقاطع مسار الشمس مع خط الاستواء السماوي، عندما يكون انحراف الشمس عند صفر 0°. @ar
definition: 将一个时间段与使用当太阳的赤纬角度为0时其所占黄道和天赤道的一个交叉点的一种作品关联起来。 @zh-hans

is period of activity of corporate body of
has element type: 2
toolkit definition: A corporate body who is active in its primary field of endeavor during a timespan.
toolkit definition: Ana faaliyet alanında belirli bir zaman diliminde etkin olan tüzel kişilik. @tr
toolkit definition: Asutus, kes on olnud oma peamisel tegevusalal sel ajavahemikul aktiivne. @et
toolkit definition: Collectivité qui est active dans son principal champ d’activité durant un laps de temps. @fr
toolkit definition: Een corporatie die actief is in diens belangrijkste bezigheid gedurende een tijdspanne. @nl
toolkit definition: Egy testület, amely fő működési területén egy időtartam alatt aktív. @hu
toolkit definition: Eine Körperschaft, die in einem Zeitraum in ihrem primären Tätigkeitsfeld aktiv ist. @de
toolkit definition: En korporasjon som er aktiv innenfor sitt hovedvirke i løpet av et tidsrom. @no
toolkit definition: Ente che è attivo nel suo campo principale di azione durante un arco di tempo. @it
toolkit definition: Entitat corporativa que està activa en el seu camp principal d’activitat durant un interval de temps. @ca
toolkit definition: Institūcija, kas norādītajā laikposmā ir aktīva savā galvenajā darbības jomā. @lv
toolkit definition: Korporation, som i løbet af en given tidsperiode er aktiv i sit primære virkefelt. @da
toolkit definition: Yhteisö, joka on ollut aktiivinen ensisijaisella toiminta-alallaan ajanjakson aikana. @fi
toolkit definition: هيئة تكون نشطة في مجال عملها الأساسي خلال فترة زمنية. @ar
toolkit definition: 在一个时间段中活跃于其主要努力领域的一个团体 @zh-hans
toolkit label: Wirkungszeitraum einer Körperschaft von @de
toolkit label: actieve periode van corporatie van @nl
toolkit label: aktivitetsperiode for korporation af @da
toolkit label: asutuse tegutsemisaeg asutusele @et
toolkit label: ir darbības periods institūcijai @lv
toolkit label: period of activity of corporate body of
toolkit label: periode en korporasjon var aktiv for @no
toolkit label: periodo di attività di ente di @it
toolkit label: període d’activitat d’una entitat corporativa de @ca
toolkit label: période d’activité d’une collectivité de @fr
toolkit label: testület működési ideje @hu
toolkit label: toiminta-aika yhteisölle @fi
toolkit label: tüzel kişiliğinin faaliyet süresi @tr
toolkit label: فترة نشاط لهيئة لـ @ar
toolkit label: ……的团体的活跃期 @zh-hans
has subproperty: P70043
lexical alias: periodOfActivityOfCorporateBodyOf.en
status: Published
type: Property
domain: C10010
label: a következő testület működési ideje: @hu
label: asutuse tegutsemisaeg asutusele @et
label: er aktivitetsperiode for korporation af @da
label: er periode en korporasjon var aktiv for @no
label: est une période d’activité d’une collectivité de @fr
label: ir darbības periods institūcijai @lv
label: is actieve periode van corporatie van @nl
label: ist Wirkungszeitraum einer Körperschaft von @de
label: toiminta-aika yhteisölle @fi
label: tüzel kişisinin faaliyet dönemidir @tr
label: è periodo di attività di ente di @it
label: és període d’activitat d’una entitat corporativa de @ca
label: هي فترة نشاط لهيئة لـ @ar
label: 是……的团体的活跃期 @zh-hans
sub property of: has related corporate body of timespan
sub property of: is period of activity of collective agent of
definition: Bir zaman aralığını, birincil çalışma alanında belirli bir zaman diliminde etkin olan bir tüzel kişi ile ilişkilendirir. @tr
definition: Correla un arco di tempo a un ente che è attivo nel suo campo principale di azione durante un arco di tempo. @it
definition: Hozzákapcsol egy időtartamot egy testülethez, amely fő működési területén egy időtartam alatt aktív. @hu
definition: Liittää ajanjakson yhteisöön, joka on ollut aktiivinen ensisijaisella toiminta-alallaan ajanjakson aikana. @fi
definition: Met un laps de temps en relation avec une collectivité qui est active dans son principal champ d’activité durant un laps de temps. @fr
definition: Relaciona un interval de temps amb una entitat corporativa que està activa en el seu camp principal d’activitat durant un interval de temps. @ca
definition: Relateert een tijdspanne aan een corporatie die actief is in diens belangrijkste bezigheid gedurende een tijdspanne. @nl
definition: Relaterer en tidsperiode til en korporation, som i løbet af en given tidsperiode er aktiv i sit primære virkefelt. @da
definition: Relaterer et tidsrom til en korporasjon som er aktiv innenfor sitt hovedvirke i løpet av et tidsrom. @no
definition: Relates a timespan to a corporate body who is active in its primary field of endeavor during a timespan.
definition: Sasaista laikposmu ar institūciju, kas norādītajā laikposmā ir aktīva savā galvenajā darbības jomā. @lv
definition: Seostab ajavahemiku asutusega, kes on olnud oma peamisel tegevusalal sel ajavahemikul aktiivne. @et
definition: Setzt einen Zeitraum in Beziehung zu einer Körperschaft, die in einem Zeitraum in ihrem primären Tätigkeitsfeld aktiv ist. @de
definition: تربط بين فترة زمنية وهيئة تكون نشطة في مجال عملها الأساسي خلال فترة زمنية. @ar
definition: 将一个时间段与在一个时间段中活跃于其主要努力领域的一个团体关联起来。 @zh-hans

is period of activity of person of
has element type: 2
toolkit definition: A person who is active in their primary field of endeavor during a timespan.
toolkit definition: Belirli bir zaman diliminde kendi ana uğraş alanında etkin olan kişi. @tr
toolkit definition: Een persoon die actief is in diens belangrijkste bezigheid gedurende een tijdspanne. @nl
toolkit definition: Egy személy, amely fő működési területén egy időtartam alatt aktív. @hu
toolkit definition: Eine Person, die in einem Zeitraum in ihrem primären Tätigkeitsfeld aktiv ist. @de
toolkit definition: En person som er aktiv innenfor sitt hovedvirke i løpet av et tidsrom. @no
toolkit definition: Henkilö, joka on aktiivinen ensisijaisella toiminta-alallaan ajanjakson aikana. @fi
toolkit definition: Isik, kes on olnud oma peamisel tegevusalal sel ajavahemikul aktiivne. @et
toolkit definition: Person, som i løbet af en given tidsperiode er aktiv i sit primære virkefelt. @da
toolkit definition: Persona che è attiva nel suo campo principale di azione durante un arco di tempo. @it
toolkit definition: Persona que està activa en el seu camp principal d’activitat durant un interval de temps. @ca
toolkit definition: Persona, kura norādītajā laikposmā ir aktīva savā galvenajā darbības jomā. @lv
toolkit definition: Personne qui est active dans son principal champ d’activité durant un laps de temps. @fr
toolkit definition: شخص نشط في مجال عمله خلال فترة زمنية. @ar
toolkit definition: 在一个时间段中活跃于其主要努力领域的一个个人 @zh-hans
toolkit label: Wirkungszeitraum einer Person von @de
toolkit label: actieve periode van persoon van @nl
toolkit label: aktivitetsperiode for person af @da
toolkit label: ir darbības periods personai @lv
toolkit label: isiku tegutsemisaeg isikule @et
toolkit label: kişisinin faaliyet süresi @tr
toolkit label: period of activity of person of
toolkit label: periode en person var aktiv for @no
toolkit label: periodo di attività di persona di @it
toolkit label: període d’activitat d’una persona de @ca
toolkit label: période d’activité d’une personne de @fr
toolkit label: személy működési ideje @hu
toolkit label: toiminta-aika henkilölle @fi
toolkit label: فترة نشاط لشخص لـ @ar
toolkit label: ……的个人的活跃期 @zh-hans
has subproperty: P70044
lexical alias: periodOfActivityOfPersonOf.en
status: Published
type: Property
domain: C10010
label: a következő személy működési ideje: @hu
label: er aktivitetsperiode for person af @da
label: er periode en person var aktiv for @no
label: est une période d’activité d’une personne de @fr
label: ir darbības periods personai @lv
label: is actieve periode van persoon van @nl
label: isiku tegutsemisaeg isikule @et
label: ist Wirkungszeitraum einer Person von @de
label: kişisinin faaliyet dönemidir @tr
label: toiminta-aika henkilölle @fi
label: è periodo di attività di persona di @it
label: és període d’activitat d’una persona de @ca
label: هي فترة نشاط لشخص لـ @ar
label: 是……的个人的活跃期 @zh-hans
sub property of: has related person of timespan
sub property of: is period of activity of agent of
definition: Bir zaman aralığını, bir zaman aralığı boyunca birincil çalışma alanında aktif olan bir kişiyle ilişkilendirir. @tr
definition: Correla un arco di tempo a una persona che è attiva nel suo campo principale di azione durante un arco di tempo. @it
definition: Hozzákapcsol egy időtartamot egy személyhez, amely fő működési területén egy időtartam alatt aktív. @hu
definition: Liittää ajanjakson henkilöön, joka on aktiivinen ensisijaisella toiminta-alallaan ajanjakson aikana. @fi
definition: Met un laps de temps en relation avec une personne qui est active dans son principal champ d’activité durant un laps de temps. @fr
definition: Relaciona un interval de temps amb una persona que està activa en el seu camp principal d’activitat durant un interval de temps. @ca
definition: Relateert een tijdspanne aan een persoon die actief is in diens belangrijkste bezigheid gedurende een tijdspanne. @nl
definition: Relaterer en tidsperiode til en person, som i løbet af en given tidsperiode er aktiv i sit primære virkefelt. @da
definition: Relaterer et tidsrom til en person som er aktiv innenfor sitt hovedvirke i løpet av et tidsrom. @no
definition: Relates a timespan to a person who is active in their primary field of endeavor during a timespan.
definition: Sasaista laikposmu ar personu, kura norādītajā laikposmā ir aktīva savā galvenajā darbības jomā. @lv
definition: Seostab ajavahemiku isikuga, kes on olnud oma peamisel tegevusalal sel ajavahemikul aktiivne. @et
definition: Setzt einen Zeitraum in Beziehung zu einer Person, die in einem Zeitraum in ihrem primären Tätigkeitsfeld aktiv ist. @de
definition: تربط بين فترة زمنية وشخص نشط في مجال عمله خلال فترة زمنية. @ar
definition: 将一个时间段与在一个时间段中活跃于其主要努力领域的一个个人关联起来。 @zh-hans

has note on timespan
has element type: 6
toolkit definition: A broad unstructured description of one or more attributes of a timespan.
toolkit definition: Bir zaman aralığının bir veya daha fazla niteliğinin yapılandırılmamış geniş tanımı. @tr
toolkit definition: Bred, ustruktureret beskrivelse af en eller flere af en tidsperiodes attributter. @da
toolkit definition: Descripció no estructurada àmplia d’un o més atributs d’un interval de temps. @ca
toolkit definition: Description non structurée générale d’un ou plusieurs attributs d’un laps de temps. @fr
toolkit definition: Descrizione non strutturata generale di uno o più attributi di un arco di tempo. @it
toolkit definition: Een algemene ongestructureerde beschrijving van één of meer attributen van een tijdspanne. @nl
toolkit definition: Egy időtartam egy vagy több ismérvének szabad szöveges, strukturálatlan leírásához. @hu
toolkit definition: Eine umfassende, unstrukturierte Beschreibung eines Merkmals oder mehrerer Merkmale eines Zeitraums. @de
toolkit definition: En bred, utstrukturert beskrivelse av ett eller flere attributter for et tidsrom. @no
toolkit definition: Plašs nestrukturēts laikposma viena vai vairāku atribūtu apraksts. @lv
toolkit definition: Yleisluonteinen rakenteistamaton kuvailu, joka sisältää ajanjakson yhden tai useamman attribuutin. @fi
toolkit definition: Üldine struktureerimata kirjeldus, mis iseloomustab üht või mitut ajavahemiku omadust. @et
toolkit definition: وصف عام غير محدد لخاصية واحدة أو أكثر من خصائص فترة زمنية. @ar
toolkit definition: 关于一个时间段的一个或多个属性的宽泛的非结构化描述 @zh-hans
toolkit label: Anmerkung zum Zeitraum @de
toolkit label: Hozzákapcsol egy időtartamot egy időtartam egy vagy több ismérvének szabad szöveges, strukturálatlan leírásához. @hu
toolkit label: huomautus ajanjaksosta @fi
toolkit label: märkus ajavahemiku kohta @et
toolkit label: noot bij tijdspanne @nl
toolkit label: nota sobre un interval de temps @ca
toolkit label: nota su arco di tempo @it
toolkit label: note om tidsperiode @da
toolkit label: note om tidsrom @no
toolkit label: note on timespan
toolkit label: note sur un laps de temps @fr
toolkit label: piezīme par laikposmu @lv
toolkit label: zaman aralığı hakkında not @tr
toolkit label: تبصرة على فترة زمنية @ar
toolkit label: 关于时间段的附注 @zh-hans
has subproperty: P70045
lexical alias: noteOnTimespan.en
status: Published
type: Property
domain: C10010
label: a pour note sur un laps de temps @fr
label: ha come nota su arco di tempo @it
label: har note om tidsperiode @da
label: har note om tidsrom @no
label: hat Anmerkung zum Zeitraum @de
label: heeft noot bij tijdspanne @nl
label: huomautus ajanjaksosta @fi
label: időtartamra vonatkozó megjegyzése a következő: @hu
label: märkus ajavahemiku kohta @et
label: piezīme par laikposmu @lv
label: té com a nota sobre un interval de temps @ca
label: zaman aralığı hakkında not ile ilişkilidir @tr
label: لها تبصرة على فترة زمنية @ar
label: 有关于时间段的附注 @zh-hans
sub property of: P00015
definition: Bir zaman aralığını, bir zaman aralığının bir veya daha fazla özelliğinin yapılandırılmadığı geniş bir tanımıyla ilişkilendirir. @tr
definition: Correla un arco di tempo a una descrizione non strutturata generale di uno o più attributi di un arco di tempo. @it
definition: Liittää ajanjankson yleisluonteiseen rakenteistamattomaan kuvailuun, joka sisältää ajanjakson yhden tai useamman attribuutin. @fi
definition: Met un laps de temps en relation avec une description non structurée générale d’un ou plusieurs attributs d’un laps de temps. @fr
definition: Relaciona un interval de temps amb una descripció no estructurada àmplia d’un o més atributs d’un interval de temps. @ca
definition: Relateert een tijdspanne aan een algemene ongestructureerde beschrijving van één of meer attributen van een tijdspanne. @nl
definition: Relaterer en tidsperiode til en bred, ustruktureret beskrivelse af en eller flere af en tidsperiodes attributter. @da
definition: Relaterer et tidsrom til en bred, utstrukturert beskrivelse av ett eller flere attributter for et tidsrom. @no
definition: Relates a timespan to a broad unstructured description of one or more attributes of a timespan.
definition: Sasaista laikposmu ar plašu nestrukturētu laikposma viena vai vairāku atribūtu aprakstu. @lv
definition: Seostab ajavahemiku üldise struktureerimata kirjeldusega, mis iseloomustab üht või mitut ajavahemiku omadust. @et
definition: Setzt einen Zeitraum in Beziehung zu einer umfassenden, unstrukturierten Beschreibung eines Merkmals oder mehrerer Merkmale eines Zeitraums. @de
definition: időtartamra vonatkozó megjegyzése: @hu
definition: تربط بين فترة زمنية ووصف عام غير محدد لخاصية واحدة أو أكثر من خصائص فترة زمنية. @ar
definition: 将一个时间段与关于一个时间段的一个或多个属性的宽泛的非结构化描述关联起来。 @zh-hans

is year degree granted of
has element type: 2
toolkit definition: A work that is a thesis associated with an academic degree that is conferred by a granting institution or faculty during a timespan.
toolkit definition: Bir zaman aralığında enstitü veya fakülte tarafından verilen akademik derece ile bağlantılı bir tez çalıması olan bir çalışma. @tr
toolkit definition: Een werk dat is een these geassocieerd met een academische graad die is verleend door een verstrekkende instelling of faculteit gedurende een tijdspanne. @nl
toolkit definition: Egy mű, amely ahhoz a tudományos fokozathoz kapcsolódik, amelyet egy időtartam alatt egy adományozó intézmény vagy kar adott. @hu
toolkit definition: Eine Hochschulschrift (Werk), für die in einem Zeitraum ein akademischer Grad von einer Institution oder Fakultät verliehen wird. @de
toolkit definition: Et verk som er en akademisk grad tildelt av en tildelende institusjon eller et fakultet i løpet av et tidsrom. @no
toolkit definition: Obra que és una tesi associada amb un títol acadèmic concedit per una institució o una facultat durant un interval de temps. @ca
toolkit definition: Opera che è un titolo accademico conferito da una istituzione abilitata o facoltà durante un arco di tempo. @it
toolkit definition: Teos, joka on opinnäyte, joka liittyy laitoksen tai tiedekunnan ajanjakson aikana myöntämään akateemiseen oppiarvoon. @fi
toolkit definition: Teos, mis on kraadi andva asutuse või teaduskonna kinnitatud akadeemilise kraadi aluseks. @et
toolkit definition: Værk, som er en akademisk grad tildelt i løbet af en tidsperiode af en tildelende institution eller fakultet. @da
toolkit definition: Zinātniskais/akadēmiskais darbs, par kuru institūcija vai fakultāte laikposmā piešķīrusi grādu. @lv
toolkit definition: Œuvre qui consiste en une thèse associée à un grade universitaire décerné durant un laps de temps par une institution ou une faculté conférant un grade universitaire. @fr
toolkit definition: عمل عبارة عن درجة أكاديمية منحها معهد أو كلية مانحة خلال فترة زمنية. @ar
toolkit definition: 作为一种和在一个时间段内由授予机构或授予院系授予之学位有关的学位论文的一种作品 @zh-hans
toolkit label: Jahr, in dem ein akademischer Grad verliehen wird von @de
toolkit label: anno di laurea di @it
toolkit label: année d’obtention de grade universitaire de @fr
toolkit label: any d’obtenció d’un títol acadèmic de @ca
toolkit label: ir grāda piešķiršanas gads @lv
toolkit label: jaar graad toegekend van @nl
toolkit label: kraadi kinnitamise aasta teoses @et
toolkit label: mezuniyet derecesinin verildiği yıl @tr
toolkit label: oppiarvon myöntämisvuosi teokselle @fi
toolkit label: year degree granted of
toolkit label: årstal for tildeling af grad for @da
toolkit label: årstall for tildeling av grad for @no
toolkit label: évben fokozatott kapott a következő: @hu
toolkit label: عام منح درجة لـ @ar
toolkit label: ……的学位授予年 @zh-hans
has subproperty: P70046
lexical alias: yearDegreeGrantedOf.en
status: Published
type: Property
domain: C10010
label: derecesinin verildiği yıldır @tr
label: er årstal for tildeling af grad for @da
label: er årstall for tildeling av grad for @no
label: est une année d’obtention de grade universitaire de @fr
label: ir grāda piešķiršanas gads @lv
label: is jaar graad toegekend van @nl
label: ist Jahr, in dem ein akademischer Grad verliehen wird von @de
label: kraadi kinnitamise aasta teoses @et
label: oppiarvon myöntämisvuosi teokselle @fi
label: è anno di titolo accademico di @it
label: és any d’obtenció d’un títol acadèmic de @ca
label: évben fokozatott kapott a következő: @hu
label: هي عام منح درجة لـ @ar
label: 是……的学位授予年 @zh-hans
sub property of: is date of work of
definition: Bir zaman aralığını, zaman aralığı boyunca derece veren bir kurum veya fakülte tarafından verilen bir akademik derece ile bağlantılı olan bir tez olan bir eserle ilişkilendirir. @tr
definition: Correla un arco di tempo a un'opera che è un titolo accademico conferito da una istituzione o facoltà abilitata durante un arco di tempo. @it
definition: Hozzákapcsol egy időtartamot egy műhöz, amely ahhoz a tudományos fokozathoz kapcsolódik, amelyet egy időtartam alatt egy adományozó intézmény vagy kar adott. @hu
definition: Liittää ajanjakson teokseen, joka on opinnäyte, joka liittyy laitoksen tai tiedekunnan ajanjakson aikana myöntämään akateemiseen oppiarvoon. @fi
definition: Met un laps de temps en relation avec une œuvre qui consiste en une thèse associée à un grade universitaire décerné durant un laps de temps par une institution ou une faculté conférant un grade universitaire. @fr
definition: Relaciona un interval de temps amb una obra que és una tesi associada amb un títol acadèmic concedit per una institució o una facultat durant un interval de temps. @ca
definition: Relateert een tijdspanne aan een werk dat is een these geassocieerd met een academische graad die is verleend door een verstrekkende instelling of faculteit gedurende een tijdspanne. @nl
definition: Relaterer en tidsperiode til et værk, som er en akademisk grad tildelt i løbet af en tidsperiode af en tildelende institution eller fakultet. @da
definition: Relaterer et tidsrom til et verk som er en akademisk grad tildelt av en tildelende institusjon eller et fakultet i løpet av et tidsrom. @no
definition: Relates a timespan to a work that is a thesis associated with an academic degree that is conferred by a granting institution or faculty during a timespan.
definition: Sasaista laikposmu ar darbu, kas ir zinātniskais/akadēmiskais darbs, par kuru institūcija vai fakultāte laikposmā piešķīrusi grādu. @lv
definition: Seostab ajavahemiku teosega, mis on kraadi andva asutuse või teaduskonna kinnitatud akadeemilise kraadi aluseks. @et
definition: Setzt einen Zeitraum in Beziehung zu einer Hochschulschrift (Werk), für die in einem Zeitraum ein akademischer Grad von einer Institution oder Fakultät verliehen wird. @de
definition: تربط بين فترة زمنية وعمل عبارة عن درجة أكاديمية منحها معهد أو كلية مانحة خلال فترة زمنية. @ar
definition: 将一个时间段与作为一种和在一个时间段内由授予机构或授予院系授予之学位有关的学位论文的一种作品关联起来。 @zh-hans

has authorized access point for timespan
has element type: 3
toolkit definition: A nomen that is an access point for timespan that is selected for preference in a specific vocabulary encoding scheme.
toolkit definition: Ajavahemiku otsielement, mis on valitud eelistatuks vastavas leksikaalses märkimissüsteemis. @et
toolkit definition: Belirli bir kelime kodlama şemasında tercih için seçilen bir zaman aralığının erişim noktası olan bir isim. @tr
toolkit definition: Een nomen dat is een ingang voor tijdspanne die als voorkeursterm geselecteerd is in een specifiek vocabulair coderingssysteem. @nl
toolkit definition: Egy nomen, amely egy előnyben részesített hozzáférési pont az időtartamhoz, amelyet egy adott szótárkódolási sémából választanak ki. @hu
toolkit definition: Ein Sucheinstieg für einen Zeitraum, der in einem bestimmten Vocabulary Encoding Scheme als Vorzugsform bestimmt wird. @de
toolkit definition: En søkeinngang for tidsrom som er valgt som preferanse i et bestemt kodeskjema for vokabular. @no
toolkit definition: Laikposma pamatforma, kas ir izvēle no konkrētas vārdnīcas. @lv
toolkit definition: Nomen que és un punt d’accés d’interval de temps que se selecciona com a preferent en un esquema de codificació de vocabulari específic. @ca
toolkit definition: Nomen qui est un point d’accès d’un laps de temps faisant l’objet d’un choix privilégié dans un schéma d’encodage de vocabulaire spécifique. @fr
toolkit definition: Nomen, joka on ajanjakson auktorisoitu hakutieto, joka on valittu ensisijaiseksi tietyssä sanaston merkintäjärjestelmässä. @fi
toolkit definition: Punto d'accesso per un arco di tempo che è stato selezionato come preferito in uno specifico schema di codifica di vocabolario. @it
toolkit definition: Søgeindgang for tidsperiode, som er valgt som præference i et specifikt vokabularkodningsskema. @da
toolkit definition: تسمية عبارة عن نقطة وصول لفترة زمنية مختارة للتفضيل في خطة ترميز مفردات محددة. @ar
toolkit definition: 作为一个时间段的检索点、并在一个特定的词表编码体系中被首选的一个命名 @zh-hans
toolkit label: Normierter Sucheinstieg für einen Zeitraum @de
toolkit label: ajanjakson auktorisoitu hakutieto @fi
toolkit label: ajavahemiku normitud otsielement @et
toolkit label: authorized access point for timespan
toolkit label: autoriseret søgeindgang for tidsperiode @da
toolkit label: autorisert søkeinngang for tidsrom @no
toolkit label: autorizált hozzáférési pont időtartamhoz a következő: @hu
toolkit label: geautoriseerde ingang voor tijdspanne @nl
toolkit label: laikposma autoritatīvā pamatforma @lv
toolkit label: point d’accès autorisé d’un laps de temps @fr
toolkit label: punt d’accés autoritzat d’interval de temps @ca
toolkit label: punto d'accesso autorizzato per arco di tempo @it
toolkit label: zaman aralığı için yetkili erişim noktası @tr
toolkit label: نقطة وصول مقننة لفترة زمنية @ar
toolkit label: 时间段的规范检索点 @zh-hans
has subproperty: P70047
lexical alias: authorizedAccessPointForTimespan.en
status: Published
type: Property
domain: C10010
label: a pour point d’accès autorisé d’un laps de temps @fr
label: ajanjakson auktorisoitu hakutieto @fi
label: ajavahemiku normitud otsielement @et
label: autorizált hozzáférési pont időtartamhoz a következő: @hu
label: ha come punto d'accesso autorizzato per arco di tempo @it
label: har autoriseret søgeindgang for tidsperiode @da
label: har autorisert søkeinngang for tidsrom @no
label: hat normierten Sucheinstieg für einen Zeitraum @de
label: heeft geautoriseerde ingang voor tijdspanne @nl
label: laikposma autoritatīvā pamatforma @lv
label: té com a punt d’accés autoritzat d’interval de temps @ca
label: zaman aralığı için yetkili erişim noktası ile ilişkilidir @tr
label: لها نقطة وصول مقننة لفترة زمنية @ar
label: 有时间段的规范检索点 @zh-hans
sub property of: has access point for timespan
sub property of: P00020
definition: Bir zaman aralığını, belirli bir kelime kodlama şemasında tercih için seçilen bir zaman aralığı için erişim noktası olan bir isimle ilişkilendirir. @tr
definition: Correla un arco di tempo a un punto d'accesso per un arco di tempo selezionato come preferito in uno specifico schema di codifica di vocabolario. @it
definition: Hozzákapcsol egy időtartamot egy nomenhez, amely egy előnyben részesített hozzáférési pont az időtartamhoz, amelyet egy adott szótárkódolási sémából választanak ki. @hu
definition: Liittää ajanjakson nomeniin, joka on ajanjakson auktorisoitu hakutieto, joka on valittu ensisijaiseksi tietyssä sanaston merkintäjärjestelmässä. @fi
definition: Met un laps de temps en relation avec un nomen qui est un point d’accès d’un laps de temps faisant l’objet d’un choix privilégié dans un schéma d’encodage de vocabulaire spécifique. @fr
definition: Relaciona un interval de temps amb un nomen que és un punt d’accés d’interval de temps que se selecciona com a preferent en un esquema de codificació de vocabulari específic. @ca
definition: Relateert een tijdspanne aan een nomen dat is een ingang voor tijdspanne die als voorkeursterm geselecteerd is in een specifiek vocabulair coderingssysteem. @nl
definition: Relaterer en tidsperiode til en søgeindgang for tidsperiode, som er valgt som præference i et specifikt vokabularkodningsskema. @da
definition: Relaterer et tidsrom til en søkeinngang for tidsrom som er valgt som preferanse i et bestemt kodeskjema for vokabular. @no
definition: Relates a timespan to a nomen that is an access point for timespan that is selected for preference in a specific vocabulary encoding scheme.
definition: Sasaista laikposmu ar nomenu, kas ir laikposma pamatforma, kas ir izvēle no konkrētas vārdnīcas. @lv
definition: Seostab ajavahemiku ajavahemiku otsielemendiga, mis on valitud eelistatuks vastavas leksikaalses märkimissüsteemis. @et
definition: Setzt einen Zeitraum in Beziehung zu einem Sucheinstieg für einen Zeitraum, der in einem bestimmten Vocabulary Encoding Scheme als Vorzugsform bestimmt wird. @de
definition: تربط بين فترة زمنية وتسمية عبارة عن نقطة وصول لفترة زمنية مختارة للتفضيل في خطة ترميز مفردات محددة. @ar
definition: 将一个时间段与作为一个时间段的检索点、并在一个特定的词表编码体系中被首选的一个命名关联起来。 @zh-hans

has variant access point for timespan
has element type: 3
toolkit definition: A nomen that is an access point for timespan that is not selected for preference in a specific vocabulary encoding scheme.
toolkit definition: Ajavahemiku otsielement, mis ei ole valitud eelistatuks vastavas leksikaalses märkimissüsteemis. @et
toolkit definition: Belirli bir kelime kodlama şemasında tercih için seçilmeyen bir zaman aralığının erişim noktası olan bir isim. @tr
toolkit definition: Een nomen dat is een ingang voor tijdspanne die niet als voorkeursterm geselecteerd is in een specifiek vocabulair coderingssysteem. @nl
toolkit definition: Egy nomen, amely egy olyan hozzáférési pont az időtartamhoz, amelyet egy adott szótárkódolási sémában nem részesítenek előnyben. @hu
toolkit definition: Ein Sucheinstieg für einen Zeitraum, der in einem bestimmten Vocabulary Encoding Scheme nicht als Vorzugsform bestimmt wird. @de
toolkit definition: En søkeinngang for tidsrom som ikke er valgt som preferanse i et bestemt kodeskjema for vokabular. @no
toolkit definition: Nomen que és un punt d’accés d’interval de temps que no se selecciona com a preferent en un esquema de codificació de vocabulari específic. @ca
toolkit definition: Nomen qui est un point d’accès d’un laps de temps ne faisant pas l’objet d’un choix privilégié dans un schéma d’encodage de vocabulaire spécifique. @fr
toolkit definition: Nomen, joka on ajanjakson varianttihakutieto, jota ei ole valittu ensisijaiseksi tietyssä sanaston merkintäjärjestelmässä. @fi
toolkit definition: Piekļuves punkts laikposmam, kas nav izvēlēts kā prioritārs noteiktai kontrolētas vārdnīcas shēmai. @lv
toolkit definition: Punto di accesso di arco di tempo che non è stato selezionato come preferito in una specifica applicazione o contesto. @it
toolkit definition: Søgeindgang for tidsperiode, som ikke er valgt som præference i et specifikt vokabularkodningsskema. @da
toolkit definition: تسمية عبارة عن نقطة وصول لفترة زمنية لم يتم اختيارها للتفضيل في خطة ترميز مفردات محددة. @ar
toolkit definition: 作为一个时间段的检索点、并未在一个特定的词表编码体系中被首选的一个命名 @zh-hans
toolkit label: Zusätzlicher Sucheinstieg für einen Zeitraum @de
toolkit label: ajanjakson varianttihakutieto @fi
toolkit label: ajavahemiku otsielemendi variant @et
toolkit label: alternativ søkeinngang for tidsrom @no
toolkit label: hozzáférésipont-változat időtartamhoz: @hu
toolkit label: laikposma papildforma @lv
toolkit label: punto d'accesso variante per arco di tempo @it
toolkit label: variant access point for timespan
toolkit label: variant af søgeindgang for tidsperiode @da
toolkit label: variant de punt d’accés d’interval de temps @ca
toolkit label: variant ingang voor tijdspanne @nl
toolkit label: variante de point d’accès d’un laps de temps @fr
toolkit label: zaman aralığı için alternatif erişim noktası @tr
toolkit label: نقطة وصول مختلفة لفترة زمنية @ar
toolkit label: 时间段的变异检索点 @zh-hans
has subproperty: P70048
lexical alias: variantAccessPointForTimespan.en
status: Published
type: Property
domain: C10010
label: a pour variante de point d’accès d’un laps de temps @fr
label: ajanjakson varianttihakutieto @fi
label: ajavahemiku otsielemendi variant @et
label: ha come punto d'accesso variante per arco di tempo @it
label: har alternativ søkeinngang for tidsrom @no
label: har variant af søgeindgang for tidsperiode @da
label: hat zusätzlichen Sucheinstieg für einen Zeitraum @de
label: heeft variant ingang voor tijdspanne @nl
label: hozzáférésipont-változat időtartamhoz a következő: @hu
label: laikposma papildforma @lv
label: té com a variant de punt d’accés d’interval de temps @ca
label: zaman aralığı için alternatif erişim noktası ile ilişkilidir @tr
label: لها نقطة وصول مختلفة لفترة زمنية @ar
label: 有时间段的变异检索点 @zh-hans
sub property of: has access point for timespan
sub property of: P00022
definition: Bir zaman aralığını, belirli bir kelime kodlama şemasında tercih için seçilmeyen bir zaman aralığı için erişim noktası olan bir isimle ilişkilendirir. @tr
definition: Correla un arco di tempo a un punto di accesso di arco di tempo non selezionato come preferito in una specifica applicazione o contesto. @it
definition: Hozzákapcsol egy időtartamot egy nomenhez, amely egy olyan hozzáférési pont az időtartamhoz, amelyet egy adott szótárkódolási sémában nem részesítenek előnyben. @hu
definition: Liittää ajanjakson nomeniin, joka on ajanjakson varianttihakutieto, jota ei ole valittu ensisijaiseksi tietyssä sanaston merkintäjärjestelmässä. @fi
definition: Met un laps de temps en relation avec un nomen qui est un point d’accès d’un laps de temps ne faisant pas l’objet d’un choix privilégié dans un schéma d’encodage de vocabulaire spécifique. @fr
definition: Relaciona un interval de temps amb un nomen que és un punt d’accés d’interval de temps que no se selecciona com a preferent en un esquema de codificació de vocabulari específic. @ca
definition: Relateert een tijdspanne aan een nomen dat is een ingang voor tijdspanne die niet als voorkeursterm geselecteerd is in een specifiek vocabulair coderingssysteem. @nl
definition: Relaterer en tidsperiode til en søgeindgang for tidsperiode, som ikke er valgt som præference i et specifikt vokabularkodningsskema. @da
definition: Relaterer et tidsrom til en søkeinngang for tidsrom som ikke er valgt som preferanse i et bestemt kodeskjema for vokabular. @no
definition: Relates a timespan to a nomen that is an access point for timespan that is not selected for preference in a specific vocabulary encoding scheme.
definition: Sasaista laikposmu ar nomenu, kas ir piekļuves punkts laikposmam, kas nav izvēlēts kā prioritārs noteiktai kontrolētas vārdnīcas shēmai. @lv
definition: Seostab ajavahemiku ajavahemiku otsielemendiga, mis ei ole valitud eelistatuks vastavas leksikaalses märkimissüsteemis. @et
definition: Setzt einen Zeitraum in Beziehung zu einem Sucheinstieg für einen Zeitraum, der in einem bestimmten Vocabulary Encoding Scheme nicht als Vorzugsform bestimmt wird. @de
definition: تربط بين فترة زمنية وتسمية عبارة عن نقطة وصول لفترة زمنية لم يتم اختيارها للتفضيل في خطة ترميز مفردات محددة. @ar
definition: 将一个时间段与作为一个时间段的检索点、并未在一个特定的词表编码体系中被首选的一个命名关联起来。 @zh-hans

has preferred name of timespan
has element type: 3
toolkit definition: A nomen that is a name of timespan that is selected for preference in a specific application or context.
toolkit definition: Ajavahemiku nimi, mis kindlas rakenduses või kontekstis on valitud eelistatuks. @et
toolkit definition: Belirli bir uygulama veya bağlamda tercih için seçilen bir zaman aralığı adı olan bir isim. @tr
toolkit definition: Een nomen dat is een naam van tijdspanne die als voorkeursterm geselecteerd is in een specifieke toepassing of context. @nl
toolkit definition: Egy nomen, amely egy olyan időtartamnév, amelyet egy adott alkalmazásban vagy kontextusban előnyben részesítenek. @hu
toolkit definition: Ein Name eines Zeitraums, der in einer bestimmten Anwendung oder in einem bestimmten Kontext als Vorzugsform bestimmt wird. @de
toolkit definition: Et navn for tidsrom som er valgt som preferanse i en bestemt applikasjon eller kontekst. @no
toolkit definition: Laikposma nosaukums, kas ir izvēlēts noteiktam lietojumam vai noteiktā kontekstā. @lv
toolkit definition: Navn på tidsperiode, som er valgt som præference i en specifik anvendelse eller kontekst. @da
toolkit definition: Nome di arco di tempo che è stato selezionato come preferito in una specifica applicazione o contesto. @it
toolkit definition: Nomen que és un nom d’interval de temps que se selecciona com a preferent en una aplicació o un context específic. @ca
toolkit definition: Nomen qui est un nom de laps de temps faisant l’objet d’un choix privilégié dans une application ou un contexte spécifiques. @fr
toolkit definition: Nomen, joka on ajanjakson nimi, joka on valittu ensisijaiseksi tietyssä sovelluksessa tai kontekstissa. @fi
toolkit definition: تسمية عبارة عن اسم فترة زمنية مختارة للتفضيل ضمن تطبيق أو سياق محدد. @ar
toolkit definition: 作为一个时间段的名称并在一个特定的应用或语境中被首选的一个命名 @zh-hans
toolkit label: Bevorzugter Name eines Zeitraums @de
toolkit label: ajanjakson ensisijainen nimi @fi
toolkit label: ajavahemiku eelisnimi @et
toolkit label: foretrukket navn for tidsrom @no
toolkit label: foretrukket navn på tidsperiode @da
toolkit label: geprefereerde naam van tijdspanne @nl
toolkit label: időtartam előnyben részesített neve: @hu
toolkit label: laikposma prioritārais nosaukums @lv
toolkit label: nom preferit d’interval de temps @ca
toolkit label: nom privilégié d’un laps de temps @fr
toolkit label: nome preferito di arco di tempo @it
toolkit label: preferred name of timespan
toolkit label: zaman aralığının tercih edilen ismi @tr
toolkit label: اسم مفضل لفترة زمنية @ar
toolkit label: 时间段的首选名称 @zh-hans
has subproperty: P70049
lexical alias: preferredNameOfTimespan.en
status: Published
type: Property
domain: C10010
label: a pour nom privilégié d’un laps de temps @fr
label: ajanjakson ensisijainen nimi @fi
label: ajavahemiku eelisnimi @et
label: ha come nome preferito di arco di tempo @it
label: har foretrukket navn for tidsrom @no
label: har foretrukket navn på tidsperiode @da
label: hat bevorzugten Namen eines Zeitraums @de
label: heeft geprefereerde naam van tijdspanne @nl
label: időtartam előnyben részesített neve a következő: @hu
label: laikposma prioritārais nosaukums @lv
label: tercih edilen zaman aralığı adı ile ilişkilidir @tr
label: té com a nom preferit d’interval de temps @ca
label: لها اسم مفضل لفترة زمنية @ar
label: 有时间段的首选名称 @zh-hans
sub property of: has name of timespan
sub property of: P00021
definition: Bir zaman aralığını, belirli bir uygulama veya bağlamda tercih için seçilen bir zaman aralığının ismiyle ilişkilendirir. @tr
definition: Correla un arco di tempo a un nome di arco di tempo selezionato come preferito in una specifica applicazione o contesto. @it
definition: Hozzákapcsol egy időtartamot egy nomenhez, amely egy olyan időtartamnév, amelyet egy adott alkalmazásban vagy kontextusban előnyben részesítenek. @hu
definition: Liittää ajanjakson nomeniin, joka on ajanjakson nimi, joka on valittu ensisijaiseksi tietyssä sovelluksessa tai kontekstissa. @fi
definition: Met un laps de temps en relation avec un nomen qui est un nom de laps de temps faisant l’objet d’un choix privilégié dans une application ou un contexte spécifiques. @fr
definition: Relaciona un interval de temps amb un nomen que és un nom d’interval de temps que se selecciona com a preferent en una aplicació o un context específic. @ca
definition: Relateert een tijdspanne aan een nomen dat is een naam van tijdspanne die als voorkeursterm geselecteerd is in een specifieke toepassing of context. @nl
definition: Relaterer en tidsperiode til et navn på tidsperiode, som er valgt som præference i en specifik anvendelse eller kontekst. @da
definition: Relaterer et tidsrom til et navn for tidsrom som er valgt som preferanse i en bestemt applikasjon eller kontekst. @no
definition: Relates a timespan to a nomen that is a name of timespan that is selected for preference in a specific application or context.
definition: Sasaista laikposmu ar nomenu, kas ir laikposma nosaukums, kas ir izvēlēts noteiktam lietojumam vai noteiktā kontekstā. @lv
definition: Seostab ajavahemiku ajavahemiku nimega, mis kindlas rakenduses või kontekstis on valitud eelistatuks. @et
definition: Setzt einen Zeitraum in Beziehung zu einem Namen eines Zeitraums, der in einer bestimmten Anwendung oder in einem bestimmten Kontext als Vorzugsform bestimmt wird. @de
definition: تربط بين فترة زمنية وتسمية عبارة عن اسم فترة زمنية مختارة للتفضيل ضمن تطبيق أو سياق محدد. @ar
definition: 将一个时间段与作为一个时间段的名称并在一个特定的应用或语境中被首选的一个命名关联起来。 @zh-hans

has variant name of timespan
has element type: 3
toolkit definition: A nomen that is a name of timespan that is not selected for preference in a specific application or context.
toolkit definition: Ajavahemiku nimi, mis kindlas rakenduses või kontekstis ei ole valitud eelistatuks. @et
toolkit definition: Belirli bir uygulama veya bağlamda tercih için seçilmemiş bir zaman aralığı adı olan bir isim. @tr
toolkit definition: Een nomen dat is een naam van tijdspanne die niet als voorkeursterm geselecteerd is in een specifieke toepassing of context. @nl
toolkit definition: Egy nomen, amely egy időtartamnév, amelyet egy adott alkalmazásban vagy kontextusban nem részesítenek előnyben. @hu
toolkit definition: Ein Name eines Zeitraums, der in einer bestimmten Anwendung oder in einem bestimmten Kontext nicht als Vorzugsform bestimmt wird. @de
toolkit definition: Et navn for tidsrom som ikke er valgt som preferasne i en bestemt applikasjon eller kontekst. @no
toolkit definition: Laikposma nosaukums, kas nav izvēlēts kā prioritārs noteiktā lietojumprogrammā vai kontekstā. @lv
toolkit definition: Navn på tidsperiode, som ikke er valgt som præference i en specifik anvendelse eller kontekst. @da
toolkit definition: Nome di arco di tempo che non è stato selezionato come preferito in una specifica applicazione o contesto. @it
toolkit definition: Nomen que és un nom d’interval de temps que no se selecciona com a preferent en una aplicació o un context específic. @ca
toolkit definition: Nomen qui est un nom de laps de temps ne faisant pas l’objet d’un choix privilégié dans une application ou un contexte spécifiques. @fr
toolkit definition: Nomen, joka on ajanjakson nimi, jota ei ole valittu ensisijaiseksi tietyssä sovelluksessa tai kontekstissa. @fi
toolkit definition: تسمية عبارة عن اسم فترة زمنية لم يتم اختيارها للتفضيل ضمن تطبيق أو سياق محدد. @ar
toolkit definition: 作为一个时间段的名称并未在一个特定的应用或语境中被首选的一个命名 @zh-hans
toolkit label: Abweichender Name eines Zeitraums @de
toolkit label: ajanjakson varianttinimi @fi
toolkit label: ajavahemiku variantnimi @et
toolkit label: alternativt navn for tidsrom @no
toolkit label: időtartam névváltozata: @hu
toolkit label: laikposma cits nosaukums @lv
toolkit label: nome variante di arco di tempo @it
toolkit label: variant af navn på tidsperiode @da
toolkit label: variant de nom d’interval de temps @ca
toolkit label: variant naam van tijdspanne @nl
toolkit label: variant name of timespan
toolkit label: variante de nom de laps de temps @fr
toolkit label: zaman aralığının alternatif ismi @tr
toolkit label: اسم مختلف لفترة زمنية @ar
toolkit label: 时间段的变异名称 @zh-hans
has subproperty: P70050
lexical alias: variantNameOfTimespan.en
status: Published
type: Property
domain: C10010
label: a pour variante de nom de laps de temps @fr
label: ajanjakson varianttinimi @fi
label: ajavahemiku variantnimi @et
label: ha come nome variante di arco di tempo @it
label: har alternativt navn for tidsrom @no
label: har variant af navn på tidsperiode @da
label: hat abweichenden Namen eines Zeitraums @de
label: heeft variant naam van tijdspanne @nl
label: időtartam névváltozata a következő: @hu
label: laikposma cits nosaukums @lv
label: té com a variant de nom d’interval de temps @ca
label: zaman aralığının alternatif ismi ile ilişkilidir @tr
label: لها اسم مختلف لفترة زمنية @ar
label: 有时间段的变异名称 @zh-hans
sub property of: has name of timespan
sub property of: P00023
definition: Bir zaman aralığını, belirli bir uygulama veya bağlamda tercih için seçilmeyen bir zaman aralığının ismiyle ilişkilendirir. @tr
definition: Correla un arco di tempo a un nome di arco di tempo non selezionato come preferito in una specifica applicazione o contesto. @it
definition: Hozzákapcsol egy időtartamot egy nomenhez, amely egy időtartamnév, amelyet egy adott alkalmazásban vagy kontextusban nem részesítenek előnyben. @hu
definition: Liittää ajanjakson nomeniin, joka on ajanjakson nimi, jota ei ole valittu ensisijaiseksi tietyssä sovelluksessa tai kontekstissa. @fi
definition: Met un laps de temps en relation avec un nomen qui est un nom de laps de temps ne faisant pas l’objet d’un choix privilégié dans une application ou un contexte spécifiques. @fr
definition: Relaciona un interval de temps amb un nomen que és un nom d’interval de temps que no se selecciona com a preferent en una aplicació o un context específic. @ca
definition: Relateert een tijdspanne aan een nomen dat is een naam van tijdspanne die niet als voorkeursterm geselecteerd is in een specifieke toepassing of context. @nl
definition: Relaterer en tidsperiode til et navn på tidsperiode, som ikke er valgt som præference i en specifik anvendelse eller kontekst. @da
definition: Relaterer et tidsrom til et navn for tidsrom som ikke er valgt som preferasne i en bestemt applikasjon eller kontekst. @no
definition: Relates a timespan to a nomen that is a name of timespan that is not selected for preference in a specific application or context.
definition: Sasaista laikposmu ar nomenu, kas ir laikposma nosaukums, kas nav izvēlēts kā prioritārs noteiktā lietojumprogrammā vai kontekstā. @lv
definition: Seostab ajavahemiku ajavahemiku nimega, mis kindlas rakenduses või kontekstis ei ole valitud eelistatuks. @et
definition: Setzt einen Zeitraum in Beziehung zu einem Namen eines Zeitraums, der in einer bestimmten Anwendung oder in einem bestimmten Kontext nicht als Vorzugsform bestimmt wird. @de
definition: تربط بين فترة زمنية وتسمية عبارة عن اسم فترة زمنية لم يتم اختيارها للتفضيل ضمن تطبيق أو سياق محدد. @ar
definition: 将一个时间段与作为一个时间段的名称并未在一个特定的应用或语境中被首选的一个命名关联起来。 @zh-hans

is period of activity of agent of
has element type: 2
toolkit definition: Agent que està actiu en el seu camp principal d’activitat durant un interval de temps. @ca
toolkit definition: Agent qui est actif dans son principal champ d’activité durant un laps de temps. @fr
toolkit definition: Agent, som i løbet af en given tidsperiode er aktiv i sit primære virkefelt. @da
toolkit definition: Agente che è attivo nel suo campo principale di azione durante un arco di tempo. @it
toolkit definition: An agent who is active in its primary field of endeavor during a timespan.
toolkit definition: Aģents, kas norādītajā laikposmā ir aktīvs savā galvenajā darbības jomā. @lv
toolkit definition: Bir zaman aralığı boyunca birincil çalışma alanında aktif olan bir temsilci. @tr
toolkit definition: Een actor die actief is in diens belangrijkste bezigheid gedurende een tijdspanne. @nl
toolkit definition: Egy ágens, amely fő működési területén egy időtartam alatt aktív. @hu
toolkit definition: Ein Akteur, der in einem Zeitraum in seinem primären Tätigkeitsfeld aktiv ist. @de
toolkit definition: En agent som er aktiv innenfor sitt hovedvirke i løpet av et tidsrom. @no
toolkit definition: Tegija, kes on olnud oma peamisel tegevusalal sel ajavahemikul aktiivne. @et
toolkit definition: Toimija, joka on aktiivinen ensisijaisella toiminta-alallaan ajanjakson aikana. @fi
toolkit definition: وكيل نشط في مجال عمله الأساسي خلال فترة زمنية. @ar
toolkit definition: 在一个时间段中活跃于其主要努力领域的一个行为者 @zh-hans
toolkit label: Wirkungszeitraum eines Akteurs von @de
toolkit label: actieve periode van actor van @nl
toolkit label: aktivitetsperiode for agent af @da
toolkit label: ir aģenta darbības periods @lv
toolkit label: period of activity of agent of
toolkit label: periode en agent var aktiv for @no
toolkit label: periodo di attività di agente di @it
toolkit label: període d’activitat d’un agent de @ca
toolkit label: période d’activité d’un agent de @fr
toolkit label: tegija tegutsemisaeg tegijale @et
toolkit label: temsilcisinin faaliyet süresi @tr
toolkit label: tevékenységi időszaka a következő ágensnek: @hu
toolkit label: toiminta-aika toimijalle @fi
toolkit label: فترة نشاط لوكيل لـ @ar
toolkit label: ……的行为者的活跃期 @zh-hans
has subproperty: is period of activity of person of
has subproperty: is period of activity of collective agent of
has subproperty: P70051
lexical alias: periodOfActivityOfAgentOf.en
status: Published
type: Property
domain: C10010
label: er aktivitetsperiode for agent af @da
label: er periode en agent var aktiv for @no
label: est une période d’activité d’un agent de @fr
label: ir aģenta darbības periods @lv
label: is actieve periode van actor van @nl
label: ist Wirkungszeitraum eines Akteurs von @de
label: tegija tegutsemisaeg tegijale @et
label: temsilcisinin faaliyet sdönemidir @tr
label: tevékenységi időszaka a következő ágensnek: @hu
label: toiminta-aika toimijalle @fi
label: è periodo di attività di agente di @it
label: és període d’activitat d’un agent de @ca
label: هي فترة نشاط لوكيل لـ @ar
label: 是……的行为者的活跃期 @zh-hans
sub property of: has related agent of timespan
definition: Bir zaman aralığını, bir zaman aralığı boyunca birincil çalışma alanında aktif olan bir temsilciyle ilişkilendirir. @tr
definition: Correla un arco di tempo a un agente che è attivo nel suo campo principale di azione durante un arco di tempo. @it
definition: Hozzákapcsol egy időtartamot egy ágenshez, amely fő működési területén egy időtartam alatt aktív. @hu
definition: Liittää ajanjakson toimijaan, joka on aktiivinen ensisijaisella toiminta-alallaan ajanjakson aikana. @fi
definition: Met un laps de temps en relation avec un agent qui est actif dans son principal champ d’activité durant un laps de temps. @fr
definition: Relaciona un interval de temps amb un agent que està actiu en el seu camp principal d’activitat durant un interval de temps. @ca
definition: Relateert een tijdspanne aan een actor die actief is in diens belangrijkste bezigheid gedurende een tijdspanne. @nl
definition: Relaterer en tidsperiode til en agent, som i løbet af en given tidsperiode er aktiv i sit primære virkefelt. @da
definition: Relaterer et tidsrom til en agent som er aktiv innenfor sitt hovedvirke i løpet av et tidsrom. @no
definition: Relates a timespan to an agent who is active in its primary field of endeavor during a timespan.
definition: Sasaista laikposmu ar aģentu, kas norādītajā laikposmā ir aktīvs savā galvenajā darbības jomā. @lv
definition: Seostab ajavahemiku tegijaga, kes on olnud oma peamisel tegevusalal sel ajavahemikul aktiivne. @et
definition: Setzt einen Zeitraum in Beziehung zu einem Akteur, der in einem Zeitraum in seinem primären Tätigkeitsfeld aktiv ist. @de
definition: تربط بين فترة زمنية ووكيل نشط في مجال عمله الأساسي خلال فترة زمنية. @ar
definition: 将一个时间段与在一个时间段中活跃于其主要努力领域的一个行为者关联起来。 @zh-hans

is period of activity of collective agent of
has element type: 2
toolkit definition: A collective agent who is active in its primary field of endeavor during a timespan.
toolkit definition: Agent collectif qui est actif dans son principal champ d’activité durant un laps de temps. @fr
toolkit definition: Agent col·lectiu que està actiu en el seu camp principal d’activitat durant un interval de temps. @ca
toolkit definition: Agente collettivo che è attivo nel suo campo principale di azione durante un arco di tempo. @it
toolkit definition: Bir zaman dilimi boyunca birincil çalışma alanında aktif olan kolektif bir temsilci. @tr
toolkit definition: Een collectieve actor die actief is in diens belangrijkste bezigheid gedurende een tijdspanne. @nl
toolkit definition: Egy kollektív ágens, amely fő működési területén egy időtartam alatt aktív. @hu
toolkit definition: Ein gemeinschaftlicher Akteur, der in einem Zeitraum in seinem primären Tätigkeitsfeld aktiv ist. @de
toolkit definition: En kollektiv agent som er aktiv innenfor sitt hovedvirke i løpet av et tidsrom. @no
toolkit definition: Grupa, kas norādītajā laikposmā ir aktīva savā galvenajā darbības jomā. @lv
toolkit definition: Kollektiiv, kes on olnud oma peamisel tegevusalal sel ajavahemikul aktiivne. @et
toolkit definition: Kollektiv agent, som i løbet af en given tidsperiode er aktiv i sit primære virkefelt. @da
toolkit definition: Yhteistoimija, joka on aktiivinen ensisijaisella toiminta-alallaan ajanjakson aikana. @fi
toolkit definition: وكيل جماعي نشط في مجال عمله الأساسي خلال فترة زمنية. @ar
toolkit definition: 在一个时间段中活跃于其主要努力领域的一个集体行为者 @zh-hans
toolkit label: Wirkungszeitraum eines gemeinschaftlichen Akteurs von @de
toolkit label: actieve periode van collectieve actor van @nl
toolkit label: aktivitetsperiode for kollektiv agent af @da
toolkit label: ir grupas darbības periods @lv
toolkit label: kolektif temsilcisinin faaliyet süresi @tr
toolkit label: kollektiivi tegutsemisaeg kollektiivile @et
toolkit label: kollektív ágens működési ideje: @hu
toolkit label: period of activity of collective agent of
toolkit label: periode en kollektiv agent var aktiv for @no
toolkit label: periodo di attività di agente collettivo di @it
toolkit label: període d’activitat d’un agent col·lectiu de @ca
toolkit label: période d’activité d’un agent collectif de @fr
toolkit label: toiminta-aika yhteistoimijalle @fi
toolkit label: فترة نشاط لوكيل جماعي لـ @ar
toolkit label: ……的集体行为者的活跃期 @zh-hans
has subproperty: is period of activity of corporate body of
has subproperty: is period of activity of family of
has subproperty: P70052
lexical alias: periodOfActivityOfCollectiveAgentOf.en
status: Published
type: Property
domain: C10010
label: er aktivitetsperiode for kollektiv agent af @da
label: er periode en kollektiv agent var aktiv for @no
label: est une période d’activité d’un agent collectif de @fr
label: ir grupas darbības periods @lv
label: is actieve periode van collectieve actor van @nl
label: ist Wirkungszeitraum eines gemeinschaftlichen Akteurs von @de
label: kolektif temsilcisinin faaliyet dönemidir @tr
label: kollektiivi tegutsemisaeg kollektiivile @et
label: működési ideje a következő kollektív ágensnek: @hu
label: toiminta-aika yhteistoimijalle @fi
label: è periodo di attività di agente collettivo di @it
label: és període d’activitat d’un agent col·lectiu de @ca
label: هي فترة لنشاط وكيل جماعي لـ @ar
label: 是……的集体行为者的活跃期 @zh-hans
sub property of: has related collective agent of timespan
sub property of: is period of activity of agent of
definition: Bir zaman aralığını, bir zaman aralığı boyunca birincil çalışma alanında aktif olan bir kolektif temsilci ile ilişkilendirir. @tr
definition: Correla un arco di tempo a un agente collettivo che è attivo nel suo campo principale di azione durante un arco di tempo. @it
definition: Hozzákapcsol egy időtartamot egy kollektív ágenshez, amely fő működési területén egy időtartam alatt aktív. @hu
definition: Liittää ajanjakson yhteistoimijaan, joka on aktiivinen ensisijaisella toiminta-alallaan ajanjakson aikana. @fi
definition: Met un laps de temps en relation avec un agent collectif qui est actif dans son principal champ d’activité durant un laps de temps. @fr
definition: Relaciona un interval de temps amb un agent col·lectiu que està actiu en el seu camp principal d’activitat durant un interval de temps. @ca
definition: Relateert een tijdspanne aan een collectieve actor die actief is in diens belangrijkste bezigheid gedurende een tijdspanne. @nl
definition: Relaterer en tidsperiode til en kollektiv agent, som i løbet af en given tidsperiode er aktiv i sit primære virkefelt. @da
definition: Relaterer et tidsrom til en kollektiv agent som er aktiv innenfor sitt hovedvirke i løpet av et tidsrom. @no
definition: Relates a timespan to a collective agent who is active in its primary field of endeavor during a timespan.
definition: Sasaista laikposmu ar grupu, kas norādītajā laikposmā ir aktīva savā galvenajā darbības jomā. @lv
definition: Seostab ajavahemiku kollektiiviga, kes on olnud oma peamisel tegevusalal sel ajavahemikul aktiivne. @et
definition: Setzt einen Zeitraum in Beziehung zu einem gemeinschaftlichen Akteur, der in einem Zeitraum in seinem primären Tätigkeitsfeld aktiv ist. @de
definition: تربط بين فترة زمنية ووكيل جماعي نشط في مجال عمله الأساسي خلال فترة زمنية. @ar
definition: 将一个时间段与在一个时间段中活跃于其主要努力领域的一个集体行为者关联起来。 @zh-hans

is period of activity of family of
has element type: 2
toolkit definition: A family who is active in its primary field of endeavor during a timespan.
toolkit definition: Bir zaman dilimi boyunca ana uğraş alanında aktif olan bir aile. @tr
toolkit definition: Dzimta/ģimene, kas norādītajā laikposmā ir aktīva savā galvenajā darbības jomā. @lv
toolkit definition: Een familie die actief is in diens belangrijkste bezigheid gedurende een tijdspanne. @nl
toolkit definition: Egy család, amely fő működési területén egy időtartam alatt aktív. @hu
toolkit definition: Eine Familie, die in einem Zeitraum in ihrem primären Tätigkeitsfeld aktiv ist. @de
toolkit definition: En familie som er aktiv innenfor sitt hovedvirke i løpet av et tidsrom. @no
toolkit definition: Famiglia che è attiva nel suo campo principale di azione durante un arco di tempo. @it
toolkit definition: Familie, som i løbet af en given tidsperiode er aktiv i sit primære virkefelt. @da
toolkit definition: Famille qui est active dans son principal champ d’activité durant un laps de temps. @fr
toolkit definition: Família que està activa en el seu camp principal d’activitat durant un interval de temps. @ca
toolkit definition: Perekond, kes on olnud oma peamisel tegevusalal sel ajavahemikul aktiivne. @et
toolkit definition: Suku, joka on aktiivinen ensisijaisella toiminta-alallaan ajanjakson aikana. @fi
toolkit definition: عائلة نشطة في مجال عملها الأساسي خلال فترة زمنية. @ar
toolkit definition: 在一个时间段中活跃于其主要努力领域的一个家族 @zh-hans
toolkit label: Wirkungszeitraum einer Familie von @de
toolkit label: actieve periode van familie van @nl
toolkit label: ailesinin faaliyet süresi @tr
toolkit label: aktivitetsperiode for familie af @da
toolkit label: család működési ideje: @hu
toolkit label: ir darbības periods dzimtai/ģimenei @lv
toolkit label: perekonna tegutsemisaeg perekonnale @et
toolkit label: period of activity of family of
toolkit label: periode en familie var aktiv for @no
toolkit label: periodo di attività di famiglia di @it
toolkit label: període d’activitat d’una família de @ca
toolkit label: période d’activité d’une famille de @fr
toolkit label: toiminta-aika suvulle @fi
toolkit label: فترة نشاط لعائلة لـ @ar
toolkit label: ……的家族的活跃期 @zh-hans
has subproperty: P70053
lexical alias: periodOfActivityOfFamilyOf.en
status: Published
type: Property
domain: C10010
label: ailesinin faaliyet dönemidir @tr
label: er aktivitetsperiode for familie af @da
label: er periode en familie var aktiv for @no
label: est une période d’activité d’une famille de @fr
label: ir darbības periods dzimtai/ģimenei @lv
label: is actieve periode van familie van @nl
label: ist Wirkungszeitraum einer Familie von @de
label: működési ideje a következő családnak: @hu
label: perekonna tegutsemisaeg perekonnale @et
label: toiminta-aika suvulle @fi
label: è periodo di attività di famiglia di @it
label: és període d’activitat d’una família de @ca
label: هي فترة نشاط لعائلة لـ @ar
label: 是……的家族的活跃期 @zh-hans
sub property of: has related family of timespan
sub property of: is period of activity of collective agent of
definition: Bir zaman aralığını, zaman aralığı boyunca birincil çalışma alanında aktif olan bir aile ile ilişkilendirir. @tr
definition: Correla un arco di tempo a una famiglia che è attiva nel suo campo principale di azione durante un arco di tempo. @it
definition: Hozzákapcsol egy időtartamot egy családhoz, amely fő működési területén egy időtartam alatt aktív. @hu
definition: Liittää ajanjakson sukuun, joka on aktiivinen ensisijaisella toiminta-alallaan ajanjakson aikana. @fi
definition: Met un laps de temps en relation avec une famille qui est active dans son principal champ d’activité durant un laps de temps. @fr
definition: Relaciona un interval de temps amb una família que està activa en el seu camp principal d’activitat durant un interval de temps. @ca
definition: Relateert een tijdspanne aan een familie die actief is in diens belangrijkste bezigheid gedurende een tijdspanne. @nl
definition: Relaterer en tidsperiode til en familie, som i løbet af en given tidsperiode er aktiv i sit primære virkefelt. @da
definition: Relaterer et tidsrom til en familie som er aktiv innenfor sitt hovedvirke i løpet av et tidsrom. @no
definition: Relates a timespan to a family who is active in its primary field of endeavor during a timespan.
definition: Sasaista laikposmu ar dzimtu/ģimeni, kas norādītajā laikposmā ir aktīva savā galvenajā darbības jomā. @lv
definition: Seostab ajavahemiku perekonnaga, kes on olnud oma peamisel tegevusalal sel ajavahemikul aktiivne. @et
definition: Setzt einen Zeitraum in Beziehung zu einer Familie, die in einem Zeitraum in ihrem primären Tätigkeitsfeld aktiv ist. @de
definition: تربط بين فترة زمنية وعائلة نشطة في مجال عملها الأساسي خلال فترة زمنية. @ar
definition: 将一个时间段与在一个时间段中活跃于其主要努力领域的一个家族关联起来。 @zh-hans

is date of capture of representative expression of
has element type: 2
toolkit definition: A work that is associated with a representative expression that is recorded, filmed, etc., during a timespan.
toolkit definition: Bir zaman aralığında kaydedilen, filme alınan vb. temsili bir anlatımla bağlantılı olan bir çalışma. @tr
toolkit definition: Darbs, kas saistīts ar reprezentatīvo izteiksmi, kas tikusi ierakstīta, filmēta u.tml. konkrētajā laikposmā. @lv
toolkit definition: Een werk dat is geassocieerd met een representatieve expressie die is opgenomen, gefilmd etc. gedurende een tijdspanne. @nl
toolkit definition: Egy mű, amely reprezentatív kifejezési formáját egy időtartam alatt rögzítettek, vettek filmre, stb. @hu
toolkit definition: Ein Werk, das mit einer repräsentativen Expression in Verbindung steht, die in einem Zeitraum aufgenommen, verfilmt und so weiter wird. @de
toolkit definition: Et verk som forbindes med et representativt uttrykk so, er tatt opp, filmet etc. i løpet av et tidsrom. @no
toolkit definition: Obra que s’associa amb una expressió representativa que s’enregistra, es filma, etc., durant un interval de temps. @ca
toolkit definition: Opera associata con un'espressione rappresentativa che è registrata, filmata, etc. durante un arco di tempo. @it
toolkit definition: Teos, joka liittyy edustavan ekspression äänitykseen, filmaukseen tms. ajanjakson aikana. @fi
toolkit definition: Teos, millega seotud iseloomulik väljendus on salvestatud, filmitud vms sel ajavahemikul. @et
toolkit definition: Værk, som er knyttet til et repræsentativt udtryk, som i løbet af en tidsperiode er indspillet, filmet, etc. @da
toolkit definition: Œuvre qui est associée à une expression représentative qui est enregistrée, filmée, etc. durant un laps de temps. @fr
toolkit definition: عمل مرتبط بتعبيرة ممثلة سجلت، وصورت، إلخ. خلال فترة زمنية. @ar
toolkit definition: 和一种在一个时间段录制、拍摄等的代表性内容表达有关的一种作品 @zh-hans
toolkit label: Aufzeichnungsdatum einer repräsentativen Expression von @de
toolkit label: data de captura d’una expressió representativa de @ca
toolkit label: data di registrazione dell'espressione rappresentativa @it
toolkit label: date de captation d’une expression représentative de @fr
toolkit label: date of capture of representative expression of
toolkit label: dato for indspilning af repræsentativt udtryk af @da
toolkit label: datum van vastleggen van representatieve expressie van @nl
toolkit label: ir reprezentatīvās izteiksmes tveršanas datējums @lv
toolkit label: iseloomuliku väljenduse jäädvustamise daatum teoses @et
toolkit label: reprezentatív kifejezési forma felvételének ideje @hu
toolkit label: tallennusajankohta edustavalle ekspressiolle @fi
toolkit label: temsili anlatımın kaydedilme tarihi @tr
toolkit label: tidspunkt for opptak av representativt uttrykk for @no
toolkit label: تاريخ التقاط تعبيرة ممثلة لـ @ar
toolkit label: ……的代表性内容表达的摄录日期 @zh-hans
has subproperty: P70054
lexical alias: dateOfCaptureOfRepresentativeExpressionOf.en
status: Published
type: Property
domain: C10010
label: a következő reprezentatív kifejezési forma felvételének ideje: @hu
label: er dato for indspilning af repræsentativt udtryk af @da
label: er tidspunkt for opptak av representativt uttrykk for @no
label: est une date de captation d’une expression représentative de @fr
label: ir reprezentatīvās izteiksmes tveršanas datējums @lv
label: is datum van vastleggen van representatieve expressie van @nl
label: iseloomuliku väljenduse jäädvustamise daatum teoses @et
label: ist Aufzeichnungsdatum einer repräsentativen Expression von @de
label: tallennusajankohta edustavalle ekspressiolle @fi
label: temsili anlatımının kayıt tarihidir @tr
label: è data di registrazione dell'espressione rappresentativa @it
label: és data de captura d’una expressió representativa de @ca
label: هي تاريخ التقاط تعبيرة ممثلة لـ @ar
label: 是……的代表性内容表达的摄录日期 @zh-hans
sub property of: has related work of timespan
definition: Bir zaman aralığını, bir zaman aralığı boyunca kaydedilen, filme alınan vb. temsili bir anlatımla bağlantılı olan bir eserle ilişkilendirir. @tr
definition: Correla un arco di tempo a un'opera associata con un'espressione rappresentativa che è registrata, filmata, etc. durante un arco di tempo. @it
definition: Hozzákapcsol egy időtartamot egy műhöz, amely reprezentatív kifejezési formáját egy időtartam alatt rögzítettek, vettek filmre, stb. @hu
definition: Liittää ajanjakson teokseen, joka liittyy edustavan ekspression äänitykseen, filmaukseen tms. ajanjakson aikana. @fi
definition: Met un laps de temps en relation avec une œuvre qui est associée à une expression représentative qui est enregistrée, filmée, etc. durant un laps de temps. @fr
definition: Relaciona un interval de temps amb una obra que s’associa amb una expressió representativa que s’enregistra, es filma, etc., durant un interval de temps. @ca
definition: Relateert een tijdspanne aan een werk dat is geassocieerd met een representatieve expressie die is opgenomen, gefilmd etc. gedurende een tijdspanne. @nl
definition: Relaterer en tidsperiode til et værk, som er knyttet til et repræsentativt udtryk, som i løbet af en tidsperiode er indspillet, filmet, etc. @da
definition: Relaterer et tidsrom til et verk som forbindes med et representativt uttrykk so, er tatt opp, filmet etc. i løpet av et tidsrom. @no
definition: Relates a timespan to a work that is associated with a representative expression that is recorded, filmed, etc., during a timespan.
definition: Sasaista laikposmu ar darbu, kas saistīts ar reprezentatīvo izteiksmi, kas tikusi ierakstīta, filmēta u.tml. konkrētajā laikposmā. @lv
definition: Seostab ajavahemiku teosega, millega seotud iseloomulik väljendus on salvestatud, filmitud vms sel ajavahemikul. @et
definition: Setzt einen Zeitraum in Beziehung zu einem Werk, das mit einer repräsentativen Expression in Verbindung steht, die in einem Zeitraum aufgenommen, verfilmt und so weiter wird. @de
definition: تربط بين فترة زمنية وعمل مرتبط بتعبيرة ممثلة سجلت، وصورت، إلخ. خلال فترة زمنية. @ar
definition: 将一个时间段与和一种在一个时间段录制、拍摄等的代表性内容表达有关的一种作品关联起来。 @zh-hans

is duration of representative expression of (Deprecated)
has element type: 2
toolkit definition: A work that has an extent of expression of a representative expression that is a playing time, performance time, running time, or other timespan. (Deprecated)
toolkit definition: Een werk dat een omvang van expressie heeft van een representatieve expressie die een speelduur, uitvoeringsduur, looptijd of andere tijdspanne is. @nl
toolkit definition: Egy mű, amely rendelkezik egy reprezentatív kifejezési formára jellemző kifejezésiforma-terjedelemmel, ami egy lejátszási idő, futási idő vagy egyéb időtartam. @hu
toolkit definition: Ein Werk, das über einen Umfang einer repräsentativen Expression verfügt, bei dem es sich um eine Wiedergabezeit, eine Aufführungszeit, eine Laufzeit oder einen anderen Zeitraum handelt. @de
toolkit definition: Et verk som har et omfang for uttrykk av et representativt uttrykk som er en spilletid, framføringstid, avspillingstid eller annet tidsrom. @no
toolkit definition: Obra que té una extensió d’expressió d’una expressió representativa que és un temps de reproducció, de projecció, d’execució o qualsevol altre interval de temps. @ca
toolkit definition: Opera che ha una estensione dell'espressione di una espressione rappresentativa che è un tempo di gioco, tempo di gioco, tempo di interpretazione, durata o altro arco di tempo. @it
toolkit definition: Teos, jonka edustavan ekspression kesto on soittoaika, esitysaika, toistoaika tai muu ajanjakso. @fi
toolkit definition: Teos, mille iseloomulikul väljendusel on väljenduse maht, milleks on mängimisaeg, esituse aeg, töötamisaeg või muu ajavahemik. @et
toolkit definition: Værk, som har et omfang af et udtryk, som er en varighed, opførelsestid, spilletid etc. eller anden tidsperiode. @da
toolkit definition: Œuvre qui possède une étendue d’une expression représentative consistant en une durée de lecture, d’exécution, de projection, etc. ou en un autre laps de temps. @fr
toolkit definition: عمل له امتداد لتعبيرة ممثلة هو وقت تشغيل، أو وقت أداء، أو وقت دوران، أو أي فترة زمنية أخرى. @ar
toolkit label: Dauer einer repräsentativen Expression von @de
toolkit label: durada d’una expressió representativa de @ca
toolkit label: durata dell'espressione rappresentativa @it
toolkit label: duration of representative expression of (Deprecated)
toolkit label: durée d’une expression représentative de @fr
toolkit label: duur van representatieve expressie van @nl
toolkit label: iseloomuliku väljenduse kestus teoses @et
toolkit label: kesto edustavalle ekspressiolle @fi
toolkit label: reprezentatív kifejezési forma tartama @hu
toolkit label: spilletid for repræsentativt udtryk af @da
toolkit label: varighet for representativt uttrykk for @no
toolkit label: فترة لتعبيرة ممثلة لـ @ar
has subproperty: P70055
lexical alias: durationOfRepresentativeExpressionOf.en
status: Deprecated
type: Property
domain: C10010
label: a következő reprezentatív kifejezési forma tartama: @hu
label: er spilletid for repræsentativt udtryk af @da
label: er varighet for representativt uttrykk for @no
label: est une durée d’une expression représentative de @fr
label: is duur van representatieve expressie van @nl
label: iseloomuliku väljenduse kestus teoses @et
label: ist Dauer einer repräsentativen Expression von @de
label: kesto edustavalle ekspressiolle @fi
label: è durata dell'espressione rappresentativa @it
label: és durada d’una expressió representativa de @ca
label: هي فترة لتعبيرة ممثلة لـ @ar
sub property of: has related work of timespan
definition: Correla un arco di tempo a un'opera che ha una estensione dell'espressione di un'espressione rappresentativa che è un tempo di gioco, tempo di gioco, tempo di interpretazione, durata o altro arco di tempo. @it
definition: Egy időtartamot hozzákapcsol egy műhöz, amely rendelkezik egy reprezentatív kifejezési formára jellemző kifejezésiforma-terjedelemmel, ami egy lejátszási idő, futási idő vagy egyéb időtartam. @hu
definition: Liittää ajanjakson teokseen, jonka edustavan ekspression kesto on soittoaika, esitysaika, toistoaika tai muu ajanjakso. @fi
definition: Met un laps de temps en relation avec une œuvre qui possède une étendue d’une expression représentative consistant en une durée de lecture, d’exécution, de projection, etc. ou en un autre laps de temps. @fr
definition: Relaciona un interval de temps amb una obra que té una extensió d’expressió d’una expressió representativa que és un temps de reproducció, de projecció, d’execució o qualsevol altre interval de temps. @ca
definition: Relateert een tijdspanne aan een werk dat een omvang van expressie heeft van een representatieve expressie die een speelduur, uitvoeringsduur, looptijd of andere tijdspanne is. @nl
definition: Relaterer en tidsperiode til et værk, som har et omfang af et udtryk, som er en varighed, opførelsestid, spilletid etc. eller anden tidsperiode. @da
definition: Relaterer et tidsrom til et verk som har et omfang for uttrykk av et representativt uttrykk som er en spilletid, framføringstid, avspillingstid eller annet tidsrom. @no
definition: Relates a timespan to a work that has an extent of expression of a representative expression that is a playing time, performance time, running time, or other timespan. (Deprecated)
definition: Seostab ajavahemiku teosega, mille iseloomulikul väljendusel on väljenduse maht, milleks on mängimisaeg, esituse aeg, töötamisaeg või muu ajavahemik. @et
definition: Setzt einen Zeitraum in Beziehung zu einem Werk, das über einen Umfang einer repräsentativen Expression verfügt, bei dem es sich um eine Wiedergabezeit, eine Aufführungszeit, eine Laufzeit oder einen anderen Zeitraum handelt. @de
definition: تربط بين فترة زمنية وعمل له امتداد لتعبيرة ممثلة هو وقت تشغيل، أو وقت أداء، أو وقت دوران، أو أي فترة زمنية أخرى. @ar

is date of usage of
has element type: 3
toolkit definition: A nomen that is used during a timespan.
toolkit definition: Benævnelse på en RDA-entitet, som bruges i løbet af en tidsperiode. @da
toolkit definition: Bir zaman aralığı boyunca kullanılan bir isim. @tr
toolkit definition: Designazione di un'entità RDA che è usata durante un arco di tempo. @it
toolkit definition: Een nomen dat is een benaming van een RDA-entiteit die gebruikt is gedurende een tijdspanne. @nl
toolkit definition: Egy nomen, amely egy időtartam alatt használt RDA-entitás megnevezése. @hu
toolkit definition: Eine Bezeichnung für eine RDA-Entität, die in einem Zeitraum verwendet wird. @de
toolkit definition: En betegnelse for en RDA-entitet som brukes i løpet av et tidsrom. @no
toolkit definition: Nomen que s’usa durant un interval de temps. @ca
toolkit definition: Nomen qui est utilisé durant un laps de temps. @fr
toolkit definition: Nomen, joka on RDA-entiteetin nimitys, jota käytetään ajanjakson aikana. @fi
toolkit definition: RDA entītes apzīmējums, ko izmanto laikposmā. @lv
toolkit definition: RDA olemi nimetus, mis on sel ajavahemikul kasutuses. @et
toolkit definition: تسمية عبارة عن اسم تعريفي لكيان "وام" استخدم خلال فترة زمنية. @ar
toolkit definition: 用于一个时间段的一个命名 @zh-hans
toolkit label: Verwendungsdatum von @de
toolkit label: data d'uso di @it
toolkit label: data d’ús de @ca
toolkit label: date d’utilisation de @fr
toolkit label: date of usage of
toolkit label: dato for brug af @da
toolkit label: dato for bruk for @no
toolkit label: datum van gebruik van @nl
toolkit label: használati időpontja: @hu
toolkit label: ir lietojuma datējums @lv
toolkit label: kasutusaeg RDA olemi nimetusele @et
toolkit label: kullanım tarihi @tr
toolkit label: käyttöajankohta RDA-entiteetin nimitykselle @fi
toolkit label: تاريخ استخدام لـ @ar
toolkit label: ……的使用日期 @zh-hans
has subproperty: P70056
lexical alias: dateOfUsageOf.en
status: Published
type: Property
domain: C10010
label: er dato for brug af @da
label: er dato for bruk for @no
label: est une date d’utilisation de @fr
label: használati időpontja a következőnek: @hu
label: ir lietojuma datējums @lv
label: is datum van gebruik van @nl
label: ist Verwendungsdatum von @de
label: kasutusaeg RDA olemi nimetusele @et
label: kullanım tarihidir @tr
label: käyttöajankohta RDA-entiteetin nimitykselle @fi
label: è data d'uso di @it
label: és data d’ús de @ca
label: هي تاريخ استخدام لـ @ar
label: 是……的使用日期 @zh-hans
sub property of: has related nomen of timespan
definition: Bir zaman aralığını, zaman aralığı boyunca kullanılan bir isimle ilişkilendirir. @tr
definition: Correla un arco di tempo a una designazione di un'entità RDA che è usata durante un arco di tempo. @it
definition: Hozzákapcsol egy időtartamot egy időtartam alatt használt RDA-entitás megnevezéséhez. @hu
definition: Liittää ajanjakson nomeniin, joka on RDA-entiteetin nimitys, jota käytetään ajanjakson aikana. @fi
definition: Met un laps de temps en relation avec un nomen qui est utilisé durant un laps de temps. @fr
definition: Relaciona un interval de temps amb un nomen que s’usa durant un interval de temps. @ca
definition: Relateert een tijdspanne aan een benaming van een RDA-entiteit die gebruikt is gedurende een tijdspanne. @nl
definition: Relaterer en tidsperiode til en benævnelse på en RDA-entitet, som bruges i løbet af en tidsperiode. @da
definition: Relaterer et tidsrom til en betegnelse for en RDA-entitet som brukes i løpet av et tidsrom. @no
definition: Relates a timespan to a nomen that is used during a timespan.
definition: Sasaista laikposmu ar RDA entītes apzīmējumu, ko izmanto laikposmā. @lv
definition: Seostab ajavahemiku RDA olemi nimetusega, mis on sel ajavahemikul kasutuses. @et
definition: Setzt einen Zeitraum in Beziehung zu einer Bezeichnung für eine RDA-Entität, die in einem Zeitraum verwendet wird. @de
definition: تربط بين فترة زمنية واسم تعريفي لكيان "وام" استخدم خلال فترة زمنية. @ar
definition: 将一个时间段与用于一个时间段的一个命名关联起来。 @zh-hans

is date of representative expression of
has element type: 2
toolkit definition: A work that is associated with the earliest timespan of a representative expression.
toolkit definition: Darbs, kas saistīts ar reprezentatīvās izteiksmes agrāko laikposmu. @lv
toolkit definition: Een werk dat geassocieerd is met de vroegste tijdspanne van een representatieve expressie. @nl
toolkit definition: Egy mű, amely kapcsolódik egy reprezentatív kifejezési forma egy legkorábbi időtartamához. @hu
toolkit definition: Ein Werk, das mit dem frühesten Zeitraum einer repräsentativen Expression in Verbindung steht. @de
toolkit definition: Et verk som forbindes med det tidligste tidsrommet for et representativt uttrykk. @no
toolkit definition: Obra que s’associa amb l’interval de temps més antic d’una expressió representativa. @ca
toolkit definition: Opera che è associata con un arco di tempo precedente di un'espressione rappresentativa. @it
toolkit definition: Temsili bir anlatımın en erken zaman aralığı ile bağlantılı olan bir çalışma. @tr
toolkit definition: Teos, johon liittyy edustavan ekspression varhaisin ajanjakso. @fi
toolkit definition: Teos, mis on seotud iseloomuliku väljenduse varaseima ajavahemikuga. @et
toolkit definition: Værk, som er knyttet til et repræsentativt udtryks tidligste tidsperiode. @da
toolkit definition: Œuvre qui est associée au laps de temps le plus ancien d’une expression représentative. @fr
toolkit definition: عمل مرتبط بفترة زمنية مبكرة لتعبيرة ممثلة. @ar
toolkit definition: 和一种代表性内容表达的最早时间段有关的一种作品 @zh-hans
toolkit label: Datum einer repräsentativen Expression von @de
toolkit label: ajankohta edustavalle ekspressiolle @fi
toolkit label: data dell'espressione rappresentativa @it
toolkit label: data d’expressió representativa de @ca
toolkit label: date d’une expression représentative de @fr
toolkit label: date of representative expression of
toolkit label: dato for representativt uttrykk for @no
toolkit label: dato for repræsentativt udtryk af @da
toolkit label: datum van representatieve expressie van @nl
toolkit label: ir reprezentatīvās izteiksmes datējums @lv
toolkit label: iseloomuliku väljenduse daatum teoses @et
toolkit label: reprezentatív kifejezési forma dátuma @hu
toolkit label: temsili anlatımın tarihi @tr
toolkit label: تاريخ استخدام لتعبيرة ممثلة لـ @ar
toolkit label: ……的代表性内容表达的日期 @zh-hans
has subproperty: P70057
lexical alias: dateOfRepresentativeExpressionOf.en
status: Published
type: Property
domain: C10010
label: a következő reprezentatív kifejezési forma dátuma: @hu
label: ajankohta edustavalle ekspressiolle @fi
label: er dato for representativt uttrykk for @no
label: er dato for repræsentativt udtryk af @da
label: est une date d’une expression représentative de @fr
label: ir reprezentatīvās izteiksmes datējums @lv
label: is datum van representatieve expressie van @nl
label: iseloomuliku väljenduse daatum teoses @et
label: ist Datum einer repräsentativen Expression von @de
label: temsili anlatımı tarihidir @tr
label: è data dell'espressione rappresentativa @it
label: és data d’expressió representativa de @ca
label: هي تاريخ تعبيرة ممثلة لـ @ar
label: 是……的代表性内容表达的日期 @zh-hans
sub property of: has related work of timespan
definition: Bir zaman aralığını, temsili bir anlatımın en erken zaman aralığı ile bağlantılı olan bir eserle ilişkilendirir. @tr
definition: Correla un arco di tempo a un'opera che è associata con un arco di tempo precedente di un'espressione rappresentativa. @it
definition: Egy időtartamot hozzákapcsol egy műhöz, amely kapcsolódik egy reprezentatív kifejezési forma egy legkorábbi időtartamához. @hu
definition: Liittää ajanjakson teokseen, johon liittyy edustavan ekspression varhaisin ajanjakso. @fi
definition: Met un laps de temps en relation avec une œuvre qui est associée au laps de temps le plus ancien d’une expression représentative. @fr
definition: Relaciona un interval de temps amb una obra que s’associa amb l’interval de temps més antic d’una expressió representativa. @ca
definition: Relateert een tijdspanne aan een werk dat geassocieerd is met de vroegste tijdspanne van een representatieve expressie. @nl
definition: Relaterer en tidsperiode til et værk, som er knyttet til et repræsentativt udtryks tidligste tidsperiode. @da
definition: Relaterer et tidsrom til et verk som forbindes med det tidligste tidsrommet for et representativt uttrykk. @no
definition: Relates a timespan to a work that is associated with the earliest timespan of a representative expression.
definition: Sasaista laikposmu ar darbu, kas saistīts ar reprezentatīvās izteiksmes agrāko laikposmu. @lv
definition: Seostab ajavahemiku teosega, mis on seotud iseloomuliku väljenduse varaseima ajavahemikuga. @et
definition: Setzt einen Zeitraum in Beziehung zu einem Werk, das mit dem frühesten Zeitraum einer repräsentativen Expression in Verbindung steht. @de
definition: تربط بين فترة زمنية وعمل مرتبط بفترة زمنية سابقة لتعبيرة ممثلة. @ar
definition: 将一个时间段与和一种代表性内容表达的最早时间段有关的一种作品关联起来。 @zh-hans

has related entity of timespan
has element type: 1
toolkit definition: Ajavahemikuga seotud olem. @et
toolkit definition: An entity that is associated with a timespan.
toolkit definition: Bir zaman aralığı ile bağlantılı olan bir varlık. @tr
toolkit definition: Een entiteit die geassocieerd is met een tijdspanne. @nl
toolkit definition: Egy entitás, amelyet egy időtartamhoz társítanak. @hu
toolkit definition: Eine Entität, die mit einem Zeitraum in Verbindung steht. @de
toolkit definition: En entitet som forbindes med et tidsrom. @no
toolkit definition: Entitat que s’associa amb un interval de temps. @ca
toolkit definition: Entiteetti, joka liittyy ajanjaksoon. @fi
toolkit definition: Entitet, som er knyttet til en tidsperiode. @da
toolkit definition: Entità che è associata con un arco di tempo. @it
toolkit definition: Entité qui est associée à un laps de temps. @fr
toolkit definition: Entīte, kas saistīta ar laikposmu. @lv
toolkit definition: كيان مرتبط بفترة زمنية. @ar
toolkit definition: 和一个时间段有关的一个实体 @zh-hans
toolkit label: ajanjaksoon liittyvä entiteetti @fi
toolkit label: ajavahemikuga seotud olem @et
toolkit label: ar laikposmu saistītā entīte @lv
toolkit label: entitat relacionada amb un interval de temps @ca
toolkit label: entitet relateret til tidsperiode @da
toolkit label: entitet relatert til tidsrom @no
toolkit label: entità correlata di arco di tempo @it
toolkit label: entité en relation avec un laps de temps @fr
toolkit label: gerelateerde entiteit van tijdspanne @nl
toolkit label: időtartam kapcsolódó entitása: @hu
toolkit label: mit Zeitraum in Beziehung stehende Entität @de
toolkit label: related entity of timespan
toolkit label: zaman aralığının ilişkili olduğu varlık @tr
toolkit label: كيان مرتبط بفترة زمنية @ar
toolkit label: 时间段的关联实体 @zh-hans
has subproperty: has related RDA entity of timespan
has subproperty: P70058
lexical alias: relatedEntityOfTimespan.en
status: Published
type: Property
domain: C10010
label: a pour entité en relation avec un laps de temps @fr
label: ajanjaksoon liittyvä entiteetti @fi
label: ajavahemikuga seotud olem @et
label: ar laikposmu saistītā entīte @lv
label: ha come entità correlata di arco di tempo @it
label: har entitet relateret til tidsperiode @da
label: har entitet relatert til tidsrom @no
label: hat mit Zeitraum in Beziehung stehende Entität @de
label: heeft gerelateerde entiteit van tijdspanne @nl
label: időtartam kapcsolódó entitása a következő: @hu
label: té com a entitat relacionada amb un interval de temps @ca
label: zaman aralığının ilgili varlığı ile ilişkilidir @tr
label: لها كيان مرتبط بفترة زمنية @ar
label: 有时间段的关联实体 @zh-hans
sub property of: P00028
definition: Bir zaman aralığını, bir zaman aralığıyla bağlantılı olan bir varlıkla ilişkilendirir. @tr
definition: Correla un arco di tempo a un'entità che è associata con un arco di tempo. @it
definition: Hozzákapcsol egy időtartamot egy entitáshoz, amelyet egy időtartamhoz társítanak. @hu
definition: Liittää ajanjakson entiteettiin, joka liittyy ajanjaksoon. @fi
definition: Met un laps de temps en relation avec une entité qui est associée à un laps de temps. @fr
definition: Relaciona un interval de temps amb una entitat que s’associa amb un interval de temps. @ca
definition: Relateert een tijdspanne aan een entiteit die geassocieerd is met een tijdspanne. @nl
definition: Relaterer en tidsperiode til en entitet, som er knyttet til en tidsperiode. @da
definition: Relaterer et tidsrom til en entitet som forbindes med et tidsrom. @no
definition: Relates a timespan to an entity that is associated with a timespan.
definition: Sasaista laikposmu ar entīti, kas saistīta ar laikposmu. @lv
definition: Seostab ajavahemiku ajavahemikuga seotud olemiga. @et
definition: Setzt einen Zeitraum in Beziehung zu einer Entität, die mit einem Zeitraum in Verbindung steht. @de
definition: تربط بين فترة زمنية وكيان مرتبط بفترة زمنية. @ar
definition: 将一个时间段与和一个时间段有关的一个实体关联起来。 @zh-hans

has category of timespan
has element type: 5
toolkit definition: A type to which a timespan belongs.
toolkit definition: Bir zaman aralığının ait olduğu tür. @tr
toolkit definition: Een type waartoe een tijdspanne behoort. @nl
toolkit definition: Egy típus, amelyhez egy időtartam tartozik. @hu
toolkit definition: Eine Art, zu der ein Zeitraum gehört. @de
toolkit definition: En type som et tidsrom tilhører. @no
toolkit definition: Tipo a cui l'arco di tempo appartiene. @it
toolkit definition: Tipus al qual pertany un interval de temps. @ca
toolkit definition: Type auquel un laps de temps appartient. @fr
toolkit definition: Type, som en tidsperiode tilhører. @da
toolkit definition: Tyyppi, johon ajanjakso kuuluu. @fi
toolkit definition: Tüüp, millesse ajavahemik kuulub. @et
toolkit definition: Veids, pie kura pieder laikposms. @lv
toolkit definition: فئة تنتمي إليها فترة زمنية. @ar
toolkit definition: 一个时间段所属于的一个类型 @zh-hans
toolkit label: Kategorie eines Zeitraums @de
toolkit label: ajanjakson kategoria @fi
toolkit label: ajavahemiku kategooria @et
toolkit label: categoria di arco di tempo @it
toolkit label: categoria d’interval de temps @ca
toolkit label: categorie van tijdspanne @nl
toolkit label: category of timespan
toolkit label: catégorie de laps de temps @fr
toolkit label: időtartam kategóriája @hu
toolkit label: kategori af tidsperiode @da
toolkit label: kategori av tidsrom @no
toolkit label: laikposma kategorija @lv
toolkit label: zaman aralığı kategorisi @tr
toolkit label: فئة لفترة زمنية @ar
toolkit label: 时间段的类别 @zh-hans
has subproperty: P70059
lexical alias: categoryOfTimespan.en
status: Published
type: Property
domain: C10010
label: a pour catégorie de laps de temps @fr
label: ajanjakson kategoria @fi
label: ajavahemiku kategooria @et
label: ha come categoria di arco di tempo @it
label: har kategori af tidsperiode @da
label: har kategori av tidsrom @no
label: hat Kategorie eines Zeitraums @de
label: heeft categorie van tijdspanne @nl
label: időtartamkategóriája a következő: @hu
label: laikposma kategorija @lv
label: té com a categoria d’interval de temps @ca
label: zaman aralığının kategorisi ile ilişkilidir @tr
label: لها فئة لفترة زمنية @ar
label: 有时间段的类别 @zh-hans
sub property of: P00029
definition: Bir zaman aralığını, zaman aralığının ait olduğu bir türle ilişkilendirir. @tr
definition: Correla un arco di tempo a un tipo a cui l'arco di tempo appartiene. @it
definition: Hozzákapcsol egy időtartamot ahhoz a típushoz, amelyhez az időtartam tartozik. @hu
definition: Liitää ajanjakson tyyppiin, johon ajanjakso kuuluu. @fi
definition: Met un laps de temps en relation avec un type auquel un laps de temps appartient. @fr
definition: Relaciona un interval de temps amb un tipus al qual pertany un interval de temps. @ca
definition: Relateert een tijdspanne aan een type waartoe een tijdspanne behoort. @nl
definition: Relaterer en tidsperiode til en type, som en tidsperiode tilhører. @da
definition: Relaterer et tidsrom til en type som et tidsrom tilhører. @no
definition: Relates a timespan to a type to which a timespan belongs.
definition: Sasaista laikposmu ar veidu, pie kura pieder laikposms. @lv
definition: Seostab ajavahemiku tüübiga, millesse ajavahemik kuulub. @et
definition: Setzt einen Zeitraum in Beziehung zu einer Art, zu der ein Zeitraum gehört. @de
definition: تربط بين فترة زمنية وفئة تنتمي إليها فترة زمنية. @ar
definition: 将一个时间段与一个时间段所属于的一个类型关联起来。 @zh-hans

is timespan described by
has element type: 2
toolkit definition: A work that is a description of a timespan.
toolkit definition: Bir zaman aralığının tanımı olan bir eser @tr
toolkit definition: Darbs, kurā aprakstīts konkrētais laikposms. @lv
toolkit definition: Een werk dat een tijdspanne beschrijft. @nl
toolkit definition: Egy mű, amely egy időtartamot ír le. @hu
toolkit definition: Ein Werk, das einen Zeitraum beschreibt. @de
toolkit definition: Et verk som beskriver et tidsrom. @no
toolkit definition: Obra que és una descripció d’un interval de temps. @ca
toolkit definition: Opera che descrive un arco di tempo. @it
toolkit definition: Teos, joka kuvaa ajanjaksoa. @fi
toolkit definition: Teos, milles kirjeldatakse ajavahemikku. @et
toolkit definition: Værk, som beskriver en tidsperiode. @da
toolkit definition: Œuvre qui consiste en une description d’un laps de temps. @fr
toolkit definition: عمل يصف فترة زمنية. @ar
toolkit definition: 作为一个时间段之描述的一种作品 @zh-hans
toolkit label: Zeitraum beschrieben in @de
toolkit label: ajanjaksoa kuvaava teos @fi
toolkit label: ajavahemiku kirjeldus @et
toolkit label: arco di tempo descritto in @it
toolkit label: időtartam leírva a következőben: @hu
toolkit label: interval de temps descrit per @ca
toolkit label: laikposms aprakstīts darbā @lv
toolkit label: laps de temps décrit par @fr
toolkit label: tarafından tanımlanan zaman aralığı @tr
toolkit label: tidsperiode beskrevet i @da
toolkit label: tidsrom beskrevet i @no
toolkit label: tijdspanne beschreven in @nl
toolkit label: timespan described by
toolkit label: فترة زمنية موصوفة في @ar
toolkit label: 被……描述的时间段 @zh-hans
has subproperty: is timespan described with metadata by
has subproperty: P70060
lexical alias: timespanDescribedBy.en
status: Published
type: Property
domain: C10010
label: ajanjaksoa kuvaava teos @fi
label: ajavahemiku kirjeldus @et
label: er tidsperiode beskrevet i @da
label: er tidsrom beskrevet i @no
label: est un laps de temps décrit par @fr
label: időtartam leírva a következőben: @hu
label: ir laikposms aprakstīts darbā @lv
label: is tijdspanne beschreven in @nl
label: ist Zeitraum beschrieben in @de
label: tarafından tanımlanan zaman aralığıdır. @tr
label: è arco di tempo descritto in @it
label: és interval de temps descrit per @ca
label: هي فترة زمنية موصوفة في @ar
label: 是被……描述的时间段 @zh-hans
sub property of: is subject timespan of
alternative label: ajanjaksoa kuvattu teoksessa @fi
alternative label: interval de temps descrit en @ca
alternative label: laps de temps décrit dans @fr
alternative label: tanımlanan zaman aralığı @tr
alternative label: timespan described in
alternative label: 被描述于……的时间段 @zh-hans
definition: Bir zaman aralığını, bir zaman aralığının açıklaması olan bir eserle ilişkilendirir. @tr
definition: Correla un arco di tempo a un'opera che descrive un arco di tempo. @it
definition: Hozzákapcsol egy időtartamot egy műhöz, amely egy időtartamot ír le. @hu
definition: Liittää ajanjakson teokseen, joka kuvaa ajanjaksoa. @fi
definition: Met un laps de temps en relation avec une œuvre qui consiste en une description d’un laps de temps. @fr
definition: Relaciona un interval de temps amb una obra que és una descripció d’un interval de temps. @ca
definition: Relateert een tijdspanne aan een werk dat een tijdspanne beschrijft. @nl
definition: Relaterer en tidsperiode til et værk, som beskriver en tidsperiode. @da
definition: Relaterer et tidsrom til et verk som beskriver et tidsrom. @no
definition: Relates a timespan to a work that is a description of a timespan.
definition: Sasaista laikposmu ar darbu, kurā aprakstīts konkrētais laikposms. @lv
definition: Seostab ajavahemiku teosega, milles kirjeldatakse ajavahemikku. @et
definition: Setzt einen Zeitraum in Beziehung zu einem Werk, das einen Zeitraum beschreibt. @de
definition: تربط بين فترة زمنية وعمل يصف فترة زمنية. @ar
definition: 将一个时间段与作为一个时间段之描述的一种作品关联起来。 @zh-hans

is beginning of
has element type: 3
toolkit definition: A timespan that starts at the time that is a timespan.
toolkit definition: Ajanjakson ajankohta, josta ajanjakso alkaa. @fi
toolkit definition: Bir zaman aralığı olan anda başlayan bir zaman aralığı. @tr
toolkit definition: Een tijdspanne die begint op het tijdstip dat is een tijdspanne. @nl
toolkit definition: Egy időtartam, amelynek a kezdete is időtartam. @hu
toolkit definition: Ein Zeitraum, der zu diesem Zeitpunkt beginnt. Auch dieser wird als Zeitraum bezeichnet. @de
toolkit definition: Interval de temps que comença en el moment en que és un interval de temps. @ca
toolkit definition: Laikposms, kad tas sākas. @lv
toolkit definition: Laps de temps qui commence au moment qui constitue un laps de temps. @fr
toolkit definition: Tidsforløb der starter ved det tidspunkt som er et tidsforløb @da
toolkit definition: فترة زمنية عبارة عن زمن تبدأ فيه فترة زمنية. @ar
toolkit definition: 开始于作为一个时间段的时间的一个时间段 @zh-hans
toolkit label: Anfang von @de
toolkit label: alku ajanjaksossa @fi
toolkit label: başlangıcı @tr
toolkit label: begin van @nl
toolkit label: beginning of
toolkit label: begyndelse på @da
toolkit label: début de @fr
toolkit label: inici de @ca
toolkit label: kezdete: @hu
toolkit label: sākums @lv
toolkit label: بداية لـ @ar
toolkit label: ……的开始 @zh-hans
has subproperty: P70061
lexical alias: beginningOf.en
status: Published
type: Property
domain: C10010
label: alku ajanjaksossa @fi
label: başlangıcıdır @tr
label: er begyndelse på @da
label: est le début de @fr
label: ir sākums @lv
label: is begin van @nl
label: ist Anfang von @de
label: kezdete a következőnek: @hu
label: és inici de @ca
label: هي بداية لـ @ar
label: 是—…的开始 @zh-hans
sub property of: is part of timespan
definition: Bir zaman aralığını, zaman aralığı olan zamanda başlayan bir zaman aralığı ile ilişkilendirir. @tr
definition: Hozzákapcsol egy időtartamot egy időtartamhoz, amely akkor keződik, amikor az egy időtartam. @hu
definition: Liittää ajanjakson ajanjakson ajankohtaan, josta ajanjakso alkaa. @fi
definition: Met un laps de temps en relation avec un laps de temps qui commence au moment qui constitue un laps de temps. @fr
definition: Relaciona un interval de temps amb un interval de temps que comença en el moment que és un interval de temps. @ca
definition: Relateert een tijdspanne aan een tijdspanne die begint op het tijdstip dat is een tijdspanne. @nl
definition: Relaterer et tidsforløb til et tidsforløb der starter ved det tidspunkt som er et tidsforløb @da
definition: Relates a timespan to a timespan that starts at the time that is a timespan.
definition: Sasaista laikposmu ar laikposmu, kad tas sākas. @lv
definition: Setzt einen Zeitraum in Beziehung zu einem Zeitraum, der zu diesem Zeitpunkt beginnt. Auch dieser wird als Zeitraum bezeichnet. @de
definition: تربط بين فترة زمنية وفترة زمنية عبارة عن زمن تبدأ فيه فترة زمنية. @ar
definition: 将一个时间段与开始于作为一个时间段的时间的一个时间段关联起来。 @zh-hans

is ending of
has element type: 3
toolkit definition: A timespan that finishes at the time that is a timespan.
toolkit definition: Ajanjakson ajankohta, johon ajanjakso loppuu. @fi
toolkit definition: Bir zaman aralığı olarak kabul edilen bir zamanda sona eren bir zaman aralığı @tr
toolkit definition: Een tijdspanne die eindigt op het tijdstip dat is een tijdspanne. @nl
toolkit definition: Egy időtartam, amelynek a vége is időtartam. @hu
toolkit definition: Ein Zeitraum, der zu diesem Zeitpunkt endet. Auch dieser wird als Zeitraum bezeichnet. @de
toolkit definition: Interval de temps que finalitza en el moment en que és un interval de temps. @ca
toolkit definition: Laikposms, kad tas beidzas. @lv
toolkit definition: Laps de temps qui se termine au moment qui constitue un laps de temps. @fr
toolkit definition: Tidsforløb der slutter ved det tidspunkt som er et tidsforløb @da
toolkit definition: فترة زمنية عبارة عن زمن تنتهي فيه فترة زمنية. @ar
toolkit definition: 结束于作为一个时间段的时间的一个时间段 @zh-hans
toolkit label: Ende von @de
toolkit label: beigas @lv
toolkit label: einde van @nl
toolkit label: ending of
toolkit label: fin de @fr
toolkit label: final de @ca
toolkit label: loppu ajanjaksossa @fi
toolkit label: slutning på @da
toolkit label: son @tr
toolkit label: vége: @hu
toolkit label: نهاية لـ @ar
toolkit label: ……的结束 @zh-hans
has subproperty: P70062
lexical alias: endingOf.en
status: Published
type: Property
domain: C10010
label: bitişidir @tr
label: er slutning på @da
label: est la fin de @fr
label: ir beigas @lv
label: is einde van @nl
label: ist Ende von @de
label: loppu ajanjaksossa @fi
label: vége a következőnek: @hu
label: és final de @ca
label: هي نهاية لـ @ar
label: 是……的结束 @zh-hans
sub property of: is part of timespan
definition: Bir zaman aralığını, zaman aralığı olan zamanda biten bir zaman aralığı ile ilişkilendirir. @tr
definition: Hozzákapcsol egy időtartamot egy időtartamhoz, amely akkor végződik, amikor az egy időtartam. @hu
definition: Liittää ajanjakson ajanjakson ajankohtaan, johon ajanjakso loppuu. @fi
definition: Met un laps de temps en relation avec un laps de temps qui se termine au moment qui constitue un laps de temps. @fr
definition: Relaciona un interval de temps amb un interval de temps que finalitza en el moment en que és un interval de temps. @ca
definition: Relateert een tijdspanne aan een tijdspanne die eindigt op het tijdstip dat is een tijdspanne. @nl
definition: Relaterer et tidsforløb til et tidsforløb der slutter ved det tidspunkt som er et tidsforløb @da
definition: Relates a timespan to a timespan that finishes at the time that is a timespan.
definition: Sasaista laikposmu ar laikposmu, kad tas beidzas. @lv
definition: Setzt einen Zeitraum in Beziehung zu einem Zeitraum, der zu diesem Zeitpunkt endet. Auch dieser wird als Zeitraum bezeichnet. @de
definition: تربط بين فترة زمنية وفترة زمنية عبارة عن زمن تنتهي فيه فترة زمنية. @ar
definition: 将一个时间段与结束于作为一个时间段的时间的一个时间段关联起来。 @zh-hans

is timespan described with metadata by
has element type: 2
toolkit definition: A work that is a metadata work for a timespan.
toolkit definition: Bir zaman aralığı için üstveri çalışması olan bir eser. @tr
toolkit definition: Obra que és una obra de metadades per a un interval de temps. @ca
toolkit definition: Teos, joka on ajanjakson metatietoteos. @fi
toolkit definition: Œuvre qui consiste en une œuvre de métadonnées pour un laps de temps. @fr
toolkit definition: 作为一个时间段之元数据作品的一种作品 @zh-hans
toolkit label: ajanjaksoa metatiedoilla kuvaileva teos @fi
toolkit label: interval de temps descrit amb metadades per @ca
toolkit label: laps de temps décrit avec des métadonnées par @fr
toolkit label: tarafından üstverilerle tanımlanan zaman aralığı @tr
toolkit label: timespan described with metadata by
toolkit label: 被……用元数据描述的时间段 @zh-hans
has subproperty: P70063
lexical alias: timespanDescribedWithMetadataBy.en
status: Published
type: Property
domain: C10010
label: ajanjaksoa metatiedoilla kuvaileva teos @fi
label: est un laps de temps décrit avec des métadonnées par @fr
label: tarafından meta verilerle tanımlanan zaman aralığıdır. @tr
label: és interval de temps descrit amb metadades per @ca
label: 是被……用元数据描述的时间段 @zh-hans
sub property of: is timespan described by
definition: Bir zaman aralığını, bir zaman aralığı için üstveri çalışması olan bir eserle ilişkilendirir. @tr
definition: Liittää ajanjakson teokseen, joka on ajanjakson metatietoteos. @fi
definition: Met un laps de temps en relation avec une œuvre qui consiste en une œuvre de métadonnées pour un laps de temps. @fr
definition: Relaciona un interval de temps amb una obra que és una obra de metadades per a un interval de temps. @ca
definition: Relates a timespan to a work that is a metadata work for a timespan.
definition: 将一个时间段与作为一个时间段之元数据作品的一种作品关联起来。 @zh-hans